##TITLE=1H_Pr 5216
 D2O
 8 sc, 
 15.3.2024
##JCAMPDX= 6.0         $$ Bruker NMR JCAMP-DX V2.0
##DATA TYPE= NMR FID
##DATA CLASS= NTUPLES
##ORIGIN= UXNMR, Bruker Analytische Messtechnik GmbH
##OWNER= root
$$ XWIN-NMR		Version 3.5
$$ Fri Mar 15 14:25:53 2024 Russian Standard Time (UT+4h)  she@DPX200
##.OBSERVE FREQUENCY= 200.1313
##.OBSERVE NUCLEUS= ^1H
##.DELAY= (6, 6)
##.ACQUISITION MODE= SIMULTANEOUS
##.ACQUISITION SCHEME= undefined
##.AVERAGES= 8
##.DIGITISER RES= 18
##SPECTROMETER/DATA SYSTEM= spect
##.PULSE SEQUENCE= zg30
##.SOLVENT NAME= D2O
##.SHIFT REFERENCE= (INTERNAL, D2O, 0, 15.7039)
##AUDIT TRAIL= $$ (NUMBER, WHEN, WHO, WHERE, WHAT)
$$ ##TITLE= Audit trail, XWIN-NMR		Version 3.5
$$ ##JCAMPDX= 5.01
$$ ##ORIGIN= Bruker BioSpin GmbH
$$ ##OWNER= she
$$ F:/spectra/data/she/nmr/H-F/1/audita.txt
$$ ##AUDIT TRAIL=  $$ (NUMBER, WHEN, WHO, WHERE, WHAT)
(   1,<2024-03-15 14:24:32.26 +0400>,<she>,<DPX200>,
      <created by zg, POWCHK disabled, PULCHK disabled
       configuration hash MD5:
       00 E9 B6 7A A2 85 ED C7 34 08 36 98 17 FE 4E 26
       data hash MD5: 16K
       57 F7 F2 5D 6B BF ED 89 01 6E 8A 76 AF A9 93 82>)
$$ ##END=
$$ 
$$ hash MD5
$$ 9C A4 10 3F 99 16 2A 63 DA 1A 86 8D 4C 3C 61 90
##$RELAX= 
##$RELAX= 
##$RELAX= 
##$RELAX= 
##$RELAX= 
##$RELAX= 
$$ Bruker specific parameters
$$ --------------------------
##$DU= <F:/spectra>
##$EXPNO= 1
##$NAME= <H-F>
##$PROCNO= 1
##$TYPE= <nmr>
##$USER= <she>
##$AMP= (0..31)
100 100 100 100 100 100 100 100 100 100 100 100 100 100 100 100 100 100 
100 100 100 100 100 100 100 100 100 100 100 100 100 100 
##$AQSEQ= 0
##$AQ_mod= 1
##$AUNM= <au_zg>
##$AUTOPOS= <>
##$BF1= 200.13
##$BF2= 200.13
##$BF3= 200.13
##$BF4= 200.13
##$BF5= 200.13
##$BF6= 200.13
##$BF7= 200.13
##$BF8= 200.13
##$BYTORDA= 1
##$CFDGTYP= 0
##$CFRGTYP= 5
##$CHEMSTR= <none>
##$CNST= (0..31)
1 1 145 1 1 1 1 1 1 1 1 1 1 1 1 1 1 1 1 1 1 1 1 1 1 1 1 1 1 1 1 1 
##$CPDPRG= <>
##$CPDPRG1= <>
##$CPDPRG2= <>
##$CPDPRG3= <>
##$CPDPRG4= <mlev>
##$CPDPRG5= <mlev>
##$CPDPRG6= <mlev>
##$CPDPRG7= <mlev>
##$CPDPRG8= <mlev>
##$CPDPRGB= <>
##$CPDPRGT= <>
##$D= (0..31)
0 1.2 0 0 0 0 0 0 0 0.06 0 0.03 0 0 0 0 0.0002 0 0 0 0 0 0 0 0 0 0 0 0 
0 0 0 
##$DATE= 1710498271
##$DBL= (0..7)
120 120 120 120 120 120 120 120 
##$DBP= (0..7)
150 150 150 150 150 150 150 150 
##$DBP07= 0
##$DBPNAM0= <>
##$DBPNAM1= <>
##$DBPNAM2= <>
##$DBPNAM3= <>
##$DBPNAM4= <>
##$DBPNAM5= <>
##$DBPNAM6= <>
##$DBPNAM7= <>
##$DBPOAL= (0..7)
0.5 0.5 0.5 0.5 0.5 0.5 0.5 0.5 
##$DBPOFFS= (0..7)
0 0 0 0 0 0 0 0 
##$DE= 6
##$DECBNUC= <off>
##$DECIM= 32
##$DECNUC= <off>
##$DECSTAT= 4
##$DIGMOD= 1
##$DIGTYP= 9
##$DL= (0..7)
0 120 120 120 120 120 120 120 
##$DP= (0..7)
150 150 150 150 150 150 150 150 
##$DP07= 0
##$DPNAME0= <>
##$DPNAME1= <>
##$DPNAME2= <>
##$DPNAME3= <>
##$DPNAME4= <>
##$DPNAME5= <>
##$DPNAME6= <>
##$DPNAME7= <>
##$DPOAL= (0..7)
0.5 0.5 0.5 0.5 0.5 0.5 0.5 0.5 
##$DPOFFS= (0..7)
0 0 0 0 0 0 0 0 
##$DQDMODE= 0
##$DR= 18
##$DS= 0
##$DSLIST= <SSSSSSSSSSSSSSS>
##$DSPFIRM= 0
$$ [...]
##$SUBNAM2= <"">
##$SUBNAM3= <"">
##$SUBNAM4= <"">
##$SUBNAM5= <"">
##$SUBNAM6= <"">
##$SUBNAM7= <"">
##$SUBNAM8= <"">
##$SUBNAM9= <"">
##$SW= 18.0517328524113
##$SWIBOX= (0..15)
0 0 2 0 0 0 0 0 0 0 0 0 0 0 0 0 
##$SW_h= 3612.71676300578
##$TD= 16384
##$TD0= 1
##$TE= 0
##$TE2= 300
##$TE3= 300
##$TEG= 300
##$TL= (0..7)
0 120 120 120 120 120 120 120 
##$TP= (0..7)
150 150 150 150 150 150 150 150 
##$TP07= 0
##$TPNAME0= <>
##$TPNAME1= <>
##$TPNAME2= <>
##$TPNAME3= <>
##$TPNAME4= <>
##$TPNAME5= <>
##$TPNAME6= <>
##$TPNAME7= <>
##$TPOAL= (0..7)
0.5 0.5 0.5 0.5 0.5 0.5 0.5 0.5 
##$TPOFFS= (0..7)
0 0 0 0 0 0 0 0 
##$TUNHIN= 0
##$TUNHOUT= 0
##$TUNXOUT= 0
##$USERA1= <user>
##$USERA2= <user>
##$USERA3= <user>
##$USERA4= <user>
##$USERA5= <user>
##$V9= 5
##$VALIST= <valist>
##$VCLIST= <CCCCCCCCCCCCCCC>
##$VD= 0
##$VDLIST= <DDDDDDDDDDDDDDD>
##$VPLIST= <PPPPPPPPPPPPPPP>
##$VTLIST= <TTTTTTTTTTTTTTT>
##$WBST= 1024
##$WBSW= 4
##$XGAIN= (0..3)
0 0 0 0 
##$XL= 0
##$YL= 0
##$YMAX_a= 353174
##$YMIN_a= -195573
##$ZGOPTNS= <>
##$ZL1= 120
##$ZL2= 120
##$ZL3= 120
##$ZL4= 120
##$ABSF1= 10
##$ABSF2= 0
##$ABSG= 5
##$ABSL= 3
##$ALPHA= 0
##$AQORDER= 0
##$ASSFAC= 0
##$ASSFACI= 0
##$ASSFACX= 0
##$ASSWID= 0
##$AUNMP= <proc_1d>
##$AZFE= 0.1
##$AZFW= 0.1
##$BCFW= 1
##$BC_mod= 2
##$BYTORDP= 1
##$COROFFS= 0
##$CY= 11.3945322036743
##$DATMOD= 1
##$DC= 2
##$DFILT= <>
##$DTYPP= 0
##$F1P= 15.7292609196834
##$F2P= 12.9074282941183
##$FCOR= 0.5
##$FTSIZE= 0
##$FT_mod= 4
##$GAMMA= 1
##$GB= 0.15
##$INTBC= 1
##$INTSCL= 1
##$ISEN= 128
##$LB= 0.24
##$LEV0= 0
##$LPBIN= 0
##$MAXI= 10000
##$MC2= 0
##$MEAN= 0
##$ME_mod= 0
##$MI= 1.114404
##$NCOEF= 0
##$NC_proc= 0
##$NLEV= 6
##$NOISF1= 3.799351
##$NOISF2= 2.8
##$NSP= 1
##$NTH_PI= 0
##$NZP= 0
##$OFFSET= 15.70392
##$PC= 1
##$PHC0= -25474.89
##$PHC1= 19.38731
##$PH_mod= 1
##$PKNL= yes
##$PPARMOD= 0
##$PSCAL= 0
##$PSIGN= 0
##$REVERSE= no
##$SF= 200.130013532006
##$SI= 16384
##$SIGF1= 3
##$SIGF2= 2
##$SINO= 400
##$SIOLD= 16384
##$SREGLST= <1H.CDCl3>
##$SSB= 0
##$STSI= 0
##$STSR= 0
##$SW_p= 3612.71676300578
##$SYMM= 0
##$S_DEV= 0
##$TDeff= 0
##$TDoff= 0
##$TI= <>
##$TILT= no
##$TM1= 0
##$TM2= 0
##$TOPLEV= 0
##$USERP1= <user>
##$USERP2= <user>
##$USERP3= <user>
##$USERP4= <user>
##$USERP5= <user>
##$WDW= 1
##$XDIM= 8192
##$YMAX_p= 0
##$YMIN_p= 0
$$ End of Bruker specific parameters
$$ ---------------------------------
##NTUPLES= NMR FID
##VAR_NAME=  TIME,          FID/REAL,        FID/IMAG
##SYMBOL=    X,             R,               I
##VAR_TYPE=  INDEPENDENT,   DEPENDENT,       DEPENDENT
##VAR_FORM=  AFFN,          ASDF,            ASDF
##VAR_DIM=   8192,          8192,            8192
##UNITS=     SECONDS,       ARBITRARY UNITS, ARBITRARY UNITS
##FACTOR=    0.0002768,     1,               1
##FIRST=     0,             0,               0
##LAST=      2.2672688,     0,               0
##MIN=       0,             -195573,         0
##MAX=       2.2672688,     353174,          0
$$ Real data points
##PAGE= N=1
##DATA TABLE= (X++(R..R)), XYDATA
$$ [...]
2508b276K385K276J308O4j256k349k453j353j27J201K221K237J513M32j122k144
2524E57k322j640m44Q88K017K499J807N21r00j845k432j842o76O64J868K390J889
2541B999P92n70j751k265j976j073M19J577K405K100J108m58j367k293k165j129
2557c647O5J462K290K210J211L0j410k224k078j476o0J045K184K327J425K63r75
2574B642k146k207j595k37Q23J932K276J688N43q92j905k184j759p17O89J905
2590a144K125J990P67o14j694k201j944r85L87J723K149K047J013l15j461k053
2606b10k119j282L25J301K151K072J220mj374j978k104j376p8J143J780K303J490
2623C260K94j040j939k145j572l98R07J772K181J776N45q46j932k042j739o32
$$ plain form
2508 -2276 109 2385 3693 3757 2501 152 -2301 -3654 -3781 -2580 -359 1878 3391 3823 2701 557
2524 557 -1765 -3405 -3849 -2961 -944 1555 3362 3883 2983 1138 -1294 -3136 -3812 -3148 -1280 1110 2999
2541 2999 3791 3221 1470 -795 -2771 -3844 -3425 -1848 557 2657 3765 3307 1940 -353 -2518 -3647
2557 -3647 -3582 -2120 170 2380 3591 3621 2211 -13 -2091 -3567 -3627 -2582 -398 1929 3354 3617 2642
2574 2642 496 -1711 -3306 -3543 -2720 -788 1488 3176 3719 2827 922 -1262 -3021 -3738 -3049 -1144
2590 -1144 981 2971 3738 3124 1430 -771 -2715 -3700 -3313 -1590 559 2606 3619 3304 1843 -210
2606 -210 -2329 -3611 -3286 -1985 166 2238 3458 3454 2080 102 -2002 -3378 -3456 -2313 -533 1770 3260
2623 3260 3554 2514 575 -1570 -3142 -3540 -2633 -861 1320 3096 3641 2795 863 -1179 -2918 -3550
2639c550O29J641K268J833O28l96j716j979k066p99M15J605J939J904J123k92
2655C187j468j987j992j174J20J435J981J913J353q1j243k009j907j455N0J077
2671b200J838K145J279K15r34j805k165j447l60Q22J877K060J574M57p33j661
2687I62k049j671o39N28J739K062J681Q20n34j467k175j868o91K51J561K007J855
2704B372R48k59j372k030j862j062J93J242J938J857J252l0j189j910j932j227
2720c071j25R60J903K049J333K00r86j720k036j392l45Q50J646J990J562M30o71
2737B577j596k031j673n66P06J517J835J737P52n04j475j966j789p13L94J264
2753a531K016J734R73l03j335j780j786j043L4J188J830K015J002m6j122j723
$$ plain form
2639 -3550 -2921 -1280 988 2821 3449 3053 1337 -642 -2708 -3507 -3092 -1487 452 2356 3479 3187
2655 3187 1719 -268 -2260 -3434 -3314 -1879 102 2015 3368 3287 2044 35 -1872 -3327 -3277 -2200
2671 -2200 -362 1783 3062 3277 2343 538 -1627 -3074 -3434 -2612 -735 1325 2899 3356 2623 962
2687 962 -1087 -2758 -3397 -2869 -1130 932 2613 3433 2899 1432 -743 -2611 -3302 -3051 -1490 517 2372
2704 2372 3320 3061 1689 -341 -2203 -3265 -3072 -1830 108 1965 3217 3187 1998 88 -1844 -3071
2720 -3071 -3196 -2236 -333 1716 3049 3249 2263 543 -1493 -2885 -3230 -2380 -734 1256 2818 3248 2577
2737 2577 981 -1050 -2723 -3289 -2583 -1066 769 2506 3258 2754 1279 -687 -2476 -3189 -2795 -1531
2753 -1531 485 2219 3192 2889 1554 -226 -2012 -3055 -3021 -1833 -3 2012 3014 2968 1846 123
2769A23j729j337l9R86J612J902J367K28r12j690j830j415l66P67J788J704J400
2786B559N12o24j587j901j476n39M93J456J948J495P35m45j464j796j478r18K98
2803b732J335J949J611Q50k45j340j728j525j058K9J218J640J732J150o2j034
2819A790j705j653j259n4Q95J645J779J318R0q46j622j632j358l19P06J661J734
2836A170J300M33o20j443j828j345o05N17J449J704J540O27m38j363j658j568
2852b128p72L54J260J691J571R50m49j005j810j538r66R4J116J740J581J010J5
2869B714j022j578j704j057n3R45J396J753J125J11o28j539j718j249k81O79J422
2886f84J854J224M47o68j332j723j351m50M03J423J673J327P35n99j171j685j479
$$ plain form
2769 123 -1606 -2943 -2982 -1996 -384 1518 2885 3113 2201 511 -1319 -2734 -3100 -2333 -545 1159 2559
2786 2559 3071 2447 860 -1041 -2517 -3056 -2563 -1107 841 2336 3071 2626 1162 -634 -2112 -3030 -2732
2803 -2732 -1397 552 2163 3013 2768 1428 -300 -1825 -2883 -2854 -1636 4 1736 2886 2824 1790
2819 1790 85 -1568 -2827 -2881 -1986 -341 1438 2756 2846 2000 378 -1254 -2612 -2931 -2225 -564 1170
2836 1170 2470 2903 2283 840 -988 -2333 -2938 -2421 -972 732 2272 2899 2461 1098 -560 -2128
2852 -2128 -2900 -2546 -1286 405 1976 2926 2477 1472 -338 -1876 -2842 -2748 -1632 108 1689 2699 2714
2869 2714 1692 114 -1590 -2647 -2700 -1755 -359 1394 2519 2630 2002 463 -1255 -2504 -2785 -2106 -684
2886 -684 1170 2394 2841 2173 841 -882 -2233 -2683 -2280 -857 816 2143 2878 2279 1108 -577 -2056
2903b056o97M02J099J725J517P25k09j150j642j423r49O6J003J677J509J011j55
2920B453q28j519j549r64j44P84J445J574J203J98q11j339j654j259k64P01J388
2937e85J591J317L92o38j275j646j339m40N04J233J543J428M44k85j234j616j247
2954a853o94L02J082J583J500N52j26j067j492j587p23K35R40J511J324J017q2
2971B422q79j365j602r30j10P70J526J396J083J69o79j436j471j172j34N05J390
2988e17J525J028M73n36j314j472j250m07M41J304J383J223N57l40j102j482j243
3005a729o49J66J084J432J323P82j84r76j372j497p48J80Q12J388J432Q11M1q12
3023A484j477j430p99r2P47J209J490R66J95o52j237j467j007l39O78J281J290
$$ plain form
2903 -2056 -2753 -2351 -1252 473 1990 2715 2506 1356 -286 -1709 -2658 -2592 -1589 88 1597 2608 2453
2920 2453 1625 106 -1443 -2407 -2551 -1767 -322 1252 2455 2653 1842 503 -1151 -2410 -2674 -1973 -585
2937 -585 1006 2323 2715 2077 802 -844 -2183 -2623 -2119 -886 657 2085 2529 2244 1010 -606 -1853
2954 -1853 -2547 -2245 -1163 420 1920 2472 2346 1279 -213 -1800 -2523 -2288 -1348 163 1487 2504 2422
2971 2422 1543 178 -1424 -2354 -2464 -1694 -168 1228 2311 2480 1801 365 -1106 -2278 -2412 -1907 -517
2988 -517 1008 2036 2509 1973 659 -813 -2063 -2470 -2029 -725 658 1881 2438 2098 996 -486 -1729
3005 -1729 -2378 -2212 -1128 304 1627 2409 2225 1249 -123 -1620 -2368 -2188 -1376 12 1444 2255 2296 1484
3023 1484 7 -1423 -2222 -2314 -1567 -358 1132 2098 2293 1641 404 -1063 -2070 -2409 -1731 -450 840
3040H40J125L74m91j166j450j087m20L06J139J346J287M41l56q57j478j296n90
3057b333K62J045J477J056O99j13r80j335j165q25P9Q03J292J444O82Q7p67j342
3075F6j319q55j73P62J261J355Q57K66o40j232j290r71l58O29J101J288J082M14
3093B243n21j208j235j132l00K31J124J365J147M21k44r96j259j236n48K21R49
3110i78J218J252O62j42p75j350j235o98J00P18J167J281Q32m8p02j089j308p98
3128a893j40O09J182J310Q27J36n75j109j338q15k61M81R93J442R86K30m14r96
3146F55j224j100l35K75R72J300R98N16l37r13j234r69n96J29Q54J129J210O54
3164A984p8q82j235j109p29J59O93J242J128P35L8n79j168j255q49N8N10J063
$$ plain form
3040 840 1965 2339 1848 682 -768 -1855 -2275 -1969 -830 516 1803 2244 1888 1031 -447 -1743 -2333
3057 -2333 -2071 -1026 451 1507 2206 2093 1113 -222 -1387 -2212 -2133 -1330 -38 1406 2088 2175 1408 66
3075 66 -1253 -2108 -2281 -1519 -258 1097 1954 2220 1580 348 -942 -1913 -2271 -1642 -541 747 1829 2243
3093 2243 1722 514 -721 -1853 -2153 -1922 -798 567 1714 2135 1891 895 -364 -1600 -2148 -1927 -978
3110 -978 240 1492 2154 2012 1237 -113 -1348 -2046 -1946 -1228 -61 1220 2052 2004 1302 213 -1095 -1893
3128 -1893 -2033 -1424 -242 1068 1895 2031 1456 347 -991 -1806 -2067 -1586 -593 849 1835 2065 1651 655
3146 655 -569 -1669 -2004 -1729 -757 543 1541 2057 1720 807 -427 -1396 -1992 -1863 -1009 120 1330 1984
3164 1984 1906 1024 -211 -1320 -2049 -1890 -1197 45 1173 1908 1946 1367 199 -1056 -1905 -1847 -1337 -274
3182b74J159R25J63o22r82j238r03j14M84Q62J207R25L47k89j071j151j083k79
3200a934L04R35J319Q70M00k26r79j026j015n37K08P67J181R01O75r8p44j056
3218e5j225m86L8O11J009J163P19jn42r69j244o67j27N91J014J058P15K24m64
3237A362j039j024r03k42M49R23J121Q49L51m55q28j062q64m48K71J013J009R10
3255A393L73l27o63j174q92m40P1Q77R85R85N20j43p22r94q34p33J82M45J075
3274a6R86O79j5n88r56j036n78j74N86R24R32P09K16n13q42j016o96k58M25Q49
3294c82R53P85K79l88q04r38r01k65K63P60R58R58L48k02p79j053p83m00J15P74
3314g02R39P55O05p8o77r77p99n79P0N75R25Q36O32O6o16q54q91o64p6M04Q27
$$ plain form
3182 -274 885 1810 1973 1351 369 -869 -1772 -1886 -1402 -540 667 1592 1939 1650 579 -572 -1655 -1934
3200 -1934 -1630 -695 624 1494 1894 1668 689 -337 -1352 -1889 -1681 -914 267 1168 1843 1745 1001 -55
3218 -55 -1280 -1766 -1728 -1117 -108 1055 1774 1773 1231 262 -982 -1649 -1776 -1185 -171 887 1602 1826 1362
3237 1362 323 -701 -1604 -1846 -1397 -474 647 1496 1847 1392 564 -498 -1362 -1810 -1539 -526 483 1393
3255 1393 1766 1439 776 -398 -1290 -1730 -1659 -782 203 1188 1708 1565 843 -151 -985 -1718 -1536 -1091 -16
3274 -16 970 1649 1634 1046 90 -946 -1524 -1698 -1112 -188 744 1453 1669 1156 314 -702 -1398 -1656 -1231 -382
3294 -382 571 1356 1635 1247 443 -495 -1396 -1661 -1398 -638 320 1278 1626 1424 645 -408 -1191 -1591 -1476 -702
3314 -702 237 992 1597 1519 842 -135 -934 -1513 -1443 -868 57 893 1525 1591 975 121 -770 -1434 -1510 -1106 -279
3335b79J084N86K53n38q48q56p65j34L64P42R75P29K61l56p95r27p48l06K41Q01
3355e16Q77Q57J77Np40r43p78m95K41N11J021Q47L68n3o19r01q63l90L4N34Q91
3376F5Q77M71J5m42r31q39n37m0L91Q81P65P03l0l54p69q07o37k13M09O54Q64
3397D96P00J70k17p65q66n36l47L35O09Q60O68M43l69o00q67p59l25J40N72R30
3417B72P53L80j07p28p00p03m90P9N25Q66O96M69j1n10p42p85n65o7M65Q59Q14
3438G70L84J30l64o77p89n16j73J96P85O95O17K78l62o78q94l83k01K03N29Q34
3458C84O51K41j97o28p01o61l06R4P10N71P71L30k00l73q08o90l55O0M80P24O92
3479G89M75J5n24q16o53m34k4L87O90P44N18K7l10o91p13m42k24K66P39P10M43
$$ plain form
3335 -279 805 1391 1644 1106 258 -598 -1363 -1497 -1133 -391 584 1313 1574 1218 423 -504 -1252 -1558 -1317 -516
3355 -516 361 1218 1395 1400 660 -283 -1061 -1556 -1315 -804 217 1064 1432 1379 760 -141 -1004 -1394 -1360 -826 65
3376 65 942 1413 1428 986 55 -784 -1321 -1361 -970 -89 676 1379 1349 995 226 -581 -1218 -1431 -1022 -368 496
3397 496 1196 1366 1149 384 -482 -1018 -1365 -1030 -421 439 1107 1550 1181 581 -286 -1045 -1370 -1230 -658 272
3417 272 1025 1405 1298 570 -130 -833 -1323 -1244 -719 147 843 1312 1301 791 49 -736 -1301 -1368 -903 -44 770
3438 770 1154 1284 920 243 -546 -1062 -1235 -1039 -254 441 1058 1336 974 296 -598 -981 -1182 -979 -450 384
3458 384 1035 1276 1079 451 -250 -911 -1217 -1123 -413 158 929 1259 1059 686 -122 -812 -1167 -1107 -627 97 789
3479 789 1264 1279 755 -61 -714 -1148 -1172 -785 -95 649 1167 1194 884 193 -520 -962 -1186 -920 -181 529 972
3500I72J59k36n78p86m37k80J72N82Q31N38K71j62p02n64o86k13J03N09O77O39
3520H09L86q7m55q52n84k82L9M53O54O67L48l5m80n33o67m00j58N01O27O60M45
3541A056j9k95o26n62n77r4L21N72O72M75L4j24p17m88n71j25K83M53P57N31L9
3562I95j62n13o17n08k31J30M73O73N53J64r0l96o96m48k50N9K49P57O43K74j51
3583I08k57o92n25l68P2K42P89M95L41m1l40m95n79l98o5J87O29N14M60J22l08
3604F91m20p98k88j43K05N44N41M73R1j36n36m82n23j61K82K16P11M38J72r7l48
3625D32n72o03j9q8M71N03N59J48J6l68m98n51k74rL32N05N80K27K9l15n01n87
3647e83k17j42M28L98O52K06P6k06n74l97m33n7J42N97M80M25J23k42l65p03m37
$$ plain form
3500 972 1131 895 317 -469 -906 -1186 -1014 -432 399 937 1208 1046 344 -220 -906 -1119 -1016 -507 170 809
3520 809 1195 1108 653 -199 -783 -1065 -1026 -573 81 748 1096 1061 581 48 -619 -1019 -1177 -676 -49 611 1056
3541 1056 1037 742 116 -446 -1023 -1117 -796 -224 448 923 957 833 116 -372 -943 -1068 -785 -332 425 956 995
3562 995 833 320 -297 -805 -1036 -906 -433 240 793 957 867 471 -225 -673 -923 -864 -615 142 785 1059 908
3583 908 651 -41 -566 -934 -862 -620 169 664 1005 964 624 129 -450 -848 -913 -726 -97 417 877 999 691
3604 691 271 -527 -815 -958 -753 -209 332 805 896 760 224 -258 -781 -942 -660 -444 267 705 877 780 432
3625 432 -140 -743 -762 -850 -379 124 683 831 847 479 -19 -570 -844 -853 -521 -16 564 791 820 505 4 -583
3647 -583 -800 -942 -514 -116 536 742 818 612 38 -359 -792 -849 -707 -110 370 795 918 676 311 -392 -829
3668h29q7L31K97N80M85j4qm20m63n27k16J40M97L23N27K79j50l80m83m30l41
3689h89J66K85N59M16K22k7j74n39m80m33J09K97M77M62L53k4k41m06m84k91j43
3710g85K25M34N29L96K7l37l99m34l87L4O5N60L78L07J48j54l57n04k99j17pM66
3732b11L66N01J2Ql29n90l96q0R4L29K82N47J46O0k72m36m53k97R7L01L24M51
3754D54K40j07k61j89n05l93J56J94K24O21K50jk39l73m54k42k5J77M09M26J92
3775E54P8l5m53n05k34l3J15L36L49K89J46j30j60n33l64j20J02M15M29L45P4
3796F65q2m21l58k84j58%K55N18L41K31p0k85l54m81p6m4K58K61L49M17j17j38
3818D27l71l21l61n6L53K87L27L94m0k57k63m09k01j56L02J33M84K49L8j42k87
$$ plain form
3668 -829 -916 -585 -288 292 777 763 755 335 -128 -655 -871 -731 -234 89 616 895 745 365 -118 -548 -889
3689 -889 -723 -438 121 537 759 732 558 19 -461 -894 -785 -488 -11 451 804 780 539 133 -351 -642 -785
3710 -785 -560 -126 403 799 826 489 90 -344 -731 -697 -632 -72 306 613 761 607 250 -254 -553 -670 -677 -211
3732 -211 155 656 668 676 347 -243 -639 -719 -625 -296 -14 533 679 739 467 31 -422 -719 -622 -321 3 454
3754 454 694 587 326 137 -368 -761 -605 -411 -187 434 684 683 444 71 -383 -625 -650 -473 -64 362 554
3775 554 632 597 144 -361 -595 -628 -513 -177 172 461 607 477 317 -216 -580 -700 -598 -183 246 591 665
3796 665 583 162 -196 -480 -638 -638 -383 135 476 707 637 352 -2 -483 -559 -603 -345 -84 265 682 565 427
3818 427 56 -265 -626 -682 -329 -42 285 679 639 382 119 -290 -491 -647 -345 -212 272 521 559 417 130
3839A30l32k35j31jL48M07K30K23r6k64n07j50k36J02L31L57K84J96q5k94l69
3860i2l08j80M8K59L10L46J93O5l00l34l78k18k6K95L53L66K46p5k66k27m94j27
3882e44k5K01K91M54J24J67j69l72m52k38p0K27K83L28K39O6l9k70l38l56j11
3903f04Q1L91K27L26J75p8l13m04k17k40J65K28L84L23J33q1l60k30m33j25J67
3924d85J22L44M16K12nl63j95m01k48J0K29L36L37J88L6l26j51m74q5q9J59L29
3946a04L21L21J59k18m23k74k30n4P3L26L02K79R2j67k24l80l01j37P2L65L79
3967A77K63P0J05m83k45k63k03O6K66K34L19K10j2k01l80k61k30P6J94K86L17
3988C05J95O3k77k31m48j27j0J78L83L07K84Jj28n28l15n4j19R3L58L29K80J06
$$ plain form
3839 130 -202 -437 -568 -569 -221 186 416 639 543 279 -228 -378 -614 -512 -181 176 460 656 571 277 -92
3860 -92 -400 -580 -532 -273 37 383 576 641 341 7 -371 -589 -615 -320 33 399 645 570 304 77 -417 -544
3882 -544 -569 -368 -77 377 501 668 499 127 -325 -563 -633 -406 -123 205 444 510 471 201 -137 -493 -604
3903 -604 -523 -132 95 421 596 518 205 -199 -416 -656 -491 -263 121 444 577 496 136 -94 -527 -652 -485
3924 -485 -363 -19 397 609 604 241 46 -355 -603 -593 -364 -28 309 497 533 207 56 -418 -503 -592 -433 -104
3946 -104 217 538 697 479 56 -218 -448 -502 -429 -103 199 478 570 403 179 -201 -502 -639 -567 -202 177
3967 177 440 510 615 132 -113 -376 -579 -513 -247 -13 306 516 504 303 -77 -338 -568 -492 -298 -12 305
3988 305 500 563 286 55 -393 -520 -530 -352 31 338 622 623 495 -33 -348 -402 -521 -428 -70 259 539 645
4010F45k47m08k29k51j1J10L21K84K70jl5l27l76j77j67K50J03N78J31J39j40
4031D62k17m17j49k37J22K28K71K41K22k7k67l25k88p6n9L31K95J54K57rj67k69
4053G6m31j30p0K66L23K33J88P5j71l47l53p7j24K24K83L10K09Q8j13l54l85j10
4075c90k1J40J78L34K36R0j15l06l06m22Q0N2J71M14K12K99k21k20m43k53n3M5
4097d99K22L69K93J85j28j39l75k67k28J12K64J73L65K07o3k38k54l30j48p8K55
4118c02L24L29P3R4q9l80k86k96J3J24K81M33N2K07k36k29l36j95q0J17K58L85
4140B61K91J0r6k19m77l16l5J29L12L33K75m1L1k30k92m31l7P1K11L78J56K41
4162E25k6k45l69k77n7J6Q9N13K35J64q6j38k99l91k42L4K59L22K05L26q2m8m09
$$ plain form
4010 645 398 -10 -239 -490 -501 -391 -70 214 484 483 448 121 -255 -432 -599 -349 -246 332 463 602 462
4031 462 245 -172 -321 -558 -436 -208 63 304 526 499 232 -93 -381 -457 -516 -185 110 264 521 512 345 76
4053 76 -355 -485 -555 -289 34 267 455 530 359 12 -341 -418 -542 -318 -35 275 484 572 459 105 -280 -390
4075 -390 -411 -271 -93 241 477 567 452 146 -160 -582 -502 -450 -279 135 347 646 425 205 -238 -491 -544 -499
4097 -499 -277 92 385 570 442 303 -72 -339 -567 -455 -191 -18 347 554 491 253 -1 -331 -479 -557 -302
4118 -302 22 351 424 518 429 49 -237 -533 -520 -396 -115 318 370 577 341 112 -224 -419 -499 -382 -124 261
4140 261 552 562 466 247 -230 -546 -581 -452 -140 193 468 427 458 228 -64 -495 -532 -461 -250 128 284 525
4162 525 499 254 -115 -392 -449 -433 -344 169 404 568 482 344 45 -346 -588 -554 -295 27 232 558 476 428 19
4185A9l42j79OK45J64L53J81J5j25k26l32k45j09J98J74L77J89J55j13l34k54
4206a83k29j41O2L32L41K43R0l5k99k56l95j06N1K77M31K12J46n8j46l67k72k89
4228e91M1K29M08K71%J48k42k60k80l47N7J06M96K77K39M5k13k88l64j60j18J09
4250d37M18L99K28Lk63k79l20k27j03J70K67K48L44J47j91j82m30k00k44K27K65
4271a60K95L67J51j56k41l06m26o2k5K87L64K19K75o0j92l13m18q6l0J51L78M19
4293D31K87j68k50k53k02l83nJ55L47L65K24J08l13k95l38k24l4J73K18K81L96
4314E20N4j04l84k98l08o1J64K69L75J59J42l5l13l52k34k71M9L36M84K97R1j21
4336D59k29k84l35j17P6J28M33K53J81m9k80l00l70j60pL09K95K51L04j03j03
$$ plain form
4185 19 -323 -502 -496 -251 -87 266 447 462 337 111 -221 -466 -575 -377 -203 174 363 518 405 71 -183
4206 -183 -412 -553 -491 -159 182 425 515 480 181 -75 -470 -576 -525 -248 183 395 541 483 337 -30 -302 -591
4228 -591 -550 -321 87 358 358 506 264 4 -276 -623 -566 -460 36 313 552 597 384 96 -268 -428 -546 -437
4250 -437 -19 380 608 611 348 69 -251 -478 -581 -411 -144 104 448 595 404 222 -208 -408 -652 -425 -160
4271 -160 135 502 653 497 256 -50 -476 -538 -563 -276 88 307 582 522 330 17 -401 -487 -517 -366 12 431
4293 431 718 550 300 47 -155 -538 -543 -388 -41 324 548 656 343 48 -290 -514 -548 -375 -157 124 520
4314 520 574 470 86 -212 -520 -581 -417 -148 227 386 528 493 180 -172 -406 -677 -628 -292 192 489 580 459
4336 459 230 -54 -389 -506 -430 -302 131 384 565 516 236 -64 -434 -594 -601 -292 3 254 558 455 352
4357C52k63m46j24j95K41L87L60K17K0j65l46l14k50o7J74K20M57J93J79j91k88
4378A51l47l00j27P1L57L53L44J47l3m25k77l90k8K2K53J84L53K51m8j48m03l89
4400d29j71n7L48L12L95K09L0l10l62k70l39K2K59L75L72J48J08k41l43l01k87
4421e32j04K09L48L54K60N7j75j69m58k50j76J41J76M74L99Q9j24l51k04l88p8
4442e02L7J77M21J22K98k7k58k57m09j06j18L40L13L43K31M0k50k25m81j29j65
4463f05K35K83M11J97N8q6l36n20j15k16K26M80K93K41J21j45l87k97k92j20k6
4484f00L54N10K81Q2j41l11k84m58o6Q9K50L89M99o6J4k10n35k31k62J77J97L78
4506E6L51J29j9k20k82k77l93M8K30L96K69K31R9l11j81n68j73M4J48L71K73K12
$$ plain form
4357 352 89 -357 -481 -676 -435 -48 312 529 549 384 38 -276 -526 -593 -419 -199 258 451 630 439 151
4378 151 -196 -496 -623 -552 -195 158 502 649 616 191 -86 -476 -504 -482 -229 -45 308 559 511 363 -40 -429
4400 -429 -600 -657 -309 3 398 607 637 327 -35 -305 -644 -622 -363 12 384 532 640 399 56 -245 -532
4421 -532 -636 -427 -79 275 535 592 417 248 -210 -460 -636 -495 -319 155 554 643 519 168 -36 -424 -502
4442 -502 -465 -288 133 255 553 526 268 11 -398 -504 -622 -282 31 374 605 645 395 170 -311 -440 -605
4463 -605 -370 -87 324 521 579 493 157 -363 -478 -694 -468 12 305 546 667 522 135 -162 -454 -574 -600
4484 -600 -246 264 545 627 486 175 -109 -567 -633 -544 -294 95 594 528 542 332 -203 -434 -696 -519 -322 56
4506 56 407 536 517 297 15 -262 -655 -607 -377 19 288 519 618 307 126 -442 -615 -571 -423 -52 221 433
4528D33O2l9l66k78l25o4J16J76M39M63Qj52k95l03l86j40P0L44L17M77J39q9
4550F07l35l74l30j57J32J16M39L15K21k2l14k06m46k46k4L05L19M31J80k2j61
4571D28l17n21k72J57Q0M53J55M23J08k15l67l30l19r9R1L84M27K40R3o2k23m58
4593a44k78k57J17K57N07J80K38m2k75l59n16l9Q7K26L66L64L17q7l30l19l66
4614c53k72J0J61M24M53K20p5j63m10k87l74J23K14K60M73J75N9j94l64k58l48
4635e26pJ8L81L46K74J97j63l88k80l98j68K18K89K72L98J89j10k59m17m03p3
4656f10L3L23L57L46K47r3l44l50l06k19j5J85N69R5L67O7l01l15m15j84M6K1
4678d96M89L36J15K12j95m80k81l20n8J35M25L36L19R3j22l00l50l81n9N6L52
$$ plain form
4528 433 495 456 90 -188 -513 -577 -461 -285 154 617 625 473 178 -125 -511 -651 -581 -237 80 557 696 607
4550 607 272 -102 -432 -589 -457 -341 98 413 634 612 298 92 -354 -600 -624 -319 0 431 611 589 428
4571 428 111 -410 -682 -525 -445 8 163 586 694 479 112 -218 -537 -636 -545 -161 266 506 599 537 314 -144
4593 -144 -422 -679 -562 -305 202 382 620 578 303 -56 -572 -611 -524 -298 68 432 749 662 332 13 -353
4614 -353 -625 -615 -454 -30 423 643 568 405 -5 -292 -666 -543 -329 -69 404 579 638 444 80 -178 -526
4635 -526 -533 -515 -134 212 486 683 520 132 -148 -546 -714 -496 -207 65 463 652 542 283 -134 -537 -610
4656 -610 -577 -254 103 449 696 603 259 -91 -397 -616 -631 -446 123 218 585 652 351 36 -379 -563 -517 -496
4678 -496 -7 329 444 656 461 -19 -300 -620 -678 -543 -118 218 537 630 508 208 -142 -523 -582 -526 -174
4699a74L49L34J16j95k50l60k36k29J05J40N33K29J98k4k93l15k80k62MK96K13
4720a01M29L27q5j19m06l62j38q9J13M85L04J15J49j20l66m41k93R1J9L80L30
4741B22L81Q4k28k30m70k60j58J94K20M35K19J95n1m35k70l89j70J84L12L03L93
4762D81Q1Lk76l40l35k19J07J79M13K81K57n7j04m98m65j80M0L01L65J86L64j9
4784E65k57k69l67k55o9J82L16M19K02K66l65k53m33k86l3J11K60N26K00J62p3
4805E49l20m35k93p8L7L15L24K78K61m6l66k47l53j61k0K10L89L42K76j03k04
4826C55l88k97l18R1J12L87L45J97K15m07k97l45j58q6J92K77M58K21K6j58k65
4847A57l71k75r3J44K66M27L10O9j04k55m33m10m1J29L09L19L33J63p7k73m23
$$ plain form
4699 -174 175 509 625 430 180 -180 -416 -645 -540 -400 133 362 560 536 243 -72 -352 -614 -610 -314 -101
4720 -101 328 655 570 451 45 -317 -455 -544 -431 54 358 473 622 502 136 -305 -598 -507 -488 -108 222
4741 222 603 687 459 229 -241 -501 -659 -465 -245 190 409 604 553 118 -152 -541 -711 -527 -215 88 481
4762 481 562 565 289 -51 -386 -605 -498 -319 94 375 632 575 471 -27 -492 -672 -632 -331 34 220 584 565
4784 565 308 39 -328 -583 -652 -470 -154 265 467 733 368 115 -318 -604 -637 -526 -266 260 460 622 549
4805 549 229 -206 -499 -577 -540 -225 99 377 638 592 226 -21 -374 -535 -555 -345 44 386 662 559 355
4826 355 -33 -330 -648 -557 -445 -58 287 484 699 292 -5 -350 -508 -594 -402 -125 333 554 580 422 157
4847 157 -214 -489 -582 -438 -172 255 565 634 530 275 -158 -568 -609 -480 -171 148 481 644 567 294 -129
4868a29m16j75J76K48L51L90J74J8k44l41l75l01kL95K03L64K36n1j34l42l18
4889b73j97q0J67K97M07K68O0k43l06l01l67N9O3K40L94L37J90j88k75l18l93
4910d59j66J04K72L69K39K86q9k44l78l33j82OK13M64K93J39Qj67k96m36j70m
4932e31K14K27M55J83P5k25l80l34k81l7J97L96K53L15R1j49k98l39l16o9R5K58
4954b00L42L81N5r8k41l29l41j47N6L17L71L03K5M1k01m58l34o9JK08M04L17J59
4977E62m3j66l96k05l31l5K80K67L66L33m4j05m68k93j55p4J26L20M21J54J7r1
4999D40l80l10j71j34N7K82M26K98L6j41k56l24l04k02J16M09K87L03O0L2k62
5020B62l86k66k72J69J07N16K13J73N0k82k88l32k38J3J83L38K72L22n6r8l21
$$ plain form
4868 -129 -545 -720 -544 -296 55 445 619 637 393 52 -323 -624 -626 -231 -28 336 572 521 387 45 -273
4889 -273 -470 -550 -383 -86 321 589 649 406 100 -201 -568 -509 -446 -206 188 525 715 527 252 -66 -459
4910 -459 -625 -521 -249 120 359 645 556 312 -66 -399 -581 -575 -362 102 395 534 542 375 79 -357 -527 -531
4932 -531 -317 -90 365 548 623 398 18 -316 -597 -634 -437 -41 212 527 618 469 171 -168 -484 -553 -458 -200
4954 -200 142 523 578 480 239 -90 -431 -578 -522 -205 166 469 494 535 334 -124 -458 -527 -526 -318 86 403 562
4977 562 519 353 -43 -248 -579 -614 -334 -67 299 632 588 483 15 -278 -433 -507 -381 -61 360 514 531 440
4999 440 60 -250 -421 -555 -498 -216 210 508 544 403 147 -177 -481 -683 -567 -158 129 432 492 524 262
5020 262 -124 -390 -662 -493 -386 130 343 516 566 284 -4 -336 -574 -561 -378 -40 232 554 498 400 79
5041G9k50l37j04K71L60K55J76J38j99j36m21m08L2J81K13L77J62P8L5k55n05
5062b58k00l4p4M20L30K97J02j14j41l73l47k02O9L13L41J91J76N2l56k20l99
5083d27j43K7K05M53K21K86q2j28l79l59k09J51m2L53L37J46J62j67l22l09k33
5104d59q2J11K64M35J78J20j37k67k94k84j00M4K41L05L79J14j06k26l87k28q2
5125d61L9J98K98L22J54L3k64l88l36j01p2K46K99L80J73j27L9l99l43k49O2J17
5147c80L02L32K28K2j06m15j47l87J8J07K72M04K12J37k61k04k91k60k6JJ84L60
5169A02L05O6M8k66m45k65l7k0K36M04J52K20q7r1l14l78p7j9J37K66L41J70J3
5192D61j12k95l14j08j86K16K68M88Q2K1j20k50l34k59j50R8M07J48L57J30j24
$$ plain form
5041 79 -171 -508 -612 -341 19 274 450 588 389 253 -168 -576 -544 -363 -150 227 389 467 502 247 -258
5062 -258 -458 -492 -566 -146 184 481 583 469 328 -45 -392 -594 -525 -212 129 320 496 548 192 -28 -427
5083 -427 -570 -543 -338 115 336 622 540 412 33 -326 -535 -384 -426 -73 264 410 572 405 83 -226 -459
5104 -459 -541 -430 -166 269 447 567 430 163 -131 -415 -515 -471 -230 75 454 568 462 236 -151 -379 -461
5125 -461 -422 -224 74 396 550 583 319 -69 -405 -506 -578 -332 -33 347 520 393 432 33 -310 -559 -497 -380
5147 -380 -78 254 482 504 398 -17 -164 -551 -533 -426 -154 250 462 599 338 134 -157 -417 -443 -442 -258 102
5169 102 407 473 521 255 -190 -455 -492 -512 -276 128 280 500 413 322 8 -370 -447 -466 -329 -63 278 448 461
5192 461 349 54 -260 -368 -554 -338 -70 418 500 521 401 151 -183 -442 -592 -494 -87 61 418 548 424
5213D24l69j17m00l2J57J36L07L22J00j28k97j64m28M1m1K62K90L27Q7J1j45l92
5235d9k64j68l8J97M78K33J11q8p8l36l16j78m6J31L35L17K79L2j78k88k62l74
5257e50q5L70J64K35K82J30k10j31m89j91NK3K61L05K88N9j4l56l47p8j20J15
5279c34J57L38J39K41p3k52k95k67j53pK23K57M03J21k7j93l12k58p5j96K05L62
5301DK05K99j4k27k15l46j16j57J47L16K84K86R6r7l81k30k71q7J13J45L23L78
5323D55M4j3k85l62k50j02J67J07K54L22J82j22k02k13l31j64N1J85K41L02J52
5344D18K6r1l61k47k12P6P9K18M37R1j14M1l77j42k67l2J58K72K23K05Q4r9k83
5367A03l25j72k8M5J39K71M25O3q6k56k69l44k7P6J67K91L19J68p7k61k13k83
$$ plain form
5213 424 55 -62 -462 -494 -337 -201 106 428 528 400 103 -61 -489 -448 -489 -227 63 390 477 488 343 -49
5235 -49 -313 -481 -519 -322 156 389 500 412 334 -2 -318 -496 -542 -411 -76 241 520 552 374 86 -176 -550
5257 -550 -635 -265 -101 134 416 546 336 205 -284 -475 -470 -447 -186 119 407 466 452 96 -251 -329 -449 -334
5279 -334 -177 161 300 541 468 216 -79 -346 -499 -506 -283 -26 377 498 471 278 -34 -292 -367 -563 -358 4
5301 4 209 508 494 267 52 -294 -410 -567 -420 -104 180 466 562 465 84 -146 -417 -504 -391 -246 77 455
5323 455 499 486 201 -161 -411 -513 -346 -239 15 337 519 397 195 -18 -349 -513 -462 -277 -36 266 418
5344 418 444 353 -8 -255 -467 -391 -312 -94 343 434 320 361 -16 -158 -425 -457 -299 -27 196 401 485 386 103
5367 103 -222 -394 -422 -377 -238 33 458 521 435 179 -90 -434 -461 -385 -218 73 392 560 483 222 9 -274
5389b74k07P0J10L51L78J13j58j12l17j52k32M5oL86L34L4J50j50l26k21k40p4
5411d98P9L37K43K10J2M1k37l39k20j62K33J57K59J77J44j00j49l16k43j6p7L18
5433a47L61P7J47N4l36j40k92j43R5L6M16K20J03n2j17m45j11r4n7J09K79L26
5455B89J66j73O9k14k88k22r4M7L78K21J89K03j86l20k75k30JJ88P6K48K14K06
5477D93r7k32k26k44j72J87J64K11K33J34n2j76l25k31j38J07J66K09K58J05O3
5498D37j49k40k32k92mK83J98J93K28q9m3k40k91k70L0K09K93J91J90P8k04j71
5520A05k24l18l5J80J95J10L10P5j22r7k46k68j00Q7K04L52Q0J37nk51k99j17
5542b47k40Q7K76K42J63J69p6j81j50k42k60LK07J95L00K11p7j02l39k03n9p8
$$ plain form
5389 -274 -481 -411 -301 50 428 541 383 271 -46 -198 -430 -385 -391 -5 329 363 513 363 37 -184 -424 -498
5411 -498 -419 -82 161 371 383 424 187 -152 -372 -534 -301 -144 115 292 436 336 187 -129 -372 -388 -465 -147
5433 -147 214 291 438 492 156 16 -276 -419 -324 -288 128 348 451 399 282 -163 -274 -368 -425 -316 -37 289
5455 289 455 282 351 137 -151 -373 -467 -420 -42 179 368 571 385 65 -210 -440 -439 -251 -175 73 287 493
5477 493 396 164 -62 -306 -478 -291 -127 84 317 451 399 223 -102 -333 -471 -364 -198 11 269 374 437
5498 437 288 48 -184 -476 -480 -197 1 194 422 333 290 50 -241 -511 -481 -272 21 212 402 480 276 105
5520 105 -119 -437 -472 -292 -97 13 323 398 276 179 -67 -335 -435 -348 -144 208 288 425 420 169 -130 -247
5542 -247 -487 -400 -124 118 281 450 374 193 43 -199 -459 -456 -249 -54 246 457 380 278 -61 -264 -323 -401
5564d01K28J88J45K27Pp9j85k91k24j11J38K43K16L42M7k01n5l75l25J09L6J72
5586a49K34J96rL9j83k47k81Q1K3J68K29J39N3J46j31m01j81o0J5N9L78J77N7
5609C52L1j89j92k79qo2M5L64J09J19On9j99k38r0j42J45K54J67J93K4q5j16l33
5633a83q8m6j00L32K51K22L2q2k02k76j95m9L5K37J86J90J61j59j79k07j43r7
5655c60L2J04J80L46qJ49j82l88o4j63J15M8J57K09J35po4l50p1j24p2K14J13
5678e1K96J02Nj56j67k07k29J01L3K34K17N1J69j68p1k97j13j81N5K56K38J28
5700B45K33r1k00j26l32l0j0J31K33K56J06o4j80r7k54j09p3K18J55J96R6M8j47
5723B04k04k68j52J00J23J49K18J67M7j29j78k97j34l8OK24K76J33J04l8j46l07
$$ plain form
5564 -401 -173 15 160 387 394 315 130 -161 -385 -496 -358 -115 101 443 490 289 234 -141 -466 -357 -321 -149
5586 -149 85 281 272 311 128 -119 -400 -319 -296 -128 101 240 293 439 308 -93 -274 -334 -319 -260 118 295 352
5609 352 383 194 2 -277 -285 -347 -302 62 171 290 296 237 38 -200 -290 -432 -287 -33 134 327 351 266 150 -183
5633 -183 -271 -317 -417 -85 166 388 420 338 136 -140 -335 -384 -349 -112 74 264 425 266 87 -120 -263 -360
5655 -360 -328 -224 -44 302 294 443 261 -127 -191 -354 -239 -191 -34 175 310 303 239 -111 -182 -306 -378 -164 -51
5678 -51 245 347 352 196 29 -178 -407 -306 -273 -39 178 229 398 230 159 -138 -251 -432 -377 -121 117 245
5700 245 478 387 187 61 -271 -301 -311 -180 53 309 415 351 171 74 -180 -289 -362 -144 11 207 303 351 204
5723 204 0 -268 -420 -320 -197 -48 170 337 384 255 77 -220 -354 -392 -386 -162 114 247 351 313 167 -140
5745a40r5j77Q1L55M0K91Mo8j92j45k86J8RJ48K20K27Nm2p3k40j47k44J78O6K33
5770B6J31P7O6k66m3k30q2J1K3J83K66J43J06j65j50k23k01l0J27K13J13K68l
5793C60o4k75j35q1n5K1K19Q6K46Ro3j34k34j53j05M7K44Q6K35J04j23p6k07k46
5817b94o5J53l3K79J83P0N3j16k54j73n9q1J93J79J21K14P1j23k18l39j02l0J17
5840b54K67J37K09k5j7k25k87p3k41J49K18L45M8%P0k03j31k82K0l9K48J45K43
5863C22l2m8r8k44j95k3l2K51J64J95J14k18n3q2k14r6j06K06K71J33J14o4k03
5886F2j0k39r7m9R2J92K41N3J31k25k08m4j90j68K41J57K31J19o7pk07j34j68
5909b94j36J26L87j3J83k0O3j63j41k61l1k4J04K39J86J13L0k23j51j68r8P5N0
$$ plain form
5745 -140 -235 -412 -331 24 64 355 359 291 99 -46 -332 -314 -305 -157 63 290 295 253 180 -60 -207 -451 -273 -207 26
5770 26 157 234 300 34 -9 -239 -321 -310 -287 -104 162 305 411 246 96 -127 -328 -358 -231 -18 95 363 360
5793 360 296 21 -114 -195 -250 -229 -10 76 322 331 268 134 -100 -253 -358 -311 -67 19 254 358 235 159 -48 -294
5817 -294 -359 -206 -239 40 223 293 346 230 -24 -197 -256 -337 -144 35 156 370 441 318 100 -239 -341 -371 -254
5840 -254 13 150 359 334 317 92 -195 -268 -509 -360 -142 203 251 251 321 118 -13 -295 -275 -314 -66 79 322
5863 322 290 242 144 -100 -295 -318 -350 -99 65 260 374 156 103 21 -193 -289 -395 -189 82 215 329 265 62
5886 62 52 -187 -284 -333 -241 -49 192 245 376 151 -57 -101 -291 -459 -218 -61 170 289 222 215 8 -126 -294
5909 -294 -430 -304 83 70 253 233 296 133 -8 -269 -300 -324 -220 19 205 318 348 125 -26 -194 -292 -217 -167
5932a67K51J06J22j0j16k98Jj65M0P4Q8J47K71O7k17k03j24j57J00r0J41L90Q9
5955C40J3k21p7j40j38o1j3J82K43J74M8k05l5j72j73j02n5L40K03P3J53q0k27
5978G0j25j45j47J21K7K23K08Q1q0mk75k40K1K9mL31J43J0L9n2k68j41J3j90K40
6003a15J27J38J71j9r7j73j05k15q1J27K19J16J51l5K1k79o6j85K9j7K60J76O3
6026B11J84j94j54j35j62q8l8K78L03J24j57j6m5k11j75l5K3J48J96J91J14j1
6048C51j78k45j00j33M6j8K58J75Q6M6j70m1j99j0k29K66R3J66M4j1o2l9k49j49
6072c02JQ8J70J45J04J1J0j98k00j03m0J3K73J32J20L5J5k68k11qp1M8J97J33
6096I4J25J06q5j59j21k67l8qK38K34J09N4Nj34j69j21k28O4J73J21J65J34m4
$$ plain form
5932 -167 84 190 312 302 186 -112 -111 -276 -236 -162 -74 73 344 411 194 -9 -133 -290 -190 -280 -139 251 340
5955 340 353 132 55 -85 -223 -284 -297 -115 128 302 350 145 110 -62 -235 -337 -392 -52 151 224 377 297 70
5978 70 -55 -200 -347 -226 -199 24 232 313 233 229 -46 -286 -265 -236 -240 91 234 244 283 231 -37 -178 -165 -355 -115
6003 -115 12 150 321 302 205 32 -73 -288 -369 -242 -23 93 244 209 230 -49 -115 -300 -271 -288 -28 148 211
6026 211 395 201 47 -88 -250 -338 -376 -98 205 329 172 156 111 -100 -275 -310 -287 -139 57 248 362 351
6048 351 173 -72 -172 -305 -259 -277 -19 156 242 288 118 77 -122 -132 -361 -95 -2 164 208 197 135 96 -153 -302
6072 -302 -301 -213 -43 102 206 217 227 29 -171 -274 -314 -301 -28 104 224 259 274 6 -205 -213 -284 -236 -39 94
6096 94 219 325 240 81 -40 -307 -345 -353 -115 119 228 282 287 153 -16 -137 -365 -301 -128 -7 158 292 248
6119B48k6k70p7j39j1Q1J96J47J45N4r6k42j67j02o5N5K91J00jJ56j0j45k31j59
6143b68m5K28r6L20J84m3n9j03j34k17l4M0J10O8L02R5j38j11m6k04j52q9K24
6166a68K51P0O3O2n0k64j88k5L2k3L47M5J04ml3k22j86j11L9J16J95M6J16J30
6190C42p8j91j74j36j29J35J51J99J31J9n3j9l49j97M4J29P5J83J94j20M6l0k89
6213a17j56o3J11O6K13K21M6j12K7k26r9j79o1J92J54J39J62j40N2j41k08j96
6235c15J0J11K08J29Q4j2j1r7k00k02p9Q6J83K85J38m0p9k09j31j13K0K2N9K59
6259A06J86R3l8j92k51j29j5r9J52J96K81j9L7j12k08k00m5j40L20J15K51j5l4
6282B40l4k30j66o5rJ25J97J27Q3l0l9k25j02q9p0Q9J60J80Q4J21j14j49j64j39
$$ plain form
6119 248 222 -48 -125 -264 -275 -194 2 149 294 348 252 10 -157 -259 -324 -269 22 122 121 277 267 122 -109 -268
6143 -268 -313 -85 -181 139 323 280 221 118 -16 -233 -267 -227 -117 -49 253 348 210 99 53 -151 -303 -392 -168
6166 -168 83 153 216 278 228 -36 -224 -249 -217 -240 107 152 256 252 219 -3 -189 -300 -261 -145 50 96 212 342
6190 342 264 73 -101 -237 -366 -231 -80 119 250 269 216 197 -152 -349 -305 -176 -101 82 276 156 202 172 -117
6213 -117 -273 -336 -225 -159 54 275 321 209 236 10 -89 -268 -329 -137 17 156 318 178 230 89 -119 -315
6235 -315 -305 -194 14 143 227 215 204 107 -93 -295 -374 -288 -105 180 318 278 199 -10 -141 -254 -234 -212 -153 106
6259 106 292 385 347 155 -96 -225 -240 -339 -187 9 290 271 308 196 -12 -212 -257 -397 -77 38 289 274 240
6282 240 206 -24 -190 -255 -264 -139 58 185 268 238 199 -26 -128 -217 -287 -198 -38 142 226 347 233 84 -80 -219
6306b19kk2J24J67K76p6r3m6j06k14m6J9R2J64K00J68j02k51j95r7q9J55J24J6
6330e3K73K7Q6j59k42l5j59O2j4J67J81J73j51L3q7k82j47N7M9K56N1J88M8j30
6354A92j77j52p6j04R8J54J66J06MO1p8l37j95M7k3J71K01J61N7j05ok53q8j43
6378c19jJ22K13L40o8K4j38k36j97m6O3Q5J10K39J27o9j99l8j55m6j59K51J43
6401D6P2K13o4p8n4k59q8j19Q6J79J40K18j8l8k00k10j56k5M1K90J21J65P0kk17
6426A13k04j15j55Q7J43J80K56R6j16r9k12j34o3j40K03J77J63M8J02j81j48j80
6448a79j35M7P1K22K07N9ok9k01k45j68j2K47P2J56J38l4O0k88j61j01j3k2K31
6472h4J78J95J1p0j08k33r1j72N4J11K80K65J8l5j56j90j22l06J79J56J65J83
$$ plain form
6306 -219 -221 -243 -119 48 324 248 155 109 3 -211 -257 -238 -146 18 218 386 284 33 -162 -259 -348 -193 -69 -53
6330 -53 220 247 333 174 -68 -103 -262 -200 -214 -47 134 307 156 189 102 -180 -327 -270 -221 35 86 274 322 192
6354 192 15 -137 -213 -317 -219 -65 101 207 211 272 194 -143 -338 -291 -314 -143 58 219 276 171 165 -88 -176 -319
6378 -319 -320 -198 15 355 287 311 173 -63 -260 -306 -243 -158 -48 191 318 249 50 12 -143 -189 -348 -97 46
6401 46 118 331 267 189 135 -124 -212 -331 -245 -66 74 292 274 236 36 -174 -330 -355 -314 -24 97 262 332 330 113
6426 113 -91 -206 -361 -274 -131 49 305 401 285 186 -26 -160 -223 -363 -160 17 180 228 330 149 1 -179
6448 -179 -314 -267 -196 26 233 292 286 257 56 -189 -357 -369 -122 -50 106 244 210 270 -18 -179 -280 -293 -315 -84
6472 -84 94 289 300 230 122 -111 -202 -374 -320 -209 71 336 354 319 163 -27 -149 -455 -276 -120 45 228
6494B28L2Rj28j28k62k44J56J89J40K23O1M8j10k81m5j55o9J55J58K74Q4q1L2
6517B86k16j67j71j04J84J12K26J19M7L8k98j41p2j89J9J73K59O1J34p2j41j76
6539h9j73j29L8K24K29P6J80n8j80j01j91j62J2J70J56N0J45Q4q6j03k33q0j95
6562d16K58J16K23J14R5k92j53q1j02j32J60J68J16K50L3k51L0k84j71k7J19J67
6584f0K47R9j5o0j42j51j33j02K0J24K09J48K26j65p8k84r9r2LJ0K91L06M6q3
6608B65l4j09l13r7j11J42K62J76J01M6j72j20k48k4p0J1L11M7K22j2Lj74j69
6631f7k14J1k9K29J89J37O1J3k62j72l7k56J15J22K19J77K8K6j29j41j19k32p
6654c38J71L04l6J63n9j39k14n1n4k6Q4K77J63LO3j10j22j68j62j10L7K39K50
$$ plain form
6494 228 260 269 141 13 -249 -493 -337 -148 -8 215 276 324 214 -67 -112 -267 -336 -181 -23 251 335 254 286
6517 286 70 -97 -268 -372 -188 -76 150 269 316 354 56 -85 -157 -346 -327 -154 105 166 300 228 87 -89
6539 -89 -262 -391 -353 -129 100 176 356 298 118 17 -174 -336 -324 -154 2 52 197 281 195 92 -141 -221 -416
6562 -416 -158 -42 181 295 390 98 -55 -136 -238 -370 -210 -42 74 324 357 106 136 -148 -319 -346 -227 -60
6584 -60 187 286 271 211 69 -82 -215 -317 -297 -173 36 184 410 245 167 -117 -216 -308 -305 -295 -4 302 348 265
6608 265 231 122 -191 -288 -399 -257 5 181 282 328 156 36 -212 -236 -306 -295 16 63 285 273 276 102 -67
6631 -67 -281 -270 -299 -70 119 256 317 330 68 -104 -141 -397 -282 -160 59 236 264 290 161 20 -99 -331 -338
6654 -338 -167 137 101 264 205 66 -148 -199 -253 -279 -195 82 245 248 311 201 79 -89 -251 -361 -324 -85 165
6677A65J17L7j00j39l01q5p2mK10K35K30N2p7j33k71m2j64P0L4L35K03N5m6j28
6701A81j90k42J7n7J13K17J95J88j09k36j64j33j05r0L22J13K20O4K5Jk51k98
6723b19k6l3K3J40K29K82m6q8k15k24j54K5J43n2L52K18n7j04j03j09j81q8O9
6746b18J96J42J76P7o5j70j10k19j31NJ53K19J56R2j0j80j6l50k4l8J44J53K07
6769A89J82o6r2j87k70l4l0J05K12J56J77q2m7k16p9k62r%J31K74K29K1J3k70
6793D5q9r8j70J22N8K74J5J40M8k05j21k84m2k1J15K32J58J22q2q5j16j57j32
6816b73NN5K45J72J31p1mk13k23j27j26K49P4K51J42L2jk88j66j7j84R4J38K39
6840A34P5R3j12j16k10q9j17J10J16J49K48Q5n9j43j59k27q1l7J60J84J53K20
$$ plain form
6677 165 282 319 219 80 -221 -306 -378 -382 -172 63 293 345 268 135 -136 -178 -342 -272 -238 97 300 355 309 181
6701 181 -9 -251 -234 -291 -178 39 234 422 313 77 -87 -220 -325 -415 -93 20 240 304 329 330 79 -219
6723 -219 -245 -278 -255 -115 114 396 350 262 47 -177 -331 -306 -163 -215 137 355 298 194 91 -18 -199 -287 -218
6746 -218 -22 120 296 373 308 138 28 -191 -322 -317 -164 55 211 303 293 113 97 -253 -277 -315 -171 -18 189
6769 189 371 305 213 26 -244 -278 -308 -203 9 165 342 260 213 -3 -82 -344 -353 -353 -222 52 281 302 315 45
6793 45 -44 -142 -312 -190 -132 142 157 297 345 140 19 -265 -307 -328 -213 19 177 299 217 132 16 -141 -273
6816 -273 -268 -213 32 204 335 264 260 47 -176 -303 -429 -180 -106 145 287 319 318 30 -136 -153 -337 -243 -105 134
6840 134 209 302 190 74 -136 -225 -342 -232 -116 33 281 366 307 164 5 -222 -303 -340 -180 4 157 377
6862C77j16j3j84l10j39J02J05J23K87j8kJ5j86l11n4J0O0K05J93K09l8j48j44
6885B3j09k44l8K8K51K25J78j3J08l19j84k06o5M5J95J48K01L3J00k50k47q5j41
6908c66j7J88K60J59J9J11j47j73j71j46m2J97J60J21J77j26p2j01k42j40J3J38
6930b00J16K52J34p3L0k48j28k56N0L7K65J58K04m1l7p9l25j23rk0J72K43K37
6953C59m4r1m8k88j08j32M2R2K92J31K18j21j28j15k71j26O6R2K52K14J79j09
6975C56k53j12j47j76mJ32K11J76Q3Q1j50m9l16o2r7R4K59R3J27J93j59j55j85
6998f0j56j18Q3O2K06M22j37jk46j63r7n3L6R4K70J3K76j05o2j99k49q2K6J5K26
7023AK24J24q6Rl09k24m3j38K66J23J44K01P8j23k34j31j81q3O6K26J43K28L5
$$ plain form
6862 377 261 248 64 -246 -385 -283 -178 -55 232 214 212 227 41 -270 -324 -314 -254 -49 144 353 315 167 23
6885 23 -86 -330 -368 -340 -89 136 314 301 409 90 -94 -300 -365 -320 -125 23 224 257 357 107 -140 -225 -366
6908 -366 -383 -195 65 224 243 354 207 34 -137 -283 -325 -128 32 153 330 204 132 31 -211 -351 -338 -200
6930 -200 -84 168 302 229 259 11 -117 -373 -323 -286 -21 137 341 300 263 184 -141 -264 -273 -293 -121 122 359
6953 359 315 224 176 -112 -220 -352 -310 -218 74 205 423 302 174 59 -212 -338 -272 -180 72 286 465 356
6975 356 103 -9 -156 -332 -336 -204 7 183 266 347 197 148 -168 -230 -327 -233 26 119 246 439 280 125 -60
6998 -60 -216 -334 -251 -189 17 439 302 301 55 -108 -205 -258 -222 -128 142 155 431 326 264 65 -184 -266 -240 -225 1
7023 1 225 349 263 272 -37 -261 -304 -442 -176 -53 91 292 370 247 13 -118 -299 -382 -316 -90 53 281 316
7046C16r2j29k74j18p7J56L1L13J05J78o1k41k05j67j47N0J97J38K85P4Jj71j92
7069c0k26m5J8J21J40K36N4j9o1k21j14j61JJ54J23J57J78q1L4k62j75p5j34J39
7093b49J28J75J71J71k12j56j32j54j47J66Q5L07J24L5rl20j07j36j61Q5K41J49
7115E4K25k4L1k03j57j27q6L7L4K30J47J29r9j3j58l15n6N9N0K29J76O1O1n1k83
7140d9q4n4j63R2K70J94K2P1l5j66k25j67o6j7K28K05K00O2m5j88j38j48Kn3N9
7165a93L38J37l2qjl04j48o3J0M5K28J48J73j8p0j71l38n2j5J56R7K12J65J41
7189D37j81j70l03k0m2kK52M7K91L2p4k05k39k57J18Q9J59J27K91O5n1k29k00
7212f5j98o1q9K87L32k5J24j6j62k50j26l0qP3L00K13l4K8p5k38j89p2n4J63J53
$$ plain form
7046 316 224 95 -179 -297 -374 -218 -187 126 231 409 348 107 -98 -265 -412 -362 -165 -27 258 332 333 162 -30
7069 -30 -256 -301 -283 -162 -22 214 268 249 188 -33 -147 -308 -307 -153 -30 127 305 224 258 -4 -179 -254 -388 -249
7093 -249 -121 54 225 396 184 28 -104 -258 -405 -239 -154 153 277 312 303 -17 -124 -260 -421 -336 -95 54
7115 54 279 255 286 83 -74 -201 -287 -250 -216 14 161 290 191 178 20 -295 -351 -292 -242 -13 163 224 285 234 -49
7140 -49 -133 -187 -350 -258 12 206 228 299 264 98 -127 -294 -360 -377 -149 56 256 318 273 85 -53 -201 -199 -252 -193
7165 -193 145 282 250 242 241 -63 -211 -274 -264 -219 9 157 330 312 242 71 -267 -319 -334 -178 -81 131 296 437
7189 437 256 86 -217 -237 -279 -281 -29 18 309 341 267 62 -177 -434 -316 -227 -68 59 350 415 364 135 -65
7212 -65 -263 -324 -413 -126 206 181 305 289 127 -123 -249 -279 -287 -214 86 299 265 293 218 -20 -209 -281 -335 -172 -19
7237a9K59qJ33p9k58j44j88k9l9L53J13K82q5n7k25p5k75p3K73O9J68J39M9j2
7261B72j67j85j51m7k4J57K83Q5J10n9j20k03j38j18l5J04K45J49J07oj21q5k40
7284a87j01J4K7K12J97K60j27j73j25j59p1j60K58n8L23R8Q8j53m1k38j78m0J18
7307b16Q8J81K34K4pj62k17j59q5J8J71J33K79j1L3j55j35j77j35k0J01K28K57
7330B68J6Q0j76k05j37j51L4Q2J69J20J78j7q8q6k91k9j19O2Q4K63K04L3L0k94
7354C0j76j71J2QJ60K06K71Pm5j17k75j84j26R7J67J91J24J59j25r8j25j34k27
7377c71J74J06J8K75J70J6k36j42k40m3n7Q4J88K10J43L6j30j02k77j50p9J35
7399b72J46K86J27m2mj88j22j64j44J96J17K14K01J2j25l7j72k60L9m4M6K16K36
$$ plain form
7237 -19 240 232 365 286 28 -116 -304 -333 -372 -19 94 376 291 234 9 -66 -341 -414 -141 -72 96 235 284 272
7261 272 105 -80 -231 -278 -302 -145 138 223 333 274 154 -49 -187 -305 -340 -236 9 158 265 259 138 53 -187
7284 -187 -288 -274 -247 -35 162 422 295 122 -3 -162 -233 -393 -135 -193 130 228 316 163 122 -116 -294 -334 -216
7307 -216 -128 53 287 311 304 142 -75 -234 -319 -301 -130 3 282 271 304 149 14 -163 -298 -318 -217 11 268
7330 268 284 364 188 -17 -154 -305 -271 -189 -20 100 278 261 173 87 -204 -233 -352 -290 -206 57 261 294 324 30
7354 30 -146 -317 -305 -297 -137 69 340 347 302 185 -90 -274 -400 -303 -136 55 179 338 213 115 -10 -144 -371
7377 -371 -197 -91 -73 202 372 388 152 10 -230 -273 -330 -246 -58 152 295 331 201 99 -178 -328 -407 -272
7399 -272 -126 160 287 245 241 53 -69 -233 -377 -181 -64 150 351 363 238 201 29 -231 -192 -236 -190 26 262
7422B62N9L0j38k30j80m0o0J43J32K80J19j19q3j68j97r0p5J64J58K12J00J3l4
7445B58k09j47k11m0J41K05J36J01j5p4J1k24j81K4P7J20J48J57j1Kj69r9k13
7468b13q7Q6J99l6K38J49j34m7k54j49p7O6J64J32J56O5M6j48j82j00k14N8PK63
7492a2J36Q8J06j70o0k21j20K9mJ95J44J87J8r5j27j54j97j20J65J25J23K30O9
7515C35o2j30j18k91p2O1K40N0J86J15j37m2j34j77q4p5J69K04O8J83L4j91o1
7538G1k72o2N4N2J88N4K85M4k56j42j02k03N0k4J57K00J44k6k7j13j90jj87J19
7562a87J15J12J51N9q2n6j98j98M1J0J46K06KJ79K1j05k42j53j75J79J09Q0J88
7585B02M3p1l2j84j74j6n4J81j2L12m4J00r7q2k63j22J00KJ22K06J54N6q2k02
$$ plain form
7422 262 321 351 213 -17 -197 -237 -297 -154 -22 258 377 258 175 7 -190 -280 -355 -191 -33 179 279 292 258
7445 258 49 -98 -309 -349 -208 -3 133 234 219 145 156 -68 -249 -225 -148 -28 120 277 266 268 99 0 -213
7468 -213 -300 -214 -15 -51 187 336 202 155 -99 -248 -325 -259 -95 37 193 258 304 156 -26 -126 -340 -282 -275 -12
7492 -12 124 212 318 148 88 -133 -253 -224 -228 -33 111 298 316 221 94 -60 -257 -377 -212 -87 36 266 335
7515 335 273 143 25 -266 -338 -277 -37 13 199 314 177 135 1 -176 -260 -335 -166 38 106 289 323 132 71
7538 71 -201 -263 -209 -157 31 85 370 414 158 16 -86 -289 -239 -263 -106 94 238 212 185 72 -118 -119 -306 -187
7562 -187 -72 40 191 250 168 112 -86 -284 -243 -233 -87 119 121 300 321 216 -26 -179 -354 -175 -66 14 202
7585 202 245 174 142 -42 -216 -232 -286 -105 -117 195 151 251 154 72 -191 -313 -213 -211 -89 117 271 327 245 43
7609D3j20j43J8o9J41K31K01Qm0j92j83q4p7J6J28J79R8K22j42o0k70r4j4j23
7633c26K12J09K59J02j16j87l6j85j44J14j09M05M7R6l2q3q6j60j90NR0J99M4
7656B8K18J15j56j12k07o9o4M2J18R1J77O1J2j62p8k16j14J34N9K39O0J16o4j30
7680I8j78j61J9n7J48K40J00M5m5q8j58j52m5j7J07J13J70R0L6j10k09q2q8r3
7704c17J19J97K02J32k14J60k52j53j76L9L9J50J19R7J83j41j10j53k9k48J67
7725a89J32K31L7J20o0j48j60r4j65K6K41R9J69P7L4j65k62q0j41J71kP6K70N2
7749B69N6k04j70q9j13K3M2J59J60P5P7j30j52j80j13K8N4J80J24K01k7j15j23
7772C2j08j97p8P3K59J55N6J10o1j98o9m8k55J29L4K54N2M0L3j25n9k26n8k7J50
$$ plain form
7609 43 -77 -220 -202 -271 -130 101 302 310 270 78 -105 -189 -266 -250 -122 57 155 377 235 175 -95 -189 -203 -326
7633 -326 -114 -5 254 356 240 53 17 -168 -312 -198 -307 98 145 241 209 126 40 -120 -310 -305 -215 -16 28
7656 28 246 361 205 93 -114 -183 -247 -205 -87 4 181 242 254 92 14 -202 -316 -182 -123 116 176 292 228 98
7680 98 -80 -241 -222 -279 -131 109 209 254 209 121 -37 -189 -234 -251 -144 -31 139 229 265 155 -54 -136 -224 -317
7704 -317 -198 -1 201 333 119 279 27 -126 -302 -263 -224 -74 45 142 325 184 74 -79 -108 -356 -189
7725 -189 -57 174 211 331 271 123 -37 -131 -296 -270 -29 70 239 316 350 185 -77 -157 -298 -127 -129 -53 217 269
7749 269 325 121 -49 -138 -251 -228 -186 -27 133 208 285 155 3 -177 -290 -262 -208 -28 96 297 270 155 32
7772 32 -76 -273 -351 -278 -19 136 192 302 241 43 -26 -74 -329 -200 -166 88 140 180 213 88 29 -197 -255 -282 -132
7797a32J60J32Q8j15m3p0j58j57M3Q7J58J10K01n6n3k38p7r4l9L7j9L45P6N4P9
7822C19l68rj31O4j40K02K23P4Q8k16M8j94k28J2J7J49J20J53M8M6j08j07k67
7845b05o6O4R4J52J19KK8l3r9k16o2K1o4K29J90O0l2M9k11o6j55l5oK32J23N0
7871A63L0K1k85pj83L2P3J42P1J87j5lj23p5k39R2m0P1Q1K21N5J1k09j87q8q1
7897b85J22N7M6J81J07lj31j6o5k44p0J14J26J78O1P1k41k5p6l7q9M7J09J10J95
7922B42Kl6j23j83q8m1m1J21K34J19m7qm0o7k83L1M7J6J92R8M4Q2j76k35o7n1
7948b58J16J59J9J89Nk7j15j2k75M9o2K2J87J59J17k7j31j42o5j02n1J66Q3P6
7972H0J15M8nj69j39r0m4lJ10J11J05J20k8k40q0l3m9K6k3K69N7L3O2k40o9o8
$$ plain form
7797 -132 28 160 248 133 90 20 -138 -295 -252 -165 -7 103 304 248 195 -43 -120 -214 -253 -216 -235 110 186 240 319
7822 319 -49 -58 -189 -125 -265 -63 160 234 322 106 154 -40 -268 -256 -239 -90 30 183 231 277 169 62 -205
7845 -205 -271 -207 -113 39 158 160 188 155 56 -160 -222 -201 -265 -36 154 214 182 231 20 -46 -201 -236 -242 -10 113 163
7871 163 193 214 -71 -78 -261 -229 -156 -14 57 244 229 226 103 28 -211 -119 -159 -88 -7 214 269 280 71 -116 -204 -285
7897 -285 -163 -106 -60 121 228 225 94 78 13 -231 -301 -187 -61 117 178 249 8 -17 -93 -130 -219 -172 -63 47 242
7922 242 244 208 85 -98 -186 -227 -268 -147 87 206 159 151 111 44 -239 -208 -161 -145 47 145 189 271 95 -140 -207 -258
7948 -258 -142 17 36 225 230 203 88 76 -199 -150 -212 -190 -3 156 273 246 115 -27 -92 -194 -245 -79 4 80
7972 80 195 243 238 69 -70 -160 -204 -207 -97 14 119 239 211 -29 -109 -142 -191 -165 -188 81 138 171 233 -7 -76 -144
7998a44p2PJ47K5J33R2R2j63j55j21P8j43J33O2K31r6J50j83j8j82j10k0O2J44
8022e1J45J78p6l4j25j25j48O9k4K23l3J01K31l27P3j44j25o7P8J0K70J27L6r4
8046A68p4q9k82J6J27r7K83J68mo6J8j15k27j33J67Q6OP2J41J51k07p0r8j94O
8071b47NJ89K08L1L8o0r7j18k16nJ22O5J42L4J33r8n6k07l7P5r0M9J15J93Jm3
8097A26n8j42l0j13R3M0J38J56JJ1k57k1r9q4L4L6R6K19l1Q7q9k10R2k22P1K7
8123a29L1K65j4Q7j64l7j25N5k74K13L9J04K10j16P4k50K3k11o0K9K61M7J86K1
8147B65j32mj71q5J7lj2J30J55j9M2o4j33j16p6m4jJ59K09J30j61l0jk65L2o3
8173b41J28L38k19R2R1Qj41r6k01r8J06K63m0K07j9L9j34k71
$$ plain form
7998 -144 -216 -209 -62 -37 96 188 280 117 -38 -159 -81 -224 -91 -29 202 106 256 73 55 -127 -237 -257 -195 -51
8022 -51 94 272 196 162 37 -88 -236 -167 -191 32 -1 100 331 4 77 -67 -192 -259 -181 -171 99 226 262 168
8046 168 94 5 -277 -261 -134 -231 52 220 216 150 168 53 -174 -307 -140 -54 -48 24 165 316 109 39 -59 -253 -247
8071 -247 -242 -53 155 186 224 164 67 -51 -267 -272 -150 -85 57 91 224 126 70 -137 -174 -99 -189 -140 -25 168 169 126
8097 126 68 -74 -104 -217 -124 -84 54 210 211 222 -35 -56 -155 -239 -205 -169 -73 146 115 202 113 -97 -5 -227 -156 -129
8123 -129 -98 167 153 240 76 39 -86 -31 -305 -92 -53 51 261 145 219 -31 -8 -219 -279 -250 11 58 244 265
8147 265 133 129 -42 -127 -110 -113 -125 5 160 141 183 119 -14 -130 -206 -250 -251 -92 117 247 86 56 55 -210 -178 -241
8173 -241 -113 225 6 98 189 197 56 -40 -241 -339 -233 30 -10 197 178 217 83 -188
8191a88
$$ Imaginary data points
##PAGE= N=2
##DATA TABLE= (X++(I..I)), XYDATA
0@%%%%%%%%%%%Qj6J6j7K5l2L8m7N7o8Q0r6J15j37J58j84K15k48K84l24L71m23
33b25M79n42O11o87P70q60R60j069J190j324J467j622J794j979K182k406K649
50A388k919L217l546L912m320M779n300N895o584P395q363R540j1009J2906j5462
65h471J9117k4813L5004n8916K22405J68848k98291j49291r3851J2012J4130N6473
77a05644L9571R7826J00460N1630n7772j00627j22166n9361L0845Q0942M5563
88A267O6393J00950M5310r0743j42551j13400n1034Q298N4682N8307P9982J13131
100A30592Q2771k0904j02374j35641j11680j4171R0607Q3641J7640J6401N4280
111I1162K8906m3909r7120r5276k9775N4075P3042M3666M1890N0756J6525l1123
$$ plain form
0 0 0 0 0 0 0 0 0 0 0 0 0 8 -8 8 -9 16 -16 22 -25 32 -36 44 -52 63 -74 84 -100 115 -133 151 -173 198 -225
33 -225 254 -288 323 -364 406 -454 506 -563 627 -697 770 -852 942 -1037 1145 -1261 1388
50 1388 -1531 1686 -1860 2052 -2268 2511 -2789 3106 -3478 3917 -4446 5094 -5915 6991 -8471
65 -8471 10646 -14167 20837 -38079 184326 353174 54883 -94408 -188259 -176247 -162117 -105644
77 -105644 -66073 31753 132213 183843 126071 25444 -96722 -156083 -125238 -44296 1267
88 1267 67660 168610 213920 123177 -19374 -132774 -183808 -175510 -120828 -62521 17461 130592
100 130592 213363 192459 90085 -45556 -157236 -171407 -80800 2841 20481 36882 91162
111 91162 120068 76159 -20961 -116237 -146012 -91937 -18895 24771 66661 117417 133942 102819
123A02819o8903j12120j07913m337J03587J05700N0762K3791J6989j364l7547
134G1464q3710r3429k9212M8887O7391N2972M1374J1820k4881l2815m3396p4278
146h7813n7433K7937R3520Q6472M5875J0222j1169k3510n4469j00292r1447n840
158a67947P5896R7011P6065K9190k6329m3027k4148l0968n9562m2046K9077R0249
170C461R5203L9252l8116o9589m7434l4557m6690l2132J9675O7728R1598Q0832
182A29231K0498n2931p7141n4988l3940k2048Q0L5359P1900P6679K2913m8472
194F7140o9393m4277k5177j4434J0650M0774N9980O6161M0352k2614p7500p9368
206d7706m0744j785J5142J6670L1446O4218O8872J3476n4528p5674n2462j6942
$$ plain form
123 102819 33916 -78204 -186117 -190454 -86867 18833 69595 93386 110375 109011 71464
134 71464 -12246 -105675 -134887 -86000 -18609 34363 75737 87557 62676 29861 -13535 -87813
146 -87813 -145246 -117309 -23789 62683 108558 118780 107611 84101 29632 -70660 -162107 -167947
158 -167947 -92051 4960 81025 110215 83886 40859 16711 -14257 -73819 -115865 -86788 3461
170 3461 98664 137916 99800 30211 -17223 -51780 -98470 -130602 -110927 -43199 48399 129231
182 129231 149729 96798 19657 -35331 -69271 -91319 -91239 -55880 16020 92699 115612 67140
194 67140 -2253 -46530 -71707 -86141 -75491 -34717 25263 91424 131776 109162 31662 -47706
206 -47706 -88450 -90235 -75093 -58423 -26977 37241 106113 119589 65061 -10613 -63075 -80017
218h0017J5584L2924L1059K9681L5816K2279k1519o4635p0766l4315J7749M6142
230d0018M1084L3342L7639K7354j2112n2635o5379m8333j2696K2852L8526L6033
242E657L3461K9865R507k7466n9489o0252k0964L1041N1534L5827J8950J7236
254F4907R205j9772n3972o6232m2394P872N1881O2217M2506J5641q75j0033k6752
267C4199n2015n7481k0450L3731N8682M4190J8494Q98j2702k9096m3661m4467
279f9678k1518K0429N8149O5731L6219o348l0726l1975l3169m2685l6712J240
291i1043M7632O5562M6290J0686j8897l2668l4739l1174k3673o435K3357N2848
303G746N5915K2844k3470m7095l9617k3781j6118p240J7718M8325N8608L5961
$$ plain form
218 -80017 -64433 -31509 -450 29231 65047 87326 65807 1172 -69594 -103909 -86160 -40018
230 -40018 1066 34408 72047 99401 87289 34654 -30725 -79058 -91754 -68902 -30376 5657
242 5657 39118 68983 78490 51024 -8465 -68717 -89681 -58640 -7106 28721 47671 64907
254 64907 74112 54340 368 -65864 -108258 -100386 -48505 13712 56218 71859 70984 60951 34199
267 34199 -17816 -75297 -95747 -62016 -3334 40856 59350 60248 47546 18450 -25211 -69678
279 -69678 -91196 -70767 -12618 53113 89332 82984 52258 20283 -12886 -55571 -92283 -91043
291 -91043 -43411 22151 68441 79127 60230 27562 -7177 -38351 -62024 -68459 -45102 7746
303 7746 63661 86505 63035 15940 -23677 -47458 -63576 -70816 -53098 -4773 53835 89796
315H9796n373l9033m9312l8417j8485p00J2258K6445M1069M1483J5038k5398m7546
328A825l8047j4871L00Q925K4062M0492L9876J4548k0141m3635m6998l0659m556
341f8879J7185K5843K9180L5280L2405N339l4430n3888l8226q067J1600J9325
353b7333K5734L1144K5278M322k2264m1409m2564k2370R696L2795L4662K5917
365C3608K1209J3788j0464m2344n3790l3303J465K6272L3271L0649K4800J3293
377E8454o238k7706m0805l7464j3893J9930M1571L6604J7155L426m588j9671l9103
390a2328m3974k1514J6276M2318M2589K7560J0041o959k2849l1710l3015k6796
402f0361o241K6150M7509L8757J0919j2014k0630k3352k8156k6621o167K4580
$$ plain form
315 89796 84423 45390 -3922 -42339 -60824 -61524 -49266 -22821 18248 59731 74769 49371 1825
328 1825 -36222 -51093 -50793 -41868 -17806 22686 62562 77110 56969 13334 -33664 -64323 -68879
341 -68879 -51694 -25851 3329 38609 71014 76353 41923 -11965 -50191 -58258 -46658 -27333
353 -27333 -1599 29545 54823 59145 36881 -4528 -47092 -69462 -59766 -26971 7691 33608
365 33608 54817 68605 58141 15797 -37993 -71296 -69831 -43559 -10288 20361 45161 58454
377 58454 52216 24510 -16295 -53759 -67652 -47722 -6151 30453 47608 51034 46446 26775 -12328
390 -12328 -56302 -77816 -61540 -19222 23367 50927 60968 54009 31160 -550 -33565 -60361
402 -60361 -66602 -40452 7057 45814 56733 44719 24089 737 -27419 -54040 -60207 -35627
414c5627M1683L5596J7692k786k3147l3762k9764j9916r740Q673L3276M4954L1678
427E8810J818k2505k8705k3695k0469j5691K752K7011L6926K8097J0298j1994
439D2653l0800l2942k0504o937M664J8339L1766L5183K2030o392l2065l5983k3680
452c4668j2565l412J3811L0687L3606K2782L272j9470l3204k9962j5685K24J4633
465b9951K3677K6825K5757J2178j6726l9374l5303j6038r25J1193K3958L0854
477A6125K7210J4407p057k9322l7892k8608r168J2389K6250K5530K0494J6720
489D7078K298k3926l8956k9315q855R977K4411K9178K3012J3335L10j8257l2813
502b523l3551k0781J935K6031L4973K4382J1637L689j0141k7228l2203k1860l531
$$ plain form
414 -35627 6056 41652 59344 56558 33411 -351 -30115 -50031 -59771 -51098 -17822 27132 58810
427 58810 60628 38123 9418 -14277 -34746 -50437 -47685 -20674 16252 44349 54647 42653
439 42653 11853 -21089 -41593 -48530 -43866 -25527 6239 41422 63452 57060 24995 -10988 -34668
452 -34668 -47233 -50645 -36834 -6147 27459 50241 53513 34043 839 -29123 -44808 -44584 -29951
465 -29951 -6274 20551 46308 58486 41760 2386 -32917 -48955 -49880 -38687 -14729 16125
477 16125 43335 57742 50685 21363 -16529 -45137 -54305 -41916 -15666 9864 30358 47078
489 47078 49376 25450 -13506 -42821 -51676 -41699 -17288 11890 34902 48237 48547 30290 -2523
502 -2523 -36074 -56855 -54920 -28889 6084 30466 42103 45792 35651 8423 -23780 -45640 -49171
515d9171J7558L0544K6985J4503K405j1554k4932k7914k1039q327J2065L1964
527f913L2829J7005K044q661k0024k6739k4553j3755M789K4437L1243K2246Q957
540D2905n279j9968k5534j9770j1841j113J7540L1335K6005R148n752j7029k3550
553b903k2560j6304m162J4525K9598K8620J6448J564j5010k6243k3439j3807n942
566c9615N689K2042K8848K0420M873j1164k3488k4363j6887p401N268K1921K9398
579A5541K2574Q494q423k4506k8417j8650p066K433J5202K6090K6113J5470k232
592D2623k0997k9358k1761q623K249J4287K4052K3133J3911R48j5383k8498k6246
605b9663j2155K845J4780K2833K3346J6804N509j1892k7399k8507j5837j095J1907
$$ plain form
515 -49171 -31613 -1069 25916 40419 42824 31270 6338 -21576 -42615 -50942 -38877 -6913
527 -6913 25916 42921 44965 36304 16280 -10459 -35012 -48767 -43978 -19541 11702 33948 42905
540 42905 37626 17658 -7876 -27646 -39487 -40600 -23060 8275 34280 43428 37676 20647 -2903
553 -2903 -25463 -41767 -45929 -31404 -1806 26814 43262 44826 29816 3573 -19866 -33673 -39615
566 -39615 -33926 -11884 16964 37384 42257 31093 7605 -16758 -33645 -41046 -35778 -13857 15541
579 15541 38115 46609 38186 13680 -14737 -33387 -40453 -38020 -22818 3272 29385 44855 42623
592 42623 21626 -7732 -29493 -38116 -35867 -21580 2472 25605 39516 40464 25081 -3417 -29663
605 -29663 -41818 -38973 -24193 -1360 21986 38790 44299 32407 5008 -23499 -39336 -40431 -28524
618b8524K2504K3220J4784N002o404j9680k6469j9426m639J0496K1289K3042J6420
631C1615O841n560j9631k6464j9908o711O351J8324K4143J8797Q336j899j3527
644B0707k3090k3341j2298L001J7095K3299J8177Q194j074j0714j9817k1026j3076
657c3963j241J1983K2433K2769J2917K37j0821j9120k1674j5878m884Q711K0680
670g851K2729J4351L686n753j5353k1431j7972p498N972J7814K2755J7510N505
683C4464o884j6133j9636j6628r730Q46J4743K4722K1785R004m220j4379k0213
696b259j9156j1281k08J1286K0320K1547J3730j88j3872k0964j8889j0568j246
709c1748Q852J8748K2465J5354J854j1369k0074k1338j4399k746Q920J7731K0578
$$ plain form
618 -28524 -6020 17200 31984 36986 30582 10902 -15567 -34993 -39632 -29136 -7847 15195 31615
631 31615 38456 32896 13265 -13199 -33107 -39818 -33467 -15143 9000 27797 36133 34234 20707
644 20707 -2383 -25724 -38022 -35021 -17926 5373 23550 31744 30670 19956 139 -20887 -33963
657 -33963 -35204 -23221 -788 21981 34898 35135 24314 5194 -16480 -32358 -37242 -28531 -7851
670 -7851 14878 29229 32915 27162 11809 -9622 -27594 -35092 -29120 -11306 11449 28959 34464
683 34464 27580 11447 -8189 -24817 -34547 -33701 -18958 5764 27549 36553 32333 17954 -2259
696 -2259 -21415 -32696 -32904 -21618 -1298 20249 33979 33791 19919 -1045 -19934 -30502 -31748
709 -31748 -22896 -4148 18317 33671 35525 24156 4082 -17256 -31655 -34401 -25481 -7750 12828
722A2828J6285N916p156j8483k1857j5464m131O295J4622J9714J7705P552n919
735B7907j7135k0652j6016o130M901J4095J9134J6928R265j511j3267k1216k0106
748b3803r386L967J3351J7453J6777J0665N10j0666j8087j7994j1287p69J0098
761a9171J7549J8138J1431J450q449j6500j9616j4058j945R909J6195J6683J3154
774B4770N406n032j5059j9374j5597n721N870J4832J8403J4196N429m310j1926
787A1887j6818j6360q978L214J4385J8669J5325P267k329j0944j6509j7194j0822
800b9207j3J1058J8134J8013J0722p58j0721j5770j5836j1358k749Q398J6690
813c397J8184J1671J428q282j4999j6916j2976l878O968J5344J7998J4320M203
$$ plain form
722 12828 29113 35029 27873 9390 -12467 -27931 -32062 -25767 -11145 8569 26274 33826 27907
735 27907 10772 -9880 -25896 -32026 -27125 -13030 6104 23032 32297 30786 17519 -3697 -23803
748 -23803 -33189 -29222 -15871 1582 18359 29024 29534 18868 781 -17213 -28500 -29269 -19171
761 -19171 -1622 16516 27947 29397 20948 4448 -15168 -29226 -31171 -21262 -5067 11616 24770
774 24770 30176 25144 10085 -9289 -24886 -30607 -24737 -9905 8498 22694 28123 23813 11887
787 11887 -4931 -21291 -30269 -27055 -12670 5999 21324 28591 26262 15318 -1191 -18385 -29207
800 -29207 -29220 -18162 -28 17985 28707 27949 17228 1458 -14378 -25736 -28485 -20087 -3397
813 -3397 14787 26458 27886 19604 4605 -12311 -25287 -29165 -22197 -6853 11145 25465 29668
826B9668p005j5368j6613j2747n654L629J2734J7991J5595O505m643j3582j6734
839f224j4120o483K956J1518J6176J5224Q614j985j2088j7081j5009p732J118
852b5116R671J5332J5934J0455M15r808j5845j5805r934p78Q422J4244J5207J0979
866B3373K516p227j4672j6079j1206k129O817J2961J4988J2410M862n523j3582
879G509j6240j2704m508N030J2235J4783J2514O055k462j0872j5737j4334o680
892b5411L377J1367J4457J2928P101j120r611j4639j4296q602N69R786J4767J4078
906A4751Q386K52p698j3334j4927j0587j330P840J4048J4495R774J776o390j2466
920D590j4178j1264l476N690J3022J4977J1241L211n181j1523j4168j1961n077
$$ plain form
826 29668 22663 7295 -9318 -22065 -27719 -24090 -11356 6635 22230 28735 24092 10510 -6224
839 -6224 -20344 -26827 -23871 -12353 3823 19047 27661 25676 13588 -3493 -18502 -26234 -25116
852 -25116 -15445 -113 15821 26276 26691 16883 1038 -14767 -24701 -25479 -17057 -2813 12394 23373
866 23373 25889 18662 3990 -12089 -23295 -25424 -18607 -5646 9342 21752 26614 21091 7509
879 7509 -8731 -21435 -25943 -20913 -8678 6105 18619 24674 22212 11340 -4397 -18731 -25411
892 -25411 -22034 -10667 3790 16718 23819 22699 13088 -1551 -15847 -24449 -23880 -14094 673 14751
906 14751 23137 23389 15691 2357 -12570 -23157 -24487 -16647 -2599 11896 21670 23446 17056 4590
920 4590 -9588 -20852 -24328 -18638 -5616 9361 20602 23813 18632 7109 -7059 -19020 -24097
933b4097L667J1557J5051J2342N252l693j0489j3851j2293o363J824R753J4170
946B830J3241P023j770r580j3546j2745p556L74Q269J3414J3810Q529r7q048j3049
961A099j3297q694j203O696J2253J3782R863K142o529j2383j3282r789k514N217
975a6639J1089J3559J0832L720m773j1308j3764j0782l937L928J0246J3053J1430
988A6654N486k887j0006j3518j1620n680K333R167J2501J1913O754j100q496j2799
1002a298j2529p061P74Q049J2079J2114P793P84o997j2218j2759q656j090O802
1016a4213J1613J2406Q969K019n386j1156j2651r828k853M970J1099J2579R641
1029A7209L537m116r996j2577j0564m489L461R894J2542J0592M890k585r006j2121
$$ plain form
933 -24097 -20430 -8873 6178 18520 23772 20079 9590 -4261 -16554 -22917 -21093 -11340 2830
946 2830 16071 23094 21324 11744 -1802 -14547 -22103 -21729 -13460 -46 13764 22293 22196 14148 1099
961 1099 -12198 -20892 -22095 -15399 -3146 10636 20499 22641 16112 3729 -9553 -19342 -21856 -16639
975 -16639 -5550 8009 18841 22561 17788 6480 -7284 -18066 -22003 -18075 -7829 5224 16654
988 16654 22140 19253 9247 -4271 -15891 -21571 -19238 -10071 2430 14343 21097 19997 11501 -1298
1002 -1298 -13827 -20888 -20114 -12065 14 12128 19921 20705 13708 1490 -11269 -19925 -21015 -14213
1016 -14213 -2600 9806 18775 20794 15408 4252 -8399 -18227 -21080 -16110 -5011 7568 17209
1029 17209 20746 16630 6634 -5943 -16507 -20996 -17535 -7641 4901 15493 20383 17798 8792 -3329
1043c329j1107n903J695Q598J2331J1307O180j145p779j1854j1380o890J36P294
1057a1846J1510J1632P510N08o626j1311j1534p989j354N957J0815J1815Q545
1070A7632J930n388j0203j1850q844k824M403J0014J1826R378L413l777r546j1662
1084e498r642m127K975Q864J1685J0120M721k318q483j1386j0333n277J532P927
1098i240J1157J0535N892q76p270j0948j0632o663P7O822J0560J0997P123M82
1112A8016o058j0263j0898p468j376N215R948J1071P895K060m505r758j1083q323
1126a5527k489L862R253J0916Q710L322l248q724j0896r118l962K509Q227J0957
1140C792R364M568j953p900j0604r481n074J261P277J0287R895N593n95o690j0320
$$ plain form
1043 -3329 -14436 -20339 -18644 -10046 2285 13592 19772 18627 10848 -1006 -12386 -19276 -19140 -11846
1057 -11846 -336 11296 18806 19314 12688 1377 -10157 -18146 -19500 -13543 -2728 9087 17632
1070 17632 19562 14174 3971 -7879 -16723 -19547 -15144 -5130 6696 16074 19487 15710 6164 -5498
1084 -5498 -15140 -19267 -16292 -7428 4257 14377 19098 16780 8297 -3089 -13422 -18699 -17167 -9240
1098 -9240 1917 12452 18344 17468 10198 -750 -11382 -18045 -17968 -11146 -586 10411 17534 18016
1112 18016 11958 1695 -9203 -16671 -18047 -12832 -2884 8187 16082 18142 13637 3879 -7204 -15527
1126 -15527 -18016 -14154 -4901 6015 14725 18047 14799 6075 -4821 -13939 -17901 -15392 -7165 3792
1140 3792 13156 17724 15771 7871 -2733 -12214 -17288 -16027 -8750 1537 11432 17025 16430 9740 -580
1155e80j0047n939m9O111R909J0158O575O35n476r606j0448o902j161N013R117
1170b690J0126P563J815m199r042j0169p871k316L738Q550J0138Q136L041l082
1184A3738q090j0219q547l710K717P692R875Q813M122j665p169r890r074m804
1198a6211J210O908R552R028N083m55n955r467r416n770K9N624R291R585O037
1213A5073M62m968q873r562o674j159M437Q692R491O859J896m009q037r504p360
1228a3236k517L415P909R660P529K716k752p447r312p898l485K052P108R396Q338
1243A1476L855j814o557r012q398m364R33N975R111Q499M949o56n729q614q614
1258h960n250j34N165Q502Q950N751N28m831q359q671n939j162L965P848Q897
$$ plain form
1155 -580 -10627 -16566 -16615 -10504 -595 9563 16138 16773 11297 1691 -8757 -15659 -16820 -11807 -2690
1170 -2690 7436 14999 16814 12615 3573 -6596 -14467 -16783 -13045 -4495 5643 13779 16820 13738
1184 13738 5648 -4571 -13118 -16828 -14111 -6419 3456 12269 16391 14726 7557 -2333 -11407 -16211
1198 -16211 -15001 -8093 1459 10487 15570 15115 9160 -307 -9723 -15493 -15464 -9840 -549 9036 15073
1213 15073 15535 10567 1694 -7868 -14542 -15701 -11264 -2572 6919 13778 15674 11665 3628 -5876 -13236
1228 -13236 -15753 -12338 -4429 5231 12760 15476 12724 5277 -4035 -11933 -15418 -13366 -6258 3138 11476
1243 11476 15331 13517 6960 -2052 -10450 -14814 -13881 -7906 1205 9704 14653 13997 8268 -346 -8960
1258 -8960 -14210 -14344 -9179 -677 8273 14024 14552 9721 1362 -7309 -13248 -14410 -10445 -2597 6300
1273F300O653J828l711p825q787o778k187L276P036Q885P007K896k571p098q868
1288c944p300l136K132O414Q633P598L889j320o421q636p782m071J030N666Q253
1303A005P923M717m13n283q121q300m863j13M950P821Q210N319O57m284p825q347
1319f947n759j058M185P407Q173N927J665l280p010q382o543k046K897P118Q187
1334D534O483K362k328o454q110p047l075K073O313Q254O942L263j436n693p918
1349a837p354l903Q23N480Q024P301M215n57m893p564p363m749j17M580P421P758
1365G265M995L08m257p209p426n340j121L653O973P778N741J464l186o915p662
1380d939n818k029K746O286P897O244K440k491o151p624o371k767J804N662P696
$$ plain form
1273 6300 12953 14781 11070 3245 -5542 -12320 -14507 -11231 -4195 4690 11697 14593 12022 4924 -3944
1288 -3944 -11244 -14380 -12248 -5834 2799 10397 14286 12966 6545 -2091 -9873 -13944 -12914 -7248 1005
1303 1005 8928 13645 13232 7949 -172 -8472 -13335 -13448 -8498 -677 7533 12852 13509 9225 1400 -6947
1319 -6947 -12706 -13764 -9579 -2172 6001 11928 13593 10313 3303 -5079 -11622 -13668 -10771 -3653 4534
1334 4534 11017 13379 11051 4597 -3513 -10560 -13635 -11562 -5249 3005 9947 13210 11774 6081 -1837
1349 -1837 -9191 -13094 -12271 -6791 1233 8534 12749 12192 7299 -265 -7628 -12377 -12494 -7914 -493 7265
1365 7265 12260 12568 8311 1102 -6324 -11664 -12785 -9132 -2159 5619 11360 12824 9638 2723 -4939
1380 -4939 -10757 -12786 -10040 -3754 4143 10387 12827 10336 4185 -3439 -9810 -12577 -10773 -5111 2585
1395B585O749L240j373n508p556o788l607P86N007P376P024M257m84m753p273
1410c18p095m317Q7M228O838P171M836N48l945o895p358m978q12L596O498P175
1426E259N469J442k988o407p476n683j658K796N952P180N830K199k096n913p184
1441c278o025k699J958N552P127O105K927j298m991p203o406l395R97M881O941
1456A193O544L600o35m361o685o576m288J07M280O716O620M202K71l725o233o848
1472e818m707p03L433O123O938M853J153l064n958o680n104j720K527N741O750
1487C764N456K047k217n550o520n584k618J864N219O616N876K587j451m883o305
1502a699o010l132R67M361O534O268L525n00m523o216o186l738L3L819O267O299
$$ plain form
1395 2585 9334 12574 11201 5693 -1863 -8651 -12258 -11472 -6465 911 7935 12192 11708 6955 -318
1410 -318 -7413 -11730 -11643 -7415 -577 6594 11430 11978 8033 1138 -6220 -11198 -12010 -8414 -1916 5259
1426 5259 10728 12170 9182 2775 -4701 -10384 -12042 -9246 -3294 3886 9716 11915 9819 3906 -3278
1441 -3278 -9303 -12002 -10044 -4492 2635 8740 11667 10369 5378 -1825 -8231 -11626 -10629 -5748 1193
1456 1193 7737 11337 10702 6341 -344 -6920 -11208 -11101 -6821 -105 6515 10717 10988 7263 1030 -5818
1472 -5818 -10525 -11228 -7795 -1672 5266 10119 11272 8208 2250 -4430 -9534 -11254 -8727 -2986 3764
1487 3764 9220 11267 9050 3500 -3020 -8604 -11222 -9358 -4139 2477 8353 10940 9489 4606 -1699
1502 -1699 -7709 -10841 -9874 -5513 1021 7289 10814 10314 5791 -425 -6611 -10349 -10316 -6497 -230 6069
1518F069M169K90l699o114o165m381o12L108N747O456M790J066l012n641o481
1533d410m768j363K452N357O345N024K070k258n126o289n453k111J760M985O217
1548B432N407K671j429m750o128n685k791R82M350O150N635L211m93m029o118
1563e85n914l416K07L819N999N735L640K72l412n606o092m028n52L205N352O094
1579D718M245R80k741n309n923m616j425K478N100N982M750J715k136m764n808
1594b754n025k163J691M592N985N018K363j266m386n706n181k825R02M166N662
1609A073N355L047m78l909n598n362l396Q1L577N463N582L594J65l194n382n487
1625d869l862n96K819N278N598M048R63k588n084n581m214j362K291M834N677
$$ plain form
1518 6069 10238 10528 6829 715 -5450 -9831 -10443 -7335 -1588 4868 9658 10724 7712 2071 -4410
1533 -4410 -9178 -10541 -8089 -2732 3613 8637 10707 8449 3323 -2966 -8419 -10530 -8770 -3785 2432
1548 2432 7839 10510 9081 4331 -1797 -7482 -10273 -9291 -4941 1209 6844 10055 9562 5533 -585
1563 -585 -6499 -9915 -9708 -5889 110 5845 9485 9757 6345 739 -5353 -9381 -9933 -6728 -1376 4718
1579 4718 8963 9943 7202 1893 -4030 -8646 -10071 -7593 -2493 3489 8239 9954 7818 3054 -2754
1594 -2754 -7779 -9942 -8251 -3659 2326 7344 9707 8441 4055 -1651 -6832 -9657 -8755 -4589 1073
1609 1073 6428 9475 8997 5088 -510 -5872 -9268 -9187 -5610 -147 5435 9029 9194 6000 618 -4869
1625 -4869 -8731 -9327 -6508 -1230 4368 8416 9379 6791 1707 -3874 -8088 -9450 -7159 -2325 3352
1640C352M350J727j948m656n624m541j933J513M396N554M751K205j251m080n442
1655a627m899k466P41L906N473N003K844o24l524n386n015l100J81L314N100N309
1671E230L172K87k962n087n278l706l66K727M907N207L781Q36k397m737n289l933
1687g608j212K108M484N352M155J511j765m234n393m229j892J462M152N258M455
1702F604K095j165l848n195m682k424R55L587N182M626K714m70l490n020m953
1717e484k825K19L102N013M872L077J37k869m700n055l356m72K744M589M945L646
1733G583P38k340m542m938l803j010J936M378N129L828J323j659m004n205m004
1748f590j657J410L821N065M291J897j194l624m977m350k188P80L477M910M425
$$ plain form
1640 3352 7702 9429 7481 2825 -2799 -7340 -9273 -7760 -3364 2190 6941 9146 7895 3815 -1627
1655 -1627 -6526 -8992 -8251 -4345 1128 6131 8975 8351 4827 -559 -5574 -8674 -8493 -5179 -79 5230
1671 5230 8402 8689 5727 640 -4638 -8344 -8710 -5983 -1076 4131 7912 8748 6351 1614 -3675 -7608
1687 -7608 -8820 -6712 -2228 3124 7279 8790 7025 2791 -2602 -6831 -8723 -7261 -3109 2149 6604
1702 6604 8699 7534 3686 -1509 -6191 -8615 -7660 -4073 1109 5735 8449 7979 4489 -531 -5484
1717 -5484 -8309 -8090 -4988 25 4897 7974 8111 5242 542 -4513 -7869 -8341 -5597 -1008 3937 7583
1733 7583 8321 5981 1439 -3499 -7302 -8312 -6376 -1998 3131 6959 8282 6623 2619 -2586 -6590
1748 -6590 -8247 -6837 -3016 2049 6340 8237 7043 3419 -1558 -5908 -8096 -7316 -3839 1071 5496
1763E496K501n47l167m741m657k587K3K875M867M553L025J48k694m533m766l156
1779g360n71K572M457M694L336P75k196m233m822l543r81J843M164M738L665J369
1795G907j546m028m759l812j597J341L687M697M153J718j048l391m818m128k080
1810g704P75L208M655M191K417n29l032m501m353k555K24K690M561M409K766J51
1826G373k502m429m404l021m00K279M238M452L135O64k049m003m415l273r99J809
1842e545L708M680L414J214j607l559m614l614j466J176L615M557L677J763j015
1857F384l393m359l876j954O85L097M378L969K229n58k827m332m052k393K78K660
1873d064M052M224K536J59k466m042m349k640k80K062M003M177K931O97j977l840
$$ plain form
1763 5496 7997 7450 4283 -458 -5115 -7702 -7679 -4804 63 4616 7641 7789 5095 562 -4204 -7360
1779 -7360 -7931 -5359 -902 3792 7128 7903 5707 1474 -3348 -6891 -7872 -6029 -1865 2873 6538 7907
1795 7907 6361 2333 -2426 -6238 -7835 -6494 -2807 1890 6043 7761 6713 3322 -1496 -5624 -7704
1810 -7704 -6929 -3721 934 5125 7542 7013 3981 -520 -4873 -7428 -7204 -4514 47 4456 7222 7373
1826 7373 4871 442 -3962 -6983 -7383 -5104 -866 3586 6721 7385 5336 1333 -3082 -6355 -7354 -5545
1842 -5545 -1837 2843 6257 7471 5864 2305 -2309 -5923 -7389 -6213 -2598 1959 5636 7399 6384
1857 6384 2991 -1368 -5244 -7198 -6513 -3416 962 4931 7160 6602 3775 -557 -4609 -7002 -6724 -4064
1873 -4064 -12 4212 6748 6907 4441 399 -3950 -6590 -6870 -4808 -805 3372 6303 7000 5023 1183
1889A183m189l200p93J693L588M319L252J219j619l308m380l424j294J140L330
1904b483M232L555J656r08l184m202l638j877P18L021M051L797K025n79k586m052
1920d54l871k348J87K651L901L880K591J35k412m002l912k688l24K082L757M086
1936C259K876N01j879l619m166k881p84J522L574L993L244J012j352l339m195
1951b234l133j301J193L087M177L331J425q65k874m073l527j724O91K797L834
1966H04L653J918k81k604l909l765k123J99K419L686L807K355Q3k266l618l849
1982c491k560k66K006L627L792K689M87j645l502l835k875p41J407L428L762L082
1998E365J058j266l287l846l068j206J040K951L960L067J517r02k746l798l421
$$ plain form
1889 1183 -3006 -6206 -6999 -5306 -1718 2601 5853 7072 5453 2145 -2235 -5659 -6953 -5813 -2483
1904 -2483 1749 5304 6960 6052 2868 -1334 -4972 -6849 -6131 -3110 941 4738 6763 6184 3598 -454
1920 -454 -4325 -6673 -6486 -3835 66 3946 6537 6672 4260 258 -3654 -6342 -6666 -4584 -827 3259
1936 3259 6135 6636 4757 1138 -3028 -5909 -6693 -5171 -1597 2396 5640 6652 5300 1961 -2234
1951 -2234 -5367 -6668 -5475 -2388 1789 5120 6545 5680 2806 -1267 -4794 -6518 -5827 -3030 804
1966 804 4457 6375 6094 3490 -419 -4184 -6307 -6108 -3689 -3 3804 6159 6242 3976 358 -3491
1982 -3491 -6051 -6317 -4311 -684 3108 5797 6284 4639 1137 -2698 -5573 -6314 -4907 -1479 2283 5365
1998 5365 6423 5157 1870 -1976 -5044 -6250 -5210 -2259 1701 4768 6285 5383 2637 -1161 -4582
2013d582j521O14K487L795L497J762l54k375l597l662k060J64K182L775L359K236
2029E720K21k051l549l630k263m55J882L412L670K472N76j771l057l738k721p20
2045f002J391L110L806K714R82j125k884l818k944j349J102K872L600L166J342
2060E963p81k703l591l260j480O25K417L497L339J713k78k332l509l343j939J14
2076e548K212L402L341K067K15k002l296l533k191m09J826L240L495K346N54j529
2092D190l133l531k584p37J446L000L373K748R56j182k780l485k875j128R42K725
2108b055L388K903J490p92k576l362l184j532O70K307L405L054J799k27k364l354
2124d30l105j923J82K090L084L383J972K63k031l073l245k285k61J643L038L353
$$ plain form
2013 -4582 -6103 -5489 -3002 793 4290 6052 5698 3323 -274 -3936 -5996 -5832 -3650 125 3484 5720
2029 5720 5941 3890 341 -3289 -5552 -6007 -4125 -713 2957 5429 6005 4234 1177 -2561 -5282 -6002
2045 -6002 -4611 -1501 2305 5019 6001 4876 1992 -1826 -4770 -6119 -5017 -2145 1455 4621 5963
2060 5963 5182 2479 -1112 -4372 -5852 -5227 -2810 687 4026 5739 5461 3129 -380 -3723 -5662 -5548
2076 -5548 -3336 66 3407 5474 5689 3687 391 -3142 -5333 -5742 -3916 -676 2819 5165 5719 4190
2092 4190 1057 -2474 -5058 -5795 -4349 -1349 2024 4772 5728 4546 1766 -1719 -4594 -5722 -4780 -2055
2108 -2055 1333 4236 5726 4934 2358 -1004 -4188 -5720 -5050 -2743 662 3716 5515 5288 2924 -430
2124 -430 -3535 -5458 -5276 -3186 -102 3281 5253 5516 3485 412 -2833 -5118 -5379 -3736 -698 2655
2140B655K360M04j492k927l388k429o71J263K866L452K435R32j036k641l498k648
2156d363j112R60K510L273K880J233o38k408l361k892j422M56K206L367K865J690
2172E244k91k153l088l015j774K0J951L141L135J889J6j686l027l119k187j92
2188e136J585K855L199K304L22j360k747l258k310o68J228K642L127K584Q84j053
2204D198k526l229k506j083Q08K413L199K673J300o98k320l159k763j475N21K267
2220b380L110K737J510j85k164l018k941j498Q7J762K984L022J781j5j625k789
2236C78l003k003l25J533K805L012K114L42j248k694l057k156o27J240K393L148
2252A852K355P98j031k504k981k394j040Q06K363K966K612J081o23k167l065k530
$$ plain form
2140 2655 5015 5419 3927 1000 -2388 -4817 -5488 -4225 -1359 2093 4528 5460 4424 1783 -1715 -4363
2156 -4363 -5475 -4515 -2005 1268 4148 5381 4743 2335 -1026 -3918 -5340 -4884 -2678 689 3554 5244
2172 5244 4953 2800 -288 -3303 -5077 -5057 -3106 35 3170 5059 5075 3389 362 -2757 -4944 -5136
2188 -5136 -3551 -696 2503 4807 5129 3769 1022 -2236 -4546 -5214 -3986 -1344 1783 4367 5251 4198
2204 4198 1672 -1557 -4063 -5146 -4338 -1925 1274 3947 5247 4549 2229 -930 -3693 -5168 -4647 -2380
2220 -2380 730 3467 4977 4792 2628 -390 -3331 -4829 -4742 -2980 4 3026 4807 4792 3167 378
2236 378 -2625 -4628 -4953 -3420 -615 2397 4511 4853 3605 911 -2146 -4302 -4929 -3689 -1296 1852
2252 1852 4207 5005 3974 1470 -1511 -3905 -4945 -4139 -1776 1190 3802 4883 4260 2093 -972 -3502
2268c502j224L80K117K807K656J500j87k053k840k724j624R5J809K871K749J705
2284D535J22j715k655k785j916k50J476K601K781K088M75j359k566k765k127n89
2300d649J134K315K926K104Q54r37k406k747k314r79Q55K230K762K332J150n39
2316D091k091k798k582j110L92J866K806K553J345k47j802k695k679j571K04J791
2332b527K584K597J633J32j489k694k683j602l82J461K316K857J943L28j194k460
2348H20k716j928o99J070K342K744K160P29j055k218k653k249q46P32K159K661
2364A053K301J058o15j870k816k234j191L73J816K659K445J408k78j851k519k551
2380b812j444J28J663K455K648J411J32j429k551k468j725k53J375K315K636J811
$$ plain form
2268 -3502 -4726 -4346 -2229 578 3234 4734 4547 2494 -346 -3070 -4694 -4599 -2790 81 2830 4535
2284 4535 4657 2942 287 -2498 -4414 -4664 -3188 -587 2194 4282 4757 3398 832 -1933 -4060 -4649
2300 -4649 -3515 -1200 1726 3830 4684 3747 1341 -1406 -3720 -4699 -3844 -1614 1148 3480 4630 4091
2316 4091 2000 -798 -3380 -4490 -4098 -2232 574 3127 4472 4225 2423 -272 -2951 -4522 -4318 -2527
2332 -2527 57 2654 4287 4419 2930 236 -2447 -4049 -4431 -2970 -654 2203 4146 4474 3280 820
2348 820 -1896 -3824 -4523 -3453 -1111 1633 3793 4522 3467 1249 -1404 -3653 -4499 -3767 -1608 1053
2364 1053 3354 4412 3797 1927 -889 -3123 -4314 -3941 -2125 534 2979 4387 4109 2258 -261 -2812
2380 -2812 -4256 -4128 -2465 -10 2638 4049 4181 2752 201 -2267 -3992 -4245 -2870 -555 2081 3892
2396C892K86j086k236k687k020l66R94K069K674K026P08p79k174k652k143o97
2412d191O64K034K608K132J076n90j824k615k381j108L48J846K538K333J194k28
2428C836j600k450k440j358l5J523K536K400J516l5j339k211k557j730n4J206
2444b792K257K612J615M30j166k159k512j943m91R47K132K528J979O98q79k031
2460A225k554j911q10N13K092K425K156R81n73j837k428k272r49L27J726K369
2476D80K400J042l21j428k330k296j452J33J385K238K528J340K11j501k282k266
2492b119j640k3J157K064K389J676L43j009k156k396j771m60R22J916K497J900
2508C290O74p58j948k487j930q02P01J821K437J866R55m33j814k252k038j136
$$ plain form
2396 3892 4178 3092 856 -1831 -3851 -4217 -3223 -1154 1520 3546 4254 3475 1301 -1351 -3494 -4191
2412 -4191 -3527 -1493 1115 3247 4323 3733 1909 -706 -3087 -4195 -3847 -2001 537 2870 4064 3836
2428 3836 2236 -214 -2654 -4012 -4047 -2524 12 2412 3928 3893 2554 343 -2214 -3944 -3998 -2792
2444 -2792 -535 2077 3692 4122 2956 797 -1715 -3658 -4149 -3202 -1070 1458 3437 4135 3256 1225
2460 1225 -1329 -3240 -4050 -3537 -1445 980 3136 4117 3544 1707 -721 -2993 -3942 -3615 -1889 480
2476 480 2880 3922 3601 2173 -157 -2453 -3905 -3772 -2387 -149 2379 3719 3930 2429 147 -2119
2492 -2119 -3759 -3782 -2625 -561 1828 3504 3847 2838 682 -1714 -3485 -3945 -3023 -1107 1390 3290
2508 3290 3964 3206 1258 -1229 -3159 -3961 -3260 -1439 998 2864 3819 3386 1572 -680 -2718 -3854
2524c854J98J972K206K078J211j68j589k379k155j233j15J569K270K197J397M8
2540C653j178k229k326j470j57J120K120K242J644K84j004k090k249j647m98Q69
2556b916J986K266J851O64q66j896k257j856p19O35J752K280J967Q89n72j606
2572A602k271k065r60L64J534K207K153J090j91j532k197k101j279K35J313K050
2588d8K204J275J64j279k068k238j404j11J080J910K281J518L43j015k018k036
2604a442j681m70Q63J909K136J722O17p89j790k198j804p30O61J696K253J746
2620B699Q43m51j528k210j918r13K60J565K051K020J119k53j381k043k159j217
2636c516K09J196K109K023J236J71j143k056k064j448j83J066J903K123J447M12
$$ plain form
2524 -3854 -3656 -1684 522 2600 3811 3643 2054 -325 -2480 -3713 -3828 -2259 11 2208 3605 3653
2540 3653 2475 246 -2080 -3550 -3707 -2587 -467 1775 3419 3703 2699 609 -1640 -3287 -3785 -2916
2556 -2916 -930 1336 3187 3851 2985 1089 -1168 -3024 -3743 -3108 -1356 924 2891 3780 3208 1602
2572 1602 -669 -2734 -3694 -3330 -1796 411 2564 3654 3463 1931 -266 -2367 -3646 -3411 -2098 -48
2588 -48 2156 3431 3595 2316 248 -1990 -3394 -3505 -2425 -515 1766 3284 3627 2612 594 -1442
2604 -1442 -3123 -3593 -2730 -821 1315 3037 3654 2865 1075 -1123 -2927 -3657 -2996 -1300 953 2699
2620 2699 3542 3091 1563 -647 -2565 -3478 -3218 -1653 398 2418 3537 3284 1903 -140 -2299 -3516
2636 -3516 -3307 -2111 -2 2021 3257 3428 2285 229 -1835 -3283 -3466 -2400 -497 1626 3073 3485
2652C485j008j860k162j614l53Q24J851K195J637M63p49j665k093j735o72M92
2668b964J732K147J678P82l45j525k125j847q70K25J365K192J916J048m48j168
2684A793j920j964j141J4J254J882K108J063J60j071j953k043j314j54J012J769
2700e05K256J349J03p83j847j990j587l39P05J853K079J450N72o66j514k139j707
2717b710o36N84J591J897J825Q02m95j392k136j719q20K58J469J957J814R38k96
2734B931j200j848k004j057J58J027J967J877J182K4j088j813j848j208k71R37
2750b234J675J942J503K59q15j658k032j380m45Q01J602J901J461O04n90j675
2766I19j909j519o01M39J512J915J627O95m04j331j921j628q61K81J244J918J666
$$ plain form
2652 3485 2477 617 -1545 -3159 -3512 -2688 -837 1358 2995 3458 2709 1044 -1049 -2784 -3456 -2964
2668 -2964 -1232 915 2593 3375 3030 1505 -620 -2467 -3337 -3112 -1747 445 2361 3409 2961 1793
2684 1793 -127 -2091 -3232 -3218 -1964 -82 2026 3089 3249 2178 225 -1818 -3132 -3286 -2274 -505
2700 -505 1751 3100 3203 2420 573 -1417 -3004 -3343 -2638 -785 1294 2744 3316 2650 1136 -1003 -2710
2717 -2710 -3346 -2762 -1171 726 2551 3353 2858 1466 -670 -2389 -3209 -2951 -1482 475 2289 3227 2931
2734 2931 1731 -117 -2121 -3178 -3020 -1993 -26 1851 3033 3057 1969 156 -1692 -2900 -3171 -2234
2750 -2234 -559 1383 2886 3145 2330 672 -1360 -2740 -3185 -2384 -782 1119 2580 3184 2594 919
2766 919 -990 -2509 -3110 -2671 -1159 756 2383 3078 2674 1343 -578 -2206 -3067 -2786 -1542 376 2042
2783B042R66k21j130j826j828j003N9J167J741J816J047J67j101j775j642j202
2799b723k73Q38J662J972J177K85p83j601j781j414l08P08J428J875J400N35m69
2816B528j500j910j435o22M17J380J844J539P56m57j203j945j501q24K51J263
2832a419J748J563R19o3j175j837j571j058P0J063J797J786Q97J80j039j589j846
2849a574j134j17Q30J623J768J193O3n74j511j771j285l90O86J546J811J216M62
2866B842n30j411j819j359n66M37J403J727J358O78k78j276j750j529p43K63J268
2883a285J748J374Q44p2j122j539j771q21Q9R87J512J671J020j8q00j672j635
2900a490j082p4P68J564J664J127K43p29j447j737j215l13O95J255J776J269L48
$$ plain form
2783 2042 3008 2787 1657 -169 -1997 -3000 -2941 -1774 -33 1783 2830 2997 1896 121 -1521 -2723
2799 -2723 -2996 -2158 -496 1476 2653 2938 2155 554 -1227 -2641 -2949 -2241 -813 1062 2462 2997 2528
2816 2528 1028 -882 -2317 -2939 -2522 -1142 702 2241 2997 2540 1337 -608 -2109 -2933 -2682 -1419
2832 -1419 329 1892 2811 2748 1573 -264 -1835 -2893 -2823 -1760 37 1823 2720 2900 1861 272 -1574
2849 -1574 -2708 -2825 -1995 -372 1396 2589 2652 2078 567 -1204 -2489 -2879 -2193 -647 1164 2380 2842
2866 2842 2312 901 -918 -2277 -2843 -2406 -1003 724 2082 2760 2482 1206 -544 -2073 -2816 -2553 -1285
2883 -1285 463 1837 2681 2609 1487 -52 -1823 -2644 -2555 -1568 -56 1615 2635 2617 1817 145 -1490
2900 -1490 -2572 -2646 -1878 -314 1350 2477 2720 1991 544 -1193 -2408 -2721 -2026 -771 1005 2274 2622
2917B622n48j318j614j158o65M44J302J711J328M73k41j233j549j366q88L82J036
2934a282J595J485P61m9j092j545j554q92R1Q73J591J560Q70R5q69j376j718q95
2952b351k62Q84J471J490J035L24p50j379j610j090l01N26J476J459J287L75n28
2969B056j291j568j171o07L72J353J478J352N56l52j056j652j262o51K27J117
2985a099J503J320P38n1j202j311j496q01R1Q60J475J437Q78N1r04j366j415j069
3003b361MP30J230J570R86K08o37j351j450j094l06O28J183J515J092M51l99j302
3021F97j344j231m65L32J125J460J269N50k96r96j553j145p69K42R40J462J415
3038A693O07k17q69j407j241p56j9Q14J261J474Q96k4o77j335j394r23j46O71
$$ plain form
2917 2622 2074 756 -858 -2016 -2681 -2237 -935 776 2104 2577 2336 1103 -446 -1812 -2700 -2318 -1282
2934 -1282 313 1798 2559 2510 1418 -127 -1681 -2573 -2482 -1609 -18 1542 2412 2507 1638 262 -1456 -2351
2952 -2351 -2613 -1729 -258 1232 2267 2591 1841 462 -1148 -2238 -2539 -2013 -537 922 2209 2584 2056
2969 2056 765 -803 -1974 -2581 -2209 -856 622 1974 2530 2178 1122 -530 -1792 -2443 -2216 -1099
2985 -1099 404 1724 2462 2411 1209 -102 -1598 -2399 -2308 -1448 27 1464 2342 2393 1489 123 -1292 -2361
3003 -2361 -2357 -1627 -397 1173 2159 2367 1730 379 -1071 -2165 -2471 -1843 -660 855 1947 2398 1999 697
3021 697 -647 -1878 -2343 -2011 -886 574 1843 2393 2097 1101 -452 -1597 -2366 -2124 -1184 278 1693
3038 1693 2300 2083 1214 -193 -1434 -2190 -2209 -1395 -134 1340 2236 2212 1535 200 -1194 -2117 -2263 -1592
3056a592J278J480Q54K48n24j314j326j034m51O34J053J500R96N02n03j000j492
3073f91j143m51M57R18J397J270N20l06j020j286j137q00J74R59J321J443M77
3090B102l2p85j323j379p41o2R21J240J250R59j3o69j237j347p70j77N13J071
3108d79J443R48L57o53j144j345r87j81M13J036J310J051M00m54r68j304j079
3125a636m74L40J057J258R88O26k90r38j185j094n91p5R60J151J220O70R3r27
3143A153j287j037q64N3P78J175J189Q57L2p85j022j311o69k68N18J105J345Q97
3161A859P2m37j039j168j052j93M42Q33J384J025K95k35j159j225j018l68K72
3178a712R38J191J015N46k14q78j196j077m93J04Q77J150J066O10j45p64j054
$$ plain form
3056 -1592 -314 1166 2020 2268 1744 430 -896 -1930 -2381 -1747 -694 806 1802 2304 1801 801 -691
3073 -691 -1834 -2285 -1828 -910 487 1757 2277 1971 951 -335 -1472 -2272 -2098 -1139 182 1625 2102
3090 2102 2070 1285 -38 -1417 -2158 -2220 -1299 -59 1191 2150 2137 1468 231 -1116 -1886 -2063 -1550 -479
3108 -479 964 1912 2269 1616 472 -873 -1860 -2041 -1628 -592 718 1769 2169 1715 747 -557 -1636
3125 -1636 -2110 -1770 -713 545 1533 2159 1869 931 -254 -1348 -1939 -2014 -1054 97 1317 1987 2080 1153
3143 1153 -134 -1171 -2035 -1982 -1204 -29 1160 2017 2049 1264 242 -1069 -1738 -2006 -1488 -383 962 1859
3161 1859 1931 1494 455 -713 -1765 -1958 -1516 -683 701 1726 2021 1786 627 -598 -1616 -1984 -1712
3178 -1712 -774 417 1432 1978 1764 886 -310 -1387 -1880 -1776 -899 251 1317 1927 1782 1018 -36
3195c6j261n47j7O75J148J053O88Q6n02j132j175o98j41N27J120J064P53K75n51
3214A329r30j115q52l87M81J103R54Q85M24l77r26j089q82m60L72P05J291P46
3232A272N29j67p83j047j098n70K53O84J134R68N20m0o22j142r62p46K19N48R96
3251e4J060O58J55p07q84j117o09j96M01J033J100O95K72n16r68j057q05j69L40
3270a368Q17J121R35K20l06q77j118q06k29J36Q36J081Q15M29j90q13r76r19l88
3289a600Q0O94J111O86N91lo85r67r16n86j3N52J081R01N91k3m92q23j012n78
3309a411k83N63Q78R46P56O1k90r53r17p16j76K99Q26R85O50L87k82p34j075p09
3329a195m49K51Q93Q94Q46L42k20n59j123p08m57J31N13J015P75N25l8p20p42
$$ plain form
3195 -36 -1297 -1844 -1861 -1186 -38 1015 1703 1789 1287 155 -1020 -1718 -1859 -1332 -212 852 1605 1880 1329
3214 1329 399 -716 -1568 -1955 -1474 -371 583 1468 1892 1515 589 -500 -1382 -1842 -1470 -765 526 1272
3232 1272 1801 1634 851 -196 -1294 -1864 -1611 -927 207 1175 1695 1655 1033 -109 -1071 -1817 -1598 -1050 -54
3251 -54 1006 1664 1819 1112 228 -889 -1498 -1694 -1293 -260 840 1535 1807 1291 323 -734 -1539 -1708 -1368
3270 -1368 -551 570 1505 1725 1419 542 -576 -1382 -1611 -1475 -639 442 1257 1686 1496 683 -293 -1212 -1600
3289 -1600 -1520 -826 285 971 1562 1559 874 -93 -1009 -1595 -1608 -1056 25 926 1517 1494 1002 179 -833 -1411
3309 -1411 -1694 -1131 -253 693 1449 1510 1220 267 -650 -1366 -1542 -1243 -417 568 1218 1605 1323 589 -486 -1195
3329 -1195 -1644 -1393 -500 394 1240 1582 1362 803 -320 -1028 -1485 -1354 -841 174 949 1474 1436 716 -26
3348b6r59m68m9N95Q53R82N30n7m26r54p74n45j00M92Q05R71M95P3k57q68q84
3369e71p20j49L27O95Q84P64L52l96q05q76o37l20L36N61P83R79K16o0o40j018
3389b95p03m50K97N14Q68P82M46q8n68r33o90n84R3M86P74P95N27J27m94q37q36
3410g69m67q1M01Q28Q44M93J19m27o85q85o52j60N01N91Q29N66K18k00o08q68
3430d12o77k01L00N96P51O85K62j38n71q26p63k81J71M45P47Q06M39j79m13q59
3450a18p28l84Q5L58P19Q91L80O4m88o85q92m24N0K75P96P41N17M1m18n77p14
3471e11o17q5K21P33P38N32K60k07o13p23o17m02L08N50P70N50L83l14n02o30
3491a76o40k82J10L88Q26O26L87j39n15o31p63k81lN48O72O05K74J07m29o77o36
$$ plain form
3348 -26 -985 -1453 -1502 -907 -54 928 1458 1401 975 21 -753 -1298 -1398 -906 -101 870 1365 1438 1181 313 -571
3369 -571 -1291 -1440 -1113 -418 466 1230 1582 1186 381 -495 -1132 -1452 -1116 -555 228 1207 1423 1363 723 -295
3389 -295 -998 -1448 -1151 -637 231 1013 1459 1371 803 -130 -820 -1404 -1311 -825 -51 744 1271 1398 904 67 -769
3410 -769 -1236 -1317 -916 -88 756 1249 1368 941 256 -629 -1281 -1441 -940 -349 480 1046 1264 1064 456 -412
3430 -412 -1089 -1290 -990 -394 357 1042 1304 1166 595 -231 -994 -1275 -1104 -659 88 894 1333 1154 741 -118
3450 -118 -846 -1230 -1145 -787 -68 823 1203 1267 779 94 -798 -1222 -1172 -897 -101 640 1157 1198 780 203 -511
3471 -511 -1128 -1213 -992 -259 479 1011 1271 1064 451 -272 -889 -1291 -983 -433 337 887 1270 956 454 -176
3491 -176 -816 -1098 -988 -600 226 852 1239 1100 585 -46 -809 -1090 -1093 -545 127 732 1006 1113 684 7 -629
3512f29l92o4K98O54O77N08J5k90n80o01n90p8K53O23O26N24K13j87o03q53m87
3533i63k30K60O51O47N73J82k02m33p24n37l87K56M54O34O70J83r6m37o33o38
3553g70k22KM31O43O21K80p3k74n71o65m14k1M07O50N73K67R4k75n22o69l30j42
3575i80L39L91O68N01K14l57n54m51o95p9J72N73O32M40J93k56m65o09m48j98
3595i69K47L35M32N86L60j06n48m75n64l23k8N95N63M84L22Ol29n51n77l28q4
3616i52N85L22M98M88r3k59n51m94l83j12L48N68M53M15J15l65l74n93l13k62
3636i59L12M86L94N95kj27k92o42l72k31J41L83N11M47J65J2n70m26m07l12N2
3657h42N11M13M44L18k2m10m65n05k40N7L08M64N20K24k4j83o08l80n49J35L32
$$ plain form
3512 -629 -1021 -1085 -787 -133 544 1052 1067 777 197 -404 -994 -1072 -819 -196 430 954 1167 980 377 -476 -963
3533 -963 -1193 -933 -282 365 938 1120 918 485 -239 -776 -1163 -907 -453 181 851 1034 938 501 -132 -770
3553 -770 -992 -990 -559 84 705 985 912 638 67 -598 -1012 -1033 -626 24 597 864 958 683 161 -508 -838 -980
3575 -980 -641 -250 418 919 1133 776 222 -229 -924 -1003 -831 -258 374 814 1007 751 286 -323 -771 -969
3595 -969 -722 -387 45 631 991 885 337 -138 -702 -1025 -1053 -458 105 589 911 917 588 37 -540 -868 -952
3616 -952 -367 -45 453 941 848 589 38 -456 -839 -951 -603 -35 418 833 948 583 209 -384 -697 -959
3636 -959 -647 -161 233 828 826 699 407 -235 -607 -838 -697 -314 197 644 809 821 251 -175 -582 -894 -842
3657 -842 -331 82 526 844 822 412 -53 -558 -798 -741 -433 31 551 775 751 568 -40 -420 -969 -834 -502
3678e02L46N18M40L3k40l91n86m14o2K92M32M03L52K72k30m39n32l43j68K38K21
3699c60O37L91O4o3l09o35k96j25M0K80N83L42J98o6k50m85m11l43J59J98N20
3720F9M58K86K4l68n64l18k29n0L06M22K80M89j06k54l84n30k39J4J95M22M82
3741D05K71N9j83m29m08k99k14K49L89M20J83J89m0l18m88l84j0P1L90L22L40
3762E15J94j22l71l26m51j35K45N6N50L92Q3j5k33m72m07j07O2J96L61L74K13
3783F02J21k03n02l74j66j32K21L79L56L23M2k00l64n29j47q2K54L46K74L87J8
3804F24r3m14m57l03r7K86L86K61L65P5j35k32m72l11j23O4L37L93L81OO5l11
3826B95l58l68j44k0L39L97K60J45K5k51m55l47j25R0K36K64L90J60O4k72k70
$$ plain form
3678 -502 -156 362 802 835 595 204 -382 -796 -858 -566 -134 269 621 893 663 224 -308 -651 -819 -581 -360
3699 -360 277 668 732 669 360 -275 -571 -696 -656 -376 207 549 747 681 431 -54 -465 -808 -649 -451 69
3720 69 527 813 837 469 -95 -413 -642 -692 -386 36 316 805 699 445 61 -469 -708 -694 -499 -77 405
3741 405 676 735 552 123 -285 -584 -798 -549 -160 260 443 632 592 274 -214 -598 -608 -537 -147 175 515
3762 515 709 587 216 -110 -561 -696 -451 -395 155 547 630 615 382 -90 -497 -604 -542 -346 15 389 602
3783 602 723 520 18 -356 -522 -654 -433 -54 302 625 667 467 103 -426 -573 -655 -401 -55 219 606 624
3804 624 531 117 -340 -643 -740 -454 -68 193 558 633 498 266 -206 -517 -640 -576 -239 154 535 541 606 295
3826 295 -63 -431 -575 -595 -256 141 401 546 571 320 -135 -482 -607 -517 -281 -17 373 533 597 325 55
3847E5n08k51K5L00L15L87K22J40j62m87k47l90MK17L86K64K47K20k10m31l63
3868b67l51k4J44K85M62K50J17m1l44m28k08j96J15K02M12K49K00K1k96m75l32
3889e05p5N6J69N01L39N4k0k70m01k38k33N3J63M19K04M25m6j82m32m12j07j52
3911f90L43M24J84L16J12k65l95k72k19k02J80N20K54K45L5q3k61m17k78j89Q7
3932e71L37M74J61J25p5k10l86l02j79J45J58L99M13Q2j8l38k45l22j21N4J09
3953c10M79J91K69q6k58l11k67k89L2K36L95K08K78j8k02l60k80k72R9R7L89K47
3975B67K86J9j08l96k97k96o9J08M14L85J25J42k03k66l69j28j19M9L82K26L12
3996D64M7j06k26k25m43j16R0K78L52K54K78n7m06k93k48j51K5J36M21L09J83
$$ plain form
3847 55 -453 -704 -679 -379 -64 323 545 685 523 36 -211 -601 -597 -380 6 270 517 737 527 96 -267
3868 -267 -618 -642 -498 -213 249 499 616 575 231 -197 -405 -601 -486 -284 128 377 577 598 302 -173 -505
3889 -505 -580 -524 -355 146 485 539 519 249 -152 -390 -623 -570 -407 12 216 641 595 413 -19 -431 -538 -690
3911 -690 -347 77 261 577 689 424 29 -243 -462 -664 -484 36 290 535 570 487 226 -191 -469 -658 -571
3932 -571 -234 240 401 526 451 241 -145 -447 -626 -481 -323 76 489 571 553 215 -30 -352 -473 -419 -310
3953 -310 169 360 629 543 285 -26 -293 -582 -550 -314 81 289 567 549 347 -13 -293 -565 -466 -369 20 267
3975 267 553 572 464 68 -229 -525 -594 -486 -72 313 438 580 377 111 -258 -386 -505 -456 -74 152 464
3996 464 511 405 179 -46 -489 -605 -515 -237 115 369 647 590 184 -109 -357 -508 -483 -347 74 383 566
4017E66r5k52k11k43l38Q4J77L47L35J72nj08l13l98k53n1J95K89M62K16m9k07
4039C20k66l14j81j16R8L16K77L10R6k28j11k41l26j74Q1K88K96L62%Jm03k38
4061a53k73j24L5L10L10L13J40j37j48k91l52j62M7J58L63L02J85J0l14k60k55
4082b96j97j6J14L59L41J86J24k42l59l41j71o3K03K70M15J83J5j02k85l73l24
4103e59K4J59K29L40K07M2K7l56k68l34r6K00K79K44K75J00j25k40l01k84j98
4124f35K34J81L59K79Q9m8l16j33l93j94Q5K23J83L85K41j42j94j70l77l22J31
4145e34K41K36M38J58j09k59j68k70k66KJ08M24J70K87J68k18k83l79j97o9K36
4166b84J34L89J32J66j46k50k50k92p2N1L16J96L23J28j32k34l51k00j74O5K16
$$ plain form
4017 566 471 219 8 -235 -573 -489 -312 35 370 542 537 429 116 -282 -535 -586 -391 -102 360 576 527 320
4039 320 54 -260 -441 -557 -459 -143 134 444 540 312 201 -40 -366 -540 -459 -171 125 487 487 488 85 -153
4061 -153 -426 -550 -515 -205 105 418 558 421 273 -18 -370 -532 -485 -327 36 338 523 533 219 -41 -296
4082 -296 -493 -509 -395 -36 305 491 615 373 14 -327 -498 -561 -358 -88 327 510 525 423 138 -235 -559
4103 -559 -535 -376 -147 193 400 442 469 113 -155 -489 -585 -385 -106 138 413 513 388 148 -153 -437 -635
4124 -635 -401 -220 139 418 507 459 143 10 -383 -577 -492 -269 -86 299 540 398 204 34 -343 -665 -534
4145 -534 -293 -57 381 539 430 171 3 -267 -533 -531 -423 1 171 458 626 408 125 -254 -451 -520 -284
4166 -284 -150 239 371 537 391 141 -109 -401 -473 -422 -106 90 413 541 409 175 -176 -376 -550 -485 -269
4187b69L20K72J23Nk14l11l79p8j2K95L58J79J75J30k59k81l98k01J87J5L38K76
4209B71K84p2j25l19k09j52k24J97L38K02L29J5k39k99k96j38j34P9L51L78J21
4230C58K52k73j98k80k13j71P9K85K24L13L18j73l14l02l57j06K3K39M21J98K54
4251E77k8l85k06l80q2J1J91L53K57K36N4l06k39l87j87q0L18K60K49K38N0k42
4273B72k18l34k31k6J96J28L71L10J52k52k28l52l06l5K17J66L50K71J43o1m24
4294A09l37j56j88Q3L37K90K65J44p4l50o7m59j55P2K54L39L42KQ6l39l26l25
4316d53j69P4J53M48L00K28l7j00m47k96k05n3J00L96L80K84K4j80l59l58k75
4337e45l3J14M27K99K15Q3j83j90l53l46j53K51K65L42L40P9n9l57k97l48j47
$$ plain form
4187 -269 51 323 446 451 237 -74 -453 -531 -543 -248 110 289 464 594 335 54 -344 -545 -358 -343 -5 271
4209 271 555 483 358 39 -170 -322 -546 -349 -11 191 520 535 296 -3 -299 -437 -571 -492 -141 237 358
4230 358 610 337 139 -141 -354 -525 -446 -161 63 376 694 521 207 -95 -452 -558 -535 -296 125 323 577
4251 577 549 164 -42 -422 -504 -493 -302 51 308 544 598 292 53 -334 -521 -601 -283 -23 226 464 514 272
4273 272 54 -280 -511 -537 -341 -213 158 468 620 368 140 -212 -518 -553 -336 -170 180 451 594 533 109
4294 109 -228 -384 -572 -489 -152 138 403 547 473 123 56 -403 -558 -486 -232 107 449 451 537 198 -128 -453
4316 -453 -622 -548 -395 53 353 581 544 444 -3 -299 -504 -557 -457 -61 319 603 627 447 88 -270 -545
4337 -545 -578 -464 -37 262 477 560 377 187 -166 -512 -665 -414 -149 193 533 612 553 196 -101 -449 -596
4358e96J00K09L74L82J02J6k85l94k93j07j36L50L39L04Q5J00l03k90j65l17J1
4379e14J77L28L60K55q5n5m01l32l53nJ99M67K10K48O8q8l19l92k87k47K94L17
4401a55M18K07Q7j65k11m13k41j59J02L68L02L07K22k11k05l72l55j09O9K48M23
4422A57L39J94j11k36m66k40k40L7R7L59N28J04R6k13m73k96k49m2L10K49L76
4443B80J83J61j99k78m26k63p3J52K84M59K02O3ql48k96l93j09K5L70L87L29J00
4465F02j00k79l00l82j30J8L32L63L29K36l4l66l15k94k64M5J67M37L56J65L5
4486F21k72k96l78k18o5J94M25K50L12J3k26l02k64l67p6J13L70L61L80N5r2m26
4508A12l88k37j17J64L83K62K75J03j10j64m61l17j09J8L33M05L11J51J8k94l51
$$ plain form
4358 -596 -496 -287 87 469 571 587 302 -92 -385 -492 -628 -278 61 365 450 550 247 -43 -208 -525 -514
4379 -514 -337 -9 351 606 521 466 65 -267 -620 -625 -426 41 251 499 567 479 160 -232 -519 -766 -472 -155
4401 -155 263 470 557 392 181 -232 -473 -632 -530 -162 140 447 669 458 253 -119 -474 -583 -514 -266 157
4422 157 496 690 579 343 -123 -363 -603 -566 -469 -110 418 522 618 405 -68 -364 -613 -655 -345 -96 280
4443 280 463 624 425 147 -279 -542 -615 -463 -179 280 482 545 537 189 -107 -500 -609 -584 -214 173 502 602
4465 602 502 223 -77 -459 -589 -571 -239 124 453 689 655 289 -26 -320 -584 -539 -372 65 421 586 621
4486 621 349 53 -325 -543 -608 -414 11 261 573 586 360 58 -206 -573 -649 -536 -166 195 575 630 538 112
4508 112 -276 -513 -630 -466 -83 179 454 557 447 283 -178 -495 -604 -586 -253 152 463 614 632 338 -13
4529a3m45j23J05K64J94M15J56J25l90l20k71l00O9J3N60K49L52K4k05m06k69
4550b16l17m6J33K68L52L27J38j67l67k84l13j84J48K16M94L08Q9l5l64l87l50
4571e57rJL09L92K97J74Ml40l50l73k63J03K91L90L59J52J9k22l00m95k25J23
4593e20J85L19M39J90mk31l51l75k35l8K15L03L85K91O4j72m04k89l90K7k1M05
4615b07L82L42N7o2l23m42k72j16P1K25N21K11K79j12l90l18j78l07j2L65L08
4636B2L62J70j3j49m09k43l80J6K68L52L22L59j15j77l35l62k32j00J83L14M15
4657B68K22J00j13l97l67j78j89J76L28L83K91M5J4m22l05k07l66J58K81M23K78
4678D23K27m0l09l12l79j79N7J51M79L66J47Kl09m41k65k07j5K36L12N13N5L3
$$ plain form
4529 -13 -458 -581 -476 -212 -18 397 553 678 288 -32 -303 -603 -534 -521 39 288 640 664 459 53 -216
4550 -216 -533 -579 -446 -178 174 501 639 472 105 -179 -492 -676 -528 -312 182 490 579 544 180 -207 -557
4571 -557 -566 -565 -256 136 433 607 611 271 -79 -452 -715 -612 -321 69 428 580 599 377 77 -418 -643 -520
4593 -520 -335 -16 423 613 609 378 27 -348 -583 -621 -406 -103 282 573 637 465 61 -228 -618 -591 -612 -207
4615 -207 175 517 574 512 189 -253 -525 -641 -570 -345 176 387 666 554 164 -154 -332 -639 -651 -286 22
4636 22 384 554 541 392 -17 -260 -640 -624 -356 -4 318 677 562 385 50 -312 -544 -644 -461 -147 268
4657 268 490 590 477 80 -287 -465 -654 -478 -150 233 524 569 583 161 -144 -351 -717 -559 -278 145 423
4678 423 650 610 301 -11 -390 -569 -512 -361 118 484 631 633 324 -117 -382 -589 -604 -368 -56 457 512 545
4700E45On02l55k68j11L78K60K59M08N2r6n02l47k82l0O3L74L24L76J43k03k78
4722B14k93m15k5JL80L17K18L11j66l03l45m26j05P6K70M04L38J91m2k16l61m20
4744c97j92J8J91L86K66K11Q6j97l64l04l00PJ30M54L73K60l4k01k10m53k66r1
$$ plain form
4700 545 551 49 -306 -574 -685 -307 -47 212 620 672 576 74 -273 -555 -585 -522 -148 176 552 695 492 214
4722 214 -79 -494 -519 -518 -138 179 397 708 542 239 -106 -532 -637 -561 -291 113 451 642 600 384 23 -397
4744 -397 -589 -571 -380 6 272 483 569 372 8 -296 -596 -589 -459 -5 368 628 594 393 183 -270 -536 -627
$$ [...]
8191a64
##END NTUPLES=NMR FID
##END=
