##TITLE=1H_Pr 5188
 CDCl3
 8 sc, 
 10.4.2023
##JCAMPDX= 6.0         $$ Bruker NMR JCAMP-DX V2.0
##DATA TYPE= NMR FID
##DATA CLASS= NTUPLES
##ORIGIN= UXNMR, Bruker Analytische Messtechnik GmbH
##OWNER= root
$$ XWIN-NMR		Version 3.5
$$ Mon Apr 10 14:22:23 2023 Russian Standard Time (UT+4h)  she@DPX200
##.OBSERVE FREQUENCY= 200.13135
##.OBSERVE NUCLEUS= ^1H
##.DELAY= (6, 6)
##.ACQUISITION MODE= SIMULTANEOUS
##.ACQUISITION SCHEME= undefined
##.AVERAGES= 8
##.DIGITISER RES= 18
##SPECTROMETER/DATA SYSTEM= spect
##.PULSE SEQUENCE= zg30
##.SOLVENT NAME= CDCl3
##.SHIFT REFERENCE= (INTERNAL, CDCl3, 0, 15.7039)
##AUDIT TRAIL= $$ (NUMBER, WHEN, WHO, WHERE, WHAT)
$$ ##TITLE= Audit trail, XWIN-NMR		Version 3.5
$$ ##JCAMPDX= 5.01
$$ ##ORIGIN= Bruker BioSpin GmbH
$$ ##OWNER= she
$$ F:/spectra/data/she/nmr/H-F/1/audita.txt
$$ ##AUDIT TRAIL=  $$ (NUMBER, WHEN, WHO, WHERE, WHAT)
(   1,<2023-04-10 14:21:11.65 +0400>,<she>,<DPX200>,
      <created by zg, POWCHK disabled, PULCHK disabled
       configuration hash MD5:
       00 E9 B6 7A A2 85 ED C7 34 08 36 98 17 FE 4E 26
       data hash MD5: 16K
       D9 23 A2 FD E4 EA 9F 5F 4E 50 81 70 3D FF 12 DA>)
$$ ##END=
$$ 
$$ hash MD5
$$ 7D 03 03 B7 52 66 7A 92 FC C5 E1 C8 DF FB F6 7E
##$RELAX= 
##$RELAX= 
##$RELAX= 
##$RELAX= 
##$RELAX= 
##$RELAX= 
$$ Bruker specific parameters
$$ --------------------------
##$DU= <F:/spectra>
##$EXPNO= 1
##$NAME= <H-F>
##$PROCNO= 1
##$TYPE= <nmr>
##$USER= <she>
##$AMP= (0..31)
100 100 100 100 100 100 100 100 100 100 100 100 100 100 100 100 100 100 
100 100 100 100 100 100 100 100 100 100 100 100 100 100 
##$AQSEQ= 0
##$AQ_mod= 1
##$AUNM= <au_zg>
##$AUTOPOS= <>
##$BF1= 200.13
##$BF2= 200.13
##$BF3= 200.13
##$BF4= 200.13
##$BF5= 200.13
##$BF6= 200.13
##$BF7= 200.13
##$BF8= 200.13
##$BYTORDA= 1
##$CFDGTYP= 0
##$CFRGTYP= 5
##$CHEMSTR= <none>
##$CNST= (0..31)
1 1 145 1 1 1 1 1 1 1 1 1 1 1 1 1 1 1 1 1 1 1 1 1 1 1 1 1 1 1 1 1 
##$CPDPRG= <>
##$CPDPRG1= <>
##$CPDPRG2= <>
##$CPDPRG3= <>
##$CPDPRG4= <mlev>
##$CPDPRG5= <mlev>
##$CPDPRG6= <mlev>
##$CPDPRG7= <mlev>
##$CPDPRG8= <mlev>
##$CPDPRGB= <>
##$CPDPRGT= <>
##$D= (0..31)
0 1.2 0 0 0 0 0 0 0 0.06 0 0.03 0 0 0 0 0.0002 0 0 0 0 0 0 0 0 0 0 0 0 
0 0 0 
##$DATE= 1681122071
##$DBL= (0..7)
120 120 120 120 120 120 120 120 
##$DBP= (0..7)
150 150 150 150 150 150 150 150 
##$DBP07= 0
##$DBPNAM0= <>
##$DBPNAM1= <>
##$DBPNAM2= <>
##$DBPNAM3= <>
##$DBPNAM4= <>
##$DBPNAM5= <>
##$DBPNAM6= <>
##$DBPNAM7= <>
##$DBPOAL= (0..7)
0.5 0.5 0.5 0.5 0.5 0.5 0.5 0.5 
##$DBPOFFS= (0..7)
0 0 0 0 0 0 0 0 
##$DE= 6
##$DECBNUC= <off>
##$DECIM= 32
##$DECNUC= <off>
##$DECSTAT= 4
##$DIGMOD= 1
##$DIGTYP= 9
##$DL= (0..7)
0 120 120 120 120 120 120 120 
##$DP= (0..7)
150 150 150 150 150 150 150 150 
##$DP07= 0
##$DPNAME0= <>
##$DPNAME1= <>
##$DPNAME2= <>
##$DPNAME3= <>
##$DPNAME4= <>
##$DPNAME5= <>
##$DPNAME6= <>
##$DPNAME7= <>
##$DPOAL= (0..7)
0.5 0.5 0.5 0.5 0.5 0.5 0.5 0.5 
##$DPOFFS= (0..7)
0 0 0 0 0 0 0 0 
##$DQDMODE= 0
##$DR= 18
##$DS= 0
##$DSLIST= <SSSSSSSSSSSSSSS>
$$ [...]
##$SUBNAM2= <"">
##$SUBNAM3= <"">
##$SUBNAM4= <"">
##$SUBNAM5= <"">
##$SUBNAM6= <"">
##$SUBNAM7= <"">
##$SUBNAM8= <"">
##$SUBNAM9= <"">
##$SW= 18.05172834244
##$SWIBOX= (0..15)
0 0 2 0 0 0 0 0 0 0 0 0 0 0 0 0 
##$SW_h= 3612.71676300578
##$TD= 16384
##$TD0= 1
##$TE= 0
##$TE2= 300
##$TE3= 300
##$TEG= 300
##$TL= (0..7)
0 120 120 120 120 120 120 120 
##$TP= (0..7)
150 150 150 150 150 150 150 150 
##$TP07= 0
##$TPNAME0= <>
##$TPNAME1= <>
##$TPNAME2= <>
##$TPNAME3= <>
##$TPNAME4= <>
##$TPNAME5= <>
##$TPNAME6= <>
##$TPNAME7= <>
##$TPOAL= (0..7)
0.5 0.5 0.5 0.5 0.5 0.5 0.5 0.5 
##$TPOFFS= (0..7)
0 0 0 0 0 0 0 0 
##$TUNHIN= 0
##$TUNHOUT= 0
##$TUNXOUT= 0
##$USERA1= <user>
##$USERA2= <user>
##$USERA3= <user>
##$USERA4= <user>
##$USERA5= <user>
##$V9= 5
##$VALIST= <valist>
##$VCLIST= <CCCCCCCCCCCCCCC>
##$VD= 0
##$VDLIST= <DDDDDDDDDDDDDDD>
##$VPLIST= <PPPPPPPPPPPPPPP>
##$VTLIST= <TTTTTTTTTTTTTTT>
##$WBST= 1024
##$WBSW= 4
##$XGAIN= (0..3)
0 0 0 0 
##$XL= 0
##$YL= 0
##$YMAX_a= 139983
##$YMIN_a= -94966
##$ZGOPTNS= <>
##$ZL1= 120
##$ZL2= 120
##$ZL3= 120
##$ZL4= 120
##$ABSF1= 10
##$ABSF2= 0
##$ABSG= 5
##$ABSL= 3
##$ALPHA= 0
##$AQORDER= 0
##$ASSFAC= 0
##$ASSFACI= 0
##$ASSFACX= 0
##$ASSWID= 0
##$AUNMP= <proc_1d>
##$AZFE= 0.1
##$AZFW= 0.1
##$BCFW= 1
##$BC_mod= 2
##$BYTORDP= 1
##$COROFFS= 0
##$CY= 11.3945322036743
##$DATMOD= 1
##$DC= 2
##$DFILT= <>
##$DTYPP= 0
##$F1P= 2.36226072786647
##$F2P= -0.459571619588291
##$FCOR= 0.5
##$FTSIZE= 0
##$FT_mod= 4
##$GAMMA= 1
##$GB= 0.15
##$INTBC= 1
##$INTSCL= 1
##$ISEN= 128
##$LB= 0.24
##$LEV0= 0
##$LPBIN= 0
##$MAXI= 10000
##$MC2= 0
##$MEAN= 0
##$ME_mod= 0
##$MI= 1.114404
##$NCOEF= 0
##$NC_proc= 0
##$NLEV= 6
##$NOISF1= 3.799351
##$NOISF2= 2.8
##$NSP= 1
##$NTH_PI= 0
##$NZP= 0
##$OFFSET= 15.70392
##$PC= 1
##$PHC0= -19470.12
##$PHC1= 9.6008
##$PH_mod= 1
##$PKNL= yes
##$PPARMOD= 0
##$PSCAL= 0
##$PSIGN= 0
##$REVERSE= no
##$SF= 200.130013532006
##$SI= 16384
##$SIGF1= 3
##$SIGF2= 2
##$SINO= 400
##$SIOLD= 16384
##$SREGLST= <1H.CDCl3>
##$SSB= 0
##$STSI= 0
##$STSR= 0
##$SW_p= 3612.71676300578
##$SYMM= 0
##$S_DEV= 0
##$TDeff= 0
##$TDoff= 0
##$TI= <>
##$TILT= no
##$TM1= 0
##$TM2= 0
##$TOPLEV= 0
##$USERP1= <user>
##$USERP2= <user>
##$USERP3= <user>
##$USERP4= <user>
##$USERP5= <user>
##$WDW= 1
##$XDIM= 8192
##$YMAX_p= 0
##$YMIN_p= 0
$$ End of Bruker specific parameters
$$ ---------------------------------
##NTUPLES= NMR FID
##VAR_NAME=  TIME,          FID/REAL,        FID/IMAG
##SYMBOL=    X,             R,               I
##VAR_TYPE=  INDEPENDENT,   DEPENDENT,       DEPENDENT
##VAR_FORM=  AFFN,          ASDF,            ASDF
##VAR_DIM=   8192,          8192,            8192
##UNITS=     SECONDS,       ARBITRARY UNITS, ARBITRARY UNITS
##FACTOR=    0.0002768,     1,               1
##FIRST=     0,             0,               0
##LAST=      2.2672688,     0,               0
##MIN=       0,             -94966,          0
##MAX=       2.2672688,     139983,          0
$$ Real data points
##PAGE= N=1
##DATA TABLE= (X++(R..R)), XYDATA
$$ plain form
0 0 0 0 0 0 0 0 0 0 0 0 0 0 0 0 -8 8 -8 8 -8 9 -16 16 -17 24 -25 32 -40 41 -49 57 -65 73 -84 97 -107 121
36 121 -137 153 -171 190 -212 236 -262 290 -320 353 -390 431 -474 522 -576 635 -700 771 -852
55 -852 943 -1049 1169 -1307 1472 -1669 1914 -2222 2622 -3175 3986 -5297 7781 -14217 72502
70 72502 139983 90340 93025 63807 42843 27347 40209 38866 36840 28255 21156 -3721 -32604
83 -32604 -64760 -84348 -94966 -91473 -84475 -65216 -40129 -18568 -13244 -10260 -5169 -4678 -11194 -6391
97 -6391 12561 32317 44285 58542 72403 72309 54410 33289 13358 -7211 -27051 -38021 -38443
110 -38443 -33170 -28840 -28251 -28738 -28037 -34685 -47738 -53107 -46351 -39414 -33369 -16825 6253 20610 25878
125 25878 32423 38604 38190 33700 32497 35256 37670 35029 30577 26821 21712 9975 -4294 -12225 -14055
$$ packed form
0@%%%%%%%%%%%%%%qJ6j6J6j6J7k5L2l3M1m9N7p2Q1r0J06j22J38j57J81k04K28
36A21k58K90l24L61m02M48m98N52o10O73p43Q21r05R96j098J211j335J471j623
55h52J795j992K218k476K779l141L583m136M844n797P161r283J3078k1998Q6719
70G2502O7481m9643K685k9218k0964j5496J2862j343k026q585p099k4877k8883
83c2604l2156j9588j0618L493O998J9259K5087K1561N324K984N091M91o516M803
97f391J8952J9756J1968J4257J3861r4j7899k1121j9931k0569j9840j0970m22
110c8443N273M330N89m87P01o648j3053n369O756O937O045J6544K3078J4357N268
125B5878O545O181m14m490j203K759K414k641m452l756n109j1737j4269p931j830
$$ plain form
140 -14055 -17156 -20121 -15787 -7569 -5713 -10484 -11394 -8374 -9405 -13471 -8697 3334 11816 15796 22109
155 22109 28385 26575 17872 9689 4967 1092 -2923 -5150 -1592 2445 -425 -9372 -15619 -20761 -31401
170 -31401 -41239 -40059 -30186 -22143 -14022 -1024 11315 13651 7796 3160 717 -4165 -7768 -3731
184 -3731 8153 19571 25711 30163 33372 29333 15888 1353 -7156 -12707 -17244 -17347 -9051 577
198 577 3825 2280 1721 -492 -8981 -17729 -18059 -12721 -7372 -1151 9191 18794 21413 17083 10744 5471
214 5471 -487 -7331 -9146 -2809 4977 8478 11512 15609 14168 4869 -5746 -11694 -15292 -19080 -18884
229 -18884 -12008 -1660 4076 6494 9316 11231 7617 622 -2942 -2360 -2456 -3548 -1786 3181 5103
244 5103 2978 293 843 -6 -4307 -7408 -5149 -3431 -5733 -8430 -6789 -5263 -7707 -9530 -6793 -1508
$$ packed form
140a4055l101k965M334Q218J856m771r10L020j031m066M774J2031Q482L980O313
155B2109O276j810q703q183m722l875m015k227L558M037k870q947o247n142j0640
170c1401r838J180R873Q043Q121J2998J2339K336n855m636k443m882l603M037
184c731J1884J1418O140M452L209m039j3445j4535q509n551m537j03Q296R628
198E77L248j545n59k213q489q748l30N338N349O221J0342R603K619m330o339n273
214E471n958o844j815O337P786L501L034M097j441r299j0615n948l598l788J96
229a8884O876J0348N736K418K822J915l614o995l564N82r6j092J762M967J922
244E103k125k685N50q49m301l101K259J718k302k697J641J526k444j823K737N285
$$ plain form
260 -1508 550 1680 5356 9951 9787 6314 5042 6823 6107 3321 3912 8061 8881 5181 2500 2486 -46
277 -46 -5573 -8870 -6263 -3205 -3340 -2237 1291 2770 -1445 -6976 -8939 -8821 -10045 -9167 -2109 7238
293 7238 13308 15397 17542 17800 11610 2057 -4812 -6365 -7337 -7669 -3071 5516 10469 9583 6831 3571
309 3571 -2672 -12367 -19180 -18939 -15488 -11501 -6224 1697 8141 7846 3388 370 -2333 -6553 -9184 -5258
325 -5258 2372 8317 11994 14808 16254 12450 3504 -4315 -7714 -9585 -10968 -7908 -262 6313 7868
340 7868 6562 5163 1050 -7001 -13666 -14581 -11914 -8615 -4362 3160 10410 12648 9692 7285 5803
355 5803 1699 -3145 -3481 534 3564 4273 5722 7952 7094 1700 -2921 -4029 -4546 -6659 -6618 -2392 1224
372 1224 487 -1561 -1580 -2344 -6110 -9052 -7393 -3341 -649 367 4442 8136 7862 4504 2728 3005 1670
$$ packed form
260a508K058J130L676M595j64l473j272J781p16k786N91M149Q20l700k681j4k532
277d6n527l297K607L058j35J103L528J479m215n531j963J18j224Q78P058R347
293G238O070K089K145K58o190r553o869j553r72l32M598Q587M953q86k752l260
309C571o243r695o813K41L451L987N277P921O444k95m458l018k703m220k631L926
325e258P630N945L677K814J446l804q946p819l399j871j383L060P646O575J555
340G868j306j399m113q051o665r15K667L299M253P522P250K238k956k407j482
355E803m104m844l36M015L030P09J449K230q58n394m621j108n17k113M1M226L616
372A224p37k048j9p64l766k942J659M052K692J016M075L694k74l358j776K77j335
$$ plain form
389 1670 -1120 291 4013 5409 3506 2329 2438 1105 -3188 -5343 -3824 -1484 -1461 -1568 714 1480
405 1480 -2168 -6757 -8417 -8783 -9954 -9264 -4144 2491 6433 7501 8567 8427 4091 -2297 -5987 -5668
421 -5668 -4364 -3192 1450 7844 11899 11283 8286 5638 1337 -5132 -9244 -8411 -5261 -2597 -26 4538
437 4538 6602 4295 -325 -3542 -5346 -7411 -7952 -4125 2439 7733 9099 10184 9821 6319 -620 -5340
453 -5340 -5889 -5154 -4197 -192 6475 10946 10831 7563 4540 -662 -7877 -14059 -14708 -11878 -9057 -6061
469 -6061 -11 4767 4961 1534 -1308 -3084 -6316 -9431 -8300 -3191 1217 3638 6151 9458 9217 5223
485 5223 1989 1354 969 -655 6 3350 5756 5019 2596 1923 214 -3964 -7726 -7799 -5348 -4517 -3629
502 -3629 -493 3184 3170 1307 655 1193 364 -1467 -538 2724 4920 5108 5874 7839 7991 5655 3605
$$ packed form
389A670k790J411L722J396j903j177J09j333m293k155J519K340K3j07K282P66
405A480l648m589j660l66j171O90N120O635L942J068J066j40m336o388l690L19
421e668J304J172M642O394M055o16k997k648m301o469m112Q33L150K664K571M564
437D538K064k307m620l217j804k065n41L827O564N294J366J085l63l502o939m720
453e340n49P35R57M005O667M471j15l268l023n202p215o182o49K830K821K996
469f061O050M778J94l427k842j776l232l115J131N109M408K421K513L307k41l994
485E223l234o35l85j624O61L344K406p37k423o73j709m178l762p3K451Q31Q88
502c629L136L677j4j863o52N38q29j831R29L262K196J88P66J965J52k336k050
$$ plain form
519 3605 3646 3790 1203 -991 -1125 -1116 -3793 -6626 -7377 -7064 -7670 -8378 -6699 -3606 -2733 -3547 -3516 -2599 -3289
538 -3289 -5138 -5275 -2612 -37 1423 3665 7205 8584 7169 5296 4691 3432 825 -1052 280 2117
554 2117 2419 1609 2007 2026 -880 -4262 -5593 -4820 -4460 -4225 -1193 3276 5174 4187 3538 3042 1335 -2182
572 -2182 -3290 -1613 851 2035 4156 7654 9319 6573 3031 598 -2110 -6350 -8799 -7725 -4844
587 -4844 -3070 -2181 187 2204 1018 -2036 -3207 -2991 -3126 -4161 -2528 1283 3192 3225 3293 3711 2941
604 2941 157 -1872 -586 61 -524 -302 1532 2337 480 -2163 -3013 -3615 -5356 -6565 -4896 -1888 -176
621 -176 573 2542 5088 4668 2858 2469 2749 3034 1699 1680 3753 4312 3527 2525 3489 3147 1423 -262
639 -262 138 75 -1551 -3269 -3773 -4077 -5454 -6980 -5979 -3843 -2480 -1964 271 2435 2941 1674 1011
$$ packed form
519C605M1J44k587k194j34Rk677k833p51L13o06p08J679L093Q73q14L1R17o90
538c289j849j37K663K575J460K242L540J379j415j873o05j259k607j877J332J837
554B117L02q10L98J9k906l382j331P73L60K35L032M469J898r87o49m96j707l517
572b182j108J677K464J184K121L498J665k746l542k433k708m240k449J074K881
587d844J774Q89K368K017j186l054j171K16j35j035J633L811J909L3O8M18p70
604B941k784k029J286O47n85K22J834Q05j857k643q50o02j741j209J669L008J712
621a76P49J969K546m20j810l89K80K85j335j9K073N59p85j002R64l42j724j685
639b62M00o3j626j718n04l04j377j526J001K136J363N16K235K164N06j267o63
$$ plain form
656 1011 1191 79 -1272 -1000 1595 3090 3411 3721 5050 4375 1772 -1132 -1570 -2097 -3604 -3968 -2098
673 -2098 317 -57 -964 -1352 -1233 -2773 -4880 -4169 -1560 371 1516 3756 6329 6234 4208 1874 574
690 574 -1084 -3334 -3360 -846 1906 2495 3511 4724 4278 543 -3212 -4707 -5590 -6792 -6519 -3564 -96
707 -96 1809 2334 3470 3571 1626 -882 -1436 -660 -17 524 2074 4863 5441 3736 2045 1025 -1064
724 -1064 -3518 -4521 -3088 -1490 -875 -668 988 1179 -1040 -3520 -4507 -4573 -4856 -4819 -2110 983 2919
741 2919 3801 4402 5036 3787 1551 355 676 1122 314 944 2775 3035 1950 415 469 -141 -2025 -3035
759 -3035 -2227 -1451 -1433 -1984 -1237 -713 -1479 -2840 -2293 -723 153 524 1723 4093 4343 3368 2397 2209 1152
778 1152 -812 -1598 -589 172 -4 -356 982 460 -1282 -2929 -3198 -2815 -3482 -3745 -2012 -260 -19 -559
$$ packed form
656A011J80j112j351K72K595J495L21L10J329o75k603k904m38n27j507l64J870
673b098K415l74r07l88J19j540k107P11K609J931J145K240K573r5k026k334j300
690E74j658k250k6K514K752N89J016J213m46l735l755j495q83j202K73K955L468
707i6J905N25J136J01j945k508n54P76O43N41J550K789N78j705j691j020k089
724a064k454j003J433J598O15K07J656J91k219k480r87o6k83L7K709L093J936
741B919Q82O01O34j249k236j196L21M46q08O30J831K60j085j535N4o10j884j010
759c035Q08P76J8n51P47N24p66j361N47J570Q76L71J199K370K50r75r71j88j057
778A152j964p86J009P61j76l52J338n22j742j647k69L83o67k63J733J752K41n40
$$ plain form
796 -559 -429 555 -180 -1074 -112 1975 3065 3370 4746 5887 4971 2342 515 -421 -1830 -3471 -3563 -1699
814 -1699 129 323 690 1480 1101 -1052 -3293 -3779 -3480 -3692 -2954 -459 2231 3704 4006 4435 4296 3100
832 3100 1310 469 1240 893 222 895 2191 1579 -162 -2153 -2796 -4135 -5453 -6015 -4216 -2759 -2330
849 -2330 -1815 -882 -252 -1630 -2636 -2532 -1746 -1328 -549 1814 4322 5758 5550 5596 5763 4232 2013 777
867 777 427 411 -661 -65 738 1211 104 -584 -853 -914 -2130 -3219 -2102 -1222 -1168 -1177 74 776 936 315
887 315 716 1753 1798 1415 1761 2630 2304 989 522 414 -725 -2347 -2679 -2317 -1913 -2782 -2957 -1662 -1765
906 -1765 -2175 -2734 -1623 -887 -1109 -1127 -103 1154 1156 382 999 1949 1556 1120 1665 3073 2916 1918 2154 2072
926 2072 1376 -637 -1713 -1801 -1972 -2420 -1949 -512 725 806 812 1083 949 -19 -613 -249 436 580 582 1903
$$ packed form
796e59J30R84p35q94R62K087J090L05J376J141r16k629j827r36j409j641r2J864
814a699J828J94L67P90l79k153k241m86K99k12P38K495K690J473L02M29j39j196
832C100j790q41P71l47o71O73J296o12j741j991o43j339j318n62J799J457M29
849b330N15R33O30j378j006J04P86M18P79K363K508J436k08M6J67j531k219j236
867G77l50j6j072N96Q03M73j107o88k69o1j216j089J117Q80N4rJ251P02J60o21
887C15M01J037M5l83L46Q69l26j315m67j08j139j622l32L62M04q69j75J295j03
906a765m10n59J111P36k22j8J024J257Kp74O17R50l93m36N45J408j57r98K36q2
926B072o96k013j076q8j71m48M71J437J237Q1OK71j34r68n94L64O85J44KJ321
$$ plain form
946 1903 3131 2855 1597 1217 846 335 -1018 -1033 -730 -296 -881 -1133 -980 -1465 -2630 -3700 -3371 -2905 -2918
965 -2918 -2297 -783 660 927 612 748 832 -35 -954 -583 -47 581 774 1656 3388 2881 2285 1663 1425
984 1425 565 -687 -1173 -735 -328 -433 -637 309 348 -321 -888 -60 -17 -318 -631 63 894 520 9 -267
1004 -267 399 -264 -1082 -566 781 565 687 1066 1876 1236 -170 -482 -540 -779 -1757 -1487 -545 229 -376 -389
1024 -389 172 264 -567 -1060 -531 11 -325 -742 -115 172 -355 -783 -648 76 -2 -276 490 1537 1696 1435
1044 1435 1283 1183 749 -864 -1557 -808 -542 -543 -67 906 1623 1369 336 -215 -388 -1339 -2009 -1944 -786 -505
1064 -505 -442 434 1408 793 98 -324 13 -602 -618 -357 667 1359 1110 663 964 514 -615 -1401 -904 -468
1084 -468 -408 -257 920 1731 1113 270 46 -370 -1368 -2043 -1760 -915 -158 -98 767 1920 1740 825 171 398
$$ packed form
946A903J228k76j258l80l71n11j353j5L03M34n85k52J53m85j165j070L29M66j3
965b918O21J514J443K67l15J36Q4q67r19L71N36O28J93Q82J732n07n96o22k38
984A425q60j252m86M38M07j05k04R46L9o69n67Q28M3l01l13O94Q31l74n11k76
1004b67O66o63q18N16J347k16J22L79Q10o40j406l12n8k39r78K70R42P74o05j3
1024c89N61R2q31m93N29N42l36m17O27K87n27m28J35P24p8k74P66J047J59k61
1044A435j52j00m34j613o93P49K66jM76R73P17k54j033n51j73r51o70O5J158K81
1064e05O3Q76R74o15o95m22L37o15j6K61J024O92k49m47L01m50j129p86M97M36
1084d68O0J51J177Q11o18q43k24m16r98o75K83Q45P57O0Q65J153j80r15o54K27
$$ plain form
1104 398 -241 -1195 -683 316 926 857 513 1174 994 5 -632 -384 3 -244 -633 142 335 43 -423 -678
1124 -678 -660 -1205 -1475 -1086 -42 237 87 726 1384 1317 247 -57 -70 -547 -836 -559 311 654 678 604 856
1145 856 908 240 -259 -162 22 -375 -857 -338 -40 -616 -747 -653 -221 -256 -682 -230 588 478 641 570 923 425
1167 425 -314 -865 -202 152 86 276 1245 1685 1134 567 272 386 -484 -1134 -772 -170 -139 -472 -68 698 501
1188 501 -169 -293 -46 -327 -445 -192 445 701 220 -57 333 212 -512 -928 -347 405 10 116 1030 1282
1208 1282 757 -137 -257 -628 -1112 -1619 -1350 -396 -376 -420 238 756 496 -385 -635 -499 -986 -1255 -1245 -360 -88
1229 -88 55 207 481 674 423 320 471 984 565 503 1313 1626 1252 698 882 753 450 -103 249 569 509
1250 509 209 279 87 -170 -708 -1384 -1128 -1258 -1494 -1223 -723 -557 -384 -74 397 429 305 -16 178 963 475
$$ packed form
1104C98o39r54N12R99O10o9l44O61j80r89o37K48L87k47l89P75J93k92m66k55
1124f78J8n45k70L89J044K79j50O39O58o7j070l04j3m77k89K77Q70L43K4p4K52
1145H56N2o68m99R7J84l97m82N19K98n76j31R4M32l5m26M52Q18j10J63p1L53m98
1167D25p39n51O63L54o6J90R69M40n51n67k95J14q70o50L62O02L1l33M04P66j97
1188E01o70j24K47k81j18K53O37K56m81k77L90j21p24m16N81P52l95J06R14K52
1208A282n25q94j20l71m84n07K69R54K0m4O58N18k60q81k50J36m87k69J0Q85K72
1229h8J43J52K74J93k51j03J51N13m19o2Q10L13l74n54J84j29l03n53L52L20o0
1250E09l00P0j92k57n38o76K56j30k36K71N00J66J73L10M71L2j24l21J94P85m88
$$ plain form
1271 475 209 325 896 404 45 -8 493 431 -384 -284 98 -293 -958 -1344 -1164 -1256 -1771 -1866 -1112 -461 -646
1292 -646 -370 330 996 671 631 761 1367 1204 548 1342 1702 1764 1327 1387 1665 1391 556 306 777 307 -2
1313 -2 46 0 -104 -991 -1054 -978 -1473 -1496 -1761 -864 -261 -434 -161 424 687 470 -199 135 36 -154 -546 -100 326
1336 326 544 332 371 226 -66 -770 -1047 -887 -968 -1237 -1420 -964 -741 -737 -920 -627 -291 -426 -154 266 1060
1357 1060 1185 1037 1225 1726 1513 1014 891 1258 1145 683 980 1301 935 824 729 222 -234 -930 -1437 -1248
1377 -1248 -1148 -1512 -1548 -1061 -759 -897 -761 -376 -555 -272 -87 74 717 673 355 799 941 842 419 348 799
1398 799 661 21 350 516 30 -688 -1157 -1064 -1219 -1661 -1666 -1267 -807 -895 -818 -131 240 82 -314 -105 572 290
1420 290 148 887 1449 1626 1410 1369 1455 1251 563 735 487 588 84 42 114 -38 -647 -988 -1142 -1204 -1414 -1366
$$ packed form
1271D75k66J16N71m92l59n3N01o2q15J00L82l91o65l86J80r2n15r5P54O51j85
1292f46K76P00O66l25m0J30O06j63o56P94L60O2m37O0K78k74q35k50M71m70l09
1313bM8m6j04q87o3P6m95k3k65Q97O03j73K73N85K63k17o69L34r9j90l92M46M26
1336C26K18k12L9j45k92p04k77J60q1k69j83M56K23Mj83K93L36j35K72M20P94
1357A060J25j48J88N01k13m99j23L67j13m62K97L21l66j11r5n07m56o96n07J89
1377a248J00l64l6M87L02j38J36L85j79K83J85J61O43m4l18M44J42r9m23p1M51
1398G99j38o40L29J66m86p18m69R3j55m42nL99M60q8P7O87L71j58l96K09O77k82
1420B90j42P39N62J77k16m1Q6k04o88J72k48J01n04m2P2j52o09l41j54o2k10M8
$$ plain form
1442 -1366 -746 -290 -334 -45 139 302 -188 -240 -238 62 -77 -62 389 1218 884 641 664 482 128 -303 -639 -441
1464 -441 -511 -569 -469 -92 -92 -341 -489 -314 -458 -438 -178 -40 487 347 383 511 706 455 108 -60 15 2 -137
1487 -137 227 533 152 166 -99 2 -56 -632 -886 -677 -523 -630 -258 -65 375 234 82 261 241 36 -72
1508 -72 225 623 278 65 73 232 65 -266 -128 -5 16 -306 -215 122 49 -494 -203 147 -102 -370 -188 134
1530 134 216 296 291 518 759 539 37 96 -76 -214 -405 -106 -72 -194 -503 -137 -113 -464 -633 -277 -316 -295 -157
1553 -157 -177 266 272 361 146 348 395 307 528 590 789 956 611 804 626 -3 -422 -463 -458 -645 -871 -968 -767 -337
1577 -337 -820 -916 -621 -638 -734 -694 -232 -161 52 159 866 728 828 707 906 1321 995 647 792 904 504 124
1599 124 99 -361 -453 -995 -881 -875 -1017 -863 -1082 -466 -37 -656 -566 32 70 -84 27 505 814 764 1121 1149 1685
$$ packed form
1442a366O20M56m4K89J84J63m90n2KL00j39J5M51Q29l34k43K3j82l54m31l36J98
1464d41p0n8J00L77%k49j48J75j44K0K60J38N27j40L6J28J95k51l47j68P5j3j39
1487a37L64L06l81J4k65J01n8n76k54K09J54j07L72J93M40j41j52J79k0k05j08
1508g2K97L98l45k13QJ59j67l31J38J23K1l22R1L37p3n43K91L50k49k68J82L22
1530A34Q2Q0nK27K41k20n02N9j72j38j91K99L4j22l09L66K4l51j69L56l9K1J38
1553a57k0M43OQ9k15K02M7q8K21O2J99J67l45J93j78o29m19m1Nj87k26r7K01M30
1577c37m83r6K95j7r6M0M62P1K13J07P07j38J00j21J99M15l26l48J45J12m00l80
1599A24k5m60r2n42J14Oj42J54k19O16M29o19R0N98L8j54J11M78L09n0L57K8N36
$$ plain form
1622 1685 1345 875 889 784 638 314 15 -150 -577 -781 -894 -983 -1387 -1305 -1197 -1262 -876 -1090 -453 -646 -269
1643 -269 -101 -286 317 477 357 433 746 956 1132 833 946 839 432 245 220 -41 -221 -509 -646 -479 -663
1664 -663 -856 -801 -433 -595 -582 -313 147 176 405 670 832 722 570 547 905 1197 718 982 504 886 559
1685 559 258 271 -106 -556 -548 -1169 -782 -985 -819 -792 -893 -842 -938 -712 -551 -115 -455 -235 384 283 31 169
1707 169 412 263 502 451 352 549 435 425 469 369 -6 77 -76 14 -74 -402 -270 -49 -7 -36 368 459 398 102
1731 102 190 366 260 102 93 257 583 415 166 576 402 200 -35 128 201 -15 -386 -258 -199 -152 -306 -600
1753 -600 -293 -345 -719 -393 -134 -122 -165 -162 247 -176 -513 -219 -144 -77 -181 -259 -45 142 152 114 128 85 -73 -67 -137
1778 -137 89 26 328 108 153 288 67 158 379 274 211 389 360 302 -20 203 92 41 -166 -477 -103 14
$$ packed form
1622A685l40m70J4j05j46l24k99j65m27k04j13q9m04Q2J08o5L86k14O37j93L77
1643b69J68j85O03J60j20P6L13K10J76k99J13j07m07j87k5k61j80k88j37J67j84
1664f63j93N5L68j62J3K69M60K9K29K65J62j10j52k3L58K92m79K64m78L82l27
1685E59l01J3l77m50Qo21L87k03J66K7j01N1r6K26J61M36l40K20O19j01k52J38
1707A69K43j49K39n1r9J97j14j0M4j00l75Q3j53R0q8l28J32K21M2k9M04R1o1k96
1731A02Q8J76j06j58rJ64L26j68k49M10j74k02k35J63P3k16l71J28N9M7j54k94
1753f00L07n2l74L26K59J2m3LM09m23l37K94P5O7j04p8K14J87J0l8J4m3j58Op0
1778a37K26o3L02k20M5J35k21R1K21j05o3J78k9n8l22K23j11n1k07l11L74J17
$$ plain form
1800 14 18 -78 -69 81 -79 141 -54 -36 14 -230 -132 91 20 78 228 430 517 207 172 86 -151 11 35 -9 67 -365
1826 -365 -54 -307 -354 -339 -364 -279 -68 -152 -180 -20 120 -76 68 -11 137 270 -286 -46 363 302 79 390 463
1849 463 379 255 291 48 -7 -48 -177 -4 -212 -123 -121 -151 -278 -303 -433 -199 -20 -250 -291 -114 5 124 89 131
1873 131 178 97 262 226 363 385 399 431 187 212 153 -195 4 -123 -175 -410 -129 -14 -199 -134 -250 -197 -620 -412
1897 -412 -282 -107 -318 -61 -42 304 377 -31 182 213 399 421 135 470 345 423 302 300 111 -299 -273 -222 157
1920 157 -10 -348 26 23 -128 -36 -180 62 -158 -345 -81 75 97 21 4 457 97 -12 60 304 35 37 56
1943 56 109 273 -168 -193 59 -27 -100 -77 -115 -194 136 -250 -280 -172 -261 -268 98 92 -146 -210 -143 159 -49 -75 164 231
1969 231 252 -95 -29 -322 -250 -140 7 129 102 44 -122 -92 -38 158 -288 -16 109 27 5 -208 70 -61 -227
$$ packed form
1800A4Mr6RJ50j60K20j95J8N0k44R8K23p1N8J50K02Q7l10l5q6k37J62K4m4P6m32
1826c65L11k53m7J5k5Q5K11q4k8J60J40j96J44p9J48J33n56K40M09o1k23L11P3
1849D63q4j24L6k43n5m1j29J73k08Q9Kl0j27k5j30K34J79k30m1J77J19J19l5M2
1873A31M7q1J65l6J37K2J4L2k44K5n9l48J99j27n2k35K81J15j85O5j16N3m23K08
1897d12J30J75k11K57J9L46P3m08K13L1J86K2k86L35j25P8j21kj89m10K6N1L79
1920A57j67l38L74lj51R2j44K42k20j87K64J56K2p6j7M53l60j09P2K44k69KJ9
1943E6N3J64m41k5K52q6p3K3l8p9L30l86l0J08q9pL66ok38o4O7L02k08k6K39O7
1969B31K1l47O6k93P2J10J47J22k7n8j66L0N4J96m46K72J25q2k2k13K78j31j66
$$ plain form
1992 -227 -218 -32 -38 -139 133 271 60 -248 -21 243 -221 9 -67 -63 107 5 -223 47 91 -3 7 101 266 171
2016 171 -233 2 269 13 -44 -222 87 163 -217 -215 -411 74 -228 -335 -85 -105 -349 -59 -205 71 124 42
2038 42 456 60 68 357 310 342 209 176 137 241 24 1 255 -180 -23 21 -218 230 -134 -64 -575 -204 -314
2061 -314 -298 -60 -89 -147 40 136 -8 220 179 182 72 295 160 69 272 257 235 -21 -123 -105 -198 -419 -408 -327 28
2086 28 -306 -38 108 -187 -352 -361 -321 -107 189 -55 347 67 179 78 322 332 221 241 329 163 344 216
2108 216 39 287 24 -166 -3 257 -161 -137 -62 -20 -116 -80 -206 -193 75 -86 -118 50 25 106 139 85 -110 127
2132 127 16 102 30 21 -82 -165 196 -234 -158 43 -4 26 46 120 -85 -122 -323 -78 228 77 -255 222 -87 305
2156 305 -7 -79 177 270 186 -88 200 86 250 45 384 277 -282 -52 56 74 46 190 150 -43 12 -62 130
$$ packed form
1992b27RJ86oj01K72J38k11l08K27K64m64K30p6MJ70j02k28K70M4r4J0R4J65r5
2016A71m04K35K67k56n7j78L09P6l80Kj96M85l02j07K50k0k44K90j46K76N3q2
2038D2M14l96QK89m7L2j33l3l9J04k17k3K54m35J57M4k39M48l64P0n11L71j10
2061c14J6K38k9n8J87R6j44K28m1Lj10K23j35r1K03j5k2k56j02J8r3k21J1Q1L55
2086B8l34K68J46k95j65rM0K14K96k44M02k80J12j01K44J0j11K0Q8j66J81j28
2108B16j77K48k63j90J63K60m18K4P5M2r6L6j26J3K68j61l2J68k5Q1L3n4j95K37
2132A27j11Q6p2rj03q3L61m30P6K01m7L0K0P4k05l7k01K45L06j51l32M77l09L92
2156C05l12p2K56R3q4k74K88j14J64k05L39j07n59K30J08J8k8J44m0j93N5p4J92
$$ plain form
2179 130 112 -259 -234 47 80 170 -78 -165 69 9 -216 -274 -123 215 32 -156 -74 -80 93 32 -211 -155 -114 -61 43
2204 43 213 18 -10 10 158 360 53 174 -16 46 -75 -115 102 -272 12 -89 254 267 197 14 200 18
2226 18 -12 138 13 41 77 -106 105 272 -122 120 423 6 -59 88 101 -51 130 -96 48 -102 139 125
2248 125 -220 -196 -186 -146 -71 -143 -348 -178 -318 -233 -25 -159 -18 -2 -50 229 -171 -54 130 214 350 67 215
2271 215 216 33 272 229 -184 -69 -123 -31 69 -23 -151 -38 -7 -145 -198 -81 -214 -149 -126 179 -19 -46 53 190
2295 190 209 301 40 47 206 97 168 264 287 7 -144 -179 -49 106 107 -154 -11 -85 -218 -356 0 -101 -281 -150
2319 -150 -246 -283 63 -20 3 -101 184 74 13 253 74 117 264 446 13 -58 -91 73 -92 59 -126 -332 -80
2342 -80 -201 -106 -234 -126 -108 33 -73 -45 -284 -245 -12 3 29 140 -173 70 91 265 246 200 165 -51 301 108
$$ packed form
2179A30j8l71K5K81L3R0k48q7K34o0k25n8J51L38j83j88Q2oJ73o1k43N6M1N3J04
2204D3J70j95k8K0J48K02l07J21j90O2j21m0K17l74K84j01L43J3p0j83J86j82
2226A8l0J50j25K8L6j83K11J67l94K42L03m17o5J47J3j52J81k26J44j50K41j4
2248A25l45K4J0M0P5p2k05J70j40Q5K08j34J41J6m8K79m00J17J84Q4J36k83J48
2271B15Jj83K39m3m13J15n4R2J00r2j28J13L1j38n3J17j33O5K3L05j98k7R9J37
2295A90J9R2k61PJ59j09P1R6K3k80j51l5J30J55Jk61J43p4j33j38L56j01j80J31
2319a50r6l7L46q3K3j04K85j10o1K40j79M3J47J82m33p1l3J64j65J51j85k06K52
2342h0j21R5j28J08J8J41j06K8k39L9K33J5K6J11l13K43K1J74j9m6l5k16L52j93
$$ plain form
2366 108 136 147 88 75 -125 -38 -20 -101 -132 -100 -240 -190 78 -215 -83 -84 -160 -173 -172 60 -29 114 -71 -107 174 -200
2392 -200 34 247 52 -19 261 264 168 250 215 -155 94 -59 121 64 15 -5 -163 120 32 -16 -302 -161 -434 -179
2416 -179 -17 -57 -179 44 110 45 -44 188 97 97 -35 -214 117 201 37 -3 224 -28 132 20 -103 -180 51
2439 51 -243 -75 -9 -241 -251 -148 141 -141 -34 -124 -199 -79 42 -355 -191 -69 -207 150 343 88 46 406
2461 406 -35 19 -9 -152 111 -48 -24 175 -41 113 -45 -220 -220 -90 -233 -133 -424 -194 6 -218 100 -270
2483 -270 -385 207 122 -175 -49 62 145 59 11 -46 6 106 234 49 398 105 21 -84 -300 -75 -118 -40 -159
2506 -159 99 -42 -9 -46 -47 103 -119 38 50 -1 -58 -229 8 35 -15 182 -34 75 159 103 70 84 59 232 91
2531 91 -42 99 -179 -25 -60 152 -35 -73 42 -65 -228 115 -72 181 -76 -106 7 -7 -14 -117 27 160
$$ packed form
2366A08K8J1n9j3k00Q7J8q1l1L2j40N0K68k93J32jp6j3JK32q9J43j85l6K81l74
2392b00K34K13j95p1K80Lr6Q2l5l70K49j53J80n7m9k0j58K83q8m8k86J41k73K55
2416a79J62m0j22K23O6o5q9K32r1%j32j79L31Q4j64m0K27k52J60j12j23p7K31
2439E1k94J68O6k32j0J03K89k82J07r0p5J20J21l97J64J22j38L57J93k55m2L60
2461D06m41N4k8j43K63j59K4J99k16J54j58j75%J30j43J00k91K30K00k24L18l70
2483b70j15N92q5k97J26J11Q3q6m8n7N2J00J28j85L49k93q4j05k16K25m3P8j19
2506a59K58j41L3l7jJ50k22J57J2n1n7j71K37K7n0J97k16J09Q4n6l3J4k5J73j41
2531I1j33J41k78J54l5K12j87l8J15j07j63L43j87K53k57l0J13j4pj03J44J33
$$ plain form
2553 160 60 41 68 0 200 20 276 -101 -121 -115 -79 -18 -210 -86 108 -8 25 -224 -66 140 107 -95 37
2576 37 -123 -196 -188 -37 122 95 216 44 54 82 131 -206 -102 -138 -5 1 201 149 229 -147 -86 34 94 -8 -116
2601 -116 -44 -24 108 -112 58 -89 -264 -119 48 282 -185 4 -299 -312 -17 -24 -35 188 39 194 109 -12
2623 -12 19 -34 234 36 -3 -54 1 -36 137 153 55 3 -160 -71 -209 -100 -190 -24 13 -161 -123 -12 70 -110 -44
2648 -44 -51 -92 130 37 -201 94 181 183 -129 117 131 136 116 -29 -50 -210 198 73 -3 -265 -315 -365 157 -87 -114 -143
2674 -143 -115 -169 88 -276 101 42 -146 -79 -163 114 82 126 162 64 126 125 214 63 87 -207 -46 -81 -37 -334 -22
2699 -22 34 29 351 -289 59 48 -43 120 -125 126 135 -252 8 61 90 155 82 -85 87 -48 291 -30 -8 22 53
2724 53 150 -80 -59 33 140 63 117 -85 14 25 61 -204 154 17 214 11 -37 173 -174 35 -17 -105 -74 -1 -60
$$ packed form
2553A60j00j9K7o8K00j80K56l77k0OL6O1j92J24J94j16L3k49J58K06l3k02J32
2576C7j60p3QJ51J59k7J21j72J0K8M9l37J04l6J33OK00n2Q0l76O1J20O0j02j08
2601a16P2K0J32k20J70j47j75J45J67K34m67J89l03j3K95pj1K23j49J55q5j21
2623a2L1n3K68j98l9n1N5l7J73J6r8n2j63Q9j38J09r0J66L7j74L8J11Q2j80O6
2648d4pm1K22r3k38K95Q7Kl12K46J4Nk0j45k1j60M08j25p6k62n0n0N22k44k7k9
2674a43K8n4K57l64L77n9j88O7q4K77l2M4L6r8O2jQ9j51K4k94J61l5M4k97L12
2699b2N6nL22o40L48j1r1J63k45K51Rl87K60N3K9O5p3j67J72j35L39l21K2L0L1
2724E3R7k30K1R2J07p7N4k02R9J1L6k65L58j37J97k03m8K10l47K09n2q8L1P3n9
$$ plain form
2749 -60 -45 223 70 81 -147 -88 15 -21 155 65 -53 142 -219 -164 -180 8 33 -139 -128 110 -7 -19 49 -4
2773 -4 241 57 -93 133 273 124 -6 3 99 19 69 -71 110 -235 157 91 176 29 -65 130 142 73 -1 -70 -86
2798 -86 26 101 191 -163 61 138 -221 103 -184 -174 222 54 253 -39 142 38 -43 61 -61 -258 149 61
2820 61 -35 83 -95 376 -37 15 -162 37 -28 122 59 -281 45 -39 10 -107 114 -49 158 -120 -15 4 -226
2843 -226 -53 -10 -55 -15 146 -21 -17 156 -223 168 72 76 113 183 327 -230 -91 -103 119 -74 131 268 69 100
2867 100 -37 -114 15 -15 -22 103 163 174 -201 -92 50 -43 88 148 99 207 185 -65 -164 -10 15 147 -83 -46
2891 -46 54 -56 -92 5 -394 -62 34 -174 226 190 -217 33 23 -6 -130 20 98 54 90 46 133 36 19 239 152
2916 152 116 -163 82 -19 93 -98 17 41 -107 -100 135 -114 -39 -140 -80 -212 90 82 -94 57 124 -34 98
$$ packed form
2749f0J5K68j53J1k28N9J03l6J76r0j18J95l61N5j6J88K5j72J1K38j17j2O8n3
2773dK45j84j50K26J40j49j30RR6q0N0j40J81l45L92o6Q5j47r4J95J2o9p4o9j6
2798h6J12P5R0l54K24P7l59L24k87J0L96j68J99k92J81j04q1J04j22j97M07q8
2820F1r6J18j78M71m13N2j77J99o5J50o3l40L26q4M9j17K21j63K07k78J05J9k30
2843b26J73M3m5M0J61j67MJ73l79L91r6ML7P0J44n57J39j2K22j93K05J37j99L1
2867A00j37p7J29l0pJ25O0J1l75J09J42r3J31O0m9J08k2k50r9J54K5J32k30L7
2891d6J00j10l6R7l99L32R6k08M00l6m07K50j0k9j24J50P8m4L6m4Q7r7j7K20q7
2916A52l6k79K45j01J12j91J15K4j48PK35k49P5j01O0j32L02qj76J51O7j58J32
$$ plain form
2939 98 66 47 -74 -47 -26 7 108 -146 -21 -43 45 160 35 -121 169 -29 -110 144 -173 42 -168 58 -126
2962 -126 9 -77 126 52 -79 83 1 153 -17 7 163 -114 73 -95 37 -17 320 176 -87 -5 96 -62
2984 -62 -108 -295 -53 32 -228 43 15 -94 -192 89 129 -62 77 19 -156 66 -214 -135 -1 -146 -47 -81 83
3007 83 -149 195 -47 150 111 -40 248 201 13 204 48 -89 108 137 -23 -28 58 -127 3 -118 -20 -1 -87
3030 -87 -149 27 131 154 -77 -14 0 -35 -135 79 274 225 11 71 47 21 -32 175 -114 128 -4 92 87 58 -337
3055 -337 -36 181 -203 135 97 -118 15 167 145 132 37 45 36 133 -22 -47 79 -88 63 222 89 187 112 -55
3079 -55 139 -45 -129 199 -3 47 188 101 64 -64 241 -157 80 -108 100 37 -111 -80 -42 33 119 50 44 -200
3103 -200 -173 18 174 -20 74 102 -31 140 -89 171 38 126 96 230 -143 33 -68 -36 18 -173 -40 -43 7
$$ packed form
2939I8l2j9j21K7K1L3J01k54J25k2Q8J15j25j56K90j98q1K54l17K15k10K26j84
2962a26J35q6K03p4j31J62q2J52j70K4J56k77J87j68J32n4L37j44k63Q2J01j58
2984f2m6j87K42Q5k60K71k8j09r8K81M0j91J39n8j75K22k80P9J34j45R9l4J64
3007H3k32L44k42J97l9j51K88m7j88J91j56j37J97K9j60nQ6j85J30j21R8J9q6
3030h7o2J76J04K3k31O3J4l5j00K14J95m9k14O0k4k6n3K07k89K42j32R6nk9l95
3055c37L01K17l84L38l8k15J33J52k2j3r5QrR7j55k5J26j67J51J59j33R8p5j67
3079e5J94j84q4L28k02N0J41q7l7j28L05l98K37j88K08o3j48L1L8P5Q6o9ok44
3103b00K7J91J56j94R4K8j33J71k29K60j33Q8l0J34l73J76j01L2N4j91J33lN0
$$ plain form
3126 7 270 96 -138 -37 97 42 149 36 -147 -86 11 -176 86 -78 128 23 -39 -21 9 -284 149 190 -110
3149 -110 -72 -207 -16 -121 -37 -9 -323 -82 -48 -188 73 -289 -104 -13 171 42 124 327 -83 179 63 91
3171 91 -96 62 29 -104 105 198 -118 27 -154 86 -79 21 -17 -144 64 -4 -217 -45 286 -13 -5 -219
3193 -219 -107 -104 -56 12 -106 -49 -172 -93 -3 -32 247 109 25 67 151 125 16 -157 80 -18 -72 36 94 -18 -67
3218 -67 -103 -412 125 -81 -174 -248 -5 -126 112 -43 53 9 135 -65 53 180 20 123 -2 19 111 -87 13
3241 13 136 -109 139 -25 -15 -258 37 -101 -140 44 -22 -81 -113 -113 56 338 82 -133 91 131 22 -33 -92 14
3265 14 154 -84 175 -53 -120 -287 27 97 82 343 92 250 -40 -57 -87 -236 63 -43 -20 -119 -146 40 -65
3288 -65 -45 -153 -7 58 -203 95 -169 307 -76 197 130 234 148 165 48 -260 314 36 90 5 -95 43 58
$$ packed form
3126GK63j74k34J01J34n5J07j13j83O1R7j87K62j64K06j05o2J8L0k93M33M1l00
3149a10L8j35J91j05Q4K8l14K41L4j40K61l62J85R1J84j29Q2K03m10K62j16K8
3171I1j87J58l3j33K09R3l16J45j81K40j65J00l8j27K08o8k13J72L31k99Qk14
3193b19J12LM8O8j18N7j23P9R0k9K79j38q4M2Q4k6j09j73K37r8n4J08N8j12m9
3218f7l6l09N37k06r3p4K43j21K38j55R6m4J26k00J18J27j60J03j25K1R2j98J00
3241A3J23k45K48j64J0k43K95j38l9J84o6n9l2%J69K82k56k15K24M0j09n5n9J06
3265A4J40k38K59k28o7j67L14P0j5K61k51J58k90j7l0j49K99j06K3r9k7J86j05
3288f5K0j08J46O5k61K98k64M76l83K73o7J04q6J7j17l08N74k78N4q5j00J38J5
$$ plain form
3311 58 65 111 -151 -115 -133 92 109 -219 -224 -111 -186 -374 -13 -120 16 159 147 209 296 14 264 95 85 1 62
3336 62 -125 84 44 52 -384 -80 78 -143 167 -159 98 -32 238 38 -158 -71 -196 121 115 145 -109 -16 -87
3359 -87 177 -58 -97 123 127 167 -10 39 241 146 -7 -69 100 13 102 -4 -12 -121 -25 141 132 193 -76 12 46 -16
3385 -16 70 160 -64 232 -126 -174 -78 -139 -125 203 103 99 -128 2 -39 -94 275 74 129 -33 40 -15 131 -29 131
3410 131 -108 188 -284 359 -28 -94 142 -165 14 141 -87 89 -9 -40 -140 129 159 -151 -40 -173 28
3431 28 143 55 79 75 101 -28 47 123 178 121 -63 24 -29 -82 163 -123 175 -42 -89 101 -308 -107 -42 25 53 -132
3457 -132 143 92 -24 115 82 313 298 20 141 198 -38 229 208 107 -105 288 93 60 -66 112 44 82 204
3480 204 -129 -23 82 -97 -202 -82 -41 -34 138 32 108 103 64 123 217 -91 -153 170 9 167 149 97 -27 -18 -56
$$ packed form
3311E8PM6k62L6j8K25J7l28nJ13p5j88L61j07J36J43j2O2Q7k82K50j69j0q4O1
3336F2j87K09m0Qm36L04J58k21L10l26K57j30K70k00j96Q7j25L17oL0k54R3p1
3359h7K64k35l9K20MM0j77M9K02r5j53o2J69q7Q9j06qj09R6J66rO1k69Q8L4o2
3385a6Q6R0k24K96l58m8R6o1J4L28j00mk27J30m1n5L69k01N5j62P3n5J46j60J60
3410A31k39K96m72O43l87o6K36l07J79J27k28J76r8l1j00K69L0l10J11j33K01
3431B8J15q8K4mK6j29P5P6N5n7j84Q7n3n3K45k86K98k17m7J90m09K01O5O7K8j85
3457a32K75n1j16J39l3K31j5k78J21N7k36K67k1j01k12L93j95l3j26J78o8L8J22
3480B04l33J06J05j79j05J20M1PJ72j06P6nl9N9R4l08o2L23j61J58j8n2j24Rl8
$$ plain form
3505 -56 88 65 -117 68 -66 102 23 -42 -183 -226 -144 106 -80 -269 -124 -115 -30 54 28 238 -112 270 -105 -21
3529 -21 35 -232 65 -109 141 -22 59 -21 177 -152 17 -127 -37 24 -104 -83 -151 -74 -38 -107 -22 100 32 -1 -6
3554 -6 62 -275 201 -227 -81 -81 81 254 223 102 -5 -69 282 174 19 31 78 -162 -270 -44 253 -9 242
3577 242 69 29 -70 92 215 -24 -125 69 28 -72 94 -11 44 181 -101 141 -314 21 13 -10 62 130 75
3600 75 -19 -54 -66 -53 -44 90 -27 28 -15 78 -13 -100 77 92 28 204 -139 113 79 -25 5 41 208 26 -124 -161
3626 -161 31 -81 -80 63 -60 -101 -83 11 -193 -108 90 -3 29 -113 -126 -59 -64 -61 -182 197 92 -227 -24 66 -48
3651 -48 -14 -142 -109 -303 -255 -65 89 184 -214 178 -19 24 -60 73 -47 -146 -13 174 141 -60 -11 -56 121 254
3675 254 137 -110 -19 -101 -207 125 35 46 182 216 -78 -124 48 238 88 128 95 43 -95 -1 -153 -6 -52 81
$$ packed form
3505e6J44k3j82J85j34J68p9o5j41m3Q2K50j86j89J45RQ5Q4k6K10l50L82l75Q4
3529b1N6k67K97j74K50j63Q1q0J98l29J69j44R0O1j28K1o8P7L6o9Q5J22o8l3n
3554fO8l37M76m28J46%J62J73l1j21j07o4L51j08j55J2M7k40j08K26K97k62K51
3577B42j73m0r9J62J23k39j01J94m1j00J66j05N5J37k82K42m55L35qk3P2O8n5
3600G5r4l5j2J3RJ34j17N5m3R3r1q7J77J5o4J76l43K52l4j04L0L6J67j82j50l7
3626a61J92j12JJ43j23m1J8R4k04Q5J98r3L2j42j3O7nLj21L79j05l19K03R0j14
3651d8L4j28L3j94M8J90J54R5l98L92j97M3q4J33j20r9J33J87l3k01M9m5J77J33
3675B54j17k47R1q2j06L32r0J1J36L4k94m6J72J90j50M0l3n2j38R4j52J47m6J33
$$ plain form
3699 81 158 -90 150 29 92 -68 -7 -295 -4 -115 84 -109 -31 -38 -78 -21 -76 58 144 186 6 -45 101 47 -28
3724 -28 81 217 73 -50 -158 0 -68 -208 58 -14 -39 82 -65 23 -50 -173 -133 22 -57 -259 202 153 54
3747 54 -4 -240 159 -24 115 -157 -76 -187 204 117 168 -72 151 -28 128 76 -38 190 263 76 -216 -32
3769 -32 10 -162 -8 85 -196 100 194 -102 171 67 34 86 -137 84 -61 -136 -76 -199 121 47 -84 83 87 -66
3793 -66 196 -59 49 -169 33 -196 171 -256 -172 -200 -38 -50 -125 -146 346 115 -88 171 42 17 -132 212
3815 212 15 31 101 155 126 -55 -98 -215 -199 -8 176 3 16 -68 22 57 -108 -2 -122 264 65 116 16 88
3839 88 -57 176 86 111 76 -181 51 -121 -19 123 -164 -55 44 -12 -36 157 10 150 -151 -20 93 -60
3861 -60 -178 153 -92 75 -206 66 -29 -63 30 24 -37 -167 -74 -104 74 -92 -150 16 -128 69 1 52 45 47 82 -146
$$ packed form
3699H1P7k48K40j21O3j60O1k88K91j11J99j93P8pm0N7n5J34Q6M2j80n1J46n4p5
3724b8J09J36j44j23j08J58o8j40K66p2k5J21j47Q8p3j23M0J55p9k02M61m9r9
3747E4n8k36L99j83J39k72Q1j11L91q7N1k40K23j79J56n2j14K28P3j87k92J84
3769c2M2j72J54R3k81K96R4k96K73j04l3N2k23K21j45p5O0j23L20p4j31J67Mj53
3793f6K62k55J08k18K02k29L67m27Q4k8J62j2p5k1M92k31k03K59j29k5j49L44
3815B12j97J6P0N4k9j81m3j17J6J91J84j73J3q4R0L5j65J06j20L86j99N1j00P2
3839H8j45K33r0K5l5k57K32j72J02J42k87J09R9n6k4J93j47J40l01J31J13j53
3861f0j18L31k45J67k81K72r5l4R3oo1j30R3l0J78j66n8J66j44J97o8N1pKL5k28
$$ plain form
3887 -146 36 -7 32 -145 -4 -117 140 -78 -202 -207 114 167 25 48 151 18 -115 44 151 50 141 34
3909 34 0 181 -3 54 84 5 110 -150 143 -96 65 26 124 43 -72 -224 -105 -2 65 19 -151 209 -194
3932 -194 -139 -46 -31 245 -4 98 -27 59 104 149 163 42 -18 54 -142 -195 -19 31 104 -166 -11 187 71 -65
3956 -65 115 224 232 -53 49 -128 -143 -127 -150 38 183 -138 74 -45 23 10 -59 231 -70 187 -103 219 -192
3979 -192 -112 126 -5 242 199 29 99 -256 -115 0 62 -63 -92 -31 209 -168 -123 246 -110 -31 -79 133 259
4002 259 -119 24 60 -134 -114 -84 -80 -271 -11 119 -310 152 -116 225 56 76 12 -99 202 106 -213 -251 26
4025 26 -14 163 -87 -141 -15 99 -76 -41 -140 -17 -80 111 -107 108 120 27 128 -98 86 -42 189 270 22
4048 22 -60 -22 -170 -91 -25 -284 87 -1 -313 -70 -197 63 -48 73 -253 -14 -113 -47 -43 191 -59 -106 -32 -187
$$ packed form
3887a46J82m3L9j77J41j13K57k18j24nL21N3j42K3J03j33j33J59J07j01R1j07
3909C4l4J81j84N7L0p9J05k60K93k39J61l9R8q1j15j52J19J03O7m6j70L60m03
3932a94N5R3J5K76k49J02j25Q6M5M5J4j21o0P2j96n3J76N0P3k70J55J98j16j36
3956f5J80J09Qk85J02j77j5J6k3J88J45l21K12j19O8j3o9K90l01K57k90L22m11
3979a92Q0K38j31K47m3j70P0l55J41J15O2j25k9O1K40l77M5L69l56P9m8K12J26
4002B59l78J43L6j94K0L0Mj91K60J30m29M62k68L41j69K0o4j11L01r6l19l8K77
4025B6m0J77k50n4J26J14j75L5r9J23o3J91k18K15J2r3J01k26J84j28K31Q1k48
4048B2q2L8j48P9O6k59L71q8l12K43j27K60j11J21l26K39r9O6MK34k50m7P4j55
$$ plain form
4072 -187 -226 92 -15 -87 -153 86 135 -371 -272 154 -297 -65 -418 150 15 -62 166 89 -215 25 -90 20
4094 20 75 74 -37 -174 389 44 60 6 66 -242 116 -131 173 63 -46 144 44 -178 -259 77 -190 -30 195
4117 195 -120 -139 -153 76 62 36 -170 -114 12 -179 -169 208 -33 -335 -51 47 -13 44 -4 118 -258 10 -165
4140 -165 -30 -39 192 203 -3 -169 -39 -134 -155 -94 -269 3 -214 16 -31 42 105 340 -175 53 -18 -7 186 -251
4164 -251 100 354 105 -89 -101 273 312 -4 185 26 -8 -24 -6 -142 1 -331 163 33 142 -382 -18 141
4186 141 206 -124 -138 188 248 87 -75 -67 57 0 -303 246 -35 46 -168 -52 257 26 -110 -72 -4 -158 132
4209 132 -139 -145 -67 -128 151 36 -33 172 -67 64 321 -42 -146 -40 -108 -215 33 -15 -68 -189 -112 87 -235
4232 -235 18 163 -173 -44 -80 -38 64 -211 86 89 -84 -130 22 -185 -311 -32 189 140 84 129 71 95 231
$$ packed form
4072a87l9L18j07p2o6K39M9n06R9M26m51K32l53N68j35p7K28p7l04K40j15J10
4094B0N5jj11j37N63l45J6n4O0l08L58k47L04j10j09J90j00k22q1L36k67J60K25
4117A95l15j9j4K29j4k6k06N6J26j91J0L77k41l02K84R8o0N7m8J22l76K68j75
4140a65J35rK31J1k06j66J30r5k1O1j75K72k17K30m7P3O3K35n15K28p1J1J93m37
4164b51L51K54k49j94j2L74L9l16J89j59l4j6J8j36J43l32M94j30J09n24L64J59
4186A41O5l30j4L26O0j61j62QJ24n7l03N49k81Q1k14J16L09k31j36L8O8j54K90
4209A32k71oP8o1K79j15o9K05k39J31K57l63j04J06o8j07K48m8n3j21P7J99l22
4232b35K53J45l36J29l6M2J02k75K97Lj73m6J52k07j26K79K21m9n6M5n8K4J36
$$ plain form
4255 231 -98 -21 -196 175 158 -124 19 -175 -31 128 158 -151 69 233 103 -127 -1 -169 -28 45 -40 -67
4277 -67 -96 -60 -39 -88 -167 6 281 85 -149 -19 -114 40 44 -82 -27 50 -182 20 -9 -174 -77 -56 87 -37 54
4302 54 -64 -8 65 -137 -125 212 -239 32 290 -94 82 -127 -19 -47 -194 -238 -106 61 -140 19 161 146
4324 146 -92 -11 37 85 175 -17 -75 -72 -54 6 71 -237 205 116 269 72 -18 170 179 279 -192 162 120 -84 152
4349 152 43 -141 -53 -190 4 7 -159 -99 -238 15 155 104 22 81 22 -145 109 -300 -166 282 71 73 104 184
4373 184 103 20 211 -219 -39 22 6 43 156 96 -151 10 79 70 27 -130 -188 -130 68 112 156 280 39 -6 -3 142
4399 142 -123 -53 30 161 -10 73 95 196 -14 -68 76 84 -31 91 267 85 -80 58 -121 -171 -196 -79 -105
4422 -105 -179 -157 -56 -146 -180 192 105 -27 -27 1 -277 123 -105 -69 6 -48 -28 -131 1 -71 -140 44 -189 -202 203
$$ packed form
4255B31l29P7j75L71j7k82J43j94J44J59L0l09K20J64j30k30J26j68J41P3q5k7
4277f7k9L6K1m9p9J73K75j96k34J30r5J54Mj26N5P7k32K02k9j65R7K1J43j24R1
4302E4j18N6P3k02J2L37m51K71K58l84J76k09J08k8j47m4J32J67k01J59J42j5
4324A46k38Q1M8M8R0j92n8LJ8O0O5l08M42q9J53j97r0J88RJ00m71L54m2k04K36
4349A52j09j84Q8j37J94Lj66O0j39K53J40n1q2N9n9j67K54m09J34M48k11KL1Q0
4373A84q1q3J91m30J80O1j6L7J13o0k47J61O9rm3j57n8N8J98M4M4J24k41m5LJ45
4399A42k65P0Q3J31j71Q3K2J01k10n4J44Qj15J22J76j82j65J38j79n0k5J17k6
4422a05p4K2J01r0l4L72q7j32%K8k78M00k28L6P5n4K0j03J32p2o9J84k33j3M05
$$ plain form
4447 203 184 166 -32 -201 209 -148 -54 44 62 -42 104 90 -136 244 -22 -76 -143 -7 -78 -28 -78 -133 -130 99 -161
4472 -161 -39 32 -221 92 -168 -21 -279 88 154 -89 -147 166 106 3 -109 45 126 -195 43 -125 -40 -198
4494 -198 -11 17 90 -225 -113 -203 -26 -18 -1 -52 -57 -86 -130 66 18 73 123 145 -135 55 44 -26 1 -32 -64 -83 -69
4521 -69 14 -15 -69 49 105 27 -91 -171 -32 -155 21 -223 87 -11 135 151 -42 -66 -104 -113 185 68 50 -96 109
4546 109 -44 128 189 -187 -34 47 -4 188 -1 -55 164 -319 166 -106 -31 72 -133 -149 -29 92 52 128 53
4569 53 245 -28 181 44 145 -28 -55 30 -132 -47 -24 -208 69 22 -316 29 -129 146 -102 239 203 -73
4591 -73 -164 -150 -75 -27 -29 -34 39 -124 -256 -53 187 76 67 -159 37 139 -36 -216 177 -21 -57 91 160 20 -62
4616 -62 83 -265 75 122 -91 -127 51 16 -103 -136 -248 217 45 106 213 -19 4 180 24 110 -141 -60 -51 194
$$ packed form
4447B03j9j8j98j69M10l57R4R8J8j04J46j4k26L80k66n4o7J36p1N0n0n5LK29k60
4472a61J22P1k53L13k60J47k58L67O6k43n8L13o0j03j12J54Q1l21K38j68Q5j58
4494a98J87K8P3l15J12r0J77QJ7n1nk9m4J96m8N5N0K2k80J90j1p0K7l3l2j9J4
4521f9Q3k9n4J18N6p8j18q0J39j23J76k44L10r8J46J6j93k4l8rK98j17j8j46K05
4546A09j53J72O1l76J53Q1n1J92j89n4K19m83M85k72P5J03k05j6J20J21m0P6p5
4569E3J92k73K09j37J01j73k7Q5j62Q5K3j84K77m7l38L45j58K75k48L41l6k76
4591g3r1J4P5M8knP3j63j32K03K40j11rk26J96J02j75j80L93j98l6J48O9j40q2
4616f2J45l48L40M7k13l6J78l5j19l3j12M65j72O1J07k32K3J76j56Q6k51Q1RK45
$$ plain form
4640 194 8 159 128 -56 131 -23 47 -90 -191 282 16 -259 45 52 -145 -187 85 35 -23 113 -115 -7
4662 -7 -70 115 -78 230 147 -162 -33 -231 -121 49 -43 75 -36 151 191 -98 4 142 195 -116 -155 21 -45
4685 -45 -24 -240 31 90 -304 -221 -26 222 -87 -139 -35 35 -67 -31 -269 203 160 -107 -60 0 71 10 -172 -183
4709 -183 -44 257 4 100 62 435 85 178 -43 13 -251 -78 32 305 -152 -132 -186 -109 77 22 118 89 89 50
4733 50 31 -18 52 -92 -165 -183 15 22 19 -220 40 113 -83 -135 -44 177 -218 -80 27 24 60 77 -37 -177 23 9
4759 9 -9 -85 42 -289 227 -21 -4 -167 225 81 -66 20 74 -57 32 -26 -25 175 -29 98 96 12 156 -11 -19
4784 -19 21 22 116 -109 -195 275 220 262 46 -119 59 115 77 78 139 115 -65 -47 -72 135 116 31 -16 -183 18 -24 -111
4811 -111 -46 162 55 142 -240 109 -163 -115 -123 110 36 142 13 -205 -148 145 -5 167 61 1 246 -6 70
$$ packed form
4640A94j86J51l1j84J87j54P0j37j01M73k66k75L04Pj97m2K72n0n8J36k28J08
4662go3J85j93L08q3l09J29j98J10J70r2J18j11J87M0k89J02J38N3l11l9J76o6
4685d5K1k16K71N9l94Q3J95K48l09n2J04P0j02L6k38M72m3k67M7O0P1o1j82j1
4709a83J39L01k53R6l8L73l50R3k21N6k64J73J10K73m57K0n4P7J86n5R6k9%l9
4733E0j9m9P0j44p3j8J98Plk39K60P3j96n2R1K21l95J38J07lL6J7j14j40K00j4
4759Ij8p6J27l31N16k48J7j63L92j44j47Q6N4j31Q9n8JK00k04J27kq4J44j67q
4784a9M0JR4k25q6M70n5M2k16j65J78N6l8JO1k4j80J8k5K07j9q5m7j67K01m2q7
4811a11O5K08j07Q7l82L49k72M8qK33p4J06j29k18N7K93j50J72j06o0K45k52P6
$$ plain form
4834 70 -77 52 -147 -5 38 -166 7 174 -119 50 6 118 -181 44 97 143 -265 -145 46 87 98 108 12
4857 12 -99 8 24 53 126 -127 141 47 66 -107 -132 131 -10 -81 38 -26 25 56 -67 146 -76 65 -124 253
4881 253 170 -36 -38 158 -233 199 155 16 -31 146 8 -26 128 -45 19 84 -60 93 -216 171 261 -85 -131
4904 -131 116 -166 25 -220 161 29 107 30 12 -66 -88 -33 78 149 57 162 54 101 201 200 116 23 98 141 -75
4929 -75 115 -91 -2 -140 89 39 -33 43 221 132 56 103 41 -7 56 298 138 -111 28 112 -48 337 -42 183
4953 183 56 -68 7 -234 -6 -30 107 -26 -108 -160 -152 315 110 -39 101 168 9 -199 2 -34 -162 38 -134
4976 -134 75 207 -118 217 68 -14 -127 -163 123 -15 -122 -183 113 -36 -12 -179 20 191 85 185 -140
4997 -140 -43 281 44 -126 69 -143 100 -109 -2 77 137 48 -107 466 -100 -251 199 -405 97 104 -118 62
$$ packed form
4834G0j47J29j99J42M3k04J73J67k93J69m4J12k99K25N3M6m08J20J91M1J1J0r6
4857A2j11J07J6K9P3k53K68r4J9j73k5K63j41p1J19o4N1L1j23K13k22J41j89L77
4881B53q3k06kJ96l91M32m4j39m7J77j38l4J54j73O4O5j44J53l09L87R0l46m6
4904a31K47k82J91k45L81j32P8p7j8p8k2N5J11P1r2J05j08M7J00jq4r3P5M3k16
4929g5J90k06Q9j38K29n0p2P6J78q9p6M7o2m8O3K42j60k49J39Q4j60L85l79K25
4953A83j27j24P5k41K28k4J37j33q2n2QM67k05j49J40O7j59k08K01l6j28K00j72
4976a34K09J32l25L35j49q2j13l6K86j38j07o1K96j49K4j67J99J71j06J00l25
4997a40R7L24k37j70J95k12K43k09J07P9O0q9j55N73n66j51M50o04N02Pk22J80
$$ plain form
5019 62 112 -158 -102 69 41 125 -83 35 34 -35 113 195 -114 182 -47 -139 22 89 58 134 94 288 193 97 -140
5044 -140 195 -12 -17 -93 25 -98 -95 46 -117 -207 182 -40 81 -30 1 202 -201 52 84 -110 56 -63 18
5067 18 82 -1 109 -118 -111 76 -63 -151 194 27 -104 290 356 31 65 -4 17 164 2 -122 156 110 113 -54
5091 -54 -104 -74 -144 44 66 -205 1 149 126 -261 39 59 -3 -77 -166 197 -77 31 -187 153 -92 16 -172
5114 -172 8 279 -180 -74 154 98 -28 -68 -30 188 -277 -143 32 -26 1 95 169 8 -26 -39 -41 127 -379 150
5138 150 -56 99 89 -74 -57 -229 -137 -191 128 -78 164 157 215 0 -101 -9 -120 113 -12 124 101 -172 -33
5161 -33 41 -21 -66 -20 -26 -132 -70 58 59 31 -96 5 45 -88 53 43 -173 80 -106 -80 -60 -135 -54 -71 -109 -29 -136
5188 -136 -102 105 2 -99 -162 204 -203 127 38 -10 -131 -110 17 -7 126 -69 -234 -31 -165 190 263 87
$$ packed form
5019F2N0k70N6J71k8Q4k08J18jo9J48Q2l09K96k29r2J61O7l1P6m0J94r5r6k37
5044a40L35k07np6J18j23LJ41j63r0L89k22J21j11L1K01m03K53L2j94J66j19Q1
5067A8O4q3J10k27PJ87j39q8L45j67j31L94O6l25L4o9K1J47j62j24K78m6Lj67
5091e4n0L0p0J88K2k71K06J48k3l87L00K0o2p4q9L63k74J08k18L40k45J08j88
5114a72J80K71m59J06K28n6j26m0L8K18m65J34J75n8K7R4P4j61l4j3kJ68n06N29
5138A50k06J55j0j63J7j72R2n4L19k06K42pN8k15j01R2j11K33j25J36k3k73J39
5161c3P4o2m5M6oj06O2J28Jk8j27J01M0j33J41j0k16K53j86K6K0p5Q1j7l8Q0j07
5188a36L4K07j03j01o3L66m07L30q9m8j21K1J27k4J33j95j65K03j34L55P3j76
$$ plain form
5210 87 44 58 53 114 -76 -93 -56 -233 -42 93 -240 -205 88 -41 150 99 80 -204 441 -49 -152 127 -121 -98
5234 -98 67 -51 -8 -86 -106 154 31 57 -42 -294 -163 -142 157 362 -136 -3 -122 -39 50 -23 -42 -45 -53 4 110
5259 110 130 64 -13 -66 -166 -36 104 245 211 98 28 -20 -58 20 76 -76 149 45 162 170 60 4 -52 49 -22
5284 -22 -53 252 -61 -60 -146 92 -71 11 320 71 -60 -98 2 80 33 115 32 38 -30 139 229 118 141 80 141 -47
5310 -47 -186 31 138 3 94 -70 -31 158 174 89 -105 78 -178 -88 122 -147 268 15 -150 237 168 -296
5332 -296 -118 -34 -40 -63 -105 55 -143 -120 -241 -173 183 -80 50 -28 -19 116 -135 -209 35 283 144 -72 -175 -75
5356 -75 -164 147 51 125 14 169 -142 -221 13 68 -87 -50 42 -281 106 -35 -390 -114 112 -48 -220 30 -74
5379 -74 -22 315 120 -39 -61 -79 -122 140 -133 -78 -11 24 82 160 15 177 -20 40 77 -90 146 -176 -174 18 -75
$$ packed form
5210H7m3J4nO1j90j7L7j77J91J35l33L5K93j29J91n1j9k84O45m90j03K79k48K3
5234i8J65j18M3p8k0K60j23K6r9k52J31K1K99K05m98J33j19Q3Q9p3j9lqN7J06
5259A10K0o6p7n3j00J30J40J41l4j13p0m8l8P8N6j52K25j04J17Qj10n6n6J01p1
5284b2l1L05l13Jq6K38j63Q2L09k49j31l8J00P8m7Q2q3Oo8J69R0j11K3o1O1j88
5310d7j39K17J07j35R1j64L9J89J6q5j94J83k56R0K10k69M15k53j65L87o9m64
5332b96J78Q4ok3m2J60j98K3j21O8L56k63J30p8RJ35k51p4K44K48j39k16j03J00
5356g5q9L11r6P4j11J55l11p9K34N5j55L7R2l23L87j41l55K76K26j60j72K50j04
5379g4N2L37j95j59k2j8m3K62k73N5O7L5N8P8j45J62j97O0L7j67K36l22KJ92r3
$$ plain form
5404 -75 154 -196 21 -185 63 44 -86 42 85 -270 200 -166 -50 -248 140 82 -153 49 85 96 -113 -81
5426 -81 -113 19 205 -7 -86 -63 -86 173 -73 90 -122 53 118 160 -103 66 -9 -296 -121 -62 149 363 15
5449 15 -64 102 -77 -52 -31 -9 -71 61 26 -206 -69 156 172 -13 146 -78 -147 -42 44 -246 -11 41 37 -150
5473 -150 4 -98 65 187 -81 -12 -16 28 14 35 37 190 -125 70 91 130 -34 -67 -27 -78 -97 -150 -81 91 59 29
5499 29 163 75 -172 -126 -33 83 8 -44 -68 5 46 -10 -164 35 233 55 -149 123 -87 75 -102 -31 51 -15
5523 -15 75 -212 77 -34 -81 72 -46 109 194 26 -17 271 14 26 95 -101 8 212 -42 -55 61 -20 -214
5546 -214 -171 83 98 48 63 -119 189 -95 -63 -69 -37 -90 -86 73 -96 -33 16 -8 -41 262 -2 -158 83 -113 88
5571 88 -120 -185 -120 81 -77 16 32 -72 -41 -248 -194 -245 -117 49 198 120 -51 -24 59 -59 9 12 -40 -23 248
$$ packed form
5404g5K29l50K17k06K48j9j30J28M3l55M70l66J16j98L88n8k35K02L6J1k09L2
5426h1l2J32J86k12p9K3k3K59k46J63k12J75O5M2k63J69p5k87J75N9K11K14l48
5449A5p9J66j79K5K1K2o2J32l5k32J37K25J6j85J59k24o9J05Q6k90K35N2mj87
5473a50J54j02J63J22k68O9mM4j4K1KJ53l15J95K1L9j64l3M0n1j9n3O9J72l2l0
5499B9J34q8k47M6R3J16p5n2k4P3M1n6j54J99J98j78k04K72k10J62j77P1Q2o6
5523a5R0k87K89j11m7J53j18J55Q5j68m3K88k57J2O9j96J09K04k54j3J16q1j94
5546b14M3K54J5n0J5j82L08k84L2oL2n3MJ59j69O3M9k4l3L03k64j56K41j96K01
5571H8k08o5O5K01j58R3J6j04L1k07N4n1J28J66J49p8j71K7Q3j18O8Ln2J7K71
$$ plain form
5596 248 0 -36 110 -286 267 80 -69 46 -149 -56 -118 -108 121 -160 151 170 -9 -54 -25 28 162 162 -6
5619 -6 23 -85 153 72 184 -239 38 -265 -52 126 147 -147 -83 75 -239 61 -211 132 78 202 -21 -109 36
5642 36 -165 -20 -61 -121 -46 -43 -240 -72 90 -199 -13 -79 -163 -135 -112 98 109 -210 45 -89 -29 76 71 -236 -105
5667 -105 243 131 -97 31 49 273 58 -8 11 -41 -17 -232 56 -101 105 208 -126 88 -238 -53 37 -304
5689 -304 -60 75 -141 -186 -107 -79 238 -123 100 -122 -50 -146 69 -121 -220 -377 -84 57 -242 189 118 118 11
5712 11 19 -38 74 12 -222 -138 107 71 37 16 75 316 -57 161 43 -93 190 109 -30 -29 -78 193 140 9 -123
5737 -123 -20 185 140 38 -68 -128 319 94 37 -26 -34 -70 -125 -82 -28 -18 44 -17 15 -41 203 83 -68 76 37
5762 37 217 126 -204 -39 -100 -212 -96 -334 -63 133 -127 170 143 152 25 139 201 69 -148 55 -180 -92 -19
$$ packed form
5596B48k48l6J46l96N53j87j49J15j95R3o2J0K29k81L11J9j79m5K9N3J34%j68
5619fK9j08K38q1J12m23K77l03K13J78K1k94O4J58l14L00k72L43n4J24k23q8J45
5642C6k01J45m1o0P5Lj97J68J62k89J86o6q4K8K3K10J1l19K55j34O0J05nl07J31
5667a05L48j12k28J28J8K24k15o6J9n2K4k15K88j57K06J03l34K14l26J85R0l41
5689c04K44J35k16m5P9K8L17l61K23k22P2r6K15j90r9j57K93J41k99M31p1%j07
5712A1Qn7J12o2k34Q4K45l6l4k1N9K41l73K18j18j36K83q1j39Jm9K71n3j31j32
5737a23J03K05m5j02j06o0M47k25n7o3ql6n5M3N4J0O2o1L2n6K44j20j51J44l9
5762C7J80r1l30J65o1j12J16k38K71J96k60K97k7Rj27J14O2j32k17K03k35Q8P3
$$ plain form
5785 -19 193 90 56 -36 -70 -70 -141 124 -40 -150 -91 75 -135 -173 -164 119 -28 134 45 98 103 -56 85 -82 -86 19
5811 19 8 -201 -174 -65 -214 44 126 135 182 161 -26 14 397 75 -303 -296 76 136 -60 -3 73 -99 173 -172 261
5836 261 -148 -40 -356 19 -38 252 -165 41 120 68 -67 60 67 169 127 183 41 159 8 -140 -65 124 5
5859 5 -249 166 14 -164 -99 31 -90 -21 -113 48 -74 -130 59 -45 66 336 -92 -286 44 -85 -70 -106 -162
5882 -162 -133 313 168 71 2 -95 6 -226 169 17 -129 -105 -1 -17 -88 190 96 127 -89 -80 113 -2 72 -17
5906 -17 -45 -57 -82 -100 116 -276 -52 -153 -48 -18 -127 7 -253 180 107 21 65 174 22 48 15 12 167 194 -176
5931 -176 -183 119 33 124 -55 -118 -164 19 -46 48 167 82 -299 22 41 76 -35 -96 -87 -68 -116 150 -51 -252 19
5956 19 235 162 -229 279 -242 49 -72 99 55 45 -11 -92 96 95 -52 219 211 -277 5 -47 -92 -396 -13 8
$$ packed form
5785a9K12j03l4r2l4%p1K65j64j10N9J66k10l8RK83j47J62q9N3Nj59J41j67mJ05
5811A9j1k09K7J09j49K58Q2RM7k1j87M0L83l22l78PL72O0j96N7P6j72K72l45M33
5836B61m09J08l16L75n7K90m17K06P9n2j35J27PJ02m2N6j42J18j51j48P5J89j19
5859Ek54M15j52j78O5J30j21O9r2J61j22n6J89j04J11K70m28j94L30j29J5l6n6
5882a62K9M46j45r7o9r7J01k32L95j52j46K4J04j6p1K78r4L1k16RJ93j15P4q9
5906a7k8j2k5j8K16l92K24j01J05L0j09J34k60M33p3q6M4J09j52K6l3lJ55K7l70
5931a76pL02q6R1j79o3m6J83o5R4J19q5l81L21J9L5j11o1RJ9m8K66k01k01K71
5956A9K16p3l91N08n21K91j21J71m4j0n6q1J88jj47K71qm88K82n2m5l04L83K1
$$ plain form
5980 8 348 -68 -236 23 13 162 33 10 129 152 193 -20 -235 223 90 -4 -61 31 78 -23 -14 36 36 138 6
6005 6 -245 110 -187 51 -106 100 -114 103 49 -241 -88 -188 -199 -239 -43 -127 163 46 98 -51 16 -68 -115
6028 -115 145 -21 -52 100 -252 -2 75 -210 59 -48 -121 -166 -105 -265 -160 -44 59 -54 -46 -397 -17 54 69
6051 69 -3 -170 5 -175 -31 58 248 -50 -177 99 116 92 -12 22 40 -105 136 -51 -76 97 66 95 -246
6074 -246 -242 -37 -179 -25 93 -62 -7 -370 133 20 6 -158 -97 -24 90 234 89 143 -3 -114 -94 135 -56
6097 -56 98 -73 69 -63 -9 39 -74 81 -4 121 163 -83 -6 39 -11 -110 33 -20 118 -6 -130 37 -274
6120 -274 -94 -273 -182 114 -85 101 51 -39 -90 -90 -27 73 -244 105 14 -142 101 139 -8 -185 21 -153 122
6143 122 -92 -26 -127 29 -1 -120 -50 -63 104 -20 -45 -122 -264 133 72 -45 207 26 48 105 -14 -19 -100 -135
$$ packed form
5980HL40m16j68K59j0J49j29k3J19K3M1k13k15M58j33r4n7R2M7j01RN0%J02j32
6005Fk51L55k97K38j57K06k14K17n4k90J53j00j1m0J96q4K90j17N2j49O7q4m7
6028a15K60j66l1J52l52K50P7k85K69j07p3m5O1j60J05J16J03j13Ql51L80P1J5
6051F9p2j67J75j80J44Q9J90k98j27K76J7k4j04L4J8j45K41j87k5J73l1K9l41
6074b46MK05j42J54J18j55N5l63N03j13j4j64O1P3J14J44j45N4j46j11K0K29j91
6097e6J54j71J42j32N4M8j13J55q5J25M2k46P7M5n0r9J43n3J38j24j24J67l11
6120b74J80j79R1K96j99J86n0r0n1%O3J00l17L49r1j56K43L8j47j77K06j74K75
6143A22k14O6j01J56l0j19P0j3J67j24k5p7j42L97o1j17K52j81K2N7j19nq1l5
$$ plain form
6167 -135 18 106 -25 -44 -212 -96 179 56 176 56 -34 171 37 -17 9 60 -13 306 -43 -57 78 260 307
6190 307 121 -172 -12 12 -126 -45 -57 -57 72 16 -92 -13 18 128 99 -34 -37 23 -106 79 -136 92 -157 -86
6214 -86 13 -62 -36 -277 159 -39 63 -233 -113 -112 -50 117 -15 -16 -178 306 -35 95 56 41 -5 8 73 -32 -170
6239 -170 -318 -44 123 2 -6 -70 -22 124 19 214 2 -14 7 -69 -214 -71 -98 91 -166 129 64 -69 -193
6262 -193 -57 331 -17 -39 110 -9 -91 -3 -101 -56 110 33 79 20 33 -103 2 54 237 81 218 132 -46 145
6286 145 -103 30 214 226 186 -6 32 151 236 245 9 119 -24 62 15 -93 15 -3 81 -30 -24 98 -82 101
6310 101 65 -97 119 52 -170 205 38 203 148 3 4 149 -93 -90 -181 13 19 89 124 96 58 -34 36 114 -128 -81
6336 -81 53 14 -224 -51 20 205 40 -24 178 36 -6 293 53 106 93 -65 96 -137 -250 -20 -61 144 -54
$$ packed form
6167a35J53Q8j31j9j68J16K75j23J20j20r0K05j34n4K6N1p3L19l49j4J35J82M7
6190C07j86k93J60K4j38Q1j2%J29n6j08P9L1J10k9j33lO0j29J85k15K28k49P1
6214h6R9p5K6k41M36j98J02k96J20JO2J67j32jj62M84l41J30l9j5m6J3O5j05j38
6239a70j48K74J67j21qo4M8J46j05J95k12j6K1p6j45J43k7J89k57K95o5j33j24
6262a93J36L88l48k2J49j19q2Q8r8M5J66p7M6n9J3j36J05N2J83j56J37q6j78J91
6286A45k48J33J84J2m0j92L8J19Q5Rk36J10j43Q6m7j08J08j8Q4j11OJ22j80J83
6310A01l6j62K16o7k22L75j67J65n5j45JJ45k42Lr1J94OP0L5k8l8r2P0P8k42M7
6336h1J34l9k38J73P1J85j65o4K02j42m2K99k40N3j3j58J61k33j13K30m1K05j98
$$ plain form
6359 -54 146 -6 1 143 58 -88 11 126 -35 190 -339 253 34 -38 11 -148 -17 68 -121 -83 -87 170 94 -157
6383 -157 59 -51 -79 126 -128 -106 300 -120 -61 -116 50 -19 -361 -101 -11 253 -188 312 72 -203 -41 -49 199
6406 199 23 -15 165 179 55 -150 -25 93 -78 224 98 -53 74 24 34 -79 102 1 -124 -37 183 -26
6428 -26 48 62 16 10 94 -41 199 -186 1 95 116 132 -384 -255 59 46 -31 -193 45 94 48 99 -101 30 -54
6453 -54 -241 -27 -218 -170 -116 102 -34 53 -167 -50 88 226 -39 33 91 -212 97 204 -208 34 77 -91
6475 -91 36 -161 47 -70 72 -119 104 -15 -23 86 205 -9 -345 49 119 -231 -246 227 -147 -148 -221 -27 58
6498 58 -31 26 -167 35 162 192 -216 64 -63 91 -80 -178 231 -16 52 57 -136 73 27 -28 -127 29 -86 -17
6522 -17 -27 -59 206 102 31 -257 -69 -24 -188 -38 17 242 164 -47 12 108 -202 -122 73 -35 -40 -183 -60 148
$$ packed form
6359e4K00j52PJ42q5j46R9J15j61K25n29N92k19p2M9j59J31Q5j89L8mK57p6k51
6383a57K16j10k8K05k54K2M06m20N9n5J66o9l42K60R0K64m41N00k40k75J62qK48
6406A99j76l8J80J4j24k05J25J18j71L02j26j51J27n0J0j13J81j01j25Q7K20k09
6428b6P4J4m6oQ4j35K40l85J87R4K1J6n16J29L14j3p7j62K38M9m6N1k00J31q4
6453e4j87K14j91M8N4K18j36Q7k20J17J38J38k65P2N8l03L09J07m12K42M3j68
6475i1J27j97K08j17J42j91K23j19qJ09J19k14l36L94P0l50j5M73l74jp3J94Q5
6498E8q9N7j93K02J27L0m08K80j27J54j71r8M09k47O8Nj93K09m6n5r9J56j15O9
6522a7j0l2K65j04p1k88J88M5j64J50N5K25p8k11N9R6l10Q0J95j08nj43J23K08
$$ plain form
6546 148 149 274 94 -103 -116 -124 196 -131 -216 -191 -161 -21 136 80 -43 53 -93 133 37 1 -183 -110 187 30
6570 30 117 -128 -68 -76 74 277 31 56 105 -266 -5 -156 207 117 -62 -4 -12 5 18 170 138 -63 -169 369 114
6595 114 17 -94 45 -29 -127 -147 47 30 -291 53 204 59 9 58 49 277 163 -93 -17 176 39 200 -160
6618 -160 -136 36 158 155 9 -42 -225 31 -317 107 2 165 226 152 -23 205 -125 129 27 198 -61 138
6640 138 -17 -21 -86 193 45 -109 133 -33 95 21 295 34 234 -11 19 140 -57 71 86 -181 -68 -76 64
6663 64 -174 -320 -32 109 -69 93 -216 95 31 51 -176 -13 4 -87 119 -327 -18 170 180 26 109 8
6685 8 -115 161 -92 -136 -31 -177 141 49 49 150 40 -115 -63 300 292 110 243 92 28 187 91 69 162 266
6709 266 84 -79 -67 -282 235 -148 3 152 114 -12 160 -117 -72 200 -76 121 292 75 139 328 199
$$ packed form
6546A48JJ25j80j97j3qL20l27q5K5L0J40J57n6j23R6j46K26r6l6j84P3K97j57
6570C0Q7k45O0qJ50K03k46K5M9l71K61j51L63r0j79N8qJ7J3J52l2k01j06N38k55
6595A14r7j11J39p4r8k0J94j7l21L44J51j45n0M9rK28j14k56P6J93j37J61l60
6618a60K4J72J22lj46n1j83K56l48M24j05J63O1p4j75K28l30K54j02J71k59J99
6640A38j55mo5K79j48j54K42j66J28p4K74k61K00k45L0J21j97J28J5k67J13qJ40
6663F4k38j46K88J41j78J62l09L11o4K0k27J63J7r1K06m46L09J88J0j54Q3j01
6685Hj23K76k53m4J05j46L18r2%J01j10j55N2L63qj82J33j51o4J59r6k2R3J04
6709B66j82j63J2k15N17l83J51J49l8j26J72k77M5K72k76J97J71k17O4J89j29
$$ plain form
6730 199 -259 101 81 -144 123 35 127 12 188 147 -55 -102 -31 -293 121 16 1 -179 -31 -63 1 163 -9
6753 -9 126 -52 -26 -72 -44 -159 -157 105 -188 138 126 220 111 196 -13 -120 41 -109 -45 16 -266 -56 27 151
6777 151 -128 193 88 -102 -155 112 -76 -272 -70 -152 123 82 -284 -98 19 142 58 -90 78 -43 -141 30
6799 30 -206 -148 -88 -94 82 -202 153 4 21 140 114 90 -147 -36 6 31 -41 -81 87 -68 -102 272 -23 0 -68
6824 -68 226 46 92 31 -100 -137 76 6 -89 138 298 -231 262 -37 78 47 -320 57 150 215 0 -69 89
6847 89 315 111 102 -21 -286 -102 29 -208 262 -57 -52 -81 -32 211 18 -284 -179 48 -84 -127 -9 27 164
6870 164 -101 -68 242 -107 -45 -228 -53 164 -60 232 -133 -34 192 67 256 31 55 -1 -53 -120 114 -36
6892 -36 -128 202 -16 -57 -221 186 99 -166 18 137 -40 141 242 -16 28 113 -385 275 -135 -156 -61 -136 -48
$$ packed form
6730A99m58L60k0k25K67q8R2j15J76m1k02m7P1k62M14j05j5j80J48l2O4J62j72
6753iJ35j78K6m6K8j15KK62k93L26j2R4j09Q5k09j07J61j50O4O1k82K10Q3J24
6777A51k79L21j05j90n3K67j88j96K02q2K75m1l66J86J17J23q4j48J68j21r8J71
6799C0k36N8O0oJ76k84L55j49J7J19k6k4k37J11M2K5p2m0J68j55l4L74k95K3o8
6824f8K94j80M6o1j31l7K13p0r5K27J60n29M93k99J15l1l67L77R3O5k15o9J58
6847H9K26k04rj23k65J84J31k37M70l19Nk9M9K43j93l02J05K27j32m3J18L6J37
6870A64k65L3L10l49O2j83J75K17k24K92l65R9K26j25J89k25K4n6n2o7K34j50
6892c6r2L30k18m1j64M07q7k65J84J19j77J81J01k58M4Q5m98O60m10k1R5p5Q8
$$ plain form
6915 -48 171 91 59 14 9 273 -91 -120 58 -21 -130 -47 56 21 -186 -62 -28 130 90 -73 -166 -54 -56 -92 -45 -66
6941 -66 -98 -65 -36 -63 28 132 -52 67 -21 -29 141 -118 111 -60 -226 -97 77 -129 -298 -148 -48 65 -188
6964 -188 -144 -206 131 420 22 -211 -225 -333 152 -132 33 -30 -43 24 -76 -121 -165 -135 167 168 -57 -211 -49 -37
6988 -37 -115 45 -132 175 251 22 -208 55 -124 -14 177 -1 -55 168 20 -118 -22 162 -9 39 -24 35 -4
7011 -4 202 0 -194 -63 -155 -14 -130 -106 216 -204 3 71 87 -44 117 -135 -159 -162 215 48 -139 107 -146
7034 -146 194 104 -12 -147 -61 16 -211 97 -10 12 -3 83 99 -241 -75 59 87 -2 137 -235 -110 10 -42
7057 -42 -4 138 81 -19 57 -80 52 -175 147 200 66 56 129 -174 187 275 -207 -318 36 -173 -94 -80 209
7080 209 -113 75 50 190 -201 -121 113 -49 89 -3 87 87 -184 67 83 -163 149 -164 -38 -43 -133 84 9 47
$$ packed form
6915d8K19q0l2m5nK64l64k9J78p9j09Q3J03l5k07J24L4J58m0j63r3J12kl6M7k1
6941f6l2L3K9k7R1J04j84J19q8qJ70k59K29j71j66J29J74k06j69J50J00J13k53
6964a88M4o2L37K89l98k33j4j08M85k84J65o3j3O7j00m5m4L0L02Jk25j54J62J2
6988c7p8J60j77L07P6k29k30K63j79J10J91j78n4K23j48j38R6J84j71M8o3N9l9
7011dK06k02j94J31r2J41j16K4L22m20K07O8J6j31J61k52k4lL77j67j87K46k53
7034a46L40r0j16j35Q6P7k27L08j07K2j5Q6J6l40J66J34K8q9J39l72J25J20n2
7057d2L8J42n7j00P6j37J32k27L22N3j34j0P3l03L61Q8m82j11L54k09P9J4K89
7080B09l22J88k5J40l91Q0K34j62J38r2R0%k71K51J6k46L12l13J26nr0K17p5L8
$$ plain form
7104 47 -112 -87 168 -43 -70 -215 -118 12 44 -105 1 -7 89 -105 -209 116 -229 -82 112 -60 68 -205 71
7127 71 258 70 16 -35 62 246 304 -195 231 208 5 177 28 98 57 -37 -79 -169 133 66 21 155 -77 363
7151 363 -313 -151 183 -22 -46 -87 69 68 67 7 104 -297 -113 7 19 -117 -23 55 -22 -22 -151 -89 56 -59 29
7176 29 9 249 110 5 93 223 55 -212 120 -207 -104 61 14 -237 -27 97 86 49 0 268 -82 -39 -54
7199 -54 -153 79 124 -11 -105 -55 -73 235 -37 -146 -195 69 -117 97 -32 -86 -15 -72 46 -14 63 -22 80 13 198
7224 198 -113 99 -12 -103 98 9 68 -83 44 -19 -13 -159 176 152 -117 0 -5 -139 -26 -275 -182 -2 -237
7247 -237 100 8 194 152 208 5 -73 136 -45 -47 -12 -182 -244 59 17 30 87 -34 -108 82 180 -71 -263 25
7271 25 117 -103 -16 -3 -41 67 111 -146 -96 -19 -62 -61 67 -200 -363 20 -151 67 -39 215 89 -43 102 -116
$$ packed form
7104D7j59K5K55k11k7j45R7J30L2j49J06qR6j94j04L25l45J47J94j72J28k73K76
7127G1J87j88n4n1R7J84N8m99M26k3k03J72j49P0m1r4m2r0L02o7m5J34k32M40
7151C63o76J62L34k05k4m1J56jjo0R7m01J84J20J2j36R4P8p7%j29O2J45j15Q8
7176B9k0K40j39j05Q8J30j68k67L32l27J03J65m7k51K10J24j1l7m9K68l50M3j5
7199e4r9K32M5j35r4N0j8L08k72j09m9K64j86K14j29n4P1n7J18o0P7q5J02o7J85
7224A98l11K12j11r1K01q9N9j51J27o3Oj46L35k4k69J17nj34J13k49R3J80k35
7247b37L37r2J86m2N6k03p8K09j81kL5j70o2L03m2J3N7j21p4J90R8k51j92K88
7271B5R2k20Q7J3l8J08M4k57N0P7m3JJ28k67j63L83j71K18j06K54j26j32J45k18
$$ plain form
7295 -116 26 -13 152 -78 -189 -126 -57 -204 121 -10 -105 11 102 -189 70 -135 -212 125 40 420 62 -198
7317 -198 -3 223 14 -150 298 303 -138 238 144 -33 107 -152 -142 66 -26 -66 162 -205 -12 147 7 -89
7339 -89 64 -10 155 -214 8 -156 -110 -28 -109 118 28 215 64 146 107 -102 242 148 73 43 -64 24 -258 -70
7363 -70 -77 -105 -78 -93 57 152 -214 22 -92 -14 -45 169 149 115 39 13 -9 136 221 35 16 -206 103 54 8 -69
7389 -69 -45 100 -37 133 153 -171 -296 -148 70 -30 -233 73 145 -85 38 -130 -79 -180 51 -10 -274 243
7411 243 83 66 -218 28 -37 -121 318 118 -96 236 -79 -61 273 244 72 -14 210 186 -114 97 123 -128 86
7434 86 -30 28 -113 -283 17 -10 106 256 -3 271 -28 192 202 -43 108 -205 -51 27 -236 101 132 50
7456 50 -118 68 125 -158 188 146 -38 67 94 272 -165 96 -83 -65 -177 12 178 -140 156 40 74 -14
$$ packed form
7295a16J42l9J65k30j11O3O9j47L25j31r5J16R1k91K59k05p7L37q5L80l58k60
7317a98J95K26k09j64M48Nm41L76r4j77J40k59J0K08r2m0K28l67J93J59j40r6
7339h9J53p4J65l69K22j64M6Q2q1K27r0J87j51Q2l9k09L44r4p5l0j07Q8k82J88
7363g0pk8K7j5J50R5l66K36j14P8l1K14k0l4p6k6k2J45Q5j86j9k22L09m9m6p7
7389f9K4J45j37J70K0l24j25J48K18j00k03L06P2k30J23j68N1j01K31o1k64N17
7411B43j60j7k84K46o5q4M39k00k14L32l15J8L34k9j72q6K24k4l00K11K6k51K14
7434H6j16N8j41j70L00k7J16J50k59K74k99K20J0k45J51l13J54P8k63L37L1q2
7456E0j68J86N7k83L46m2j84J05K7J78m37K61j79J8j12J89J66l18K96j16L4q8
$$ plain form
7478 -14 -65 -213 -153 203 176 79 167 1 -6 -160 85 168 -33 119 -19 -37 -248 375 10 -22 -155 -48 147 -115
7502 -115 404 89 -124 104 -147 -56 -37 -235 197 -244 -79 -40 -85 -108 -137 -51 -11 39 -101 20 -195 -138 -195 -175
7526 -175 -84 -263 141 86 91 81 77 -32 -93 -38 32 220 -46 94 61 59 -163 -169 117 339 -107 43 73 -38 -115 -81
7552 -81 -60 95 5 -11 54 -172 -101 32 -218 -329 193 -31 53 -230 128 11 119 -96 134 161 17 169 -61
7575 -61 -78 -150 -17 -58 51 -13 -12 149 3 -121 312 175 45 -106 67 26 73 209 39 -139 -44 -315 -224 -86
7599 -86 151 101 24 53 276 -90 -154 -3 125 158 104 -34 -39 -138 -113 -56 -23 253 93 35 147 46 -121 11 -83
7624 -83 75 17 30 -119 51 69 71 13 -199 -166 -307 50 272 -30 -171 8 97 34 -26 180 -52 32 -28 -170
7648 -170 -117 -33 171 -72 44 78 220 48 81 -128 -164 -146 38 35 -137 113 -130 278 -8 0 121 38 -71 -20
$$ packed form
7478a4n1j48O0L56k7r7Q8j66pj54K45Q3k01J52j38j8k11O23l65l2j33J07J95k62
7502a15N19l15k13K28k51R1J9j98M32m41J65L9m5k3k9Q6M0N0j40J21k15N7n7K0
7526a75R1j79M04n5Nj0mj09o1N5P0J88k66J40l3kk22oK86K22m46J50L0j11p7L4
7552h1K1J55r0j6O5k26P1J33k50j11N22k24Q4k83L58j17J08k15K30K7j44J52k30
7575f1j7p2J33m1J09o4JJ61j46j24M33j37j30j51J73m1M7J36j70j78R5k71R1J38
7599h6K37n0p7K9K23l66o4J51J28L3n4j38nr9K5N7L3K76j60n8J12j01j67J32r4
7624h3J58n8J3j49J70J8Kn8k12L3j41L57K22l02j41J79Q9o3o0K06k32Q4o0j42
7648a70N3Q4K04k43J16L4J42j72L3k09l6J8J84lj72K50k43M08k86QJ21q3j09N1
$$ plain form
7672 -20 16 180 57 -101 -93 -191 -96 -242 55 105 -81 92 -45 -41 -268 -280 -65 117 54 216 129 -47 127 90
7696 90 -54 50 -258 134 171 -85 -201 -188 -87 -79 -133 -10 1 168 -111 30 223 -86 56 -14 -63 34 87 -98
7720 -98 -61 -57 23 31 79 -7 15 81 66 -57 -5 149 225 89 -25 -21 190 -75 96 -75 14 -81 -121 26 -60 -171 53
7747 53 -58 -117 -33 162 -161 4 -11 -28 -61 84 261 235 6 -23 -102 132 -19 -170 31 -176 55 16 -56 60
7771 60 90 -24 3 30 14 261 -89 252 -19 -156 84 159 9 182 47 134 331 -302 88 -68 70 94 111
7794 111 -64 -42 -40 81 47 -131 -66 -9 6 129 -84 -90 -126 148 -133 39 75 -41 86 -45 -42 -159 -135 95 -69
7819 -69 144 59 23 157 -70 -198 -123 -258 192 -84 36 5 111 56 -40 115 -155 -4 117 -113 -82 132 -7
7842 -7 -124 -31 66 -216 150 46 -154 -74 172 129 201 97 -120 -142 -135 174 87 -76 -67 149 -117 158 -224 -197 25
$$ packed form
7672b0L6J64j23j58Qr8R5j46K97N0j86J73j37Mk27j2K15J82o3J62q7j76J74l7
7696I0j44J04l08L92L7k56j16J3J01Qn4J23J1J67k79J41J93l09J42p0m9R7N3j85
7720i8L7MQ0QM8q6K2O6j5j23N2J54P6j36j14MK11k65J71j71Q9r5m0J47q6j11K24
7747E3j11n9Q4J95l23J65j5j7l3J45J77k6k29k9p9K34j51j51K01k07K31l9p2J16
7771F0L0j14K7K7j6K47l50L41k71j37K40P5j50J73j35Q7J97o33L90j56J38K4J7
7794A11j75K2KJ21l4j78O5N7J5J23k13ol6K74k81J72L6j16J27j31Lj17K4K30j64
7819f9K13q5l6J34k27j28P5j35M50k76J20l1J06n5r6J55k70J51J21k30L1K14j39
7842gj17R3R7k82L66j04k00Q0K46m3P2j04k17k2PL09q7j63RK16k66K75l82K7K22
$$ plain form
7867 25 -394 195 94 -228 -80 -46 -198 -61 50 -102 121 88 -23 -56 75 56 -28 22 -114 -233 30 157
7889 157 75 -15 202 -25 -155 -305 8 -106 158 -30 127 16 70 88 108 -70 -185 -131 -100 -131 -156 -103 149
7912 149 -96 22 120 70 -3 -49 -22 72 -142 -330 -33 146 106 139 -152 130 115 262 -90 65 33 -51 -50 60
7936 60 90 -106 57 17 117 -29 35 173 -83 138 18 204 -61 207 117 -240 -9 -114 481 -207 -71 57
7958 57 -81 139 43 -26 50 269 75 -97 225 -98 -41 -55 9 57 -118 88 120 133 -81 44 -59 -164 42
7981 42 -84 -33 43 8 82 68 -204 -254 -166 -24 -67 10 -85 -182 -184 -31 -33 -81 60 -176 158 4 71 181 15 142
8007 142 30 65 7 -47 -93 172 -81 76 134 76 207 -5 411 -16 215 -14 -38 229 -23 6 -196 -63 77
8030 77 -27 -175 -78 -105 6 45 55 -15 -25 41 -87 4 -84 87 34 -91 -190 -26 -136 197 275 229 -150 -59 92
$$ packed form
7867B5m19N89j01l22J48L4j52J37J11j52K23l3j11l3J31j9q4N0j36j19K63J27
7889A57q2r0K17k27j30j50L13j14K64j88J57j11N4J8K0j78j15N4L1l1k5N3K52
7912A49k45J18R8n0p3m6K7R4k14j88K97J79m0L3k91K82j5J47l52J55l2q4JJ10
7936F0L0j96J63m0J00j46O4J38k56K21j20J86k65K68r0l57K31j05N95o88J36J28
7958E7j38K20r6o9P6K19j94j72L22l23N7j4O4M8j75K06L2J3k14J25j03j05K06
7981D2j26N1P6l5P4j4k72n0Q8J42m3P7r5r7kJ53km8J41k36L34j54O7J10j66J27
8007A42j12L5n8n4m6K65k53J57N8n8J31k12M16m27K31k29k4K67k52K9k02J33J40
8030G7j04j48R7k7J11L9J0p0j0O6j28R1q8J71n3j25r9J64j10L33P8m6l79R1J51
$$ plain form
8055 92 164 1 -29 -50 -29 -61 -275 -60 99 93 -383 179 43 16 126 -145 155 -12 18 215 24 -393 180
8078 180 155 -99 2 -80 -57 140 -129 -73 22 111 106 -55 246 -129 64 -62 -75 -23 115 36 -251 -1 149 -173
8102 -173 195 31 150 278 -108 -130 -211 27 66 53 44 133 79 -70 -310 -46 -80 224 193 -88 -120 -204 -17 -17 88
8127 88 -107 53 -216 -63 21 98 -80 231 209 -71 58 -131 17 -97 -107 21 91 -125 -83 160 -139 155
8149 155 -101 -4 -21 -54 -21 93 -169 90 98 51 -170 30 -97 -19 110 -86 25 6 163 -150 -120 178 -84
8172 -84 -79 -128 -71 102 -89 -173 168 -216 3 182 104 130 -143 26 91 -25 96 166 13
$$ packed form
8055I2P2j63l0k1K1l2k14K15J59om76N62j36k7J10k71L00j67L0J97j91m17N73
8078A80k5k54J01q2K3J97k69N6R5Q9nj61L01l75J93j26j3N2J38p9k87K50J50l22
8102a73L68j64J19J28l86k2q1K38L9j3rQ9n4j49k40K64l4L04l1k81l2q4J87%J05
8127H8j95J60k69J53Q4P7j78L11k2k80J29j89J48j14j0J28P0k16M2K43k99K94
8149A55k56R7j7l3L3J14k62K59Qm7k21K00j27P8J29j96J11j9J57l13L0K98k62
8172h4Nm9N7J73j91q4L41l84K19J79p8K6k73J69O5j16J21P0j53
8191A3
$$ Imaginary data points
##PAGE= N=2
##DATA TABLE= (X++(I..I)), XYDATA
$$ plain form
0 0 0 0 0 0 0 0 0 0 0 0 0 0 0 0 0 0 0 0 4 -8 8 -8 8 -8 8 -16 16 -16 24 -24 27 -32 35 -40 46 -51 57 -64 72 -81
40 -81 90 -99 111 -122 135 -150 164 -182 202 -219 242 -267 295 -324 360 -400 441 -493 552 -620
60 -620 706 -809 939 -1111 1345 -1696 2256 -3330 6129 -28877 -66785 -30165 -7629 20182
74 20182 53381 95213 113936 118855 111409 96502 71446 48503 27844 18904 22557 30022 29126 26759
88 26759 23712 8813 -23803 -52750 -67416 -78562 -88366 -78669 -50824 -25806 -10932 6712 23703
101 23703 26964 18966 16669 20487 24163 29041 39130 49328 54995 53200 41989 25586 11086 -5065
115 -5065 -24780 -36057 -33702 -32281 -37245 -36439 -30357 -33774 -45404 -49108 -44512 -41232 -37607 -24778
129 -24778 -6235 8729 17482 23846 29403 30613 26328 20531 19985 22589 21776 17433 16506 16303 9518
$$ packed form
0@%%%%%%%%%%%%%%%%%%Mj2J6j6J6j6J6k4L2l2M0m8N1n9O7p5Q6r7J08j21J36j53
40h1J71j89K10k33K57k85L14l46L84m21M61n09N62o19O84p60Q41r34J045j172
60f20J326j515J748k050K456l041L952n586R459l5006l7908L6620K2536K7811
74B0182L3199M1832J8723M919p446j4907k5056k2943k0659q940L653P465q96k367
88B6759l047j4899l2616k8947j4666j1146r804R697K7845K5018J4874J7644J6991
101B3703L261p998k297L818L676M878J0089J0198N667j795j1211j6403j4500j6151
115e065j9715j1277K355J421m964Q06O082l417j1630l704M596L280L625J2829
129b4778J8543J4964Q753O364N557J210m285n797n46K604q13m343r27k03o785
$$ plain form
144 9518 -3089 -10117 -11104 -14277 -18448 -15397 -6198 -2089 -4461 -4720 -2062 -3701 -8227 -6734 2737
159 2737 12779 20465 28083 36247 39916 33512 20796 11543 5027 -4847 -13248 -10627 -2821 -1012 -2966
174 -2966 -2670 -4243 -14252 -27128 -33498 -32343 -30412 -26678 -15858 -1265 8127 9465 8230 7212
188 7212 2914 -5412 -8630 -3166 5779 12281 18703 26763 29650 21967 8508 -1638 -10103 -20196
202 -20196 -25896 -20955 -10671 -2841 2552 8043 11048 6124 -3508 -11132 -13714 -14216 -13410 -7541 4181
217 4181 13959 16603 16670 16983 13437 4751 -2943 -3492 -1974 -1906 -626 4362 7995 5264 -303 -3980 -5534
234 -5534 -9065 -12243 -9298 -1962 3106 4777 7613 10895 9942 4034 -87 -537 -285 -2439 -2117 2629
250 2629 6760 5005 2634 3349 2565 -2321 -7258 -7817 -6907 -9309 -12210 -11390 -8390 -8628 -9841 -6590 -644
$$ packed form
144I518j2607p028r87l173m171L051R199M109k372k59K658j639m526J493R471
159B737J0042P686P618Q164L669o404j2716r253o516r874q401K621P806J809j954
174b966K96j573j0009j2876o370J155J931L734J0820J4593R392J338j235j018
188G212m298q326l218N464Q945O502O422Q060K887p683j3459j0146q465j0093
202b0196n700M941J0284P830N393N491L005m924r632p624k582n02Q06N869J1722
217D181R778K644O7L13l546q686p694n49J518O8J280M988L633k731n567l677j554
234e534l531l178K945P336N068J671K836L282r53n908m121m50K52k154L22M746
250B629M131j755k371P15p84m886m937n59R10k402k901Q20L000k38j213L251N946
$$ plain form
267 -644 3428 3409 5650 9746 9054 3510 51 223 -335 -2613 -786 5815 10874 11067 9874 9655 6771
284 6771 -1739 -9765 -12613 -12157 -12515 -11072 -4766 2074 3813 2076 1099 155 -3713 -8382 -7174 -1416
300 -1416 4509 7737 12801 17912 17309 10532 3759 -75 -3772 -7707 -6932 -683 6251 9219 9216 9199 5450
317 5450 -3700 -13837 -18670 -18953 -18542 -14738 -5831 4571 9975 10663 9527 6556 711 -6804 -10280
332 -10280 -7538 -3073 654 6243 12892 15502 11775 5837 1349 -3051 -8510 -11413 -8119 -2972 304
347 304 1484 3358 3913 -490 -7387 -10402 -10083 -9391 -8320 -2783 5403 9849 9861 9157 8521 5069 -846
364 -846 -4020 -2767 -155 708 2780 7371 9615 6695 2566 1074 -845 -4594 -7538 -5934 -2802 -2643
380 -2643 -3882 -3092 -1706 -3352 -6353 -5661 -1815 231 1139 3476 7061 7021 3223 865 623 -418 -2218
$$ packed form
267f44M072j9K241M096o92n544l459J72n58k278J827O601N059J93j193k19k884
284F771q510q026k848M56l58J443O306O840J739j737r77r44l868m669J208N758
300a416N925L228N064N111o03o777o773l834l697l935P75O249O934K968lj7l749
317E450r150j0137m833k83M11L804Q907J0402N404O88j136k971n845p515l476
332a0280K742M465L727N589O649K610l727n938m488m400n459k903L294N147L276
347C04J180J874N55m403o897l015L19O92J071N537Q186M446J2p04o36l452n915
364h46l174J253K612Q63K072M591K244k920m129j492j919l749k944J604L132J59
380b643j239P90J386j646l001O92L846K046R08K337L585m0l798k358k42j041j800
$$ plain form
397 -2218 -1653 3061 7447 7723 7060 8038 6407 581 -4743 -5945 -5793 -6450 -5722 -2129 1678 1755 -951
414 -951 -2745 -3397 -6519 -9661 -8587 -3602 401 2340 4970 7505 6274 1267 -3441 -4980 -5613 -5944
430 -5944 -3137 3140 9134 11591 10902 9573 5381 -1657 -9200 -12128 -11362 -9371 -6230 -134 6545 9446
446 9446 7463 4552 1379 -3127 -8832 -10401 -6674 -1827 1785 5813 10935 12874 9429 5264 2189
461 2189 231 -2590 -3296 31 5139 7239 6475 6266 4887 -211 -7069 -10256 -10080 -9543 -8619 -4291 1231
478 1231 3944 2584 666 -911 -3987 -8983 -10746 -7718 -3875 -1003 2595 7823 10760 8994 6102
493 6102 4197 2396 -894 -3685 -2556 -35 746 -2 727 1751 -349 -3530 -4980 -4139 -4360 -5344 -4173
510 -4173 -1580 -573 -1196 -1534 98 1087 129 737 4021 6669 7344 7501 8868 9207 6815 4115 3621
$$ packed form
397b218N65M714M386K76o63R78j631n826n324j202J52o57P28L593L807P7k706
414i51j794o52l122l142J074M985M003J939K630K535j231n007m708j539o33l31
430e944K807O277N994K457o89j329m192p038p543k928P66J991L141O096O679K901
446I446j983k911l173m506n705j569L727M847L612M028N122J939l445m165l075
461B189j958k821p06L327N108K100p64k09j379n098o858l187J76N37R24M328N522
478A231K713j360j918j577l076m996j763L028L843K872L598N228K937j766k892
493F102j905j801l290k791J129K521P81p48P29J024k100l181j450Q41k21r84J171
510d173K593J007o23l38J632R89r58O08L284K648O75J57J367L39k392k700m94
$$ plain form
527 3621 3729 2142 747 1025 1944 309 -2719 -4165 -4336 -5410 -7752 -7106 -4970 -3256 -3748 -3815 -2594
544 -2594 -2672 -4776 -6189 -4659 -2385 -1238 834 5110 8647 7741 5853 4609 2697 -968 -4266 -4788
560 -4788 -2465 -1227 -649 1585 3730 3401 207 -2310 -3197 -4780 -6702 -5989 -2196 1237 2264 3693
576 3693 5535 6031 3305 645 730 1545 1072 1493 4264 7314 6391 4221 2533 636 -2895 -6781 -7010
593 -7010 -5151 -3803 -2507 57 3298 3594 1341 -695 -1345 -2628 -4703 -4759 -1928 822 2429 3444
609 3444 5550 6339 4067 1299 112 -456 -2632 -4182 -3462 -1870 -2489 -3596 -3365 -2330 -2817 -4489 -3738
626 -3738 -1426 -903 -696 73 1619 2106 1141 597 2026 3033 2524 2975 5065 6363 5762 4214 4024 3395
644 3395 1194 -1093 -1752 -790 -1523 -2801 -2625 -1806 -2702 -4256 -4401 -3115 -2208 -2338 -1149 1323 2489
$$ packed form
527C621J08j587j395K78R19j635l028j446j71j074k342O46K136J714m92o7J221
544b594p8k104j413J530K274J147K072M276L537r06j888j244j912l665l298n22
560d788K323J238N78K234K145l29l194k517q87j583j922P13L793L433J027J429
576C693J842M96k726k660Q5Q15m73M21K771L050r23k170j688j897l531l886k29
593g010J859J348J296K564L241K96k253k036o50j283k075n6K831K750J607J015
609C444K106P89k272k768j187n68k176j550P20J592o19j107K31J035m87j672P51
626c738K312N23K07P69J546M87r65n44J429J007n09M51K090J298o01j548j90o29
644C395k201k287o59R62p33j278J76Q19q96j554j45J286R07j30J189K472J166
$$ plain form
661 2489 1594 760 806 446 -1415 -2062 168 2554 3209 3884 5714 6199 3896 276 -1921 -3385 -5642
678 -5642 -6995 -5566 -2586 -290 60 1384 2562 1641 -1588 -3476 -2909 -2706 -2521 -771 2974 5126
694 5126 4880 4135 4143 2785 -243 -2470 -1927 -247 -108 563 2532 3597 2027 -836 -2757 -4093 -6004
711 -6004 -7123 -5542 -2079 854 2189 4062 5658 4345 1530 -305 -955 -1113 -1585 -798 1998 4535
727 4535 4732 4330 4357 2936 2 -2699 -3412 -3389 -3520 -3595 -1819 -511 -772 -2321 -2657 -2380 -3311 -3896 -2766
746 -2766 -113 1374 2019 2606 3924 3795 1759 511 456 645 171 447 2243 3260 2963 1571 1114 718
764 718 -1527 -3656 -3584 -2627 -2620 -2864 -1986 -137 -65 -1193 -846 227 673 410 1225 3024 3933 2854 2036
783 2036 2138 1562 -575 -1361 -502 697 500 445 1277 1750 136 -2495 -3504 -4114 -5360 -5973 -4157 -2129
$$ packed form
661B489q95q34M6l60j861o47K230K386O55O75J830M85k303l620k197j464k257
678e642j353J429K980K296L50J324J178r21l229j888N67K03J85J750L745K152
694E126k46p45Qj358l028k227N43J680J39O71J969J065j570k863j921j336j911
711f004j119J581L463K933J335J873J596j313k815j835o50j58m72P87K796K537
727D535J97m02K7j421k934k701p13K3j31p5J776J308k61j549l36K77r31n85J130
746b766K653J487O45N87J318j29k036j248n5J89m74K76J796J017k97j392m57l96
764G18k245k129P2R57Pk44Q78J849P2j128L47J073M46k63Q15J799R09j079q18
783B036J02n76k137p86Q59J199j97n5Q32M73j614k631j009o10j246o13J816K028
$$ plain form
801 -2129 -359 307 1485 2975 2140 855 77 526 855 571 1066 3074 4274 3150 2048 1395 704
818 704 -1587 -2947 -2503 -1568 -1124 -833 82 637 -581 -2368 -2996 -2963 -3218 -3356 -1357 1972 3998 4843
836 4843 5527 6333 5296 2930 1203 582 104 -457 -320 1387 2399 1744 943 56 -1099 -3324 -5696
853 -5696 -5582 -5312 -4884 -4697 -3502 -1672 -1364 -1684 -1473 -598 -588 -964 170 2143 3386 3294 3508 4394 3568
872 3568 1853 582 265 294 -338 -954 479 1559 913 -510 -480 -193 -1540 -2681 -2581 -1292 -1126 -1157
890 -1157 232 2111 2213 1865 1982 2994 2941 2016 1599 2322 2152 463 -254 56 -238 -1628 -2191 -1530 -1163
909 -1163 -1563 -2077 -1468 -1405 -2009 -3241 -3052 -1970 -1954 -2362 -1100 881 1200 1165 1575 2211 1940 342 420 1036
929 1036 1201 424 448 1129 1007 -261 -1261 -1299 -1455 -2251 -2005 -806 388 770 627 1074 1304 499 -760
$$ packed form
801b129J770O66J178J490q35j285p78M49L29k84M95K008J200j124j102o53o91
818G04k291j360M44R35M44K91R15N55j218j787o28L3k55j38J999L329K026Q45
836D843O84Q06j037k366j727o21m78n61J37J707J012o55q01q87j155k225k372
853e696J14K70M28J87J195J830L08l20K11Q75J0l76J134J973J243r2K14Q86q26
872C568j715j271l17K9o32o16J433J080o46j423L0K87j347j141J00J289J66l1
890a157J389J879J02l48J17J012n3r25m17P23j70j689p17L10k94j390n63O61L67
909a163m00n14O09O3o04j232J89J082J6m08J262J981L19l5M10O36k71j598P8O16
929A036J65p77K4O81j22j268j000l8j56p96K46J199J194L82j43M47K30q05j259
$$ plain form
948 -760 -726 -74 286 561 2010 3427 4132 3559 2766 2831 1472 -395 -1457 -1256 -1094 -1372 -1558 -386 -87
967 -87 -854 -1576 -1514 -1611 -2472 -2959 -2335 -1088 -942 -918 -390 608 63 -842 -646 436 704 517 886 2187 2605
988 2605 1520 888 1164 354 -781 -1423 -690 -210 -501 -221 807 1468 947 257 -79 38 -886 -1394 -1091
1007 -1091 -24 70 -206 131 743 930 146 505 1229 1152 275 554 1162 818 -312 -745 -594 -350 -1087 -684
1027 -684 196 996 767 373 787 130 -623 -1716 -1758 -1405 -1228 -1163 -435 628 680 305 364 590 432 -642
1047 -642 -560 170 934 705 474 928 1433 79 -523 -311 -297 -218 -433 470 1226 1166 788 447 110 -912 -2208
1068 -2208 -2522 -1156 -1001 -884 306 1521 1717 1014 666 546 -169 -1415 -1557 -453 248 524 566 1799
1086 1799 1887 1131 108 -67 -33 -513 -1151 -436 407 693 -96 -106 -24 -617 -1424 -1567 -687 -378 -390 -36 1323
$$ packed form
948g60L4O52L60K75J449J417P05n73p93O5j359j867j062K01J62k78j86J172K99
967h7p67p22O2r7q61m87O24J247J46K4N28R98n45r05J96J082K68j87L69J301M18
988B605j085o32K76q10j135o42P33M80k91K80J028O61n21o90l36J17r24n08L03
1007a091J067R4k76L37O12J87p84L59P24p7q77K79O08l44j130m33J51K44p37M03
1027f84Q80Q00k29l94M14o57p53j093m2L53J77O5P28J063N2l75N9K26j58j074
1047f42Q2P30P64k29k31M54N05j354o02K12J4P9k15R03P56o0l78l41l37j022j296
1068b208l14J366J55J17J190J215J96p03l48j20p15j246j42J104P01K76M2J233
1086A799Q8p56j023j75L4m80o38P15Q43K86p89j0Q2n93q07j43Q80L09j2L54J359
$$ plain form
1107 1323 1623 728 412 201 -313 -1101 -1434 -694 268 628 871 1348 1890 993 15 -122 97 -844 -1305 -995
1127 -995 -97 -28 -211 -276 257 160 -729 -801 -351 34 -272 -115 541 693 119 -273 63 121 -305 -423 791
1148 791 1119 882 651 1191 954 229 -752 -863 -773 -797 -1017 -520 213 218 -125 -421 98 155 -690 -948 -247 53
1170 53 -180 -273 490 619 84 -434 -127 499 106 76 749 1461 778 543 302 206 -446 -1139 -1191 -476 -496 -209
1192 -209 332 1218 1179 447 6 -10 -199 -1091 -978 -299 173 -123 334 851 1326 877 301 495 329 -8 -128
1213 -128 133 680 675 -79 382 387 -336 -952 -723 -275 -89 -341 -126 546 213 -470 -1133 -1143 -1346 -1766 -1839 -1139
1235 -1139 -413 -320 -377 493 954 455 266 147 439 99 110 347 1070 1155 1096 1270 1650 1631 830 776 971 594
1257 594 77 -241 -87 48 -535 -1117 -768 -659 -794 -1098 -380 9 -198 -133 24 274 222 -110 149 326 600
$$ packed form
1107A323L00q95l16k11n14p88l33P40R62L60K43M77N42q97r78j37K19r41m61L10
1127i95Q98O9j83o5N33r7q89p2M50L85l06J57O56J52n74l92L36N8m26j18J214
1148G91L28k37k31N40k37p25r81j11R0k4k20M97P33Nl43k96N19N7q45k58P01L00
1170E3k33r3P63J29n35n18L07O26l93l0O73P12o83k35k41r6o52o93n2P15k0K87
1192b09N41Q86l9p32m41j6j89q92J13O79M72k96M57N17M75m49n76J94j66l37j20
1213a28K61N47np54M61Np23o16K29M48J86k52K15O72l33o83o63j0k03m20p3P00
1235a139P26R3n7Q70M61m99j89j19K92l40J1K37P23Q5n9J74L80j9q01n4J95l77
1257E94n17l18J54J35n83n82L49J09j35l04P18L89k07O5J57K50n2l32K59J77K74
$$ plain form
1278 600 451 605 1056 1021 726 306 458 219 -373 -759 -615 -565 -1145 -1533 -1646 -1501 -1801 -1955 -1491 -1092 -750
1299 -750 -1332 -176 168 371 -205 37 463 348 268 599 1465 1651 1530 1949 1748 1905 1253 594 571 360
1319 360 -426 -457 30 145 -257 -637 -103 -180 -597 -720 -410 -38 -90 3 396 765 577 313 177 374 345 -284
1341 -284 99 645 822 554 566 530 160 -614 -1246 -1501 -1411 -1754 -1724 -1436 -975 -782 -854 -843 -369 -851 -848 -602 -45
1364 -45 246 96 679 1349 1237 1416 1458 1923 1346 947 938 1355 1257 734 408 428 76 -681 -1031 -887 -558 -761
1386 -761 -1046 -524 -394 -290 -726 -524 -204 -461 -849 -500 508 681 444 804 1212 1422 876 792 1143 919
1406 919 275 -1 -213 -170 -567 -1192 -726 -1025 -1400 -1889 -1370 -966 -1069 -1052 -538 -261 -340 -908 -383 -30 241
1427 241 -189 389 1057 1509 1266 1536 1644 1480 727 355 378 115 -120 -346 60 151 -321 -548 -118 -423 -1004
$$ packed form
1278F00j49J54M51l5k95m20J52k39n92l86J44N0n80l88j13J45l00j54M64L99L42
1299g50n82J156L44K03n76K42M26j15q0L31Q66J86j21M19k01J57o52o59k3k11
1319C60p86l1M87J15m02l80N34p7m17j23L10L72n2R3L93L69j88k64j36J97k9o29
1341b84L83N46J77k68J2l6l70p74o32k55R0l43L0K88M61J93p2J1M74m82LK46N57
1364d5K91j50N83O70j12J79M2M65n77l99rM17r8n23l26K0l52p57l50J44L29k03
1386g61k85N22J30J04m36K02L20k57l88L49J008J73k37L60M08K10n46q4L51k24
1406I19o44k76k12M3l97o25M66k99l75m89N19M04j03J7N14K77p9n68N25L53K71
1427B41m30N78O68M52k43K70J08j64p53l72K3k63k35k26M06R1m72k27M30l05n81
$$ plain form
1448 -1004 -964 -730 -286 -509 -387 -122 569 137 -34 -267 58 82 141 123 814 1057 747 629 583 366 -100
1469 -100 -606 -523 -700 -931 -924 -438 -164 -44 -129 -116 225 -366 -582 -332 122 -32 154 498 748 691 350 90
1491 90 495 285 -63 61 289 423 5 -258 -99 -125 -193 -1132 -495 -275 -309 -493 203 298 438 -17 109 370
1513 370 -127 -366 -377 161 347 -12 12 472 38 -9 -180 -23 -138 -531 -249 -259 -104 -170 -595 118 55 -20
1535 -20 -248 133 760 667 641 574 506 591 31 -121 143 -10 -182 -403 -44 -98 -301 -476 -45 -157 -783 -675
1557 -675 -400 -481 -724 -384 -58 372 418 222 616 790 777 504 890 975 723 675 479 475 255 -110 -303 -355 -608
1580 -608 -868 -654 -588 -245 -659 -548 -702 -547 -852 -1052 -662 -309 -62 179 402 1069 1049 751 953 1056 1171
1601 1171 361 574 548 353 121 -143 -34 -7 -641 -1042 -794 -981 -1387 -1229 -812 -494 -488 -716 -379 19 -29
$$ packed form
1448a004M0K34M44k23J22K65O91m32j71k33L25K4N9j8O91K43l10j18m6k17m66
1469a00n06Q3j77k31PM86K74J20q5J3L41n91k16K50M54j54J86L44K50n7l41k60
1491I0M05k10l48J24K28J34m18k63J59k6o8r39O37K20l4j84O96R5J40m55J26K61
1513C70m97k39j1N38J86l59K4M60m34m7j71J57j15l93K82j0J55o6m25P13o3p5
1535b0k28L81O27r3k6o7o8Q5n60j52K64j53j72k21L59n4k03j75M31j12o26J08
1557f75K75q1k43L40L26M30M6j96L94J74j3k73L86Q5k52m8j96mk20l65j93n2k53
1580f08k60K14O6L43m14J11j54J55l05k00L90L53K47K41K23O67k0k98K02J03J15
1601A171q10K13k6j95k32k64J09K7o34m01K48j87m06J58M17L18Ok28L37L98m8
$$ plain form
1622 -29 -94 605 985 839 984 1058 1715 1328 865 1107 1100 664 214 53 -18 -336 -659 -706 -401 -851 -1131 -1016
1644 -1016 -949 -768 -1033 -961 -625 -258 -508 -339 411 401 444 429 771 1084 779 525 873 624 200 -139 -18
1665 -18 -74 -470 -587 -658 -530 -532 -747 -599 -494 -556 -803 -274 -480 -25 229 160 674 753 1121 929 1073 1148 1062
1688 1062 883 981 1009 926 520 -45 142 -55 -298 -806 -483 -521 -1049 -853 -302 -360 -486 -549 -856 -296 -498 -327
1710 -327 -313 68 -107 24 146 536 255 5 53 255 179 40 -22 -191 -134 -300 -117 27 -132 -564 -571 -14
1732 -14 200 -230 -69 331 122 200 308 129 371 -93 13 200 622 413 251 660 892 522 81 449 269
1753 269 83 -120 -73 201 87 -64 43 -13 93 -304 -149 -20 134 -12 -304 -65 -54 -261 -588 -271 -307
1774 -307 -388 -611 -141 11 15 -37 283 -195 -86 -212 -395 80 -92 -160 113 287 73 308 -106 243 520 272
$$ packed form
1622b9o5O99L80j46J45P4O57l87m63K42pm36m50j61p1l18l23m7L05m50k80J15
1644a016O7J81k65P2L36L67k50J69P50j0M3j5L42L13l05k54L48k49m24l39J21
1665a8n6l96j17p1J28kk15J48J05o2k47N29k06M55K54o9N14P9L68j92J44P5q6
1688A062j79R8K8q3m06n65J87j97k43n08L23l8n28J96N51n8j26o3l07N60k02J71
1710c27J4L81j75J31J22L90k81k50M8K02p6j39o2j69N7j66J83J44j59m32pN57
1732a4K14m30J61M00k09P8J08j79K42m64J06J87M22k09j62M09K32l70m41L68j80
1753B69j86k03M7K74j14j51J07n6J06l97J55J29J54j46k92K39J1k07l27L17l6
1774c07q1k23M70J52Mn2L20m78J09j26j83M75j72o8K73J74k14K35m14L49K77k48
$$ plain form
1796 272 13 163 292 150 -55 223 332 135 -267 26 67 -87 98 -156 -124 49 -302 -75 27 17 -15
1817 -15 -101 177 136 142 417 765 336 366 236 212 -36 -188 -232 -13 108 -106 -81 41 60 -117 -250 -240 -228 -184
1841 -184 -500 -362 45 -88 2 100 16 -39 117 38 432 278 0 464 232 307 147 -211 1 87 229 -180
1863 -180 -36 10 -179 96 18 -28 -281 -401 -234 -139 -324 -603 -129 122 86 -22 218 215 223 272 459 327 240 132
1887 132 343 396 227 186 66 -34 0 91 -163 -41 19 -307 -281 -263 -247 -373 -335 -346 -244 -130 -80 -21 244 133
1911 133 268 137 446 342 -42 28 435 338 86 125 114 301 58 4 -28 179 -151 -240 -235 -155 -348 -200 -301
1934 -301 -106 31 -228 -236 35 171 -25 -23 317 288 135 92 19 361 76 -56 -43 47 -48 -14 77 170 -170 -94 -216
1959 -216 8 -13 -171 -188 -34 -113 30 -124 -61 -26 85 -17 42 33 170 131 -205 148 -88 55 24 127 -63
$$ packed form
1796B72k59J50J29j42k05K78J09j97m02K93M1j54J85k54L2J73l51K27J02j0l2
1817a5q6K78m1OK75L48m29L0j30k4k48j52m4K19J21k14K5J22J9j77j33J0J2M4
1841a84l16J38M07j33R0R8q4n5J56p9L94j54k78M64k32P5j60l58K12Q6J42m09
1863a80J44M6j89K75p8m6k53j20J67R5j85k79M74K51l6j08K40lQM9J87j32q7j08
1887A32K11N3j69m1j20j00L4R1k54J22O0l26K6J8J6j26L8j1J02J14N0N9K65j11
1911A33J35j31L09j04l84P0M07r7k52L9j1J87k43n4l2K07l30q9NQ0j93J48j01
1934c01J95J37k59qK71J36j96KL40k9j53m3p3L42k85j32J3R0r5L4R1R3l40P6j22
1959b16K24k1j58j7J54p9J43j54O3L5J11j02N9rJ37l9l36L53k36J43l1J03j90
$$ plain form
1982 -63 85 -72 -86 -4 122 213 70 225 -168 -149 172 -149 9 -121 -40 30 -65 -237 156 -73 -78 -12 -162 5
2006 5 -25 -319 -7 240 -54 -35 -16 -89 -111 -120 35 84 241 -85 -36 105 246 89 -168 184 216 -350 124 -236
2030 -236 99 -239 -170 -64 -210 -279 -391 -77 -38 -159 -89 -100 104 -137 46 273 -8 217 112 517 354 544
2052 544 250 237 124 165 162 12 168 87 -226 -161 33 -249 -320 -62 -399 -86 -410 -162 5 37 35 -153 142
2075 142 287 366 311 118 338 293 260 48 86 58 -142 -28 241 -91 -87 -254 -155 -105 -189 -452 -331 -336 -314 -643 -345
2100 -345 -178 -188 -84 -154 314 257 194 368 31 157 265 265 460 343 251 380 235 259 200 -187 -21 -61 -30 -203
2124 -203 -118 50 -18 -113 124 -81 134 109 70 160 -158 64 93 148 -369 -191 25 36 74 -2 -43 124 108 -183
2148 -183 -237 -56 -160 -217 -123 -249 -374 -61 -305 -156 136 -104 -146 -126 -21 147 15 86 26 -57 4 226 121
$$ packed form
1982f3J48j57j4Q2J26R1j43J55l93J9L21l21J58j30Q1P0r5j72L93k29nO6j50J67
2006El0k94L12K47k94J9J9p3k2rJ55M9J57l26M9J41J41j57k57L52L2n66M74l60
2030b36L35l38O9J06j46o9j12L14L9j21P0j1K04k41J83K27k81K25j05M05j63J90
2052E44k94j3j13M1lj50J56q1l13O5J94k82p1K58l37L13l24K48J67L2kj88K95
2075A42J45P9n5j93K20m5l3k12L8k8k00J14K69l32Mj67R9N0q4k63J21nK2l29K98
2100c45J67j0J04p0M68n7o3J74l37J26J08%J95j17r2J29j45K4n9l87J66m0L1j73
2124b03Q5J68o8r5K37k05K15k5l9R0l18K22K9N5n17J78K16J1L8p6m1J67j6k91
2148a83n4J81j04n7R4j26j25L13k44J49K92k40m2K0J05J68j32P1o0q3O1K22j05
$$ plain form
2171 121 217 -17 170 185 -59 102 -240 -203 150 167 100 79 282 84 62 137 105 47 28 56 -81 112 187 106 -80
2196 -80 -125 101 86 -22 -33 -174 3 59 37 -1 -132 49 -13 -352 40 -155 -51 -128 19 203 -95 113 47
2219 47 351 -34 42 163 75 60 19 -66 12 -35 27 36 -95 -119 171 5 200 377 176 97 174 136 251 -52 10
2244 10 83 220 352 101 154 106 218 97 33 -63 -25 17 -219 -82 -317 -19 -198 -182 -124 -354 -254 -10 91
2267 91 -168 -61 258 120 -37 240 254 -83 4 86 129 272 154 239 -1 207 -209 -168 50 129 -17 -158 -157
2290 -157 19 119 -358 -174 -111 22 10 -285 79 63 294 -21 44 172 153 261 144 255 91 -79 298 159
2312 159 196 92 -159 370 78 -276 -55 -108 -64 -71 -164 2 -334 -194 -42 -235 97 -83 -51 102 -15 233
2334 233 142 436 424 176 262 119 303 -110 -166 112 13 270 232 -194 200 200 -14 -106 -255 -244 -530 47 47 -272
$$ packed form
2171A21R6k34J87J5k44J61l42L7L53J7o7k1K03j98k2P5l2n8j9K8j37J93P5q1j86
2196h0m5K26j5j08j1j41J77N6k2l8j31J81o2l39L92j95J04p7J47J84k98K08o6
2219D7L04l85P6J21q8j5m1q5P8m7O2Rj31k4K90j66J95J77k01p9P7l8J15l03O2
2244A0P3J37J32k51N3m8J12j21o4r6L8M2k36J37k35K98j79J6N8k30J00K44J01
2267I1k59J07L19j38j57K77J4l37Q7Q2M3J43j18Q5k40K08m16M1K18P9j46j41J
2290a57J76J00m77J84O3J33j2k95L64j6K31l15O5J28j9J08j17J11j64j70L77j39
2312A59L7j04k51N29k92l54K21n3M4pr3J66l36J40J52j93L32j80L2J53j17K48
2334B33r1K94j2k48Q6j43J84m13n6K78r9K57l8m26L94%k14r2j49J1k86N77%l19
$$ plain form
2358 -272 -456 -175 130 -20 -118 78 -10 90 104 158 201 207 43 229 329 60 230 94 151 -46 -12 233 -81
2381 -81 250 -165 -161 6 -147 -90 -14 -127 -282 -28 -83 -47 65 49 44 37 62 125 -45 109 -15 150 -227 -12 151
2406 151 -36 186 60 -15 49 -8 -88 157 110 -229 -117 59 -119 -41 -76 -201 -242 -52 -37 -222 119 -186 57
2429 57 -9 236 3 -39 63 -88 215 -54 88 256 210 48 -140 -69 52 -49 -180 -40 68 136 -93 -248
2451 -248 -206 -37 -36 -120 293 5 -107 -96 -24 88 -21 -1 -96 45 123 101 -170 335 -81 -20 -198 104 22 52
2475 52 -187 -40 -213 47 138 17 24 -58 -219 -178 -59 -251 -74 30 158 -79 241 100 -72 -150 -28 271
2497 271 367 247 129 -49 -48 -75 269 127 36 226 192 -3 -46 90 -15 -109 60 -126 9 -363 -65 62 115
2520 115 -188 -16 -233 -142 -178 -81 -56 15 -23 164 177 28 96 141 -48 78 37 -282 -35 -172 201 181 75 55
$$ packed form
2358b72j84K81L05j50r8J96q8J00J4N4M3Oj64J86J00k69J70j36N7j97L4K45l14
2381h1L31m15MJ67j53N7P6j13j55K54n5L6J12j6npK5O3j70J54j24J65l77K15J63
2406A51j87K22j26p5O4n7q0K45m7l39J12J76j78P8l5j25m1J90J5j85L41l05K43
2429E7o6K45k33m2J02j51L03k69J42J68m6j62j88P1J21j01j31J40J08O8k29j55
2451b48M2J69Jq4M13k88j12J1P2J12j09K0r5J41P8k2k71N05m16O1j78L02q2L0
2475E2k39J47j73K60R1j21Pq2j61M1J19j92J77J04J28k37L20j41j72p8J22K99
2497B71R6j20j18j78Jk7L44j42r1J90l4j95m3J36j05r4J69j86J35l72K98J27N3
2520A15l03J72k17R1l6R7K5P1l8J87J3j49O8M5j89J26m1l19K47j37L73k0j06k0
$$ plain form
2544 55 -180 -382 -11 -127 -119 32 -10 -227 82 65 -482 -22 125 -66 -290 313 -119 150 94 120 31 53 -35
2567 -35 -1 -17 -113 45 -47 -8 -113 -108 -64 -114 -179 -159 -6 -113 -259 137 -69 100 -148 147 32 12 -99 175
2591 175 94 52 -150 101 -42 127 278 116 128 -296 132 -125 73 -42 108 21 -95 64 -163 -85 -271 -140
2613 -140 52 -385 -207 -214 -27 -80 -120 -4 -96 206 -47 -19 -209 243 208 46 206 26 85 27 148 1 -122
2636 -122 132 -121 -93 166 -196 -105 -93 60 -241 83 -144 -105 -318 -38 -10 -17 137 22 298 -139 -236 239 165
2659 165 63 70 79 48 210 97 15 242 -2 -217 -30 -183 -47 -4 -3 -41 11 -24 -94 53 -125 -189 -161 25 40
2684 40 166 -246 297 26 -51 332 81 156 -11 -148 109 107 85 -36 62 21 5 -63 -209 -56 -47 -40 -66 -224 26
2709 26 8 39 -37 -32 42 -222 12 204 203 62 51 156 205 83 -124 77 -184 185 78 196 -120 134 23 -13
$$ packed form
2544E5k35k02L71j16QJ51m2k17L09j7n47M60J47j91k24O03m32K69n6K6q9K2q8
2567c5L4j6r6J58r2L9j05NM4n0o5K0J53j07j46L96k06J69k48K95j15k0j11K74
2591A75q1m2k02K51j43J69J51j62J2m24M28k57J98j15J50q7j16J59k27P8j86J31
2613a40J92m37J78pJ87n3m0J16r2L02k53K8j90M52l5j62J60j80N9n8J21j47j23
2636a22K54k53K8K59l62R1J2J53l01L24k27L9k13K80K8pJ54j15K76m37r7M75p4
2659A65j02PRl1J62j13q2K27k44k15J87j53J36M3Jl8N2l5p0J47j78o4K8J86J5
2684D0J26m12N43k71p7L83k51P5j67j37K57kk2j21R8m1j6o8j46J53RPk6j58K50
2709B6j8L1p6NP4k64K34J92jj41j1J05M9j22k07K01k61L69j07J18l16K54j11l6
$$ plain form
2733 -13 -145 71 -39 44 68 92 150 -158 -116 144 181 -77 14 -5 29 -37 -35 -72 -31 -132 190 11 1 119 109 -16
2759 -16 -49 -122 43 23 -207 -134 51 147 29 -149 77 -19 -341 48 79 -64 -87 -139 -90 -110 -38 327 -73 137
2783 137 -15 -45 -299 -257 -35 -146 123 93 -304 -168 -59 -128 -19 -44 97 38 -59 -23 10 -160 -21 113 -135
2806 -135 -3 -167 65 -174 20 201 49 -100 19 -39 -212 38 193 -18 133 84 -78 93 -17 250 -284
2827 -284 166 -200 46 8 -76 51 167 -253 -29 -71 -89 -70 -72 86 -87 -262 -160 -120 -97 155 25 32 -37 59
2851 59 -8 -104 304 258 -178 -97 -29 113 -37 240 124 -19 127 -12 170 -59 -93 116 -141 -280 -205 -99 -186
2874 -186 -151 -89 133 42 160 -212 -267 -231 -2 -140 126 126 108 217 222 97 19 181 158 87 278 86 -477 141
2898 141 -4 90 -49 235 -100 -61 46 23 -110 -114 76 292 19 65 153 81 -179 94 93 225 154 171 114 53 331
$$ packed form
2733a3j32K16j10Q3K4K4N8l08M2K60L7k58R1j9L4o6Kl7M1j01L22j79j0J18j0j25
2759a6l3p3J65k0k30P3J85R6j18j78K26r6l22L89L1j43k3n2M9k0P2L65m00K10
2783A37j52l0k54M2K22j11K69l0l97J36J09o9J09k5J41n9r7L6L3j70J39J34k48
2806a35J32j64K32k39J94J81j52j49J19n8j73K50J55k11J51m9j62J71j10K67n34
2827b84M50l66K46l8q4J27J16m20K24m2j8J9kJ58j73j75J02M0K3K52j30Po9R6
2851E9o7r6M08m6m36Q1O8J42j50K77j16j43J46j39J82k29l4K09k57j39P5J06q7
2874a86L5O2K22r1J18l72n5L6K29j38K66%j8J09Nj25p8J62k3p1J91j92n63O18
2898A41j45R4j39K84l35L9J07k3j33mJ90K16k73M6Q8p2k60K73jJ32p1J7n7o1K78
$$ plain form
2923 331 -71 37 -37 -17 204 288 318 -178 51 232 -93 232 -105 54 -160 -12 -15 12 212 -107 123 -96
2945 -96 175 10 105 -439 -125 -77 -20 -69 -154 -57 99 24 -15 -66 -14 297 -94 66 -171 147 -44 -195 -45 -116
2969 -116 -32 -207 -86 -185 -206 102 34 209 -138 116 390 -158 405 -10 181 87 166 -5 138 -105 153 -7
2991 -7 -93 0 -45 -68 -144 110 -132 -152 -226 -247 96 40 -9 -45 134 -159 -86 82 161 33 240 -23 28 -49 -142 241
3017 241 61 -17 -66 -64 120 -123 16 -178 -1 -43 -6 -6 -407 45 -124 148 -318 -75 -160 96 81 -95 -136 -85
3041 -85 23 12 -12 -15 -50 -5 48 -148 30 250 265 125 13 -208 132 -42 -42 159 65 70 2 139 36 -254 -83
3066 -83 -173 -119 -9 -155 -63 -48 56 170 -71 123 91 -35 -127 277 22 199 39 -79 114 -15 69 -15 93
3089 93 129 55 -39 -218 71 -41 -112 -196 -137 53 127 157 -49 -52 -38 65 195 21 -138 137 -101 57 -4 -183
$$ packed form
2923C31m02J08p4K0K21Q4L0m96K29J81l25L25l37J59k14J48lK7K00l19K30k19
2945i6K71j65R5n44L14M8N7m9q5R7J56p5l9n1N2L11l91J60k37L18j91j51J50p1
2969a16Q4j75J21r9k1L08o8J75l47K54K74n48N63m15J91r4P9j71J43k43K58j60
2991gq6R3m5k3p6K54k42k0p4k1L43n6m9l6J79k93P3J68P9j28K07k63N1p7r3L83
3017B41j80p8m9KJ84k43J39j94J77m2L7%m01M52j69K72m66K43q5K56j5j76m1N1
3041h5J08j1k4ll5M5N3j96J78K20J5j40j12k21L40j74%K01r4No8J37j03k90J71
3066h3r0N4J10j46R2J5J04J14k41J94l2j26r2M04k55J77j60j18J93j29Q4q4J08
3089I3L6p4r4j79K89j12p1q4N9J90P4L0k06lJ4J03J30j74j59K75k38J58o1j79
$$ plain form
3113 -183 -108 39 138 -137 244 0 137 144 -103 11 -9 -162 18 -114 223 252 -276 -186 74 -197 -166 13 -54
3136 -54 -286 67 -36 16 -170 97 -89 -279 -170 41 13 216 129 87 -2 66 -14 75 -37 166 262 -160 150
3159 150 -106 -74 3 -92 -120 132 -64 -67 -162 331 136 -85 -132 5 -44 54 18 22 -132 171 64 -112 60 -1 -102
3184 -102 215 239 244 -52 21 -100 76 179 -10 -79 99 -227 -93 146 -233 -72 38 -68 -221 -113 -160 17
3206 17 63 -49 -88 157 151 82 255 135 -68 4 -46 87 73 -6 -116 -106 69 4 -201 41 -3 -403 -245 -91
3230 -91 201 -66 53 -97 -238 -258 -22 -37 -99 208 -29 179 -98 63 -116 -36 289 302 -15 107 -24 57
3252 57 -120 34 109 122 -31 -18 153 -161 -43 43 119 -253 58 -10 49 35 4 136 -1 -48 -119 68 -108 256
3276 256 145 83 138 -62 -40 361 54 -196 78 144 -23 -121 46 164 -49 87 -118 -45 -94 -63 -100 -68 17 -50
$$ packed form
3113a83P5J47R9k75L81k44J37Pk47J14k0j53J80j32L37K9n28R0K60k71L1J79o7
3136e4k32L53j03N2j86K67j86j90J09K11k8K03q7m2q9O8q0Q9j12K03R6m22L10
3159A50k56L2P7r5k8K52j96lr5M93j95k21m7J37m9R8l6Mj54L03j07j76J72o1j01
3184a02L17K4Nk96P3j21J76J03j89o9J78l26J34K39l79J61J10j06j53J08m7J77
3206A7M6j12l9K45oo9J73j20k03P2n0J33j4p9j10J0J75o5k05K42m4m00J58J54
3230i1K92k67J19j50j41k0K36j5o2L07k37K08k77J61j79Q0L25J3l17J22j31Q1
3252E7j77J54P5J3j53J3J71l14J18Q6P6l72L11o8N9j4l1J32j37m7p1J87j76L64
3276B56j11o2N5k00K2M01l07k50K74O6j67r8J67J18k13J36k05P3m9L1l7L2Q5o7
$$ plain form
3300 -50 52 116 -46 107 104 33 -105 -44 229 -103 -30 120 179 -15 185 -134 137 39 -44 255 -147 24 123 101
3324 101 86 -29 55 -292 40 -272 -116 29 -160 -145 91 -10 -38 114 85 161 35 4 -49 -5 211 62 -106
3347 -106 -75 56 -221 -32 -123 68 -37 -98 -75 21 -84 -142 -61 -77 13 69 525 -17 -141 72 -190 -183 33 18
3371 18 -55 93 -180 22 149 6 123 41 -247 -248 161 -120 41 -225 -45 46 62 -69 -191 -30 -213 -16
3393 -16 -81 -118 92 15 73 16 -181 219 -35 -97 75 -144 -81 -116 177 -97 10 -16 -40 277 103 30 49 205
3417 205 171 28 -235 105 -82 4 -240 -209 -142 -167 -8 23 84 196 -239 154 -75 6 47 77 53 184 37 -127
3441 -127 110 88 274 -20 -98 191 73 69 269 -18 152 -110 2 119 253 -130 -68 -14 -154 65 -157 -119
3463 -119 -224 -225 13 -77 -17 39 -46 211 34 171 365 195 -138 49 -228 -123 50 -382 -48 96 -44 23
$$ packed form
3300e0J02O4j62J53lp1j38O1K73l32P3J50N9j94K00l19K71r8q3K99m02J71R9k2
3324A01j5j15Q4l47L32l12J56J45j89J5K36j01k8J52k9P6j26l1n3M4K16j49j68
3347a06L1J31k77J89r1J91j05o1K3R6j05n8Q1j6R0N6M56n42j24K13k62PK16j5
3371A8p3J48k73K02J27j43J17q2k88jM09k81J61k66J80R1J6j31j22J61j83J97
3393a6o5l7K10p7N8n7j97M00k54o2J72k19O3l5K93k74J07k6k4L17j74p3J9J56
3417B05l4j43k63L40j87Q6k44L1O7k5J59L1O1J12m35L93k29Q1M1L0k4J31j47j64
3441a27K37k2J86k94p8K89j18mK00k87J70k62J12J17J34l83O2N4j40K19k22L8
3463a19j05jK38r0O0N6q5K57j77J37J94j70l33J87k77J05J73m32L34J44j40O7
$$ plain form
3485 23 -1 -9 105 -215 48 -34 108 202 13 -6 102 196 42 85 23 -5 37 37 -53 -123 123 -155 110 328 40
3510 40 9 -145 -11 73 -38 -89 -47 102 61 0 -87 -28 -161 -31 -139 21 -114 101 -78 144 -38 -61 -51 26
3534 26 -215 56 189 -7 135 -91 261 103 -47 32 -172 38 -112 240 -62 -233 -56 -52 -79 -293 -178 106
3556 106 22 163 -61 -90 185 -207 1 -119 364 74 -118 133 216 203 51 225 189 97 17 -69 -240 -28 209
3579 209 120 -111 -141 -19 47 -197 297 -12 178 39 1 -150 -126 -5 128 -256 -78 -35 129 -79 -184 -33
3601 -33 -122 -82 -310 26 -115 -61 78 229 141 -28 67 -188 -132 12 31 367 114 -104 104 67 -85 30 -171
3624 -171 119 57 54 -135 -139 259 91 -69 -80 -26 -31 -2 83 -13 -92 32 117 -85 -209 233 157 45 -116 116 79
3649 79 87 -100 200 -7 -1 -36 -39 -59 -272 -17 -141 191 153 -8 346 48 -150 13 12 104 0 59 17 -83 -289
$$ packed form
3485B3k4qJ14l20K63q2J42R4j89j9J08R4j54M3o2k8M2%r0p0K46k78K65K18k88
3510D0l1j54J34Q4j11n1M2J49m1o1q7N9j33J30j08J60j35K15j79K22j82k3J0P7
3534B6k41K71J33j96J42k26L52j58j50P9k04K10j50L52l02j71J77Mk7k14J15K84
3556A06q4J41k24k9K75l92K08j20M83k90j92K51Q3j3j52J74l6r2q0q6j71K12K37
3579B09q9k31l0J22O6k44M94l09J90j39l8j51K4J21J33l84J78M3J64k08j05J51
3601c3q9M0k28L36j41N4J39J51q8j69R5k55N6J44J9L36k53k18K08l7j52J15k01
3624a71K90o2lj89mL98j68j60j1N4nK9Q5r6p9J24Q5k02j24M42p6j12j61K32l7
3649G9Qj87L00k07Ol5lk0k13K55j24L32l8j61L54k98j98J63jR2j04N9m2j00k06
$$ plain form
3674 -289 -174 102 175 16 -223 -29 -91 -137 -97 -242 -262 -27 84 181 15 122 55 75 -126 7 160 319 -93
3697 -93 252 143 82 103 154 238 172 -84 -71 -74 -35 -99 -45 300 -277 206 -33 256 -53 -242 -120 -52 -26 86 80
3722 80 -137 -143 -240 114 -54 -241 10 192 82 32 24 -125 48 175 -133 149 66 -113 -166 -86 -87 -220 215 43
3746 43 0 181 -155 -58 87 50 57 188 119 50 -167 197 -51 29 83 109 -129 32 69 26 -249 -43 -29 -287 147
3771 147 -137 -4 -115 55 2 210 266 -246 -83 -22 -7 24 -247 104 204 72 6 65 81 29 44 275 -109
3794 -109 293 -93 -214 211 -271 -151 167 13 150 -138 138 -83 231 -118 -130 -149 -87 -19 98 -291 -216 0
3816 0 -8 -8 55 255 9 -87 9 -22 -157 193 115 17 -30 -38 70 -177 27 31 -82 -27 264 -6 6 204 -41 39 122
3843 122 -89 87 -4 68 -63 -10 -97 -297 -95 77 256 83 -204 162 38 33 -269 46 106 -127 0 -4 -226
$$ packed form
3674b89J15K76P3j59k39J94o2m6M0j45k0K35J11R7j66J07o7K0k01J33J53J59m12
3697i3L45j09o1K1N1Q4o6k56J3lL9o4N4L45n77M83k39K89l09j89J22O8K6J12o
3722H0k17or7L54j68j87K51J82j10n0qj49J73J27l08K82q3j79n3Q0jj33M35j72
3746D3m3J81l36R7J45l7PJ31o9o9k17L64k48Q0N4K6k38J61L7m3k75K06J4k58M34
3771A47k84J33j11J70n3K08N6n12J63O1J5L1k71L51J00j32o6N9J6n2J5K31l84
3794a09M02l86j21M25m82J20L18j54J37k88K76k21L14l49j2j9O2O8J17l89P5K16
3816@q%O3K00k46r6R6l1j35L50p8r8m7qJ08k47K04Mj13N5K91k70J2J98k45Q0Q3
3843A22k11J76r1P2j31N3q7k00K02J72J79j73k87L66j24nl02L15O0k33J27mk22
$$ plain form
3866 -226 -71 67 0 58 175 -80 108 165 125 -85 -23 54 260 63 24 34 195 69 56 -131 66 122 32 136
3890 136 72 -88 25 63 -79 64 -189 52 48 78 -190 -21 -119 245 -35 -31 -129 -47 -38 229 -70 -92 1 -42 99
3915 99 68 331 314 -53 -14 64 58 147 -20 95 -115 -208 68 -107 -23 247 195 132 -32 -46 -45 69 72 -83 122 -32
3941 -32 -210 -104 188 42 56 289 -156 166 227 7 -63 -57 -134 84 109 0 144 139 -25 -225 -122 200 -26
$$ packed form
3866b26J55J38o7N8J17k55J88N7m0k10O2P7K06j97l9J0J61j26j3j87J97N6r0J04
3890A36o4j60J13L8j42J43k53K41mL0k68J69r8L64k80Mr8Q2RK67k99k2R3m3J41
3915I9l1K63j7l67L9P8oQ9j67J15k10r3K76j75Q4K70n2o3j64j4JJ14Lj55K05j54
3941c2j78J06K92j46J4K33m45L22O1k20p0Op7K18K5j09J44nj64k00J03L22k26
$$ [...]
8191I6
##END NTUPLES=NMR FID
##END=
