##TITLE=1H_Pr 5183
 CDcl3
 8 sc, 
 22.2.2023
##JCAMPDX= 6.0         $$ Bruker NMR JCAMP-DX V2.0
##DATA TYPE= NMR FID
##DATA CLASS= NTUPLES
##ORIGIN= UXNMR, Bruker Analytische Messtechnik GmbH
##OWNER= root
$$ XWIN-NMR		Version 3.5
$$ Wed Feb 22 16:47:40 2023 Russian Standard Time (UT+4h)  she@DPX200
##.OBSERVE FREQUENCY= 200.13135
##.OBSERVE NUCLEUS= ^1H
##.DELAY= (6, 6)
##.ACQUISITION MODE= SIMULTANEOUS
##.ACQUISITION SCHEME= undefined
##.AVERAGES= 8
##.DIGITISER RES= 18
##SPECTROMETER/DATA SYSTEM= spect
##.PULSE SEQUENCE= zg30
##.SOLVENT NAME= DMSO
##.SHIFT REFERENCE= (INTERNAL, DMSO, 0, 15.7039)
##AUDIT TRAIL= $$ (NUMBER, WHEN, WHO, WHERE, WHAT)
$$ ##TITLE= Audit trail, XWIN-NMR		Version 3.5
$$ ##JCAMPDX= 5.01
$$ ##ORIGIN= Bruker BioSpin GmbH
$$ ##OWNER= she
$$ F:/spectra/data/she/nmr/H-F/1/audita.txt
$$ ##AUDIT TRAIL=  $$ (NUMBER, WHEN, WHO, WHERE, WHAT)
(   1,<2023-02-22 16:46:23.21 +0400>,<she>,<DPX200>,
      <created by zg, POWCHK disabled, PULCHK disabled
       configuration hash MD5:
       00 E9 B6 7A A2 85 ED C7 34 08 36 98 17 FE 4E 26
       data hash MD5: 16K
       79 96 51 59 B2 A6 6A 7D 96 30 4B 76 97 9B C7 51>)
$$ ##END=
$$ 
$$ hash MD5
$$ D3 C1 FB 1C C7 BD D8 D7 9B B7 CF 28 37 95 68 EB
##$RELAX= 
##$RELAX= 
##$RELAX= 
##$RELAX= 
##$RELAX= 
##$RELAX= 
$$ Bruker specific parameters
$$ --------------------------
##$DU= <F:/spectra>
##$EXPNO= 1
##$NAME= <H-F>
##$PROCNO= 1
##$TYPE= <nmr>
##$USER= <she>
##$AMP= (0..31)
100 100 100 100 100 100 100 100 100 100 100 100 100 100 100 100 100 100 
100 100 100 100 100 100 100 100 100 100 100 100 100 100 
##$AQSEQ= 0
##$AQ_mod= 1
##$AUNM= <au_zg>
##$AUTOPOS= <>
##$BF1= 200.13
##$BF2= 200.13
##$BF3= 200.13
##$BF4= 200.13
##$BF5= 200.13
##$BF6= 200.13
##$BF7= 200.13
##$BF8= 200.13
##$BYTORDA= 1
##$CFDGTYP= 0
##$CFRGTYP= 5
##$CHEMSTR= <none>
##$CNST= (0..31)
1 1 145 1 1 1 1 1 1 1 1 1 1 1 1 1 1 1 1 1 1 1 1 1 1 1 1 1 1 1 1 1 
##$CPDPRG= <>
##$CPDPRG1= <>
##$CPDPRG2= <>
##$CPDPRG3= <>
##$CPDPRG4= <mlev>
##$CPDPRG5= <mlev>
##$CPDPRG6= <mlev>
##$CPDPRG7= <mlev>
##$CPDPRG8= <mlev>
##$CPDPRGB= <>
##$CPDPRGT= <>
##$D= (0..31)
0 1.2 0 0 0 0 0 0 0 0.06 0 0.03 0 0 0 0 0.0002 0 0 0 0 0 0 0 0 0 0 0 0 
0 0 0 
##$DATE= 1677069982
##$DBL= (0..7)
120 120 120 120 120 120 120 120 
##$DBP= (0..7)
150 150 150 150 150 150 150 150 
##$DBP07= 0
##$DBPNAM0= <>
##$DBPNAM1= <>
##$DBPNAM2= <>
##$DBPNAM3= <>
##$DBPNAM4= <>
##$DBPNAM5= <>
##$DBPNAM6= <>
##$DBPNAM7= <>
##$DBPOAL= (0..7)
0.5 0.5 0.5 0.5 0.5 0.5 0.5 0.5 
##$DBPOFFS= (0..7)
0 0 0 0 0 0 0 0 
##$DE= 6
##$DECBNUC= <off>
##$DECIM= 32
##$DECNUC= <off>
##$DECSTAT= 4
##$DIGMOD= 1
##$DIGTYP= 9
##$DL= (0..7)
0 120 120 120 120 120 120 120 
##$DP= (0..7)
150 150 150 150 150 150 150 150 
##$DP07= 0
##$DPNAME0= <>
##$DPNAME1= <>
##$DPNAME2= <>
##$DPNAME3= <>
##$DPNAME4= <>
##$DPNAME5= <>
##$DPNAME6= <>
##$DPNAME7= <>
##$DPOAL= (0..7)
0.5 0.5 0.5 0.5 0.5 0.5 0.5 0.5 
##$DPOFFS= (0..7)
0 0 0 0 0 0 0 0 
##$DQDMODE= 0
##$DR= 18
##$DS= 0
##$DSLIST= <SSSSSSSSSSSSSSS>
$$ [...]
##$SUBNAM2= <"">
##$SUBNAM3= <"">
##$SUBNAM4= <"">
##$SUBNAM5= <"">
##$SUBNAM6= <"">
##$SUBNAM7= <"">
##$SUBNAM8= <"">
##$SUBNAM9= <"">
##$SW= 18.05172834244
##$SWIBOX= (0..15)
0 0 2 0 0 0 0 0 0 0 0 0 0 0 0 0 
##$SW_h= 3612.71676300578
##$TD= 16384
##$TD0= 1
##$TE= 0
##$TE2= 300
##$TE3= 300
##$TEG= 300
##$TL= (0..7)
0 120 120 120 120 120 120 120 
##$TP= (0..7)
150 150 150 150 150 150 150 150 
##$TP07= 0
##$TPNAME0= <>
##$TPNAME1= <>
##$TPNAME2= <>
##$TPNAME3= <>
##$TPNAME4= <>
##$TPNAME5= <>
##$TPNAME6= <>
##$TPNAME7= <>
##$TPOAL= (0..7)
0.5 0.5 0.5 0.5 0.5 0.5 0.5 0.5 
##$TPOFFS= (0..7)
0 0 0 0 0 0 0 0 
##$TUNHIN= 0
##$TUNHOUT= 0
##$TUNXOUT= 0
##$USERA1= <user>
##$USERA2= <user>
##$USERA3= <user>
##$USERA4= <user>
##$USERA5= <user>
##$V9= 5
##$VALIST= <valist>
##$VCLIST= <CCCCCCCCCCCCCCC>
##$VD= 0
##$VDLIST= <DDDDDDDDDDDDDDD>
##$VPLIST= <PPPPPPPPPPPPPPP>
##$VTLIST= <TTTTTTTTTTTTTTT>
##$WBST= 1024
##$WBSW= 4
##$XGAIN= (0..3)
0 0 0 0 
##$XL= 0
##$YL= 0
##$YMAX_a= 179401
##$YMIN_a= -141592
##$ZGOPTNS= <>
##$ZL1= 120
##$ZL2= 120
##$ZL3= 120
##$ZL4= 120
##$ABSF1= 10
##$ABSF2= 0
##$ABSG= 5
##$ABSL= 3
##$ALPHA= 0
##$AQORDER= 0
##$ASSFAC= 0
##$ASSFACI= 0
##$ASSFACX= 0
##$ASSWID= 0
##$AUNMP= <proc_1d>
##$AZFE= 0.1
##$AZFW= 0.1
##$BCFW= 1
##$BC_mod= 2
##$BYTORDP= 1
##$COROFFS= 0
##$CY= 11.3945322036743
##$DATMOD= 1
##$DC= 2
##$DFILT= <>
##$DTYPP= 0
##$F1P= 2.36226072786647
##$F2P= -0.459571619588291
##$FCOR= 0.5
##$FTSIZE= 0
##$FT_mod= 4
##$GAMMA= 1
##$GB= 0.15
##$INTBC= 1
##$INTSCL= 1
##$ISEN= 128
##$LB= 0.24
##$LEV0= 0
##$LPBIN= 0
##$MAXI= 10000
##$MC2= 0
##$MEAN= 0
##$ME_mod= 0
##$MI= 1.114404
##$NCOEF= 0
##$NC_proc= 0
##$NLEV= 6
##$NOISF1= 3.799351
##$NOISF2= 2.8
##$NSP= 1
##$NTH_PI= 0
##$NZP= 0
##$OFFSET= 15.70392
##$PC= 1
##$PHC0= -19106.21
##$PHC1= 11.80074
##$PH_mod= 1
##$PKNL= yes
##$PPARMOD= 0
##$PSCAL= 0
##$PSIGN= 0
##$REVERSE= no
##$SF= 200.130013532006
##$SI= 16384
##$SIGF1= 3
##$SIGF2= 2
##$SINO= 400
##$SIOLD= 16384
##$SREGLST= <1H.CDCl3>
##$SSB= 0
##$STSI= 0
##$STSR= 0
##$SW_p= 3612.71676300578
##$SYMM= 0
##$S_DEV= 0
##$TDeff= 0
##$TDoff= 0
##$TI= <>
##$TILT= no
##$TM1= 0
##$TM2= 0
##$TOPLEV= 0
##$USERP1= <user>
##$USERP2= <user>
##$USERP3= <user>
##$USERP4= <user>
##$USERP5= <user>
##$WDW= 1
##$XDIM= 8192
##$YMAX_p= 0
##$YMIN_p= 0
$$ End of Bruker specific parameters
$$ ---------------------------------
##NTUPLES= NMR FID
##VAR_NAME=  TIME,          FID/REAL,        FID/IMAG
##SYMBOL=    X,             R,               I
##VAR_TYPE=  INDEPENDENT,   DEPENDENT,       DEPENDENT
##VAR_FORM=  AFFN,          ASDF,            ASDF
##VAR_DIM=   8192,          8192,            8192
##UNITS=     SECONDS,       ARBITRARY UNITS, ARBITRARY UNITS
##FACTOR=    0.0002768,     1,               1
##FIRST=     0,             0,               0
##LAST=      2.2672688,     0,               0
##MIN=       0,             -141592,         0
##MAX=       2.2672688,     179401,          0
$$ Real data points
##PAGE= N=1
##DATA TABLE= (X++(R..R)), XYDATA
$$ [...]
$$ plain form
1418 -1104 -1505 -526 699 392 101 1182 2048 1626 687 896 1568 1140 16 129 950 901 -84 -461 345
1437 345 124 -972 -1511 -863 -446 -1175 -1530 -490 131 -359 -1210 -215 451 -139 -608 -80 1114 961 226
1456 226 731 1476 1217 12 -192 459 183 -921 -974 -129 132 -457 -949 -37 373 -577 -1194 -394 233 -457
1476 -457 -861 -159 934 593 -136 711 1531 798 -10 137 907 633 -413 -243 420 191 -883 -985 -379
1495 -379 -270 -984 -1183 -296 -175 -881 -1151 -345 377 -424 -705 59 853 555 94 914 1427 1078 412 452
1515 452 1176 697 -140 -293 406 263 -681 -697 -145 -217 -997 -1455 -689 -254 -1038 -1402 -462 213 -357 -792 -20
1536 -20 650 348 -160 435 1209 988 364 642 1318 909 -30 -264 312 195 -608 -680 286 175 -397 -793 -103
1557 -103 62 -784 -1337 -562 -213 -503 -840 76 943 641 14 569 1040 391 -295 -97 673 398 -359 36
$$ packed form
1418a104m01R79J225l07k91J081Q66m22r39K09O72m28j124J13Q21m9r85l77Q06
1437C45k21j096n39O48M17p29l55J040O21m90q51R95O66n90m69N28J194j53p35
1456B26N05P45k59j205k04O51k76j104n3Q45K61n89m92R12M10r50o17Q00O27o90
1476d57m04P02J093l41p29Q47Q20p33q08J47P70k74j046J70O63k29j074j02O06
1495c79J09p14j99Q87J21p06k70Q06P22q01k81P64P94k98m61Q20N13l49o66M0
1515D52P24m79q37j53O99j43r44j6N52p2p80m58P66M35p84l64R40O75n70m35P72
1536b0O70l02n08N95P74k21o24K78O76m09r39k34N76j17q03p2R66j11n72l96O90
1557a03J65q46n53P75L49k90l37R16Q67l02o27N55M71o49o86J98P70k75p57L95
$$ plain form
1577 36 552 602 -358 -517 -74 106 -676 -918 -180 108 -235 -514 114 462 35 -461 122 554 396 -378 240
1598 240 1085 757 48 -30 372 79 -711 -699 -226 -288 -720 -709 -26 286 -487 -651 -85 197 -536 -743 -20
1619 -20 616 -42 162 671 1223 805 286 630 847 678 -426 -106 439 368 -384 -392 219 150 -581 -1045 -480
1640 -480 -441 -784 -1070 -395 262 -508 -694 81 558 76 -412 155 686 675 105 452 999 589 9 -132 363
1661 363 74 -698 -667 -31 91 -451 -492 -43 150 -522 -774 -132 103 -346 -630 109 818 418 -98 588 1015
1682 1015 636 108 465 732 313 -226 108 411 293 -458 -533 101 -20 -726 -849 -396 -317 -703 -911 -269
1702 -269 -67 -519 -584 45 403 144 -47 383 910 626 352 565 1115 878 273 232 867 601 104 142 263
1723 263 208 -307 -614 34 -114 -579 -982 -622 -225 -586 -953 -492 -95 -256 -598 -145 404 120 -371 163
$$ packed form
1577C6N16N0r60j59M43J80p82k42P38K88l43k79O28L48m27m96N83M32j58p74O18
1598B40Q45l28p09p8M02k93p90J2M73o2m32J1O83L12p73j64N66K82p33k07P23
1619b0O36o58K04N09N52m18n19L44K17j69j104L20N45p1p52qO11o9p31m64N65
1640d80L9l43k86O75O57p70j86P75M77m82m88N67N31j1n70L47N47m10n80j41M95
1661C63k89p72L1O36J22n42m1M49J93o72k52O42K35m49k84P39P09m00n16O86M27
1682A015l79n28L57K67m19n39L34L03j18p51p5O34j21p06j23M53P9l86k08O42
1702b69K02m52o5O29L58k59j91M30N27k84k74K13N50k37o05m1O35k66m97L8J21
1723B63n5n15l07O48j48m65m03L60L97l61l67M61L97j61l42M53N49k84m91N34
$$ plain form
1743 163 713 568 15 264 761 686 198 100 655 851 -40 -66 399 347 -136 -369 -32 48 -476 -599 -141 132
1765 132 -82 -584 -140 200 -143 -484 -249 397 42 -319 -98 380 341 -141 -46 444 183 -380 -269 221 347
1786 347 -147 -338 191 315 -168 -313 46 344 -150 -422 104 442 94 -133 -25 526 111 -162 -162 286 318
1807 318 -102 94 400 370 -54 -214 231 197 -404 -469 25 127 -120 -329 -76 15 29 -372 -275 -57 -157 -610
1829 -610 -279 218 280 -268 -65 382 299 72 109 240 337 -40 -89 304 556 -30 -37 220 351 62 -148 -38
1851 -38 244 -85 -307 -139 207 -11 -431 -242 79 -73 -434 -376 114 57 -296 -247 125 286 -283 -225 50 273
1873 273 -291 -67 215 325 203 -87 367 475 113 -48 -61 251 -179 -438 -80 160 128 -317 -157 201 162
1894 162 -396 -262 25 -50 -211 -418 70 205 -143 -127 -50 343 45 -169 92 285 64 -90 -21 195 164 -190
$$ packed form
1743A63N50j45n53K49M97p5m88r8N55J96q91k6M65n2m83k33L37Q0n24j23M58K73
1765A32k14n02M44L40l43l41K35O46l55l61K21M78l9m82R5M90k61n63J11M90J26
1786C47m94j91N29J24m83j45L59K98m94k72N26L38l48k27J08N51m15k73%M48L2
1807C18m20J96L06l0m24j60M45l4o01o5M94J02k47k09K53R1J4m01R7K18j00m53
1829f10L31M97O2n48K03M47q3k27L7J31R7l77m9L93K52n86pK57J31k89k10J10
1851c8K82l29k22J68L46k18m20J89L21j52l61N8M90n7l53M9L72J61n69N8K75K23
1873B73n64K24K82J10j22k90M54J08l62j61j3L12m30k59L58K40l2m45J60L58l9
1894A62n58J34K87p5j61k07M88J35l48J6P7L93k98k14K61J93k21j54O9K16l1l54
$$ plain form
1916 -190 -18 26 -7 -277 -263 39 145 -235 -120 59 222 -237 -299 10 91 -115 -212 109 107 134 -24 68 493
1939 493 173 -154 104 238 122 -213 -116 188 -6 -312 -161 257 -15 -261 -250 -3 -125 -334 -352 -44 157
1960 157 -237 -336 -6 384 53 -75 172 370 115 -100 205 367 105 -205 175 428 129 -19 -164 249
1980 249 -63 -283 -175 -152 3 -400 -397 -225 53 23 -138 0 102 1 -119 165 190 66 -6 -126 245 257
2002 257 125 179 249 312 -112 -3 312 212 -32 -175 70 128 -213 -507 -19 8 -344 -326 -105 112 -140 -291
2024 -291 22 200 -81 -274 -174 322 133 -209 278 453 254 -34 84 298 168 -129 -213 216 153 -180 -255
2045 -255 -37 186 -8 -333 -106 248 -180 -211 36 221 -205 -344 -21 31 -210 -99 -38 125 -35 -146 -78
2066 -78 132 170 -203 -22 54 187 -241 -168 115 256 -35 106 73 225 135 11 -49 271 -46 -172 -175 107 -5
$$ packed form
1916a90J72M4l3k70J4L02J06l80J15J79J63m59o2L09Q1k06r7L21kK7j58R2M25
1939D93l20l27K58J34j16l35R7L04j94l06J51M18k72k46J1K47j22k09j8L08K01
1960A57l94r9L30L90l31j28K47J98k55k15L05J62k62l10L80K53k99j48j45M13
1980B49l12k20J08K3J55m03LJ72K78l0j61J38J02j01j20K84K5j24p2j20L71J2
2002B57j32N4P0O3m24J09L15j00k44j43K45N8l41k94M88K7l52J8K21K17k52j51
2024b91L13J78k81j93J00M96j89l42M87J75j99k88J18K14j30k97q4M29o3l33p5
2045b55K18K23j94l25K27L54m28l1K47J85m26j39L23N2k41J11O1J63j60j11O8
2066g8K10L8l73J81P6J33m28P3K83J41k91J41l3J52r0j24o0L20l17j26lK82j12
$$ plain form
2089 -5 -176 -179 162 -23 -282 -262 98 -21 -156 -129 -53 195 -128 -233 -135 75 70 -138 187 250 228 -85 -28 478
2113 478 -43 -4 -9 159 66 -305 -109 -1 131 -190 -11 196 200 -111 -303 -35 158 -169 -120 54 140 34 -17
2136 -17 59 220 85 -256 95 130 77 -53 57 333 71 -287 -234 208 23 -140 -135 29 -103 -112 -296 -46 60
2159 60 -87 -183 126 211 -149 -42 156 271 248 42 98 271 113 -29 139 237 -21 -36 -175 86 -100 -207
2181 -207 -201 64 -155 -342 -226 -44 41 -36 -372 -20 -107 -99 -147 -89 152 99 -64 12 77 202 -79 -43 154 129 44
2206 44 -172 145 157 -229 -102 156 34 -367 -131 58 -41 -55 -108 -68 140 -76 -203 -47 131 -105 -42 -34 116
2229 116 70 6 87 276 92 12 -195 197 -5 -170 -70 -147 -46 -300 -182 -110 118 1 -229 -30 129 -58
2251 -58 -203 -10 155 -95 70 46 165 -159 -100 55 87 170 -47 -3 21 223 -99 124 -7 15 -166 -121 57
$$ packed form
2089ej71lL41j85k59K0L60j19j35K7P6K48l23j05R8K10nk08L25O3k2l13N7N06
2113D78n21L9nJ68r3l71J96J08J32l21J79K07Ml11j92K68J93l27M9J74Q6j06n1
2136a7P6J61j35l41L51L5n3j30J10K76k62l58N3M42j85j63NJ64j32rj84K50J06
2159F0j47r6L09Q5l60J07J98J15k3k06N6J73j58j42J68R8k58j5j39K61j86j07
2181b07OK65k19j87J16J82Q5p7l36L52q7Qm8N8K41n3j63P6O5J25k81L6J97k5q5
2206D4k16L17J2l86J27K58j22m01K36J89r9j4n3M0K08k16j27J56J78k36O3QJ50
2229A16m6o4Q1J89j84q0k07L92k02j65J00p7J01k54J18P2K28j17k30J99J59j87
2251e8j45J93J65k50J65k4J19l24N9J55L2Q3k17M4K4K02l22K23j31K2j81M5J78
$$ plain form
2274 57 -76 -111 -204 -22 -56 -80 -230 8 59 -204 -68 53 156 71 65 -74 193 220 -17 -96 114 378 -120 167
2298 167 250 202 84 -17 -157 -115 -137 -324 -79 -19 -54 -92 39 202 61 -92 -101 40 -103 -66 57 100 97 -99
2322 -99 41 31 33 -61 -251 -8 145 -22 -98 113 128 -47 -236 -1 11 54 -179 25 -79 -97 11 48 106 -6
2346 -6 -113 -45 175 5 -81 -38 109 139 69 114 220 -50 -28 -63 85 189 28 82 -54 -97 -3 -106 -47 -220 72
2371 72 39 -130 37 129 -193 -9 143 77 -98 -105 77 -27 -108 128 30 133 91 -76 22 7 -113 24 73 105
2395 105 63 -208 53 39 15 -113 -67 134 -29 -235 -100 15 12 -148 -127 117 39 -40 -27 -2 36 -90 -246 -15
2419 -15 69 70 88 205 252 -108 -156 -12 193 8 -107 99 202 -36 83 -88 180 100 -204 -4 64 -53 -181
2442 -181 -25 -21 71 -73 -139 -7 43 -125 -21 77 5 -134 -92 36 365 54 -23 75 75 165 24 60 171 84 10
$$ packed form
2274E7j33l5r3J82l4k4j50K38N1k63J36J21J03q5oj39K67K7k37p9K10K64m98K87
2298A67Q3m8j18j01j40M2k2j87K45O0l5l8J31J63j41j53rJ41j43L7J23M3lj96
2322i9J40j0Kr4j90K43J53j67p6K11J5j75j89K35J2M3k33K04j04j8J08L7N8j12
2346fj07O8K20j70q6M3J47L0p0M5J06k70K2l5J48J04j61N4j36m3R4j03N9j73K92
2371G2l3j69J67R2l22J84J52o6j75pJ82j04q1K36r8J03m2j67R8j5j20J37M9L2
2395A05m2k71K61j4k4j28M6K01j63k06J35J15lj60K1K44p8p9J3K5L8j26j56K31
2419a5Q4JJ8J17M7l60m8J44K05j85j15K06J03k38J19j71K68q0l04K00O8j17j28
2442a81J56MR2j44o6J32N0j68J04R8p2j39M2J28L29l11p7R8%R0j41L6J11q7p4
$$ plain form
2467 10 98 132 17 -53 112 50 47 7 -30 15 -87 -28 -52 -68 52 -17 -99 46 -21 61 -270 -55 20 183 48 -52
2493 -52 130 59 37 -274 148 7 -56 -287 -126 -100 -112 -148 16 99 -204 -280 39 -57 -52 -124 -14 75 -19 64 58 136
2519 136 -113 82 147 253 26 15 16 142 -24 -120 -81 91 -201 -81 -36 -96 58 -145 -238 -68 -62 -94 40 68
2543 68 76 7 -114 39 53 40 -125 -112 55 2 48 -51 87 99 -93 28 29 45 -178 -267 59 20 -31 7 -5 52 -92
2570 -92 -18 -33 171 75 -115 137 202 -107 14 -4 262 111 -22 -215 129 72 -15 -60 54 196 -50 -7 69 14
2594 14 -174 -153 37 91 -39 -65 0 -126 67 -71 135 88 88 24 62 116 2 13 61 -7 53 -185 -175 139 167 68
2620 68 56 166 160 -78 -29 -13 132 -35 -22 45 120 -82 38 92 82 17 -50 -84 40 19 96 -12 5 145 -57 -5
2646 -5 56 -24 -1 -95 67 81 -110 6 113 75 -57 -66 4 -58 -96 -109 107 75 46 -217 14 -8 -8 -142 -34 5 41
$$ packed form
2467A0Q8L4j15p0J65o2lm0l7M5j02N9k4j6J20o9q2J45o7Q2l31K15P5J63j35j00
2493e2J82p1k2l11M22j41o3k31J61K6j2l6J64Q3l03p6L19r6Np2J10Q9r4Q3oP8
2519A36k49J95O5J06k27j1JJ26j66r6L9J72k92J20M5o0J54k03r3J70Ol2J34K8
2543F8Qo9j21J53J4j3j65J3J67n3M6r9J38J2j92J21JJ6k23q9L26l9n1L8j2N7j44
2570i2P4j5K04r6j90K52O5l09J21j8K66j51j33j93L44n7q7m5J14J42k46M3P6n5
2594A4j88K1J90N4j30k6O5j26J93j38K06m7%o4L8N4j14J1M8o8O0k38J0L14K8r9
2620F8j2J10ok38M9J6J45j67J3O7P5k02J20N4j0o5o7l4J24k1P7j08J7J40k02N2
2646eO1q0K3r4J62J4j91J16J07l8j32rP0o2l8j3K16l2k9k63K31k2%j34J08L9L6
$$ plain form
2673 41 18 -63 113 -193 40 -105 77 283 -99 -176 -52 96 23 -278 -55 -62 3 -44 -145 166 -55 -121 -84 79
2697 79 63 -80 -95 47 -67 -26 40 -13 95 -75 -43 127 -70 -72 40 11 60 3 -55 27 46 41 24 62 93 -105 20
2724 20 77 288 -111 -53 19 -46 -90 -80 -18 71 -142 -42 -113 17 81 -123 -16 224 12 24 35 179 154 -76 -11
2749 -11 -54 46 76 0 -68 -24 48 -99 -50 57 -38 -58 -31 28 117 -111 -11 9 2 -14 -12 145 42 -5 -18 108 -5
2776 -5 48 -64 -63 188 106 -62 147 73 -118 6 28 0 66 -126 -74 -67 -25 -114 23 78 14 9 -87 -16 50 6 -147 -2
2804 -2 -10 72 70 -10 104 32 -26 220 -4 -74 -77 -141 -21 -32 -221 -84 -132 -20 -87 -34 -9 -75 10 18 -130 113 -90 -41
2832 -41 106 75 317 -136 175 9 -80 102 100 159 101 3 22 -114 114 395 -50 32 75 40 74 143 29 -69 -5
2857 -5 -15 134 -113 48 127 -13 -100 61 135 2 -45 -105 68 18 -53 -222 83 117 -102 -18 13 -12 139 -69 93
$$ packed form
2673D1k3q1J76l06K33j45J82K06l82p7J24J48p3l01K23pO5m7j01L11k21o6L7J63
2697G9j6j43j5J42j14M1O6n3J08j70L2J70j97kJ12k9M9n7n8Q2J9nj7L8L1j98J25
2724B0N7K11l99N8P2o5m4J0O2Q9k13J00p1J30O4k04J07K40k12J2J1J44k5k30O5
2749a1m3J00L0p6o8M4P2j47M9J07r5k0K7N9Q9k28J00K0pj6KJ57j03m7j3J26j13
2776eN3j12JK51q2j68K09p4j91J24K2k8O6j92N2PM2q9J37N5o4nr6P1O6m4j53J45
2804bqQ2kq0J14p2n8K46k24p0lo4J20j1j89J37m8J12o7N3K5o6Q5Qj48K43k03M9
2832d1J47l1K42m53L11j66q9J82kN9n8r8J9j36K28K81m45Q2M3l5L4O9j14r8O4
2857ej0J49k47J61P9j40q7J61P4j33m7o0J73n0p1j69L05L4k19Q4L1k5J51k08J62
$$ plain form
2882 93 12 94 -14 128 -2 58 -15 -115 -85 94 -158 -11 -121 -95 49 -63 -62 117 132 -40 -64 127 184 -76
2906 -76 -55 142 -189 -91 -56 -114 1 -80 39 0 -22 -30 -59 132 -21 36 102 252 -77 -57 29 -67 4 -72 65 -115
2932 -115 -74 -37 -30 10 -79 108 -184 172 166 -17 54 -78 61 -3 -114 13 89 38 -31 49 -216 0 78 7 -38 9
2958 9 69 47 40 95 -39 -94 31 60 -9 70 47 -35 69 -81 31 112 44 -90 -195 -6 7 -85 -37 -100 62 22 4
2985 4 16 -68 102 85 -99 -37 -12 -74 -182 86 63 -2 5 -19 111 -226 48 95 -26 -57 -34 -121 -205 160 33 33 -53
3012 -53 -39 -37 -35 -56 -199 92 -18 8 120 90 -174 -20 85 -61 33 -51 -119 -141 8 -10 105 -61 61 -29 34
3037 34 -25 54 -27 -65 28 -158 -95 -12 49 37 -120 39 -94 70 -121 -116 -11 -86 -53 -70 60 -41 -25 77 -78
3062 -78 -18 43 8 77 -142 -3 -52 106 49 -27 78 82 57 44 -70 70 -45 49 29 56 82 -49 66 49 -124 -62
$$ packed form
2882I3q1Q2j08J42j30O0p3j00L0J79k52J47j10K6J44j12JJ79J5j72k4J91N7k60
2906g6K1J97l31R8L5n8J15q1J19l9k2qk9J91j53N7O6J50l29K0Q6r6P1p6J37j80
2932a15M1L7PM0q9J87k92L56oj83P1j32J39o4j11J27P6n1o9Q0k65K16P8p1m5M7
2958IO0k2pN5j34n5J25K9o9P9k3q2J04j50J12Q1o8j34j05J89J3r2M8o3J62m0j8
2985DJ2q4J70j7j84O2K5o2j08K68k3o5Pk4J30l37K74M7j21l1K3q7q4L65j27%q6
3012e3J4KKk1j43K91j10K6J12l0k64J54J05j46R4q4o8k2J49j8J15j66J22r0O3
3037C4n9P9q1l8R3j86O3Q3O1j2j57J59j33J64j91NJ05p5L3j7J30j01J6J02j55
3062g8O0O1l5O9k19J39m9J58n7p6J05Mk5j3j14J40j15R4k0K7K6j31J15j7j73O2
$$ plain form
3088 -62 72 58 -166 67 -31 -217 38 -5 -21 90 106 41 33 -3 -30 -14 1 67 -45 52 -68 -11 -169 -58 -26 -90
3114 -90 -142 50 80 -127 8 95 -41 -1 32 -34 -72 -240 42 53 -213 -198 -170 28 -37 14 27 -147 -77 -43 142
3139 142 47 -150 64 -37 37 -80 101 85 38 -70 -48 -65 -51 16 -30 -5 -31 -37 41 -33 122 40 87 -19 -41 128
3165 128 -50 -23 28 -17 140 -206 -27 -55 96 5 -24 157 169 -18 44 131 -19 -104 -176 -36 34 51 26 -76 -48
3190 -48 47 -208 45 234 11 65 -69 58 -53 9 -130 8 -20 -192 -89 84 118 11 -85 41 48 -128 -165
3213 -165 -18 36 -81 -43 140 1 -78 13 216 -12 58 -114 -69 -19 -19 -92 -93 -70 55 62 223 90 4 101 -134 -22
3239 -22 35 -157 -23 29 -60 153 -70 -83 -1 40 31 -32 40 -216 -66 40 74 -18 18 -42 -34 -75 -123 -52 -53 211 -93
3266 -93 -118 27 -42 -36 98 -10 19 -16 -176 -18 155 -14 176 -47 144 2 -9 42 68 102 -75 112 13 46
$$ packed form
3088f2J34j4k24K33r8j86K55m3j6J11J6o5ql6k7J6J5O6j12R7j20N7j58J11L2o4
3114i0n2J92L0k07J35Q7j36M0L3o6l8j68K82J1k66J5K8J98o5N1J3j74P0L4J85
3139A42r5j97K14j01P4j17J81j6m7j08K2j7J4O7m6K5k6oP8p4J55q2M7j06k2J69
3165A28j78K7N1m5J57l46J79k8J51r1k9J81J2j87O2Q7j50q5p2J40P0J7k5j02K8
3190d8R5k55K53J89k23N4j34J27j11O2j39J38k8j72J03J73L4j07r6J26Pj76l7
3213a65J47N4j17L8J83j39p9R1K03k28P0j72M5N0%p3jK3J25PJ61j33q6R7k35J12
3239b2N7j92J34N2q9K13k23j3Q2M1ro3P2k56J50J06L4r2L6o0Qm1m8P1jK64l04
3266i3k5J45o9OJ34j08K9l5j60J58J73j69J90k23J91j42j1N1K6L4j77J87r9L3
$$ plain form
3290 46 -6 -48 42 109 -21 -39 -81 90 -37 39 56 2 -5 36 -12 108 66 -19 39 -42 52 -74 77 66 106 -134 -51
3317 -51 -13 -3 3 78 42 15 -226 -61 35 24 17 -23 46 20 -33 80 60 21 -34 1 -77 -68 -37 84 -165 104 -16 -38
3345 -38 -33 -10 99 5 24 33 83 16 -101 223 -66 -189 -64 -124 3 -47 92 -80 229 -32 9 9 72 -10 98 -159
3371 -159 123 101 100 65 69 23 -83 136 5 48 -39 -1 28 31 5 111 66 20 -34 -69 -131 123 97 -59 -43 37 74 6
3399 6 -146 126 34 -96 102 22 119 7 -60 24 -90 -8 -113 -11 -97 30 7 149 91 -141 -126 108 -82 -74 41
3424 41 -83 156 -51 -87 66 15 -19 -103 -51 -28 55 -27 -190 12 191 -109 38 29 134 207 -162 72 142 -15
3448 -15 -34 15 52 27 -83 32 2 18 -113 15 -51 2 -166 65 19 0 -60 -39 -58 -130 151 7 108 -38 -69
3473 -69 -113 -50 79 -76 3 -41 -7 -74 76 -103 -143 190 19 -34 168 138 -39 -127 103 -116 -58 -148 39 215
$$ packed form
3290D6n2m2R0O7j30j8m2J71j27P6J7n4pM1m8J20m2q5N8q1R4j26J51j1M0k40Q3
3317e1L8J0OP5l6k7k41J65R6j1pm0O9k6n3J13k0l9n5L5p8RL1J21k49K69j20k2
3345c8NK3J09r4J9RN0o7j17L24k89j23J25o0J27n0J39j72L09k61M1%O3q2J08k57
3371a59K82k2jl5Mm6j06K19j31M3q7L8K9Lk6J06m5m6n4l5o2K54k6j56J6Q0L7o8
3399Fj52K72r2j30J98q0R7j12o7Q4j14Q2j05J02q6J27k3J42n8k32J5K34j90QJ15
3424D1j24K39k07l6J53n1l4q4N2K3Q3q2j63K02J79l00J47rJ05P3l69K34P0j57
3448a5j9M9L7k5j10J15l0J6j31J28o6N3j68K31m6j9o0K1j9p2K81j44J01j46l1
3473f9m4O3J29j55P9m4L4o7J50j79m0L33j71n3K02l0j77q8K30k19N8r0J87J76
$$ plain form
3497 215 10 -40 -116 171 -26 20 37 38 -17 -45 82 26 18 -55 -79 88 -33 -59 -59 165 7 -183 92 130 81 64
3523 64 -24 -22 51 -91 137 -10 -21 -8 -61 95 14 132 -28 -41 191 -29 77 55 115 -149 -300 36 -85 -154
3547 -154 -38 40 113 -144 38 82 -110 32 52 81 55 134 120 82 -8 33 -101 -62 19 52 51 72 -133 -118 -64 19 -31
3574 -31 39 -2 -60 61 -3 -79 -75 -92 45 -78 -18 29 255 -38 -9 9 -78 17 49 -103 52 -134 64 -13 36 -100
3600 -100 -184 148 -98 91 -2 -205 39 -40 -55 23 -90 -90 -115 41 75 52 -209 81 17 -46 45 6 -80 -87 45 -34
3626 -34 -141 74 130 -39 -5 54 117 -156 93 84 26 116 -24 73 79 38 -53 -32 65 -16 -13 -66 -70 44 10 64 -117 68
3654 68 -182 -19 -94 55 -8 4 105 -86 38 -212 -26 -34 -125 -34 -11 48 9 119 -39 -24 37 72 125 27 52 34
3680 34 -66 103 -36 99 91 -27 -30 10 18 10 79 -132 92 5 -48 44 77 9 -38 63 41 13 -52 17 3 -24 -10 2
$$ packed form
3497B15k05n0p6K87j97M6J7Jn5k8J27n6qp3k4J67j21k6%K24j58j90K75L8m9j7
3523F4q8KP3j42K28j47j1J3n3J56q1J18j60j3K32k20J06k2O0k64j51L36j21o9
3547a54J16P8P3k57J82M4j92J42K0K9k6P9j4l8r0M1j34L9Q1L3jK1k05J5N4Q3n0
3574c1P0m1n8J21o4p6Mj7J37j23O0M7K26k93K9J8q7R5L2j52J55j86J98p7M9j36
3600a00q4L32k46J89r3k03K44p9j5P8j13%k5J56L4k3k61K90o4o3R1l9q6pJ32p9
3626c4j07K15N6j69L4N9O3k73K49rn8R0j40R7Om1r1K1R7q1Ln3mJ14l4N4j81J85
3654F8k50J63p5J49o3J2J01j91J24k50J86qr1R1K3N9l9J10j58J5O1L5N3r8K5j8
3680C4j00J69j39J35qj18lM0QqO9k11K24q7n3R2L3o8m7J01k2k8o5O9j4k7J4J2
$$ plain form
3708 2 -2 24 28 -87 -36 4 -90 -48 -51 -61 57 93 -52 23 -59 7 202 -30 39 47 91 26 -8 187 -19 69 190 33
3736 33 56 71 -72 -67 38 -25 106 -182 3 -150 -158 8 66 -7 40 -32 13 15 -64 88 -169 33 99 4 41 -206
3762 -206 -97 -143 -70 -27 184 80 48 46 -68 -56 107 155 -13 164 -101 -84 27 28 32 65 66 -65 90 53 -25 -122
3788 -122 -157 -45 -69 -139 -89 -118 110 -31 -118 187 -28 -92 -109 -5 -102 -39 -128 -41 -111 -61 -66 69 12 -38 216 -44
3814 -44 6 54 -49 221 107 71 -17 -50 -54 132 26 -73 -74 -136 62 -20 -96 -162 -43 -37 -7 -131 10 -95 142 60
3840 60 114 39 99 -52 66 56 25 -30 -152 36 12 -36 194 171 -102 -52 -84 -12 -7 82 -31 11 -34 49 -72 -34 -50
3867 -50 158 83 -60 21 42 -129 84 59 -74 -19 29 57 -68 -49 -61 -21 -138 -24 -83 -24 73 16 -51 8 -76 -36
3893 -36 38 55 14 148 112 52 58 62 55 -4 -55 -11 -22 -96 -164 -16 -61 -147 40 -63 -31 -58 -37 -217 -8 -236 -2 46
$$ packed form
3708BmK6Mj15N1M0r4M2lj0J18L6j45P5q2O6J95k32O9QM4o5l4J95k06Q8J21j57
3736C3K3J5j43NJ05o3J31k88J85j53qJ66N8p3M7p2M5Kp9J52k57K02O6r5L7k47
3762b06J09m6P3M3K11j04l2kj14J2J63M8j68J77k65J7J11JML3Jj31J55l7p8r7
3788a22l5J12k4p0N0k9K28j41q7L05k15o4j7J04r7O3q9Q7p0N0nJ35n7n0K54k60
3814d4N0M8j03K70j14l6q8l3mJ86j06r9jo2J98q2p6o6J19OL0j24J41j05K37q2
3840F0N4p5O0j51J18j0l1n5j22J88k4m8K30k3k73N0l2P2NQ9j13M2m5Q3j21L8j6
3867e0K08p5j43Q1K1j71K13k5j33N5M8K8j25J9j2M0j17J14n9N9R7n7o7N9q4M0
3893c6P4J7m1J34l6o0OMpn9n1M4j1p4o8J48m5q6J87j03L2k7K1j80K09k28K34M8
$$ plain form
3921 46 22 -24 38 -10 132 -46 -77 -66 -62 9 -6 66 -49 34 -20 130 -12 36 89 15 -40 153 50 17 -138 -18
3947 -18 124 30 89 -51 -44 39 -55 -73 -23 60 83 -139 2 -92 140 193 69 68 72 -59 -8 73 -84 -18 119 83 42
3974 42 -53 -132 -94 38 11 -58 62 80 18 -14 197 -21 -99 -11 90 -4 38 -11 51 -2 75 -1 70 -49 -65 -34 -172
4001 -172 3 -37 -111 -77 9 -71 49 43 -29 -118 31 -38 -11 -85 7 28 53 104 1 104 -69 -115 6 117 -94 45
4027 45 22 -60 -73 102 -36 -53 -6 -2 29 14 119 73 -42 -105 -12 -14 51 148 -90 -12 -177 30 75 -69 109 -18
4053 -18 77 102 -239 -91 -105 51 27 33 -52 9 -33 -78 29 69 -46 -89 -69 55 -14 86 -2 37 -180 167 51 11
4079 11 153 -29 -45 -160 99 -119 -10 57 -35 142 17 13 53 153 -114 -82 82 -52 -7 -144 91 48 55 22
4103 22 80 -45 152 -21 -128 -33 39 38 -82 -89 30 -100 -159 -89 7 -89 -168 -62 49 -69 100 92 24 138 -164
$$ packed form
3921D6k4m6O2m8J42j78l1J1MP1j5P2j15Q3n4J50j42M8N3p4n5J93j03l3j55J20
3947a8J42r4N9j40PQ3r4j8N0Q3K3k22J41r4K32N3j24jMj31N1Q1j57O6J37l6m1
3974D2r5p9L8J32k7o9J20J8o2l2K11k18p8Q8J01r4M2m9O2n3P7p6P1j19j6L1j38
4001a72J75m0p4L4Q6q0J20op2q9J49o9K7p4R2K1K5N1j03J03j73m6J21J11k11J39
4027D5k3q2j3J75j38j7M7ML1j5J05m6j15o3R3kO5R7k38P8j65K07M5j44J78j27
4053a8R5K5l41J48j4J56k4Oq5O1m2m5J07M0j15m3K0J24o9J00q8L9k17L47j16m0
4079A1J42j82j6j15K59k18J09O7r2J77j25mM0J00k67L2J64j34M5j37K35m3Pl3
4103B2N8j25J97j73j07R5P2jj20pJ19j30n9P0R6r6p9J06J11j18J69qo8J14l02
$$ plain form
4128 -164 -48 -12 -40 31 35 -49 -94 -3 -18 -35 230 58 -47 12 29 16 3 -34 -36 18 -77 24 39 -50 -50 14 -26 -30 41
4157 41 -91 -37 39 103 0 -147 224 -87 129 60 41 -43 -17 -59 -147 74 -94 -29 -164 -140 -228 -17 -23 15 -97
4182 -97 184 -52 113 163 32 41 54 -84 1 -65 37 -49 -33 -12 16 217 -49 -102 -66 26 -24 -48 -55 61 8 -16 -75
4209 -75 -132 3 -64 -49 -2 -75 -53 79 152 -15 -12 -125 14 -112 5 101 -99 -32 -86 29 194 16 -77 -13 -46
4234 -46 89 -50 -87 -157 102 14 -62 -65 2 -81 51 -30 21 -21 -38 38 -6 28 83 -193 -110 19 -40 -22 -167 -11 200
4261 200 -63 65 -24 -173 -82 2 78 26 -38 124 -163 -44 67 -134 -32 -30 -107 28 -57 58 15 -80 -31 95
4285 95 5 58 -7 -2 -17 40 -61 -166 57 27 -106 -87 -122 59 -24 -15 45 73 20 118 80 73 165 97 99 -212 57 -46
4313 -46 -37 112 54 -73 -32 10 -68 -4 -12 -109 -108 -64 -66 -7 115 -17 -27 -147 -72 23 -37 -97 16 48 -121 -41 -132 -84 -15
$$ packed form
4128a64J16L6k8P1Mq4m5R1j5j7K65j72j05N9J7j3j3l7kN4r5J01J5q9%O4m0mP1
4157D1j32N4P6O4j03j47L71l11K16o9j9q4K6m2q8K21j68O5j35K4q8K11oL8j12
4182i7K81k36J65N0j31RJ3j38Q5o6J02q6J6K1K8K01k66n3L6R2n0k4pJ16n3k4n9
4209g5n7J35o7J5M7p3K2J32P3j67Lj13J39j26J17R6k00O7n4J15J65j78r3O4l3
4234d6J35j39l7p0K59q8p6lO7q3J32q1N1m2j7P6m4L4N5k76Q3J29n9J8j45J56K11
4261B00k63J28q9j49R1Q4P6n2o4J62k87J19J11k01J02Kp7J35q5J15m3r5M9J26
4285I5r0N3o5Nj5N7j01j05K23l0j33J9l5J81q3RO0K8n3R8l8pR2o8Kl11K69j03
4313d6RJ49n8j27M1M2p8O4qr7JM4kN9J22j32j0j20P5R5o0o0J13L2j69Q0r1M8O9
$$ plain form
4342 -15 -72 36 120 -10 -32 -31 -72 68 87 -103 21 -23 40 -30 -17 87 -44 10 208 168 -82 10 -151 -5 6
4367 6 12 133 -183 54 -84 70 -36 -155 -122 17 -67 -26 38 66 -175 71 4 -45 -29 -123 140 -67 125 -62
4391 -62 29 27 -69 25 47 -140 21 -16 49 -90 92 -31 85 -183 -74 -65 -24 -49 -38 48 32 -102 63 139 -51 -105
4417 -105 -78 -67 134 62 -26 129 -20 12 -24 -45 21 37 -303 115 -34 -27 33 20 28 15 76 121 -51 64 -44 81
4443 81 -90 -17 33 55 68 -207 20 -138 -74 8 11 -154 27 -14 -19 16 -30 -112 -24 -87 -85 57 10 -126 -53 3 41 129
4471 129 27 32 -10 18 -104 115 65 -99 -67 77 35 -110 85 82 -40 -35 -59 64 41 114 -17 14 -77 -100 -56 -167
4497 -167 57 22 -58 -43 -6 -224 43 33 -64 89 -24 -103 81 35 51 -77 -104 -10 -161 56 -40 37 11 41 139
4522 139 -15 107 16 -75 69 107 72 25 -27 -16 78 -165 35 -30 -198 -18 -42 -27 -74 67 -11 23 166 -54 -83
$$ packed form
4342a5n7J08Q4j30k2Jm1J40J9j90J24m4O3p0J3J04j31N4J98m0k50R2j61J46J1
4367FOJ21l16K37j38J54j06j19L3J39q4M1O4K8k41K46o7m9J6r4K63k07J92j87
4391f2R1kr6R4K2j87J61l7O5j39J82j23J16k68J09RM1k5J1Q6j6j34J65P6j90n4
4417a05K7J1K01p2q8J55j49L2l6k1O6J6l40M18j49PO0j3Qj3O1M5j72J15j08J25
4443H1j71P3N0K2J3k75K27j58O4Q2Lj65J81m1nL5m6q2Q8o3KJ42m7j36P3N6L8Q8
4471A29j02Nm2K8j22K19n0j64L2J44m2j45J95lj22Nk4J23k3P3j31L1r1k3M4j11
4497a67K24l5q0J5L7k18K67j0r7J53j13p9J84m6J6j28k7R4j51K17r6P7k6L0R8
4522A39j54J22r1r1J44L8l5m7n2J1R4k43K00o5j68J80k4J5m7J41p8L4J43k20k9
$$ plain form
4547 -83 -14 17 148 54 10 75 -7 35 -64 -8 -31 -95 -35 0 -75 6 -30 32 -29 -14 44 64 -37 186 -53 -146 162 -34
4575 -34 -14 -85 -72 119 116 -17 11 196 78 -193 253 -94 30 -110 164 -88 57 70 42 106 145 17 94 2
4599 2 3 165 -24 162 37 83 14 -27 75 128 12 118 45 -89 57 -117 -64 -7 105 17 61 35 64 45 -148
4624 -148 35 101 46 91 37 -29 -102 -22 -55 -63 31 83 -18 -72 -75 -78 -74 73 -20 72 63 135 6 56 84 -111 100 52 78
4653 78 109 50 58 102 -216 66 -20 83 30 -7 79 56 160 -9 -32 -81 39 -172 -47 171 143 83 -13 133 134 -37
4679 -37 -41 -9 -115 95 -70 -75 41 -153 -19 -149 -40 81 -30 78 66 -174 26 -26 -71 80 -33 76 -54
4702 -54 73 -39 6 -9 -58 89 59 72 -38 10 45 -79 -209 56 -33 28 138 -91 -58 54 9 20 -103 20
4726 20 47 -78 41 13 -1 89 -95 -121 109 -58 -104 31 -33 38 22 -79 -56 -148 26 -144 166 61 39 -14 -18
$$ packed form
4547h3O9L1J31r4m4O5q2M2r9N6k3o4O0L5p5Q1l6O2o1J5N8K0j01K23k39r3L08j96
4575c4K0p1J3J91lj33K8J85j18k71M46l47J24j40K74k52J45J3k8O4L9j28P7r2
4599BJJ62j89J86j25M6o9m1J02N3j16J06p3j34J46j74N3N7J12q8M4k6K9j9j93
4624a48J83O6n5M5n4o6p3Q0l3qR4N2j01n4llMJ47r3R2rP2j29N0K8j95K11m8K6
4653G8L1n9QM4l18K82q6J03n3l7Q6k3J04j69k3m9J20k11J25K18k8o0r6J46Jj71
4679c7mL2j06K10j65nJ16j94J34j30J09J21j11J08j2k40K00n2m5J51j13J09j30
4702e4J27j12M5j5m9J47l0J3j10M8L5j24j30K65q9O1J10k29L3J12m5J1j23J23
4726B0K7j25J19k8j4R0j84k6K30j67m6J35o4P1j6j01K3r2J74j70L10j05k2n3m
$$ plain form
4751 -18 -99 0 60 -117 -47 -27 126 -3 -41 45 -143 61 -48 155 203 11 92 -59 63 52 36 -105 30 105
4775 105 63 8 -101 -52 1 -129 53 77 -61 -129 190 -63 -24 -40 -11 5 125 -31 -69 94 -58 158 -105 78
4799 78 -28 -32 -2 -153 144 79 -51 13 49 16 -4 210 96 -146 -37 -33 -264 33 74 -169 188 -104 -106 207 -68
4824 -68 -44 80 -20 13 9 -81 -76 56 -21 -77 70 -140 43 -72 170 -88 130 150 -20 52 12 78 -75 29 21
4849 21 35 -60 -138 -95 -175 93 29 69 -2 24 47 -21 -113 -29 151 -22 61 32 -17 -21 54 -120 -25 -20 48 -11 8 -122 -10
4878 -10 123 7 -82 -152 -51 67 110 -63 1 -7 51 -54 -129 -136 100 70 35 -161 -35 5 54 97 -21 135 32
4903 32 -119 -39 -67 48 39 -34 -36 -94 105 29 9 50 26 19 -12 151 -9 -27 16 92 38 -31 -6 149 103 -53 40 74
4931 74 -134 120 -58 58 39 -5 -84 -105 53 -2 142 -90 -14 44 34 -1 40 173 -59 -59 28 119 166 12 -38 52
$$ packed form
4751a8q1R9O0j77P0K0J53j29l8Q6j88K04j09K03M8j92Q1j51J22j1j6j41J35P5
4775A05m2n5j09M9N3j30J82K4j38o8L19k53L9j6K9J6J20j56l8J63j52K16k63J83
4799G8j06mL0j51K97o5j30O4L6l3k0K14j14k42J09Mk31K97M1k43L57k92kL13k75
4824f8K4J24j00L3mr0NJ32p7n6J47k10J83j15K42k58K18K0j70P2m0O6j53J04q
4849B1J4r5p8M3q0K68o4M0p1K6K3o8r2Q4J80j73Q3k9m9mP5j74R5NO8n9J9j30J12
4878a0J33j16q9p0J01J18M3j73O4qN8j05p5pK36l0l5j96J26M0M9M3j18J56j03
4903C2j51Q0k8J15rp3kn8J99p6k0M1k4pl1J63j60j8M3P6n4o9K5J55m6j56R3L4
4931G4k08K54j78J16j9m4p9k1J58n5J44k32P6N8j0l5M1J33k32%Q7R1M7j54n0R0
$$ plain form
4957 52 -101 107 68 -86 4 85 -57 0 -39 -97 -61 101 98 72 74 -12 -151 -79 -124 -103 -54 -14 -65 -133 -145 -207 22 -11
4985 -11 -165 -39 -64 -57 76 -115 -70 67 83 80 -21 26 51 54 -123 33 -82 -67 -71 -58 134 111 -47 -36 -78 91
5011 91 -37 17 3 -90 -71 39 -18 2 145 -152 101 -137 32 -149 10 27 -70 -69 99 94 158 -5 -60 61 70 96
5037 96 122 57 4 -101 -32 -99 112 49 -61 150 68 111 -91 -59 68 225 -61 -10 35 24 2 -94 30 30 -64 -5
5063 -5 22 -151 95 22 -34 11 5 124 -21 -11 -51 86 59 196 -72 27 -68 -169 -140 2 54 -12 116 42 12 -32
5089 -32 -175 19 -2 -135 -90 -37 10 -93 59 -66 -85 110 -21 34 138 26 -59 -98 -110 -78 -30 38 -127 122
5113 122 -78 35 -22 -144 -50 -168 214 32 37 154 -23 -128 127 -97 -53 34 24 -77 -61 -113 -124 -92 -16 -41
5137 -41 -145 -27 -161 20 7 -27 -72 121 68 1 -83 3 -51 10 14 -45 -21 -25 -18 10 191 65 15 45 121 0 -225
$$ packed form
4957E2j53K08l9j54R0Q1j42N7l9n8L6J62lk6Kq6j39P2m5K1M9M0n1o8j2o2K29l3
4985a1j54J26k5PJ33j91M5J37J6lj01M7K5Lj77J56j15J5mJ3J92k3j58J1m2J69
5011I1j28N4j4r3J9J10n7K0J43k97K53k38J69j81J59J7r7JJ68nO4j63n5J21RK6
5037I6K6o5n3j05O9o7K11o3j10K11q2M3k02L2J27J57k86N1M5j1k2r6J24%r4N9
5063eK7j73K46p3n6M5oJ19j45J0m0J37k7J37k68R9r5j01K9J42N2o6J28p4l0m4
5089c2j43J94k1j33M5N3M7j03J52j25j9J95j31N5J04j12q5l9j2L2M8O8j65K49
5113A22k00J13n7j22R4j18L82j82NJ17j77j05K55k24M4Q7j0j01J6n2j1L2P6k5
5137d1j04J18j34J81j3l4m5J93n3o7q4Q6n4O1Mn9K4mPK8J81j26n0L0P6j21k25
$$ plain form
5164 -225 -44 79 -51 155 93 31 -88 214 76 7 152 -19 -166 -23 -17 -46 -162 -56 87 -8 126 23
5186 23 -5 -86 80 -3 -37 -5 48 -6 -11 30 6 -24 35 53 117 12 -3 6 -31 -86 -103 27 -76 -44 -9 -80 -37 -60 -55 -30
5216 -30 -63 96 125 -48 -183 -25 -28 -39 116 73 89 -101 -73 -3 -140 -39 113 152 194 2 111 15 -3 -20 -61
5241 -61 147 24 50 1 -98 -57 14 -71 73 -29 9 -5 -3 -83 91 -80 -92 -153 -6 4 -35 6 4 -133 -76 -80 -67 -3
5269 -3 -77 -68 18 -59 -37 19 -46 -29 -100 -61 -97 95 -32 173 -193 63 -59 -72 31 -197 3 33 -6 -78 23 70
5295 70 46 -10 21 -133 -116 99 69 28 117 -116 -103 -132 -90 -19 -5 -25 -166 1 12 -59 -36 -68 -26 -138 -40 -4 -27
5322 -27 36 26 -26 72 70 -126 163 28 106 33 -53 174 17 -37 -88 -27 143 -140 51 -45 106 -60 -185 213 30
5347 30 69 12 49 3 -173 -133 72 -21 39 32 -83 71 170 43 -44 -133 -119 8 -71 -22 -7 -9 -80 58 -15 119 178
$$ packed form
5164b25J81J23j30K06o2o2j19L02j38o9J45j71j47J43Ok9j16J06J43r5J34j03
5186B3k8q1J66q3l4L2N3n4nM1k4l0N9J8O4j05j5Rl7n5j7J30j03L2L5p1M3k3NK5
5216c0l3J59K9j73j35J58lj1J55m3J6j90K8P0j37J01J52L9M2j92J09r6j8j7m1
5241f1K08j23K6m9r9M1P1q5J44j02L8j4Kq0J74j71j2o1J47J0l9M1kj37N7mJ3O4
5269cp4RQ6p7K2N6o5J7p1L9l6J92j27K05l66K56j22j3J03k28K00L0l9p2J01M7
5295G0k4n6L1j54J7K15l0m1Q9k33J3k9M2P1J4k0j41J67J1p1K3l2M2j12R8L6k3
5322b7O3j0n2R8kj96K89j35P8p3q6K27j57n4n1O1J70k83J91r6J51j66j25L98j83
5347C0L9n7L7m6j76M0K05r3O0pj15J54R9j27q7q9J4J27p9M9J5kp1J38p3J34N9
$$ plain form
5374 178 29 -10 -71 41 10 -12 -155 33 -49 -109 -17 145 -127 -183 5 59 59 93 141 -32 -63 -31 -88 7 -240 80
5400 80 -35 193 27 -68 61 17 107 20 30 33 -1 137 25 29 6 -106 -21 15 11 -58 71 13 74 150 18 23 123
5427 123 -108 -112 77 -6 -66 -60 -80 89 -61 48 -45 -28 -21 61 -97 -49 -130 70 -101 165 -94 19 86 -14 3
5452 3 196 -112 53 76 -176 -10 102 -64 109 -90 -63 58 51 -41 -36 30 56 22 -47 -59 65 -1 -30 -28 -84 59
5478 59 -57 -57 131 -24 -140 18 193 -112 54 36 84 50 -21 -42 -107 -73 15 161 75 113 92 94 19 66 -159 -11
5504 -11 -133 -55 -56 96 -42 -30 -97 -242 70 -7 110 -75 -28 3 32 72 88 -123 -125 -11 4 178 -8 26 -18 54
5530 54 35 -91 -68 -36 -119 -81 140 -46 -104 11 -92 28 -104 100 33 81 -79 -129 -136 57 113 -31 -34 -13 33 -70
5556 -70 -73 113 56 33 -8 -103 52 -96 66 122 -95 43 -79 -134 90 -3 183 34 -214 -61 -69 -11 -18 101 -52
$$ packed form
5374A78j49l9o1J12l1k2j43J88q2o0R2J62k72n6J88N4%L4M8j73l1L2n7R5k47L20
5400H0j15K28j66r5J29m4R0q7J0Ll4J38j12Mk3j12Q5L6mo9J29n8O1P6j32NJ00
5427A23k31mJ89q3o0Ok0J69j50J09r3J7PQ2j58M8q1K00j71K66k59J13O7j00J7
5452CJ93l08J65K3k52J66J12j66J73j99K7J21pr2NO6K6l4o9j2J24o6k9Kn6J43
5478E9j16%J88j55j16J58J75l05J66j8M8l4p1k1o5L4Q8J46q6L8k1Kp5M7k25J48
5504a1j22P8jJ52j38J2o7j45L12p7J17j85M7L1K9M0J6k11kJ14J5J74j86L4m4P2
5530E4j9j26K3L2q3L8K21j86n8J15j03J20j32K04o7M8j60n0pJ93N6j44lK1M6j03
5556g0lJ86n7k3m1r5J55j48J62N6k17J38j22n5K24r3J86j49k48J53qN8pJ19j53
$$ plain form
5581 -52 -107 -59 -57 52 77 1 -44 -236 -28 -200 167 94 28 93 -118 161 -37 -129 -25 -57 -132 -124 -94 -7 35 117 -107
5608 -107 -89 -82 79 -98 -38 -16 70 67 49 47 -8 115 77 11 8 -13 63 -30 3 101 82 -264 82 80 -30 -69 -60 -170 -110
5637 -110 -83 16 139 3 -55 -35 -27 105 81 17 112 -14 82 -3 -4 -20 -139 70 -17 -71 -22 -18 -14 2 -155 -71 106 10
5665 10 -49 50 -58 -59 9 32 -66 -60 -55 21 45 85 43 17 -67 -55 -11 3 -37 15 22 82 121 13 -37 -27 62 -107 -30 -16 -30
5696 -30 5 -111 20 -18 8 -98 96 124 67 -24 -2 -39 -96 -84 -82 145 -127 106 236 -100 97 -31 -84 11 118
5721 118 -27 133 -76 10 -73 27 -6 -1 -8 -21 -157 -37 86 39 -52 -37 79 96 6 136 97 130 5 -18 73 23
5747 23 87 118 12 -53 -59 -5 38 13 -154 27 92 2 25 130 -48 -35 29 -117 86 -29 -55 79 -157 41 21
5772 21 125 -3 14 -83 -132 76 -80 0 -49 55 -10 -85 18 77 149 -159 16 55 37 102 -87 41 175 81 -35
$$ packed form
5581e2n5M8KJ09K5p6m5j92K08j72L67p3o6O5k11K79j98r2J04l2p5QL0Q7M2Q2k24
5608a07J8PJ61j77O0K2Q6lj8kn5J23l8o6lk1P6r3L3R8j9l46L46kj10l9Rj10O0
5637a10K7R9J23j36n8K0QJ32k4o4R5j26R6q5jj6j19K09q7n4M9MMJ6j57Q4J77r6
5665A0n9R9j08jO8K3r8ONP6K4M0m2k6q4J2M4J4m0N2PO0L9j08n0J0Q9j69P7J4j4
5696c0L5j16J31l8K6j06J94K8n7r1K2l7n7J2KK27k72K33J30l36J97j28n3R5J07
5721A18j45J60k09Q6q3J00l3Npj3j36J20J23m7r1J5J16J7r0J30l9L3j25k3R1n0
5747B3O4L1j06o5oN4M3k5j67J81O5r0K3J05j78J3O4j46K03j15k6J34k36J98k0
5772B1J04j28J7r7m9K08j56Q0m9J04o5p5J03N9P2l08J75L9j8O5j89J28J34r4j16
$$ plain form
5797 -35 34 -63 19 46 15 3 37 130 23 80 -58 -26 -98 -29 59 28 -31 82 16 -43 -137 48 29 119 22 55 7 -11
5825 -11 -6 12 -28 22 -7 127 -93 131 154 117 -32 -143 20 79 -54 -61 -3 -102 9 -6 -108 65 -100 47 99
5850 99 -153 -21 10 -67 82 118 -60 5 190 -15 -88 28 46 45 -147 159 -1 120 71 6 204 109 92 112 131
5875 131 -72 8 -2 -159 28 -43 38 2 10 -186 52 -56 -57 143 -7 5 46 201 193 -37 2 86 40 82 -21 76
5901 76 169 29 54 113 -3 -104 -75 -24 158 107 -70 96 5 122 147 75 77 65 -15 -102 31 11 -110 -9 -25 -67
5927 -67 81 57 -90 59 -32 -53 -218 63 -231 -131 94 -23 117 82 -77 -122 -54 -18 7 143 70 -116 -61 -159
5951 -159 110 1 92 -2 176 138 -127 28 -6 23 -98 -94 144 152 97 -13 156 117 12 118 118 -53 -112 5 -88
5976 -88 97 -1 -52 -7 123 75 -38 170 -43 -18 -64 46 182 -81 54 113 45 175 -36 31 -41 -29 40 100 -36
$$ packed form
5797c5O9r7Q2K7l1j2L4R3j07N7j38L2p2O9Q8l1n9J13o6n9r4J85j9R0r7L3m8j8
5825a1NJ8m0N0k9J34k20K24K3l7j49j11J63N9j33pN8r9J11j5j02J73j65J47N2
5850I9k52J32L1p7J49L6j78O5J85k05p3J16J8jj92L06j60J21m9o5J98r5j7K0J9
5875A31k03Q0j0j57J87p1Q1l6Qj96K38j08jK00j50J2M1J55qk30L9Q4m6M2j03R7
5901G6R3j40K5N9j16j01K9N1J82n1j77J66r1J17K5p2Kj2q0q7J33k0j21J01j6m2
5927f7J48k4j47J49r1k1j65K81k94J00K25j17J40l5j59m5O8L6K5J36p3j86N5r8
5951a59K69j09R1r4J78l8k65J55l4K9j21MK38Qn5j10J69l9j05J06%j71n9J17r3
5976h8J85r8n1M5J30m8j13K08k13K5m6J10J36k63J35N9o8J30k11O7p2J2O9O0j36
$$ plain form
6001 -36 -34 39 52 49 73 -32 -142 38 -22 58 -57 49 -116 -39 7 -11 87 69 48 -89 64 69 104 70 40 20 -30 -9
6029 -9 80 26 15 84 48 58 -59 -12 -81 -29 154 -5 -64 135 17 227 36 3 -55 20 2 67 -26 -100 67 -14 113
6056 113 39 180 -86 -45 -84 -41 -120 -25 -35 -180 -29 -192 -19 -26 192 -12 -113 16 66 24 67 134 -31 -84 44
6081 44 51 34 -72 -89 -72 -7 -18 4 40 14 147 -196 26 -78 -51 -190 -69 6 -39 21 7 -125 -9 107 -61
6106 -61 -119 30 95 -63 76 132 -40 -138 -102 62 -83 -127 10 46 -8 -9 -67 -63 -75 -69 -2 -21 83 -5 86 54 -23 73
6134 73 82 15 135 4 66 -97 -139 -63 -118 -60 -100 -62 -150 108 -115 60 -178 161 -71 -26 -24 90 63 110 163 31
6160 31 88 -32 -80 13 72 33 90 -1 41 50 -110 -82 86 -33 1 -55 -52 -19 62 -17 -194 182 -43 -32 -103 -204 -27
6187 -27 31 34 -111 105 -115 5 38 29 56 -89 -109 92 -18 10 -35 -75 -7 -49 -40 -12 127 -79 24 -28 -25 93 84
$$ packed form
6001c6KP3J3lK4j05j10J80o0Q0j15J06j65P7M6j8R8j8k1j37J53NL5l4l0k0n0K1
6029iQ9n4j1O9l6J0j17M7o9N2J83j59n9J99j18K10j91l3n8P5j8O5r3p4J67q1J27
6056A13p4J41k66M1l9M3p9R5j0j45J51j63J73pK18k04j01J29N0m2M3O7j65n3J28
6081D4Pj7j06j7J7O5j1K2L6k6J33l43K22j04K7j39J21P5m5O0j4j32J16J16j68
6106f1n8J49O5j58J39N6j72r8L6J64j45m4J37L6n4jn8Mj2OO7j9J04q8R1l2p7R6
6134G3Ro7J20j31O2j63m2P6n5N8m0L8q8K58k23J75k38L39k32M5KJ14k7M7N3j32
6160C1N7j20m8R3N9l9N7r1M2Rj60K8J68j19L4n6LL3Q1p9j77L76k25J1p1j01J77
6187b7N8Lj45K16k20J20L3rK7j45k0K01j10K8m5m0O8m2RK8J39k06J03n2LJ18r
$$ plain form
6214 84 106 96 101 -66 -27 -9 23 0 106 -90 -59 100 -86 19 -91 54 19 -2 128 -8 -25 -76 -18 61 28 -155
6240 -155 101 -148 2 34 37 -19 41 116 79 45 191 53 -43 37 -87 -16 4 -19 0 -160 131 1 -58 -21 142
6265 142 18 -184 151 85 -10 107 33 22 -52 4 163 -7 -72 -52 10 8 -31 17 -115 -76 -58 11 42 137 121 -17
6291 -17 109 -58 22 30 6 -110 -129 63 -97 15 96 -19 46 -104 -4 107 -2 53 -28 62 21 -2 -90 4 8 -16
6317 -16 30 29 -35 -134 -88 48 78 -109 4 -48 -45 -10 17 -20 -38 -17 -93 47 -37 77 -2 -76 -102 -45 23 1 -28 68 -108
6346 -108 -50 83 106 109 74 128 24 180 -99 -200 164 -45 75 -128 2 146 6 67 91 -74 -9 61 166
6369 166 123 -190 -45 -32 88 -18 33 19 -20 92 -133 -68 32 -193 -83 -11 -62 109 61 -84 0 -23 106 86
6393 86 -33 0 7 3 2 -24 40 -48 26 -39 -14 -40 54 39 -75 191 -23 40 131 -8 67 38 -77 42 64 14 -17 151
$$ packed form
6214H4K2j0Nj67L9J8L2k3J06j96L1J59j86J05j10J45l5k1J30j36j7n1N8P9l3j83
6240a55K56k49J50L2Ln6O0P5l7l4J46j38r6Q0j24P1K0k3J9j60K91j30n9L7J63
6265A42j24k02L35o6r5J17p4j1p4N6J59j70o5K0O2kl9M8j32L9J8O9L1R5j6j38
6291a7J26j67Q0Qk4j16j9J92j60J12Q1j15O5j50J00J11j09N5q1R0m1k3q8R4Mk4
6317a6M6jo4r9M6J36L0j87J13n2LL5K7l7j8K1p6J40q4J14p9p4k6N7O8k2k9R6j76
6346a08N8J33K3Ll5N4j04J56k79j01L64k09J20k03J30J44j40O1K4j65O5P0J05
6369A66m3l13J45J3J20j06N1j4l9J12k25O5J00k25J10P2n1J71m8j45Q4k3J29k0
6393H6j19L3Pmjk6O4q8P4o5K5k6R4j5j14K66k14O3R1j39P5k9j15J19K2n0l1J68
$$ plain form
6421 151 102 -105 -8 -3 -46 -3 -151 -19 15 212 -87 -9 -17 67 32 79 23 77 -126 -89 116 68 -80 -45 17 149
6447 149 3 19 50 20 -35 115 -27 -75 79 7 -91 12 -10 -138 -30 -46 38 -5 36 16 37 -35 -12 39 19 34
6473 34 121 127 61 48 -26 -47 110 -191 91 27 -43 40 -9 -113 52 -57 4 15 -111 -61 -75 -90 -103 66 144 25
6499 25 74 -14 -44 -47 -50 93 -82 63 -67 -84 28 -196 -23 159 -54 70 -75 91 -50 -44 29 25 -130 187 -149
6524 -149 173 12 69 31 -133 43 165 20 -131 80 -56 83 111 151 134 110 35 -2 -160 -6 -6 44 14 114
6548 114 -54 194 -15 -261 -97 -14 -133 -21 -158 196 -86 -41 -104 -136 115 83 -192 68 -117 -149 -95 -143 -97
6571 -97 122 68 -167 -98 -37 27 32 16 39 2 101 -23 9 -91 56 136 -144 -41 32 -108 -18 -35 -33 150 -6 -114
6597 -114 -249 6 192 -37 -21 -116 -33 74 -27 44 51 16 0 -114 88 -73 152 102 28 -17 -26 54 -31 -95 36
$$ packed form
6421A51m9k07R7Nm3M3j48J32L4J97k99P8qQ4l5M7n6N4k03L7K05m8j48L5O2J32
6447A49j46J6L1l0n5J50j42m8J54p2r8J03k2j28J08j6Q4m3M1k0K1p2K3N1k0J5
6473C4Q7Oo6j3p4k1J57l01K82o4p0Q3m9j04J65j09O1J1j26N0j4j5j3J69P8j19
6499B5M9q8l0llJ43j75J45j30j7J12k24J73J82k13J24j45J66j41OP3mj55L17l36
6524a49L22j61N7l8j64J76J22j45j51K11j36J39K8M0j7k4p5l7j58J54%N0l0J00
6548A14j68K48k09k46J64Q3j19J12j37L54k82M5o3l2K51l2k75K60j85l2N4m8M6
6571i7K19n4k35O9O1O4Nj6K3l7R9j24L2j00J47Q0k80J03P3j40R0j7KJ83j56j08
6597a14j35K55J86k29J6r5Q3J07j01P1Pl5j6j14K02j61K25n0p4m5rQ0q5o4J31
$$ plain form
6622 36 -41 -251 37 -173 -27 41 223 17 -52 17 57 220 43 -65 -145 95 -104 -4 -75 -50 43 135 -203 -37
6646 -37 76 44 -114 -138 -174 27 25 -21 87 65 101 -16 39 118 -24 4 -47 117 -5 -20 141 104 28 -32 27 52
6672 52 -204 -9 -39 21 -130 18 61 -4 171 -33 64 -15 -26 167 51 -45 -16 -25 106 -28 -62 -28 46 25 15 220
6698 220 -57 -107 31 -144 -22 -14 49 7 -13 -59 140 -25 -119 -42 70 71 195 -99 207 -114 -142 -51 -52 99 -4
6723 -4 51 -124 15 109 63 7 108 57 128 163 -119 84 -103 181 -73 -52 129 35 -12 95 4 26 14 -68 -67 -106
6749 -106 54 32 -25 4 -101 -69 -116 -140 -28 -271 177 -89 -17 80 41 -84 -99 127 56 -92 176 -58 26 18 -30
6774 -30 196 17 73 32 -88 -52 -63 44 -14 -17 -58 -88 -59 -54 -2 103 -65 202 -90 66 -50 -8 67 15 -67 142
6800 142 -206 24 -78 -58 -10 -14 47 70 -27 -27 -28 -32 138 -33 187 76 42 -30 181 -5 3 42 74 71 3 10 160 145
$$ packed form
6622C6p7k10K88k10J46O8J82k06o9O9M0J63j77j08q0K40j99J00p1K5R3R2l38J66
6646c7J13l2j58k4l6K01km6J08k2L6j17N5P9j42K8n1J64j22j5J61l7p6o0N9K5
6672E2k56J95l0O0j51J48M3o5J75k04R7p9j1J93j16r6K9rJ31j34l4L4P4k1j0K05
6698B20k77n0J38j75J22QO3m2k0m6J99j65r4P7J12JJ24k94L06l21k8R1jJ51j03
6723dN5j75J39R4m6n6J01n1P1L5k82K03j87K84k54K1J81r4m7J07r1K2j2q2Jl9
6749a06J60k2n7K9j05L2m7k4J12k43M48k66P2R7l9j25j5K26p1j48K68k34Q4qm8
6774c0K26j79N6m1j20L6j1J07n8lm1l0K9NN2J05j68K67k92J56j16M2P5n2q2K09
6800A42l48K30j02K0M8mO1K3r7%jmJ70j71K20j11l4p2K11j86QL9L2lo8PJ50j5
$$ plain form
6828 145 -27 -181 54 -47 74 -65 -29 -145 -4 76 -65 78 136 91 23 72 249 -6 -176 19 73 -59
6850 -59 -58 2 14 -71 122 -15 42 87 35 -60 -25 -102 -39 -43 -46 -56 -38 -8 63 92 54 192 -104 -89 12 -12 -127 55
6878 55 -10 145 90 -31 7 -17 -46 -27 -106 24 54 63 44 64 211 33 -136 -47 29 17 30 -8 23 -21 187 71 75
6905 75 -69 3 10 -131 -31 -129 63 -68 104 4 83 -18 183 96 93 -2 77 48 63 39 -129 207 -50 61 -23
6930 -23 53 103 2 5 78 -12 -16 16 -163 22 -110 -76 41 -9 -58 64 -77 -4 -83 74 -46 -7 124 -36 -87 -295
6956 -295 -31 27 -39 -4 132 -7 190 -78 38 99 -14 0 94 -50 -34 36 44 -87 99 -36 -6 71 -1 -38 -83
6981 -83 -169 -201 -35 17 68 101 9 39 -11 31 -43 -61 22 17 38 -90 54 -37 -71 -36 -1 91 47 20 -128 -71 -116 23
7009 23 5 41 -16 63 116 6 -106 13 67 -20 31 23 -6 21 -2 -177 41 -41 -42 -11 12 -55 46 -146 40 136 -26
$$ packed form
6828A45j72j54K35j01J21j39L6j16J41Q0j41J43N8m5o8M9J77k55j70J95N4j32
6850e9JO0J2q5J93j37N7M5n2r5L5p7O3mlj0J8L0P1K9l8J38k96J5J01k4j15J82
6878E5o5J55n5j21L8k4k9J9p9J30L0Rj9K0J47j78j69Q9P6j2J3l8L1m4K08j16M
6905G5j44P2Pj41J00r8J92j31J72j00P9j01K01q7lr5P9k9J5k4j68L36k57J11q4
6930b3P6N0j01LP3r0mL2j79J85j32L4J17n0m9J22j41P3p9J57j20L9J31j60n1k08
6956b95K64N8o6L5J36j39J97k68J16O1j13J4R4j44J6P0Qj31J86j35L0P7p2l7m5
6981h3q6l2J66N2N1L3r2L0n0M2p4j8Q3nK1j28J44r1l4L5L5R2m4k7j48N7m5J39
7009B3j8L6n7P9N3j10j12J19N4q7N1qk9K7k3j75K18q2jL1K3o7J01j92J86R6j62
$$ plain form
7036 -26 81 -92 78 70 -8 21 -17 120 21 35 62 50 -15 4 -62 1 -91 41 -21 -250 40 -7 -247 -27 -55 59
7062 59 -4 55 30 -29 39 -149 10 131 68 18 58 -69 18 -3 114 -41 -33 -49 147 -4 122 73 127 -10 -53 -13
7088 -13 -14 -161 88 -17 69 16 115 106 6 51 37 -101 -9 56 34 -88 24 -14 110 14 61 100 -38 64 110 -97
7114 -97 -29 -49 101 40 -139 30 131 50 -169 104 14 13 21 23 40 121 -93 127 -159 -75 -147 75 -5 182 39 100
7140 100 1 -76 -80 -17 -248 -53 -107 -12 51 -82 -126 50 75 -75 53 18 37 -13 -122 -3 65 74 31 -11 -4 -1 -3 -97
7168 -97 2 27 -12 -44 105 3 84 -148 103 -60 94 -88 -29 35 -13 12 143 26 -26 -186 -17 49 -4 -17 -89
7193 -89 38 -121 204 -54 -90 -37 91 0 36 6 -168 14 66 184 -1 -21 11 176 -59 -74 -57 -49 -9 -102 -74
7218 -74 82 20 -96 -10 49 103 159 -17 -42 -35 -10 -30 -77 -50 -19 26 -61 60 88 84 27 -69 -4 4 147 22 -11 269
$$ packed form
7036b6J07j73J70qp8K9l8J37r9J4K7j2o5J9o6O3r2J32o2k29K90m7k40K20k8J14
7062E9o3N9k5n9O8j88J59J21o3n0M0j27Q7k1J17j55Qj6J96j51J26m9N4j37m3M0
7088a3jj47K49j05Q6n3R9rj00M5j4j38R2O5k2j22J12l8J24r6M7L9j38J02M6k07
7114i7O8k0J50o1j79J69J01q1k19K73r0jQKJ7Q1k14K20k86Q4p2K22q0J87j43O1
7140A00r9p7mO3k31J95n4R5O3j33m4J76K5j50J28l5J9n0j09J19O8Rm3m2PLkr4
7168i7R9K5l9l2J49j02Q1k32K51j63J54j82N9O4m8K5J31j17n2j60J69O6n3j3p2
7193h9J27j59L25k58l6N3J28r1L6l0j74J82N2J18j85k0L2J65k35j5J7QM0r3K8
7218g4J56o2j16Q6N9N4N6j76k5PK5k0m7K7L1M5q7J21K8mn7r6O5QJ43j25l3K80
$$ plain form
7246 269 82 32 -43 -17 -77 106 -54 -99 -79 10 69 33 4 11 18 -82 150 -112 -79 -33 6 -38 -65 57 -139 -143 31
7273 31 -104 -163 -72 89 -187 163 -4 85 -129 -53 -53 -58 13 28 2 94 56 32 102 -36 94 -36 -54 15 104 -22
7299 -22 -85 99 13 96 76 -72 7 22 88 -148 -142 157 117 -60 -230 -118 -146 -43 -52 -154 -31 85 101 -193 -136
7324 -136 -82 186 43 29 34 39 -83 52 166 -1 -22 41 -4 -124 -9 32 -106 21 -59 55 -65 -58 -39 -94 129
7349 129 -67 -84 14 -84 -87 87 -21 70 -7 45 -29 -97 -133 -113 23 -62 -4 -1 -86 -61 -134 -2 13 -74 -31 -149 130
7376 130 -84 135 -100 53 147 35 84 62 -86 -43 39 -78 -25 19 -94 -103 -43 35 103 18 -52 -11 -13 -166 157 -80
7402 -80 -49 -75 14 -53 20 113 61 115 2 24 -76 109 -36 -152 31 -42 -55 153 24 148 -19 -46 -2 -97 -83
7427 -83 -60 105 -125 -98 77 107 -113 -43 24 39 -89 133 -71 38 128 -128 -39 -6 26 -61 -2 146 94 92 -105
$$ packed form
7246B69j87n0p5K6o0J83j60m5K0Q9N9l6k9PPj00K32k62L3M6L9m4k7J22j96mJ74
7273C1j35n9R1J61k76L50j67Q9k14P6%nP1J5k6R2l8k4P0j38J30j30j8O9Q9j26
7299b2o3J84q6Q3k0j48P9J5O6k36OK99m0j77j70J12k8J03rj02J23J16J6k94N7
7324a36N4K68j43j4NNj22J35J14j67k1O3m5j20J15M1j38J27q0J14j20PJ9n5K23
7349A29j96j7R8r8lJ74j08R1p7N2p4o8l6K0J36q5N8Lq5K5p3J32J5q7M3j18K79
7376A30k14K19k35J53R4j12M9k2j48M3Q2j17N3M4j13rO0P8O8q5p0M1kj53L23k37
7402h0L1k6Q9o7P3R3n2N4j13K2j00J85j45j16J83p3j3K08j29J24j67k7M4r5J4
7427h3K3J65k30K7J75L0k20P0O7J5j28K22k04J09R0k56Q9L3L2q7N9J48n2kj97
$$ plain form
7452 -105 20 53 11 -64 -8 -125 192 -7 37 -97 -6 69 -50 203 42 63 46 12 -240 99 15 -106 238 55
7476 55 79 79 66 60 10 -131 143 29 126 -121 113 -46 35 -62 -74 -86 -231 148 115 -127 -50 70 27 148 -126
7501 -126 -14 1 15 62 34 -40 -19 -111 -114 -57 -46 -101 79 42 -114 -16 -5 -8 62 -10 -42 -16 172 -47 -76 -223 142
7528 142 114 30 -24 50 -9 50 34 -11 75 99 -121 -2 88 9 -92 131 168 52 -99 -33 24 16 60 -162 -123 146
7554 146 -79 -120 31 -45 67 82 -36 65 -45 -48 -37 31 -26 -34 0 16 -80 67 63 1 69 34 70 -39 -53 30 30 62
7582 62 -57 22 -26 7 -17 -14 12 -102 -107 -8 160 -57 120 -48 -31 -28 91 39 -10 5 9 -128 -123 -52 130 68 60 76 -99
7611 -99 32 -27 -79 12 4 -97 -33 47 -23 84 19 25 20 9 -28 -2 81 350 158 147 -38 -207 172 60 29 35 83 12
7639 12 -23 -174 5 24 -144 -83 -143 11 -169 128 -107 97 -82 30 109 -1 21 70 -74 -136 39 -7 -59 -153
$$ packed form
7452a05J25L3m2p5N6j17L17j99M4j34R1P5j19K53j61K1j7l4k52L39q4j21L44j83
7476E5K4%j3on0j41K74j14R7k47K34j59Q1r7j2j2j45L79l3k42P7J20m3J21k74
7501a26J12J5J4M7k8p4K1r2lN7J1n5J80l7j56R8J1lP0p2l2K6J88k19k9j47L65
7528A42k8q4n4P4n9N9j6m5Q6K4k20J19R0p9j01K23L7j16j51O6N7qM4k22L9K69
7554A46k25m1J51p6J12J5j18J01j10lJ1O8n7qL4J6r6J47mo2O8l5L6j09j4Q3%L2
7582F2j19P9m8L3k4LK6j14nR9J68k17J77j68J7LJ19n2m9J5Mj37NP1J82o2qJ6j75
7611i9J31n9n2R1qj01O4Q0p0J07o5Onj1l7K6Q3K69j92j1j85j69L79j12l1OM8p1
7639A2l5j51J79J9j68O1o0J54j80K97k35K04j79J12P9j10K2M9j44o2J75m6n2r4
$$ plain form
7663 -153 -78 -49 71 4 39 -84 -119 67 147 107 -47 -180 -107 104 -62 127 -31 28 72 -65 -113 12 -52 -88
7687 -88 10 104 15 -50 -64 -49 78 96 -131 70 -108 -65 -90 -19 93 -70 21 88 -148 -44 7 33 12 -62 -95 -17
7713 -17 11 -21 -64 -110 -61 -48 -49 0 -17 -123 -22 24 -99 -15 -100 -26 -109 142 20 32 76 14 -126 20 -49 -71 97
7740 97 102 -63 -60 64 170 -69 -128 -33 -45 104 -31 -51 -91 -52 19 127 89 -111 -32 55 54 -19 39 -69 78 54 -76
7767 -76 17 65 -32 -97 -46 -90 22 32 -114 56 -6 70 -236 -70 19 -81 21 -73 97 32 -72 -8 47 11 178
7792 178 -19 -8 232 61 43 -84 -91 -106 44 -105 82 92 -28 -65 140 109 8 177 6 218 -142 -192 -17
7815 -17 -77 -90 6 -75 1 -145 -64 -48 114 -69 -40 -72 212 -20 51 117 38 77 -43 44 -5 -20 6 -130 23 -30
7841 -30 -184 -21 -114 100 23 -20 -8 -148 -105 -132 31 57 3 123 -123 30 21 102 -93 -161 146 -141 -55 18 6
$$ packed form
7663a53P5K9J20o7L5j23l5J86Q0m0j54j33P3K11j66J89j58N9M4j37m8J25o4l6
7687h8R8R4q9o5j4J5J27J8k27K01j78M3k5P1J12j63R1O7k36J04N1K6k1p4l3P8
7713a7K8l2m3m6M9J3jM9j7j06J01M6j23Q4q5P4q3K51j22J2M4o2j40J46o9k2J68
7740I7Nj65LJ24J06k39n9R5j2J49j35k0m0L9P1J08l8k00P9Q7jp3N8j08J47k4j30
7767g6R3M8r7o5N1m4J12J0j46J70o2P6l06J66Q9j00J02r4J70o5j04O4N5l6J67
7792A78j97J1K40j71j8j27pj5J50j49J87J0j20l7K05l1j01J69j71K12l60n0J75
7815a7o0j3R6q1P6j46Q1J6J62j83K9l2K84k32P1O6p9L9j20Q7m9j5K6j36J53n3
7841c0j54J63r3K14p7m3J2j40M3k7J63K6n4J20k46J53rQ1j95o8L07k87Q6P3j2
$$ plain form
7866 6 -57 -29 4 88 27 -5 -102 69 -40 14 49 -118 -129 53 181 -12 158 44 -76 126 -85 2 -31 -18 -81
7891 -81 116 77 -3 18 27 90 0 248 -42 152 -43 1 153 -70 127 35 53 110 -130 -40 -84 68 77 -196 -85
7916 -85 -63 -5 -132 61 60 -83 60 -141 169 78 -1 -10 -55 -227 -84 35 -41 58 126 113 8 -13 28 116 -18 -41
7942 -41 -95 51 28 175 -86 177 -22 198 -123 24 -149 -43 -58 -3 41 -250 234 -1 -21 -63 140 -104 -44
7965 -44 109 -171 86 -44 -48 -55 -28 22 -82 -70 51 3 -65 5 40 -141 -2 -103 -112 -12 -175 -122 -27 -89 -104 -60
7991 -60 152 -13 103 -176 49 0 -36 132 -83 -53 19 -56 -28 126 -125 98 88 126 29 -193 41 115 151 12
8015 12 -21 80 -23 17 -75 -71 -13 109 -131 121 -48 5 -116 25 -119 76 -40 46 101 136 84 -80 7 -93
8039 -93 29 -41 -63 77 12 191 -238 25 -51 10 94 -151 -49 -24 -156 3 31 78 -121 75 63 -14 -153 121
$$ packed form
7866Fo3K8L3Q4o1l2r7J71j09N4L5j67j1J82J28j93J70j14j20K02k11Q7l3J3o3
7891h1J97l9q0K1RO3r0K48k90J94j95M4J52k23J97r2J8N7k40R0m4J52Rk73J11
7916h5K2N8j27J93jj43J43k01L10r1p9rm5j72J43J19p6R9O8j3j05k1M1Q8j34k3
7942d1n4J46k3J47k61K63j99K20l21J47j73J06j5N5M4k91M84k35k0m2K03k44O0
7965d4J53k80K57j30mpK7N0j04J2J21m8o8P0L5j81J39j01rJ00j63N3R5o2j5M4
7991f0K12j65J16k79K25m9l6J68k15L0P2p5K8J54k51K23j0L8r7k22K34P4L6j39
8015A2l3J01j03M0r2MN8J22k40K52j69N3j21J41j44J95j16Q6N5L5n2j64Q7j00
8039i3J22p0k2J40o5J79m29K63p6O1Q4k45J02K5j32J59K8M7j99J96j2p7j39K74
$$ plain form
8063 121 24 -177 -14 14 21 -67 28 72 64 213 222 -15 -19 -136 -119 4 -26 -99 -13 156 -146 -16 -65 -53 62 88 59
8090 59 -161 83 149 21 -16 13 -15 122 -19 128 26 19 3 -14 30 -55 -25 76 -29 -22 21 317 46 27 24 -96
8116 -96 -120 160 69 -34 98 53 105 -15 -133 37 -232 -3 18 11 48 23 19 140 62 149 -49 100 100 -42 15 -55
8142 -55 -123 215 -73 -68 154 53 -52 53 -179 -18 -107 -120 103 40 99 -75 225 92 69 -67 -162 -44 117
8165 117 -58 -4 259 33 0 28 67 -9 139 -12 38 -14 -15 -74 50 -79 -81 102 -61 -51 26 40 0 87 125 103
$$ packed form
8063A21r7k01J63K8Pq8R5M4qJ49Rk37mj17J7J23l0p3Q6J69l02J30m9J2J15K6k9
8090E9k20K44O6j28l7K9k8J37j41J47j02pj6j7M4q5L0J01j05PM3K96k71j9lj20
8116i6k4K80r1j03J32m5N2j20j18J70k69K29K1pL7k5mJ21p8Q7j98J49%j42N7p0
8142e5o8L38k88NK22j01j05J05k32J61q9j3K23o3N9j74L00j33k3j36r5J18J61
8165A17j75N4K63k26l3K8L9p6J48j51N0n2jn9J24j29kJ83j63J0P7J4m0Q7L8k2
8191A03
$$ Imaginary data points
##PAGE= N=2
##DATA TABLE= (X++(I..I)), XYDATA
$$ plain form
0 0 0 0 0 0 0 0 0 0 0 0 0 0 0 0 0 0 0 0 8 -8 8 -8 8 -8 11 -16 16 -16 24 -24 31 -32 39 -41 48 -53 59 -67 74 -83
40 -83 91 -103 115 -127 140 -155 171 -188 206 -228 251 -276 306 -337 371 -412 457 -511 572 -644
60 -644 732 -840 976 -1156 1407 -1777 2379 -3539 6588 -31163 -76534 -20848 16389 35673
74 35673 61264 120253 162213 160787 130193 118109 109956 70944 14326 4452 29144 28436 3095
87 3095 6489 25057 5446 -52606 -91242 -95585 -108192 -138664 -136505 -88492 -42968 -31335 -18686
100 -18686 20715 46031 23798 -2682 9405 30409 23215 17201 48544 85144 85239 63361 55848
113 55848 58077 32523 -16287 -36526 -21929 -22405 -43688 -40812 -11930 -4380 -28838 -44243 -33712
126 -33712 -26729 -41485 -47359 -16227 19890 23372 19467 41076 60314 42700 11875 8628 20200
$$ packed form
0@%%%%%%%%%%%%%%%%%%Qj6J6j6J6j6J9k7L2l2M0m8N5o3P1q0Q9j01J12j26J41j57
40h3J74j94K18k42K67k95L26l59L94m34M79n27N82o43P08p83Q69r68J083j216
60f44J376j572J816k132K563l184M156n918J0127l7751m5371N5686L7237J9284
74C5673K5591N8989M1960j426l0594j2084q153l9012n6618r874K4692p08k5341
87C095L394J8568j9611n8052l8636m343j2607l0472K159M8013M5524J1633J2649
100a8686L9401K5316k2233k6480J2087K1004p194o014L1343L6600R5k1878p513
113E5848K229k5554m8810k0239J4597m76k1283K876K8882P550k4458j5405J0531
126c3712O983j4756n874L1132L6117L482l905K1609J9238j7614l0825l247J1572
$$ plain form
139 20200 9952 -9078 80 26565 28801 6600 -2131 6750 -3757 -37514 -53277 -37293 -26379
152 -26379 -38353 -36994 -6160 14606 4123 -6119 7049 18314 4232 -11535 2406 25373
164 25373 21018 5715 15300 33643 22759 -2254 -3505 10511 5586 -13556 -13447 5828 8984
177 8984 -10719 -18716 -4756 -1848 -19908 -25419 -3673 13392 6369 1936 18719 29850 14235
190 14235 -4837 -1840 5909 -6017 -20810 -11934 7235 6558 -8690 -8039 4052 -3842 -26631 -30713
204 -30713 -15358 -9908 -18250 -14239 8425 21179 11876 4765 16139 23672 10303 262 14897
217 14897 31300 26044 16143 22926 30365 15160 -9466 -15494 -9209 -15941 -30909 -26376 -6040 -1135
231 -1135 -14488 -18367 -9297 -12386 -33288 -41430 -24996 -10508 -10842 -3473 21683 40813 34934 22905
$$ packed form
139B0200j0248j9030R158K6485K236k2201q731Q881j0507l3757j5763J5984J0914
152b6379j1974J359L0834K0766j0483j0242J3168J1265j4082j5767J3941K2967
164B5373m355j5303R585J8343j0884k5013j251J4016m925j9142J09J9275L156
177H984j9703p997J3960K908j8060n511K1746J7065p023m433J6783J1131j5615
190A4235j9072K997P749j1926j4793Q876J9169o77j5248O51J2091p894k2789m082
204c0713J5355N450q342M011K2664J2754r303p111J1374P533j3369j0041J4635
217A4897J6403n256r901O783P439j5205k4626o028O285o732j4968M533K0336M905
231a135j3353l879R070l089k0902q142J6434J4488l34P369K5156J9130n879j2029
$$ plain form
245 22905 26248 29084 11623 -6628 -770 15435 15253 7534 16238 29077 19428 -4809 -16215 -14139
259 -14139 -22544 -40551 -40367 -19421 -7144 -12183 -10503 5098 9546 -7349 -18495 -8785 1187 -2889
273 -2889 -2657 16604 35467 31755 19815 20781 23221 7856 -13167 -14004 -1490 -772 -7343 244 15037
288 15037 13168 -5258 -16350 -14537 -19516 -34246 -36170 -17659 -536 1131 4663 20896 29076
301 29076 16104 725 573 3852 -4116 -11449 -134 18118 21142 13286 14592 20690 10356 -11546
315 -11546 -19897 -13695 -13975 -22391 -19077 -1381 7340 -637 -6062 643 2545 -9605 -17810 -6798
329 -6798 6780 5542 3197 15031 26288 18775 4249 2783 7539 241 -11366 -7596 6724 9948
343 9948 704 205 8319 3887 -14043 -22496 -15567 -12651 -20109 -19090 -2178 9720 5612 1303 8388
$$ packed form
245B2905L343K836j7461j8251N858J6205j82p719Q704J2839r649k4237j1406K076
259a4139q405j8007J84K0946J2277n039J680J5601M448j6895j1146R710R972m076
273b889K32J9261J8863l712j1940R66K440j5365k1023q37J2514P18o571P587J4793
288A5037j869j8426j1092J813m979j4730j924J8511J7123J667L532J6233Q180
301B9076j2972j5379j52L279p968p333J1315J8252L024p856J306O098j0334k1902
315a1546q351O202k80q416L314J7696Q721p977n425O705J902j2150q205J1012
329f798J3578j238k345J1834J1257p513j4526j466M756p298j1607L770J4320L224
343I948r244m99Q114m432j7930q453O929K916p458J019J6912J1898m108m309P085
$$ plain form
358 8388 13012 1812 -9593 -3590 6427 3618 -1024 7939 20551 17782 6530 5905 11462 5444
372 5444 -7845 -9847 -260 1447 -7581 -8730 824 2686 -7989 -13506 -5624 -902 -7694 -11062 -1916
387 -1916 5867 897 -6187 -1646 4604 -947 -9251 -4560 6330 6272 140 3799 13042 10989 -36
402 -36 -2741 3265 3281 -5306 -6936 3403 9397 3151 -563 6819 10475 910 -7388 -2346 3228 -1653
418 -1653 -7750 -2264 5882 1775 -7592 -6594 269 -2523 -11481 -9618 1613 3467 -3912 -3915 4248 4074
434 4074 -6311 -10502 -3066 1772 -2729 -3051 8136 16733 11365 4375 7960 10365 188 -9920
448 -9920 -6759 1322 120 -3941 2568 12210 10106 -379 -3699 8 -4241 -15188 -15638 -4692 608
463 608 -2934 -1047 8860 11661 2146 -4665 -1249 1370 -4710 -8237 313 9695 7316 1867 4946
$$ packed form
358H388M624j1200j1405O003J0017k809m642Q963J2612k769j1252o25N557o018
372E444j3289k002R587J707r028j149R554J862j0675n517P882M722o792l368R146
387a916P783m970p084M541O250n551q304M691J0890n8o132L659R243k053j1025
402c6k705O006J6q587j630J0339N994o246l714P382L656r565q298N042N574m881
418a653o097N486Q146m107r367R98O863k792q958J863J1231J854p379lQ163j74
434D074j0385m191P436M838m501l22J1187Q597n368o990L585K405j0177j0108
448i920L161Q081j202m061O509R642k104j0485l320L707m249j0947m50J0946N300
463F08l542J887R907K801r515o811L416K619o080l527Q550R382k379n449L079
$$ plain form
478 4946 8146 409 -10602 -10433 -4277 -4628 -8143 -3248 6674 8558 272 -3455 118 -1911 -11059
493 -11059 -12829 -2865 5109 4677 6503 15481 20224 12597 3160 2201 2891 -3708 -10161 -4542 5180 6288
509 6288 2075 4260 9049 2772 -10207 -14818 -12005 -12994 -18421 -15910 -4085 3176 -363 -1817 4159
524 4159 5578 -2895 -8509 -2130 4636 2949 2434 10694 18869 15320 7348 7075 9484 3204 -5301 -3954
540 -3954 3984 4354 -1356 -23 5625 2558 -7994 -12892 -9628 -9284 -14753 -14244 -4005 3441 1264
555 1264 -302 5057 7640 -109 -6899 -3548 1251 -473 -2489 3932 12716 11689 5041 5218 7796
570 7796 2946 -6533 -8082 -2305 -1651 -6021 -4357 2719 4749 -1249 -4433 -166 1583 -3661 -6348
585 -6348 -501 5269 2928 -225 3896 8137 3931 -2034 -430 4337 2497 -2764 -1185 4664 3421
$$ packed form
478D946L200p737j1011J69O156l51l515M895R922J884q286l727L573k029r148
493a1059j770R964P974m32J826Q978M743p627r437r59O90o599o453N619R722J108
509F288m213K185M789o277j2979m611K813r89n427K511J1825P261l539j454N976
524D159J419q473n614O379O766j687n15Q260Q175l549p972k73K409o280q505J347
540c954P938L70n710J333N648l067j0552m898L264L44n469N09J0239P446k177
555A264j566N359K583p749o790L351M799j724k016O421Q784j027o648J77K578
570G796m850r479j549N777O54m370J664P076K030n998l184M267J749n244k687
585f348N847N770k341l153M121M241m206n965J604M767j840n261J579N849j243
$$ plain form
600 3421 -3423 -5461 -1644 -2444 -9348 -10419 -4047 -733 -4067 -4595 1823 5413 712 -3350 366 4538
616 4538 1098 -2696 2103 8833 6547 2258 4701 9275 6134 -835 -774 3810 2537 -3846 -4402 962
632 962 781 -6009 -8017 -3004 -1621 -6496 -7330 -1005 3073 -616 -3652 554 3689 -1050 -5551 -2200
648 -2200 3178 1906 -816 3585 9356 7839 1795 1357 4138 722 -6037 -6534 -1088 531 -2751 -1725
664 -1725 4059 5777 215 -3479 -614 335 -4409 -6784 -1584 3727 2088 -243 3151 6313 2739
679 2739 -3307 -2855 844 -370 -4045 -1936 4002 4342 -846 -2147 889 -521 -6251 -7769 -2354 1269
695 1269 -528 -196 5233 8299 3828 -1112 -188 1341 -2970 -6556 -2441 3817 3989 1782 4175 7880
711 7880 4430 -3121 -5229 -2961 -4403 -8484 -7250 277 3618 741 581 4569 4757 -1343 -5372 -2080
$$ packed form
600C421o844k038L817q00o904j071O372L314l334n28O418L590m701m062L716M172
616D538l440l794M799O730k286m289K443M574l141o969O1M584j273o383n56N364
632I62j81o790k008N013J383m875q34O325M078l689l036M206L135m739m501L351
648b200N378j272k722M401N771j517o044m38K781l416o759m97N446J619l282J026
664a725N784J718n562l694K865R49m744k375N200N311j639k331L394L162l574
679B739o046M52L699j214l675K109N938L40n188j301L036j410n730j518N415L623
695A269j797L32N429L066m471m940R24J529m311l586M115O258J72k207K393L705
711G880l450p551k108K268j442m081J234P527L341k877j60L988J88o100m029L292
$$ plain form
727 -2080 627 -1900 -2491 2976 7813 5590 1439 2753 4538 265 -5327 -4294 397 117 -3135 -1092
743 -1092 3355 2274 -3435 -5082 -2651 -2376 -6466 -5954 361 4065 2227 1834 5487 6656 1611 -2552
759 -2552 -850 1268 -791 -2509 1455 6558 5395 1884 2057 3629 -7 -6281 -7174 -3776 -3385 -5762
775 -5762 -4123 1388 3232 -79 -1359 1293 2077 -2106 -4204 -313 3155 1652 350 3733 6802
790 6802 4045 283 961 3351 959 -2924 -1861 2076 1318 -2591 -2795 254 -639 -5433 -6167 -2405
806 -2405 -1121 -3477 -3525 1046 3753 708 -1384 1331 3294 49 -2699 574 4312 2826 727 3298
822 3298 6535 4339 -98 -85 2554 538 -3734 -3315 343 455 -3011 -3404 506 670 -3027 -3955 -664
839 -664 594 -2479 -3764 -738 1499 -1039 -3114 -560 2429 911 -1490 1007 4419 3102 10
$$ packed form
727b080K707k527n91N467M837k223m151J314J785m273n592J033M691k80l252K043
743a092M447j081n709j647K431K75m090N12O315L704j838l93L653J169n045m163
759b552J702K118k059j718L964N103j163l511J73J572l636o274q93L398L91k377
775e762J639N511J844l311j280K652P84m183k098L891L468j503j302L383L069
790F802k757l762O78K390k392l883J063L937p58l909k04L049q93m794p34L762
806b405J284k356m8M571K707l045k092K715J963l245k748L273L738j486k099K571
822C298L237k196m437J3K639k016m272M19L658J12l466l93L910J64l697r28L291
839f64J258l073j285L026K237k538k075K554K989j518k401K497L412j317l092
$$ plain form
854 10 804 3314 1702 -2090 -1814 1541 1982 -621 -322 3337 4071 549 -1059 699 1120 -2538 -4485
871 -4485 -1746 661 -1051 -2689 -319 2128 219 -2910 -2196 135 -993 -3708 -2180 1670 1876 -722
887 -722 -363 2406 2257 -1079 -1784 1404 2694 404 -198 3021 4562 1555 -1242 151 901 -2157 -4427
904 -4427 -2317 1056 553 -1058 707 3389 1638 -2364 -2684 -458 -1405 -4130 -2872 1772 3210 1334
920 1334 1591 4321 4087 -95 -2339 -797 130 -2432 -3410 18 2755 1043 -1175 453 1629 -1188
936 -1188 -4253 -3402 -512 -1114 -2435 -576 3061 3129 170 -100 2134 1558 -1061 -1178 2164 3580 1988
953 1988 1563 3712 4016 593 -2368 -1335 -627 -2521 -4109 -1766 1346 714 -1434 -485 839 -1183
969 -1183 -4346 -4427 -2057 -1659 -2896 -1254 2702 4095 1926 1226 3219 2950 -256 -2118 22 1817
$$ packed form
854A0P94K510j612l792K76L355M41k603K99L659P34l522j608J758M21l658j947
871d485K739K407j712j638K370K447j909l129P14K331j128k715J528L850K06k598
887g22L59K769j49l336p05L188J290k290o02L219J541l007k797J393P50l058k270
904d427K110L373n03j611J765K682j751m002l20K226r47k725J258M644J438j876
920A334K57K730k34m182k244J542R27k562r78L428K737j712k218J628J176k817
936a188l065Q51K890o02j321J859L637O8k959k70K234n76k619j17L342J416j592
953A988m25K149L04l423k961J033P08j894j588K343L112o32k148R49J324k022
969a183l163q1K370L98j237J642L956J393k169p00J993k69l206j862K140J795
$$ plain form
985 1817 505 -359 2149 4362 2182 -521 -20 1359 -805 -3446 -2368 416 81 -1895 -1204 1416
1001 1416 795 -1946 -2369 -8 452 -1732 -1697 1466 2541 299 -756 947 1584 -971 -2798 -871
1017 -871 1086 -83 -1163 966 3006 1666 -828 -274 1237 -194 -2731 -1874 706 1159 -482 104
1033 104 2634 2649 226 -816 1145 1122 -1182 -2219 -31 1339 -403 -1510 142 1530 -199 -1805
1049 -1805 -496 845 -101 -2025 -1084 1118 312 -1776 -1282 896 962 -898 -707 1945 2262 222 -440
1066 -440 1234 1517 -657 -1980 -98 872 -477 -1427 284 2082 779 -1061 -508 1127 107 -2017
1082 -2017 -1377 915 753 -1036 -462 1439 1464 -616 -1065 969 1334 -627 -1257 993 1791 -241 -1628
1099 -1628 -174 773 -1201 -2430 -836 819 -103 -1218 267 2016 892 -1298 -1065 651 -222 -1973
$$ packed form
985A817j312q64K508K213k180k703N01J379k164k641J078K784l35j976O91K620
1001A416o21k741m23K361M60k184L5L163J075k242j055J703O37k555j827J927
1017h71J957j169j080K129K040j340k494N54J511j431k537Q57K580M53j641N86
1033A04K530J5k423j042J961k3k304j037K188J370j742j107J652J388j729j606
1049a805J309J341r46j924R41K202q06k088M94K178O6j860J91K652L17k040o62
1066d40J674K83k174j323J882R70j349r50J711J798j303j840N53J635j020k124
1082b017O40K292j62j789N74J901K5k080m49K034L65j961o30K250P98k032j387
1099a628J454R47j974j229J594J655r22j115J485J749j124k190K33J716q73j751
$$ plain form
1115 -1973 -1152 1712 1895 578 926 2710 2422 -61 -1315 -140 288 -1659 -2055 133 1535 319
1131 319 -908 387 1276 -772 -2603 -1665 -235 -831 -1911 -527 1830 1487 -124 91 1529 1098 -770
1148 -770 -886 1208 1710 425 180 1615 2141 -174 -1400 -448 12 -1267 -2324 -679 1199 272 -775
1165 -775 -14 1013 -197 -2369 -2088 -470 -492 -1462 -687 1940 2689 1022 778 2123 1696 -769 -1542 -243
1183 -243 737 -472 -830 957 2280 1128 -637 -99 697 -783 -2504 -1692 186 -242 -1220 -177 1402
1200 1402 1129 -839 -756 655 547 -921 -1046 977 1370 -3 -360 790 1283 -801 -1715 -403 317
1217 317 -715 -1309 162 1688 593 -876 -177 674 -558 -1878 -1069 743 723 -245 563 2125 1995
1234 1995 562 -166 822 841 -751 -1316 43 877 -136 -740 493 1140 -345 -1414 -931 -23 -981 -2143
$$ packed form
1115a973Q21K864J83j317L48J784k88k483j254J175M28j947l96K188J402j216
1131C19j227J295Q89k048j831R38J430n96j080J384K357l43j611K15J438m31j868
1148g70j16K094N02j285k45J435N26k315j226R52M60j279j057J645J878r27j047
1165g75P61J027j210k172K81J618k2r70P75K627P49j667k44J345m27k465p73J299
1183b43R80j209l58J787J323j152j765N38P96j480j721Q12J878m28r78J043J579
1200A402k73j968Q3J411j08j468j25K023L93j373l57J150M93k084r14J312P20
1217C17j032n94J471J526j095j469O99Q51j232j320Q09J812k0r68Q08J562j30
1234A995j433p28R88J9j592n65J359Q34j013o04J233O47j485j069M83R08r58j162
$$ plain form
1252 -2143 -1159 192 -264 -1183 -674 708 672 -657 -315 1198 1372 87 10 1290 1672 287 -434 703
1270 703 1420 87 -605 645 1466 309 -933 29 901 -283 -1559 -878 369 -223 -1459 -733 787
1287 787 442 -829 -742 678 587 -836 -1133 202 602 -784 -1012 282 862 -463 -1006 42 997 88
1305 88 -772 354 1179 390 -634 -89 888 574 -647 -86 1331 1357 355 572 1662 1253 -313 -820
1323 -820 -67 -116 -1110 -1478 -366 348 -386 -961 -245 579 -718 -1858 -1184 -224 -630 -1375 -248 1026 983
1342 983 -76 356 1432 930 -35 -56 1193 1154 134 43 1128 1405 -33 -847 46 292 -940 -1555 -524
1361 -524 601 -139 -902 -316 718 -28 -1291 -854 186 185 -978 -3 1539 1533 283 374 1373 913 -728
1380 -728 -1114 -232 9 -783 -1147 151 793 -250 -979 -234 -83 -1230 -1648 -1020 53 -57 -414 565 1648
$$ packed form
1252b143R84J351m56r19N09J382l6j329L42J513J74j285p7J280L82j385p21J137
1270G03P17j333o92J250Q21j157j242R62Q72j184j276O81J247n92j236P26J520
1287G87l45j271Q7J420r1j423k97J335M00j386k28J294N80j325n43J048R55r09
1305H8q60J126Q25p89j024N45R77l14j221N61J417K6j002K17J090m09j566n07
1323h20P53m9r94l68J112P14p34n75P16Q24j297j140O74R60m06p45J127J274m3
1342I83j059M32J076n02r65k1J249l9j020r1J085K77j438q14Q93K46j232o15J031
1361e24J125p40p63N86J034p46j263M37J040jj163R75J542oj250R1R99m60j641
1380g28l86Q82K41p92l64J298O42j043p29P45J51j147m18O28J073j10l57R79J083
$$ plain form
1399 1648 1310 464 612 1516 1256 68 199 1325 1464 178 244 997 645 -498 -1290 -610 -501 -1235 -1804
1418 -1804 -893 -182 -737 -1416 -825 -208 -769 -1601 -932 265 543 17 665 1796 1686 937 669 1440 1137
1437 1137 -55 -289 584 781 173 -439 343 853 -240 -981 -714 -354 -913 -1762 -1022 -50 -104 -885 -178
1456 -178 946 415 -239 -28 758 784 -58 63 1000 1168 40 -286 448 585 -626 -949 -229 177 -541
1475 -541 -1167 -218 227 -514 -1073 -505 256 -153 -901 -87 947 994 141 593 1430 1274 91 127 943 802
1495 802 -109 -373 373 438 -395 -918 -251 48 -917 -1517 -848 -311 -871 -1268 -440 68 -190 -471 -109 865
1515 865 654 202 562 1446 1045 412 351 1078 944 65 -231 248 598 -130 -649 -80 179 -772 -1420 -1060
1535 -1060 -308 -886 -1487 -624 267 25 -290 -22 765 747 -130 199 746 988 330 146 1061 1046 309 -109
$$ packed form
1399A648l38q46J48R04k60j188J31J126J39j286O6P53l52j143p92O80J09p34n69
1418a804R11P11n55o79N91O17n61q32O69J197K78n26O48J131j10p49k68P71l03
1437A137j192k34Q73J97o08o12P82N10j093p41K67L60n59q49P40R72n4p81P07
1456a78J124n31o54K11P86K6q42J21R37J68j128l26P34J37j211l23P20M06p18
1475e41o26R49M45p41n59N68P61m09p48Q14J034M7q53M52Q37j56j183L6Q16j41
1495H02r11k64P46O5q33n23O67K99r65o00O69N37n60l97Q28N08k58k81L62R74
1515H65k11m52L60Q84m01o33o1P27j34q79k96M79L50p28n19N69K59r51o48L60
1535a060P52n78o01Q63Q91k42l15K68P87j8q77L29N47K42o58j84R15j5p37m18
$$ plain form
1555 -109 337 519 -339 -791 -152 286 -365 -886 -365 201 -322 -1120 -590 98 -269 -658 -162 912 411 -99
1575 -99 207 706 662 -357 -360 396 499 -197 -470 589 708 -3 -533 -69 155 -656 -1135 -526 -62 -176 -624
1596 -624 134 922 536 -25 297 841 473 -411 -84 543 408 27 -2 577 561 -392 -668 -388 -28 -886 -926
1617 -926 -335 -51 -396 -784 -405 80 -310 -652 -163 293 320 -175 453 1162 1103 338 391 583 672 -231 -330 394
1639 394 415 -172 -312 196 268 -375 -1034 -497 -82 -724 -1268 -574 -105 -269 -307 -118 778 421 -96 33 770
1660 770 536 -269 32 630 674 -56 31 388 524 -140 -609 -210 171 -554 -751 -260 86 -342 -736 -238 69
1681 69 -120 -519 12 751 514 217 521 1127 751 92 220 621 557 -67 50 411 593 -217 -373 57 47
1702 47 -548 -878 -640 -332 -806 -1156 -688 -152 -382 -732 -187 266 254 -188 54 693 740 91 188 914 751
$$ packed form
1555a09M46J82q58m52O39M38o51n21N21N66n23p98N30O88l67l89M96J074n01n10
1575i9L06M99m4j019lP56J03o96k73J059J19p11n30M64K24q11m79O09M64j14m48
1596f24P58P88l86n61L22N44l68q84L27O27j35l81k9N79j6r53k76K80L60q58m0
1617i26N91K84l45l88L79M85l90l42M89M56K7m95O28P09n9p65N3J92Q9r03r9P24
1639C94K1n87j40N08P2o43o59N37M15o42n44O94M69j64l8J89Q96l57n17J29P37
1660G70k34q05L01N98M4p30Q7L57J36o64m69L99L81p25j97M91L46m28l94M98L07
1681F9j89l99N31P39k37k97L04O06l76o59J28M01o4o24J17L61J82q10j56M30j0
1702D7n95l30K38L08m74l50M68N36k30l50N45M53j2m42K42O39M7o49R7P26j63
$$ plain form
1723 751 541 227 628 816 359 -6 459 469 -112 -364 -228 20 -374 -839 -682 -191 -288 -592 -388 -42 -221
1744 -221 -643 -514 149 149 -346 -249 412 494 169 -44 425 679 58 -122 565 752 82 -1 265 514 -64 -379
1766 -379 -140 289 4 -429 -298 253 266 -213 -129 260 139 -533 -254 89 260 -302 88 332 451 21 -118
1787 -118 185 290 -92 -286 -87 92 -63 -334 23 348 30 -392 -157 197 -131 -430 -293 -158 157 -158
1807 -158 -60 553 639 91 -121 285 541 -31 -239 233 493 42 -98 -3 341 -50 -343 -221 374 -192 -411
1828 -411 -357 205 9 -313 -295 65 -194 -428 -310 -4 123 -249 -159 404 560 29 -149 207 374 -64 -298
1849 -298 45 498 241 97 265 620 463 -114 154 334 96 -247 -243 -10 122 -264 -246 150 16 -272 -418
1870 -418 -80 14 -279 -565 -83 219 -141 -218 34 169 38 -362 10 217 46 -21 118 343 210 -61 -109
$$ packed form
1723G51k10l14M01J88m57l65M65J0n81k52J36K48l94m65J57M91r7l04K04L46j79
1744b21m22J29O63%m95R7O61Q2l25k13M69K54o21j80O87J87o70q3K66K49n78l15
1766c79K39M29k85m33J31N51J3m79Q4L89j21o72K79L43J71n62L90K44J19m30j39
1787a18L03J05l82j94J99J79j55k71L57L25l18m22K35L54l28k99J37J35L15l15
1807a58R8O13Q6n48k12M06K56n72k08M72K60m51j40R5L44l91k93J22N95n66k19
1828d11N4N62j96l22J8L60k59k34J18L06J27l72R0N63J56n31j78L56J67m38k34
1849b98L43M53k57j44J68L55j57n77K68J80k38l43MK33J32l86J8L96j34k88j46
1870d18L38R4k93k86M82L02l60p7K52J35j31m00L72K07j71o7J39K25j33k71m8
$$ plain form
1891 -109 224 199 -189 -29 138 220 -42 -178 61 137 -248 -467 -17 31 -245 -349 23 319 31 -149 146
1912 146 300 88 -215 -40 323 237 -204 -39 264 137 -236 -202 113 56 -169 -300 55 111 -140 -479 -188
1933 -188 137 -79 -444 -44 226 147 -279 -106 415 268 -27 160 284 92 -148 99 284 265 -127 -52 282
1954 282 136 39 -260 -97 -8 -291 -360 -70 -161 -247 -383 -71 112 -222 -327 70 318 0 -94 72 416 192
1976 192 -8 -146 347 148 191 106 386 363 25 122 134 256 -165 -401 -18 -52 -110 -466 -99 9 -241 -224 42
1999 42 68 -18 -329 -36 53 142 32 30 385 193 -58 35 221 381 11 -146 90 96 -266 -44 73 30 -51 -497
2023 -497 -153 -55 41 -404 -165 135 -76 -293 -353 66 111 -222 -309 119 133 -204 -158 387 347 -19 -24 168 138 -135
2047 -135 -141 22 313 -34 -154 33 167 -91 -151 86 166 -42 -239 -52 165 106 -251 -53 151 70 -144 -269
$$ packed form
1891a09L33k5l88J60J67Q2k62j36K39P6l85k19M50M8k76j04L72K96k88j80K95
1912A46J54k12l03J75L63q6m41J65L03j27l73L4L15n7k25j31L55N6k51l39K91
1933a88L25k16l65M00K70p9m26J73N21j47k95J87J24j92k40K47J85j9l92P5L34
1954B82j46r7k99J63Q9k83o9K90r1q6j36L12J83l34j05L97K48l18r4J66L44k24
1976A92k00j38M93j99M3q5K80k3l38R7J2J22m21k36L83l4n8l56L67J08k50J7K66
1999D2K6q6l11K93Q9Q9j10kL55j92k51R3J86J60l70j57K36Ol62K22J17m3q1m46
2023d97L44R8R6m45K39L00k11k17o0M19M5l33q7M28J4l37M6N45m0l66nJ92l0k73
2047a35oJ63K91l47j20J87J34k58o0K37Q0k08j97J87K17n9l57J98K04q1k14j25
$$ plain form
2069 -269 125 30 -121 -218 -12 330 28 -104 82 118 -138 -183 -56 43 11 2 3 104 86 -216 -64 206 45 -72
2093 -72 -166 204 294 -21 -192 -24 195 -166 -288 67 -159 -141 -464 -119 137 -59 -161 -7 317 24 -97
2114 -97 -174 294 94 -215 -114 321 58 -12 10 230 102 -36 -182 -123 -8 -203 -147 76 240 -166 -307 25
2136 25 279 -10 -193 -83 176 117 -192 60 206 58 -51 -23 32 48 -157 -51 196 107 -179 -23 -49 39 -39
2159 -39 -373 19 -18 -320 -96 -290 -17 -240 -184 -119 -8 -49 -146 84 42 205 8 -8 257 139 59 -28 211
2182 211 199 39 -120 127 -33 -56 -34 -114 63 -190 -230 -41 66 -17 -177 -148 132 -39 -107 -42 79 -33 -109
2205 -109 -63 239 150 -3 -148 259 154 33 -153 103 233 55 -27 -81 12 -95 -322 -38 158 -195 -195 -86
2227 -86 72 33 -132 84 348 140 -18 113 181 142 -17 41 92 160 -18 -38 131 -96 15 -44 12 -100 -104 -317
$$ packed form
2069b69L94r5j51r7K06L42l02j32J86L6k56m5J27R9l2rJJ01j8l02J52K70j61j17
2093g2r4L70R0l15j71J68K19l61j22L55k26J8l23L45K56j96j02J54L24k93j21
2114i7p7M68k00l09J01M35k63p0K2K20j28j38j46N9J15j95N6K23J64m06j41L32
2136B5K54k89j83J10K59n9l09K52J46j48j09K8N5J6k05J06K47q9k86J56k6Q8p8
2159c9l34L92l7l02K24j94K73k23N6O5J11m1r7K30m2J63j97j6K65j18q0q7K39
2182B11j2j60j59K47j60k3K2q0J77k53m0J89J07q3j60K9K80j71o8O5J21j12p6
2205a09M6L02q9j53j45M07j05j21j86K56J30j78q2n4R3j07k27K84J96l53%J09
2227h6J58l9j65K16K64k08j58J31O8l9j59N8N1O8j78k0J69k27J11n9N6j12mk13
$$ plain form
2251 -317 -116 168 -77 40 -11 176 -155 -197 -49 240 126 -140 101 150 93 4 92 236 129 -10 131 260
2273 260 92 -138 -141 13 -3 -56 -285 -58 -102 -192 -240 -76 87 -196 -117 -300 -75 -58 -184 50 112 260 -8
2296 -8 23 88 250 -44 -105 163 215 72 -92 31 -8 69 -115 138 122 -22 -163 2 27 -68 -219 -33 -44 -34
2320 -34 -123 -187 87 139 61 -136 105 80 28 -41 12 142 -83 -121 197 75 186 -80 45 142 -212 -128 87 180
2344 180 45 -91 -84 39 -92 -144 -300 99 123 -96 -8 157 112 -131 -2 145 113 -5 60 3 39 5 -9 297
2368 297 42 -40 12 40 57 52 3 -39 115 -117 -305 -106 172 -28 -124 -143 -62 -116 -123 -51 13 33 11 -17 118 -6
2394 -6 -9 -8 -173 129 34 -254 44 13 92 -70 40 100 -12 24 42 -28 -69 -2 14 47 88 41 4 43 -90 24 -45
2421 -45 204 76 -97 -39 -100 23 12 -10 -14 197 53 -128 94 113 -25 -152 54 31 162 25 -118 173 -48
$$ packed form
2251c17K01K84k45J17n1J87l31m2J48K89j14k66K41M9n7q9Q8J44j07j39J41J29
2273B60j68k30lJ54j6n3k29K27m4r0m8J64J63k83P9j83K25J7j26K34O2J48k68
2296hL1O5J62k94o1K68N2j43j64J23l9P7j84K53j6j44j41J65K5r5j51J86j1J0
2320c4q9o4K74N2p8j97K41k5n2o9N3J30k25l8L18j22J11k66J25R7l54Q4K15R3
2344A80j35j36PJ23j31n2j56L99K4k19Q8J65m5k43J29J47l2j18O5n7L6l4j4L06
2368B97k55q2N2K8J7nm9m2J54k32j88J99K78k00r6j9Q1n4pP2O4K0k2k8J35j24
2394flJj65L02r5k88K98l1P9j62J10O0j12L6J8p0m1O7J6L3M1m7l7L9j33J14o9
2421d5K49j28j73N8o1J23j1k2mK11j44j81K22J9j38j27K06k3J31j37j43K91k21
$$ plain form
2444 -48 -33 -117 -5 88 -156 -180 -84 10 -93 -128 -72 -41 -12 -15 22 -66 -57 -86 178 117 145 -184 -71 224 98 -71 -178
2471 -178 -20 101 -47 -27 12 -60 -22 5 -93 6 -177 -153 -80 -62 -91 -146 -173 15 -87 -45 -27 -127 145 -120 -99
2496 -99 197 136 -78 31 -1 185 40 -112 -46 96 -109 -114 -40 -29 -68 -108 103 -8 -130 -184 16 -58 -57 -126 -73
2521 -73 97 97 -240 8 50 -48 21 -134 99 99 -48 78 45 71 49 -69 92 -46 -13 18 5 -74 -135 -159 -33 104
2547 104 14 -129 -35 84 9 -139 37 45 -77 -158 -139 -11 56 -64 -15 67 86 39 -105 178 145 -17 -152 -187 56
2572 56 0 -170 52 58 59 -10 -177 17 -77 -28 50 -122 17 59 -126 35 133 71 144 143 -18 -13 -110 45 25 171 -87
2599 -87 -56 119 -92 -76 -16 -99 74 24 62 87 -85 -173 -129 65 1 -177 -71 52 -138 -26 -22 -25 -52 -82 69 128
2625 128 74 50 83 77 151 36 50 -79 -33 106 -70 124 23 14 8 -114 113 156 -8 -62 54 9 -18 -87 37 -69
$$ packed form
2444d8J5q4J12R3k44k4R6R4j03l5N6L1K9lL7q8Rk9K64o1K8l29J13K95j26j69j07
2471a78J58J21j48K0L9p2L8K7r8R9j83K4P3J8k9n5k7J88j02M2J8j00K72k65K1
2496i9K96o1k14J09l2J86j45j52O6J42k05nP4J1l9m0K11j11j22n4K00p4Jo9N3
2521g3J70%l37K48M2r8O9j55K33%j47J26l3K6k2j18J61j38L3L1j3p9o1k4J26J37
2547A04r0j43R4J19p5j48J76Qj22q1J9J28O7j20M9Q2J9m7j44K83l3j62j35l5K43
2572E6n6j70K22OJo9j67J94r4M9P8j72J39M2j85J61R8o2P3jj61Nr7J55k0J46k58
2599h7L1J75k11J6O0q3J73n0L8K5j72q8M4J94o4j78J06J23j90J12Mlk7l0J51N9
2625A28n4k4L3oP4j15J4j29M6J39j76J94j01roj22K27M3j64n4J16m5k7o9J24j06
$$ plain form
2651 -69 -178 -162 6 -132 -102 -43 106 -17 15 -287 0 97 -2 23 -120 85 136 -121 156 -12 23 -27 -69 116
2675 116 48 -122 -192 185 85 -93 -114 115 -4 67 -37 18 57 89 -210 195 33 39 -71 8 -72 11 -102 70
2699 70 111 -30 63 77 90 73 -129 -120 8 28 -126 -113 -105 -23 -55 -140 -86 109 97 -83 51 2 67 -109 71 78 55
2726 55 17 10 -60 32 56 -49 -26 -87 7 -80 -97 -170 92 -59 47 112 20 -133 -42 19 -31 28 39 94 23 24 -60 25 44
2755 44 -79 -44 80 92 -137 -72 18 -63 -122 24 174 -30 -86 -78 -96 -37 43 -109 -50 143 159 99 -64 1 34 12
2781 12 -147 104 -46 -10 43 113 25 33 41 143 19 -2 -136 139 65 129 -130 41 286 3 -90 -143 -33 -59 22
2806 22 31 -64 -13 -174 -17 40 -181 -137 -5 174 137 -7 78 76 -68 -118 -39 20 26 74 32 -69 12 143 45 96 80
2833 80 -238 -104 97 -99 -39 -110 36 44 32 -84 68 -51 -49 -26 9 -114 -158 -112 7 -63 22 71 44 38 -44 81
$$ packed form
2651f9j09J6J68j38L0N9J49j23L2l02K87R7r9K5j43K05N1k57K77j68L5n0m2J85
2675A16o8j70p0L77j00j78k1K29j19P1j04N5L9L2k99M05j62Oj10P9q0Q3j13J72
2699G0M1j41R3J4J3j7k02RJ28K0j54J3QQ2l2q5N4J95j2j80J34m9O5j76J80Pk3
2726E5l8pp0R2K4j05K3o1R4q7j7p3K62j51J06O5r2j53R1O1n0N9J1N5p1Jq4Q5J9
2755D4j23L5J24J2k29O5R0q1n9J46J50k04n6Qj8N9Q0j52N9J93J6o0j63O5L3k2
2781A2j59K51j50L6N3P0q8QQJ02j24k1j34K75p4O4k59J71K45k83r3n3J10k6Q1
2806B2Rr5N1j61J57N7k21M4J32J79l7j44Q5kj44n0P9N9OM8m2j01Q1J31r8N1j6
2833H0l18J34K01j96O0p1J46Qj2j16J52j19KK3L5j23m4M6J19p0Q5M9k7oq2J25
$$ plain form
2859 81 -75 71 171 74 -7 -14 131 12 24 -65 62 17 -79 264 5 54 -63 -26 -4 27 51 -89 178 -67 7
2884 7 -57 -6 -55 -13 41 -6 108 -33 108 61 43 -75 -91 97 143 38 -37 53 -99 -222 42 1 3 48 -39 -147
2910 -147 -140 114 43 21 -45 -8 -28 -115 20 -21 -48 -205 26 70 -68 23 221 -81 12 -45 15 -1 14 53 -25 -10 128
2937 128 -6 -44 103 -4 17 -86 39 10 51 -59 5 -48 -93 -48 71 75 32 52 -55 43 37 -118 -5 -58 8 -41
2963 -41 -26 37 -110 -79 16 3 60 -155 28 12 -84 -62 -74 -45 104 -67 -43 35 63 -48 -7 72 -44 79 -62 3
2989 3 8 -71 19 129 79 151 -93 23 63 -100 -111 112 -40 27 -24 106 234 -52 -33 -76 -18 62 -57 -118 132 80
3015 80 -112 4 -8 67 80 -25 122 8 -32 -49 -119 62 32 86 63 108 0 -192 -270 -66 160 37 4 2 -26
3040 -26 -39 -23 5 59 -62 36 98 30 -66 -3 4 40 57 -32 -107 59 135 154 -124 -84 29 -36 -22 27 78 -124 77 100
$$ packed form
2859H1j56J46J00r7q1pJ45j19J2q9J27m5r6L43k59M9j17L7K2L1K4j40K67k45P4
2884Go4N1m9M2N4m7J14j41J41m7j8j18j6J88M6j05p5R0j52j23K64m1KM5q7j08
2910a47PK54p1k2o6L7k0q7J35m1k7j57K31M4j38R1J98l02R3n7O0j6J5L9p8J5J38
2937A28j34l8J47j07K1j03J25k9M1j10O4n3m5M5J19Mm3K0j07R8oj55J13n3O6m9
2963d1J5O3j47L1R5j3N7k15J83j6r6K2j2K9J49j71K4P8K8j11M1P9j16J23j41O5
2989CNp9R0J10n0P2k44J16M0j63j1K23j52O7n1J30J28k86J9m3N8Q0j19o1K50n2
3015H0j92J16j2P5J3j05J47j14m0j7p0J81l0N4k3M5j08j92p8K04K26j23l3kk8
3040b6j3J6K8N4j21R8O2o8r6O3PL6J7q9p5J66P6J9k78M0J13o5J4M9N1k02K01K3
$$ plain form
3068 100 -97 -85 57 7 52 -67 77 -57 -58 -18 -82 -32 47 17 64 -11 -20 3 -14 100 104 31 147 155 18 219 -46
3095 -46 28 89 -178 60 34 141 78 140 1 -49 36 -56 -32 47 62 3 51 -148 -40 52 21 166 -196 73 -99
3120 -99 -143 10 -6 -71 -42 -38 89 182 -93 62 12 -15 -121 -106 0 68 28 -3 8 -14 -139 46 71 29 -75 -9
3146 -9 69 -56 25 -60 -13 -56 82 -83 52 -33 62 -30 -62 48 87 86 17 63 -43 45 190 -77 -29 44 11 -64 -47
3173 -47 -139 257 92 34 116 -93 77 4 -6 -99 134 -83 -49 -66 45 127 -20 67 -58 4 132 -12 -66 211
3197 211 41 -205 -31 77 -33 -174 -166 -25 71 54 168 -105 15 91 77 73 29 118 8 197 -44 85 126 2
3221 2 159 -51 -103 -76 76 58 4 -147 -169 -62 -87 20 -50 -107 73 -93 -8 182 -61 -162 44 84 -31 66
3245 66 55 -4 -24 10 2 -7 -39 123 50 22 155 16 -12 -39 -61 93 -61 -70 -99 29 -47 7 20 -135 65 -55 -23
$$ packed form
3068A00j97J2J42n0M5j19J44j34jM0o4N0P9l0M7p5rK3j7J14Mp3J16Qj37K01k65
3095d6P4O1k67K38k6J07o3O2j39n0Q5r2K4P9J5n9M8j99J08R2l1J45l62K69j72
3120i9m4J53j6o5K9MJ27R3k75J55n0k7j06J5J06O8m0l1J1k2j25J85K5m2j04O6
3146iP8j25Q1q5M7m3J38j65J35q5R5r2l2J10L9jo9M6j06Q8J45k67M8P3l3p5J7
3173d7r2L96j65n8Q2k09J70p3j0r3K33k17L4j7J11Q2j47Q7j25O2J28j44n4K77
3197B11j70k46J74J08j10j41QJ41R6j7J14k73J20P6j4mm4Q9j10J89k41J29M1j24
3221BJ57k10n2K7J52j8n4j51k2J07k5J07p0n7J80j66Q5J90k43j01K06M0j15R7
3245F6j1n9k0L4qrl2J62p3k8J33j39k8k7k2J54j54rk9J28p6N4J3j55K00j20L2
$$ plain form
3272 -23 -85 139 -89 122 -9 19 -42 -104 96 -72 158 -98 -31 118 1 -47 213 14 -112 22 5 -153 -103
3295 -103 48 66 -26 57 -43 -111 -94 55 -95 5 0 -124 36 -86 -48 -41 -80 -40 -24 -9 -12 57 -96 -31 -17 27 -73
3322 -73 14 -36 35 255 -89 -2 71 114 -20 4 -8 41 54 8 120 -36 64 -8 32 208 127 -87 12 -70 -60 -49
3348 -49 -26 27 74 13 -11 -10 135 -108 59 -8 112 -91 57 47 60 -67 -139 -113 -82 -45 -33 -80 67 138 15 -95
3374 -95 17 -83 -38 117 145 1 137 -63 92 64 -12 -81 -3 -52 95 -16 19 115 72 22 110 -134 -145 146 159
3399 159 70 65 -21 8 191 -31 -28 90 55 -71 -8 134 97 7 192 -37 -70 29 59 -30 -215 44 -54 45 -3 -39
3425 -39 -53 -81 -27 -17 131 -50 -3 100 62 70 94 -54 99 99 -150 126 -70 31 -10 -162 13 103 11 221 51
3450 51 -180 -23 191 227 26 -78 15 -10 10 -280 189 111 87 -25 -45 8 -119 109 -65 -35 -45 179 36 68
$$ packed form
3272b3o2K24k28K11j31K8o1o2K00j68K30k56O7J49j17m8K60j99j26J34j7j58N0
3295a03J51J8r2Q3j00o8J7J49j50J00nj24J60j22L8Pl9M0J6J5lO9j53O5J4M4j00
3322g3Q7n0P1K20l44Q7P3M3j34K4j2M9J3m6J12j56J00p2M0J76q1k14R9q2J0J1
3348d9K3N3M7o1k4JJ45k43J67o7J20k03J48j0J3j27p2K6L1L7J2m7J47P1j23j10
3374i5J12j00M5J55K8j44J36k00J55k8p6o9P8m9J47j11L5R6m3n0Q8k44j1K91J3
3399A59q9nq6K9J83k22LJ18l5j26O3J42l7r0J85k29l3R9L0q9j85K59r8R9m8l6
3425c9j4k8N4J0J48j81M7J03l8QK4j48J53%k49K76j96J01m1j52J75R0r2K10j70
3450E1k31J57K14L6k01j04R3k5K0k90M69p8k4j12k0N3j27K28j74L0j0K24j43L2
$$ plain form
3474 68 -19 -158 -30 152 -54 -86 -104 -107 -27 2 -100 -113 110 34 -159 -59 26 -18 -117 -41 -71 -44 18 23 95 -56 -19
3501 -19 -43 40 127 112 -54 -35 -159 -117 26 185 38 57 -57 58 156 -45 -31 -48 86 145 -185 -63 -106 -7 27
3526 27 -72 17 12 61 87 94 -214 17 116 -90 140 1 -28 -10 -19 -35 50 108 -66 -62 -38 -21 78 -128 -117 -33 -59 -207
3554 -207 114 -123 33 -17 -64 57 84 -61 129 -147 -70 121 14 -110 -44 1 23 85 11 -68 -55 24 0 -20 -94
3579 -94 -10 43 -94 -43 -37 21 -16 -61 46 -219 -2 -46 -63 -6 -34 111 63 90 75 99 -47 -54 -69 -77 3 31 41 -119
3607 -119 -19 -182 47 -134 -69 -195 -131 16 104 182 -10 -143 53 25 71 -99 14 -84 -56 54 46 -59 -63 -30
3631 -30 8 -41 -132 35 -50 -195 -80 19 -146 -25 90 55 18 -64 -110 101 157 -228 -66 -207 103 79 -8 -89 -112
3656 -112 -100 23 -179 -45 81 -68 -56 78 44 -62 -67 9 66 -45 51 -143 -131 106 102 -29 -2 -18 49 93 -106
$$ packed form
3474F8q7j39J28J82k06l2j8lQ0K9j02j3K23p6j93J00Q5m4r9P6l0K7O2NP2j51L7
3501a9k4Q3Q7j5j66J9j24M2J43J59j47J9j14J15R8k01J4j7J34N9l30J22m3R9L4
3526B7r9Q9nM9K6Pl08K31R9k06K30j39k9J8rj6Q5N8j74MK4J7R9k06J1Q4k6j48
3554b07L21k37J56n0m7J21K7j45J90k76P7J91j07j24O6M5K2O2p4p9J3P9k4k0p4
3579i4Q4N3j37N1ON8l7m5J07k65K17m4j7N7k8J45m8K7j5K4j46pj5qQ0K8J0j60
3607a19J00j63K29j81O5j26O4J47Q8P8j92j33J96k8M6j70J13r8K8J10qj05mL3
3631c0L8m9r1J67q5j45J15R9j65J21J15l5l7q2m6K11N6l85J62j41L10k4q7q1k3
3656a12J2J23k02J34J26j49J2J34l4j06nP6N7j11R6j94J2K37mj31K7j6O7M4j99
$$ plain form
3681 -106 21 73 20 -12 -8 107 54 -3 -73 132 -47 60 -29 38 -42 13 203 22 -20 -39 -14 -30 -14 30 -110 -31
3707 -31 -28 100 -50 39 25 -37 38 159 89 -14 -148 -104 -260 -190 -56 -94 -4 -7 -117 132 37 -7 -4 28 37 25 -91
3734 -91 -102 -2 -177 -26 75 56 -158 -9 -26 1 99 -14 66 -75 67 30 -6 154 -9 43 -88 140 -33
3757 -33 -14 -168 -104 -95 -148 166 73 147 54 -51 83 133 -89 117 70 24 -67 82 -26 -33 -98 -17 -68 -3 -95 -105 26
3784 26 67 -64 -6 42 53 18 -159 -6 45 104 30 121 65 16 61 90 -117 39 -103 46 95 39 -137 37 -56 79
3810 79 133 -32 83 -57 -29 -121 41 -37 -210 -6 -2 -46 -105 -12 -69 196 57 -49 -103 118 15 -103 -99 118 39
3835 39 -185 -16 -58 -211 -162 56 52 35 -42 25 -4 33 -94 87 -10 -95 19 10 28 -205 20 -22 -159 -81 173 -18
3861 -18 18 -75 10 -44 -27 128 -79 -71 -58 -166 -62 -10 -11 -163 -70 56 -62 -30 13 51 -115 38 -67 -64 -128 122
$$ packed form
3681a06J27N2n3l2MJ15n3n7p0K05j79J07q9O7q0N5J90j81m2j9K5j6J6M4j40P9
3707c1LJ28j50Q9j4o2P5J21p0j03j34M4j56P0J34l8R0lj10K49r5m4LL2Rj2j16
3734i1j1J00j75J51J01j9k14J49j7K7R8j13Q0j41J42l7l6J60j63N2j31K28j73
3757c3J9j54O4Rn3L14r3P4r3j05J34N0k22K06m7m6r1J49j08po5Q1n1O5r2j0J31
3784B6M1j31N8M8J1l5j77J53N1N9p4R1n6m9M5K9k07J56j42J49M9n6j76J74r3J35
3810G9N4j65J15j40K8r2J62p8j73K04Mm4n9R3n7K65j39j06n4K21j03j18MK17p9
3835C9k24J69m2j53M9K18mj7p7O7k9L7j27J81r7q5J14rJ8k33K25m2j37P8K54j91
3861a8L6r3Q5n4J7J55k07QJ3j08J04N2jj52R3J26j18L2M3L8j66J53j05Lo4K50
$$ plain form
3887 122 65 -114 -24 -173 -100 -1 67 -149 34 -59 -8 9 -186 -51 57 -57 9 -40 146 62 27 57 59 -25 -99 -174
3913 -174 -19 136 141 31 -65 -1 78 24 30 60 121 107 -78 -24 -101 46 52 -87 170 203 -82 131 -211 85 55 27
3939 27 89 -149 -55 11 85 -74 71 65 48 -72 71 -40 93 -14 13 -22 -100 36 0 60 -67 -35 -152 133 62
3964 62 11 24 -35 32 -107 96 -71 84 -68 -70 55 -141 53 40 -59 -48 -115 47 61 -82 -15 -133 -82 17 52
3989 52 -100 -54 -26 -8 84 45 -38 -8 -149 -15 76 -22 7 31 20 80 -85 -13 -69 -60 -63 -28 -6 40 33 25 -31 61 -17 -23 -20
4020 -20 -40 23 -126 161 61 107 -54 -125 34 17 -77 -58 -59 -52 -106 123 -137 50 121 34 123 -142 -79 -20 73 -217
4046 -217 -127 -99 -163 30 2 140 68 11 74 -146 -67 -55 82 98 -151 160 80 -23 -40 9 43 83 -92 33 58
4071 58 57 96 -25 36 -13 -2 52 -46 221 106 -34 160 214 51 -63 9 31 -31 -211 -20 112 -39 -49 -17 -8 0
$$ packed form
3887A22n7j79R0j49P3R9O8k16J83r3N1J7j95J35J08j14O6m9J86q4l5L0Kq4p4p5
3913a74J55J55Nj10r6O4P9n4OL0O1j4j85N4p7J47Oj39K57L3k85K13l42K96l0k8
3939B7O2k38R4O6P4j59J45oj7j20J43j11J33j07K7l5p8J36l6O0j27L2j17K85p1
3964F2n1J3n9O7j39K03j67J55j52kJ25j96J94j3r9J1o7J62J4j43O7j18N1R9L5
3989E2j52M6K8J8R2l9q3L0j41J34R1r8K9K4j1O0j65P2n6RlL5K2M6pqn6R2p8oL
4020b0k0O3j49K87j00M6j61p1J59j7r4J9jPn4K29k60J87P1q7Q9k65O3N9R3k90
4046b17R0K8o4J93k8J38p2n7O3k20P9J2J37J6k49L11q0j03j7M9L4M0j75J25K5
4071E8jL9j21O1m9J1N4r8K67j15j40J94N4j63j14P2K2o2j80J91J32j51j0L2RQ
$$ plain form
4097 0 -106 115 49 119 27 -184 -16 52 -16 37 56 131 -72 -53 -57 -9 -68 71 5 -30 9 -134 -44 -75 154 124 95
4124 95 -24 156 81 8 -20 -45 -37 -60 105 -12 8 -54 -55 93 -190 -24 -48 -9 -62 -141 31 -37 -9 -74 -18 33 -16
4151 -16 10 -11 -39 -36 -69 61 185 -18 21 -98 126 49 -96 0 -19 59 104 -103 114 40 120 -93 144 -31 -7
4176 -7 -34 -96 118 -156 -38 24 94 73 -155 -51 78 66 -6 33 -33 66 -56 -28 279 45 -56 94 40 69 61 15
4202 15 -6 -36 121 -105 -52 40 33 -92 50 -14 242 -108 68 -36 -59 31 -46 -10 25 -51 140 11 -31 -36 148 37
4228 37 -107 14 60 -117 28 87 0 -16 -149 253 -66 -47 -19 6 43 21 39 -58 4 27 18 -180 17 27 -17 130
4254 130 70 -67 38 -27 -89 -60 -66 -81 -114 -148 -111 59 85 -87 -195 -45 -38 -84 -20 -29 -40 -32 -28 95 35 -167 69 39
4282 39 -30 110 14 -66 20 -74 75 -81 91 150 -117 -71 77 142 81 -36 -56 -7 32 -46 -11 84 13 -181 152 -106
$$ packed form
4097@j06K21o6P0r2k11J68O8o8N3J9P5k03J9mM8n9J39o6l5L9j43R0l1K29l0k9
4124I5j19J80p5p3k8k5Qk3J65j17K0o2jJ48k83J66k4L9n3p9J72o8K8o5N6N1m9
4151a6K6k1k8Ll3J30J24k03L9j19K24p7j45R6j9P8M5k07K17p4Q0k13K37j75K4
4176gk7o2K14k74J18O2P0k1k28J04J29j2p2L9o6R9j22K8L07k34j01J50n4K9qm6
4202A5k1l0J57k26N3R2pj25J42o4K56l50J76j04k3R0p7L6L5p6J91j29m2nJ84j11
4228C7j44J21M6j77J45N9q7j6j33M02l19J9K8K5L7k2J8r7O2K3rj98J97J0m4J47
4254A30o0j37J05o5o2K9oj5l3l4L7J70K6j72j08J50Pm6O4rj1QMJ23o0k02K36l0
4282C9o9J40r6q0Q6r4J49j56J72N9k67M6J48O5o1j17k0M9L9p8L5R5p1j94L33k58
$$ plain form
4308 -106 -105 -68 -51 -29 109 9 -62 17 -84 102 -176 -17 79 38 -114 6 -24 -9 68 73 69 -34 -122 49 32 22
4334 22 -38 7 115 9 23 -36 15 81 36 -132 50 -241 73 -2 -43 -142 -168 -22 -48 -78 -132 -9 27 55 -194 67
4360 67 81 54 83 50 110 -116 -40 76 137 -15 175 41 -39 9 -67 -93 -156 86 56 -96 -100 153 -27 -119 -63 -31
4386 -31 -2 56 41 72 113 -73 -4 -9 14 108 -52 -107 -92 -70 148 -59 98 92 -65 -28 40 -110 -34 -49 -50 120 -8
4413 -8 19 -38 -48 -144 93 88 -95 -14 56 -31 60 -109 -37 30 110 -56 -2 92 -45 -45 66 -2 -8 52 61 85 53 -120 10
4442 10 -129 -35 -46 -36 21 32 16 -20 131 -64 -63 20 106 63 -64 -17 -46 30 79 -104 -35 66 95 11 -57 -126 0
4469 0 -25 -49 109 117 175 -108 -8 -227 -80 54 45 26 -16 -24 96 85 -7 -190 0 -38 177 -38 12 80 -61 88
4495 88 0 -92 36 59 -204 43 97 176 -306 -34 52 96 -21 -182 7 -66 117 71 156 14 -81 27 70 165 -52
$$ packed form
4308a06JL7J7K2J38j00p1P9j01J86k78J59R6m1j52J20l0J5P7Nmj03q8J71j7j0
4334B2o0M5J08j06J4n9N1O6m5j68J82k91L14p5m1r9k6J46k6l0n4J23L6K8k49K61
4360F7J4k7K9l3O0k26P6J16O1j52J90j34q0M8p6k6o3K42l0j52mK53j80r2N6L2
4386c1K9N8j5L1M1j86O9nK3R4j60n5J5K2K18k07J57oj57L7O8j50P6j5jJ70j28
4413hK7n7j0r6K37nj83Q1P0q7R1j69P2O7Q0j66N4R4j37%J11o8oO0RK4l2j73J30
4442A0j39R4j1J0N7J1j6l6J51j95JQ3Q6m3j27M7k9P6M9j83O9J01K9q4o8o9J26
4469@k5k4J58QN8k83J00k19J47J34rj9m2qJ20j1r2j83J90l8K15k15N0O8j41J49
4495H8q8r2J28K3k63K47N4P9m82K72Q6M4j17j61J89p3J83m6Q5j42r5J08M3R5k17
$$ plain form
4520 -52 -39 97 84 137 -28 19 205 12 121 -58 -118 -134 -212 -112 100 93 -52 50 -1 -50 -106 -120 -33 -80 159
4545 159 -89 -116 -124 -52 7 115 27 33 133 7 -23 -10 122 -5 -17 -117 29 72 -8 -27 47 49 -52 114 56 -1
4571 -1 -33 147 -17 -64 20 8 95 -36 -37 -23 143 -34 13 118 185 6 107 58 -124 -41 102 4 141 84 -50
4596 -50 -61 -44 -108 82 -86 229 -17 42 -11 -145 -68 15 -28 78 -148 -126 65 53 85 3 9 -37 -16 72 101 41 -145
4623 -145 -36 39 54 106 91 28 -168 -10 107 35 -76 228 19 -61 30 -52 3 -79 13 29 17 49 -30 -21 108 -62
4649 -62 -45 31 -108 -68 54 6 20 54 64 -11 -105 -44 79 -62 -122 -20 76 -122 63 -3 -101 -57 26 -199 60 34
4675 34 -132 9 -17 -14 17 42 -112 -22 59 -67 28 -25 -97 24 -67 -201 33 -109 35 -33 -87 69 -141 111 -82
4700 -82 4 43 92 -54 -122 -52 -47 89 70 31 -13 19 16 -101 -129 -67 41 -6 114 -138 107 -31 -21 -106 -43 107 -44
$$ packed form
4520e2J3J36j3N3j65M7J86j93J09j79o0j6p8J00K12pj45J02n1m9n6j4Q7m7K39
4545A59k48k7qP2N9J08q8OJ00j26l0J3J32j27j2j00J46M3q0j9P4Kj01J66n8n7
4571al2J80j64m7Q4j2Q7j31jJ4J66j77M7J05O7j79J01m9j82Q3J43r8J37n7j34
4596e0j1J7o4J90j68L15k46N9n3j34P7Q3m3J06k26K2J91j2L2q2Om6K1Q8K9o0j86
4623a45J09P5J5N2j5o3j96J58J17p2j11L04k09q0R1q2N5q2R2J6j2L2p9RJ29j70
4649f2J7P6j39M0J22m8J4L4J0p5r4O1J23j41o0J02R6j98J85o6r8M4Q3k25K59k6
4675C4j66J41k6LL1K5j54R0Q1j26R5n3p2J21r1j34K34j42J44o8n4J56k10K52j93
4700h2Q6L9M9j46o8P0NJ36j9l9m4L2lj17k8O2J08m7J20k52K45j38J0q5O3J50j51
$$ plain form
4727 -44 58 10 -86 26 -65 -81 134 66 -65 -153 58 -4 -84 -104 -28 110 48 85 -27 97 33 -75 5 59 -100
4752 -100 0 38 -87 18 10 62 -118 -99 -52 -32 23 -12 31 -48 19 -5 -61 87 46 4 -3 36 80 -27 -2 -43 8 -89
4780 -89 -145 -100 -31 102 -219 -82 84 -170 -7 47 -63 -67 -195 57 82 2 -180 -65 101 -34 40 -55 -27 -58
4804 -58 25 90 41 -9 -36 13 -14 121 -82 -57 -123 -152 212 9 -69 34 -143 87 -66 -43 -60 29 -58 -47 -39 82
4830 82 -83 -129 -88 1 -14 11 65 25 -77 37 12 -102 33 35 -69 32 -2 206 61 0 -1 -317 -35 29 -32 20
4856 20 -28 -85 64 167 -185 -25 3 -92 -222 21 -93 -37 3 83 59 -169 12 -134 -41 83 28 -6 12 -74 5
4881 5 -32 -247 211 57 -82 58 24 99 -9 37 40 67 -81 -193 -186 -46 33 -11 238 -41 22 138 10 -159 31
4906 31 96 -37 -59 -89 -82 97 32 -53 -100 -85 1 -53 25 10 83 30 155 167 -31 41 60 -50 -42 -73 -102 195 47 -58
$$ packed form
4727d4J02m8r6J12r1j6K15o8j31q8K11o2q0k0P6J38o2L7j12J24o4j08Q0N4j59
4752a00J00L8j25J05qN2j80J9M7K0N5l5M3p9O7k4n6J48m1m2pL9M4j07K5m1N1r7
4780h9n6M5O9J33l21J37J66k54J63N4j10mj28K52K5q0j82J15J66j35P4r5K8l1
4804e8Q3O5m9n0k7M9k7J35k03K5o6k9L64k03p8J03j77K30j53K3j7Q9q7J1QJ21
4830H2j65m6M1Q9j5K5N4m0j02J14k5j14J35Kj04J01l4K08j45o1jl16K82O4o1N2
4856B0m8n7J49J03l52J60K8r5j30K43j14N6M0Q0k4k28J81j46R3J24n5l4J8q6P9
4881El7k15M58j54j39J40l4P5j08M6LK7j48j12PJ40P9m4K49k79O3J16j28j69J90
4906C1O5j33k2l0PJ79o5q5m7J5Q6n4P8j5P3n3J25J2j98P2J9j10Ql1k9K97j48j05
$$ plain form
4934 -58 -46 -126 -97 65 58 -63 20 117 134 57 101 7 -34 -69 42 164 -66 -21 -130 -143 43 -41 -45 58 -68 -45 31
4961 31 -11 -115 -84 134 7 -64 -108 -15 70 -1 26 61 -94 148 -77 65 -85 -2 29 63 50 131 -31 7 68 -148
4987 -148 -95 -36 28 -144 73 55 157 15 -14 -147 -84 168 79 -45 85 49 137 72 -79 -45 58 -38 39 -87
5011 -87 103 68 14 -48 -35 -30 97 167 -157 85 55 168 25 24 34 9 -18 -229 -76 55 29 -77 -101 137 -22
5036 -22 29 -38 -163 56 11 -16 -180 72 -19 -83 82 -57 -38 -138 54 7 -48 -46 99 74 -104 -46 -69 44 122
5061 122 59 180 11 25 177 -107 -86 8 -49 97 -99 -78 182 -47 -136 -60 -92 -15 81 -36 -210 -81 -91 -60
5085 -60 -52 47 30 85 26 -3 93 261 60 72 -75 -57 16 20 76 127 125 78 79 18 -35 -39 129 -106 2 -117 131 -22
5113 -22 -41 221 -5 -65 -12 -91 5 8 112 -3 137 -89 -60 23 -35 143 -79 9 11 -13 -78 -15 50 -22 42 -54 122
$$ packed form
4934e8J2q0K9J62pj21Q3R7J7p7M4r4m1l5J11J22k30M5j09j3J86q4mJ03j26K3P6
4961C1m2j04L1K18j27p1m4R3Q5p1K7L5j55K42k25J42j50Q3L1L4j3Q1j62L8O1k16
4987a48N3N9O4j72K17j8J02j42k9j33O3K52q9j24J30l6Q8o5j51L4J03r6P7j26
5011h7J90l5n4o2J3NJ27P0l24K42l0J13j43jJ0k5k7k11J53J31k6j06k4K38j59
5036b2N1o7j25K19m5k7j64K52r1o4J65j39J9j00J92m7n5KJ45k5j78N8k3J13P8
5061A22o3J21j69J4J52k84K1R4n7J46j96K1K60k29q9P6l2P7R6j17j74J29j0L1
5085f0QR9j7N5n9k9R6J68k01J2j47J8P3MN6N1km7Jo1n3mJ68k35J08j19K48j53
5113b2j9K62k26o0N3p9R6LJ04j15J40k26K9Q3n8J78k22Q8Kk4o5O3O5p2O4r6J76
$$ plain form
5140 122 -36 127 -146 4 -40 -210 -135 82 -85 22 8 -131 -57 22 31 6 30 12 -27 -34 114 20 98 -37 51
5165 51 24 169 -173 -32 -59 12 86 -77 172 -34 -119 -31 -2 45 -121 4 -36 102 45 124 -61 -60 -120 -97 -47 66
5191 66 -88 -74 -5 -122 -71 -28 75 92 -9 34 76 -96 146 16 -8 125 116 2 60 -4 -12 -43 -117 20 -49 120
5217 120 -12 -136 183 80 94 8 16 17 18 46 -35 41 -88 -24 64 47 -57 210 -127 -199 -26 4 148 75 55 88
5243 88 70 -10 -28 -149 21 5 188 -48 -142 -66 12 -132 2 -25 14 -232 48 144 120 -125 -77 45 71 99 -9
5268 -9 92 65 -94 -26 74 -74 10 117 -6 -78 37 -56 4 124 -37 65 -32 94 65 8 47 -58 -37 125
5292 125 34 3 -23 36 9 -36 -41 -35 3 24 60 102 -181 100 -75 172 -12 29 -134 52 13 -66 -65 28 108 166 -4
5319 -4 138 -2 -24 61 -117 -32 -28 16 -108 17 70 6 -90 -38 -40 -119 163 163 -77 50 -93 96 -60 18 -24 -32 -113
$$ packed form
5140A22j58J63k73J50m4j70P5K17j67J07j4j39P4P9Rk5K4j8l9pJ48r4P8j35Q8
5165E1k7J45l42J41k7P1P4j63K49k06q5Q8K9M7j66J25m0J38n7P9j85Jo0K3N0J13
5191F6j54J4O9j17N1M3J03J7j01M3M2j72K42j30k4J33rj14N8o4ql1p4J37o9J69
5217A20j32j24L19j03J4q6QJJK8q1P6j29O4Q8j7j04K67l37p2J73L0J44p3k0L3
5243H8j8q0j8j21J70j6J83k36r4P6P8j44J34k7L9k46K80R6k4k45M8J22K6K8j08
5268iJ01k7j59O8J00j48Q4J07j23p2J15r3O0J20j61J02r7J26k9n7L9j05K1J62
5292A25r1l1k6N9k7m5nOL8K1L6M2k83K81j75K47j84M1j63J86l9p9JR3Q0N8j70
5319dJ42j40k2Q5j78Q5MM4j24J25N3o4r6N2kp9K82%k40J27j43J89j56P8m2qq1
$$ plain form
5346 -113 12 64 140 -5 -22 32 -220 23 36 -130 -93 -54 39 -56 -31 -29 151 33 31 25 65 -115 -26 98 73 -77
5372 -77 6 -81 -77 -8 -96 -68 -81 37 -54 -26 19 107 -152 -2 136 -32 35 -65 78 132 37 -110 50 -136 41
5397 41 107 78 -21 -110 -11 13 65 -122 89 96 23 -32 -118 -204 128 1 -124 -36 -61 -74 -9 43 -24 49 -5 -75 199 -96
5425 -96 84 -102 45 -24 143 -1 -8 20 168 73 -132 60 72 -23 -68 218 5 95 -23 22 -129 -30 128 149
5449 149 -6 -8 142 -70 164 -2 -134 -101 23 102 -65 53 -48 28 -33 -92 62 -107 -90 -72 7 -54 -26 38
5473 38 7 103 -50 51 50 -96 49 41 -88 11 -19 -45 -33 -85 -206 12 52 -135 -55 38 -25 -72 -33 -106 12 -116
5499 -116 116 79 36 -119 -207 35 -109 46 -13 -11 -141 31 -70 39 272 80 112 -118 138 -27 1 60 112
5522 112 43 22 -41 -15 117 6 -40 -76 -20 102 62 45 -9 35 175 73 6 -98 -9 116 23 5 97 37 104 24
$$ packed form
5346a13J25N2P6j45j7N4k52K43J3j66L7L9R3r5K5KJ80j18koM0j80Q9J24k5j50
5372g7Q3q7MO9q8K8j3J18r1K8M5Q8k59J50J38j68O7j00J43N4r5j47J60j86J77
5397D1O6k9r9q9R9K4N2j87K11Pp3n5q6q6L32j27j25Q8k5j3O5N2o7P3n4p0K74k95
5425i6J80j86J47o9J67j44pK8J48r5k05J92J2r5m5K86k13R0j18M5j51R9J58K1
5449A49j55kJ50k12K34j66j32L3J24P9j67J18j01P6o1n9J54j69J7J8P9o1K8O4
5473C8l1R6j53J01jj46J45qj29R9l0k6J2n2j21K18M0j87Q0R3o3m7L9p3J18j28
5499a16K32l7m3j55q8K42j44J55n9Kj30J72j01J09K33j92L2k30K56j65K8N9N2
5522A12o9k1o3K6J32j11m6l6N6J22m0j7n4M4J40j02o7j04Q9J25r3j8R2o0O7q0
$$ plain form
5548 24 -12 75 30 27 195 11 21 63 28 16 105 54 -24 30 26 -42 38 113 27 158 -8 48 -87 -83 82 -68 -77 -205
5576 -205 -9 100 -23 -147 -111 -21 83 -15 -78 246 4 -30 109 -91 40 64 -60 -24 -113 32 -169 -53 7
5599 7 -91 -62 13 67 197 110 108 -35 -75 28 79 54 96 72 -49 -35 -145 111 114 33 96 -97 91 32 132 12 34
5626 34 -64 -77 -23 1 31 -83 14 29 -26 -96 14 36 25 118 -20 47 103 -14 170 47 80 92 7 116 105 -50
5652 -50 114 -34 -58 39 -133 -9 -4 52 -130 7 113 57 140 -85 -45 -31 -29 -6 -34 107 9 254 16 65 8 89
5678 89 70 221 -96 50 53 -90 -19 -9 74 -55 -128 -48 68 28 -26 110 8 -156 58 26 114 56 69 -166 40
5703 40 33 20 119 -12 -17 17 -90 26 -51 -75 -51 -67 32 -44 -63 -46 22 61 34 130 57 59 86 31 25 -108 19 73 -45
5732 -45 111 32 -14 -39 14 124 138 196 41 -8 -49 63 59 116 64 119 99 -54 -59 31 -28 15 86 -11 85 -110 -32 88
$$ packed form
5548B4l6Q7m5lJ68j84J0M2l5j2Q9n1p8N4mo8Q0P5q6J31j66N6j35MJ65j50rj28
5576b05J96J09j23j24L6R0J04r8o3L24k42l4J39k00J31K4j24L6q9J45k01J16O0
5599Gr8K9P5N4J30q7kj43m0J03N1k5M2k4j21J4j10K56Lq1O3j93J88n9J00j20K2
5626C4r8j3N4K4L0j14R7J5n5p0J10K2j1R3j38O7N6j17J84j23L3J2q5J09j1j55
5652e0J64j48k4R7j72J24NN6j82J37J06n6Q3k25M0J4KK3k8J41r8K45k38M9n7Q1
5678H9j9J51l17J46Lj43P1J0Q3j29p3Q0J16m0n4J36j02j64K14l2Q8n8J3k35K06
5703D0pj3R9j31nL4j07J16p7k4K4j6R9p6j9J7O8L9k7R6p3KK7n5oj33J27N4j18
5732d5J56p9m6k5N3J10J4N8j55m9m1J12mN7n2N5k0j53nR0n9M3P1r7R6j95P8J20
$$ plain form
5760 88 23 25 130 21 26 121 46 -147 53 56 6 73 -200 -53 60 9 -14 -31 -25 -111 -67 49 -72 -59 8 105 125 21
5788 21 75 20 75 -145 49 -8 -26 -102 90 132 -25 57 82 -47 202 -5 31 -10 30 32 -9 101 181 -65 52 -53
5814 -53 -74 -40 22 -61 137 46 -36 17 10 -46 55 -7 26 11 6 -22 -27 183 2 -11 -59 134 50 -191 -15 0 -30 80
5842 80 -19 -5 225 116 -130 26 120 -109 -1 4 -2 -69 1 -50 134 165 122 -45 62 82 152 -67 -73 159 45 71
5868 71 35 46 -23 7 -134 65 93 -177 -12 145 32 -80 -57 10 56 25 94 48 -58 42 142 -251 -55 54
5892 54 88 70 -81 21 -18 7 20 -24 -12 -103 -51 63 30 -49 8 223 -23 17 23 31 -15 17 0 -69 -41 -95 -72 17 14
5921 14 -81 -84 108 -71 51 -89 25 8 -29 61 -122 -66 2 -2 -52 -42 16 49 -42 89 -157 -30 18 -39 16 0 38
5948 38 120 -26 73 -172 57 -166 -72 27 124 120 -143 28 -19 74 119 94 -24 -39 88 118 118 -38 52 11 15 85 27
$$ packed form
5760H8o5KJ05j09NR5p5j93K00Ln0O7k73J47J13n1k3j7Oq6M4J16j21J3O7R7K0j04
5788B1N4n5N5k20J94n7j8p6J92M2j57Q2K5j29K49k07L6m1M0Km1J10Q0k46J17j05
5814e3k1L4O2q3J98r1q2N3pn6J01o2L3j5nk8nK10j81j3m8J93q4k41J76J5l0J10
5842H0r9J4K30j09k46J56R4k29J08Noo7P0n1J84L1m3j67J07K0P0k19oK32j14K6
5868G1l6J1o9L0j41J99K8k70J65J57j13j12K3O7M6l1O9m6j06J00J00l93J96J09
5892E4L4j8j51J02l9K5J3m4J2r1N2J14l3p9N7K15k46M0OQm6L2j7o9K8n4K3Q9l
5921A4r5lJ92j79J22j40J14j7l7R0j83N6O8mn0J0N8L3r1J31k46J27M8n7N5j6L8
5948C8Q2j46R9k45K29k23R4R9R7mk63J71m7R3M5k5j18j5J27L0%j56R0m1MP0n8
$$ plain form
5975 27 -11 60 -80 43 73 78 38 -96 -43 135 -139 -68 14 -56 -125 75 -81 -94 -146 93 32 -21 192 -27 -50 119
6001 119 -12 52 78 57 91 -66 111 -17 122 -148 -10 -41 -6 -27 -49 -73 -70 -106 -188 37 17 -81 96 -136 -86
6026 -86 -52 8 25 11 297 -20 153 54 -16 -88 58 42 20 42 -25 -42 102 -51 18 -60 79 -12 75 2 -73 -2 -81
6053 -81 -106 18 -4 46 66 -69 79 -56 55 -124 18 97 -38 -36 -210 -70 -118 58 -11 -48 -61 -10 64 -84 -15
6078 -15 22 117 78 83 0 75 -6 61 -244 114 -157 -32 -12 41 -162 95 58 40 -97 -180 -64 -36 -151 72 33 -173
6104 -173 -37 130 -192 -7 85 -95 -29 -164 200 -39 -49 75 -202 83 146 -142 157 -202 10 -63 8 33
6126 33 -55 24 70 -1 151 -72 1 117 14 -7 -94 112 54 -63 100 -88 18 196 -99 35 19 132 12
6149 12 -81 185 -38 41 -6 -119 100 4 -11 70 68 82 32 31 -90 10 -10 -228 -105 24 -12 -7 4 -89 117 187 66
$$ packed form
5975B7l8P1j40J23L0Nm0j34N3J78k74P1Q2p0o9K00j56j3n2K39o1n3K13k19k3J69
6001A19j31O4K6k1L4j57J77j28J39k70J38l1L5k1k2k4Ll6q2K25k0r8J77k32N0
6026h6L4O0J7j4K86l17J73r9p0p2J46j6k2K2o7j7J44j53O9p8J39r1Q7p3p5P1p9
6053h1k5J24k2N0K0j35J48j35J11j79J42P9j35Kj74J40m8J76o9l7j3N1P4j48O9
6078a5L7R5l9Nq3P5q1O7l05L58k71J25K0N3k03K57l7j8j37q3J16K8j15K23l9k06
6104a73J36J67l22J85R2j80O6j35L64k39j0J24k77K85O3k88K99l59K12p3P1K5
6126C3q8P9M6p1J52k23P3J16j03k1q7K06n8j17J63j88J06J78k95J34j6J13j20
6149A2r3K66k23P9m7j13K19r6j5Q1kJ4n0jj21J00k0k18J23J29l6NJ1r3K06P0j21
$$ plain form
6176 66 27 133 97 50 -113 -21 25 16 -32 -37 -9 -58 -95 -19 51 98 58 -140 29 -100 -114 132 39 81 78 109 -111 -115 -120
6205 -120 -73 157 19 12 -24 97 -51 31 -95 48 -80 122 -7 -117 148 36 -29 144 51 74 8 -132 -5
6228 -5 -53 7 45 146 -10 -16 -116 82 95 -7 -82 46 -214 13 163 -40 -30 -53 -104 23 -58 81 -109 -133 77
6253 77 75 -4 -71 62 -54 -22 45 32 -30 -42 14 -163 -24 -107 27 9 -106 -93 -6 10 -30 120 -4 73 -44 55
6279 55 2 34 -191 57 113 -53 -17 -25 39 33 53 -74 105 106 -126 127 -165 -118 -41 -71 40 7 -81 -41 -69 176 -24
6306 -24 138 -34 111 207 81 29 -28 11 -13 -98 -16 45 32 -69 -18 63 -50 28 221 238 47 -212 92 160 -35
6331 -35 32 7 -12 129 88 -35 -61 25 -203 86 57 71 -45 33 -51 -86 105 67 52 32 -2 -64 68 76 -13 -56 85
$$ packed form
6176F6l9J06l6m7j63R2M6rm8nK8m9l7P6P0M7m0j98J69j29j4K46r3M2lL1k20mn
6205a20M7K30j38pl6J21j48Q2j26J43j28K02j29j10K65j12o5J73r3K3o6j40J27
6228em8O0L8J01j56oj00J98J3j02p5J28k60K27J50k03J0k3n1J27q1J39j90k4K10
6253G7kp9o7J33j16L2O7j3o2j2N6j77J39q3J34j8j15J3Q7J6m0J50j24P7j17R9
6279E5n3L2k25K48N6j66L6qO4oK0j27J79Jk32K53k92M7P7l0J11l3q8M0k8K45k00
6306b4J62j72J45R6j26n2n7L9k4q5Q2O1j3j01N1Q1j13P8J93J7j91k59L04O8j95
6331c5O7k5j9J41m1j23k6Q6k28K89k9J4j16P8q4l5J91l8j5k0l4o2J32Qq9m3J41
$$ [...]
8191e6
##END NTUPLES=NMR FID
##END=
