##TITLE=1H_Pr 5182-up
 CDCl3
 8 sc, 
 26.1.2023
##JCAMPDX= 6.0         $$ Bruker NMR JCAMP-DX V2.0
##DATA TYPE= NMR FID
##DATA CLASS= NTUPLES
##ORIGIN= UXNMR, Bruker Analytische Messtechnik GmbH
##OWNER= root
$$ XWIN-NMR		Version 3.5
$$ Thu Jan 26 14:02:42 2023 Russian Standard Time (UT+4h)  she@DPX200
##.OBSERVE FREQUENCY= 200.13135
##.OBSERVE NUCLEUS= ^1H
##.DELAY= (6, 6)
##.ACQUISITION MODE= SIMULTANEOUS
##.ACQUISITION SCHEME= undefined
##.AVERAGES= 8
##.DIGITISER RES= 18
##SPECTROMETER/DATA SYSTEM= spect
##.PULSE SEQUENCE= zg30
##.SOLVENT NAME= CDCl3
##.SHIFT REFERENCE= (INTERNAL, CDCl3, 0, 15.7039)
##AUDIT TRAIL= $$ (NUMBER, WHEN, WHO, WHERE, WHAT)
$$ ##TITLE= Audit trail, XWIN-NMR		Version 3.5
$$ ##JCAMPDX= 5.01
$$ ##ORIGIN= Bruker BioSpin GmbH
$$ ##OWNER= she
$$ F:/spectra/data/she/nmr/H-F/1/audita.txt
$$ ##AUDIT TRAIL=  $$ (NUMBER, WHEN, WHO, WHERE, WHAT)
(   1,<2023-01-26 14:01:41.34 +0400>,<she>,<DPX200>,
      <created by zg, POWCHK disabled, PULCHK disabled
       configuration hash MD5:
       00 E9 B6 7A A2 85 ED C7 34 08 36 98 17 FE 4E 26
       data hash MD5: 16K
       8C FE A6 3F BB E6 EE 8B 49 30 74 63 62 20 2F 79>)
$$ ##END=
$$ 
$$ hash MD5
$$ D0 72 60 48 6E C0 54 52 CB 07 D1 21 F5 85 42 34
##$RELAX= 
##$RELAX= 
##$RELAX= 
##$RELAX= 
##$RELAX= 
##$RELAX= 
$$ Bruker specific parameters
$$ --------------------------
##$DU= <F:/spectra>
##$EXPNO= 1
##$NAME= <H-F>
##$PROCNO= 1
##$TYPE= <nmr>
##$USER= <she>
##$AMP= (0..31)
100 100 100 100 100 100 100 100 100 100 100 100 100 100 100 100 100 100 
100 100 100 100 100 100 100 100 100 100 100 100 100 100 
##$AQSEQ= 0
##$AQ_mod= 1
##$AUNM= <au_zg>
##$AUTOPOS= <>
##$BF1= 200.13
##$BF2= 200.13
##$BF3= 200.13
##$BF4= 200.13
##$BF5= 200.13
##$BF6= 200.13
##$BF7= 200.13
##$BF8= 200.13
##$BYTORDA= 1
##$CFDGTYP= 0
##$CFRGTYP= 5
##$CHEMSTR= <none>
##$CNST= (0..31)
1 1 145 1 1 1 1 1 1 1 1 1 1 1 1 1 1 1 1 1 1 1 1 1 1 1 1 1 1 1 1 1 
##$CPDPRG= <>
##$CPDPRG1= <>
##$CPDPRG2= <>
##$CPDPRG3= <>
##$CPDPRG4= <mlev>
##$CPDPRG5= <mlev>
##$CPDPRG6= <mlev>
##$CPDPRG7= <mlev>
##$CPDPRG8= <mlev>
##$CPDPRGB= <>
##$CPDPRGT= <>
##$D= (0..31)
0 1.2 0 0 0 0 0 0 0 0.06 0 0.03 0 0 0 0 0.0002 0 0 0 0 0 0 0 0 0 0 0 0 
0 0 0 
##$DATE= 1674727300
##$DBL= (0..7)
120 120 120 120 120 120 120 120 
##$DBP= (0..7)
150 150 150 150 150 150 150 150 
##$DBP07= 0
##$DBPNAM0= <>
##$DBPNAM1= <>
##$DBPNAM2= <>
##$DBPNAM3= <>
##$DBPNAM4= <>
##$DBPNAM5= <>
##$DBPNAM6= <>
##$DBPNAM7= <>
##$DBPOAL= (0..7)
0.5 0.5 0.5 0.5 0.5 0.5 0.5 0.5 
##$DBPOFFS= (0..7)
0 0 0 0 0 0 0 0 
##$DE= 6
##$DECBNUC= <off>
##$DECIM= 32
##$DECNUC= <off>
##$DECSTAT= 4
##$DIGMOD= 1
##$DIGTYP= 9
##$DL= (0..7)
0 120 120 120 120 120 120 120 
##$DP= (0..7)
150 150 150 150 150 150 150 150 
##$DP07= 0
##$DPNAME0= <>
##$DPNAME1= <>
##$DPNAME2= <>
##$DPNAME3= <>
##$DPNAME4= <>
##$DPNAME5= <>
##$DPNAME6= <>
##$DPNAME7= <>
##$DPOAL= (0..7)
0.5 0.5 0.5 0.5 0.5 0.5 0.5 0.5 
##$DPOFFS= (0..7)
0 0 0 0 0 0 0 0 
##$DQDMODE= 0
##$DR= 18
##$DS= 0
##$DSLIST= <SSSSSSSSSSSSSSS>
$$ [...]
##$SUBNAM2= <"">
##$SUBNAM3= <"">
##$SUBNAM4= <"">
##$SUBNAM5= <"">
##$SUBNAM6= <"">
##$SUBNAM7= <"">
##$SUBNAM8= <"">
##$SUBNAM9= <"">
##$SW= 18.05172834244
##$SWIBOX= (0..15)
0 0 2 0 0 0 0 0 0 0 0 0 0 0 0 0 
##$SW_h= 3612.71676300578
##$TD= 16384
##$TD0= 1
##$TE= 0
##$TE2= 300
##$TE3= 300
##$TEG= 300
##$TL= (0..7)
0 120 120 120 120 120 120 120 
##$TP= (0..7)
150 150 150 150 150 150 150 150 
##$TP07= 0
##$TPNAME0= <>
##$TPNAME1= <>
##$TPNAME2= <>
##$TPNAME3= <>
##$TPNAME4= <>
##$TPNAME5= <>
##$TPNAME6= <>
##$TPNAME7= <>
##$TPOAL= (0..7)
0.5 0.5 0.5 0.5 0.5 0.5 0.5 0.5 
##$TPOFFS= (0..7)
0 0 0 0 0 0 0 0 
##$TUNHIN= 0
##$TUNHOUT= 0
##$TUNXOUT= 0
##$USERA1= <user>
##$USERA2= <user>
##$USERA3= <user>
##$USERA4= <user>
##$USERA5= <user>
##$V9= 5
##$VALIST= <valist>
##$VCLIST= <CCCCCCCCCCCCCCC>
##$VD= 0
##$VDLIST= <DDDDDDDDDDDDDDD>
##$VPLIST= <PPPPPPPPPPPPPPP>
##$VTLIST= <TTTTTTTTTTTTTTT>
##$WBST= 1024
##$WBSW= 4
##$XGAIN= (0..3)
0 0 0 0 
##$XL= 0
##$YL= 0
##$YMAX_a= 88003
##$YMIN_a= -154954
##$ZGOPTNS= <>
##$ZL1= 120
##$ZL2= 120
##$ZL3= 120
##$ZL4= 120
##$ABSF1= 10
##$ABSF2= 0
##$ABSG= 5
##$ABSL= 3
##$ALPHA= 0
##$AQORDER= 0
##$ASSFAC= 0
##$ASSFACI= 0
##$ASSFACX= 0
##$ASSWID= 0
##$AUNMP= <proc_1d>
##$AZFE= 0.1
##$AZFW= 0.1
##$BCFW= 1
##$BC_mod= 2
##$BYTORDP= 1
##$COROFFS= 0
##$CY= 11.3945322036743
##$DATMOD= 1
##$DC= 2
##$DFILT= <>
##$DTYPP= 0
##$F1P= 2.36226072786647
##$F2P= -0.459571619588291
##$FCOR= 0.5
##$FTSIZE= 0
##$FT_mod= 4
##$GAMMA= 1
##$GB= 0.15
##$INTBC= 1
##$INTSCL= 1
##$ISEN= 128
##$LB= 0.24
##$LEV0= 0
##$LPBIN= 0
##$MAXI= 10000
##$MC2= 0
##$MEAN= 0
##$ME_mod= 0
##$MI= 1.114404
##$NCOEF= 0
##$NC_proc= 0
##$NLEV= 6
##$NOISF1= 3.799351
##$NOISF2= 2.8
##$NSP= 1
##$NTH_PI= 0
##$NZP= 0
##$OFFSET= 15.70392
##$PC= 1
##$PHC0= -19113.61
##$PHC1= 13.20079
##$PH_mod= 1
##$PKNL= yes
##$PPARMOD= 0
##$PSCAL= 0
##$PSIGN= 0
##$REVERSE= no
##$SF= 200.130013532006
##$SI= 16384
##$SIGF1= 3
##$SIGF2= 2
##$SINO= 400
##$SIOLD= 16384
##$SREGLST= <1H.CDCl3>
##$SSB= 0
##$STSI= 0
##$STSR= 0
##$SW_p= 3612.71676300578
##$SYMM= 0
##$S_DEV= 0
##$TDeff= 0
##$TDoff= 0
##$TI= <>
##$TILT= no
##$TM1= 0
##$TM2= 0
##$TOPLEV= 0
##$USERP1= <user>
##$USERP2= <user>
##$USERP3= <user>
##$USERP4= <user>
##$USERP5= <user>
##$WDW= 1
##$XDIM= 8192
##$YMAX_p= 0
##$YMIN_p= 0
$$ End of Bruker specific parameters
$$ ---------------------------------
##NTUPLES= NMR FID
##VAR_NAME=  TIME,          FID/REAL,        FID/IMAG
##SYMBOL=    X,             R,               I
##VAR_TYPE=  INDEPENDENT,   DEPENDENT,       DEPENDENT
##VAR_FORM=  AFFN,          ASDF,            ASDF
##VAR_DIM=   8192,          8192,            8192
##UNITS=     SECONDS,       ARBITRARY UNITS, ARBITRARY UNITS
##FACTOR=    0.0002768,     1,               1
##FIRST=     0,             0,               0
##LAST=      2.2672688,     0,               0
##MIN=       0,             -154954,         0
##MAX=       2.2672688,     88003,           0
$$ Real data points
##PAGE= N=1
##DATA TABLE= (X++(R..R)), XYDATA
$$ plain form
0 0 0 0 0 0 0 0 0 0 0 0 0 0 0 8 -8 8 -8 9 -16 16 -24 24 -32 32 -40 48 -56 64 -72 86 -96 112 -127 143 -161
35 -161 182 -203 228 -255 285 -318 351 -391 433 -478 530 -586 643 -712 783 -863 949 -1047
53 -1047 1154 -1275 1411 -1565 1744 -1949 2189 -2480 2832 -3277 3852 -4631 5751 -7506 10667
68 10667 -18174 76547 -4198 -113850 57317 63369 946 3108 17708 -30063 5193 55024
80 55024 -8279 -53287 22396 9676 -33150 -9996 -15168 -9261 43753 2770 -54460 -2626 56314
93 56314 -2969 -39215 28597 19918 -33005 35965 43537 -37155 4101 49287 -25124 -42275 30817
106 30817 26628 -36837 -4943 24012 -42006 -15689 56198 -16958 -68724 -6408 21528 7556
118 7556 -68 -18824 -23996 12759 29386 -21535 -25638 24169 -8384 -21942 37431 4994 -37560
$$ packed form
0@%%%%%%%%%%%%%Qj6J6j6J7k5L2m0M8n6O4p2Q8j04J20j36J58j82K08k39K70l04
35a61L43l85M31m83N40o03O69p42Q24r11J008j116J229j355J495j646J812j996
53a047K201k429K686k976L309l693M138m669N312o109P129q483J0382j3257J8173
68A0667k8841R4721q0745j09652J71167O052o2423K162J4600m7771L5256M9831
80E5024o3303m5008P5683j2720m2826K3154n172N907N3014m0983n7230N1834N8940
93E6314n9283l6246O7812q679n2923O8970P572q0692M1256M5186p4411j7151P3092
106C0817m189o3465L1894K8955o6018K6317P1887p3156n1766O2316K7936j3972
118G556p624j8756n172L6755J6627n0921m103M9807l2553j3558N9373l2437m2554
$$ plain form
131 -37560 22290 28146 -41576 -25264 43110 6557 -51876 7919 35475 -26112 -10316 19001
143 19001 -15415 -5805 13178 -17080 -12715 28446 17823 -27166 -7256 23563 -7030 -2021 17953
156 17953 -25895 -14452 37274 4072 -24301 11436 13434 -21852 -5834 28059 -6476 -20167
168 -20167 25433 2690 -21638 32095 21412 -33436 -4957 29912 1828 -12952 15109 8346
180 8346 -17823 12253 17371 -23068 -1148 15239 -18892 -3827 18565 -10739 -14490 17700 8569
193 8569 -26361 -3637 23874 -11359 -7168 22598 -12990 -14944 32364 11840 -25108 -2381 17025
206 17025 -2389 -4498 15429 -5865 -16771 20271 3546 -25923 8948 9755 -24107 -8080 12008
219 12008 -4811 -11009 5348 -5023 -20794 11567 14002 -25297 -2204 20706 -11260 -4713 19546
$$ packed form
131c7560N9850N856o9722J6312O8374l6553n8433N9795K7556o1587J5796K9317
143A9001l4416R610J8983l0258M365M1161j0623m4989J9910L0819l0593N009J9974
156A7953m3848J1443N1726l3202k8373L5737J998l5286J6018L3893l4535j3691
168b0167M5600k2743k4328N3733j0683n4848K8479L4869k8084j4780K8061o763
180H346k6169L0076N118m0439K1920J6387l4131J5065K2392k9304l751L2190r131
193H569l4930K2724K7511l5233M191K9766l5588j954M7308k0524l6948K2727J9406
206A7025j9414k109J9927k1294j0906L7042j6725k9469L4871Q07l3862J6027K0088
219A2008j6819o198J6357j0371j5771L2361K435l9299K3093K2910l1966O547K4259
$$ plain form
232 19546 -1198 -11529 11474 11392 -14592 978 23098 -9579 -11192 19635 -5845 -16441 14207
245 14207 2468 -19289 -3260 7482 -7594 -6633 10689 -9560 -19456 17007 7227 -20825 7404
258 7404 12169 -11519 3546 16000 -2558 -5966 15026 7365 -14762 10468 20408 -15026 -2618
271 -2618 17975 -7992 -7069 11478 -3878 -13658 3958 7096 -14907 -6288 14255 -9987 -13588
284 -13588 13808 -3999 -12678 13341 4109 -11761 5331 13595 -4051 -4985 16232 2224 -13259
297 -13259 14814 9816 -16081 6410 11362 -12252 -2961 9408 -4882 -12108 5218 4092 -16453
310 -16453 -360 11339 -14459 -4990 12632 -9099 -6710 10807 -689 -8374 5635 9562 -8405
323 -8405 -3099 15831 -4217 -9111 15236 -632 -11707 10667 4644 -11265 379 8165 -5615
$$ packed form
232A9546k0744j0331K3003q2k5984J5570K2120l2677j613L0827k5480j0596L0648
245A4207j1739k1757J6029J0742j5076R61J7322k0249r896L6463r780k8052K8229
258G404M765k3688J5065J2454j8558l408K0992p661k2127K5230R940l5434J2408
271b618K0593k5967R23J8547j5356r780J7616L138k2003Q619K0543k4242l601
284a3588K7396j7807q679K6019r232j5870J7092Q264j7646r34K1217j4008j5483
297a3259K8073m998k5897K2491M952k3614R291J2369j4290p226J7326j126k0545
310a6453J6093J1699k5798R469J7622k1731K389J7517j1496p685J4009L927j7967
323h405N306J8930k0048m894K4347j5868j1075K2374o023j5909J1644P786j3780
$$ plain form
336 -5615 -8899 9655 1534 -14497 6960 6265 -14322 3484 9124 -10470 -2275 9038 -2018
349 -2018 -7821 6285 6508 -11262 1433 12316 -10641 -2461 13312 -7198 -7172 10809 805 -8786
363 -8786 2707 8009 -7018 -4379 12792 -3092 -9351 12731 1147 -10950 8269 5204 -8224
376 -8224 -417 6918 -3618 -7311 7247 1792 -12425 5017 5621 -13514 1947 8494 -9024 -3551
390 -3551 7717 -91 -6595 4627 6870 -7689 1749 12807 -7129 -2993 13752 -1970 -5719
403 -5719 7814 1626 -6096 1711 5571 -7605 -6591 9432 -3380 -12402 6040 -532 -10489 4012
417 4012 1230 -8844 291 7602 -1793 -6873 7140 5872 -6635 6591 7394 -8381 5336 12126
431 12126 -4993 -3442 7064 2947 -5000 -122 2631 -7855 -491 6976 -11498 -7776 8645 -4024
$$ packed form
336e615l284J8554q121j6031K1457o95k0587J7806N640j9594Q195J1313j1056
349b018n803J4106K23j7770J2695J0883k2957Q180J5773k0510K6J7981j0004r591
363h786J1493N302j5027K639J7171j5884o259K2082j1584j2097J9219l065j3428
376h224P807P335j0536l693J4558n455j4217J7442O04j9135J5461O547j7518N473
390c551J1268p808o504J1222K243j4559R438J1058j9936M136J6745j5722l749
403e719J3533o188p722P807L860j3176J014J6023j2812r022J8442o572r957J4501
417D012k782j0074R135P311r395n080J4013j268j2507J3226Q03j5775J3717O790
431A2126j7119J551J0506m117p947M878K753j0486P364P467j8474L722J6421j2669
$$ plain form
445 -4024 -8897 2246 -1035 -5354 2278 5728 -6005 -4192 13157 2893 -8092 7181 5287 -2386
459 -2386 7460 3164 -5336 3157 8697 -2087 -8416 4513 3740 -9682 1194 2863 -11677 -297
473 -297 6950 -8015 -7312 3376 1927 -5358 -375 4354 -3897 1265 9399 -5327 -2384 11443 -429
488 -429 -4751 6685 4221 -3387 765 6911 -2124 -6392 6251 345 -8517 3676 448 -7214 2726
503 2726 773 -6554 -1222 3509 -2251 -5990 5115 3751 -9144 3762 9396 -7115 -2192 7712
517 7712 -701 -1850 2757 1782 -2432 1578 5484 -4389 -2834 6111 -3855 -2866 6966 -4415 -6311
532 -6311 6354 2952 -6364 -3420 5648 402 -5726 3544 275 -5158 6747 1750 -8170 2327
546 2327 4511 -3078 -1743 2028 -182 -2645 5266 2707 -9946 2463 10023 -5684 -5018 4306 1541
$$ packed form
445d024m873J1143l281m319P632L450j1733J813J7349j0264j0985J5273j894p673
459b386R846m296q500Q493N540j0784o329J2929p73j3422J0876J669j4540J1380
473b97P247j4965P03J0688j449p285M983M729q251N162Q134j4726K943J3827j1872
488d29m322J1436k464p608M152O146r035m268J2643n906q862J2193l228p662R940
503B726j953p327N332M731n760l739J1105j364j2895J2906N634j6511M923R904
517G712q413j149M607r75m214M010L906r873J555Q945r966R89R832j1381j896
532f311J2665l402r316K944R068n246o128R270l269n433J1905m997r920J0497
546B327K184p589J335L771k210k463P911k559j2653J2409P560j5707O66R324k765
$$ plain form
561 1541 1484 950 -2073 -1805 3736 5321 -5917 -4105 6779 -2004 -2948 6321 -4388 -6623 5250
576 5250 2758 -6708 -5000 4809 1302 -5773 2524 1588 -5264 4866 2840 -5693 2701 4344 -861
591 -861 1149 3890 876 -2255 4654 4768 -7284 -188 7215 -4583 -3256 3161 -2310 -1796 5
606 5 -3267 -4941 195 3788 -5614 -5757 6112 -314 -2937 5080 -1648 -3856 5485 5537 -1091 -1804 4958
623 4958 4104 -2131 3725 1893 -4228 3547 1604 -5419 1424 1222 -4777 -2233 1292 -1937 -6841 -274
639 -274 3398 -5929 -2015 4528 -4408 -118 5695 -1422 -2081 3397 3679 402 1567 5309 -800 -1255
655 -1255 7034 0 -3499 4290 -1257 -4677 2521 1466 -3836 -4282 0 -531 -4462 1301 -824 -6865
671 -6865 2845 3216 -4692 871 3297 -1423 -156 3432 2615 -1956 2037 5950 -2228 244 5471 -2831
$$ packed form
561A541n7n34l023K68N541J585j1238J812J0884q783r44R269j0709k235J1873
576E250k492r466J708R809l507p075Q297r36o852J0130k026q533Q394J643n205
591h61K010K741l014l131O909J14j2052P096P403j1798J327O417n471N14J801
606El272j674N136L593r402j43J1869o426k623Q017o728k208R341N2o628p13O762
623D958q54o235N856j832o121P775j943p023O843k02n999K544L525l229m904O567
639b74L672r327L914O543q936M290N813p117o59N478K82l277J165L742o109m55
655a255Q289p034l499P789n547l420P198j055n302m46M282n31l931N763k125o041
671f865R710L71p908N563K426m720J267L588q17m571L993L913q178K472N227q302
$$ plain form
687 -2831 -961 4205 -1879 -3168 393 1294 -1733 -2227 242 -3406 -3170 4843 -1982 -5981 2862 605
703 605 -2324 2325 1405 -2183 -1441 3273 2090 -2296 3031 2164 -3803 3206 4277 -3449 -341 1679
719 1679 -884 -636 786 616 -2754 -9 3225 -3753 -1553 3993 -2638 -1602 2609 -1320 -1526 1285
735 1285 1008 -1232 -1300 2571 -1947 -2519 4751 -370 -4669 2742 1096 -1295 1479 -110 -2120 -881
751 -881 3638 1790 -3659 1315 2818 -2734 2579 2949 -3410 80 2256 -933 -529 664 1005 -3568
767 -3568 -996 3012 -3310 -2091 2787 -3084 -1950 2463 -1473 -1674 931 1282 -1179 -1143 3470 879
783 879 -1753 4674 750 -2561 3671 2001 -1343 1244 695 -791 -1001 1624 823 -4862 -442 1242
799 1242 -4268 -339 833 -4517 -553 1266 -1202 -1180 322 1541 -1225 -112 4472 -798 150 4962
$$ packed form
687b831J870N166o084j289L561R01l027m94K469l648K36Q013o825l999Q843k257
703F05k929M649r20l588P42M714j183m386N327q67n967P009J071p726L108K020
719A679k563K48J422j70l370K745L234o978K200N546o631J036M211l929k06K811
735A285k77k240o8L871m518n72P270n121m299P411j646k391K774j589k010J239
751h81M519j848n449M974J503n552N313L70o359L490K176l189M04J193L41m573
767c568K572M008o322J219M878n871J134M413l936k01K605L51k461L6M613k591
783H79k632O427l924l311O232j670l344K587n49j486k10K625q01n685M420J684
799A242n510L929J172n350L964J819k468K2J502J219k766J113M584n270R48M812
$$ plain form
815 4962 -698 76 4313 327 -550 1165 1277 -360 -1894 1714 -949 -3865 1148 -1361 -4886 991
831 991 -959 -3737 -367 -334 -856 -935 1008 1292 -2192 1773 3480 -1727 2170 3597 -1296 1752 2990
848 2990 507 140 506 1549 -1205 -1154 1962 -2615 -2605 2197 -2732 -3183 1358 -1844 -2105 -360 -116
865 -116 -569 -1585 1927 600 -2091 3058 1481 -1702 3189 1914 -948 1987 1466 625 -241 948
881 948 1386 -2351 336 1955 -3454 -298 1604 -2930 -780 727 -1303 -1378 -617 686 -1261 -1327 3004
898 3004 -827 -1660 3070 -330 -692 2548 -300 -254 949 1129 -190 -1509 1872 435 -2517 1935
914 1935 348 -2909 1767 885 -2381 -92 516 -114 -937 12 1148 -1903 335 2230 -3046 -245
930 -245 2470 -1703 -524 912 -387 -402 -196 784 -1182 -1373 2841 -573 -2062 2144 -374 -339 2335
$$ packed form
815D962n660P74M237l986q77J715J12j637j534L608k663k916N013k509l525N877
831I91j950k778L370L3n22p9J943K84l484L965J707n207L897J427m893L048J238
848B990k483l67L66J043k754N1L116m577J0M802m929m51M541l202k61J745K44
865a16m53j016L512j327k691N149j577l183M891j275k862K935n21q41q66J189
881I48M38l737K687J619n409L156J902m534K150J507k030p5P61J303j947o6M331
898C004l831q33M730l400l62L240k848M6J203J80j319j319L381j437k952M452
914A935j587l257M676q82l266K289O08o30q23R49J136l051K238J895n276K801
930b45K715m173J179J436j299j5K06R80j966j91M214l414j489M206k518L5K674
$$ plain form
947 2335 -587 -584 1123 1085 46 -1171 1861 1025 -2438 1635 432 -2909 1123 535 -2086 -805 -327
964 -327 -92 -887 -1001 335 -1850 217 1798 -2382 536 2519 -1083 373 1883 691 762 569 2232
981 2232 290 -819 3018 63 -1476 2008 -972 -1636 1120 -1331 -1712 -942 -436 -893 -2530 539
997 539 160 -3263 763 1044 -1839 988 1083 -63 1207 795 1279 910 944 1827 -469 1323 2968 -1744
1015 -1744 83 2149 -1626 -775 137 -1179 -1847 -1876 209 -977 -2541 485 -1185 -1713 1493 -949
1031 -949 -1059 1843 371 258 1187 1380 1450 -63 2149 1846 -1588 2047 2042 -1552 765 118 -1193 323
1049 323 -926 -657 -1177 -1356 -77 -2584 -1137 1042 -2596 -517 1555 -1284 -325 1111 495 381 -8
1066 -8 2167 1552 -701 2090 545 -351 2515 -559 -1104 1862 -168 -672 -463 -269 11 -1624 167
$$ packed form
947B335k922LJ707l8j039j217L032q36l463M073j203l341M032n88k621J281M78
964c27K35p95j14J336k185K067J581m180K918J983l602J456J510j192P1j93J663
981B232j942j109L837k955j539L484k980o64K756k451l81P70N06m57j637L069
997E39l79l423M026K81k883K827R5j146J270m12M84l69L4Q83k296J792J645m712
1015a744J827K066l775Q51R12j316o68k9K085j186j564L026j670n28L206k442
1031i49j10K902j472j13R29J93P0j513K212l03l434L635nl594K317o47j311J516
1049C23j249K69n20j79J279k507J447K179l638K079K072k839R59J436o16j14l89
1066hK175o15k253K791j545q96K866l074n45K966k030n04K09J94K80j635J791
$$ plain form
1083 167 471 -3187 383 1503 -2088 -103 295 -755 758 69 222 74 309 1890 -608 -116 2353
1100 2353 -1548 -212 2351 -1117 -87 599 -116 322 -444 622 152 -1236 1242 -50 -1426 1728
1116 1728 -381 -1233 1267 -154 -514 -134 110 615 -1454 21 1278 -2131 522 1281 -1582 336
1132 336 181 -1039 579 -254 283 -210 -210 1800 -801 -369 1785 -783 50 2099 -697 -154 739 -185
1150 -185 388 -407 488 -312 -2067 816 -593 -2063 592 -796 -1876 666 -487 -194 34 -40 1061
1167 1061 -243 681 1381 -1079 1268 2145 -1020 1156 1060 -404 964 229 283 -370 -748 652 -1423
1184 -1423 -1363 747 -1950 -1281 637 -1673 -909 -164 -638 134 -101 712 413 -991 2233 925 -642
1201 -642 2130 1135 -21 1839 238 370 596 -143 699 -1108 -236 185 -2253 -563 446 -2510 -579
$$ packed form
1083A67L04l658L570J120l591J985L98j050J513o89J53j48K35J581k498M92K469
1100B353l901J336K563l468J030O86p15M38p66J066m70j388K478j292j376L154
1116A728k109q52K500j421l60L80K44N05k069J475J257l409K653P59k863J918
1132C36j55j220J618q33N37m93%K010k601M32K154k568Q33K049k796N43Q93r24
1150a85N73p95Q95q00j755K883j409j470K655j388j080K542j153K93K28p4J101
1167A061j304R24P00k460K347Q77l165K176r6j464J368p35N4o53l78J400k075
1184a423O0K110k697O69J918k310P64P45m74P72k35Q13k99j404L224j308j567
1201f42K772r95j156J860j601J32K26p39Q42j807Q72M21k438J690J009k956J931
$$ plain form
1218 -579 -220 -1706 -475 -614 -134 -441 -630 1470 107 -309 1904 220 265 2438 2 635 1205 707
1236 707 771 -115 860 358 -1529 648 -138 -2001 139 -844 -1509 1 -1008 -928 -499 -762 329 -950
1254 -950 -222 796 -1061 1002 1577 -578 872 1248 50 1006 557 590 184 -582 1434 -427 -1179 944
1272 944 -943 -743 727 -895 -831 -349 -535 -8 -887 -41 42 -1234 907 531 -1161 1190 186 -829
1290 -829 1110 360 1 -36 160 1058 -524 -137 950 -1074 234 1171 -1431 130 391 -351 98 -192
1308 -192 219 417 -333 1145 -204 -935 1336 -852 -504 1073 -943 -256 -31 -268 272 -473 82 406
1326 406 -1224 695 449 -980 836 358 -226 1082 -4 284 601 156 1146 -150 -180 1080 -821
1343 -821 418 1104 -1250 -57 94 -996 -206 -552 -541 -506 -1210 406 -500 -1237 1076 -69 -296 1395
$$ packed form
1218e79L59j486J231j39M80l07j89K100j363m16K213j684M5K173k436O33N70m98
1236G07O4q86R75n02j887K177p86j863K140r83o65J510j009Q0M29k63J091j279
1254i50P28J018j857K063N75k155J450L76j198R56m49L3m06p66K016j861p52K123
1272I44j887K00J470j622O4M82j86N27q79Q46Q3j276K141l76j692K351j004j015
1290h29J939p50l59l7J96Q98j582L87J087k024J308R37k602J561K61p42M49k90
1308a92M11J98p50J478j349p31K271k188L48J577k016O87K25k37N40p45N55L24
1326D06j630J919k46j429J816m78n84J308j086K88L17m45R90j296l0J260j901
1343h21J239O86k354J193J51j090P90l46J1L5p04J616r06p37K313j145k27J691
$$ plain form
1361 1395 -222 110 842 456 836 270 444 1119 -439 1065 915 -1271 766 182 -837 270 -514
1378 -514 -1042 -584 -990 -149 -1254 -1181 442 -1041 -147 1083 -800 13 889 -186 865 1101 669 865
1396 865 -11 1669 763 -77 1594 -5 -410 1072 -570 -614 -231 -836 -600 -1369 -917 -325 -1378 -226
1414 -226 46 -1685 286 65 -711 725 95 309 878 243 1429 536 469 1778 -74 144 837 -703
1432 -703 281 580 -714 127 -675 -607 -548 -1175 -21 -554 -1445 522 -566 -1102 818 -319 -134 180 90
1451 90 1154 158 636 1054 -249 831 840 -607 728 737 -559 482 361 -217 -213 -795 147 -651 -707 533
1471 533 -922 -639 243 -896 78 360 -602 88 -171 378 306 -425 900 371 -555 1004 137 -551 753
1490 753 -419 -24 330 -294 404 58 10 457 -601 569 365 -1069 318 519 -822 506 -50 -351
$$ packed form
1361A395j617L32P32l86L80n66J74O75j558J504j50k186K037n84j019J107p84
1378e14n28M58m06Q41j105P3J623j483Q94J230j883Q13Q76j075J051K36m32J96
1396H65q76J680r06q40J671j599m05J482j642m4L83o05K36p69M52N92j053J152
1414b26K72j731J971k21p76J436o30K14N69o35J186q93o7J309j852K18O93j540
1432g03R84K99j294Q41q02O8N9o27J154n33q91J967j088n36J920j137J85L14r0
1451I0J064r96M78M18j303J080Rj447J335Rj296J041j21n78Mn82R42p98n6J240
1471E33j455K83Q82j139R74K82r62O90k59N49p2p31J325n29r26J559q67o88J304
1490G53j172L95L54o24O98l46m8M47j058J170k04j434J387K01j341J328n56l01
$$ plain form
1508 -351 -52 -471 527 -117 -471 881 -318 -748 541 -893 -2 324 -467 161 -102 255 182 -197 698
1527 698 448 -283 1040 318 -346 841 -100 83 227 -170 242 -171 -383 373 -1245 -176 126 -1123
1545 -1123 -73 -133 -1045 92 -155 -118 137 -354 703 40 -124 1128 -98 6 1189 -60 568 874
1563 874 -133 632 -49 -249 228 -843 -136 -166 -1336 185 -350 -1250 -168 -1065 -639 -224 -353 116 -209
1582 -209 118 888 -448 200 1320 -148 1075 983 -56 1008 364 523 445 -527 301 -27 -686 358
1600 358 -988 -1032 31 -1139 -909 -62 -868 -114 -298 -512 205 -685 685 586 -365 1052 888 -42 935
1619 935 496 696 1157 27 744 0 -57 851 -525 34 471 -905 -402 -111 -1066 -151 -699 -817 -215
1638 -215 -705 309 172 -367 978 -207 -166 1182 -147 262 792 280 558 7 4 900 -301 300 409
$$ packed form
1508c51K99m19R98o44l54J352j199m30J289j434Q91L26p91O28k63L57p3l79Q95
1527F98k50p31J323p22o64J187r41J83J44l97M12m13k12P56j618J069L02j249
1545a123J050o0r12J137k47L7K55m91J057o63j64J252j226J04J183j249O28L06
1563H74j007P65o81k00M77j071P07l0j170J521n35r00J082q97M26M15j29M69l25
1582b09L27P70j336O48J120j468J223r2j039J064o44J59p8r72Q28l28o59J044
1600C58j346m4J063j170K30Q47q06P54j84k14P17q90J370r9r51J417j64r30R77
1619I35m39K00M61j130P17p44n7R08j376N59M37j376N03K91r55R15n48j18O02
1638b15m90J014j37n39J345j185M1J348j329M09N30n12K78n51lQ96j201O01J09
$$ plain form
1657 409 -639 374 53 -592 235 -527 -425 34 -610 215 -145 -545 215 -743 -219 719 -435 153 599
1676 599 -121 678 313 -62 425 -340 531 109 -256 480 -386 -467 791 -106 -192 313 -101 170 -135 13
1696 13 620 -113 299 285 -516 423 10 -765 332 -161 -709 131 -411 20 -300 -519 717 -652 -391 634
1716 634 -324 97 256 -116 399 286 122 460 -349 478 383 -261 624 58 -329 521 -437 -489 200 -958
1736 -958 -150 -533 -497 -242 -745 -155 56 -769 221 331 -340 493 202 77 689 424 809 418 -37 905
1756 905 -83 157 983 -388 233 74 -706 78 -267 -623 -330 -883 -485 -570 -1014 158 -377 -651 327 -356
1776 -356 38 608 116 410 546 700 1117 -11 598 924 -257 621 339 -613 217 -256 -612 -405 -899
1795 -899 -458 -409 -695 -139 -814 -734 -30 -694 -107 383 -384 207 162 197 772 130 1037 858 -286 1131 291
$$ packed form
1657D09j048J013l21o45Q27p62J02M59o44Q25l60m00P60r58N24R38j154N88M46
1676E99p20P99l65l75M87p65Q71m22l65P36q66q1J258q97q6N05m14K71l05J48
1696A3O07p33M12j4q01R39m13p75J097m93n48Q40n42M31l20k19J236j369K61J025
1716F34r58M21J59l72N15j13j64L38q09Q27r5o44Q85n66l87Q50r58n2O89j158
1736i58Q08l83L6K55n03N90K11q25R90J10o71Q33k91j25O12k65L85l91m55R42
1756I05r88K40Q26j371O21j59p80P84l45l56K93n53L98q5m44J172n35k74R78o83
1776c56L94N70m92K94J36J54M17j128O09L26j181Q78k82r52Q30m73l56K07m94
1795h99M41M9k86N56o75Q0P04o64N87M90p67N91m5L5N75o42R07j79j144J417q40
$$ plain form
1816 291 -195 703 8 -102 101 -489 51 -518 -613 133 -691 -183 -85 -1031 -165 125 -948 -4 -132 -145 437
1837 437 -2 267 418 178 1016 113 173 1048 -131 210 623 -466 292 -190 -368 125 -445 -177 -75 -717
1857 -717 482 -55 -627 389 -473 -159 82 -688 86 -95 -7 196 -100 220 462 -434 482 263 -553 245
1877 245 66 -288 260 -46 214 303 -256 434 -362 -480 873 -250 -143 575 -511 86 149 -417 130 -322
1897 -322 82 123 -634 93 -67 -595 260 -248 -320 106 -288 177 206 -92 498 -66 398 675 -37 369 435
1918 435 -328 566 133 131 39 -302 79 268 -460 176 -490 -563 20 -711 -535 -52 -813 -253 -278 -521 288 -316
1940 -316 317 305 -14 603 448 -216 913 560 234 557 -115 363 36 -289 90 -441 -425 70 -672 -302
1960 -302 -120 -907 -39 -162 -585 -147 -597 -17 195 -311 438 7 -33 992 -57 310 729 287 697 449
$$ packed form
1816B91m86Q98o95j10K03n90N40n69r5P46q24N08R8r46Q66K90j073R44j28j3N82
1837D37m39K69J51k40Q38r03O0Q75j179L41M13j089P58m82j78M93n70K68J02o42
1857g17J199n37n72J016q62L14K41p70P74j81Q8K03k96L20K42q96R16k19q16P98
1877B45j79l54N48l06K60Q9n59O90p96j18J353j123J07P18j086N97O3n66N47m52
1897c22M04M1p57P27j60n28Q55n08p2M26l94M65K9k98N90n64M64K77p12M06O6
1918D35p63Q94m33kr2l41L81J89p28O36o66p3N83p31J76M83p61N60k5k43Q09o04
1940c16O33j2l19O17j55o64J129l53l26L23o72M78l27l25L79n31J6M95p42L70
1960c02J82p87Q68j23m23M38m50N80K12n06P49m31m0J025j049L67M19m42M10k48
$$ plain form
1980 449 146 1142 -14 -116 334 -738 273 -345 -897 68 -252 -989 10 -545 -286 -177 -536 163 -261
1999 -261 -300 631 -228 438 838 48 716 501 54 690 192 283 333 -157 303 -150 -609 271 -391 -421 -24
2020 -24 -636 -13 -34 -353 -57 -446 -153 345 -310 391 465 -361 461 48 -64 644 43 478 270 -84 657
2041 657 -235 -62 414 -347 -43 -7 -545 262 -146 -387 32 -543 21 -30 -495 139 -116 -349 160 -135 -88
2062 -88 580 -238 230 -115 -220 236 0 24 164 -342 158 320 -445 289 -27 39 229 -165 157 157 -521 474
2084 474 13 -128 398 -291 146 295 -483 163 -135 -537 -109 -366 -275 14 -512 376 -159 -380 591 -224
2104 -224 -119 311 -100 319 367 144 649 188 296 610 -385 429 203 -763 347 -206 -288 295 -492 -91
2124 -91 -165 -367 34 -369 -628 -5 -537 -144 166 -136 690 318 25 775 67 194 411 4 520 402 -220
$$ packed form
1980D49l03R96j156j02M50j072J011o18n52R65l20p37R99n55K59J09l59O99m24
1999b61l9R31q59O66M00p90O68k15m47O36m98R1N0m90M60m53m59Q80o62l0L97
2020b4o12O23k1l19K96l89K93M98o55P01P4q26Q22m13j12P08o01M35k08l54P41
2041F57q92J73M76p61L04L6n38Q07m08k41M19n75N64n1m65O34k55k33N09k95M7
2062h8O68q18M68l45j05M56k36K4J40n06N00J62p65P34l16O6J90l94L22%o78R95
2084D74m61j41N26o89M37J49p78O46k98m02M28k57R1K89n26Q88n35k21R71q15
2104b24J05M30m11M19M8k23N05m61J08L14r95Q14k26r66J110n53q2N83p87M01
2124i1p4k02M01m03k59O23n32L93L10l02Q26l72k93P50p08J27K17m07N16j18o22
$$ plain form
2145 -220 419 -79 -32 158 -530 -69 -302 -529 64 -447 -202 -261 -742 -170 -55 -718 -39 -77 -239 277 -217
2166 -217 388 331 -61 531 248 139 697 -66 397 381 -333 86 32 -457 -39 -543 -113 -313 -657 -174 -417
2187 -417 -487 61 -38 -488 197 -189 214 519 17 339 130 176 634 -30 335 595 -176 459 62 -260 420
2208 420 -458 -295 -120 -522 129 -336 -501 -12 -697 -322 97 -659 -22 -87 -125 134 116 337 429 -146 519
2229 519 463 -175 452 -137 -108 473 -311 300 39 -359 221 -111 -63 302 -329 -20 223 -356 -97 -123 -303
2250 -303 358 -148 118 133 -373 406 -37 -290 302 -157 6 309 -274 228 -63 -101 304 -98 12 435 -298
2271 -298 398 407 -319 419 -121 -78 399 -69 30 2 -138 68 -42 56 155 -543 53 97 -616 278 -35 -587 292
2294 292 -123 -427 64 -231 306 15 -175 567 185 84 415 -384 310 156 -151 219 -17 -159 140 -404
$$ packed form
2145b20O39m98M7J90o88M61k33k27N93n11K45n9m81N72J15o63O79l8j62N16m94
2166b17O05n7l92N92k83j09N58p63M63j6p14M19n4m89M18n04M30k00l44M83k43
2187d17p0N48r9m50O85l86M03L05n02L22k09M6M58o64L65K60p71O35l97l22O80
2208D20q78J63J75m02O51m65j65M89o85L75M19p56O37o5l8K59j8K21R2n75O65
2229E19n6o38O27n89K9N81p84O11k61l98N80l32M8L65o31L09K43n79K59k6j80
2250c03O61n06K66J5n06P79m43k53N92m59J63L03n83N02k91l8M05m02J10M23p33
2271b98O96Rp26P38n40M3M77m68R9k8j40K06j10R8R9o98N96M4p13Q94l13n52Q79
2294B92m15l04M91k95N37k91j90P42l82j01L31p99O94j54l07L70k36j42K99n44
$$ plain form
2314 -404 43 -21 -592 -28 -327 -472 -13 -550 -38 -203 -365 325 -211 -110 48 -173 202 543 174 493
2334 493 236 190 370 42 145 268 -221 107 -299 -139 146 -307 -342 86 -451 -263 -283 -611 30 -173 -303
2355 -303 248 -29 424 275 18 594 268 -3 697 244 357 393 32 562 -161 134 149 -415 -233 120 -455
2376 -455 -48 -344 -483 -95 -440 -299 -56 -281 73 45 -346 136 -88 29 664 41 568 722 128 607
2396 607 194 166 507 -276 169 162 -370 288 -264 -330 295 -528 41 -299 -439 94 147 -348 370 -495 136 388
2418 388 -1 213 280 -68 438 -95 115 419 -151 178 286 7 241 -284 33 250 -449 -163 142 -294
2438 -294 -65 -400 -49 238 -364 6 -115 -383 320 29 -225 258 -206 -19 279 -129 67 -40 -225 254
2458 254 -186 32 67 -289 -81 81 -180 368 -320 -155 290 -123 155 52 -163 226 -450 -250 161 -260
$$ packed form
2314d04M47o4n71N64k99j45M59n37N12j65j62O90n36J01J58k21L75L41l69L19
2334D93k57m6J80l28J03J23m89L28m06J60K85m53l5M28n37J88k0l28O41k03j30
2355c03N51k77M53j49k57N76l26k71P00m53J13L6l61N30p23K95J5n64J82L53n75
2376d55M07k96j39L88l45J41K43k25L54k8l91M82k24J17O35o23N27J54n94M79
2396F07m13k8L41p83M45pn32O58n52o6O25q23N69l40j40N33N3m95P18q65O31K52
2418C88l89K14O7l48N06n33K10L04n70L29J08k79K34n25L17K17o99K86L05m36
2438b94K29l35L51K87o02L70j21k68P03k91k54M83m64J87K98m08J96j07j85M79
2458B54m40K18L5l56K08J62k61N48o88J65M45m13K78j03k15L89o76K00M11m21
$$ plain form
2478 -260 -25 108 -671 131 -301 -288 266 -427 156 -110 -1 191 40 27 118 153 264 331 -45 395 197 -41
2500 -41 443 -18 -146 350 -209 227 199 -593 154 -147 -231 222 -375 -196 -139 -546 44 -178 -189 238 -254 179
2522 179 217 -127 349 78 -145 594 25 353 307 75 312 90 -322 235 66 -353 -150 -604 -168 31 -547
2543 -547 -15 -332 -329 11 -526 288 -9 -331 360 103 -210 680 156 328 70 -7 412 441 -34 383 -105
2564 -105 -51 38 -86 -60 -283 -186 -155 -380 -169 -45 -460 106 11 -193 -62 -92 3 142 56 401 93 -181 187
2587 187 185 226 414 37 335 113 -384 -4 -179 -126 81 -411 -159 -40 -357 189 5 -335 409 -82 -127 126
2609 126 -313 4 -76 -3 236 85 192 225 -215 229 75 -21 187 -106 -15 220 -162 156 -101 -315 259 -103
2631 -103 -140 285 -235 36 8 -590 -85 -302 -150 -30 -150 337 191 -299 178 70 -309 15 -109 43 -63
$$ packed form
2478b60K35J33p79Q02m32J3N54o93N83k66J09J92j51j3R1L5J11O7l76M40j98k38
2500d1M84m61j28M96n59M36k8p92P47l01q4M53n97J79N7m07N90k22j1M27m92M33
2522A79L8l44M76k71k23P39n69L28m6k32K37k22m12N57j69m19K03m54M36J99n78
2543e47N32l17LL40n37Q14k97l22O91k57l13Q90n24J72k58p7M19K9m75M17m88
2564a05N4Q9j24K6k23R7L1k25K11J24m15N66r5k04J31l0R5J39q6L45l08k74L68
2587A87kM1J88l77K98k22m97L80j75N3K07m92K52J19l17N46j84l40P44m91m5K53
2609A26m39L17q0P3K39j51J07L3m40M44j54r6K08k93R1K35l82L18k57k14N74l62
2631a03l7M25n20K71k8n98N05k17J52J20j20M87j46m90M77j08l79L24j24J52j06
$$ plain form
2652 -63 -337 58 -19 -49 317 1 -17 440 -121 217 -100 -200 316 -283 -208 218 -141 54 112 -188 74 -119
2674 -119 -219 -259 -191 95 185 -157 -125 -98 -86 60 -156 124 461 120 243 -1 56 136 -87 198 79 -169 317
2697 317 -131 -203 -16 -198 -208 116 -351 -164 37 -499 -363 -333 -367 271 -199 47 200 -110 357 78 74 425
2719 425 -6 342 312 97 371 375 86 125 46 40 326 -403 -9 125 2 115 -498 -297 -31 -339 -59 -259
2741 -259 -237 133 3 -262 216 -113 350 182 117 461 113 208 396 -93 180 190 -39 337 -84 -371 73
2762 73 -486 -17 44 -676 -65 -198 -234 -84 -187 255 208 -216 271 355 -24 217 295 338 580 -259 256 399
2784 399 -124 418 -79 180 -94 -107 147 -234 -365 56 -56 -34 -199 -120 -75 -29 -162 109 -120 46 139 154
2806 154 -149 146 229 -157 85 -59 126 -76 -2 258 159 -4 -330 -141 169 -218 17 -121 -281 -88 -15
$$ packed form
2652f3k74L95p7l0L66l16j8M57n61L38l17j00N16n99P5M26l59J95N8l00K62j93
2674a19j00m0O8K86R0l42L2K7J2J46k16K80L37l41J23k44N7Q0k23K85j19k48M86
2697C17m48p2J87j82j0L24m67J87K01n36J36L0l4O38m70K46J53l10M67k79mL51
2719D25m31L48l0k15K74Mk89L9p9oK86p29L94J34j23J13o13K01K66l08K80k00
2741b59K2L70j30k65M78l29M63j68o5L44l48R5J88m89K73J0k29L76m21k87M44
2762G3n59M69O1p20O11j33l6J50j03M42m7m24M87Q4l79K41P8M3K42q39N15J43
2784C99n23N42m97K59k74j3K54l81j31M21j12K2j65P9M5M6j33K71k29J66R3J5
2806A54l03K95Q3l86K42j44J85k02P4K60r9j63l26J89L10l87K35j38j60J93P3
$$ plain form
2827 -15 -217 87 -126 -51 159 -216 94 -97 -86 51 113 -201 217 -126 20 182 -200 -30 67 20 179 -272
2849 -272 -53 -22 -1 94 233 101 304 -22 37 293 164 256 159 -333 33 -141 -103 41 -405 -28 -7 -368 -3
2872 -3 -374 -129 130 -134 135 61 -64 -78 347 83 633 29 352 178 104 419 97 -175 446 -203 -107 180
2894 180 -367 82 -18 -214 30 -116 -321 -195 -191 -235 -88 -184 37 -124 96 1 301 145 207 193 445 -215
2916 -215 100 346 -260 -33 173 36 5 94 -76 50 -240 -413 -166 -510 -161 -101 -338 70 -18 87 -13
2937 -13 -314 107 53 184 166 -35 299 377 1 493 220 89 213 132 -108 62 -173 99 -52 -293 -55 23
2959 23 33 -138 -144 -373 -6 24 232 -157 -128 144 -66 -114 235 -88 338 184 80 5 190 -120 132 -190 114
2982 114 217 31 359 -217 -195 117 -304 -155 -160 -76 96 -164 -292 -54 -250 168 243 -236 95 254 136 263
$$ packed form
2827a5k02L04k13P5K10l75L10j91J1J37O2l14M18l43J46J62l82J70R7m7J59m51
2849b72K19L1K1R5J39j32K03l26N9K56j29R2r7m92L66j74L8J44m46L77K1l61L65
2872cl71K45K59k64K69p4j25j4M25k64N50o04L23j74p4L15l22k72O21o49R6K87
2894A80n47M49j00j96K44j46k05J26Mm4J47r6K21j61K20r5L00j56O2j4K52o60
2916b15L15K46o06K27K06j37l1Q9j70J26k90j73K47l44L49O0k37M08q8J05j00
2937a3l01M21n4J31j8k01L34P8l76M92k73j31J24q1k40J70k35K72j51k41K38P8
2959B3J0j71ok29L67L0K08l89K9K72k10m8L49l23M26j54j04p5J85l10K52l22L04
2982A14J03j86L28n76K2L12m21J49nQ4J72k60j28K38j96M18P5m79L31J59j18J27
$$ plain form
3004 263 100 80 96 95 271 162 -90 -41 -130 -221 181 -252 160 -11 -366 102 -140 -29 224 -38 193 98 34
3027 34 68 -31 148 203 -374 -256 184 -27 -57 -148 -15 178 -348 46 202 -50 35 -75 -52 208 133 -14 36
3050 36 -92 188 -92 -58 233 -107 -5 -155 -238 -83 -267 -402 133 -139 -302 -15 -44 -118 110 -14 -270 24
3072 24 62 28 -106 -174 89 -347 145 32 137 171 -110 57 14 202 -39 -76 -215 226 -206 109 80 -455 -57
3095 -57 -316 -304 38 -30 -235 89 -294 333 -82 -33 214 114 212 403 105 59 387 -58 137 -251 -80 232
3117 232 -446 45 -108 -276 91 -259 -315 -314 -116 -111 -243 -362 -469 123 -53 352 163 205 330 111 8 163
3139 163 179 496 143 -178 125 27 243 67 -168 194 -305 -231 -140 -406 -137 -191 -124 41 -128 -115 -52 -166 60
3162 60 201 -87 414 87 206 448 3 59 112 125 215 165 -139 285 -191 -125 1 -273 263 39 -263 114
$$ packed form
3004B63j63k0J6jJ76j09k52M9q9r1M02m33M12j71l55M68k42J11K53k62K31r5o4
3027C4L4r9J79N5n77J18M40k11l0r1J33J93n26L94J56k52Q5j10K3K60p5j47N0
3050C6j28K80k80L4K91l40J02j50q3J55j84j35N35k72j63K87k9p4K28j24k56K94
3072B4L8l4j34o8K63m36M92j13J05L4k81J67m3J88k41l7j39M41m32L15k9n35L98
3095e7k59J2L42o8k05L24l83O27m15M9K47j00R8J91k98m6L28m45J95l88J71L12
3117B32o78M91j53j68L67l50n6JJ98Nj32j19j07N92j76M05j89M2J25k19j03J55
3139A63J6L17l53l21L03r8K16j76k35L62m99P4R1k66K69n4O7J65j69J3O3j14K26
3162F0J41k88N01l27J19K42m45N6N3J3R0n0l04M24m76O6J26k74N36k24l02L77
$$ plain form
3184 114 -90 -203 -48 -306 -335 -170 19 81 -248 -36 -5 148 316 21 53 295 40 -23 44 -255 88 493
3206 493 -158 205 129 -74 137 2 10 -18 -372 62 -132 11 -6 -132 152 36 44 99 -43 -30 307 -162 -50
3229 -50 1 -102 -119 -84 6 240 160 82 40 -96 157 -131 -176 229 196 -162 -84 -280 150 278 -22 350 308 -367
3253 -367 -139 -137 42 119 -469 -236 -52 -254 -118 -55 10 81 -124 62 245 181 290 108 -35 384 75 25 425
3276 425 61 29 97 -58 -141 -151 -252 -67 -207 85 -124 -245 122 74 -169 202 84 192 137 -111 258 -184
3298 -184 -41 292 151 138 49 106 85 74 2 208 -21 -309 -25 -90 76 -346 -357 -33 -143 -185 -86 -402 65
3321 65 122 -316 -24 -57 27 222 81 74 124 131 276 -72 64 246 -86 96 208 -45 103 -208 -158 -17 -166
3344 -166 -38 -181 -380 11 11 -172 -17 118 217 -69 -48 136 115 -36 139 57 107 153 63 312 115 -98 64
$$ packed form
3184A14k04j13J55k58k9J65J89O2l29K12L1J53J68k95L2K42k55o3O7k99L43M05
3206D93o51L63p6k03K11j35Qk8l54M34j94J43j7j26K84j16QN5j42J3L37m69J12
3229e0N1j03j7L5R0K34q0p8m2j36K53k88m5M05l3l58P8j96M30J28l00L72m2o75
3253c67K28KJ79P7n88K33J84k02J36O3O5P1k05J86J83o4J09j82j43M19l09n0M00
3276D25l64l2O8j55q3j0j01J85j40K92k09j21L67m8k43L71j18J08n5k48L69m42
3298a84J43L33j41j3q9N7k1j1p2K06k29k88K84o5J66m22j1L24j10m2R9l16M67
3321F5N7m38K92l3Q4J95j41pN0PJ45l48J36J82l32J82J12k53J48l11N0J41j49
3344a66J28j43j99L91%j83J55J35R9k86K1J84k1j51J75q2N0M6r0K49j97k13J62
$$ plain form
3367 64 -55 -210 207 -231 55 56 -182 -31 -295 -122 150 -66 107 -14 -220 -107 -194 -120 -86 -138 202 2
3389 2 -199 210 -69 -64 370 -164 -199 221 -38 98 -78 -159 59 -76 276 232 -362 64 22 -81 222 38 -110
3412 -110 81 -26 114 12 -221 52 -431 286 107 30 258 201 -33 204 363 -321 84 -39 -117 57 -64
3433 -64 58 -32 -81 135 -185 234 -8 -73 136 117 124 382 -3 148 142 -97 -269 19 -131 114 -79 -47 -28 -13
3457 -13 -20 226 129 386 1 60 350 -239 96 233 29 264 -19 -276 124 -63 357 124 -127 -354 -112 -308
3479 -308 -55 -186 -115 -2 -216 282 -293 36 -94 -38 -21 79 -11 254 112 -260 1 37 118 338 -73 112
3501 112 244 -403 184 -77 99 37 -240 -57 -165 -394 74 -138 -312 -14 -89 99 -3 -80 255 192 -165
3522 -165 414 236 312 444 -58 111 -20 -166 432 -95 -59 -172 -137 166 -178 -421 151 -116 -321 -17 -126
$$ packed form
3367F4j19j55M17m38K86Jk38J51k64J73K72k16J73j21k06J13q7P4L4n2L40k00
3389Bk01M09k79NM34n34l5M20k59J36j76q1K18j35L52m4n94M26m2j03L03j84j48
3412a10J91j07J40j02k33K73m83P17j79p7K28n7k34K37J59o84M05j23p8J74j21
3433f4J22r0m9K16l20M19k42o5K09j9PK58l85J51ok39j72K88j50K45j93L2J9J5
3457a3pK46r7K57l85N9K90n89L35J37k04K35k83k57M00j87M20k33k51k27K42j96
3479c08K53j31P1J13k14M98n75L29j30N6J7J00r0K65j42l72K61L6Q1K20m11J85
3501A12J32o47N87k61J76o2k77J83j08k29M68k12j74K98p5J88j02p7L35o3l57
3522a65N79j78P6J32n02J69j31j46N98n27L6j13L5L03l44k43N72k67k05L04j09
$$ plain form
3543 -126 -207 -260 -219 -147 111 50 29 -20 42 262 -382 136 68 28 94 -62 294 -124 -4 56 -32 -20 -151 223 82
3568 82 -51 -131 112 255 -60 123 -118 -273 192 -126 13 -27 -199 -185 74 8 233 27 -122 40 -162 -38
3590 -38 -102 -124 -31 -158 -91 198 229 188 70 -272 142 -242 165 -38 -67 237 -72 -80 -57 9 9 77 -504 22 -216
3615 -216 -57 -11 -113 -13 32 -18 33 55 276 145 93 151 -165 112 154 181 -135 204 93 36 67 -53 267 57
3639 57 -325 304 77 -225 122 -109 -163 -168 -48 -56 130 -362 35 -100 -144 97 -6 79 171 -41 241 271 20
3662 20 245 110 291 7 -39 113 -199 -105 -106 -104 41 -138 -192 -34 -10 -44 -8 -22 -297 110 -159 -101 -117 75 314
3687 314 166 184 220 -118 204 283 -141 206 90 277 229 -134 -217 -126 -27 -55 -453 5 -34 52 229 -28 -86 152
3711 152 92 -29 186 17 -11 107 -148 -16 241 7 334 -151 -138 -1 -120 141 -75 -42 95 -234 -81
$$ packed form
3543a26q1n3M1P2K58o1k1m9O2K20o44N18o8m0O6j56L56m18J20O0q8J2j31L74j41
3568H2j33q0K43J43l15J83k41j55M65l18J39m0j72J4K59o6K25k06j49J62k02J24
3590c8o4k2R3j27O7K89L1m1j18l42M14l84M07k03k9L04l09qK3O6%O8n81N26k38
3615b16J59M6j02J00M5n0N1K2K21j31n2N8l16K77M2K7l16L39j11n7L1j20L20k10
3639E7l82O29k27l02L47k31n4nJ20qJ86m92L97j35m4K41j03Q5R2k12K82L0k51
3662B0K25j35J81k84m6J52l12R4jKJ45j79n4J58K4l4L6j4k75M07k69N8j6J92K39
3687C14j48J8L6l38L22P9m24L47j16J87m8l63q3R1R9k8l98M58l9Q6J77k57n8K38
3711A52o0j21K15j69k8J18k55J32K57k34L27m85J3J37j19K61k16L3J37l29J53
$$ plain form
3732 -81 -54 -87 -47 -114 -196 33 -128 53 88 9 127 376 -66 252 48 -65 102 -93 248 355 160 316 -80
3755 -80 112 131 -55 -3 255 -173 122 -259 -236 43 -134 159 -323 -64 -19 -196 -1 210 114 239 109 163
3777 163 -37 162 -231 132 13 58 130 -206 -25 178 -209 316 -341 -134 53 84 -19 111 -45 -166 29
3798 29 143 104 29 109 52 88 -249 36 35 236 -110 -153 163 168 -88 33 -59 70 76 -268 181 -138 57 368 -97
3823 -97 221 33 -113 80 -9 39 0 -124 29 99 -146 286 -200 75 371 -172 -53 -20 -276 4 -78 -134 3
3846 3 -175 -65 203 -339 175 9 -22 40 -92 259 -175 32 252 -71 -42 -25 5 -190 63 -120 21 -42 -110
3869 -110 57 -379 -283 21 -7 219 177 22 71 164 -95 124 -18 30 294 -220 519 -121 77 417 -230 -107
3891 -107 -11 1 -126 92 53 20 -299 -162 59 -36 62 47 39 176 38 118 52 196 221 -21 253 150 -34 166
$$ packed form
3732h1K7l3M0o7q2K29j61J81L5p9J18K49m42L18k04j13J67j95L41J07j95J56l96
3755h0J92J9j86N2K58m28K95l81K3K79j77K93m82K59M5j77J95K11r6J25j30N4
3777A63k00J99l93L63j19M5P2l36J81K03l87N25o57K07J87L1j03J30j56j21J95
3798B9J14l9p5Q0n7L6l37K85jK01l46m3L16Nk56J21r2J29Ol44M49l19J95L11m65
3823i7L18j88j46J93q9M8l9j24J53P0k45M32m86K75K96n43J19L3k56K80q2n6J37
3846Cj78J10K68n42N14j66l1O2j32L51m34K07K20l23K9J7L0j95K53j83J41o3o8
3869a10J67m36R6L04k8K26m2j55M9R3k59K19j42M8K64n14P39o40J98L40o47J23
3891a07R6J2j27K18l9l3l19J37K21r5R8j5qJ37j38Q0o6J44K5k42K74j03j84K00
$$ plain form
3915 166 78 69 -92 -70 31 32 1 -210 -169 -89 157 -390 -83 78 -380 -157 3 84 103 -188 -117 -190 68 178
3939 178 214 -122 -78 106 187 98 -16 -230 41 156 -212 11 -109 24 -83 47 14 -307 -217 81 -282 -196
3961 -196 -1 65 185 -29 50 -80 75 290 -69 14 -30 -22 -51 -202 -39 62 -127 -166 202 -7 33 297 -76
3984 -76 -100 32 -37 159 -47 25 60 301 74 160 -353 268 -17 -44 171 -213 157 153 -45 -86 -161 -55 38 131
4008 131 6 -66 -10 157 -1 -185 141 -37 -59 -165 484 -30 -161 64 41 -32 -269 32 -288 88 12 213
4030 213 -15 -95 56 -11 47 156 254 40 309 22 -98 408 415 -194 153 56 -68 121 50 3 145 -156 210
4053 210 -136 204 68 -88 -159 -41 -50 -81 61 -62 -262 -228 -38 184 -78 45 150 174 148 -383 255 36
4075 36 62 149 -29 55 84 162 -49 -51 -103 -72 -43 -2 191 -362 24 163 -112 -23 68 -12 98 -112 119 -16 -38
$$ packed form
3915A66q8rj61K2J01Jl1k11M1Q0K46n47L07J61m58K23J60Q1J9k91P1p3K58J10
3939A78L6l36M4J84Q1q9j14k14K71J15l68K23j20J33j07J30l3l21R0K98l63Q6
3961a96J95O6J20k14P9j30J55K15l59Q3m4Qk9j51J63J01j89l9L68k09M0K64l73
3984g6k4J32o9J96k06P2L5K41k27Q6n13O21k85k7K15l84L70mj98m1p5J06R3R3
4008A31j25p2N6J67j58j84L26j78k2j06O49n14j31K25k3p3k37L01l20L76p6K01
4030B13k28q0J51o7N8J09R8k14K69k87j20N06Po09L47r7j24J89p1m7J42l01L66
4053B10l46L40j36j56p1J18rl1J42j23k00L4J90K22k62J23J05K4k6n31O38k19
4075C6K6Q7j78Q4K9P8k11kn2L1K9M1J93n53L86J39k75Q9R1q0J10k10K31j35k2
$$ plain form
4100 -38 127 -150 -154 72 -9 350 269 -66 -50 40 280 185 -92 238 376 -163 -204 -92 5 76 -96 23 -69 -267
4124 -267 5 -175 190 54 -170 -70 -132 273 79 258 111 -123 -33 56 86 158 -204 -109 -45 171 139 -8 22
4147 22 -86 -80 -26 -160 -97 4 -53 -144 41 43 -146 -69 -52 -107 -96 43 -161 -42 444 -151 29 -65 204 271 -84
4172 -84 -45 -277 -83 -81 -56 -117 171 -161 15 100 173 209 119 132 -71 99 -162 212 -77 173 32 -249 113 -174
4196 -174 -182 10 -45 110 5 -100 47 113 70 171 138 7 -328 -10 51 -152 -182 -31 130 -177 47 -287 91
4219 91 -72 11 130 -205 285 9 -130 -115 -129 -139 -150 14 81 -156 43 -48 85 34 -17 322 10 233 -23
4242 -23 -228 211 216 -145 3 -150 197 -317 -255 -214 -156 82 37 -129 -105 -254 -35 134 -266 -40 134 -118 -123
4265 -123 79 27 -45 179 270 270 -112 229 -93 174 47 -316 2 94 -70 -95 -152 -202 186 163 -31 14 42 184
$$ packed form
4100c8J65k77mK26q1L59q1l35J6R0K40r5k77L30J38n39m1J12R7P1j72J19r2j98
4124b67K72j80L65j36k24J00o2M05j94J79j47k34R0Q9L0P2l62R5O4K16l2j47L0
4147B2j08ON4j34O3J01n7r1J85Kj89P7J7n5J1J39k04J19M86n95J80r4K69O7l55
4172h4L9k32J94KK5o1K88l32J76Q5P3L6r0J3k03J70k61L74k89K50j41k81L62k87
4196a74qJ92n5J55j05j05J47O6m3J01l3j31l35L18O1k03l0J51J61l07K24l34L78
4219I1j63Q3J19l35M90k76j39J5j4j0j1J64O7k37J99r1J33n1n1L39l12K23k56
4242b3k05M39Nl61J48j53L47n14O2M1N8K38m5j66K4j49K19J69m00K26J74k52n
4265a23K02n2p2K24R1%l82L41l22K67j27l63L18R2j64k5n7n0L88k3j94M5K8J42
$$ plain form
4289 184 111 -23 180 63 -297 -29 21 -147 178 -81 150 -35 101 132 -111 284 26 216 35 -37 -21 144
4311 144 48 -32 -68 186 -98 -81 69 449 67 84 85 -38 17 8 34 -22 99 -122 94 -142 -69 291 -42 38 -387
4336 -387 -8 123 144 -8 283 -217 23 11 -57 -166 99 172 191 30 155 43 -106 401 -77 85 -148 140
4358 140 92 29 124 204 -239 57 72 -182 228 0 -238 96 0 -222 90 -238 47 -118 24 216 122 85 -18
4381 -18 -303 -90 -53 -180 -215 95 -71 -107 -29 -101 -105 -21 126 -256 -155 12 -2 128 172 -175 1 -96 -108 -2
4405 -2 146 0 181 -273 30 -117 -222 -4 -194 43 -548 47 -93 156 -55 31 -36 -235 210 -258 -81
4426 -81 0 117 -100 124 -213 91 70 -113 74 -34 89 141 86 87 19 102 54 74 11 69 -21 -412 -101 48 291
4451 291 -129 162 175 -281 95 -207 -154 28 -9 95 228 -160 168 -50 34 6 40 -7 -97 40 -37 221 -239
$$ packed form
4289A84p3j34K03j17l60K68N0j68L25k59K31j85J36L1k43L95k58J90j81p2J6J65
4311A44r6q0l6K54k84J7J50L80l82J7Jj23N5rK6n6J21k21K16k36P3L60l33Q0m25
4336c87L79J31K1j52K91n00K40j2o8j09K65P3J9j61J25j12j49N07m78J62k33K88
4358A40m8o3R5Q0m43K96J5k54M10k28k38L34r6k22L12l28K85j65J42J92r4l7j03
4381a8k85K13L7j27l5L10j66l6P8p2mQ4J47l82J01J67j4J30M4l47J76r7j2J06
4405bJ48j46J81m54L03j47j05K18j90K37n91N95j40K49k11Q6o7j99M45m68J77
4426h1Q1J17k17K24l37L04k1j83J87j08J23N2n5Jo8Q3m8K0o3N8r0l91L11J49K43
4451B91m20K91J3m56L76l02N3J82l7J04J33l88L28k18Q4k8L4m7r0J37p7K58m60
$$ plain form
4474 -239 191 -89 -14 -124 -24 -120 -68 -195 83 120 -84 69 17 -24 52 171 118 141 -280 186 -130 -64 -64 -261
4498 -261 -100 95 40 -178 56 -33 -60 5 -12 33 -178 -13 -123 102 -41 102 352 -158 -62 124 96 12 283
4521 283 33 85 99 -30 135 -91 150 12 -65 -178 -175 -161 -79 -228 -210 7 -122 -340 197 253 171 -47 19 -84
4545 -84 185 128 180 227 159 34 201 199 -153 -42 -108 78 137 -24 42 102 -8 192 -116 -148 11 304 -28 0
4569 0 -48 205 -76 27 -46 0 -69 -97 7 -14 -144 -106 -229 201 220 102 102 124 -164 -109 -39 73 -72 -121 -195 -69
4595 -69 6 -81 44 -74 56 63 65 -70 22 -162 -110 -11 87 -127 225 -181 63 -66 -51 -84 30 -71 -50 96 456
4620 456 151 -148 -136 -74 -160 6 -54 62 -190 123 3 243 181 58 -271 -98 -96 -27 -47 20 39 -341 -178 27
4644 27 54 -158 63 -84 -63 233 82 -191 100 -186 238 -52 -17 -81 153 8 -5 12 43 94 -159 46 93
$$ packed form
4474b39M30k80P5j10J00r6N2j27K78L7k04J53n2m1P6J19n3K3m21M66l16O6%j97
4498b61J61J95n5k18K34q9k7O5j7M5k11J65j10K25j43J43K50n10R6J86k8q4K71
4521B83k50N2J4j29J65k26K41j38p7j13LJ4Q2j49J8K17j29k18N37N6q2k18O6j03
4545h4K69n7N2M7o8j25J67kl52J11o6J86N9j61O6O0j10K00l08l2J59K93l32K8
4569@m8K53k81J03p3M6o9k8J04k1j30L8j23M30J9j18%K2k88N5P0J12j45m9p4J26
4595f9P5q7J25j18J30PKj35R2j84N2R9R8k14L52m06K44j29J5l3J14j01K1J46L60
4620D56l05k99J2O2q6J66o0J16k52L13j20K40o2j23l29J73KO9k0O7J9l80J63K05
4644B7K7k12K21j47K1K96j51k73K91k86M24k90L5o4K34j45j3J7L1N1k53K05M7
$$ plain form
4667 93 -75 113 -197 -55 -65 -42 299 -205 113 118 29 -30 -302 -181 139 43 -19 -95 39 180 316 -202 -152 41
4691 41 22 3 86 65 87 107 209 -227 43 -443 -46 -47 -38 -54 -44 187 36 264 73 31 -153 19 -5 21 62 -11
4717 -11 -118 135 -213 -192 -6 185 231 85 86 64 103 93 43 -97 -243 207 100 102 144 -210 63 7 58 182 2
4742 2 -11 -81 180 -51 259 8 111 -111 -72 -110 -106 288 -9 79 116 14 -192 237 148 -140 47 2 279 -149
4766 -149 -153 6 10 62 150 90 -57 -169 -152 139 96 -233 125 -233 -192 157 -307 93 -29 86 -93 -161 120 -78
4790 -78 46 335 207 -178 -174 50 30 -79 -86 48 -205 7 -30 112 -47 58 -66 -185 121 -172 -254 -88 149
4813 149 232 -194 -49 -100 -210 158 76 125 75 245 19 31 -169 12 -105 -32 27 -138 28 -142 350 -137 -299
4836 -299 3 -57 -30 56 43 80 135 52 -56 -17 -236 64 -78 90 139 -119 87 217 -136 242 276 72 173
$$ packed form
4667I3j68J88l10J42j0K3L41n04L18Nq9n9k72J21L20r6o2p6J34J41J36n18N0J93
4691D1j9j9Q3k1K2K0J02m36K70m86L97jRj6J0K31j51K28j91m2j84J72k4K6M1p3
4717a1j07K53l48K1J86J91M6j46Jk2L9j0n0j40j46M50j07KM2l54K73n6N1J24j80
4742Bj3p0K61k31L10k51J03k22L9l8ML94k97Q8L7j02k06M29q9k88J87m5K77m28
4766a49mJ59MN2Q8o0j47j12J7K91m3l29L58l58M1L49m64M00j22J15j79o8K81j98
4790g8J24K89j28l85MK24k0j09pJ34k53K12l7J42j59J05j24j19L06k93q2J66K37
4813A49Q3m26J45n1j10L68q2M9n0J70k26J2k00J81j17P3N9j65J66j70M92m87j62
4836b99L02o0K7Q6j3L7N5q3j08L9k19L00j42J68M9k58K06J30l53L78L4k04J01
$$ plain form
4859 173 100 -96 83 313 149 106 24 262 233 -369 92 -179 -24 -200 -126 144 109 234 19 246 61 47
4881 47 -174 -23 271 7 92 -134 226 48 76 115 36 67 23 -166 -23 51 -24 121 107 90 -39 -9 153 -53
4905 -53 45 145 6 -182 47 -154 286 266 -36 -9 165 -50 -177 119 8 -11 25 -123 145 -162 180 -201
4927 -201 -133 -165 10 145 -166 -210 -83 7 231 62 84 155 207 147 -122 -30 11 -120 -9 -311 -169 -245 181 14
4951 14 -56 99 200 -59 -9 20 100 105 -124 -5 89 -102 -110 221 -18 55 160 -108 -193 184 -72 -148 3 -99
4975 -99 241 -52 191 131 -152 5 69 -204 117 226 -155 85 -238 233 1 121 -43 33 80 67 287 -142
4997 -142 -55 252 185 -1 85 189 28 165 -312 85 0 -31 -25 -4 95 228 107 262 -103 3 101 87 157 -148
5021 -148 -266 -222 -42 -2 242 142 -9 -64 33 -55 31 -277 -161 -160 -142 6 45 -8 -264 -127 295 -67 -187 28
$$ packed form
4859A73p3j96J79K30j64m3q2K38k9o02M61k71J55j76P4K70l5J25k15K27j85j4
4881D7k21J51K94k64Q5k26L60j78K8L9p9L1m4j89J43P4p5J45j4j7j29L0J62k06
4905e3R8J00j39j88K29k01M40k0l02K7J74k15j27K96j11j9L6j48K68l07L42l81
4927b01O8l2J75J35l11m4J27R0K24j69K2P1N2o0k69R2M1j31J11l02J42p6M26j67
4951A4p0J55J01k59N0K9Q0Nk29J19R4j91qL31k39P3J05k68q5L77k56p6J51j02
4975i9L40k93K43o0k83J57O4k73L21J09l81K40l23M71k32J20j64P6M7j3K20m29
4997a42Q7L07o7j86Q6J04j61J37m77L97q5l1OK1R9J33j21J55l65J06R8j4P0l05
5021a48j18M4J80M0K44j00j51n5R7q8Q6l08J16JJ8J48L9n3k56J37M22l62j20K15
$$ plain form
5045 28 -33 67 231 190 52 88 97 87 117 -93 -131 22 -55 -85 106 199 -217 27 139 6 22 -172 13 -64 -91
5070 -91 26 253 71 145 202 -38 92 43 207 -26 4 173 3 150 7 16 -121 -203 138 168 -79 -77 101 243
5094 243 -62 -211 -161 127 192 75 24 11 -175 -95 7 278 31 77 55 -57 -227 -21 -87 -48 152 -63 46
5117 46 176 147 40 -120 -82 -52 99 -6 92 19 126 -57 20 -122 123 49 135 21 166 264 200 -184 47 74
5141 74 -151 134 -81 50 324 33 -120 -75 35 76 64 -135 -82 50 90 -40 173 -75 -113 -149 -46 -62 270
5164 270 -51 -147 -55 39 153 65 44 319 -150 56 252 -266 -20 -30 -120 370 96 63 28 -161 193 -154 -16
5187 -16 -83 -216 -94 -152 106 -215 -48 -93 107 48 -16 90 -35 -47 -36 -97 128 -107 -78 -64 111 110 149 175 -71
5212 -71 -65 223 158 58 -11 40 -37 -154 -201 219 131 -70 43 -160 6 -76 -404 54 -67 -202 -46 -157 -145 -27
$$ packed form
5045B8o1J00J64m1j38L6Rj0L0k10l8J53p7l0J91R3m16K44J12j33J6j94J85p7k7
5070i1J17K27j82P4N7k40J30m9J64k33L0J69j70J47j43Rj37q2L41L0k47KJ78J42
5094B43l05j49N0K88O5j17n1j3j86Q0J02K71k47M6k2j12j70K06o6L9K00k15J09
5117D6J30k9j07j60L8L0J51j05R8p3J07j83P7j42K45p4Q6j14J45R8o4l84K31K7
5141G4k25K85k15J31K74k91j53M5J10M1j2j99N3J32M0j30K13k48l8l6J03j6L32
5164B70l21r6R2R4J14q8k1K75m69K06J96n18K46j0r0M90k74l3l5j89L54l47J38
5187a6o7j33J22n8K58l21J67m5K00n9o4J06j25j2J1o1K25k35K9J4J75jL9K6k46
5212g1OK88o5j00o9N1p7j17m7M20q8k01J13k03J66q2l28M58j21j35J56j11J2J18
$$ plain form
5236 -27 -44 157 181 -65 -24 108 -87 -13 -80 -341 56 -92 4 -188 -91 92 -18 124 205 -265 58 -26 252
5259 252 80 160 93 -17 -76 76 -76 -158 28 74 -61 86 -1 93 58 -11 -102 181 1 -51 -34 -62 -21 23 -236
5284 -236 -160 0 55 89 -292 -40 76 303 -180 177 -126 -125 -43 70 -188 -116 28 -4 -228 191 4 84 -309
5307 -309 -56 -8 -111 139 15 228 -98 188 -157 220 120 30 -110 -80 46 -182 105 39 -253 -71 -23 -172
5329 -172 -24 132 -3 -22 -28 6 17 166 -55 207 58 71 240 61 163 -1 34 2 147 99 88 -19 6 -212
5353 -212 31 116 -3 239 -16 -81 138 -213 -12 -22 48 40 22 -77 153 12 137 132 113 0 -6 -379 -91 -161 -150
5378 -150 -114 364 181 -74 227 -104 -112 -142 54 -2 -24 -240 -107 48 -29 102 60 123 63 -94 -12 23 86 315
5402 315 21 -34 -5 -58 -144 -151 -54 2 174 175 -333 19 -52 199 92 -176 -10 -177 -12 289 -21 -12 287 -38
$$ packed form
5236b7j7K01K4k46M1J32j95P4o7k61L97j48R6j92R7J83j10J42Q1m70L23q4K78
5259B52j72Q0o7j10n9J52j52q2J86M6j35J47q7R4l5o9r1K83j80n2J7k8M1M4k59
5284b36P6J60N5L4l81K52J16K27m83L57l03JQ2J13k58P2J44l2k24M19j87Q0l93
5307c09K53M8j03K50j24K13l26K86l45L77j00r0j40L0J26k28K87o6k92J82M8j49
5329a72J48J56j35j9oL4J1J49k21K62j49J3J69j79J02j64L5l2J45m8j1j07K5k18
5353b12K43Q5j19K42k55o5K19l51K01j0P0qj8r9K30j41J25nj9j13ol73K88p0J1
5378a50L6M78j83k55L01l31ql0J96n6k2k16J33J55p7J31m2O3o0j57Q2L5O3K29
5402C15k94n5K9n3q6pR7N6J72Jn08L52p1K51j07k68J66j67J65L01l10RK99l25
$$ plain form
5426 -38 348 -101 215 59 -32 35 43 6 3 391 -117 452 -142 305 -41 -64 -87 75 -250 -131 -205 -177 202 36
5450 36 6 -62 -200 -44 -153 -55 52 52 80 -268 22 87 89 41 81 48 7 -170 -158 294 98 1 109 -300 86
5475 86 47 -71 -95 219 -53 -321 138 58 -64 -5 173 -262 115 89 75 -97 -182 52 27 -54 213 -14 61 65
5499 65 -110 -106 183 -104 60 -133 -279 146 29 -11 -275 -57 -242 74 -60 -120 33 -93 -100 47 -179 159
5521 159 -208 -108 -55 -104 -95 1 110 -32 -68 -128 -282 -51 -59 192 -20 -136 -183 134 19 -63 -316 116 47 56 -208
5546 -208 178 166 -42 137 47 100 24 -41 -239 367 -292 -194 -109 90 82 -199 59 291 -134 -154 -44 -105 -12 -32
5570 -32 -77 -69 4 104 -142 -27 -19 -62 87 63 74 -197 -81 -131 -192 75 -16 -214 -312 85 132 -88 -210 73 53
5595 53 16 -80 -217 127 -9 -112 -40 -179 -6 88 -162 251 -32 -20 67 -151 180 114 119 165 63 159 277 34
$$ packed form
5426c8L86m49L16j56r1O7Ql7lL88n08N69n94M47l46k3k3J62l25J19p4K8L79j66
5450C6l0o8j38J56j09R8J07%K8l48K90O5Km8M0l3m1j77J2M52j96r7J08m09L86
5475H6l9j18k4L14k72k68M59q0j22N9J78m35L77k6j4j72q5K34k5q1K67k27P5M
5499F5j75MK89k87J64j93j46M25j17m0k64K18j85L16j34o0J53j26pJ47k26L38
5521A59l67J00N3m9RR6J09j42l6o0j54K31qK51k12j16m7L17j15q2k53M32o9Rk64
5546b08L86j2k08J79r0N3p6o5j98O06o59R8Q5J99qk81K58K32m25k0J10o1R3k0
5570c2m5QP3J00k46J15Qm3J49k4J1k71J16n0o1K67r1j98r8L97M7k20j22K83k0
5595E3l7r6j37L44j36j03P2j39J73R4k50M13k83J2Q7k18L31o6NM6j02R6J18k43
$$ plain form
5619 34 153 -74 -346 30 -134 74 -126 96 -116 -134 -5 166 114 -87 -58 -214 -26 -284 -68 -148 23 -125
5641 -125 -105 -337 -97 -144 -36 -17 133 73 139 50 -97 86 90 206 240 -23 47 95 32 162 -270 -145 309 14
5665 14 32 44 62 -10 77 -106 -176 -114 80 180 292 188 172 -259 -90 105 -81 102 -23 301 -174 100 42
5688 42 -295 131 158 10 113 127 -25 -49 -146 -14 311 -9 -74 75 110 134 -70 -113 27 -165 72 -19 -37 -201
5712 -201 -250 -44 41 -35 -91 -188 -206 205 -13 246 19 125 202 184 10 -11 -112 -39 -120 91 172 -210 -64 -166
5736 -166 -231 -158 -180 -149 -82 -173 17 -91 65 29 -181 94 -88 -175 -176 213 -46 256 -302 -51 -134 -17 332 41
5760 41 221 -67 281 5 22 65 2 -34 173 215 -232 104 -63 244 -105 -56 259 -139 -72 137 127 -142 58
5783 58 -171 97 92 197 -10 272 -324 108 103 97 236 39 364 206 146 39 112 142 -182 -138 -54 150 166 34
$$ packed form
5619C4J19k27k72L76j64K08k00K22k12j8J29J71n2k01K9j56J88k58K16q0J71j48
5641a25K0k32K40m7J08J9J50o0O6q9j47J83MJ16L4k63P0M8o3J30m32J25M54k95
5665A4J8J2J8p2Q7j83p0O2J94J00J12j04j6m31J69J95j86J83j25L24m75K74n8
5688D2l37M26K7j48J03J4j52k4r7J32L25l20o5J49L5K4k04m3J40j92K37r1j8j64
5712b01m9K06Q5p6n6r7j8M11k18K59k27J06P7j8j74k1j01P3q1K11Q1l82J46j02
5736a66o5P3k2L1O7r1J90j08J56l6k10K75j82q7jL89k59L02n58K51q3J17L49k91
5760D1J80k88L48k76J7M3o3l6K07M2m47L36j67L07l49M9L15l98O7K09j0k69K00
5783E8k29K68nJ05k07K82n96M32noJ39j97L25j58o0j07P3L0l24M4Q4K04J6j32
$$ plain form
5807 34 128 167 -13 24 75 -39 89 78 -193 205 81 9 185 -133 -121 129 207 98 -131 193 -1 145 39
5830 39 -32 102 -92 13 164 -29 -176 96 -16 153 49 -163 -103 193 -183 60 174 -101 107 44 119 100
5852 100 156 128 -258 -237 -56 -70 -141 -194 46 -49 -110 -213 93 127 -322 -159 -324 -24 69 59 44 -24 151 46
5876 46 -26 -64 -78 -240 62 -176 -31 -225 -21 -15 -7 -84 -61 -34 -125 -20 -59 -86 238 -248 -67 229 -143 -199 -283
5901 -283 -86 222 -12 -70 -51 -14 -99 -124 58 -205 -230 -220 91 -148 -40 43 -147 -131 -117 -61 153 231 -61 -87
5925 -87 -101 -102 -252 -207 8 -66 -354 43 38 98 -68 -127 -130 -12 21 -48 66 -7 36 227 -15 -36 4 -127 41 -182
5951 -182 -125 -54 102 11 48 62 151 -38 188 -120 309 196 84 -16 -30 -92 -17 -78 -198 250 -70 45 123 50
5975 50 12 -36 92 -98 -57 -59 21 125 65 -11 148 50 -6 227 -66 -2 -227 -76 239 -78 -154 -43 -55 -31 -68
$$ packed form
5807C4R4L9j80L7N1j14J28j1k71L98j24p2J76l18J2K50P8j09k29L24j94J46j06
5830C9p1J34j94J05J51j93j47K72j12J69j04k12O0K96l76K43J14k75K08o3P5j9
5852A00N6k8l86K1J81j4p1n3K40r5o1j03L06L4m49J63j65L00R3j0j5o8J75j05
5876D6p2l8j4j62L02k38J45j94K04OQp7K3K7r1J05l9k7L24m86J81K96l72n6q4
5901b83J97L08k34n8J9L7q5k5J82k63k5J0L11k39J08Q3j90J6J4N6K14P8k92k6
5925h7j4jj50M5K15p4k88L97nO0j66n9lJ18L3o9J14p3M3J91k42k1M0j31J68k23
5951a82N7P1J56r1L7J4Q9j89K26l08M29j13j12j00j4o2P5o1j20M48l20J15P8p3
5975E0l8m8J28j90M1kQ0J04o0p6J59r8n6K33k93O4k25J51L15l17p6J11j2K4l7
$$ plain form
6000 -68 -29 43 120 207 123 -223 33 189 2 37 -48 2 4 83 -88 49 -196 130 -80 -103 130 45 -54 -18 81 82
6026 82 135 -194 -96 33 -74 88 -26 -29 -36 -165 -66 -13 -18 256 -109 177 -116 -101 4 -81 -95 53 59 -4 -269 -31
6052 -31 -72 -228 -59 -169 125 95 38 -14 136 52 22 174 -122 127 112 177 -121 41 -38 -309 41 -142 74
6075 74 35 173 163 31 24 123 -105 -98 4 -109 86 -169 78 -24 364 79 -47 75 -88 81 59 87 -164
6098 -164 -100 -14 14 30 -57 -128 120 21 168 -115 -168 109 82 71 -8 145 179 0 31 -176 -21 24 -172 -93 -1
6123 -1 -90 -45 -42 107 255 -100 319 -100 -38 89 114 -130 -98 -37 -47 109 -55 2 -119 -333 -99 229 115 91
6147 91 75 64 290 -72 -146 9 -142 -126 -110 -53 -119 85 -350 21 -3 145 161 5 149 125 -105 -13 -149 141
6171 141 -112 -170 -50 266 -5 35 -114 -83 350 -266 -253 -284 -26 218 68 24 10 -81 -159 -39 103 -187 3
$$ packed form
6000f8L9P2P7Q7q4l46K56J56j87L5q5N0KP9j71J37k45L26k10k3K33q5r9L6R9J
6026H2N3l29R8J29j07J62j14lpj29R9N3nK74l65K86k93J5J05q5j4J48Oo3k65K38
6052c1m1j56J69j10K94l0n7n2J50q4l0J52k96K49j5O5k98J62p9k71L50j83K16
6075G4l9J38j0j32pR9k28PJ02j13J95k55K47j02L88k85j26J22j63J69k2K8k51
6098a64O4Q6K8J6q7p1K48r9J47k83n3K77k7j1p9J53L4j79L1k07J55M5j96P9R2
6123aq9M5LJ49J48l55M19m19O2J27K5k44L2O1j0J56j64N7j21k14K34L28j14k4
6147I1j6j1K26l62p4J55j51J6J6N7o6K04m35L71k4J48J6j56J44k4k30R2j36K90
6171A41k53n8J20L16k71M0j49L1M33o16J3l1K58K44j50m4j4r1p8J20J42k90J90
$$ plain form
6194 3 124 -140 106 4 -21 -21 173 60 185 78 -151 -95 199 91 -39 131 -32 149 -180 135 113 14 145
6217 145 -449 32 -168 -163 -405 -86 -151 -10 132 18 -134 98 6 -119 -98 -256 2 97 164 219 62 -189 -199
6240 -199 -123 43 -7 171 -25 -38 -244 -1 -18 155 70 -243 -72 -112 291 -30 56 106 28 -155 44 36 -336 -123
6264 -123 -264 163 -133 -218 -20 150 -62 6 -120 123 48 7 6 1 -18 -194 0 189 -90 -73 277 -31 52 10
6288 10 -98 330 -121 107 -143 172 180 -94 164 -63 3 -140 -3 -233 139 237 6 51 -136 208 104 110 -118
6311 -118 109 -12 74 -97 -135 169 18 264 23 -8 -73 -93 118 -98 -39 3 26 84 -57 -271 -263 102 110 -80
6335 -80 119 -87 -47 -220 91 -129 195 -76 -95 28 142 -184 -95 10 -41 -132 181 -59 -67 23 70 -65 -118 -134
6359 -134 63 24 -198 106 -79 -113 130 -166 -44 -89 -145 75 85 123 -190 -40 70 -138 -71 144 -96 9
$$ packed form
6194CJ21k64K46j02k5%J94j13J25j07k29N6K94j08j30J70j63J81l29L15k2r9J31
6217A45n94M81k00Nk42L19o5J41J42j14j52K32r2j25K1j58K58R5O7N5j57k51j0
6240a99P6J66n0J78j96j3k06K43j7J73q5l13J71m0M03l21Q6N0p8j83J99ql72K13
6264a23j41M27k96q5J98J70k12O8j26K43p5m1jnj9j76J94J89k79J7L50l08Q3m2
6288A0j08M28m51K28k50L15Qk74K58k27O6j43J37k30L72R8k31M5j87L44j04Ok28
6311a18K27j21Q6j71l8L04j51K46k41l1o5k0K11k16N9M2K3N8j41k14QL65Qj90
6335h0J99k06M0j73L11k20L24k71j9J23J14l26Q9J05n1r1L13k40qR0M7j35n3j6
6359a34J97l9k22L04j85l4K43k96J22m5n6K20J0L8l13J50J10k08O7K15k40J05
$$ plain form
6381 9 16 83 -146 -6 57 13 120 5 -23 -50 202 0 -107 264 152 187 227 82 -93 -1 -53 -5 -168 66 -44
6406 -44 40 34 -6 -184 -129 64 -298 -39 -180 -89 6 -247 12 -181 -46 122 -107 -155 89 256 -27 384 17
6429 17 -32 -62 -110 -32 163 187 -278 -248 193 -12 165 160 -25 -23 -10 -126 249 -81 129 74 -82 78 -35 -103 14
6454 14 20 0 166 -69 -32 -62 -113 -153 -14 -238 151 -65 -27 -131 -154 -268 -133 71 -51 261 192 -30 -11 65
6478 65 8 -121 -162 -97 13 -3 -111 -194 -61 -107 -72 50 -316 36 -74 110 58 -157 311 118 -114 -11 -57
6501 -57 -307 97 2 -55 113 -39 -31 79 -161 221 118 98 431 119 89 45 -63 233 13 122 -153 -123 40
6524 40 179 -33 -14 44 -131 8 -7 -48 189 102 283 -243 45 80 -147 -23 227 -181 42 57 -199 290 47
6547 47 -212 -21 23 -53 28 -329 -243 -151 -64 17 47 -130 119 13 45 -2 -44 60 -32 -136 -13 114 181 68 9
$$ packed form
6381IPO7k29J40O3m4J07j15k8k7K52k02j07L71j12L5M0j45j75R2n2M8j63K34j10
6406d4Q4om0j78N5J93l62K59j41R1R5k53K59j93J35J68k29m8K44J67k83M11l67
6429A7m9l0m8P8J95K4m65L0M41k05J77nj85KJ3j16L75l30K10n5j56J60j13o8J17
6454A4Ok0J66k35L7l0n1m0J39k24L89k16L8j04k3j14J35K04j22L12o9k22J9P6
6478F5n7j29m1O5J10j6j08q3J33m6L5J22l66L52j10J84n2k15M68j93k32J03m6
6501e7k50M04r5n7J68j52QJ10k40L82j03k0L33l12l0m4j08K96k20J09k75L0J63
6524D0J39k12J9N8j75J39j5m1K37q7J81n26K88L5k27J24K50m08K23J5k56M89k43
6547D7k59J91M4p6Q1l57Q6R2Q7Q1L0j77K49j06L2m7m2J04r2j04J23J27O7j13n9
$$ plain form
6572 9 -175 1 -249 20 -202 -78 39 101 163 82 109 11 159 -458 -44 30 42 80 323 117 -293 2 -161
6595 -161 216 -11 12 18 243 -256 45 -115 -105 240 195 225 -90 147 -29 196 290 -23 -22 -28 131 84 -27 -28 -50
6620 -50 265 33 -95 -105 -118 -34 82 -171 50 238 218 94 -331 -24 256 -36 -244 -195 -50 24 90 20 -191
6643 -191 72 -194 8 -1 -335 -8 -114 41 251 3 69 89 -23 106 200 -61 -4 166 155 -169 126 -83
6665 -83 -8 -39 -180 66 74 -108 -25 172 -177 -261 -86 171 196 -121 -54 4 -70 222 -140 -93 -99 -337 -156 -91 -194
6690 -194 73 142 147 -89 31 7 229 15 -39 27 -59 -59 43 -194 159 109 156 -1 -77 -392 -201 209 -52 -41
6714 -41 -196 0 -71 274 -55 13 -316 188 260 280 304 -59 40 -102 -19 -169 -101 -104 -1 -217 -95 116 5 141
6738 141 449 44 71 207 -289 153 11 -215 0 35 70 -133 -25 166 14 -32 31 200 14 182 158 -139
$$ packed form
6572Ij84J76k50K69k22J24J17O2O2q1K7r8J48o17M14P4J2L8K43k06m10K95j63
6595a61L77k27K3OK25m99L01j60J0L45m5L0l15K37j76K25R4l13JoJ59m7j11jk2
6620e0L15k32j28j0j3Q4J16k53K21J88k0j24m25L07K80k92k08M9J45P4O6p0k11
6643a91K63k66K02rl34L27j06J55K10k48O6K0j12J29R4k61N7J70j1l24K95k09
6665h3P5l1j41K46Qj82Q3J97l49q4J75K57K5l17O7N8p4K92l62M7ok38J81O5j03
6690a94K67O9Nk36J20k4K22k14n4O6q6%J02k37L53n0M7j57p6l15J91M10k61J1
6714d1j55J96p1L45l29O8l29N04P2K0K4l63R9j42Q3j50O8lJ03k16J22K11j11J36
6738A41L08m05K7J36m96M42j42k26K15L5L5k03J08J91j52m6O3J69j86J68k4k97
$$ plain form
6760 -139 -3 -172 -47 207 183 -133 -10 -153 -346 135 -19 -127 119 -70 -89 -46 84 -120 -24 -261 69
6781 69 109 93 -47 140 15 -98 0 17 48 -74 -111 -164 -28 148 103 -50 -2 -246 -58 -1 127 -35 -293 4
6805 4 -50 -4 -166 106 -13 -144 48 201 -115 71 60 -2 -284 49 66 112 -8 119 148 66 150 -74 17 -50
6829 -50 -146 -60 -94 145 -129 244 -219 358 127 -138 -23 -284 -41 17 87 258 1 34 -81 -126 22 -10 -126
6852 -126 8 -72 63 -89 14 -85 87 -83 -291 7 -35 -219 102 97 -112 121 13 -80 -153 24 123 3 -268
6875 -268 -153 -14 148 47 -111 220 142 93 3 217 -25 -51 -45 5 64 25 59 101 232 -328 -172 -88 162 90
6899 90 -54 211 38 -20 -235 33 217 -141 -99 94 -13 82 -86 -13 -180 -188 89 -13 80 13 -1 -44 121 -242
6923 -242 -22 -138 25 -52 -71 97 105 -110 -125 -176 -88 77 64 -173 55 -51 41 -62 -141 25 -43 -154 1 184
$$ packed form
6760a39J36j69J25K54k4l16J23j43j93M81j54j08K46j89j9M3J30k04R6k37L30
6781F9M0j6j40J87j25j13R8J7L1j22l7n3J36J76m5j53M8k44J88N7J28j62k58K97
6805Dn4M6j62K72j19j31J92J53l16J86j1o2k82L33J7M6j20J27K9q2Q4k24R1o7
6829e0r6Q6l4K39k74L73m63N77k31k65J15k61K43N8P0J71k57L3j15m5J48l2j16
6852a26J34q0J35j52J03r9J72j70k08K98m2j84L21nk09K33j08r3p3J77R9j20k71
6875b68J15J39J62j01j58L31p8m9r0K14k42k6ON0N9l9L4M2J31n60J56Q4K50p2
6899I0j44K65j73n8k15K68J84l58M2J93j07R5j68P3j67qK77j02R3o7j4m3J65l63
6923b42K20j16J63p7j9J68Qk15j5n1Q8J65j3k37K28j06R2j03p9J66o8j11J55J83
$$ plain form
6947 184 40 -107 -181 11 4 -32 26 177 138 -18 -3 0 -263 81 -124 25 2 -132 -212 -100 59 -32 -222 -42
6971 -42 -181 -35 137 82 172 -170 -21 -62 -386 7 -160 124 -85 -17 -191 -391 80 159 -60 100 -53 72
6993 72 -176 -176 233 -118 -121 -164 -66 -58 42 -89 -282 52 153 59 -23 70 15 -143 23 -38 155 -142 -67 27 9 2
7019 2 -201 -173 30 -156 226 20 102 -205 118 178 -54 -334 182 23 189 41 -158 -261 -96 15 -61 -41
7041 -41 -168 33 -7 5 10 290 -131 76 18 60 -149 -68 -16 106 -6 -83 204 9 -38 -269 -25 240 -132 158
7065 158 -205 209 -238 193 9 -18 82 136 126 242 -11 -260 56 101 103 34 146 218 -113 -171 221 -161 -24
7088 -24 117 -263 54 -262 -179 -30 108 -108 -10 -123 -112 269 -153 -198 -31 196 148 233 33 -160 21 -24 141
7111 141 -46 -195 179 151 -57 263 8 57 168 18 -111 -28 -144 -129 -14 49 -141 -62 -249 300 41 -43
$$ packed form
6947A84j44j47p4J92pl6N8J51l9j56J5Lk63L44k05J49k3j34q0J12J59r1j90J80
6971d2j39J46J72n5R0l42J49m1l24L93j67K84k09O8j74k00M71P9k19J60j53J25
6993G2k48%M09l51lm3R8QJ00j31j93L34J01r4q2R3n5j58J66o1J93k97P5R4j8p
7019Bk03K8K03j86L82k06Q2l07L23O0k32k80N16j59J66j48j99j03J65J11p6K0
7041d1j27K01m0J2NK80m21K07n8M2k09Q1N2J22j12p7K87j95m7k31K44K65l72K90
7065A58l63M14m47M31j84k7J00N4j0J16k53k49L16M5Ko9J12P2l31n8L92l82J37
7088b4J41l80L17l16Q3J49J38k16R8j13J1L81m22m5J67K27m8Q5k00j93J81m5J65
7111A41j87j49L74k8k08L20k55M9J11j50j29Q3j16J5J15O3j90P9j87N49k59q4
$$ plain form
7133 -43 4 65 42 61 -138 -55 95 181 121 107 -31 129 -222 -128 -340 147 -27 -61 57 -18 61 69 103 55 42 56
7159 56 -104 130 -6 186 -28 107 87 72 -224 -155 -23 -361 -154 247 67 -56 263 5 96 -19 -13 -58 7
7182 7 -81 79 -28 -214 -84 -10 126 214 6 56 -81 -62 390 -12 -1 -183 15 -86 -4 128 40 -53 -164 -75
7206 -75 -75 -86 79 46 29 82 171 -269 -205 -42 58 144 -32 122 61 187 -194 -132 -35 92 -150 -238 -14 36 -4
7231 -4 253 -215 178 317 -111 37 35 123 -294 140 133 90 17 -19 -36 140 -60 -65 123 31 157 -185 42 -144 -57
7256 -57 -38 2 -63 -53 197 110 6 108 94 254 8 69 -63 185 -259 35 53 -139 14 314 101 79 -225
7279 -225 33 -225 111 166 42 125 78 -158 -56 -115 4 294 79 248 51 100 -109 -305 152 -159 -229 155
7301 155 -333 145 145 232 -69 19 72 -159 -107 -106 135 -94 -46 -116 -46 -229 15 -103 231 -99 226 -96 -70 -184
$$ packed form
7133d3M7O1k3J9j99Q3J50Q6o0j4j38J60l51R4k12M87j74l4J18p5P9QL4m8j3J4
7159E6j60K34j36J92k14J35k0j5k96O9J32l38K07M01j80j23L19k58R1j15Om5O5
7182Gq8J60j07j86J30P4J36Q8k08N0j37J9M52m02J1j82J98j01Q2J32q8r3j11Q9
7206g5%j1J65l3j7N3Q9m40O4J63J00Q6j76J54o1J26l81O2R7J27k42q8K24N0m0
7231dK57m68L93J39m28J48kQ8m17M34pm3p3l6j7J76k00nJ88r2J26l42K27j86Q7
7256e7J9M0o5J0K50q7j04J02j4J60k46O1j32K48m44K94J8j92J53L00k13k2l04
7279b25K58k58L36N5j24Q3m7k36J02n9J19K90k15J69j97M9k09j96M57l11p0L84
7301A55m88M78%Q7l01Q8N3k31N2JK41k29M8p0P0j83K44j18L34l30L25l22K6j14
$$ plain form
7325 -184 60 30 48 -33 -95 -37 -136 -17 -234 -4 195 -118 -57 -214 128 13 -6 -222 8 37 -13 -134 -51 -65
7349 -65 -157 121 -3 -56 -221 137 14 272 112 240 276 137 -56 -64 290 183 -100 -131 37 -65 13 52 -420
7372 -420 -202 185 -39 -20 -144 116 -112 -174 -152 -177 -160 -156 155 -198 171 -161 228 -155 -99 356 184 -37 -59
7395 -59 -129 210 -18 -189 -70 -5 -374 150 86 -60 -77 -91 -18 -18 -105 -11 -377 -164 126 37 -43 7 -195 -82 91
7420 91 194 -94 27 69 -61 -110 14 179 -165 -132 -152 -136 -32 148 62 277 -23 54 121 -126 -65 -180 -125 -42
7444 -42 -23 26 -56 -6 -203 -124 -81 169 214 -79 89 -143 -117 -26 -86 -146 63 55 37 99 139 331 26 39 -55 -134 156
7471 156 111 215 -133 1 154 -124 -21 127 -292 -35 -13 -96 0 190 113 18 78 -149 -252 -21 0 82 101
7494 101 120 110 14 81 351 71 13 -19 17 -57 103 -211 8 177 -180 19 -65 -123 28 -186 125 -207 153
$$ packed form
7325a84K44l0J8q1o2N8r9J19k17K30J99l13O1j57L42j15j9k16K30K9n0j21Q3j4
7349f5r2K78j24n3j65L58j23K58j60J28L6j39j93qL54j07k83l1J68j02P8L9m72
7372d20K18L87k24J9j24K60k28o2K2k5J7ML11l53L69l32L89l83N6M55j72k21k2
7395e9p0L39k28j71J19O5l69N24o4j46j7j4P3%q7R4l66K13K90q9q0N0k02J13J73
7420I1J03k88J21M2j30m9J24J65l44L3k0J6J04J80q6K15l00P7O7k47O1j15N5Q3
7444d2J9M9q2N0j97P9M3K50M5k93J68k32K6R1o0o0K09qj8O2M0J92l05J3r4p9K90
7471A56m5J04l48J34J53k78J03J48m19K57K2q3R6J90p7r5O0k27j03K31K1Q2J9
7494A01J9j0r6O7K70k80n8l2L6p4J60l14K19J69l57J99q4n8J51k14L11l32L60
$$ plain form
7517 153 38 200 36 -154 -50 46 -248 -8 79 -39 -200 207 -171 -116 156 40 69 -112 -183 32 168 105
7539 105 161 -47 13 45 -251 -137 100 -40 45 -31 -134 126 99 100 64 306 -166 31 66 -81 -292 -64 115
7562 115 -64 -167 12 33 12 25 311 71 73 -117 83 24 89 -120 -65 -64 -160 -162 -23 169 72 61 -169 118 -96
7587 -96 135 89 89 325 227 252 82 113 -44 -89 -208 255 -188 -182 22 -25 -110 -129 71 -179 -26 -224 107 29 64
7612 64 23 181 36 182 -68 68 -139 -67 139 157 0 62 -246 107 -170 -121 254 15 20 -10 -113 -94 75
7635 75 -160 -172 6 -6 -139 109 -117 113 67 76 141 5 -51 79 22 -92 45 36 73 78 -251 -161 -174 -103 157 30
7661 30 102 -43 -94 244 -313 -284 -218 -167 94 -171 -171 38 -216 64 139 159 66 83 -71 -98 17 -35 -71 -115 -68 -241
7687 -241 -88 54 -25 -35 -82 -266 -213 -35 35 50 -63 -40 -1 148 -82 -10 161 -32 -206 -31 -160 54 -173
$$ packed form
7517A53j15J62j64j90J04R6k94K40Q7j18j61M07l78N5K72j16K9j81p1K15J36o3
7539A05N6k08O0L2k96J14K37j40Q5p6j03K60k7Jl6K42m72J97L5j47k11K28J79
7562A15j79j03J79K1k1J3K86k40Kj90K00n9O5k09N5Jr6kJ39J92r7j1k30K87k14
7587i6K31m6%K36r8K5j70L1j57m5j19M63m43OK04m7q5j9K00k50J53j98L31p8L5
7612F4m1J58j45J46k50J36k07P2K06J8j57O2l08L53k77M9L75k39Nl0j03J9J69
7635G5k35j2J78j2j33K48k26K30m6RO5j36n6J30n7j14J37rL7Nl29R0j3P1K60j27
7661C0P2j45n1L38n57K9O6N1K61k65%K09k54K80P5K0r3J7j54k7J15n2l6m4M7j73
7687b41J53J42p9j0m7j84N3J78P0J5j13K3L9J49k30P2J71j93j74J75j29K14k27
$$ plain form
7710 -173 -181 81 347 97 -136 310 -7 -149 -170 -162 144 -36 71 119 -24 -122 -204 -42 20 -153 -31 -47 -17 107
7734 107 -102 -12 3 -126 -59 -64 59 -56 16 -25 -331 23 -38 15 177 -146 -65 37 -38 208 189 246 -146 -127 -94
7759 -94 -393 -26 47 73 92 185 -185 199 -106 -52 -102 -4 211 -136 -110 -340 9 24 -141 276 32 100 97 -402
7783 -402 -123 -26 102 21 83 237 9 78 230 -71 42 108 214 23 77 321 98 34 -82 179 112 73 -52
7806 -52 -67 182 -213 -88 -410 -22 -38 160 73 -160 190 -117 5 178 72 -53 136 -58 37 10 -43 116
7828 116 12 -320 -148 60 -173 -104 244 18 -7 -102 274 -38 49 -144 -54 153 215 10 -97 19 -178 -244
7850 -244 112 -108 -97 -58 -271 314 158 23 151 -64 36 12 92 -272 194 18 -188 105 258 -147 100
7871 100 155 257 337 -110 -39 -207 57 29 251 158 242 -28 -227 -46 -37 -67 -64 238 132 288 143 -159 48 -1
$$ packed form
7710a73qK62K66k50k33M46l17j42k1QL06j80J07M8j43r8q2J62O2j73J22j6L0J24
7734A07k09R0J5j29O7nJ23j15P2m1l06L54o1N3J62l23Q1J02p5K46j9N7l92J9L3
7759i4k99L67P3K6J9R3l70L84l05N4n0R8K15l47K6k30L49J5j65M17k44O8lm99
7783d02K79R7J28q1O2J54k28O9J52l01J13O6J06j91N4K44k23o4j16K61o7l9j25
7806e2j5K49l95J25l22L88j6J98q7k33L50l07J22J73j06j25J89j94R5k7n3J59
7828A16j04l32J72K08k33O9L48k26k5r5L76l12Q7j93R0K07O2k05j07J16j97o6
7850b44L56k20J1L9k13N85j56j35J28k15J00k4Q0l64M66j76k06K93J53m05K47
7871A00N5J02Q0m47P1j68K64k8K22r3Q4k70j99J81Rl0LL02j06J56j45l02K07m9
$$ plain form
7895 -1 94 -259 -96 -449 94 60 -87 -215 45 108 245 -162 169 58 250 -30 10 53 -46 121 155 162 -60 -24
7919 -24 144 322 291 232 -88 -137 -168 -44 -90 278 -62 -3 -246 135 55 -81 -149 47 0 52 -37 -83 -31 34 36 -33
7945 -33 42 -92 -140 62 3 78 -111 59 -66 -13 55 -190 -18 -158 -94 40 55 47 -108 22 271 55 10 27
7969 27 62 -10 184 109 74 -192 -91 -160 -86 -34 -26 1 194 65 -10 19 -45 199 192 -131 70 238 164 -298 -3 -150
7995 -150 -101 116 -56 -159 -75 151 154 -67 220 -77 -56 -19 37 125 -101 176 -17 138 -118 -25 -124 254 235 145
8019 145 -267 -238 48 85 170 100 -25 138 -321 -48 -139 71 4 -313 -192 119 -53 -210 -102 140 91 29 59
8042 59 101 92 -58 132 64 27 103 23 56 -158 -186 -57 -95 206 98 -59 -158 55 85 -197 -49 27 137 -135 9
8067 9 -265 -60 23 15 -223 152 -221 -46 145 -208 -78 -46 216 65 118 1 -221 -60 -84 58 97 -67 -77
$$ packed form
7895aR5l53J63l53N43l4j47j28K60O3J37m07L31j11J92k80M0M3r9J67L4Pk22L6
7919b4J68J78l1n9l20m9l1J24m6L68l40N9k43L81q0j36o8J96m7N2q9m6N2O5Ko9
7945c3P5j34m8K02n9P5j89J70j25N3O8k45J72j40O4J34J5qj55J30K49k16m5J7
7969B7L5p2J94p5l5k66J01o9P4N2QK7J93j29p5K9o4K44pl23K01J68p4m62K95j47
7995a50M9K17j72j03Q4K26Lk21K87k97K1L7N6Q8k26K77j93J55k56R3r9L78j9r0
8019A45m12K9K86L7Q5p0j25J63m59K73r1K10o7l17J21L11j72j57J08K42m9o2L0
8042E9M2rj50J90o8l7P6q0L3k14k8J29l8L01j08j57r9K13L0k82J48P6J10k72J44
8067Ik74K05Q3qk38L75l73J75J91l53J30L2K62j51N3j17k22J61k4J42L9j64j0
$$ plain form
8090 -77 62 -74 -19 -233 196 165 91 168 -33 12 -108 6 -36 -75 149 -148 138 -208 -126 151 315 460 -162
8113 -162 0 -95 28 85 200 32 -176 225 -11 58 -77 3 -212 201 -49 -47 -19 -7 69 -164 67 -38 -229
8136 -229 -319 149 -32 -18 161 -42 -260 -225 -185 -170 -235 157 -91 77 -134 188 38 -166 250 -93 79 -195
8158 -195 -60 -101 -122 -79 124 115 -93 -26 63 137 192 29 -85 44 -62 -39 163 -49 279 -215 87 106 140 -10
8182 -10 -172 -274 -81 278 -124 2 41 -86 52
$$ packed form
8090g7J39j36N5k14M29l1p4P7k01M5j20J14m2l9K24k97K86l46Q2K77J64J45o22
8113a62J62r5J23N7J15j68k08M01k36O9j35Q0k15M13k50KK8J2P6k33K31j05j91
8136b29r0M68j81J4J79k03k18L5M0J5o5L92k48J68k11L22j50k04M16l43J72k74
8158a95J35m1k1M3K03rk08O7Q9P4N5j63j14J29j06K3K02k12L28m94L02J9L4j50
8182a0j62j02J93L59m02J26L9j27J38
8191E2
$$ Imaginary data points
##PAGE= N=2
##DATA TABLE= (X++(I..I)), XYDATA
$$ plain form
0 0 0 0 0 0 0 0 0 0 0 0 0 0 0 0 0 0 8 -8 8 -8 8 -8 11 -16 16 -16 24 -24 32 -32 40 -43 48 -56 64 -70 79 -89
38 -89 98 -108 122 -133 148 -163 181 -198 221 -241 264 -294 322 -355 394 -433 480 -533 593 -664
58 -664 746 -845 967 -1121 1316 -1581 1956 -2531 3506 -5453 10797 -54088 -154954 40119
72 40119 88003 -17031 -18541 23068 -3384 11244 59335 9403 -47596 25339 37940 -27321
84 -27321 -5576 12878 -2724 28474 -155 -59273 -11770 47507 -7790 -56945 8568 28953
96 28953 -33646 10315 45252 -35100 -15409 51790 -8737 -36040 40367 47391 -22487 -7209
108 -7209 41333 -10746 -15406 55637 -514 -65871 8385 46593 6672 -11043 -17347 -16723 11623
121 11623 24150 -20299 -34524 20657 8721 -25861 25245 15464 -39750 9861 33784 -32602
$$ packed form
0@%%%%%%%%%%%%%%%%Qj6J6j6J6j6J9k7L2l2M0m8N6o4P2q3R1j04J20j34J49j68
38h9J87k06K30k55K81l11L44l79M19m62N05n58O16o77P49q27R13j013J126j257
58f64J410j591J812k088K437k897L537m487O037q959J6250o4885j00866J95073
72D0119M7884j05034j510M1609k6452J4628M8091m9932n6999P2935J2601o5261
84b7321K1745J8454j5602L1198k8629n9118M7503N9277n5297m9155O5513K0385
96B8953o2599M3961L4937q0352J9691O7199o0527k7303P6407P024o9878J5278
108g209M8542n2079m660P1043n6151o5357P4256L8208l9921j7715o304O24K8346
121A1623J2527m4449j4225N5181j1936l4582N1106r781n5214M9611K3923o6386
$$ plain form
133 -32602 -25213 44889 19206 -47027 1083 46291 -19860 -25812 22034 -8617 -16852 12559 -9470
146 -9470 -14927 21567 13232 -31158 -16560 24628 -1305 -15963 13481 -13074 -17941 34817 9274
159 9274 -33083 2672 15738 -19607 -12496 23254 -2190 -28880 14627 10992 -27838 13532 20597
172 20597 -37042 -13728 33075 4402 -19030 9113 14216 -13629 4873 22885 -16254 -7523
184 -7523 24116 -7660 -7866 22138 -3316 -16561 13782 9848 -24325 -8832 24746 -5213 -18890
197 -18890 17210 -3881 -21008 24441 12481 -30412 -6233 22850 3098 -8042 12462 3870
209 3870 -13910 17734 15589 -20951 6768 22017 -15414 -5570 20972 2326 -11251 3364 1714
222 1714 -16392 4730 15614 -22892 -12805 21266 -8893 -16115 13551 -1731 -17740 5046
$$ packed form
133c2602P389P0102k5683o6233M8110M5208o6151n952M7846l0651q235K9411k2029
146i470n457L6494q335m4390J4598M1188k5933j4658K9444k6555m867N2758k5543
159I274m2357L5755J3066l5345P111L5750k5444k6690M3507l635l8830M1370P065
172B0597n7639K3314M6803k8673k3432K8143N103k7845J8502J8012l9139Q731
184g523L1639l1776k06L0004k5454j3245L0343l934l4173J5493L3578k9959j3677
197a8890L6100k1091j7127M5449j1960m2893K4179K9083j9752j1140K0504q592
209C870j7780L1644k145l6540K7719J5249l7431R844K6542j8646j3577J4615j650
222A714j8106K1122J0884l8506J0087L4071l0159p222K9666j5282j6009K2786
$$ plain form
234 5046 11172 -12247 -4700 22021 -2074 -15686 19091 6666 -16131 14531 12160 -15981 -200
247 -200 14744 -1369 -7901 7491 -3377 -19814 9683 10568 -24940 -3970 13198 -14889 -7678
260 -7678 11010 -6528 -13188 7088 7003 -14951 2190 21407 -10815 -9272 21737 137 -9344
273 -9344 14627 4574 -9711 6807 12563 -7708 -7064 14900 -2717 -17685 10364 1947 -17824
286 -17824 6466 5185 -16747 -1772 10108 -6395 -11206 9306 4593 -14937 8155 15464 -13987
299 -13987 1525 18295 -6906 -3547 14700 1976 -7877 6887 10033 -9954 -3076 14691 -8426
312 -8426 -10669 13137 -4802 -12686 8455 186 -11705 1525 7454 -7968 -7590 12170 -201
325 -201 -13206 11211 5731 -13540 8103 10013 -10274 -67 11086 -1976 -7918 8112 6676
$$ packed form
234E046O126k3419P547K6721k4095j3612L4777j2425k2797L0662k371k8141J5781
247b00J4944j6113o532J5392j0868j6437K9497Q85l5508K0970J7168k8087P211
260g678J8688j7538o660K0276q5k1954J7141J9217l2222J543L1009k1600r481
273i344K3971j0053j4285J6518N756k0271O44K1964j7617j4968K8049q417j9771
286a7824K4290j281k1932J4975J1880j6503m811K0512m713j9530K3092P309k9451
299a3987J5512J6770k5201L359J8247j2724r853J4764L146j9987O878J7767k3117
312h426k243K3806j7939p884K1141q269j1891J3230N929j5422L78J9760j2371
325b01j3005K4417n480j9271K1643J910k0287J0207J1153j3062n942J6030j436
$$ plain form
338 6676 -12844 2754 11456 -12525 -1826 11668 -8982 -6139 9311 -1167 -9014 3352 6919
351 6919 -9412 -3766 12475 -6342 -8125 13148 -2832 -11063 9852 3394 -9763 701 7928
364 7928 -5231 -7405 10399 901 -12470 8705 6156 -12629 5125 9022 -7711 -1080 8426
377 8426 -741 -6326 5876 6244 -9749 2002 10260 -10304 -2398 10591 -7565 -7525 7383 -403
391 -403 -8928 361 5279 -7710 -4832 10532 -5252 -8358 11902 991 -8989 7762 5734 -4648
405 -4648 2416 8207 -1985 -4519 10776 3503 -11054 5580 6397 -9830 1528 4107 -9284 -2781
419 -2781 5745 -3974 -10439 1590 4784 -9385 -1404 6910 -8741 -806 11934 -4790 -5753 9089
433 9089 6014 -2919 1076 7268 -975 527 10533 -4061 -7450 11092 1256 -10399 2131 1384
$$ packed form
338F676j9520J5598Q702k3981J0699J3494k0650K843J5450j0478p847J2366L567
351F919j6331N646J6241j8817j783K1273j5980q231K0915o458j3157J0464P227
364G928j3159k174J7804r498j3371K1175k549j8785J7754L897j6733O631R506
377H426r167n585J2202L68j5993J1751Q258k0564P906J2989j8156M0J4908p786
391d03q525R289M918j2989K878J5364j5784l106K0260j0911r980J6751k028j0382
405d648P064N791j0192k534J5295p273j4557J6634Q17j6227J1358K579j3391O503
419b781Q526r719o465J2029L194j4169P981Q314j5651P935J2740j6724r63J4842
433I089l075q933L995O192q243J502J0006j4594l389J8542r836j1655J2530p47
$$ plain form
447 1384 -6378 -1088 2238 -7259 -8607 6844 1746 -13903 897 6551 -5852 1777 4010 -4956
461 -4956 2842 9554 204 -5615 5970 9622 -4593 770 9067 -5834 -952 10058 -5127 -8114
475 -8114 4662 2231 -6662 -3954 2676 -4134 -4691 4971 -5333 -7925 8390 133 -8671 4517
489 4517 4820 -3735 300 6872 1089 -4783 6550 6206 -6355 3703 6139 -5477 2205 4275 -5715
504 -5715 -1658 3789 -1896 -6060 1728 3831 -8877 -1538 9103 -7177 -6844 7723 -175 -4837
518 -4837 2269 2098 -1923 354 4968 -1633 -3947 6530 33 -4565 7218 -608 -6514 6326 4591
533 4591 -6572 -3586 5683 2105 -6254 1221 3048 -5279 3581 3330 -8555 541 6457 -3247 -3085
548 -3085 2133 754 -2222 1970 3038 -8449 -1220 10722 -4809 -8167 5523 2638 -1423 -61
$$ packed form
447A384p762N290L326r497j348J5451n098j5649J4800N654j2403P629K233q966
461d956P798O712r350n819J1585L652j4215N363Q297j4901M882J1010j5185k987
475h114J2776k431q893K708O630o810n57R662j0304k592J6315q257q804J3188
489D517L03q555M035O572n783n872J1333l44j2561J0058K436j1616P682K070r990
504e715M057N447n685m164P788K103j2708P339J0641j6280L33J4567p898m662
518d837P106j71m021K277M614o601k314J0477o497m598J1783p826n906J2840j735
533D591j1163K986R269l578q359P475J827q327Q860k51j1885R096N916r704J62
548c085N218j379k976M192J068j1487P229J1942j5531l358J3690k885m061J362
$$ plain form
562 -61 -1846 -924 3059 4014 -3816 -4747 8002 2362 -4634 5642 -323 -5986 5888 4667 -6429
577 -6429 -4269 5224 2958 -6395 -649 2529 -6003 400 2828 -7078 -1046 4209 -2742 -1950 2292
592 2292 375 -2232 2510 5329 -4466 -1060 10040 -711 -3277 6443 1791 -974 2181 -320 -2203
607 -2203 1210 3953 -3936 -7209 4402 759 -7334 1018 -1781 -7048 2551 3468 -4196 -4109 2892 4133
623 4133 -2799 530 4244 -2671 3299 5962 -2806 2561 5695 -2103 -222 3930 306 -4214 -306
638 -306 4425 -4410 -4990 3930 -3694 -5170 2969 -3553 -6193 689 1367 -1823 -1736 2509 -127 -2915
654 -2915 5334 2565 -3732 4755 3174 -2394 4381 4859 -1269 -1683 1967 2362 -2459 -26 1158 -5779
670 -5779 967 3811 -6405 -3211 2151 -3352 -3125 1178 465 -3141 -852 4837 -1738 -2823 5540
$$ packed form
562f1j785R22L983R55p830r31J2749n640o996J0276n965n663J1874j221j1096
577f429K160R493k266r353N746L178q532O403K428r906O032N255o951P92M242
592B292j917k607M742K819r795L406J1100j0751k566R720m652k765L155k501j883
607b203L413K743p889l273J1611l643q093Q352k799n267R599R17p664Q7P001J241
623D133o932L329L714o915N970K663q768N367L134p798J881M152l624m520L908
638c06M731q835n80Q920p624j476Q139o522k640O882O78l190Q7M245k636k788
654b915Q249k769o297Q487j581n568O775M78o128m14L650L95m821K433J184o937
670e779O746K844j0216L194N362n503K27M303p13l606K289N689o575j085Q363
$$ plain form
685 5540 -208 -2058 5411 976 -1988 2776 3297 661 -1176 1343 -414 -2481 4395 328 -6866
700 -6866 1947 2363 -3822 76 696 -3355 -2380 1554 1570 -3320 90 2974 -3454 1117 5082 -3263
716 -3263 -1646 3624 31 -99 1804 1452 -1213 -535 3583 -1989 -2998 4476 -879 -3362 3521 171
732 171 -2465 1294 641 -1428 -1817 1481 171 -2784 3399 1197 -5295 1587 2705 -2594 -4 -169
748 -169 -2377 -232 2190 1277 -3931 -475 3695 -2592 -109 3696 -3193 -753 4133 -141 -191 1483
764 1483 1527 -1225 -395 3662 -741 -2860 3576 -990 -3267 2242 -847 -2997 347 72 -2249 -2373
780 -2373 1167 590 -3439 1727 1199 -4005 2187 3005 -1909 1299 2276 295 1044 2652 2638 -1987 254
797 254 4594 -1663 -528 2870 -3352 -1408 2059 -1895 -2716 -1158 -495 -2359 -2904 1754 -1439 -3195
$$ packed form
685E540n748j850P469m435k964M764N21k636j837K519j757k067O876m067p194
700f866Q813M16o185L898O20m051R75L934J6m890L410K884o428M571L965q345
716c263J617N270l593j30J903l52k665O78M118n572j009P474n355k483O883l350
732A71k636L759o53k069l89L298j310k955O183k202o492O882J118n299K590j65
748a69k208K145K422r13n208L456M170o287K483L805o889K440M886m274n0J674
764A483M4k752Q30M057m403k119O436m566k277N509l089k150L344k75k321j24
780b373L540n77m029N166n28n204O192Q18m914L208R77j981P49J608j4m625K241
797B54M340o257J135L398o222J944L467l954q21J558O63j864n45M658l193j756
$$ plain form
813 -3195 3105 -480 -2515 3504 808 -1275 2287 2260 1062 142 2735 2788 -1664 2408 2496 -2915 1648
830 1648 1987 -3272 -506 257 -1820 -1992 -1240 -211 -3657 -2157 1784 -3067 -1630 2486 -2295 -748
846 -748 3003 33 -74 1295 2376 1253 215 3581 709 -1524 4079 680 -2294 2596 -8 -2264
862 -2264 -144 -225 -1235 -2369 -280 -88 -3964 128 998 -3786 660 1645 -2434 339 1770 19
878 19 247 1005 2081 -343 613 3741 -1459 -308 3798 -1410 -1074 2087 -746 -840 2 259 -925 -2296
896 -2296 1498 -808 -3457 1707 -219 -2846 1658 124 -1502 1049 483 55 -809 1013 1806 -2157
912 -2157 686 2419 -2300 1144 2343 -1989 -85 1190 -231 -496 -463 977 -1115 -641 2274 -1799
928 -1799 -1259 3035 -1342 -1413 1591 -309 -455 154 211 -706 -1713 1675 -88 -2949 1236 262 -2036
$$ packed form
813c195O300l585k035O019k696k083L562k7j198r20K593N3m452M072Q8n411M563
830A648L39n259K766P63k077j72P52J029l446J500L941m851J437M116m781J547
846g48L751k970j07J369J081j123j038L366k872k233N603l399k974M890k604k256
862b264K120q1j010j134K089J92l876M092Q70m784M446R85m079K773J431j751
878A9K28P58J076k424R56L128n200J151M106n208L36L161k833r4Q42K57j184j371
896b296L794k306k649N164j926k627M504j534j626K551n66m28q64J822P93l963
912b157K843J733m719L444J199m332J904J275j421k65L3J440k092M74K915m073
928a799N40M294m377p1L004j900j46O09N7r17j007L388j763k861M185r74k298
$$ plain form
945 -2036 1333 -392 -1647 974 650 -484 -818 1557 2189 -1891 857 2169 -1888 1167 2279 -1440
961 -1440 89 1082 358 -66 -969 288 -1104 -1119 1100 -2721 -2192 2166 -1743 -2089 868 -627 -794
978 -794 39 808 360 -1101 1971 1776 -1539 2249 1775 -675 2709 851 -874 1294 916 123 -1262
995 -1262 -208 1120 -2824 -976 1125 -3118 -1375 655 -2435 -733 -316 -476 -140 -744 980 -137
1011 -137 65 3025 -356 -504 3809 345 -60 2614 930 40 111 1041 967 -1922 139 85 -2603 240
1029 240 -818 -3078 437 -993 -2115 -652 -553 -248 -829 -34 1451 -1665 919 3268 -731 729
1045 729 2414 398 1444 1135 282 475 148 1348 -516 -1114 1523 -1765 -2270 1247 -1651 -2134 172
1062 172 -891 -1400 -1326 -73 512 -1800 516 1402 -1087 1748 746 -1311 2298 1389 -415 1473 679
$$ packed form
945b036L369j725j255K621l24j134l34K375O32m080K748J312m057L055J112l719
961a440J529R93p24m24r03J257j392j5K219l821N29M358l909l46K957j495j67
978g94Q33P69m48j461L072j95l315L788m74k450L384j858j725K168l78p93j385
995a262J054J328l944J848K101m243J743K030l090J702M17j60L36o04J724j117
1011a37K02K960l381j48M313l464m05K674j684q90P1R30p4k889K061n4k688K843
1029B40j058k260L515j430j122J463R9L05n81P95J485l116K584K349l999J460
1045G29J685k016J046l09q53J93l27J200j864n98K637l288n05L517k898m83K306
1062A72j063n09P4J253N85k312K316Q86k489K835j002k057L609r09j804J888p94
$$ plain form
1079 679 722 -110 250 1685 -1880 -427 2129 -2211 -1228 600 -1296 36 -219 -994 -758 -925 1074
1096 1074 -727 -1705 1869 -344 -1347 2349 -331 -783 1238 329 259 -241 318 721 -1371 680 1146
1113 1146 -1700 1033 726 -1652 967 551 -1054 277 98 589 -305 -192 1430 -1092 -630 1895 -1423
1130 -1423 -391 1201 -1131 -18 89 -765 -231 -552 963 -323 -1839 1286 -654 -912 1997 -436
1146 -436 -667 1074 590 488 438 507 1120 -478 1005 1062 -1592 946 731 -2024 464 12 -1377 -661
1164 -661 -1053 -385 -1148 -1052 752 -1340 -827 1617 -1294 -200 1494 -427 745 1318 412 1063 140 1549
1182 1549 1055 -626 1593 328 -1043 1448 -570 -1259 517 -902 -1122 -1166 -1036 -330 -1846 -666 357
1199 357 -2005 88 921 -1156 888 771 -140 850 731 1680 743 572 1992 55 291 1905 -600
$$ packed form
1079F79M3q32L60J435l565J453K556m340R83J828j896J332k55p75K36j67J999
1096A074j801r78L574k213j003L696k680m52K021r09p0n00N59M03k092K051M66
1113A146k846K733l07k378K619m16j605J331j79M91q94J13J622k522M62K525l318
1130a423J032J592k332J113J07q54N34l21J515j286j516L125j940k58K909k433
1146d36k31J741m84j02n0O9O13j598J483N7k654K538k15k755K488m52j389P16
1164f61l92O68p63R6J804k092N13K444k911J094J694j921J172N73r06O51r23J409
1182A549m94j681K219j265j371K491k018o89J776j419k20m4J30P06j516J180J023
1199C57k362K093Q33k077K044j17r11R90j19R49r37j71J420j937K36J614k505
$$ plain form
1216 -600 -254 893 -942 -229 -316 -1441 -420 -1613 -401 -1060 -2028 214 -757 -1765 1048 -310 -973
1233 -973 954 273 836 482 650 1433 -317 1344 1937 -655 1148 1335 -953 973 -247 -741 -176
1250 -176 -889 -336 -874 -1256 276 -1629 -1113 1010 -1719 -954 739 -739 25 388 -26 506 -204 1096
1268 1096 918 -730 1742 1081 -645 1271 91 -723 734 -17 -82 -334 -552 276 -1320 -131 843
1285 843 -1833 -178 644 -1289 153 59 -547 230 155 511 174 -418 1778 -278 -569 1398 -999 -674
1303 -674 1007 -294 216 150 -120 444 -521 458 218 -1070 988 116 -720 1080 -155 -647 692 -240
1321 -240 18 -305 -488 564 -770 -4 732 -1299 -295 598 -1109 173 -154 -731 258 67 488 219
1339 219 -415 899 -108 -36 1654 -371 -31 1654 -246 176 281 -329 296 -759 273 350 -1787 -146
$$ packed form
1216f00L46J147j835P13q7j125J021j193J212o59r68K242r71j008K813j358o63
1233i73J927o81N63l54J68P83j750J661N93k592J803J87k288J926j220m94N65
1250a76p13N53n38l82J532j905N16K123k729P65J693j478P64L63m14N32p10J300
1268A096j78j648K472o61j726J916j180q14J457p51o5k52k18Q28j596J189R74
1285H43k676J655Q22j933J442r4o06P77p5L56l37n92K196k056k91J967k397L25
1303f74J681j301N10o6k70N64r65R79k40j288K058q72q36J800j235m92J339r32
1321b40K58l23j83J052j334P66P36k031J004Q93j707J282l27n77R89j91M21k69
1339B19o34J314j007P2J690k025L40J685j900M22J05o10O25j055J032P7k137J641
$$ plain form
1357 -146 -264 -1779 401 -834 -1424 253 -474 114 -188 -266 942 -374 577 1382 -717 987 1768 -90
1375 -90 1192 892 -153 579 108 158 -80 -1178 447 -722 -1574 234 -1406 -1357 114 -1163 -708 -275
1393 -275 -855 37 -453 237 858 -839 1269 1169 -408 1336 997 154 1308 478 660 389 -144 828
1411 828 -554 -345 385 -1760 -669 372 -1624 -560 -548 -1257 -83 -632 -50 -143 -1048 1001 117 -316
1429 -316 1432 121 104 1434 79 593 815 460 849 -6 468 610 -1378 154 193 -1308 400 -654
1447 -654 -1229 -169 -911 -389 -128 -569 424 -594 -314 989 -569 395 1380 -338 195 794 109 475
1465 475 171 464 501 -272 784 -74 -865 595 -545 -691 474 -561 -492 -33 -459 188 -678 207 345
1484 345 -997 387 502 -772 586 84 -493 600 -27 298 -13 -323 323 -459 -266 1158 -779 53
$$ packed form
1357a46j18j515K180j235n90J677p27N88l02p8J208j316R51Q05k099J704P81j858
1375i0J282l00j045P32m71N0k38j098J625j169q52J808j640M9J471j277M55M33
1393b75n80Q92m90O90O21j697K108j00j577J744l39q43J154q30J82k71n33R72
1411H28j382K09P30k145J091J041j996J064J2p09J174n49N82r3r05K049q84m33
1429c16J748j311j7J330j355N14K22l55L89q55M74J42j988J532L9j501J708j054
1447f54n75J060p42N22K61m41R93j018K80J303j558R64R85j718N33N99o85L66
1465D75l04K93L7p73J056q58p91J460j140j46J165j035O9M59m26O47q66Q85J38
1484C45j342J384J15j274J358n02n77J093o27L25l11l10O46p82J93J424j937Q32
$$ plain form
1502 53 767 -737 117 350 81 172 -211 156 410 -546 732 107 -1180 777 -377 -997 435 -576
1520 -576 -159 -6 -635 -229 -704 -185 373 -931 422 398 -591 350 377 -308 652 120 285 419 219 842
1540 842 -91 179 1066 -735 -165 877 -801 -523 -56 -526 -42 -846 -743 -281 -1286 -27 -234 -470
1558 -470 707 -405 -285 837 130 404 769 314 1021 136 721 1275 -410 638 585 -741 428 76
1576 76 -782 66 -566 -590 -479 -1247 -261 -1058 -1055 336 -936 -356 659 -680 111 382 58 615 266 882
1596 882 1091 127 1132 811 -88 1200 197 -333 540 -614 -569 -115 -801 -74 -873 -592 58 -1356 -262
1615 -262 99 -931 -151 -54 -663 575 340 163 656 227 923 746 158 1410 -111 24 820 -541 241
1634 241 349 -509 70 -272 -455 -134 -1135 -103 -346 -1165 12 -389 -844 631 -166 -84 464 -62 664
$$ packed form
1502E3P14j504Q54K33k69R1l83L67K54r56J278o25j287J957j154o20J432j011
1520e76M17J53o29M06m75N19N58j304J353k4r89R41K7o85R60n32J65J34k00O23
1540H42r33K70Q87j801N70J042j678K78M67m70M84q04J03M62j005J259k07k36
1558d70J177j112J20J122p07K74L65m55P07q85N85N54j685J048n3j326J169l52
1576G6q58Q48o32k4J11p68R86p97LJ391j272N80J015j339P91K71l24N57l49O16
1596H82K09r64J005l21q99J288j003n30Q73j154M5M54o86P27p99K81O50j414J094
1615b62L61j030P80R7o09J238k35j77M93m29O96j77n88J252j521J35P96j361P82
1634B41J08q58N79l42j83L21j001J032k43q19J177m01m55J475p97Q2N48n26P26
$$ plain form
1653 664 8 295 898 -380 250 858 -278 396 228 -651 353 -9 -481 -101 -409 232 -277 -797 423
1672 423 -666 -425 375 -655 -252 423 -51 120 -256 167 601 -348 493 416 -713 776 104 -365 614
1691 614 -156 -280 340 -187 252 -317 -125 664 -341 211 594 -405 20 544 -371 253 44 -161 -64 -475
1711 -475 275 -320 -755 453 -261 -514 369 -596 -166 203 -409 489 40 290 664 -243 508 446 -153 836
1731 836 311 -201 773 197 153 405 -153 217 -241 -548 437 -695 -380 215 -1155 -277 -236 -785 51 -102
1751 -102 -112 164 -37 567 468 -249 1008 353 161 1141 141 546 599 20 422 40 27 352 -714 -164
1771 -164 -147 -1133 -216 -699 -1047 -131 -635 -670 85 -477 82 12 125 614 53 305 1118 246 710 698 260
1792 260 705 429 339 548 62 428 85 -664 157 -787 -782 41 -519 -501 -311 -843 -183 -407 -305 246 -180
$$ packed form
1653F64o56K87O03j278O30O08j136O74j68q79J004l62m72L80l08O41n09n20J220
1672D23j089K41Q00j030M03O75m74J71l76M23M34r49Q41p7j129J489o72m69R79
1691F14p70j24O20n27M39n69J92P89j005N52L83r99M25N24r15O24k09k05R7m11
1711d75P50n95m35J208p14k53Q83r65M30L69o12Q98m49K50L74r07P51o2n99R89
1731H36n25n12R74n76m4K52n58L70m58l07R85j132L15N95j370Q78M1n49Q36j53
1751a02j0K76k01O04r9p17J257o55j92R80j000M05N3n79M02l82j3L25j066N50
1771a64J7r86R17m83l48R16n04l5P55n62N59p0J13M89n61K52Q13q72M64j2m38
1792B60M45k76r0K09m86L66l43p49Q21r44NQ23n60J8J90n32O60k24J02N51m26
$$ plain form
1813 -180 245 484 -136 801 705 160 982 445 372 713 23 650 75 -163 506 -791 69 425 -599 -205
1833 -205 -124 -584 -39 -420 -212 234 -534 101 -63 -405 622 -398 -291 951 -56 262 924 4 886
1852 886 -9 335 233 -28 259 478 -453 302 28 -574 10 -352 -335 -121 -429 3 -50 -457 431 -324 -131
1873 -131 656 -567 51 429 -327 197 33 15 351 -343 531 -209 -558 265 -171 -518 634 -100 -201 347
1893 347 -167 407 -64 2 448 -522 -177 210 -700 259 115 -534 172 -252 -394 57 -526 6 -188 -254 259
1914 259 -304 -330 473 -515 395 391 -206 410 490 358 604 46 277 510 -143 681 185 -430 359 -121 3
1935 3 -124 -717 68 -538 -344 -37 -795 -528 18 -848 -38 211 -196 616 286 -18 568 18 566 445 186
1956 186 902 224 255 521 -622 97 48 -715 49 -272 -420 51 -621 -333 -396 -606 10 -326 -250 383 -98
$$ packed form
1813a80M25K39o20R37r6n45Q22n37p3L41o90O27n75k38O69j297Q60L56j024L94
1833b05Q1m60N45l81K08M46p68O35j64l42J027j020J07J242j007L18O62r20Q82
1852H86q95L44j02k61K87K19r31P55k74o02N84l62J7K14l08M32n3m07Q88p55J93
1873a31P87j223O18L78p56N24j64j8L36o94Q74p40l49Q23m36l47J152p34j01N48
1893C47n14N74m71O6M46r70L45L87r10R59j44o49P06m24j42M51n83N32j94o6N13
1914B59n63k6Q03r88R10mn97O16Q0j32K46n58K31K33o53Q24m96o15P89m80J24
1935Cj27n93P85o06J94L07p58K67N46q66Q10K49m07Q12l30l04N86n50N48j21k59
1956A86P16o78L1K66j143P19m9p63P64l21j48M71o72K88o3k10O16l36P6O33m81
$$ plain form
1977 -98 -60 748 -5 618 282 117 607 85 507 976 86 377 407 -281 396 -31 -407 26 -652 -241 -64
1998 -64 -687 -109 -720 -904 390 -359 -207 290 -427 179 -244 238 458 7 377 624 102 738 201 -221
2018 -221 830 -3 -84 97 -308 -291 -33 -528 -92 -451 -264 219 -747 -82 -58 -306 436 -113 -281 -9 -215
2039 -215 293 225 -352 630 113 -234 755 -127 61 395 -524 211 -68 -80 196 -335 320 14 -458 223 -51
2060 -51 -536 415 40 -69 364 -259 131 -131 -441 423 -142 -80 311 -490 81 -128 -516 349 64 -234 107
2081 107 -364 368 209 -383 324 -117 -114 659 -201 196 389 -375 190 -32 -79 -84 -267 -222 339 -387 411 -92
2103 -92 -572 195 -241 -250 97 -371 84 143 -121 466 -54 -11 443 -138 476 334 -9 331 299 96 575 -209
2125 -209 -136 105 -404 146 -290 -570 198 -555 -273 131 -680 -27 -124 -265 255 -39 -9 516 -271 593 456
$$ packed form
1977i8L8Q08p53O23l36j65M90n22M22M69q90K91L0o88O77m27l76M33o78M11J77
1998f4o23N78o11j84J294p49J52M97p17O06m23M82K20m51L70K47n22O36n37m22
2018b21J051q33q1J81m05J7K58m95M36l59J87M83r66O65K4k48P42n49j68K72k06
2039b15N08o8n77R82n17l47R89q82J88L34r19P35k79j2K76n31O55l06m72O81k74
2060e1m85R51l75j09M33o23L90k62l10Q64n65O2L91q01N71k09l88Q65k85k98L41
2081A07m71P32j59n92P07m41LP73q60L97J93p64N65k22m7nj83M5N61p26P98n03
2103i2m80P67m36rL47m68M55N9k64N87n20M3M54n81O14j42l43L40l2k03M79p84
2125b09P3K41n09N50m36k80P68p53K82M04q11O53r7j41N20k94L0N25p87Q64j37
$$ plain form
2146 456 2 499 391 387 617 -83 258 164 -181 411 -157 -208 -18 -542 -247 -48 -576 75 -259 -734 154
2167 154 -370 22 163 -87 449 374 -63 635 237 400 735 191 460 379 0 555 -139 72 162 -505 -17
2188 -17 -109 -1015 -228 -572 -362 -290 -610 -45 -39 -37 154 -223 -181 434 -17 111 643 -265 447 399 -10 501 -5
2211 -5 290 171 -142 195 13 -462 160 -475 -614 -29 -504 101 38 -470 80 -459 107 246 -263 262 448
2232 448 -303 294 153 -201 812 -64 250 108 -217 203 -71 25 645 -244 -233 130 -615 161 -117 -54 74
2253 74 -205 -46 74 -283 420 -15 -521 373 -280 -9 443 -280 96 31 -378 162 -119 4 188 -430 290
2274 290 145 -191 176 51 -151 240 -211 117 203 -77 438 86 18 311 -337 94 376 -513 -59 -140 -333
2295 -333 160 -576 -171 -133 -786 57 -147 -256 508 35 -69 402 -205 446 254 28 413 86 248 347 -188
$$ packed form
2146D56m54M97j08mK30p00L41r4l45N92n68n1J90n24K95J99n28O51l34m75Q88
2167A54n24L92J41k50N36p5m37O98l98J63L35n44K69q1l79N55o94K11R0o67M88
2188a7r2r06P87l44K10P2l20N65OKJ91l77M2O15m51J28N32r08P12m8m09N11n06
2211eK95j19l13L37j82m75O22o35j39N85m75O05o3n08N50n39N66J39n09N25J86
2232D48p51N97j41l54J013q76L14j42l25M20k74R6O20q89J1L63p45P76k78O3J28
2253G4k79J59J20l57P03m35n06Q94o53K71M52p23L76o5m09N40k81J23J84o18P20
2274B90j45l36L67j25k02L91m51L28Q6k80N15l52o8K93o48M31K82q89M54q1j93
2295c33M93p36M05L8o53Q43k04j09P64m73j04M71o07O51j92k26L85l27J62R9n35
$$ plain form
2316 -188 393 158 -328 298 -72 -107 154 -580 -122 -263 -489 104 -407 -409 -68 -354 -247 -14 -396 460 310
2337 310 214 306 292 -60 463 -15 263 105 -19 373 216 -152 375 -440 -177 26 -526 205 -425 -641 -445
2358 -445 -647 -103 -267 -398 417 -95 -61 347 109 366 429 -81 528 257 104 530 197 20 444 -481 -11
2379 -11 -181 -449 234 -412 -494 -3 -399 -208 -64 -614 371 -260 -211 215 -162 -53 -110 -194 647 118 -136 466
2401 466 10 227 463 129 491 36 -474 270 -192 -48 241 -348 -265 -188 -590 1 -181 -173 100 -477 -234
2422 -234 -5 -264 251 -449 27 319 -3 295 -70 -220 163 -58 -210 438 36 -131 65 3 182 -167
2442 -167 -2 566 -546 44 282 -317 325 203 -354 42 -464 -331 103 -170 351 65 -67 275 -140 -345
2462 -345 417 -380 -96 85 -100 288 -282 -147 303 -282 -121 147 -269 215 29 -105 257 -277 194 210
$$ packed form
2316a88N81k35m86O26l70l5K61p34M58j41k26N93n11kL41k86J07K33l82Q56j50
2337C10r6R2j4l52N23m78K78j58j24L92j57l68N27q15K63K03n52P31o30k16J96
2358d45k02N44j64j31Q15n12L4M08k38K57O3n10O09k71j53M26l33j77M24r25M70
2379a1j70k68O83o46q2M91l96J91J44n50R85o31M9M26l77J09n7q4Q41n29k54O02
2401D66m56K17K36l34L62m55n10P44m62J44K89n89Q3P7m02N91j82QK73n77K43
2422b34K29k59N15p00M76K92l22K98l65j50L83k21j52O48m02j67J96o2J79l49
2442a67J65N68j112N90K38n99O42j22n57L96n06J33M34k73N21k86j32L42m15k05
2462c45P62p97K84J81j85L88n70J35M50n85J61K68m16M84j86j34L62n34M71J6
$$ plain form
2482 210 -125 228 -122 -270 2 -489 -142 -201 -326 -211 -166 -616 115 -252 26 361 -79 126 91 166 404
2503 404 100 168 249 41 64 208 65 415 -63 -8 36 -225 67 38 -519 74 -226 -443 60 -446 -399 53
2525 53 -308 -68 13 -170 393 -183 308 390 -5 466 498 131 286 54 106 153 14 320 -140 -447 -22 -484
2547 -484 -289 -41 -649 -313 -125 -305 -152 -150 -388 88 -214 251 156 88 330 93 335 418 126 456 229 198
2569 198 360 221 -2 267 -370 8 124 -321 -147 -108 -647 -187 -460 -282 132 -368 -46 69 37 419 23
2590 23 -333 469 -34 225 222 -107 465 186 -2 497 -141 -168 8 -185 3 44 -25 -96 -200 -7 -65 -417 -89
2613 -89 -210 29 193 -370 -172 271 -253 167 246 -54 486 2 -227 305 -213 91 141 -167 65 55 -97
2634 -97 -30 -340 124 132 -271 203 -102 -190 256 -195 119 45 -147 -33 -1 -226 154 -373 -100 124 -165 432
$$ packed form
2482B10l35L53l50j48K72m91L47n9j25J15M5m50P31l67K78L35m40K05l5P5K38
2503D04l04O8Q1k08K3J44j43L50m78N5M4k61K92k9n57N93l00k17N03n06M7M52
2525E3l61K40Q1j83N63n76M91Q2l95M71L2l67J55k32N2M7j39L06m60l07M25m62
2547d84J95K48o08L36J88j80J53Kk38M76l02M65r5o8K42k37K42Q3k92L30k27l1
2569A98J62j39k23K69o37L78J16m45J74L9n39M60k73J78M14n00L22J15l2L82l96
2590B3l56Q02n03K59ll29N72k79j88M99o38k7J76j93J88M1o9p1j04J93n8l52L28
2613h9j21K39J64n63J98M43n24M20P9l00N40m84k29N32n18L04N0l08K32j0j52
2634i7O7l10M64Qm03M74l05q8M46m51L14p4j92J14L2k25L80n27K73K24k89N97
$$ plain form
2656 432 199 -11 13 153 -130 54 -120 209 157 -165 485 41 1 107 5 188 296 -307 184 -344 108
2677 108 332 -154 111 -56 -320 -195 -101 -489 122 -277 101 132 -309 106 73 -305 187 -210 -11 276 104
2698 104 324 359 38 204 76 -166 147 -49 133 154 -60 107 -301 -94 -58 -432 -245 -176 -246 -67 -275 -102
2720 -102 353 -141 -128 349 -12 178 234 80 408 186 11 158 7 227 109 -335 327 -363 -79 -207 -404
2741 -404 -59 -312 -350 61 -159 -253 -64 -269 100 -152 -148 120 -23 127 335 -91 179 269 29 164 19 -165
2763 -165 257 143 -169 14 -370 -24 -49 -529 -166 -204 -331 57 -253 -174 -59 -227 -29 -195 -38 113 -34
2784 -34 461 172 70 589 55 296 114 -145 249 8 -275 280 -30 -47 5 -277 -163 -254 -465 4 40 -293
2806 -293 76 -213 -106 216 -129 54 146 93 174 -274 164 279 -22 188 -97 -27 -2 -6 -108 -112 -427 -19 -123
$$ packed form
2656D32k33k10K4J40k83J84j74L29n2l22O50m44m0J06j02J83J08o03M91n28M52
2677A08K24m86K65j67k64J25R4l88O11l99L78L1m41M15l3l78M92l97J99K87j72
2698A04K20L5l21J66j28k42L13j96J82K1k14J67m08K07L6l74J87O9p0J79k08J73
2720a02M55m94J3M77l61J90N6j54L28k22j75J47j51K20j18m44O62o90K84j28j97
2741d04L45k53l8M11k20r4J89k05L69k52MK68j43J50K08m26K70R0k40J35j45j84
2763a65M22j14l12J83l84L46k5m80L63l8j27L88l10P9J15j68J98j66J57J51j47
2784c4M95k89j02N19n34K41j82k59L94k41k83N55l10j7N2k82J14r1k11M69L6l33
2806b93L69k89J07L22l45J83R2n3Q1m48M38J15l01K10k85P0K5mj02ml15M08j04
$$ plain form
2829 -123 -259 275 8 -73 -36 -400 -157 268 11 63 109 85 137 -322 292 10 -389 209 -72 -246 61 -156
2851 -156 -148 449 18 68 -395 -373 240 -31 -116 142 -102 145 158 -77 281 -41 8 56 -176 75 -25 -415 289
2874 289 0 -195 -107 -286 117 44 -335 106 30 -344 79 -310 -28 185 133 435 68 -146 246 242 198 390
2896 390 38 196 213 -199 89 -207 4 116 -525 -20 -162 -375 -346 -17 -247 222 -249 -169 -15 -29 401
2917 401 138 106 300 -144 112 248 46 586 302 172 320 -256 268 -16 -535 -311 -336 -98 -14 -437 -306
2938 -306 39 -256 -126 -61 -152 -77 -26 26 210 -235 146 161 3 430 74 123 131 -112 217 225 16 360 -2 -187
2962 -187 72 -472 -190 -188 -146 120 -154 -43 134 -71 -155 153 -223 336 200 -152 49 148 208 588 135 1
2984 1 -19 65 398 119 241 139 -342 61 205 -301 63 -59 -128 285 46 58 -39 -171 164 -90 -199 30
$$ packed form
2829a23j36N34k67q1L7l64K43M25k57N2M6k4N2m59O14k82l99N98k81j74L07k17
2851a56QN97m31N0m63K2O13k71q5K58k44K47J3k35L58l22M9M8k32K51j00l90P04
2874B89k89j95Q8j79M03p3l79M41p6l74M23l89K82K13n2L02l67k14L92mm4J92
2896C90l52J58J7m12K88k96K11J12o41N05j42k13K9L29k30M69m71Q0J54j4M30
2917D01k63l2J94m44K56J36k02N40k84j30J48n76N24k84n19K24k5K38Q4m23J31
2938c06L45k95J30O5r1P5N1N2J84m45L81J5j58M27l56M9Qk43L29Qk09L44l62j85
2962a87K59n44K82KM2K66k74J11J77k05q4L08l76N59j36l52K01R9O0L80m53j34
2984Ak0Q4L33k79J22j02m81M03J44n06L64j22o9M13k39J2r7j32L35k54j09K29
$$ plain form
3006 30 20 207 297 -107 70 140 -87 249 133 20 180 -290 366 230 -404 90 105 -262 87 -319 25 -231
3028 -231 -197 143 -10 -78 207 -251 -159 21 -266 58 -28 -182 -107 -283 -157 207 -147 179 -73 -47 190 -129
3050 -129 54 -63 -318 122 62 -10 187 126 50 292 -126 240 63 -316 97 -569 -5 -118 -351 70 -254
3071 -254 -65 -15 -171 -375 156 -274 -118 128 182 160 -70 -269 515 76 -90 190 49 660 215 -146 141
3092 141 151 161 212 -251 104 -65 -346 -240 89 -441 -39 -195 -79 -161 -281 366 -36 71 153 232 224 217 408
3115 408 126 80 -124 109 -20 78 42 -8 -35 -182 -247 112 -232 -37 -30 -384 -17 -228 -208 173 -4 -12 289 -396
3139 -396 48 112 -173 412 345 61 269 -138 190 60 -179 188 -42 0 97 -160 84 144 -451 -81 0 -533
3161 -533 -83 107 -12 56 -111 106 198 -175 197 -231 30 236 -7 292 240 88 286 -176 -249 16 -53 26
$$ packed form
3006C0j0J87R0m04J77P0k27L36j16j13J60m70O56j36o34M94J5l67L49m06L44k56
3028b31L4L40j53o8K85m58R2J80k87L24q6j54P5j76J26L64l54L26k52K6K37l19
3050a29J83j17k55M40o0p2J97o1p6K42m18L66j77l79M13o66N64j13k33M21l24
3071b54J89N0j56k04N31m30J56K46N4k2k30j99P84m39j66K80j41O11m45l61K87
3092A41J0J0N1m63L55j69k81J06L29n30M02j56J16q2j20O47m02J07Q2P9qpJ91
3115D08k82m6k04K33j29R8l6n0k7j47o5L59l44J95Pl54L67k11K0L81j77qL01o85
3139c96M44O4k85N85o7k84K08m07L28j30k39L67k30M2R7k57K44O0n95L70Q1n33
3161e33M50J90j19O8j67K17R2l73L72m28K61K06k43K99n2j52J98m62p3K65o9P9
$$ plain form
3183 26 -91 -48 174 -1 -217 325 -15 -207 132 -188 32 -234 -208 136 -91 -20 237 -351 76 134 -191 503
3205 503 138 171 384 -77 118 134 -31 216 19 168 66 -203 -145 171 -217 -14 80 33 -319 -210 -3 15
3227 15 -323 193 212 -384 271 -373 135 28 -85 69 -131 -15 -106 -50 287 156 -208 -50 141 57 104 -52
3249 -52 -148 87 136 72 401 40 291 59 180 256 -134 37 3 -225 -258 -403 -214 -64 -324 -86 56 -196
3271 -196 436 89 27 206 217 -70 107 5 263 235 59 164 -130 207 -60 -319 -81 -99 -275 -132 -1
$$ packed form
3183B6j17M3K22j75k16N42l40j92L39l20K20k66K6L44k27P1K57n88M27N8l25O94
3205E03l65L3K13m61J95J6j65K47j97J49j02k69N8L16l88K03R4m7l52J09K07J8
3227A5l38N16J9n96O55o44N08j07j13J54k00J16r1N6L37j31l64J58J91q4M7j56
3249e2r6K35M9o4L29l61K51k32J21P6l90J71l4k28l3j45J89J50k60K38J42k52
3271a96O32l47o2J79J1k87J77j02K58k8j76J05k94L37k67k59K38j8j76J43J31
$$ [...]
8191f4
##END NTUPLES=NMR FID
##END=
