##TITLE=1H_Pr 5182-b
 CDCl3
 8 sc, 
 26.1.2023
##JCAMPDX= 6.0         $$ Bruker NMR JCAMP-DX V2.0
##DATA TYPE= NMR FID
##DATA CLASS= NTUPLES
##ORIGIN= UXNMR, Bruker Analytische Messtechnik GmbH
##OWNER= root
$$ XWIN-NMR		Version 3.5
$$ Thu Jan 26 13:57:13 2023 Russian Standard Time (UT+4h)  she@DPX200
##.OBSERVE FREQUENCY= 200.13135
##.OBSERVE NUCLEUS= ^1H
##.DELAY= (6, 6)
##.ACQUISITION MODE= SIMULTANEOUS
##.ACQUISITION SCHEME= undefined
##.AVERAGES= 8
##.DIGITISER RES= 18
##SPECTROMETER/DATA SYSTEM= spect
##.PULSE SEQUENCE= zg30
##.SOLVENT NAME= CDCl3
##.SHIFT REFERENCE= (INTERNAL, CDCl3, 0, 15.7039)
##AUDIT TRAIL= $$ (NUMBER, WHEN, WHO, WHERE, WHAT)
$$ ##TITLE= Audit trail, XWIN-NMR		Version 3.5
$$ ##JCAMPDX= 5.01
$$ ##ORIGIN= Bruker BioSpin GmbH
$$ ##OWNER= she
$$ F:/spectra/data/she/nmr/H-F/1/audita.txt
$$ ##AUDIT TRAIL=  $$ (NUMBER, WHEN, WHO, WHERE, WHAT)
(   1,<2023-01-26 13:56:09.10 +0400>,<she>,<DPX200>,
      <created by zg, POWCHK disabled, PULCHK disabled
       configuration hash MD5:
       00 E9 B6 7A A2 85 ED C7 34 08 36 98 17 FE 4E 26
       data hash MD5: 16K
       21 1E C5 C7 20 6C 25 A3 67 15 F3 42 32 9A EF 4F>)
$$ ##END=
$$ 
$$ hash MD5
$$ 1F A4 27 C3 C6 35 6E 5A 6B 54 D3 09 1E D7 9A C2
##$RELAX= 
##$RELAX= 
##$RELAX= 
##$RELAX= 
##$RELAX= 
##$RELAX= 
$$ Bruker specific parameters
$$ --------------------------
##$DU= <F:/spectra>
##$EXPNO= 1
##$NAME= <H-F>
##$PROCNO= 1
##$TYPE= <nmr>
##$USER= <she>
##$AMP= (0..31)
100 100 100 100 100 100 100 100 100 100 100 100 100 100 100 100 100 100 
100 100 100 100 100 100 100 100 100 100 100 100 100 100 
##$AQSEQ= 0
##$AQ_mod= 1
##$AUNM= <au_zg>
##$AUTOPOS= <>
##$BF1= 200.13
##$BF2= 200.13
##$BF3= 200.13
##$BF4= 200.13
##$BF5= 200.13
##$BF6= 200.13
##$BF7= 200.13
##$BF8= 200.13
##$BYTORDA= 1
##$CFDGTYP= 0
##$CFRGTYP= 5
##$CHEMSTR= <none>
##$CNST= (0..31)
1 1 145 1 1 1 1 1 1 1 1 1 1 1 1 1 1 1 1 1 1 1 1 1 1 1 1 1 1 1 1 1 
##$CPDPRG= <>
##$CPDPRG1= <>
##$CPDPRG2= <>
##$CPDPRG3= <>
##$CPDPRG4= <mlev>
##$CPDPRG5= <mlev>
##$CPDPRG6= <mlev>
##$CPDPRG7= <mlev>
##$CPDPRG8= <mlev>
##$CPDPRGB= <>
##$CPDPRGT= <>
##$D= (0..31)
0 1.2 0 0 0 0 0 0 0 0.06 0 0.03 0 0 0 0 0.0002 0 0 0 0 0 0 0 0 0 0 0 0 
0 0 0 
##$DATE= 1674726968
##$DBL= (0..7)
120 120 120 120 120 120 120 120 
##$DBP= (0..7)
150 150 150 150 150 150 150 150 
##$DBP07= 0
##$DBPNAM0= <>
##$DBPNAM1= <>
##$DBPNAM2= <>
##$DBPNAM3= <>
##$DBPNAM4= <>
##$DBPNAM5= <>
##$DBPNAM6= <>
##$DBPNAM7= <>
##$DBPOAL= (0..7)
0.5 0.5 0.5 0.5 0.5 0.5 0.5 0.5 
##$DBPOFFS= (0..7)
0 0 0 0 0 0 0 0 
##$DE= 6
##$DECBNUC= <off>
##$DECIM= 32
##$DECNUC= <off>
##$DECSTAT= 4
##$DIGMOD= 1
##$DIGTYP= 9
##$DL= (0..7)
0 120 120 120 120 120 120 120 
##$DP= (0..7)
150 150 150 150 150 150 150 150 
##$DP07= 0
##$DPNAME0= <>
##$DPNAME1= <>
##$DPNAME2= <>
##$DPNAME3= <>
##$DPNAME4= <>
##$DPNAME5= <>
##$DPNAME6= <>
##$DPNAME7= <>
##$DPOAL= (0..7)
0.5 0.5 0.5 0.5 0.5 0.5 0.5 0.5 
##$DPOFFS= (0..7)
0 0 0 0 0 0 0 0 
##$DQDMODE= 0
##$DR= 18
##$DS= 0
##$DSLIST= <SSSSSSSSSSSSSSS>
$$ [...]
##$SUBNAM2= <"">
##$SUBNAM3= <"">
##$SUBNAM4= <"">
##$SUBNAM5= <"">
##$SUBNAM6= <"">
##$SUBNAM7= <"">
##$SUBNAM8= <"">
##$SUBNAM9= <"">
##$SW= 18.05172834244
##$SWIBOX= (0..15)
0 0 2 0 0 0 0 0 0 0 0 0 0 0 0 0 
##$SW_h= 3612.71676300578
##$TD= 16384
##$TD0= 1
##$TE= 0
##$TE2= 300
##$TE3= 300
##$TEG= 300
##$TL= (0..7)
0 120 120 120 120 120 120 120 
##$TP= (0..7)
150 150 150 150 150 150 150 150 
##$TP07= 0
##$TPNAME0= <>
##$TPNAME1= <>
##$TPNAME2= <>
##$TPNAME3= <>
##$TPNAME4= <>
##$TPNAME5= <>
##$TPNAME6= <>
##$TPNAME7= <>
##$TPOAL= (0..7)
0.5 0.5 0.5 0.5 0.5 0.5 0.5 0.5 
##$TPOFFS= (0..7)
0 0 0 0 0 0 0 0 
##$TUNHIN= 0
##$TUNHOUT= 0
##$TUNXOUT= 0
##$USERA1= <user>
##$USERA2= <user>
##$USERA3= <user>
##$USERA4= <user>
##$USERA5= <user>
##$V9= 5
##$VALIST= <valist>
##$VCLIST= <CCCCCCCCCCCCCCC>
##$VD= 0
##$VDLIST= <DDDDDDDDDDDDDDD>
##$VPLIST= <PPPPPPPPPPPPPPP>
##$VTLIST= <TTTTTTTTTTTTTTT>
##$WBST= 1024
##$WBSW= 4
##$XGAIN= (0..3)
0 0 0 0 
##$XL= 0
##$YL= 0
##$YMAX_a= 84178
##$YMIN_a= -152792
##$ZGOPTNS= <>
##$ZL1= 120
##$ZL2= 120
##$ZL3= 120
##$ZL4= 120
##$ABSF1= 10
##$ABSF2= 0
##$ABSG= 5
##$ABSL= 3
##$ALPHA= 0
##$AQORDER= 0
##$ASSFAC= 0
##$ASSFACI= 0
##$ASSFACX= 0
##$ASSWID= 0
##$AUNMP= <proc_1d>
##$AZFE= 0.1
##$AZFW= 0.1
##$BCFW= 1
##$BC_mod= 2
##$BYTORDP= 1
##$COROFFS= 0
##$CY= 11.3945322036743
##$DATMOD= 1
##$DC= 2
##$DFILT= <>
##$DTYPP= 0
##$F1P= 2.36226072786647
##$F2P= -0.459571619588291
##$FCOR= 0.5
##$FTSIZE= 0
##$FT_mod= 4
##$GAMMA= 1
##$GB= 0.15
##$INTBC= 1
##$INTSCL= 1
##$ISEN= 128
##$LB= 0.24
##$LEV0= 0
##$LPBIN= 0
##$MAXI= 10000
##$MC2= 0
##$MEAN= 0
##$ME_mod= 0
##$MI= 1.114404
##$NCOEF= 0
##$NC_proc= 0
##$NLEV= 6
##$NOISF1= 3.799351
##$NOISF2= 2.8
##$NSP= 1
##$NTH_PI= 0
##$NZP= 0
##$OFFSET= 15.70392
##$PC= 1
##$PHC0= -19113.94
##$PHC1= 17.00079
##$PH_mod= 1
##$PKNL= yes
##$PPARMOD= 0
##$PSCAL= 0
##$PSIGN= 0
##$REVERSE= no
##$SF= 200.130013532006
##$SI= 16384
##$SIGF1= 3
##$SIGF2= 2
##$SINO= 400
##$SIOLD= 16384
##$SREGLST= <1H.CDCl3>
##$SSB= 0
##$STSI= 0
##$STSR= 0
##$SW_p= 3612.71676300578
##$SYMM= 0
##$S_DEV= 0
##$TDeff= 0
##$TDoff= 0
##$TI= <>
##$TILT= no
##$TM1= 0
##$TM2= 0
##$TOPLEV= 0
##$USERP1= <user>
##$USERP2= <user>
##$USERP3= <user>
##$USERP4= <user>
##$USERP5= <user>
##$WDW= 1
##$XDIM= 8192
##$YMAX_p= 0
##$YMIN_p= 0
$$ End of Bruker specific parameters
$$ ---------------------------------
##NTUPLES= NMR FID
##VAR_NAME=  TIME,          FID/REAL,        FID/IMAG
##SYMBOL=    X,             R,               I
##VAR_TYPE=  INDEPENDENT,   DEPENDENT,       DEPENDENT
##VAR_FORM=  AFFN,          ASDF,            ASDF
##VAR_DIM=   8192,          8192,            8192
##UNITS=     SECONDS,       ARBITRARY UNITS, ARBITRARY UNITS
##FACTOR=    0.0002768,     1,               1
##FIRST=     0,             0,               0
##LAST=      2.2672688,     0,               0
##MIN=       0,             -152792,         0
##MAX=       2.2672688,     84178,           0
$$ Real data points
##PAGE= N=1
##DATA TABLE= (X++(R..R)), XYDATA
$$ [...]
1844a98R98j111Q1N84p65Q46n49j53N86o96M12J70q39O78P9j033J188j88n56Q28
$$ -198 800 -311 -230 354 -411 435 -114 -267 319 -377 35 205 -634 44 123 -910 278 90 -466 362
1864C62q20M87n8m61J280q24k79O58n20K33K49m86M45k00p1N10p98N54K91q04
$$ 362 -458 29 -29 -490 790 -34 -313 345 -175 58 307 -179 266 66 -5 505 -293 261 552 -252
1884b52L40K51q00Q97m87L6L34n80K51J35m02N83o23J15M91p75K31J55j21L05
$$ -252 88 339 -461 436 -51 -15 319 -261 -10 125 -277 306 -317 -202 289 -486 -255 -100 -221 84
1904H4j64j85M40l98K18K70o70R72l47l07O48l71k75L81l83K50k7k69N22n17J10
$$ 84 -80 -265 175 -223 -5 265 -405 567 220 -87 561 190 -85 296 -87 163 136 -133 389 -128 -18
1925a8L3o44O04J24o61L86j01o3J75l35N64Jm86O90k40j24P98o83k4M33l48L50
$$ -18 15 -629 -25 99 -562 -176 -277 -340 -165 -500 64 65 -421 269 29 -95 703 20 -4 429 81 431
1947D31j49j24L47p73K61N90n32J33n45K15J81k92j93M00k30M7j9j04M17L7K2
$$ 431 282 158 505 -268 -7 583 51 184 -361 -146 35 -257 -450 -50 -280 -233 -252 -356 61 98 120
1968A20N5l41N63k5k82K89k37K01J23m62K54n6j53J68l72J44K33n08L99l83l9
$$ 120 175 -166 397 372 90 379 142 343 466 4 258 202 49 217 -155 -11 222 -286 113 -270 -309
1989c09J44P9k24J59l74O40l41l52O89j95J62M36l75j19L61k90M44l53j9L44l25
$$ -309 -165 -86 -310 -151 -525 115 -226 -578 111 -84 78 514 139 20 381 91 535 182 163 507 182
2010A82k00K99m39N20l59l06K78j39Q4J49o47M19j44p9O15l68J54Rm29O18K2k70
$$ 182 -18 281 -158 362 3 -303 -25 -164 -80 69 -578 -159 -303 -382 233 -135 19 28 -401 217 239 -31
2032c1K88j59J43L7n27K01J76o65Q74k59k68N15l05p4l2j61K26M6l60N77o12J50
$$ -31 257 98 241 278 -249 -48 128 -537 337 78 -190 325 20 -54 -86 -247 -21 25 -335 242 -370 -220
2054b20M42m97L16J48k85K43m72K92M28p97L93k01j87P81n35j68N51n69O46M3
$$ -220 222 -275 41 189 -96 147 -325 -33 395 -402 -9 -210 -397 384 -151 -319 232 -337 309 352
2074C52m04M37m19o4L97m96J76O4m49N36k42j1L33l39P0o3l19N68k72P9N8m08
$$ 352 -52 385 -34 -98 299 -197 -21 43 -406 130 -112 -123 210 -129 -59 -122 -441 127 -145 -66 -8 -416
2096d16M27K25p53L77K29l02M88k44o7M3p2M17l21j17M74j90k22L84p13N54k82
$$ -416 11 236 -517 -140 89 -213 275 31 -36 7 -65 352 31 -86 388 198 -24 360 -353 201 -81
2117h1j48L29k24o7K04l94J23K49l55M12q2j18K35j33m6O87q81P59P4q00O76k42
$$ -81 -229 100 -124 -191 13 -381 -258 -9 -364 48 -34 -152 83 -50 -96 591 -290 469 543 -257 419 177
2139A77m56Q04o93N63l40m95N92n26J70L34l57K64o9j38J7p5k43M93q7l31N06
$$ 177 -279 525 -168 395 55 -440 152 -374 -204 130 -227 37 -32 -170 -153 -228 -471 22 -65 -396 110
2160A10l61N93l46j85R36p02r1M83n01K22L1j60K09Jk80K88l37NK03m78O42n54
$$ 110 -251 342 -4 -189 747 45 -46 437 -64 158 189 29 238 239 -41 247 -90 -85 118 -360 282 -272
2182b72R5N28q10K81J82l85L13r2R4K74l02J38K86l17L19l6n56M39j49N6O5m0
$$ -272 -177 351 -459 -178 4 -381 -68 -160 -66 208 -94 44 330 13 332 296 -260 179 30 86 151 111
2204A11j2j48j1K24k28m3J81m37L49L6m40L58r7j39K01J10m7l7jL54k12lk6k41
$$ 111 99 -49 -60 164 -64 -107 74 -363 -14 22 -418 -60 -157 -296 -95 15 -32 -69 -70 284 72 69 43 -198
2228a98M56k3k80L91m7k37J87Jk87J28j04K11k80m8J19k15j30J50QK33j09M5Q2
$$ -198 258 235 -45 346 299 62 249 250 -37 91 -13 198 -82 -130 -11 -226 -356 -206 -198 35 -74 -29 53
2251E3l60L42K39l49K48lk22K91m98J09M86l29J20l81K16K35j60l13L98m8M6q8
$$ 53 -307 35 274 -75 173 170 -52 239 -259 -150 336 7 127 -254 -38 197 37 -276 122 74 120 32
2273C2k03K94k33J90j87JK95Jm39L68m4KJ3l72J15L53m61J81k02Q5K45l0k63N80
$$ 32 -171 123 -110 80 -107 -106 189 190 -249 119 75 77 90 -282 -167 186 -275 -94 -296 -211 34 4 -259 321
2297C21n16O28r7k19K39l92L74j68j48L24J0m53L70k78j57L52p39M67K7k88K27
$$ 321 -195 433 336 117 356 -36 338 170 22 346 356 -97 273 -5 -162 190 -549 -82 -55 -343 -116
2318a16l15K33M11o52K03K91j44M52n4k32K24j54p6K33k36M31q2k35m1l10K1J58
$$ -116 -431 -198 213 -439 -236 55 -89 363 309 77 301 147 71 304 68 499 417 182 141 -169 -148 10
2340A0m36L60J73n95M74J43j62J00l63L49N9o25M74k07J99L17k29p4K31m21M27
$$ 10 -426 -66 107 -488 -14 129 -33 67 -296 53 112 -513 -39 -246 -47 270 41 -33 198 -223 204
2361B04j04J26J54l41K24L8l22j18M66n93L79k17l16M29k87L21j27l31N25J05
$$ 204 100 226 380 39 263 301 -21 -139 327 -266 113 -104 -420 9 -278 43 -84 -415 110 215
2381B15p6L2k63K38j25j52J46j6J96o0O8k89L76j88P3J8m98N20j19o4K67n55L54
$$ 215 139 171 -92 146 21 -131 15 -1 195 135 203 -86 290 102 175 193 -305 215 96 32 299 -256 98
2404I8J24m74J23J3j81K73k58K15L9k42N01j54m03L64j99J67j28J09J32l46J84
$$ 98 222 -252 -129 -116 -297 -24 -282 -67 -28 -270 231 77 -326 38 -161 6 -122 -13 119 -227 -43
2425d3K24k36N1M83l92j05q7Q7o1m2J87l60R3J64o3J14m3j31K2J18o5O4P9o3n2
$$ -43 181 -55 -4 479 87 -18 -105 -18 -79 -121 66 -294 -201 -37 -100 14 -29 -160 -138 -20 -85 -21 58 -5 -57
2450e7l4j08O55o31j6K51j25O4J13Ml5l08M95l19R5M9j97n8N39n86L67j84r2L43
$$ -57 -91 -199 456 -175 -191 60 -65 -1 112 116 81 -227 268 -51 44 93 -104 -162 377 -209 158 -26 -118 225
2474B25k36k99L53m22J85J69k11J86Pj47K95p7j3N9k12J24n2k4J96M3j98L78j36
$$ 225 -11 -310 43 -379 -194 -25 -236 -50 -43 -190 105 28 15 74 -138 -14 -66 -90 106 149 -49 329 193
2497A93J04K01n80K67j33k33J87k7j64J62m33M58q5J08R9p20O05j62J9P7k5j21
$$ 193 297 498 -82 185 52 -181 6 -21 -185 -23 -456 2 -83 25 124 -596 9 -153 -134 -57 -82 -203
2519b03K40l75M10M80m20N5O3k91N05l01P3j23l1K32k61k71L31l06J25R1l21K37
$$ -203 37 -338 72 552 132 187 250 -41 464 163 236 113 82 314 53 -218 113 -193 -68 23 -298 -61
2541f1q2j41P5j90K79K57r9j2k78M7N77m30M5M51m82r0K77Q9j27J19N8J77m98
$$ -61 -143 -284 -209 -399 -120 137 38 26 -252 -205 372 -58 -13 438 -44 -134 143 232 105 224 282 459 -39
2564c9K75k38P6k48K83k93N42l93k30K69o22N89r6J0M80o04L45J12m56P03l13
$$ -39 236 -2 74 -174 109 -184 358 -35 -265 4 -618 -29 -125 -115 365 -239 106 218 -238 465 152
2585A52K7J89l84j47K67l54M35M7n82L21K58j54O2n78L89K25k45P7r0j04L30k69
$$ 152 179 368 -16 -163 104 -250 185 232 -350 -29 229 75 137 -441 -52 173 -72 5 -85 -189 141 -128
2607a28j03N95n35L80j63k00N41m91Q8L22j88p7P3k10J71j63o0L40j72J27j28
$$ -128 -231 364 -171 209 46 -154 387 -104 -16 306 118 41 114 -96 75 -88 -148 192 20 147 19
2628A9K7j9j99L26O3k27j78R8J8l2K77o4q5l11L25J07j50k4J03j60j22J90l86
$$ 19 46 27 -172 154 217 -10 -188 -90 -72 -104 173 109 24 -287 38 145 -5 -29 74 -86 -208 -18 -404
2651d04N64l17L29j96j04J53R4j64j26K82Q2J68l05J6j36j05J87k74j7P4J29J30
$$ -404 160 -157 172 -24 -128 25 119 -45 -171 111 193 361 56 72 -64 -169 18 -256 -273 -199 -70 60
2673F0p2j49J05J01K8o6l71M93m46L03R0j09J97Kk71K30K89j71o8p6no8J81k15
$$ 60 -12 -161 -56 45 73 7 -364 129 -317 -14 76 -33 164 166 -105 125 414 243 175 99 94 26 207 -8
2697hr7R0N8j49o8P9j6l5J02j5n1QO2j08J44k27L12L0J90k59K79j11KM4J0k24
$$ -8 -105 -15 43 -106 -174 -95 -111 -146 -44 -59 -110 -102 -40 -148 -4 -231 81 111 301 42 321 210 212 256 266 42
2723D2k59N75m42L27l69L67j29n3j87R0l80L47J38j56J49l66J04J75n1K3P0j47
$$ 42 -217 358 -84 243 -126 241 112 59 -128 -38 -418 -71 67 -89 60 -306 -202 -27 -78 -55 15 -132
2745a32K01m7K8J82k24J63J7N9j92O5J13k48j02J0R3j52o1j4O2K02k32K58o0j04
$$ -132 69 22 50 232 8 171 188 247 55 120 233 -15 -117 -107 -14 -166 -227 -241 -179 23 -209 49 -11 -115
2769a15R4j83M08j79L6j76OP8K40k07J98j24p9K39j23k55J75k91L92J33r9L4m18
$$ -115 -21 -204 204 25 61 -115 -109 -31 209 2 200 76 -3 236 113 -142 33 -258 134 267 168 202 -216
2792b16K11J10j32L2l09K24J18J7j65r5p4J68L02m56K62K63k64J43n2p8K40k46
$$ -216 -5 105 -27 5 -304 -80 38 55 -110 -205 -279 -111 191 -265 -3 260 -4 139 87 9 249 3
2814CK26M4k91J44n8k73L82j16J36j12j32K88k04N1j61k0J15n2j28K16P9k24K64
$$ 3 229 273 -18 126 68 -205 177 61 197 85 -47 241 37 88 -73 -93 22 -30 -158 58 137 -87 177
2837A77l13L93j88p9J32k01Q2J43l23R2K14k74K01n8m20N05n8r8O61o85P9j63
$$ 177 -136 257 69 -10 122 -79 3 146 -177 -85 129 -145 56 -2 -422 83 25 -73 588 -97 -18 -181
2859a81J4J61J27k61K1K15pN4k92r4J73l17O58n95J56p6J29k0J44p3K17j69R8
$$ -181 -167 -6 121 -140 -119 96 89 143 -149 -243 -70 -387 271 -324 -168 -244 -115 -135 9 -64 153 -16 82
2882H2J03l00K6Q2L10l81K78K2q5k76J08n9J11n3j08j91K97oo9K71l81M12j62
$$ 82 185 -115 -89 -7 303 -78 200 222 137 -139 -31 -90 21 -32 -140 -331 -34 -40 -109 162 -219 193 31
2905C1k67K13L3K00j08m84L19K15j36J67K4k78K72k30M3J2M2oK5j41j22j60J72
$$ 31 -236 -23 10 210 102 -382 -63 152 16 183 207 -71 201 -29 14 26 68 62 87 -54 -176 -336 -164
2928a64j36J61J2J06k26L87k46LL76l53M09k82k9L2j53M61J5m16K03k04l6J62
$$ -164 -300 -139 -127 -21 -247 140 -106 -103 273 -80 329 47 18 50 -103 358 373 -43 160 -44 -80 82
2950H2j73j36K44l69L19J22m1q7O5k79K91j02K00j55k73M42l51N01l27K74k70
$$ 82 -91 -227 17 -352 -33 89 48 -39 26 -253 38 -64 136 -19 -292 150 -201 300 -27 247 -23
2971b3K00l01R6K26r6J3J80l38j46J68m4K94l37J28r8M1J40k71K2O9j27L16L0
$$ -23 177 -124 -28 198 102 115 295 -43 -189 -21 -65 229 -108 20 -78 -37 103 -168 -146 -77 -204 112 142
2994A42l42M4K30j17j91L10P3L6k61J83J05l84K61m8j39J12Q2k18J00J30n1k34
$$ 142 -200 -156 74 -43 -234 76 149 185 -76 107 212 -172 89 41 -98 14 96 -122 -22 108 57 -177
3016a77L6L09k12J55n9M0R7j97Q1N7k41o3M8O2J45N4p2q8j80L07q3kq0J31J56
$$ -177 -141 168 -44 111 52 92 189 -8 73 130 -111 -174 -126 -64 81 135 63 -25 -205 102 19 17 -63 68 224
3041B24j94j12RJ28Rj46P1j25Q6K54q3j40q2M44m87P5Ok59J57j22J39K6j24J21
$$ 224 30 -82 -73 55 64 -82 -11 -136 -50 204 121 -19 -101 343 -144 -69 -63 -322 -165 -287 -148 -122 -246 -125
3065a25J82j18J7J84j84L87k94%M05m32k86M60j45J55R3r6j80J43n5lk42J34J57
$$ -125 57 -61 -44 140 -44 343 49 49 454 22 -264 196 51 206 299 203 23 166 111 108 -134 0 157
3088A57k80K14j11q7L23k95K8l88L37L13m65K35K73l66J31L7n6L41l14J63L9m10
$$ 157 -123 91 -20 -107 216 -79 -51 -439 -102 211 -254 -19 254 -112 19 56 0 341 27 190 229 -181
3110a81M54j46k64L38k55Q0M1k30j15M25j90K60j97k08J87j79K58k54K39N3j16
$$ -181 273 127 -137 201 -54 26 67 -163 -278 147 -43 217 20 -188 -1 -180 78 -176 63 116 0
3131@L9kj85n8K53k55J28K47k7P5k42J30Pj34N9p0M6j03j24M01j67o7N5k87K1
$$ 0 39 37 -148 -206 47 -208 -80 167 140 215 -27 103 110 -24 35 -35 11 -92 -216 185 18 -49 6 -281 -260
3156b60M33l35J86J34o2k02L90k60j28O4p3L41k40K4Q9j02J95l20K79q3k09K87
$$ -260 173 -162 24 158 96 -106 284 24 -104 -40 -113 228 -12 12 101 -1 194 -126 153 70 -139 148
3178A48q5m2K75l33j30l0N4L58j09k61J07rl24L35K38l21R9K4P9k11k66L73K14
$$ 148 63 21 296 -37 -167 -197 -143 215 106 -155 -48 -57 -381 -46 192 -129 -30 -6 73 -138 -404 -31 183
3201A83l51N12m17K94j56j30j85K88j94K43k24K78k48K10L9p5l75L38j16n6K23
$$ 183 -168 344 -73 221 65 -65 -250 38 -156 87 -137 141 -107 103 142 67 -308 30 -86 -142 81
3222H1l26R0L38p4Jj45j10J46j24O9L8j12L74n17L12P3j64k48L18j11J53l5o6
$$ 81 -245 -155 183 109 110 -35 -145 1 -123 -54 -16 -128 246 -271 41 114 -50 -298 20 -91 62 27 -39
3245c9J32o3K9j50p8n5L68l44L33m14p1J06l1L40j11o9J81k72J29n0K52j04J64
$$ -39 93 30 59 -91 -169 -224 144 -200 133 -281 -352 -246 -277 63 -48 -117 64 -208 -79 -129 123 19 183
3268A83P0p1k7k48L02rq9L16l85J61j38R9k23P0j66R1k00O3K70j29k58n7L49j5
$$ 183 253 182 155 -93 209 200 111 427 42 203 65 164 -59 11 -155 -64 -264 -201 69 -60 -318 -375 -26 -41
3292d1Q7l80N94l34M8l0Q4M5j35m1L2M8lR2k1j9J5r2N2k6j38M5%Q8N4j77L42m54
$$ -41 46 -334 260 -74 -26 -56 28 73 -62 -103 -71 -23 -26 66 45 26 41 -51 1 -25 -163 -118 -118 -30 24 -153 189 -265
3320b65K66J72k58O4Q3K09j73j58R3k6q8M69l98J70J71m41o9K67n0k7k13K01J86
$$ -265 1 173 -85 -21 62 271 98 -60 33 7 -81 388 -10 160 331 -110 -179 88 38 11 -202 -1 185
3343A85k68J15n3l58K30n7J58N0j26P6M9q1J89k78J54K5l30M43k90J79m3K1M5
$$ 185 -83 32 -21 -379 -149 -206 -48 2 -124 -48 1 -80 109 -169 -15 10 -320 123 -167 12 -31 -10 35
3366C5m3Q2jj01j36M68m73J61r1J91K4l4j93p9J91j8J25j27J40j39J4m5K63n31
$$ 35 -8 74 73 -28 -164 304 -169 -8 -99 92 116 82 -111 -190 1 -17 108 -19 121 -18 -4 -49 214 -317
3390c17M35k57K38j67j28J68M9k0j43K50l66K51m1L57j66l4k10J78j54J61m85
$$ -317 118 -139 99 -68 -196 -28 21 1 -142 108 -258 -7 -48 309 143 109 -101 77 -77 84 -401
3411d01L32O2P9J07k9l45K20k7k13L36j48Nm2O3J95k26N2R8l64L91j60j18M01
$$ -401 -69 -7 72 179 150 -195 25 -2 -215 121 -27 -22 -64 -1 194 -32 20 118 -246 145 -15 -133 268
3434B68l65M65k49j81P4J83l71L42m09M10j52j45j42K69j36k5L57n18N73l9m92
$$ 268 -97 368 119 -62 12 195 -176 166 -243 167 15 -130 -272 -3 -139 -164 193 -325 248 209 -283
3455b83O18m01j65N93j87k14K06N7k67J90J47j3j79J42k44J53K65o07K07J20j20
$$ -283 335 -66 -231 362 175 -39 167 224 -43 147 294 281 102 244 0 153 418 -189 18 138 18
3476A8r2Q5O3L7r4n9J33j16L9k22J22J08J7k91L08J35k59J22j99N41n75K26K4
$$ 18 -74 11 74 111 17 -42 91 -25 14 -208 -86 22 39 -252 56 191 -68 54 -145 396 -179 47 71
3499G1k39O9J39k80J56M4k03J91j37J77R2p1O9j94O3P8l1L1N1k16J52l6j58K0
$$ 71 -168 -99 40 -240 -84 -40 -243 -52 -189 -12 80 9 78 -116 -53 25 -6 25 76 -140 12 -24 -182 -162
3523a62L56l40Q5n9K09O8j06J38n9k44j30J59O1j2n1L33l51j21J65k56K34O4M0
$$ -162 194 -146 -61 -120 89 157 51 189 130 -114 -244 -85 -24 -36 -87 246 -105 -226 -61 -317 -83 -19 21
3546B1K43l70J2j05L6J94j53KL44q4k08J60n2L03m33K02O6J6j83N5J01j84k57
$$ 21 264 -106 -94 -199 -163 31 -122 -120 224 140 -68 92 40 343 -90 112 178 194 11 66 167 -17 -274
3569b74J73r1j7K41K4p3j82J78J11j04QM7O3q8k15K05k14M06k22p0p0J10j73M05
$$ -274 -101 -192 -209 32 56 -17 -199 -21 90 -14 -6 41 104 16 -199 6 -208 198 -24 -94 -164 -54 -227 178
3593A78k48p1M2J86K26j12k32J43j26K9j29L9L23k89n3K20n40O52k37q4O1O9j10
$$ 178 -70 -141 -99 87 313 201 -31 112 -14 15 -114 -75 248 -41 -94 126 -414 238 1 -83 -22 47 -63
3616f3j2P6J5O2M7p2P3j51J19j9k2L01l43P9O5l61L08J13k45J51j70J22j25j33
$$ -63 -75 1 16 78 125 53 126 -25 94 75 53 354 11 90 155 -206 102 215 -30 121 -49 73 -52 -185
3640a85K23l7k73M10j64J69j70k21N21j83k40K54j47K0K21l04J14k3J6J78l37
$$ -185 38 1 -272 138 -26 143 -27 -248 273 90 -150 104 -43 -23 198 -106 8 -15 1 179 -158
3661a58J29K9J64j83P6k59N40m47J27P0l9j26P6l10M20j28j23K27k23JJ89k80
$$ -158 -29 0 164 -19 57 -202 338 -109 18 88 49 -77 -1 -311 109 -19 -142 85 -138 -137 52 -228
3683b28J79N0k55N07k32J8p9J07R1O3l08L30j12j66L44l75j12J93p7p9j11L23
$$ -228 -49 1 -254 253 21 39 -40 67 158 221 -87 243 131 -35 309 -66 -178 15 -62 -141 -252 71
3705G1J80m61J21R6j32R9k94K56K90j57j14M13m13K47p3j51J75l82K9L41l78M23
$$ 71 251 -210 -89 7 -125 -26 -320 -64 226 69 -45 368 -45 202 129 -22 153 -229 -200 141 -237 186
3727A86k64j57K28p6J79j28k17J43N4j15O5j30L11J62l08p3m2K15J68k42J9L69
$$ 186 -78 -235 -7 -83 96 -32 -249 -106 -52 -167 -102 -232 79 241 -67 -140 -182 33 201 -41 -22 347
3749C47m07P9J44j77k5K81o3j11k66L20k52N3J00n9J82m8j32J61m1k62L98l37
$$ 347 -60 19 163 -14 -39 242 179 68 -198 122 -130 -77 23 -36 146 98 -34 127 86 -176 222 -115
3771a15M1J64k96K08K81l37J41j99K9J36R9n4M7k60K47kn3j79J34r0L25n36L70
$$ -115 -74 90 -206 2 283 -54 87 -112 -83 53 152 98 145 -115 132 130 77 -102 32 -58 267 -269 101
3794A01J85l85Pj11K52j30N3L46m25l85N59n9Lj62Q4j10J71j46K48l33K1K38N9
$$ 101 286 -99 -92 -203 49 -81 -28 318 -107 -492 67 8 11 -151 -67 -177 -6 -152 96 -237 -216 22 81
3817H1n2rj74K4K02l4K12l96Q4J22N5P1J68k66M1n89K44M97n85M27l07Q3K13j20
$$ 81 29 20 -154 -130 72 38 250 -146 -62 60 115 186 354 88 129 -460 -216 281 -304 123 -184 -101 112 -8
3841hj60K94l46J61K71j41o6j21J33J69k94kN41k63J8k38J62O5J0J3k47j21L46
$$ -8 -168 126 -220 -59 212 71 5 -116 17 186 -108 -110 431 168 186 -52 110 175 185 198 -49 -170 176
3864A76j13k73L99j44r3n7j40K33J09m18L79j97pK1O6J66j10J10J41k93J39J57
$$ 176 63 -210 189 45 -48 -105 -245 -12 97 -321 58 -139 -146 -125 -59 107 -3 107 248 -45 94 251
3886B51j12m1m6O0Pqj60J39j90L44j41r1J15l12l1K69k14K10K2j29M79l89P1p6
$$ 251 139 98 52 112 119 111 -49 90 -100 244 103 12 127 -185 -216 53 -161 49 71 -58 421 32 103 27
3910B7J14k6K3j27N6k6j2J67j16O6k73K70j51J17j88K23j11r3K58l46KK01k77
$$ 27 141 115 138 11 67 41 29 196 80 146 -127 143 -8 109 -79 144 33 -60 198 -148 -146 55 -222
3933b22L07J03k41K45k59K31k19qOK93l20O0j65J13R2j79K11J09k15l1J40j99
$$ -222 85 188 -53 192 -67 164 -55 -63 -57 236 -84 -24 -189 -76 16 -163 48 157 -58 -89 51 -148
3955a48J90r0j07K17m34M96k69J7J39k28L62l8J5r0k15m3L20J49k30R9k68K7K85
$$ -148 42 -48 -155 62 -372 124 -145 -128 11 -217 145 107 122 32 -183 -226 94 243 13 112 -156 -129 156
3978A56q8j02j34J90L59r3k72J0j1J0O8j70l6K91p8k88O8K29j61r4L08j22j48
$$ 156 68 -34 -168 22 381 288 16 26 15 25 93 -77 -113 178 100 -188 -120 109 -52 -146 162 40 -108
4001a08J36q5M67l66o1O6j38j5N3J19K69l12q5K97m63J86Q0J86n5k01L25l14J73
$$ -108 28 -57 410 44 -17 49 -89 -104 -51 68 337 25 -60 237 -226 -40 40 226 171 -30 295 -19 154
4024A54n1l37L76j64R1q0o7k11L24L7l5j72kL9L90k89j14J69p5L31j94k1K4L9
$$ 154 103 -234 142 -22 69 -11 -78 -289 35 72 37 -135 -137 -98 292 3 -111 58 -17 314 120 99 123 162
4048A62k64L51k79n6J9j85L39j93K40l1p5R6j69j30m8J05n8J87r8j04K75r9R2
$$ 162 -102 249 -30 -86 -67 -252 87 -106 134 103 28 124 -45 -175 -223 -118 -176 11 -87 -191 84 -15 77
4071G7j74L1L20k35P2K54k26J78m03j11M21l29K68l02J47J35k24K25k42J26j84
$$ 77 -97 -66 254 19 91 345 119 297 -106 -217 204 -125 143 -159 -12 123 -101 124 -118 8 -176
4092a76K70k51K18J2m8J22J8k2ok97J90m8P0N6k0J53k18K37l59J65Q0k07J46j84
$$ -176 94 -157 61 73 25 147 165 143 137 -160 30 -18 52 108 88 241 23 260 -99 66 146 -61 85 -99
4116i9K75j43n8l1l14J04L12QN5j23K0K14l15L62q8j63K35k81m6J58p4j37J83
$$ -99 176 33 -25 -56 -370 -266 46 54 109 -14 6 220 -95 267 179 16 251 -30 -76 82 8 -129 54
4139E4R6j31m9R3J33m89L52n5J8J57k27J5J59L1m71K66O8M7j91K8J81j17n7O4
$$ 54 150 19 -30 63 196 -293 59 4 22 179 -48 -33 126 157 -314 -48 20 67 -124 -96 85 -32 -89 -25
4163b5n7r1K68j85oJ23j2K24j84OQ4m70K28J3J58M1k3Q2P0r3j39J47n9K5k27N
$$ -25 -82 -173 95 -90 -96 27 15 239 55 61 145 -325 -97 -84 74 115 92 174 244 151 12 159 100 125 -102 -97
4189i7J91k36J68k6K6l02K04j00K62k74n1L23j38NJ64k74N72l92O8K03l32L5L4
$$ -97 94 -142 26 0 26 -276 -72 -172 90 -184 -235 88 -50 -45 119 -155 417 25 93 296 -36 -1 33
4212C3p2J10o4j87O2k56L69N8l87Q60p70j11K80r8K77j4l26J74Rk33K49J6j22
$$ 33 -39 71 7 -180 -118 -374 -5 53 -334 526 -244 -355 -75 -173 104 90 -236 -62 -53 -286 -37 -21 -143
4235a43r3L12m9Q0j22J15j75J12J16m1M7k18k6R1q4j56K34m07M95m15L95m9Q5
$$ -143 -236 76 27 107 -15 100 -75 37 153 112 159 -59 -85 6 -78 -234 0 -407 88 -327 68 19 104
4258A04k02K4Kj09J45j17J7J56K3q0LK27p4p1m1JM7K58l49M3R9q0J1q9j09M2J23
$$ 104 -98 -74 -72 -181 -36 -153 -136 20 43 -37 -34 193 119 48 7 8 55 313 -36 7 106 26 37 -52 -161 -119 4
4285Dk69J07K54j87J6J59n4o7R0K3M2j54n0m0M48j17l54Q3n2K92j05J91k66K66
$$ 4 -265 -158 96 -91 -75 84 30 -37 53 76 118 -36 -86 -126 322 205 -149 -66 -118 174 69 260 -6 260
4309B60m32P3J43j81J23j51K95m52L50n4J74q2j10k0J87k8k04K18k87J12J76j4
$$ 260 -172 -99 44 -137 -14 -165 130 -322 28 -26 148 66 -44 -64 123 95 -109 109 -178 -66 110 96
4331I6R5l46k06N92k17k38K92k2p7R8k58K54j02l3J56J09j44q9m8J85j12j65L31
$$ 96 191 -155 -361 231 14 -224 68 46 -31 67 -191 63 -39 -72 84 193 49 -40 -88 97 -15 -180 151
4354A51l70K13K7J17j1l0k50K07q4k10J65r0L18q9J09L2n00K98P3j86J72j74j35
$$ 151 -219 -6 21 138 127 97 -153 54 -30 -240 -75 -165 153 64 173 205 -295 3 76 -110 62 -112 -247
4377b47P1K14j44K17l6j0J16j55R2j55O5J80o27K75K55n18M54j16k16J80J24p7
$$ -247 -176 38 -106 111 75 65 181 26 118 -37 28 208 -419 -144 111 -407 47 -69 -285 -105 19 -58
4399e8J2j46K55n5Q7j33k71N53p0l57q7N33p7J52k78j97O7j8j08K06pn6J65r2
$$ -58 -46 -192 63 8 95 -38 -309 244 174 -183 -270 263 186 338 60 -137 -70 -88 -196 10 3 -53 112 20
4423B0p4J89p3L04m86R4J33J83J1Oj34J97l20Q2j15o1K48j31k02L17l77L18l01
$$ 20 -54 135 62 366 -120 -26 107 290 301 307 173 370 50 132 17 -44 204 73 -129 188 -189 129 -172
4446a72o4R1J6o2K00m4P0k0L4L3n1k94L43m8K8p3K9K19P0l02J69R6m23J46j46
$$ -172 -236 -145 -129 -191 9 -35 35 15 49 82 31 -263 80 32 60 -13 16 235 305 3 172 268 -155 -9 -155
4471a55lP5n8P3J47j57J22k37J74R8n5l9l95L28LL3k00M30l12J10K44p2L65n48
$$ -155 -158 -83 -141 -68 79 -78 44 -193 -19 79 24 -15 -410 -82 -79 -46 -246 184 -128 -18 226 154 519 -29
4495b9J54L2k0j81J07j28J77q2j09Oj49J76K0k69J30K95j83Q7Q9j60k1P1n6J50
$$ -29 125 157 137 -44 63 -65 112 30 -79 -73 -222 -46 -26 -295 -165 130 -53 34 123 -37 -58 13 -43 107
4519A07J30k78J20j21K18k19K0n4j08M70m43O1k2K31j42J41j18M6k26L50J35k94
$$ 107 237 -41 79 -42 176 -43 -23 -77 -185 285 -158 -97 -119 112 -30 111 -7 39 -187 163 298 4
4541DL69n58M61j5l92K29qK25l69K3j70M52l50L10m85L44k09K34n2L5k85J22K31
$$ 4 373 -185 276 261 -131 98 90 315 -54 -31 -201 251 -99 211 -274 70 -139 95 43 78 -207 -85 146
4564A46k07J99l26K31J4J20j07jj78R8K01j91m3K85k21Q6l67kJ12j11J51J10j05
$$ 146 -61 138 -188 43 57 177 70 69 -109 -11 190 -1 -44 241 20 106 -261 -263 -151 -262 -111 -1 -106
4587a06K73k22j90J14M5N3R8L9O2q6j35K35k7j28K62m01M21k63r0K03k73L06j56
$$ -106 167 -55 -245 -131 -86 -33 65 104 166 80 -55 180 153 25 287 -114 307 44 -46 157 -116 190 34
4610C4Kj54j9L8m9J91K46k26p0J39l65K45r3J47p2J38l4j83J33KjJ38k66J49N6
$$ 34 36 -118 -137 -99 -148 43 289 63 -7 132 -233 12 -81 66 -6 132 98 -85 48 50 49 187 -79 70 126
4635A26k20K0j95L85l77M21M9k38J03j82j26K9L17k46j5oJ45J9J29J22l08mp1
$$ 126 -94 -74 -269 116 -261 160 209 -29 74 -108 -234 -205 112 -134 -149 -155 -10 9 138 260 -48 -52 -123
4658a23J62J0j72K88J41k04r0R7j26j6l6K87l13j22N9R7J2m8j24M9P6J34l1j30
$$ -123 39 49 -123 165 306 102 12 109 -17 -33 -69 218 -95 -217 -158 -61 -49 -97 -221 -172 -96 38 7 -123
4682a23K98o7p1j3K8pj64J25k77K85J42k32j11m2R1O08j77o62N88l28J40K27m12
$$ -123 175 108 37 24 52 45 -119 6 -271 14 156 -76 -187 -229 -138 470 293 -369 219 -109 31 258 -154
4705a54r2N9r5MJ09J71K90m45L27k98j31j98N10j27K9J28j02mj60K37M8j25l9
$$ -154 -246 -187 -282 -278 -169 2 292 -153 174 -124 -255 -453 57 -70 -41 87 -15 -19 -179 58 106 -19 -58
4728e8N7j73K46K36m72P5J66o3K1j76J25J55l45r2R7N38o31L18o0M6j2o3L21o1
$$ -58 -1 -174 72 308 -164 -89 77 14 35 -141 -16 139 -206 -298 -201 337 -294 24 -36 10 -2 -65 256 195
4752A95J6k26K49l06RL98l67J43K0j99M14l36K83j98l17KK35M5R4k16r8J85r7
$$ 195 211 -15 234 -72 -63 335 -32 111 131 -68 346 10 293 95 -222 -220 15 60 154 -62 -160 25 -72
4775g2k51L23l40L64J05k79J20j09j7K10j94N4Q8Oj6J26k95K70J3p4Q5Q9k15k31
$$ -72 -323 0 -340 24 129 -150 -30 -139 -156 54 -140 -86 2 8 -8 118 -177 93 106 32 117 206 -9 -240
4799b40%K38o7j24j22L9R4L33l6j05j06K07j62j86K76j09J42J73n45L27o6K71
$$ -240 -240 -2 -69 -193 -315 -276 -182 151 115 10 -96 111 -51 -237 39 -70 72 245 -300 27 -39 232
4821B32j60J69l18J74j22k54M74o6k74q5K69m9L4j67L46l53K58k50q1K48J11l29
$$ 232 72 241 -77 97 -25 -279 195 129 -145 -230 39 -10 24 -143 203 -150 108 -142 -223 25 136 -193
4843a93K95j45J1m9K6K80m11L48j04j30K39l5j8jk43N3O3r5j25K73K6j84J81R2
$$ -193 102 -43 -32 -81 -55 225 -186 162 58 -72 167 132 114 113 -130 -77 -14 -109 -234 39 65 -119 62 154
4867A54l97L85l36L10k26J3r0Q3J11l1j45J78j07O9k1j9K32n1Q4k19L1J85m3k11
$$ 154 -243 142 -194 116 -110 -97 -187 -104 7 -24 -169 9 -98 -29 -50 -69 163 112 196 -23 8 193 150 -61
4891f1L09l97JJ78j21O3K35l38J49n8q3J40J86l0q0j01K7K0n8j37Q8J97l32J02
$$ -61 248 -149 -148 30 -91 -28 207 -131 18 -40 -123 17 203 173 93 -8 19 39 -19 -156 -68 129 -203 -101
4915a01n8L65m43K23J62j87Q1L0k42j7J40n4J69j24k8j94J24K95k55J54K6j39
$$ -101 -159 206 -237 -14 148 -39 42 72 -170 -187 -47 -101 68 -56 -84 -278 -154 141 -114 40 66 -73
4937g3q8j28J73P5J65J42j47l07J92k01K05k14M45k75J29l26J49K74j78j18k08
$$ -73 -161 -289 -116 -41 124 266 119 -188 4 -197 8 -206 239 -36 93 -233 -84 190 12 -106 -314
4958c14L53l5j48K49k39j21M29k24J96j14k63J12J03K4m9j9J76j79L01l19Q8l2
$$ -314 39 4 -144 105 -134 -255 174 -50 146 32 -231 -119 -16 8 -41 -60 116 -63 238 -81 7 -25
4980b5K26k03K6o3m5Q4J59j66J94j35Km71M69K3k79o5L44k09J16K39l30J54k94
$$ -25 201 -2 24 -39 -84 0 159 -7 187 52 54 -417 52 75 -204 -269 75 -134 -18 221 -109 45 -249
5003b49L78j07n8J6J62m2m4j65J81J09k83O0J80j14k39L81j1L3m6j74p7J47J2
$$ -249 129 22 -36 -20 142 100 56 -109 72 181 -102 -42 138 24 -215 166 155 188 142 -32 -109 38 50
5026E0j67K43n1j4m31J89L36p5j36K47k56R0j75j30L60j26L9j02L6J62L77n62
$$ 50 -117 126 75 61 -370 -181 155 80 -56 191 -65 25 -150 -280 80 -46 -7 -109 -73 89 466 -96
5048i6j58L92%j75J64j73r8L22j46R4j28o8J60m22L63K21j81j32L17j58Lj21J45
$$ -96 -254 138 138 -37 127 -46 -144 178 32 126 -2 -70 90 -332 31 252 71 -61 256 98 101 -20 125
5071A25j67K0J20j45j04J28j02L19k58J94q3m6p8K24n9n0Rl6K32l13j42Q2n5q0
$$ 125 -42 -22 98 -47 -151 -23 -125 194 -64 130 47 1 -77 147 88 38 47 11 243 -70 -212 -130 -185 -265
5095b65J49L15q9j61J53q7N4k15K45j6k63O7J81j88r1N0J30J26k13O9J39k41j17
$$ -265 -116 199 110 -51 102 15 69 -146 99 83 -180 -113 68 -120 -211 -161 -31 95 -118 -49 90 -151 -268
5118b68K56J75o2k14K3J08o2K3O4j39pp8L81P1p13K22K09j29J66K8l0l5k3K21
$$ -268 -12 163 101 -113 -90 18 -44 -21 43 -96 -103 -181 200 271 -442 -220 -11 -140 26 54 24 -11 -34 187
5142A87l41J49K22m40K55J37l9n4j97M5O1o4n5J01j81K33l06q6N47m27J71J27
$$ 187 -154 -5 217 -223 32 169 130 76 -121 -76 -15 -79 -134 -33 -214 19 -287 -373 174 -253 -82 45
5164D5p0R1l8m50N32J03j48J03j21n4n0L5K23J95l83J73l31L8J73lK61k55l7j85
$$ 45 -25 66 28 -422 110 213 65 168 47 -7 -57 -22 201 396 13 186 -145 -107 66 63 324 69 32 -153
5188a53K82k96J97j46L4q8LK89j99J53M2j60nM22k29L0k37R3J46m0l96L17m17
$$ -153 129 -167 30 -116 -82 -170 -167 122 -77 76 118 -42 -47 375 146 176 -61 32 178 138 -258 59 -358
5211c58M06k65K04O4n1n3Op3R8J18O5k35j07J28K23m82L40M5m2J45j17N9k39K95
$$ -358 48 -217 -13 51 0 -53 -47 -120 -22 96 161 -74 -181 -53 170 -312 28 73 31 176 59 118 -121 174
5235A74j32J5q4p5k50L70r2P2K46o6j58k74J62N8K11n19J19M45k95J3M09j10j65
$$ 174 42 57 -27 -102 -352 18 -74 -2 244 178 20 -254 -92 -34 177 -342 -223 222 -73 -60 349 239 74
5258G4j97r0L83k74M62k96J92l12R3l6n4o2OM46m49K12k49J74k7j10o0O9R8J57
$$ 74 -123 -213 170 -104 358 62 254 -58 35 -1 -55 -117 -111 335 -114 98 -151 23 -4 -114 -174 -105 -7 150
5282A50k95J97J61k34L2J53j98k1j13M58k43k88K67k42M44j29j12J53n9j78j05
$$ 150 -145 52 213 -21 11 164 -34 -55 -168 290 47 -241 26 -216 228 99 -13 140 81 -97 -202
5303b02K00L06l92L96j37j89J78K6q0j60K45m03K52L1J37Mk64R3o5O3P1k55k6
$$ -202 -2 304 -88 308 171 -18 160 186 106 -54 191 -212 40 71 208 212 -52 41 -24 39 110 -145 -171
5326a71J42J8OO0j13oL35l52q5J10J61jk56RM31k83j17K72n0L7k13K77r9l5O4
$$ -171 -29 -11 -5 55 -58 -64 271 -81 -166 -56 105 104 -152 -143 288 5 -112 160 110 147 -66 211 112 77 141
5351A41N8l23J01q4p7J93J5J21j86K14l45J45N7r6R0J11j37M1Q9k28J29n4j23
$$ 141 199 -124 -23 -107 -184 9 24 145 -41 173 -172 -27 30 -66 24 135 -2 39 128 -100 29 -25 -148
5374a48K37Mk86J29L15k69LK8j18N9N3p6J85k49J73j24j89J50K16j37K5j97L25
$$ -148 89 93 -193 -64 251 -18 -15 13 -105 -46 7 -69 116 -133 40 -84 -273 -123 93 -44 -19 -216 109
5397A09J44j88K22j62N3k77O7j4K80p7O9k32j49K27M2l24Q0m9J80j05j80J02J18
$$ 109 253 65 287 125 178 -99 -32 -46 234 157 226 -6 -155 72 114 -210 -130 -179 1 -104 -284 -182 -64
5420f4K18n5j19k16Q8J05P1j30L32m8l81K80j33K40q8j00OM4o4Q1Oj27J98J06
$$ -64 154 99 -20 -236 -148 -43 28 -102 230 182 -199 81 -52 188 100 0 6 50 -14 67 73 -54 144 250
5444B50q1m56M7L32m9l46L54P4j72J42k02N8J05l24M48j89j4J38j46l57L67K36
$$ 250 169 -287 -240 92 43 -303 51 125 -47 95 -107 -49 56 -268 180 -9 -23 115 -31 -388 -21 215
5466B15k5k18j51L31k77J47J31n0q9k40J89j3N65o72N05m45J72k4j7K17k83l1
$$ 215 190 -28 -179 152 -125 22 153 103 14 -226 -37 -50 515 -157 348 -97 75 51 34 251 -32 -63
5488f3n9K60j2j22M8Q3p8k50M4J1j26K49j71K80J07M0l40J10m1J33k12N2M7Q3
$$ -63 -122 138 126 4 52 135 57 -193 -149 -138 -264 -15 -186 94 201 241 -99 11 -30 103 -109 -57 -10 73
5512G3l46K91k12J39qO9l13K22K77n6j9j21J2j17N2p5K80j50J41q3k28L95r0l83
$$ 73 -273 18 -194 -55 -63 6 -307 -85 192 136 117 -4 8 -109 -57 -132 148 -2 139 56 -172 223 133 -250
5536b50L07j52j01K00p9J64j86P5r0K2L00l04j96K80l36L59J1L4J13n6k59r7L69
$$ -250 57 -95 -196 4 -75 89 -97 -22 -112 -90 210 -94 -290 -10 -346 13 24 58 171 115 -144 -241 128
5559A28l71L38Q2Q3j2m4l3r1J06l21J34k9p5r6J89k29L22j91m8K75j13j21K00
$$ 128 -243 95 177 260 248 204 171 80 186 -135 -1 -30 -105 -201 -12 -241 81 -110 -158 117 4 -117 83
5582H3j4Q2k4R7k59K51j63j78J71j26N8J40j66J63j09K3O7j53J90J42l92K8m0
$$ 83 69 151 127 224 -35 216 53 -125 46 -80 -22 118 -48 115 6 29 96 -57 133 275 -117 -89 -129
5605a29J04R8l32q2J01K23P0j4l29K85L6j91N20j87r6k4j44L83k98r8K91om19
$$ -129 -25 73 -259 -341 -240 -17 53 39 -290 -5 31 -160 360 173 77 53 -91 292 -6 -104 187 181 -238
5628b38N05k68O2m2k92L76j48K9j5l0l56M87NL9j01R1j59n3J64Mj80K19k58l9
$$ -238 267 -1 61 19 -273 103 -45 -16 -31 -61 -417 70 75 114 13 104 -55 -108 56 60 -120 99 -159 -198
5652a98O32l04J76l24j05J48J1m5kR0o5K98l28o9Q3q3K08j7k82J83OK2N1l57L14
$$ -198 434 130 306 -18 -123 25 36 -9 -11 79 14 312 -16 -85 -2 -85 123 106 -176 7 13 35 86 -271 43
5677D3l22M31J36j87j88J18K80l81j09J59j58K25k10l4R6K18J47l24J61J06j20
$$ 43 -279 152 288 101 -87 31 311 -70 -179 -20 -178 47 -163 -197 -101 117 264 -60 101 207 87
5698H7N1k27J20k83M2J04Pk7K46k20L7j03J87M8j75L54l80J53j85L18k05K0r5
$$ 87 138 -89 31 -252 -210 -106 -99 -126 120 -100 -63 -166 21 69 -106 248 -132 21 -164 154 -51 -31 -126
5721a26J31j67j15K76k4j31j29M25j40l46L90k5N0P8j39j02j96K13j10J30L07
$$ -126 5 -162 -277 -1 -25 -156 -285 140 0 -346 44 19 69 147 8 -94 -290 -77 -187 -57 250
5742B50q6m12K97j46M81l75j21K27j11P9J9k9j40J76j01l9J24k32Q7l3J57J13
$$ 250 164 -248 49 -97 384 9 -112 115 4 83 102 73 -67 109 8 -31 93 -139 -52 -85 72 185
5764A85l62K56q9L4Rj4j66J44k38L10j71L4k13L67j30r9K39j14J97n16K48K7J35
$$ 185 -177 79 -10 24 33 19 -147 -3 -241 69 -102 -68 -281 86 -44 -143 96 -18 179 -337 -89 -62 73
5787G3j37J35k77J85Q2j34o6N9J91k91L17j73r9K71j19Q1r5j53J8L53j55j18M4
$$ 73 -64 71 -206 -21 61 -73 -139 -80 111 -180 137 -36 -135 136 17 98 3 -150 -132 221 66 -52 -8
5810hj82K63k2M9l8j42K03p7p6J21J14J35j87q6K6J69k77j03J21k8j56N2J73l33
$$ -8 -190 73 51 100 62 -80 123 46 -30 91 205 340 153 67 93 262 -15 -118 3 -25 -181 -129 44 -289
5834b89K79J27J03n99N42k6l01ML54k03J3k32J98J37n12L15J42K74j62k94J92
$$ -289 -10 117 220 -379 163 137 -164 -160 194 -9 4 -228 -30 107 -405 -90 52 326 164 -130 62
5855F2r9M6k4M5J3j52m7J7P6o5LR0J05Nk75K64j60J64p6J1J47j24Q2l2m4M0j05
$$ 62 -37 9 -15 30 43 -109 -156 -139 -63 -128 -125 -35 70 75 -200 64 -96 68 -8 3 150 26 108 76 32 72 -33
5882c3J5J89j52K7k0K2k6P9K27l31R8o4P6j8k39J32l8K08k16J30j16N4M9Q9k44
$$ -33 -18 171 19 46 26 48 22 101 328 -3 95 31 107 89 -150 -18 -56 152 -64 66 -50 4 53 142 -102
5907a02K67J55m57K73o6k79K75j09pj94pJ84P8j41M74j87n6k68L06k31m2K23R7
$$ -102 165 320 -137 136 70 -209 66 -43 -50 -244 -251 -67 11 -130 344 157 101 -167 139 -92 -134 89 186
5930A86j46NR4p8P7j03j35p6L62l31K11k04j06Q7J38R9m8l23L52J57j74J72k6
$$ 186 40 45 139 61 138 35 -100 -176 186 -145 66 -138 -244 -157 -19 80 32 -291 61 218 44 216 190
5953A90q1P5k13L6m8l7k8J02m5N5k13L99j91K57l20k02K22Q1L4k86J80R6J12k85
$$ 190 109 184 -29 7 -41 -78 -106 -4 -49 6 -207 192 1 258 -62 -264 -42 39 73 -213 -33 63 175 -110
5977a10J58O0k42J75k82M49j71P0j30l2n7L09J9m89K59K7J3N6j42M7J91k42R3
$$ -110 48 108 -134 41 -241 208 37 107 -23 -55 -112 197 216 -273 -14 13 26 82 -60 -13 178 -64 29
6000B9M5n7J81j77K7Rj03K04j21Q5M6j29j34K35l7Lj41r0K01p4K9N9k89L82k51
$$ 29 74 17 198 21 48 57 -46 158 37 122 168 39 -95 140 103 106 -35 -125 76 2 31 90 -199 183 -68
6025f8P5m0o3L1K25kj51K22j23k26K81r1K7k81M36j97j57J02k19J46J19J26m75
$$ -68 7 -33 -96 -65 160 158 7 229 106 -120 161 70 97 -184 252 55 -102 0 -219 -73 46 172 -303
6048c03L98j74K27l39K79J67l73r6P8R0J25q7J77L6o5j00K8k56j38P22n11J14
$$ -303 95 -79 148 -191 88 255 -118 -214 -136 -46 79 -8 169 205 140 40 68 -188 -326 396 -115 -1
6070al5J05m6o5p6J52K82k16k23j86L18K55k15n7J7K08m57K95M1J01R2m59J80
$$ -1 -36 69 23 -42 -118 34 316 100 -123 -309 9 264 49 -8 9 217 -240 55 96 197 289 -170 10
6093A0O8L0r3l4j26J73k13N6N33l33R1k40K43r0Q3q7Rr2q1Q9P1M7k27K7p4K36
$$ 10 78 108 15 -19 -145 28 -185 -129 404 71 162 -78 165 75 158 71 80 -12 -93 -4 67 114 -113 -86 -160 76
6119G6N3j37n5P8P2j83j09L07p0k44PM7J87J51k04J31k04K71j2k1k84K50Q7k79
$$ 76 129 -8 -63 15 87 -96 -205 102 32 -212 -205 -158 29 180 -24 107 -97 174 162 141 -143 107 194 -85
6143h5K64L4m10M20L8j32k7k42J40p6N4o9J04j67J17q0J73O8j74Q5M8j22J1L4
$$ -85 179 213 -197 223 261 129 102 -140 0 -76 -22 -91 13 -154 -37 -117 56 124 -50 35 83 -39 -28 6
6167FJ4L4mq1pO9l53M98k32Q0L8j56J28L26l24M3l21J23j1L53l54R0O0j38J64
$$ 6 20 54 50 -31 -38 31 -322 176 -56 24 62 -94 34 360 36 79 -242 -119 -130 223 -131 -41 19 -119 45
6192D5J9k06k81O60n1j40M9J7o2j8J00K3j21m01L63r0r5L33k3n0q2J31k28L15
$$ 45 64 -142 -423 237 186 46 95 112 50 32 132 155 34 -367 -4 -94 -189 144 121 71 -11 120 -108 207
6216B07k77J76j38N3j21K55k42J89k16K57j22j70J46J79l4k61J37PL6l9j37K34
$$ 207 -70 106 -32 21 -100 155 -87 102 -114 143 21 -149 -3 176 142 -119 18 25 61 22 -115 119
6238A19k94J10N1j57K15j52L43k62J12j09J75K14l76K62q5O7k09m2l52O42k97
$$ 119 -175 -65 -14 -171 44 -108 235 -27 85 -24 151 365 -11 251 166 233 24 -18 -370 272 -25
6259b5O3J22r6k98L79k64K22j22K14k60o5J4J95j59R2j06m4k05J10M12j45k62
$$ -25 38 160 64 -234 145 -119 103 -19 195 -65 -130 -116 79 -80 12 -94 -138 -343 -233 179 34 -228
6281b28J31K12l54j7K49K17j72l14K23J00l51K96j76J33j39L11o1j08L5J41j31
$$ -228 -97 115 -239 -256 -7 210 38 -276 -53 47 -304 -8 -184 -51 -190 121 60 -48 -13 128 -3
6302cJ88j08j82PK74k3j67K15l18J69j11P4J04l8k89L49l32M29n5k48N6J21k59
$$ -3 185 77 -105 -98 176 153 -14 201 -117 52 -59 15 119 81 -208 141 -191 238 183 -65 -9 112 -147
6325a47J10k93K82L5LK61n01K91k4k3J96p6Rj49K55k54OJ11L6n02K44K61j4m6
$$ -147 -37 -330 -48 -13 -10 251 -250 41 17 -6 190 114 123 -26 229 -25 -19 92 128 -374 -130 131 117 71
6349G1J15l4l45m8K10J39K7J3m08L43J28k02r3q6k05M23K53k17K2J4k53L41j51
$$ 71 186 152 -193 -241 -31 108 135 148 -260 83 211 9 -84 -170 -375 48 301 84 106 120 -133 208 57
6372E7L3N8j96n2J18l06K59j4j44J23KL23l51j07K75j69R9l5J03K7R1k4j71M5
$$ 57 90 148 -48 -100 18 -288 -29 -43 -187 -64 -62 261 -90 -197 78 -91 8 -27 76 103 194 170 -1 44
6396D4o2K95l79k46L75m61M51Q3l83j00J77L1J12J24J16j55j00L05q7k00M0NK1
$$ 44 -18 277 -102 -348 27 -434 17 100 -283 -383 -206 -175 -63 61 177 22 -78 227 140 -60 -20 -15 6
6419FM6n8J27k45R0J05K4k48K35p4J46l76J56J01j24K02Oj20N2J72k34r5J18O6
$$ 6 52 -6 121 -124 -34 71 95 -153 82 8 154 -222 -66 35 -89 113 119 -1 51 223 -11 -106 12 78
6443G8p6j4Qo0q6L78l78L19k96k34L51J38r0kj01j42r3J02o8K21L24o8K5j42M9
$$ 78 2 -12 -4 -64 -150 228 -150 169 -127 -361 -10 128 38 36 -65 -207 -300 -198 -266 -45 279 211 236 94 143
6468A43l21K15Mj26J9n6j55J28J98j19J42J62j80O4k16J8J47k49J51N6m9p5Q5
$$ 143 -178 37 41 -85 -66 -122 -277 -149 49 -70 72 234 54 118 -98 -80 67 -182 -31 25 -24 -99 -14
6491a4j27k3J0j42N73l88N9P2J85j84j91J6K57K3j14qk92M04j46J9k59M55j33
$$ -14 -141 -164 -154 -296 277 -111 -52 20 205 21 -170 -154 103 126 12 4 -288 116 -30 -11 -270 185 52
6514E2l3k28L11Mr0j95J40J81j73K45j64l92N22J14k77j50K40k51J3J36K13j95
$$ 52 19 -209 102 106 16 -179 -39 142 -31 214 50 -342 180 294 17 -133 107 -144 -131 5 218 23
6536B3j58J88O2N8j91L2J26l07K58J21r1j60J42K6q7K3j06j57L54m83M50j02J75
$$ 23 -135 53 115 173 -18 14 140 -167 91 212 121 -39 103 129 42 65 -41 -198 156 -327 123 21 196
6559A96j46l38L13P1j71K6P9MJ46n6j87J8q9R4J31j08J64p5P1l81L01K21k45K36
$$ 196 50 -288 25 96 -75 -49 30 34 180 124 -63 -45 -134 -40 91 -17 147 72 143 -238 63 284 39 275
6583B75l71J1J1q1J91j58M6m8M6Q5K34l3l46J50j49J28O4l09K88J04J72J38m98
$$ 275 -96 -85 -74 -155 36 -122 -76 -124 -78 7 241 208 -138 12 -137 -9 55 -254 34 138 310 448 -50
6606e0Q6L9l62L28n6KKJ60lk15l6J65M9j22j21J91l1L3m5l2J79k09J1J87l00M14
$$ -50 36 75 -287 41 -15 -13 -11 149 146 -69 -105 60 109 -13 -134 57 26 59 14 -18 161 -48 -37 150 -150 264
6632B64m09J17J8J24j66J42j91J34J51k43J02M3J4l18m9L48P7k23P0K3Q2n02M20
$$ 264 -145 -28 -10 114 -52 90 -101 33 184 -59 43 86 100 -218 -267 81 158 -65 5 28 110 -392 28
6655B8K92l13k2J3r8L56k35j05J17m7k68L48K29k91O2j1L15m39J40j72l0K39M0
$$ 28 320 7 -15 -2 -100 256 21 -84 33 -14 -282 66 295 4 66 55 370 -69 71 -101 -131 108 148
6678A48j08n3k8O0J88m70M78k41k16J36j24J12K45J46p8l25j7K49oj68J23j84
$$ 148 40 -13 -41 19 207 -263 215 -26 -242 -106 -230 -118 127 273 195 -130 -147 102 96 -72 51 -133
6700a33L6J53R8K0l1k16O5K42l79L29k69J82J18m92J16q2K42K21l95K14k91J22
$$ -133 -97 56 154 174 143 -73 -8 234 -145 184 -85 97 215 -277 -161 -243 -1 220 -175 39 -252 -130
6722a30Q5J99j87K33J83j42j88L2k56K95k20O4L6K0j0j79K66j10o8J13p4M5P0
$$ -130 -45 154 -33 200 383 241 53 85 -171 124 -96 -32 4 24 14 -165 101 -9 -77 36 -38 7 77
6745G7j32j09R9K48k40K48m2q3m3J16J33k70p3mm9K18p9l90L28O5J36l05J37K8
$$ 77 -55 -164 -65 183 -57 191 149 66 23 139 272 2 -71 -75 -124 94 15 -375 -47 18 154 -151 -14 14
6769A4r2O9n7j85K42J18j70J06j98O3K16k74L49j67r0L76o82N38k92n1J74k6J30
$$ 14 -78 -9 -66 -251 -9 109 -61 45 -153 -90 126 -148 201 34 -56 320 -362 176 -116 -167 7 -19 111
6792A11j27j70L31o5M3k10j61J28krj06J68jlj60K73K9j85j22Q3K36j12k23M09
$$ 111 -16 -186 145 80 123 -87 -248 -120 -122 -131 -237 -69 -70 -73 -233 40 69 -116 -238 -155 81 -31 -254 155
6816A55k06j42J55r8K08k57N21k81k56J34P1M3k61K42m6J98K0K4q1J15n34N70
$$ 155 -51 -193 -38 -136 72 -185 336 55 -201 -67 4 47 -214 28 -18 180 200 224 143 258 -276 294
6838B94k76j53J22P2j38j08J58O9l3J8k01J58q6J84k09L13m64K6M47l53J74J36
$$ 294 18 -135 -13 59 -79 -187 -29 40 7 25 -176 -18 -104 80 -129 184 -280 -254 193 -160 14 150
6860A50l30M3K75rpl71J35r7K0j15L40N1N6j56Q7n0j92K15l1k80L30k24J10qK37
$$ 150 -180 -137 138 129 122 -249 -114 -211 -191 -306 34 85 141 -15 72 22 -170 45 14 -266 64 -160 -50 -58 179
6885A79l13Q9J07jj25M9K95j89R2k38J29l0Q5l01j8p3K59J63n9k79K66l52J91
$$ 179 -134 -45 62 61 -64 -15 280 91 183 -55 74 44 129 -172 -190 -263 -4 159 100 -179 87 -265 -74
6908g4L44k30k94J79K67j26p3L4J05k15L85p3j33M0J8n7qk05j39M68l77K63m00
$$ -74 270 40 -254 -75 192 66 -7 27 132 -83 302 229 96 136 154 97 89 -116 -255 213 -164 99 -301
6931c01L09R2l84J31J87l13L6M74l81R5J05j08J30j45K74k09J3K49j96j33M06
$$ -301 8 100 -284 -153 34 -279 -243 231 -150 -55 50 -58 72 -73 201 -8 5 254 58 -75 331
6952C31l64j24J23p1K12k76J50j0J27p0J23m02Q8J18q3K32k2k10J51K6j45k28
$$ 331 -33 -157 -34 -105 107 -169 -19 -29 98 28 151 -251 -163 -45 -128 104 82 -128 23 49 -96 -324
6974c24K89K20j80j32K91k1Mj88M1M1j65K97m60L06j03L3N5Q9q9l3K27j29m00
$$ -324 -35 185 5 -127 164 143 147 -41 0 41 -124 173 -287 19 -84 -51 4 93 4 -29 198 69 -331
6997c31M50k90J95o1PL71k02l26M00m9p5l34K40P8k84J28m6J64j74K55l00J79
$$ -331 119 -171 24 -37 -30 341 139 -187 213 164 89 -245 -5 73 -211 -83 -129 35 -139 116 -184 -5
7019eN3p0k45J24J91k2q9j10K14M3J61k18mj0L3n2Q2%M6k30r5K62j34O8J54j78
$$ -5 48 -22 -267 -143 48 26 -63 -173 41 84 245 27 23 13 46 -6 76 76 122 -108 -203 59 -75 -7 147 -31
7045c1J15m3j59K39L3J49j08j15M9q8QK73m20J34j64j25J42J0j38O9k9L2L13k45
$$ -31 84 41 -118 121 154 303 195 80 129 41 49 322 -98 36 -128 -253 -111 -101 -239 -170 -199 -167 146 -99
7069i9L5L8j34j01J14J30l9P4J1K10k63m5M9k65K39m8L57k33l56O07m35K03j0
$$ -99 -64 -26 -160 -261 -147 -17 -56 18 29 239 -24 -69 -20 -285 -46 -94 263 30 -326 281 -154 49 39
7092C9J54k13Q6l71L01M8k43L28j27P8j14r4M2K9k23L92Oj85oJ76j07J41j11j45
$$ 39 193 -20 66 -305 -4 44 -199 129 2 80 -34 -128 -86 -57 -280 112 118 -67 -73 103 -4 137 26 -119
7116a19K31j0j37K32l26K57j46K99l47J00p2k89M46j08k02K31k40K84o5j19J6
$$ -119 112 102 -35 197 -129 128 -18 281 -66 34 -38 -327 119 11 -191 40 -200 84 19 -100 -84
7137h4K32j43j56O5J04l10K03K98k23j43J65J88l07p2M4N6K40m63N27k53l05K23
$$ -84 148 5 -151 -86 18 -292 -89 209 -14 -157 8 196 -111 -183 -139 -83 157 -306 221 -32 -337 -114
7159a14k01O55j06k23L4k1j38L89m28q2L61l31J99j77J12Q8j14o8K95j02J33k14
$$ -114 -315 340 234 11 45 24 -114 275 -153 -235 126 -205 -6 -183 -71 17 -97 -165 130 28 161 -53
7181e3j14L9P8n0K20j16J3k65J34J06k14K82o5J10k5j20L2j12L00m8l31k36L17
$$ -53 -167 -128 -50 -100 120 4 17 -248 -114 -8 -222 60 -5 105 80 -40 -8 -120 180 132 -199 -435 -118
7204a18Q6j44J64k7j12K97jm37L48n0j31M23k60J02n9N0k99J65J76j01r5K23n34
$$ -118 -32 -176 -12 -39 -151 146 145 -292 56 6 -125 298 38 140 81 131 -168 -3 173 72 -23 200 -334
7227c34n3J85J03J24J16j09Oq6K55m30L52j89L5M3j29J61l0p0L05q7k17L3j09
$$ -334 -387 -202 -99 25 141 32 38 -48 207 -223 129 -60 -25 18 -111 50 20 -50 255 168 -49 -16 -125
7250a25K2j5J45l2J21k13L80n24J78j82M6K11j64k5J68j24J05J50j06j22M96l21
$$ -125 -103 -118 27 -5 116 -97 283 -241 -63 -245 -199 12 -152 -177 -9 -133 -28 122 16 -106 390 69
7272F9j17q3K68j8k43J35Kr9k06L37J68j02k7P2l06%P5K38j70Kj02j08K82M9m46
$$ 69 -48 -131 137 119 -124 11 13 -86 -292 45 213 111 84 156 -150 -150 -75 163 -7 -5 -107 -215 67 116 -330
7297c30J68L27l93K46J68k11O6K2K75k82k80R3J9K41j16r7k21K7M8J58O4k58J42
$$ -330 -162 165 -228 18 186 -25 41 63 338 56 -224 -131 -112 129 13 -84 -305 -278 -230 -72 -8 -266 -124
7320a24J34j01n5P1m1J06m9j65P4j48L73k82J72%N8j37r7J92K48j86q3L05m39
$$ -124 10 -91 -146 -75 -116 -10 -59 -224 -150 -298 75 -207 -35 -35 23 -114 -211 -19 229 43 -40 265 -174
7343a74J44J14k11K26r4L11j06Qjn21P2J07o1J03J08j89R9J75j65n0J43k4l6R6
$$ -174 -30 84 -127 99 5 316 210 218 217 -304 -232 -125 -186 -83 25 -164 -65 110 -55 -105 38 14 -22 74
7367G4K1n3j9L8j0R7L5k32j2J64k25P4J66k10J54l63q7L47j08j6J45L7j2J97l24
$$ 74 95 42 23 61 51 148 183 -49 -61 103 -122 -48 118 -92 62 -301 -388 -41 -149 -165 -20 17 5 202 -122
7392a22K34j63J86Jj38J89o5k16K33l87k1K24K7J52j84r8K71k36OK13l4J6J52
$$ -122 112 -51 135 136 -2 187 122 -94 139 -248 -269 -45 -18 134 -50 -148 123 -113 -107 106 72 88 240
7415B40l21K83j58j48Kl6K24J67l60j0R1L4j73K82l45K32j36J17q0K83J19l83
$$ 240 -81 202 44 -104 -102 -138 86 253 -107 -117 -26 8 -165 117 -228 4 -132 -15 -95 188 307 -76
7437g6lJ08j11O4K27j79j69J35k1j8K0Q1j69J08L4j51L2K95k35j08M4K11J18m13
$$ -76 -79 29 -82 -18 209 30 -139 -4 -25 -43 -23 58 -111 -3 31 -120 -88 207 -28 -136 -92 119 237 -176
7461a76J54P8J41j74l5k5J6J49j2k44K87k51J12q7K03O4k33j85M6K24j65K69R0
$$ -176 -22 56 197 23 -12 -37 -21 128 116 -128 159 -92 20 -67 136 200 -33 -218 -172 52 -113 156 246
7484B46j74k43K41l37K74J62N9l11K20j62j11R5k54L73jJ42k42o8L99l74J04J86
$$ 246 72 -171 70 -267 7 169 228 -83 137 -25 -136 -41 -295 78 77 219 -23 -91 308 -66 38 224
7506B24N6j67k84O4M9K95k83P3N0l67L46l37K84k0j01L0N3j9n9lJ42n1l7M2j41
$$ 224 280 113 -171 -107 -58 237 -46 27 77 -290 56 -281 3 -17 -118 -88 -35 -54 -113 -116 26 -25 -62 -20 -161
7531a61J78N6j38O9J07l72L95Jk60J89k20K52j14j19J19j24R5kn0O1J13j24p0
$$ -161 17 73 -65 4 111 -261 134 135 -125 64 -156 96 -18 -137 -18 -142 -47 -49 -99 -38 75 -49 -119
7554a19N3o1J94r2l8J9J34j94K02k4j53K96j23k56L25Q0j63j49j30J56j1r7J14
$$ -119 -66 -127 67 -25 -63 -44 90 -104 98 74 -79 217 94 -162 163 243 80 -69 -199 -43 -54 -151 -37
7577c7O8j70M2L9P9k03L9l8J85J56k79L09O4k21Lm2K8P0k52M26j68J22ol47K26
$$ -37 31 -139 -97 -58 21 -182 -143 -181 4 160 -119 190 254 33 36 -6 22 92 -160 266 98 220 214 -133 93
7602I3N3j34K5j4j82M45k8l37P2J82j64jo9m2O2L0l6j16J98q2k50K48o8j09K91
$$ 93 146 12 37 23 -159 286 258 -79 -7 175 11 10 -59 -101 -39 -9 -45 -161 37 -45 -295 -47 -115 -224 67
7627F7l8n6m5Q9J32l5k00r0K16k40R2M53j05J8k19j76K39j94R3J97p7m3k04K87
$$ 67 29 -27 -72 17 149 114 -86 -176 40 -200 -108 345 240 258 39 -137 102 -92 1 198 121 78 -126 161
7651A61k32K90k99M8K1j55J70J78j19m4J71j08J54j63R2j60j42J37P6k22LR7K3
$$ 161 -71 219 -80 -32 -11 -166 4 182 63 19 190 82 236 73 165 5 -137 0 76 -146 -143 -46 -23
7674b3K16m8k45J19p8K06k64R2j4O2j43M07j81k21J84j9J18m7J1K19j60k84L97
$$ -23 193 145 -100 19 -59 147 -117 -25 -39 23 -120 287 106 -115 69 50 168 121 132 351 191 -93 304
7697C04j68K19k09l9l39Q5J63o0n0K74m70K08K06R4o40L37j09R7n5K7J65ML3j56
$$ 304 136 355 146 107 -232 -147 16 -44 -94 180 -290 -82 124 218 -422 -85 -194 -97 -152 -125 40 44 77 -79
7721g9r9P0M07k73K17j59jj10j55K42Q6j78N4J10j2j57J39k4j52M9k30K45R4j56
$$ -79 -178 -108 299 26 243 84 83 -27 -182 60 146 -32 22 132 120 -37 102 78 -74 -25 -255 -10 84 -72
7745g2J40K6j05o9M48m82j2K74k27p2K49k1l2M8j21j10K27j96J67j80J15j06J35
$$ -72 68 94 -11 -80 368 -114 -126 148 -79 -151 98 77 45 93 -28 -138 89 -107 60 -120 -5 -111 24
7768B4K2K45l83K00o5j28j71K69l96M08p6J29j33j55J87J16J43p7j18k03K70l29
$$ 24 46 291 -92 108 43 -85 -256 13 -383 25 -51 78 -55 -210 -23 93 236 159 41 -162 108 -221
7790b21K71j71K98j46qR3m40L87j40j8J72J83m32J47L8l08L05n8K7J04j91J61
$$ -221 50 -121 177 31 23 116 -324 63 -77 -95 77 260 -172 -25 13 -295 10 -48 -21 83 -108 53
7812E3l52O4K32K68k06k40J47P4lk08J17K01j26p5NP6Oj85J55N3K02l40j29J52
$$ 53 -299 -235 -3 265 59 -181 -34 40 37 -171 -54 147 21 -54 -49 27 33 -152 3 56 258 -82 -211 -59
7836e9M0j90K12l9q5Q1r5J04J21o5pq3O3K66k22O7q8m2R2p2j08M16L1j69j2j64
$$ -59 -19 -209 3 -36 -121 -40 -135 -31 90 25 18 -65 -2 264 42 109 21 -21 71 -1 -109 307 338 169 157 -7
7862gj55J71k48L22j5q3j55N74k38j36o8q8l7Q6k17L34J77l54J31J11Rk57L35
$$ -7 -162 9 -239 83 68 -15 -170 404 166 30 -38 -126 -163 -77 -294 40 217 -137 -6 105 114 -143 192
7885A92l40L49j73O2Nj07j65M54l35J01l80J93J21L02l67K1J05l1q1m3J92j35
$$ 192 -148 201 28 90 95 -12 -177 277 -58 43 -337 -144 -23 279 -88 -67 38 7 -74 -117 75 -60
7907f0J81j27n0JJ79j94N5l02L12n7O1q0J71j67J08K05m26M22l13J43l7l6L5n1
$$ -60 121 -6 -56 -55 124 -70 -15 -317 -5 -62 -1 -81 90 -77 31 236 -190 232 -81 62 25 -11 24 -27
7931b7o2J40p9J1L02l46K17l63K2K36P7k37J97p3n1p3j11J99J60m88L89ok30N48
$$ -27 -89 51 -28 -17 285 -61 156 -207 -185 51 128 -109 88 15 -36 -109 -220 -21 139 -349 40 34 -196 352
7955C52l00J0k4j92J58J27J3k07m1L46r3j9k33J18m7O3P1l96J64k1O3R7J6j34
$$ 352 52 62 38 -154 4 131 144 -63 -104 242 149 130 -103 15 -32 31 102 -294 -130 -151 -88 9 25 -109
7979a09l8N7o0K19j07J37j24J94R5k60j09L67m12K23J3J9j80K46k94Q7M9j53m8
$$ -109 -147 -90 -150 69 -38 99 -25 169 264 4 -105 262 -150 73 86 105 -75 171 -123 -36 13 -140 -188
8002a88K62j52o0K68l07Rl88M39J03L77o66K83k11K87l8k25K86N5j71J47j30J05
$$ -188 74 -78 -138 130 -177 -168 -556 -117 -14 363 -303 -20 -231 56 18 -207 79 134 -37 110 -20 85
8024H5J76k12J11l06K95k07p7p5L20m6j53R9k4R0n9o9K13o1m14K5K75k30L31O1
$$ 85 261 49 160 -146 149 -58 -135 -210 110 64 -89 10 -14 76 17 -52 161 100 -314 -289 -14 -244 87 148
8048A48%o3j86J98NP7k42R0J17k09J85l0l11L13k14j15J55O5n4L28k68Rk10M89
$$ 148 148 85 -101 97 102 179 -63 27 144 -65 120 90 -221 92 -122 -237 -82 -17 -71 257 -11 -2 -212 277
8072B77k76N2P2J86l68L8p7J66k16j79K26l2j33J44L49l20J75l22J72J43%M1j53
$$ 277 1 53 125 311 -57 -19 -96 70 -146 -325 -99 -131 -264 -120 229 -91 84 -238 -66 77 77 118 -35
8095c5M3j43Q1J50J05k62R7k49K64q0M0p9J08n7O0Q5l62N00j47j70M9J5J8p7r7
$$ -35 8 -135 -54 96 201 -61 36 -213 51 -29 11 -68 40 -17 43 128 -234 266 119 -51 -2 13 31 -46 -143
8120a43L3J5J95r4L19n01K08J63j47j07J24k27J44j85J53j12M1K23k82K47j51
$$ -143 -110 -95 100 6 325 -176 32 195 48 -59 65 -162 -18 -203 -50 -162 -121 102 -180 67 -84
8141h4J73M9l89K74K64j39j45O7po1j00m8O9l6J82l1o7J6N5N5k25J0J46J4K7p0
$$ -84 89 138 -251 23 287 148 3 70 63 2 -98 -146 -77 -113 69 38 -29 -13 42 97 -128 -118 28 42 69 -1
8167aJ09j05K2K1j41N02j96k36M1j05J61k79K47m5j56r7K67k25K15J66k18PJ95
$$ -1 108 3 25 46 -95 407 211 -25 16 -89 72 -207 40 -5 -161 -258 9 -216 -1 165 -53 -46 149
8190A49p4
$$ 149 75
8191G5
$$ Imaginary data points
##PAGE= N=2
##DATA TABLE= (X++(I..I)), XYDATA
0@%%%%%%%%%%%%%%%%Qj6J6j6J6j6J9k7L2l2M0m8N4o2P1q1R0j03J17j32J48j64
$$ 0 0 0 0 0 0 0 0 0 0 0 0 0 0 0 0 0 8 -8 8 -8 8 -8 11 -16 16 -16 24 -24 30 -32 39 -42 48 -55 62 -70 78 -86
38h6J81k01K24k50K77l05L36l72M12m54N00n49O03o65P34q12Q98r93J104j232
$$ -86 95 -106 118 -132 145 -160 176 -196 216 -238 262 -287 316 -349 385 -427 471 -522 582 -650
58f50J381j561J779k048K391k844L473m407N930q803J5957o1904j01486J91726
$$ -650 731 -830 949 -1099 1292 -1552 1921 -2486 3444 -5359 10598 -51306 -152792 38934
72C8934M5244r4732K061L2909k5346J4461M6766m7279o3552P3015J6686p1074
$$ 38934 84178 -10554 -8493 24416 -930 13531 60297 13018 -50534 22481 39167 -31907
84c1907K5836K2751k4495L2721j8071n6618L6286N4342m0565n2248N1708L1441
$$ -31907 -6071 16680 -7815 24906 6835 -49783 -13497 40845 280 -51968 -260 31181
96C1181n9531L0502M3625p2422J0300O5062n1890k8108O4738R906n8192M674M4097
$$ 31181 -28350 2152 45777 -26645 -16345 48717 -3173 -31281 33457 43363 -14829 -10155 33942
109C3942m2320j3820O8248m4964o9929O7124M1387l5191j3783o600J094K4599
$$ 33942 -8378 -22198 46050 1086 -68843 -1719 39668 4477 -9306 -15906 -14812 9787
121I787J1668l2385k0576M0840K39l2033M0245m298n0979M3272K3191o1322P246
$$ 9787 21455 -10930 -31506 9334 9573 -22460 17785 13487 -37492 5780 28971 -32351 -25105
134b5105O1045k1149n6572L7768M3319n4439j0129M4617k8048j0876L2968k0296
$$ -25105 35940 14791 -41781 -4013 39306 -15133 -25262 19355 -8693 -19569 13399 -6897
146f897q784L7901m389l9913R583L6098k0016j5670K4726k3351j0784N0193j5038
$$ -6897 -15681 22220 17831 -22082 -12499 23599 3583 -12087 12639 -10712 -21496 28697 13659
159A3659m4179L0743J5046l4423P695L4829k1987k5442L7961P37l5902L5629J2768
$$ 13659 -30520 223 15269 -19154 -11459 23370 1383 -24059 13902 14639 -21263 14366 27134
172B7134n7153J3310M8992k4581k5777K9520N711l0278J7582K1102l6563N10L1135
$$ 27134 -30019 -16709 32283 7702 -18075 11445 17156 -13122 4460 25562 -11001 -10491 20644
185B0644k5336q109L0008j6104j8895K6662K918l3906R982L3722k4122j4398L1998
$$ 20644 -4692 -12801 17207 1103 -17792 8870 11788 -22118 -12136 21586 -2536 -16934 15064
198A5064j5898j9551L9291p40m3027J1631L0556j5813j2837K2179o915k0450K8062
$$ 15064 -834 -20385 18906 18166 -24861 -13230 17326 1513 -11324 10855 3940 -16510 11552
211A1552L991l3155J8689J7359l0511M25K6223r092j6904J2807J786j9817J7534
$$ 11552 15543 -17612 1077 18436 -12075 -11650 14573 5481 -11423 1384 3170 -16647 887
224H87J4249l3259M973K9667k1768q942K4529q293j7695J5985J0632k2756K948
$$ 887 15136 -18123 -13150 16517 -5251 -14193 10336 2043 -15652 333 10965 -11791 -8843
237h843K8946k0761j3746L2253j0373k1307K6491K632k5192O000J7081j0346r948
$$ -8843 20103 -658 -14404 17849 7476 -13831 12660 15292 -9900 -3900 13181 2835 -7113
250g113J7240q949k1968K8731N103l4098J6032J6439k2336L363J7106j1104j1514
$$ -7113 10127 1178 -20790 7941 13044 -21054 -5022 11417 -10919 -7556 9550 -1554 -13068
263a3068J7805O046k6126J3371K5089l0803k486L0993j7520j1569K0999m931j5570
$$ -13068 4737 10783 -15343 -1972 23117 -7686 -10172 20821 3301 -8268 12731 7800 -7770
276g770R402J2902j8448q157K6423j2828k0815K6935l912k1803K0394L471j8595
$$ -7770 1632 14534 -3914 -12071 14352 1524 -19291 7644 3732 -18071 2323 5794 -12801
289a2801O836J3703q675j1727J7894L376k4548J8989J3959k9438J0208J8517j9606
$$ -12801 -5965 7738 -937 -12664 5230 8606 -15942 3047 17006 -12432 -2224 16293 -3313
302c313j692J5109n633j1969Q482J1274j9248j489K3099j9291q391K4260j2776
$$ -3313 -5005 10104 4471 -7498 984 12258 -6990 -8479 14620 -4671 -13062 11198 -1578
315a578j0594J6849l291r768O151R020q968q231J9276m554j7809K1580l40k0055
$$ -1578 -12172 4677 1386 -8382 -2231 6789 -2179 -10410 8866 4312 -13497 8083 7743 -12312
329a2312J7341M803j6759N619R566o866q981J1684N830k0269R401J3989k2892
$$ -12312 5029 9832 -6927 -1308 8258 1392 -7589 4095 9925 -10344 -943 13046 -9846
342i846N429J6953j8079j235J3852o036q123O995Q088j3715j868J9130j4175q309
$$ -9846 -4417 12536 -5543 -6778 7074 1038 -7085 -90 7998 -5717 -7585 11545 -2630 -10939
356a0939K2898j1593j2076J8779k166j2900O699Q653q892p385J6457k218j7890
$$ -10939 11959 366 -11710 7069 4903 -7997 -1298 7355 -1537 -8922 7535 5317 -12573
369a2573J8378M182k1606J3072R730j6679K201J0651n327r136Q978O672j6897
$$ -12573 5805 9987 -11619 1453 11183 -5496 -3295 7356 2029 -7107 1871 8543 -8354
382h354M914J4848j8734M84J7383j3978o177J4358j955r838M107R364j0295l807
$$ -8354 -3440 11408 -7326 -6842 10541 -3437 -9614 4744 2789 -7049 -2942 6422 -3873 -7680
396g680J6917r025j0915J9060k451j4089J1867L622r825K343P722o136p631J2545
$$ -7680 9237 212 -10703 8357 5906 -8183 3684 7306 -2519 -176 7546 1410 -6221 6324
410F324J095j6670R646P642j4791M307P173j0846N02R506l782q926O326P568j0650
$$ 6324 7419 -9251 395 8037 -6754 -2447 4726 -6120 -5618 3888 106 -8820 -2494 5074 -5576
425e576J693J0068j1676J113J4516r670p063J1816K311q508J056O361o433j605
$$ -5576 -3883 6185 -5491 -4378 10138 468 -6595 5221 7532 -976 80 6441 8 -1597
439a597J1235r306q838J4581j753j1761O340K714p315K796O454q099o077J5149
$$ -1597 9638 332 -8506 6075 4322 -7439 -1099 1615 -5700 -2904 3550 -4549 -10626 4523
453D523O86j6042Q622Q230j0007L520N444p810Q99J0451l249j0978Q219P088j2301
$$ 4523 5209 -10833 -2211 6019 -3988 -468 4976 -2834 -1935 8516 5267 -5711 2508 9596 -2705
468b705K108R038j2605P2J2837q670q993Q991M794j0200r78J0066o480m204J2475
$$ -2705 -597 8441 -4164 -4092 8745 75 -8918 73 4867 -5333 -6311 3755 -2725 -6929 5546
483E546o328p826J3206j324r708O486M970p044j659J0750k524j1735J1339M574
$$ 5546 -782 -8608 4598 3274 -6434 52 5022 -2022 -3681 7069 4545 -7190 4149 8723
497H723j4141N658N991r200J974M737m196l214M317K100p743L536O538j1880L078
$$ 8723 -5418 240 6231 -2969 -995 3742 -454 -3668 649 2749 -4994 -1458 5080 -6800 -3722
512c722J2685j2035m657J2148j902o642K441M947m187l628J0421l870p943J0241
$$ -3722 8963 -3072 -7729 4419 2517 -4125 -1684 3263 -924 -4552 5869 1999 -5944 4297
526D297k076n580P902l915n579P857J808o035l621Q044K316j1148N244M724r918
$$ 4297 2221 -3359 4543 628 -4951 2906 4714 -1321 -4942 3102 5418 -5730 -486 4238 -5680
541e680P093M183j1037L845N537l685k340M94K517m022K762N561j2171K359J5413
$$ -5680 1413 5596 -5441 -1596 3941 256 -2084 -1590 927 -3095 -333 5228 -6943 -4584 10829
556A0829j1608p167J0195N62k571p93P83l31j292P242l872q439J0250q32p528
$$ 10829 -779 -7946 2249 2811 240 -553 230 -101 -1393 5849 1977 -6462 3788 2956 -4572
571d572R954l433q239Q773L163p260l748O672L007j0958M489P792j2452L860R027
$$ -4572 5382 1949 -6290 2483 5646 -1614 -5362 1310 4317 -6641 -2152 5640 -6812 -2952 6075
586F075r491L65M956k593j55J180K041m046L75Q856q062m642J2956n615o625P698
$$ 6075 -3416 -3051 1905 -688 -843 337 2378 -1668 -1293 7563 -499 -5141 7815 2200 -4425 3273
602C273j147k786J958m98j169k559N441n82r782P519J857p805P829K52r118N389
$$ 3273 2126 -660 1298 800 -369 -2928 2513 1931 -7851 -332 1525 -6280 1549 1801 -7317 -1928
618a928N296l339m053K854N279n724J336P574q838j47P661n096l59K542m157J333
$$ -1928 3368 29 -4024 -1170 4109 -1615 -279 7295 -1543 -1690 5971 875 516 3058 -1099 234
634B34K964r36m929r39Q016n026n941Q154l021m106Q286k757n607M187L083k008
$$ 234 3198 2262 -2667 -3606 4410 -616 -6557 1597 -1424 -5530 2756 -1 -5608 -1421 1662 -346
650c46l037M434J475n830N473K350p249O125J878q402K755N626k984l898R17L205
$$ -346 -3383 1051 2526 -3304 2169 4519 -2730 3395 5273 -3129 -374 5252 2268 -1630 -713 2492
666B492l545J178L057p790O36P675n614k668N304k086j705L452J501m944n34P865
$$ 2492 -1053 125 3182 -4608 -3972 3703 -1911 -4579 725 -1361 -3066 386 1887 -3057 -3591 4274
682D274l641m932P583j005m821N794M45n397J077M020j683l519L271K52n124M548
$$ 4274 633 -4299 3284 2279 -2542 3252 3697 -1700 -623 3397 1714 -1805 1466 1718 -3406 1142
698A142K281p349K610L203m736N99M042j259m256K088M092l899M01L517n600P19
$$ 1142 3423 -3926 -1316 1887 -2849 -2250 1792 533 -3723 -1635 2457 -1442 -1041 2476 -3124 -2405
714b405O910l172l333K599J104j810j25K644k872j490N473l054l736N745j103
$$ -2405 4505 1333 -2000 599 1703 -107 -232 2412 -460 -1950 3523 469 -3267 2478 1375
729A375l550K946J84k118J95K362r05k970L974m01m758N002J697o318K364K002
$$ 1375 -2175 771 955 -1163 -968 1394 489 -2481 1493 1092 -3666 1336 3033 -3285 -921 1081
745A081k177J454O98j191k431K299L872n435M26M585n410J378M769m149j111K139
$$ 1081 -1096 358 1056 -135 -2566 -267 3605 -1830 -1404 3181 -2229 -851 3918 -231 -1342 797
761G97N00j123l08L099l323k320O832l494m244N833j880l387L135r8j662k27K321
$$ 797 1297 174 -134 2965 -358 -2678 4154 660 -3584 2249 369 -3018 117 19 -1643 -1870 451
778D51J94m919M616K087o706M668K412n643K832K055k177Q29L56P58k806J050
$$ 451 645 -4274 342 2429 -4277 391 2803 -2840 -8 2047 -130 699 1055 1813 -993 57
794E7N245n679j514N793m529p81M263l829j394J610L49o38k331L427p17m143O099
$$ 57 5302 -377 -1891 3902 -627 -1408 2855 -974 -2368 -758 -409 -1047 -3378 49 -668 -4811 1288
811A288p12m711O093j076k933L703n18l49n09R99J912m172J877L588n816K268
$$ 1288 576 -4135 1958 882 -2051 1652 1134 785 276 1275 3187 -985 892 4480 -1336 932
827I32K681n377J872J445l026O83p19P79j270j123M414k923j825N245l458n19
$$ 932 3613 -1764 108 1553 -1473 -790 -1509 -730 -2000 -3123 1291 -1632 -3457 1788 -1670 -2189
843b189N051m106R5K646n72M47j699J785O72l636L970j10n138N673q78m351L777
$$ -2189 2862 -1244 -1149 1497 925 1372 -327 1458 2130 -1506 2464 2354 -2784 2889 2011 -2340 1437
860A437q97j848M03k71J542l061J254L078m869J922L920n756K183L191l405P10
$$ 1437 540 -1308 -905 -1176 366 -2695 -1441 1637 -3232 -1310 2610 -3146 -963 2228 -1177 -467
876d67J012N59o19j297L402k076k314N285k891k717N132k260j736K063p56m60
$$ -467 545 1104 485 -812 2590 514 -1800 3485 594 -2123 3009 749 -987 1076 320 -140
892a40p65J408Q3l802L566J390n156L046J918l632K105P39j561O44J22J447k359
$$ -140 -905 503 586 -3216 350 1740 -3416 -370 1548 -2084 21 760 -801 -157 -35 1412 -947
909i47j9L430l177J9L251l794M86L087k420o54Q17R41n86j366K126j066k082L768
$$ -947 -966 2464 -713 -694 2557 -1237 -751 2336 -84 -738 79 1020 434 -932 1194 128 -1954 1814
927A814j478k582L629p29j794J572p14j43k90J348j82k657K351J728l700J506
$$ 1814 336 -2246 1383 654 -1140 432 -282 -425 -715 633 451 -2206 145 1873 -1827 -321
943c21Q43j635J089N46r20L57M08P95j514P8K358k732P78K205k981k99K894j079
$$ -321 522 -1113 -24 522 -398 -41 367 1162 -352 -274 2084 -648 130 2335 -646 -945 1949 870
961H70j744P79J122j190j139K117j520j583L135j640j479K905q88j509J543P17
$$ 870 -874 -95 1027 -163 -1302 815 -705 -2288 847 -793 -2272 633 -255 -1764 -221 496
977D96p48r42K586K04l246K877J163k789J678M80j570M58M55M7j423N10Q77k640
$$ 496 -252 -1194 1392 1596 -1650 1227 2390 -399 1279 1759 189 647 1102 1149 -274 236 1113 -1527
995a527Q96K157l812K27L309k729o91J830J50m82r61K131j21j937L209j018j490
$$ -1527 -631 1526 -2286 -2059 1250 -1479 -2170 -340 -190 -672 -1633 498 377 -1560 1649 631 -859
1012h59L088j230r38K043j464j08N41M65l80k759K100J367l917J745Q25k975K057
$$ -859 2229 999 61 2104 640 532 1073 1538 1158 -1601 499 1866 -2051 -306 519 -2456 -399
1029c99Q8j343P63n19J276j74j142K027j398M10K781l579M93L298k567L70N00
$$ -399 -311 -1654 -891 -1410 -134 -308 -1450 577 -821 -411 2370 -1209 -716 2582 15 385 885
1046H85l48P34j114R41J70k290K518j216k251L611k221j532L028k090m33J255
$$ 885 537 1271 157 1098 1268 -1022 1496 280 -1971 1640 -581 -2113 915 -1175 -1608 -353
1062c53J17K30k212J809K309l877J661J902l295K269M27k002J821m19L10J05j044
$$ -353 -236 -6 -2218 -409 1900 -1977 -316 1586 -1709 560 987 -1015 806 387 697 802 -242
1079b42J980j867m07L232l444p66L605k859k79J367j472O48p96J169M73k522K488
$$ -242 1738 -129 -536 2696 -748 -1514 2091 -768 -1047 320 -1152 -504 -1300 -131 342 -2180 308
1096C08M15k923L376k44k943L098q16o26R34q33J221j438M63K378l333M94K321
$$ 308 723 -2200 1176 932 -2011 1087 271 -355 579 -254 967 -471 -8 2370 -963 -469 1852
1113A852k548Q14J030k358J229j14l15P52j632K107q40j534L243j570j389K820
$$ 1852 -696 118 1148 -1210 19 -95 -410 342 -1290 817 -23 -1557 1686 116 -1273 1547
1129A547j748k12J631j636L01m65K86J007k180J348J191k337K075K30k540K490
$$ 1547 -201 -413 1218 -418 -117 -582 -296 711 -1469 -121 1070 -1267 808 1038 -1502 988
1145I88k83r98R94o84M68k57m10J804j920j75K206k482Q09J147k154O18M21q20
$$ 988 705 -293 701 17 485 228 -182 1622 -298 -473 1733 -749 60 1207 -947 -329 92 -728
1163g28J25n63Q01m65q71K194p71j055K314q39p68K075o33l84J35M03P91j888
$$ -728 -603 -1166 -365 -830 -1701 493 -278 -1333 981 142 -626 1449 816 432 567 970 1761 -127
1181a27P58P97k182J597O52k797J557M43j320k01L9L88j085QJ189j267r2K022
$$ -127 631 1428 -754 843 1495 -1302 255 698 -622 -823 -784 -396 -1481 -1473 -284 -1551 -1643 379
1199C79j599L87J561p43K72R46L0o5p41Q62j71j279J696r83j524J788j07j033
$$ 379 -1220 -833 728 -15 257 1203 1233 1168 427 1289 1118 -161 1535 552 -972 816 709 -324
1217c24L23K31m19r38P29L87j555J010N96j421J088L38j112R09L52lJ23o5R89
$$ -324 -1 230 -189 -1127 -398 -11 -1566 -556 40 -1381 -293 45 -1067 -158 194 191 314 249 1238
1236A238r38R3J284j862K77J086j219L1N62q85J58k4M27j15r64J039m22r22J639
$$ 1238 300 393 1677 -185 92 1178 -41 -10 552 -333 -175 -199 228 113 -851 188 -234 -1156 483
1255D83r14q09J562r12L95J51m62R54p62P19P86j607J186M62j924J486k69j249
$$ 483 -431 -1240 322 -590 -195 -44 -506 448 -314 405 1191 -416 770 1232 -692 794 525 -724
1273g24J058k99M76m14n92J351j238l6J939k049J26J433j972O83K80r74Q76m23
$$ -724 334 35 511 97 -495 856 -382 -418 1521 -528 -402 1031 -941 -258 22 -952 -76 -499
1291d99M45K58j300J772l11j426K418j410p10J704q29L5N37j127J033j191P11
$$ -499 -54 204 -1096 676 365 -1061 1357 -53 -763 941 112 147 684 -443 590 -601 110
1308A10J256k276P83J451k244J414M96j945J244n07J98L49j440J495n98j032K255
$$ 110 1366 -910 -127 1324 -920 494 990 -955 289 -218 -20 329 -1111 384 -214 -1246 1009
1325A009j428n59J905j604L74P09j098R84q56M79Q24j792J442L68j583J987o39
$$ 1009 -419 -978 927 -677 -303 406 -692 292 -564 -85 739 -1053 389 757 -826 1161 522
1342E22j334J841r39j87Q19j026Q39p60m22J241j602M69J420k127J047O94j882
$$ 522 -812 1029 90 -97 722 -304 535 -225 -647 594 -1008 -539 881 -1246 -199 495 -1387
1359a387J215K55j084J170j005J184M0j351J818p72o19K181j574j72J497j144
$$ -1387 -172 83 -1001 169 -836 348 388 -963 855 83 -536 1645 71 -101 1396 252
1375B52N51k16m73P10j120K19N47j692J637l18j764J710p23l66R45n97N51m75
$$ 252 803 587 114 824 -296 -77 470 -1222 415 97 -1667 43 -680 -1046 -101 -698 -147 -622
1393f22q0J362j112o0J929j735N52J167j426O38M71m83J81o03N51k84j020J248
$$ -622 -702 660 -452 -512 1417 -318 234 1401 -25 613 1084 601 782 179 730 446 -574 674
1411F74p90r19J445r29n94R74q62L72J93l3M16q79O14Q84j231Q43L28q94Q69N26
$$ 674 -116 -1035 410 -519 -1113 -139 -1001 -629 -436 -469 -53 -932 -318 566 -665 178 506 -388 481 1007
1431A007j151O52j71M44l13n74J243j127n07J092j066K80L23j121N40J10k93L23
$$ 1007 -144 508 337 781 468 -106 1137 10 -497 595 -471 -191 132 -989 -449 -339 -632 -309
1449c09l83N23j17o29J054m03m60J425o82NM32m15j8L83j18J46p22O76O5q54O63
$$ -309 -692 -169 -286 -915 139 -264 -724 701 19 24 456 41 23 406 288 434 -288 388 453 -401 262
1470B62%p92R02k95l14M01n08L42l95J27O83r24R1Q18j076O11L28o75N7L58J45
$$ 262 262 -530 372 77 -237 164 -344 -2 -397 -270 413 -511 -420 398 -678 -67 261 -414 -357 1 146
1491A46j4m14P91l94o16J108l11o90O46n73K75P21p83K3J52o7O53j343P71M74
$$ 146 132 -282 509 115 -501 607 296 -394 252 -321 -46 675 -108 -85 67 0 653 -690 81 555
1511E55j505J174N1l74J19l13J71j45l03O66m04k44Q52j141M94R50j241L88O48
$$ 555 -950 224 275 -99 20 -293 -122 -267 -570 96 -308 -552 300 -841 -347 603 -638 -250 398
1530C98n20N18r02N87M19p40R91j64j087J393n23o25P90q54K45K54n45K86l28
$$ 398 -122 396 -506 81 500 -240 751 587 -500 893 370 -255 535 -319 -74 180 -365 -79 -407
1549d07k22N98r20N66N78j156P29K28o90J074m18K5O75o02M98m7l32J082j288
$$ -407 -629 -31 -951 -385 193 -963 -234 -6 -696 378 -40 -15 660 58 556 509 177 1259 -29
1568b9K24R95j558O39J09j192R37n31m9M34q14M73L21j288J611p25n09J547j082
$$ -29 195 1190 -368 271 380 -812 125 -406 -455 -21 -835 -362 -41 -1329 282 -443 -952 595 -487
1587d87M0O59o32P63j02m70J535j086K59O16j249P17J97j088R55m96m22O64r34
$$ -487 -447 212 -420 343 241 -229 1306 220 479 1095 -154 563 760 -328 627 131 -291 373 -561
1606e61K38j16o00R23l66m88J077p01l6J047r08M77J07l65Q59p24K84N35q03P32
$$ -561 -323 -439 -1039 -116 -482 -970 107 -594 -630 417 -491 -14 93 -272 587 -137 147 682 -121 611
1626F11O0r46J289q47j68O56p03L62J17j112J046n92n04J049r81J27Q08q81P03
$$ 611 671 -275 1014 167 -1 655 -48 314 431 -681 365 -227 -731 318 -663 -536 272 -609 94
1645I4o7o14P74p34M36K27k95M50N5n69J082q34p5P72r26N07N0n17O53n91k06
$$ 94 27 -587 187 -547 -111 116 -179 271 326 -243 839 5 -70 702 -224 283 333 -184 469 -122 -328
1666c28N68o08O07j60o23O66n2o03Q41o03L29K02o12J95J58l68R39r61Q5R40p26
$$ -328 240 -368 239 79 -544 122 70 -533 308 -295 34 236 -376 -181 -23 -391 548 -413 -328 612 -114
1687a14J22M24o13K06j6J09L97p39M92mn71O20l00J22K76m22J69j95k48Q38q45
$$ -114 8 432 -181 25 9 118 515 -224 268 264 -307 313 13 135 411 -11 158 -37 -285 553 -292
1708b92J63L24o16L57N63j363Q72o8k79L62l46N09M6l68K62L3n82J036o56L96
$$ -292 -129 195 -421 -64 499 -864 8 -60 -339 23 -323 186 232 -136 126 159 -423 613 -43 353
1728C53j2j85K6J96l96L66l54J94j33l11J57Ol83N54n17k06O93p16N90m97J9P03
$$ 353 341 156 182 378 -18 348 -6 188 55 -256 -99 -93 -476 78 -439 -645 48 -668 -78 -575 -556 147
1750A47m11J19M11m06M99J81o51Q13n01K70q3J5J91k19n13M77k24k67N62q60L92
$$ 147 -264 -145 266 -140 359 540 -111 702 201 471 388 403 594 375 -138 339 115 -152 410 -450 -58
1771e8O4p90N41Rk57L63l48K42M63p79P77l89j2R62p47J08L07k36L95k72k18M54
$$ -58 6 -784 -243 -234 -491 -128 -476 -234 229 -550 227 -162 -174 788 41 149 456 220 615 343 125 579
1793E79m99K09J74o78M32k14m32M22l37l7J91k19L62j08o69J117m84k57P58n78
$$ 579 80 289 463 -215 217 3 -429 -7 -344 -381 -190 -409 -47 -155 -824 293 -191 -448 310 -268
1813b68K99L45q81J164l72q6M89o94L40K55o32M99j43p21O27l26l46N22n03K38
$$ -268 31 376 -505 659 287 201 690 -4 336 591 -41 458 315 -406 221 -105 -451 71 -432 -194
1833a94L3o15Q44o73J93O96r16P59K55q18Q10k91m54R14n74Q4N41q33Q13n11l57
$$ -194 -161 -776 68 -605 -412 284 -632 127 382 -436 374 83 -371 543 -31 53 594 -239 574 63 -294
1854b94Q36q57J99M30p79N50m8l61N84n64J37M77q61P51P4q39Q94l57k58N56n53
$$ -294 542 -315 -116 314 -465 85 37 -324 260 -304 -167 310 -551 200 274 -565 329 -28 -286 270 -283
1875b83L66K66p96N50j55j05O92p96L58L38q99M84O0m24N72k71L05J25o09J53
$$ -283 83 349 -447 103 -52 -157 535 -261 97 435 -464 20 80 -344 228 -43 262 387 -222 -69
1895f9L11l68J038j074m1O92l11j13K6m58L84l59L2L32o35Q90r3l83J83J35n28
$$ -69 242 -126 912 -162 -203 489 178 65 91 -367 17 -342 -310 22 -613 277 184 -199 -16 119 -409
1916d09O23k89J18J83k97N64l50l54R11m64q2K98m89J68K6l50J25J41j54l6l05
$$ -409 214 -75 43 226 -71 493 143 -211 700 236 154 452 -37 131 157 -193 -68 73 -81 -117 -422
1937d22L12Q9k33L79q3l83O48l63J39J36k67N85k84K1J03k33J33k7m52O80l45
$$ -422 -110 -21 -254 125 42 -341 307 -56 83 219 -48 537 253 274 377 144 277 250 -202 478 133
1958A33k17K11k10L7j45p7j03R3r6K94m39O2O38o48L75J72l63O00n6k23L59l99
$$ 133 -84 127 -83 -46 -191 -268 -371 -278 -374 -80 -519 -457 181 -467 -92 80 -283 317 261 38 397 -2
1980bR2K72l46M89l26j21L14k36m6Q8l07O5j19J34p9q3l4l0k06L07q2K03n1r1
$$ -2 90 362 16 505 179 58 372 136 90 178 -129 -64 -183 -49 -128 -211 -245 -275 -481 -174 -256 -53 -104 -195
2004a95L08J59m02J88l97L79K85l63m5M04l42J44L02k31l18k3R9J79m40M40k9
$$ -195 113 272 -130 58 -339 40 325 -38 -83 321 -21 123 425 194 -124 -147 -48 131 -309 131 102
2025A02m04J31l37L43L13k09q1k8J01K89k84r2K97m01L41J30l91L28j01J46L44
$$ 102 -302 -171 -508 -165 148 -61 -142 -170 -69 220 -64 -156 141 -260 81 211 -180 148 47 193 537
2046E37p07K22M6j59L54k40j23M10m43N7R0j31q3J74j87K55p1J0J27n37N63l55
$$ 537 -170 52 98 -61 293 53 -70 340 -103 -46 44 -87 -170 4 -183 72 1 11 138 -399 164 -191
2068a91O0M84n17q1M60k36p6M78n80M99n41J21M19k88K42Qn14M87l77l5O73o83
$$ -191 -131 353 -164 -245 215 -21 -97 381 -199 300 -241 -120 299 11 253 261 -253 234 -143 -178 495 -188
2090a88L54O2l46M87q1o14M54n11K00L49p84N16L06n31N51l37K3K34n23N66K02
$$ -188 166 228 -118 369 288 -326 128 -383 -183 166 -618 -102 204 -327 224 -113 -90 144 -379 187 389
2111C89o94R01l92l80P09m15K0L11l52L97m42k13N71q79K82J01j49J22J13m76
$$ 389 -305 596 204 -176 533 118 138 449 97 494 52 -161 410 -469 -187 -86 -235 -113 0 -476
2131d76P06o40K26L37o48O01o7m13M73j55j08N43n39N31j59j19L13j28k75K32
$$ -476 230 -410 -184 153 -495 106 39 -374 99 -56 -164 379 -160 371 212 93 406 278 3 235
2151B35n40L42O0m95N80j92m45O03k50n9J39m51L53o8j69N34k00k26N97l00J22
$$ 235 -305 37 97 -398 182 -10 -455 148 -102 -161 -22 -473 -120 -188 -357 177 -23 -249 348 48 170
2172A70K82m26L80m20k36P54o85K92k9J31r9o14K08K31k81J57L13m49K18j81j49
$$ 170 452 26 406 -14 -250 504 -181 111 82 213 114 -500 -292 -61 -342 -185 128 -321 -103 -284 -433
2193d33M33j08j28L55j49K16j45r7J45J0j91L78l35J03K10j22J22j66k40L85j88
$$ -433 0 -108 -236 119 -30 186 41 -56 89 99 -92 286 -49 54 264 142 264 98 -142 243 55
2214E5k08J82k38J82J45k02J76l55L44O4l53L06o6m75O66l66K22n7j96L90j16
$$ 55 -153 29 -209 -27 118 -84 92 -263 81 145 -208 98 32 -443 223 -143 79 22 -174 216 100
2235A00r3L21l76J77J10m06M58l79J84o1j69K61Mj93J19p1l39M78J45k60l7K9
$$ 100 7 328 -48 129 239 -167 291 -88 96 35 -134 127 131 -62 57 -14 -353 125 270 10 -27 2
2257BJ28j37Q6J30l74J44J44l60L22j24J66k07K45l19R8o4mK82j96Q2j19n7K83
$$ 2 130 -7 79 209 -165 -21 123 -237 85 -39 127 -80 165 -154 -56 -120 -124 158 -38 44 -75 -132 151
2280A51j32lK09k94K41l84P2K83j49O3J98l43J50k87M9K01l55O7K74k74K79j76
$$ 151 19 16 225 -69 172 -212 -140 143 -6 57 255 -88 62 -225 -176 25 -330 -263 11 -263 16 -160
2302a60K0M30l88LJ94k6L85k16j99L93l09j55L13k33J18j53m43O26J8l19J3k2
$$ -160 -140 290 -98 -95 99 73 458 242 43 436 127 -28 285 52 170 17 -426 200 218 -101 -88 -110
2324a10j96M39n50K53o8n7M66j83J00K00n10M12R9l19M68m03K02K50m37K82j48
$$ -110 -306 133 -417 -164 -232 -289 177 -6 94 294 -216 196 295 -24 444 41 243 493 56 338 190
2345A90n39N98l66J23J12n81K11K54k88M24m84R7L49n03K10K63m48O71o1m36L40
$$ 190 -349 249 -117 6 118 -463 -252 2 -286 138 -346 -249 100 -403 -193 70 -378 293 232 -204 136
2366A36l21J03K86k97N84l84k90M86l85J29n3r3NJ42j01J35j97L7J42l88N88k18
$$ 136 -185 -82 204 -93 491 107 -183 303 -82 47 -6 -99 -94 48 -53 82 -115 -78 64 -324 264 46
2388D6l56M61p0k29J20k08K3L87l98P52m18l80M98k32k81M85n63J93K17k51M88
$$ 46 -310 151 81 -148 -28 -236 -213 174 -224 528 110 -270 228 -4 -285 200 -363 -170 47 -204 284
2409B84l17r4L99m44K61k26R6j27J69n8J15l84L36J96l12K47k7k71L86k16J31
$$ 284 -33 -127 272 -172 89 -137 -41 -168 1 -57 58 -326 10 206 -106 141 114 -157 229 13 144
2430A44n7j56K00k37J00J31l10K36L41n64K79K7l58L40j69j13L18j40q8n4j89
$$ 144 87 -69 131 -106 -6 125 -185 51 392 -172 107 134 -224 116 -53 -166 152 12 -76 -130 -319
2451c19M27j9m86N50m03L24J29n39K89L4j62L50l47L07k83M8M02k91k70K00R0
$$ -319 108 89 -397 153 -250 74 203 -336 -47 -13 -175 175 -172 135 -148 -100 302 11 -259 -59 31
2472C1J69l1j71RQ5k76M5K46kk54K15ll7q7j22J58l35L66j28K46o2k56K43n5l3
$$ 31 200 169 -2 7 92 -184 -139 107 105 -149 66 63 26 -61 -183 -25 -360 6 -122 124 62 -194 49 -6 -39
2497c9K79m11K06J28k31L16k49J00K36l77K04P0l89L53k94pJ01k62J31L6j58L07
$$ -39 240 -171 35 163 -68 248 -1 99 335 -42 162 232 -157 196 -98 -105 -4 -266 -135 -99 -257 50
2519E0j77l7K40l17Q3K42k21q0K00k07M42j55K29k15j25L04o0k76L90k05k42L53
$$ 50 -127 -164 76 -241 -158 84 -137 -217 -17 -224 218 63 292 77 -48 256 196 -80 310 105 -137 216
2541B16l15l7K10O1k75jk37K68k54L43k02J92j44L46j55O4j00L5M61n56M31k82
$$ 216 -99 -136 74 135 -140 -141 -378 -110 -364 -21 -223 -31 -175 171 16 80 -20 15 476 -80 351 69
2563F9J47R0l80L53k45P9J6k42k47L35k6jr7k49K12Q6r4L28J1K0l29J31m7J61
$$ 69 216 306 -74 279 34 113 129 -113 -360 -25 -51 -52 -149 -398 -186 -100 -194 134 145 165 -164 -33 -80 81
2587H1k05L99n11L55K68o74K18K86k45Q9j18J1K85m16J75R3j40p0N2P2J1k30K61
$$ 81 -124 275 -236 119 387 -287 -69 217 -28 61 -57 -46 239 -177 -2 91 -49 -119 -67 5 16 -214 47
2610D7R1k2P0j38k30L28l62K58M4l01N5M95k33J36l10k51K57J15L5J25l93L11
$$ 47 138 116 186 48 -182 146 -216 42 86 -215 -160 335 102 238 -72 -323 -66 49 84 209 -184 127
2632A27J82k28J5m7N2N3n01O00m01l27O62k91J95j1Q6q9R9j81J48J0l03K38k02
$$ 127 309 81 96 49 101 154 -347 253 -148 -475 187 -104 91 80 166 77 176 -5 143 153 -150 88 -114
2655a14m4L72m75M50Rk64O0j04L05k98J44M76n26N2j08P5k1K51o34N32k48O1J64
$$ -114 -158 214 -261 189 198 -66 -6 -110 195 -103 41 517 -9 43 -65 10 -11 240 -394 138 -110 -49 115
2678A15j08j73L49m28K74J61l49K72R0j76L02k51k1KmK35k73J76J10L9j52km80
$$ 115 7 -166 183 -245 29 190 -159 113 203 27 329 78 57 59 55 290 17 193 303 342 190 188 -292
2701b92L09K43j25j2m22K55J6R3k09j08M3k2K06NK03j94P2km5J89l42J87K49l35
$$ -292 17 260 135 123 -299 -44 -28 65 -144 -252 -209 -231 -25 -20 183 -11 61 59 14 203 -139 48 297 -38
2725c8J76n5q2L22j53k01J34o0j15m6k37N30j76K6l15j61J60J73j00L7N0J77n0
$$ -38 138 83 1 323 170 -31 103 43 -72 -118 -355 175 -1 25 -290 -451 -291 -118 -218 -181 -131 46 -4
2748dj18O0q6J17K86l71Q8K87j95k00J97n1k0p4K85j54l2J9p3l4J81m70N69j91
$$ -4 -122 -62 -148 -31 255 -116 -28 259 64 -136 61 10 -10 -84 201 47 15 34 -39 -73 108 -362 207 16
2772A6j25J28q1k81K10k8P4R1L9J03l21J07K15L7j96J94l03L00j36j52Q1J14R
$$ 16 -109 19 -62 -343 -133 -161 -87 4 43 146 -175 -68 147 184 -12 182 -121 179 43 -109 -28 86 95
2795I5k3j37K18j46M2K7j41R4L8j47K17k41J87J15l60P3P2P7l2l1J52k78J8k29
$$ 95 72 -65 153 7 49 76 -65 29 67 -80 137 -104 83 198 -162 -89 -17 60 28 -3 149 -129 -111 -340
2819c40M33m5k08L40l90j14J25MK20n1k4j24M15j90J88k45j49q3K25K78j57j38
$$ -340 93 48 -160 180 -210 -324 -199 -195 25 -26 -50 -174 241 51 239 -6 -155 -238 -13 265 108 -30
2841c0J99l34k2M80m79R8k06L63m8k64J81P4l8O3m9J83o4k55M92k66l92L50J18
$$ -30 169 -165 -187 293 -186 -88 -294 69 21 -243 -62 12 -26 37 -12 171 107 -148 344 78 -314 36 154
2864A54k33K53Q1j27J77l28np9m6P9k1K2J20k56K82k10m6L8J24k6K36k14K08P0
$$ 154 -79 174 255 128 305 -23 -28 -107 -153 -74 -95 -73 47 -209 73 -137 -183 -145 -21 -47 189 -25 183 253
2888B53k74K23k7j33L81o38K40J37k99K61L29n69K60l13J21O5j53k24K39o5L65
$$ 253 -21 202 175 42 423 -215 25 162 -137 124 453 -116 144 -169 -48 17 -136 -360 -121 -186 179
2909A79k89k94L34j75L83j44J32o1P5j12J1R7j20K11j71Q1J14l34mL28j70j23
$$ 179 -110 -404 -70 -245 138 -6 126 65 140 28 39 136 16 227 56 137 251 -83 -87 241 71 -52
2931e2j3m8L2l2K54l30Q0K70m14l9K14p9M12l69K87j65oj57K23k01K90n4m36N76
$$ -52 -65 -113 -81 -113 141 -189 -109 161 -253 -292 -78 -157 255 -114 173 8 2 -155 68 -133 157 103 -333 243
2955B43m39K47J06n4j30M0j5j54L58o13K86j02K40J83m50J96j45j13L81J49q4
$$ 243 -196 51 157 103 -27 13 -2 -156 202 -411 -125 -227 13 196 -254 -58 -203 -316 65 214 130
2976A30o2N0j67J32J85J1k49K6K4J17Kk60N2R7j82j79L03l0K69k96P2K22l96J57
$$ 130 68 118 -49 83 268 279 30 56 80 197 199 -61 -9 88 -94 -273 30 0 269 -27 45 267 -129 28
3000B8O9k53K29Ql99L85j35k19J41J75k11J87j00J34j39L43j6n06N20l96K91j10
$$ 28 97 -156 73 81 -318 67 -68 -287 -146 29 -182 5 -95 39 -100 243 227 -279 241 -155 136 26
3022B6j78k7K7o2J71L93m82pK04k44J50Q5l55K08o7K05j04J23q3j5J29j30j53
$$ 26 -152 -179 -152 -214 -43 350 -132 -139 65 -179 -29 56 -299 -91 -158 47 -57 66 -17 -32 97 -33 -186
3045a86K65J3n6n5j14L05p1p4K6K56j57o2n9J17R5l69K67j38J9J45k09kJ91m88
$$ -186 79 92 36 -19 -133 172 101 27 53 309 152 90 31 148 243 -126 141 3 22 167 -42 -44 147 -341
3069c41L78p6j95J63Kj46J18j29L51j43o4J69k00J68J75k7O8r2j37j27L4q6K42
$$ -341 37 -39 -234 -71 -69 -215 -97 -226 125 -18 -82 87 -113 55 230 203 271 179 42 -85 -51 -137 105
3092A05j50K96j74m86M07k69J52j23K10R8n3l1O7j65j21L20k14j74O18m70M96
$$ 105 -45 251 77 -409 -2 -271 -119 -242 -32 66 13 -18 49 -116 -237 83 -131 -305 313 -157 339
3113C39l01j91M38j74j56J87p2N1K8k69K01O6j52K88m14J94j76r6K57j30O5J24
$$ 339 38 -153 285 111 -45 142 70 121 149 -120 81 147 -5 283 -131 63 -113 -209 48 -82 -17 107
3135A07J01k81P9j82K51m2n0k7J27r4L84m66j06K47m11M23p7O7j30j2N3P4j99
$$ 107 208 -73 6 -176 75 33 -17 -44 83 -11 373 -93 -199 48 -363 60 -17 50 -80 -92 -39 35 -164
3158a64R0k4j41M38l92J2M95l87j00J32m9K54k76m5K62j39Kl5R8L7j34j10K24
$$ -164 -74 -98 -239 199 -193 -181 314 -73 -173 -41 -90 164 -112 -157 105 -34 -32 -67 31 68 -66 -176 48
3181D8J44k58K6P4j4j6M9j48R3j41Q8J27J49l46j18J29L1K85l79J34J01J03j90
$$ 48 192 -66 -40 34 20 4 53 -95 -2 -143 -55 72 221 -125 -243 -114 -83 202 -177 -43 58 161 -29
3204b9J03k17P2k4k38L17P1k7p2j43J60K54m05L09J4o3m8j14L3nM8K43n13J56
$$ -29 74 -143 -71 -95 -333 -16 55 28 -44 -187 -27 227 -178 131 145 82 34 -80 -47 -52 -4 239 -274 -118
3228a18K27j2J1N4k43M02k8l96J65n5k38L80k46J42j14R1oMn4O3J04m5J32j95
$$ -118 109 97 108 162 -81 321 293 -103 62 7 -231 149 -97 45 -69 22 16 20 -34 29 133 88 220 25
3252B5j15M73m69N27l06j03l3k46J41m4O1K9J33k03K84l11J83Q4l50M25j24l3
$$ 25 -90 383 -86 441 135 32 -1 -247 -106 -150 -89 -60 73 -130 154 -157 26 110 -240 185 61 28
3274B8N6l19J91j99K30n3M5K10j05j43M0N3k65J72L90k48j53J62R9j05J8N2k79
$$ 28 84 -235 -44 -243 -13 -66 -21 189 84 -59 -19 34 -231 -59 331 83 -70 92 191 86 104 156 -123
3297a23k5R1j02J66R4j47J59o6K1J2j08J34P0o3J57j08l45M40j91K09j73j77K8
$$ -123 -148 -57 -159 7 101 -46 113 47 68 80 -28 106 176 113 270 162 -183 257 66 275 102 -75 -47
3320d7J67n22M36k74N3K31k53R0q5j75L64q0j89K21J01n8O3k66J70K09k54K05
$$ -47 120 -402 34 -240 -187 44 -209 -119 -204 -379 -15 -95 -284 -63 38 -20 43 -223 -53 156 -98 107
3342A07k79M43j82l11R0q0L49k13rK35j00k76J75J71l62M05l59J1Q3k2K5Q6J14
$$ 107 -172 271 89 -222 -132 -212 137 -76 -85 150 50 -226 -51 120 -242 163 -196 -185 -102 -124 -99 -13 101
3365A01j19K33j6j06j97K05M4l54O56k20k01Q1l87K52p9J86J30l85nK65j50L1
$$ 101 -18 215 199 93 -104 101 145 -209 447 227 26 107 -280 -28 -107 79 209 -176 -181 84 -66 -35
3387c5K34l58L83q1j15L35k61J16j71L1l0O5k96M62k69O1m7r5j19J57q1j05K90
$$ -35 199 -159 224 143 28 363 102 218 47 78 48 113 -183 279 10 71 24 -71 -190 -33 -114 -219 71
3410G1k31K97k84J27J47k8p0l2oK56k46m2K80k00j59K41l73K73o0O6M6j38R4k7
$$ 71 -160 137 -147 -20 127 99 29 -3 -9 247 1 -41 239 39 -120 121 -252 21 -39 27 73 -65 29 2
3434BN1J22k25K00j11M2n0J80j03n9K35k56J62k62J22m5j35J46j4R0l5K9j19r
$$ 2 53 175 -50 150 39 81 31 211 108 49 284 28 190 -72 50 5 -130 16 2 92 57 86 -33 -42
3458d2P9j46N6p4q4K58m8K7o5j6K37k01J48j95J67L1J71mm40o5N05m75J75J16
$$ -42 37 -109 -53 -127 -211 47 -1 26 -39 -55 182 -19 129 -66 101 132 303 299 -141 -206 299 -176 -1 115
3482A15k30J75M7k43o9J37J45k01J99QN5j04j00K1Oj69L30j34jl7O2k35L52j86
$$ 115 -115 60 107 -136 -205 -68 77 -124 75 83 138 34 -66 -45 -39 -208 122 -12 -13 -50 12 -223 129 -57
3506e7K06p7J44k06j22Q9J5O9p4J62r9k25L39j40%l0n3j1J59m44J33J59PJ93k02
$$ -57 149 72 216 10 -112 -23 -8 61 -13 149 50 -175 164 24 24 -6 -59 -70 89 -355 -222 -63 -56 137 -65
3531f5O0J17J99m51K66l81L04j06n3M15o15O16j22k80K68m61K74J90k37l9M4J08
$$ -65 -5 112 311 -140 126 -255 49 -57 -110 305 -310 306 184 -96 172 -289 -15 175 -62 -101 -57 51
3553E1j71j76J79qJ48o3J3J45k97J89j57J97n5N4k8p7K5Q5j93L73j92l32O09n87
$$ 51 -120 -296 -117 -125 23 -40 -27 118 -179 10 -147 50 -5 49 21 -56 -31 54 -139 234 42 -290 319 -268
3577b68K7L66j70q0J30R7K54k51j09J36j56P3OO4J41l70J69k18mL34k15Q5L6R8
$$ -268 -241 125 -45 -125 5 102 356 105 -4 132 -24 49 55 119 260 -110 59 -159 -163 171 -44 41 77 175
3601A75l03J3K6L41k28l33L96j86K84j62k04r3K48k8k0K36k40R9k62J79P7l45
$$ 175 -128 -115 -89 252 24 -309 87 -99 185 23 -181 -274 -26 -54 -74 162 -78 21 -241 -62 15 -330
3623c30N46j40p2P7l3k07L76j9j89K31l97K09j84J57Kq8K18K1l12O7k09K75J14
$$ -330 216 76 4 81 48 -159 217 198 9 240 -157 52 -132 25 27 -61 157 178 -134 -67 -276 -1 113
3646A13j44oP9k09K07pk1j12o9K26k65n6J81K05k51J14P4P6J53j47r9j31K08j62
$$ 113 -31 -37 42 -167 40 33 12 -100 -169 57 -208 -264 -83 122 -129 -15 59 135 288 141 42 -89 119 -43
3670d3j06L43m3O2k88m5n8j6O7j00K61q3j03K08j7j1j8M6k46J8j37M88k59j18
$$ -43 -149 194 151 213 -75 -120 -178 -194 -127 -227 34 -49 -152 56 39 28 10 56 -190 -172 -309 179 -80 -198
3694a98M05j63R5J06j68K75m56L75k87L4L3j08J33k34n0M65k34k78J78k2k7L27
$$ -198 207 44 139 245 77 352 -104 271 -16 18 51 -57 76 -158 -208 257 23 -255 -77 -99 -126 201
3716B01k16k56J07J17M1q5j83L20p8K19L9l84M62q0k02M1K69m89O4M8J57j98q5
$$ 201 -15 -271 -164 -47 -6 -91 -274 46 -32 187 226 -158 304 224 22 63 332 -157 -93 -45 112 -86 -171
3739a71J17l03P9J30n3J19K5J12j23K4k98K73jJ03j8j07n4K61n3K01l99M11k68
$$ -171 -54 -357 -278 -148 -201 -82 -57 55 -68 -44 -342 -69 -70 33 15 -92 -146 115 62 263 -136 275 7
3762Gj14j01l8J46J38j16P0j36R8J0j53r7M27k00J79j33k20N53k97j78J11J03
$$ 7 -107 -208 -246 -100 38 -78 -8 -144 -46 -36 -189 -286 141 -59 120 -13 -233 320 23 -155 -44 59
3784E9j41J41j60k6L59m53L07j4O4l11K49J64j43k22J09l7j08J31j29J86j57L08
$$ 59 -82 59 -101 -127 232 -221 86 72 136 -175 74 238 95 -127 -18 -55 -163 -32 -161 25 -132 176
3806A76k53J51j25L28j73l01L22j1j44n5j43L69l49K02k0K4j60L10n4k70J16L17
$$ 176 -77 74 -51 277 104 -197 125 114 -30 -85 -228 141 -208 -6 -26 -2 -162 148 94 -176 -60 257
3828B57l19j08J55J48k72J56j75Q7J68l63M36k54j01L9K39l17L31j49o4Q1P3j9
$$ 257 -62 -170 -15 133 -139 17 -158 -71 97 -266 170 -84 -185 -146 93 -224 107 -42 -106 -25 48 29
3850B9K2m1j6l0K46k57j35O10k34l8j89j76K95J98o08K99j75Q6J78l20L65o5M1
$$ 29 51 10 -6 -36 210 -47 -182 428 194 156 -33 -209 86 284 -324 -25 -200 -114 64 -256 109 44 85
3873H5l46L94o5l4k73K06M3k88Q5M80k10l83L09o5K53j69n4L4p7k9L11j43r3J58
$$ 85 -261 133 68 34 -239 -33 10 -278 -193 287 77 -306 3 -62 191 22 -32 2 -75 -104 207 64 -29 129
3897A29j24J19k45k31M96k76K55l63K40j05n2J28J11o50L57K81l95M90k60J50
$$ 129 5 124 -121 -352 144 -132 123 -240 0 -105 -157 -29 82 -568 -211 70 -325 165 -95 55
3917E5p4o4R0O3N6J76l21R6O8o53L48N43k76p6J16k86l3L87j89k88J67o4K22K03
$$ 55 -19 -83 7 70 126 302 -19 77 145 -508 -160 383 107 31 147 -139 -172 215 26 -262 -95 -159 63 266
3941B66j26L0j3m9j85J38m3k25K06L2R1k1j89K41j77K46n4j28JJ25k92J66K3r0
$$ 266 140 170 157 108 -77 61 18 -207 -1 31 122 101 -88 153 -24 222 168 40 41 166 -126 40 63 -27
3965b7j90J29n3J68K31o5k90J21O7j80R4O7k33pL72l79J1L40l36K79l03L72k75
$$ -27 -217 -88 -141 27 258 193 -97 24 91 -89 5 72 -161 -168 204 -175 -164 176 -160 119 -184 188 -87
3988h7K92M7k54N0K24P1l60J95q4q8q1K2K28m95J62J51j98K09P4l47J04M11k62
$$ -87 205 252 -2 48 272 343 -17 178 94 6 -75 -53 175 -320 -158 -7 -205 4 78 -269 -165 246 -16
4011a6L17l97L8P6J56R9l47O4N1L30q4k54J4J13rj5j11j01MK2K10k10O6k3J29
$$ -16 301 -96 -58 18 174 273 -74 -10 41 371 287 33 47 160 151 136 25 -76 -72 -50 160 -50 16 -7 122
4036A22l38M6Lj52M94k30j9r9p6J23O4j44K27J59j30J54J74k82Qp5j55K52N2k37
$$ 122 -216 -170 -167 -319 175 -55 -74 -173 -249 -126 -62 -206 21 180 50 204 378 96 104 29 -126 126 178 -59
4060e9l21M18j04J32K24n2k89j69P5J34L1p1R5k72R1J36j38O3J58p9K1m8k54M37
$$ -59 -380 38 -66 66 290 238 -51 -220 -145 -11 20 -51 44 -228 -137 -1 -139 -76 82 3 24 -24 -278 159
4084A59kj11J61k81M04k52p3j0j92J50p9p9J08J03j02J51k31j0M4K83k27K34k16
$$ 159 157 46 207 -74 330 78 5 -5 -197 -47 -126 -205 -97 6 -96 55 -176 -186 -142 141 -86 148 -68
4107f8J42J11l37K8L28j80K03k23J88k22k23N22J1k17M9m15K74o9j0N3K17j56
$$ -68 74 185 -152 -124 204 24 227 4 192 -30 -253 269 280 63 112 -303 -29 -98 -108 -55 162 6
4129FJ6k67K60j8j76L0P9k96N24j01N7j80J04J18j76m5K96m09J95J81l28J09K58
$$ 6 22 -245 15 -3 -179 -149 -70 -366 158 57 114 -66 38 156 -20 -65 231 -178 17 198 -130 -21 237
4152B37m34L35j45L3Q8j58J92j53J18J73k40k00K45l14r2K89M0j13J86j96J47
$$ 237 -197 138 -7 26 114 -44 148 -5 113 286 46 -154 91 -223 -315 -26 14 -99 87 -109 38
4173C8O9KJ97l25P7j47j22R7K44k19K3O8J22j26j34K49j5p4o5q8K46j73k21K67
$$ 38 107 109 306 -19 58 -89 -211 -114 130 -89 -66 2 124 -2 -136 113 98 24 -41 -129 117 -56 -277 -10
4197a0n9k75M63r6N6j37k05J01l3J78N9J02k83L83m49K2J18J28J50q4j4mj02J39
$$ -10 -69 -344 119 23 79 -58 -263 -162 -195 -17 42 144 -139 244 -205 -183 -65 63 213 129 115 111 9 148
4221A48Q2l99K77K8l00K57j45p2J4k36M22o2J52j14n8k5K13N2j34j89k86N10j77
$$ 148 230 -169 108 136 -164 93 -52 -124 -110 -346 76 14 166 52 -6 -31 182 234 100 -89 -375 135 -42
4244d2J05k4j0k44L92k80K10j80J06P3j43O0J33K2j03k86K89j05J30k46J88k30
$$ -42 63 39 29 -215 177 -103 107 -73 33 106 -37 23 156 178 75 -211 78 -27 103 -143 45 -185
4266a85J39j01pJ99j63J01N2Q4q1j68L41p3k74J85J64n78M35m9k7j45M2N6K9M8
$$ -185 -46 -147 -154 45 -118 -17 35 119 38 -130 211 138 -136 49 213 -365 70 21 -6 -151 -109 -53 -24 24
4290B4L54n74K8J58J3m2N3J56qk50L53j12l32J11j0K58k97L51k30K24j46l0l7
$$ 24 378 -196 -168 -10 3 -39 14 170 162 -88 265 153 -179 -68 -78 180 -117 234 4 228 82 52 15
4313A5J72k65M14j69l60N05k96J52j4R3k38k86K21k8j35J01J7J58k0j12Q9J08
$$ 15 187 -78 336 167 -193 312 16 168 154 247 9 -277 -56 -84 -219 -118 -101 57 37 -75 14 122
4335A22j42L27j19l8nNj65K07k14L66l68j9L4j31K29m6k06K88j69J62n2j05j20
$$ 122 -20 307 188 150 145 150 -15 192 -22 344 -24 -43 -9 -140 89 43 -163 125 -44 118 66 -39 -159
4358a59J99j78J66L14k81j10j5J67M0j50o9l2m7L12J6l47L28k02P9j88M9K65j57
$$ -159 40 -138 28 342 61 -49 -64 103 143 -7 -76 -108 -155 157 173 -174 154 -48 31 -157 -108 157 0
4381@p2L75k47p6J90k29K31j69J64n9j37N4M8j41K39j33k06K20j90J78j80k01
$$ 0 -72 303 56 -20 170 -59 172 3 167 108 -29 25 73 -68 171 38 -168 52 -138 40 -140 -341
4403c41L45o1J09J33j30M4q9n0J53j14q2K81k0l24M55l22J2J15n47L85N0j17J81
$$ -341 4 -57 52 185 55 99 10 -40 113 -1 -83 198 178 -146 309 -13 -1 114 -433 -48 2 -115 66
4426F6m9n7j73J78oo3P6Q3lJ0M4Q6J9k96j01K96M9l59L11j54M7L18l65k43L76
$$ 66 17 -40 -213 -35 -41 -104 -28 55 52 62 106 192 211 -85 -186 110 159 -200 111 -43 4 322 -43 -286 90
4451I0Q4k27j28J21J54l06K73J75k88J18k07R3N4k71M27k10j09L48l7l32K14K9
$$ 90 174 -53 -181 -60 94 -212 61 236 -52 66 -141 -48 6 -265 162 -48 -157 191 154 -178 36 65
4473F5nN4p5l6r0j33K17L7k61K31k88L55k02K8L3j06J49J47j48R8l26J29O7NN8
$$ 65 60 114 39 3 -87 -220 -3 34 -227 4 -284 71 -131 -103 -70 -176 -27 120 -28 70 -256 -127 -60 -55 3
4498CK75l78J79m3o3K22J8n23K38J78l0J44k22l3j51K67k00MJ79J91j36j9O1j68
$$ 3 278 -100 79 36 -27 195 213 -310 -72 106 76 220 -2 -35 -186 81 -119 -115 64 255 119 100 161 -7
4522gN0j50J28m2k1%K5o5j71K17L15m1n39L45r1J79l51K86K7O6q6K12l36j40J55
$$ -7 43 -107 21 -21 -42 -42 -17 -82 -253 -36 279 238 -301 44 -47 132 -219 67 94 160 74 286 -50 -190 -35
4547c5J10j91K74k97l2L8O5O1l21K30j63L83j86J44k36q9M10k27J88k56J57k4
$$ -35 75 -116 158 -139 -171 -133 -68 -7 -328 -98 -261 122 -64 80 -156 -245 165 -62 126 -130 27 3
4569CJ54k79n3K82P3j02p3j54L12k40J09n3k6P3O5n9j66L58k48N8J65k01j81J38
$$ 3 157 -122 -175 107 180 78 5 -149 163 -77 32 -21 -47 26 91 32 -134 224 -24 34 199 -2 -183 -45
4593d5j18NL10m09K3K71K00l48R7j0k6J35J8k93K76L6l25N75k45k6k05j52K33
$$ -45 -163 -158 152 -257 -234 37 237 -111 -14 -24 -50 85 103 -190 86 122 -203 372 127 101 -104 -256 -23
4616b3L36k63q8%Q2l33K69m02K4N53j81L05l55J07Q2k30K33r1m3k92K8L51r4K47
$$ -23 313 50 -38 -38 44 -289 -20 -422 -398 155 -26 279 -76 31 113 -117 116 25 -18 -310 -282 69 -25 222
4640B22k06j95M13k88O1O5j95K4o6K09p2N6m0p0p4j11K01R7l01K35np2O8k0r7
$$ 222 16 -179 234 -54 7 72 -123 -99 -165 44 -28 28 -12 -82 -156 -267 -66 31 -270 -35 -40 -112 -44 -64 -161
4665a61J72m1j44l5K00J08k90J56mmP4j40N2j3p8J25p5k09K50L2K92r5J57k52
$$ -161 11 -30 -174 -209 -9 99 -191 -35 -39 -43 31 -109 -57 -70 -148 -23 -98 -307 -57 -25 267 172 329 77
4689G7m8j78K05j87M9J67k35K52J05l80R0L3O3L35j66n14L83l04M03k53l2L07
$$ 77 29 -149 56 -131 -82 85 -150 102 207 -173 -83 -50 13 348 182 -332 51 -253 150 -103 -135 172
4711A72r5l9l4O4j65N7N5N6O5k48J26p1j16M25k10O3l14pL86k86K13j61p2M01
$$ 172 77 38 4 68 -97 -40 15 71 136 -112 14 -57 -173 252 42 105 -209 -216 170 -116 97 -64 -136 265
4735B65n01L62%K0m0k07J79k13K94j72J81k44P4K75m9J15j37j32l0jj68K87k94
$$ 265 -236 126 126 146 106 -101 78 -135 159 -13 168 -76 -2 273 224 339 202 70 40 39 -129 158 -136
4758a36N2j28l7K54k24L83q3k76L2K62j22J04P4k42j31M35K4j23j09L08l58P4
$$ -136 -84 -212 -249 5 -219 164 81 -195 -163 99 -23 81 155 -87 -218 217 241 118 9 317 -41 33
4780C3N2p1m5L5P3l75K30P0R5k72lJ57M7M6L51n04J54K3j72J79j75K21k10R1n5
$$ 33 85 14 -31 4 77 -298 -68 2 97 -175 -178 -21 26 72 423 -81 73 96 -76 103 -72 149 -61 30 -25
4805b5O0k44J78j58K04j2J09j03j76L14k89J23l0N8k38L11P5m07J61L74l86Q4
$$ -25 35 -209 -31 -189 15 3 112 9 -167 147 -142 -19 -49 9 -229 82 157 -250 -89 285 -101 -17
4827a7m5J60j49J8L45m95M56j37M4J22j72k02m7K32m8k64K67j67J29J08j36k46
$$ -17 -62 98 -51 -33 312 -183 273 136 180 302 130 -72 -119 113 65 -199 68 -99 30 138 2 -244
4849b44P4J35j48M4K98l4J0K04r6q5k10J66P2l01j1L39m42L27M7k96K2j01Q2Q5
$$ -244 -170 -35 -183 -139 159 125 135 339 243 158 -52 114 186 -115 -126 213 -229 98 145 -151 -129 -230 -148 -63
4873f3Q8J95k92r8L02l75K69j42J02kk20J5L00m3n1K23l00K18l9j62J87M1k44
$$ -63 25 220 -72 -170 132 -243 26 -116 -14 -16 -236 -221 79 36 -15 208 -92 126 87 -75 112 153 -91
4896i1L89n86N53l14Q0m9j69o3M06R2k16j85Q1J45k89NK74l01L03N1k47K71m17
$$ -91 298 -288 265 -49 31 -18 -187 -250 156 248 32 -153 -72 73 -216 -211 63 -238 65 116 -131 140 -277
4919b77L52p3J83J18q4l56j5L59k36K7K05k78L66k41R5l69K26J85m47J16L04l15
$$ -277 75 2 185 303 219 -137 -152 207 -29 -2 203 -75 291 50 145 -224 2 187 -260 -144 160 -155
4941a55K38K6p8J05r1r6J33l70M22l9n7n2p1K52o5l00K99Mj61J63n1j96K25o0
$$ -155 83 109 31 136 45 -51 82 -288 134 95 38 -14 -85 167 102 -198 101 105 -56 107 56 -140 85 25
4965B5J5J17k4j92j4mL12l54J28P6N4j21r2N0j30L70l35K26j0m8J9l10N30k82
$$ 25 40 157 133 -59 -73 -77 235 -119 9 85 139 18 -74 -24 -154 216 -119 107 97 49 68 -242 288 6
4989Fj62K64Np3K98k06j53%J91j9j43k26J69Q7l0J27p2p1l9j41j12K97j86K42
$$ 6 -156 108 113 40 338 132 -21 -21 170 151 8 -218 -49 38 8 135 63 -8 -47 -188 -300 -3 -189 53
5013E3j29J55l82M96j56j27J4K42j27J03l0k38K89j44K17k54n8K07o9K0qj66R7
$$ 53 -76 79 -303 193 37 -90 -76 166 39 142 112 -126 163 19 236 -18 -76 131 62 82 74 -92 5
5036Ej02P9J67j99nj3k3L0L3R4o1j41k5r3L35N8p2j86K70l7m57O28l27Q0J63m86
$$ 5 -97 -18 149 -50 -55 -68 -91 -61 -28 66 5 -136 -161 -254 81 139 67 -119 151 114 -343 285 -42 38 201 -285
5062b85K75r2oJ57J14j51k7m3K52o8l87L01n8P2o4n4J75q5p1k39L30k71K89N8
$$ -285 -10 -102 -108 49 163 12 -15 -58 194 126 -261 40 -18 54 -10 -64 111 26 -45 -284 46 -225 64 122
5086A22j8pk81K11j8R2j10q0j3Q2k18%K92J10l59M42L1k37l09L93k06K34j9n0
$$ 122 104 97 -184 27 9 101 -9 -89 -102 -20 -238 -238 54 164 -195 247 278 41 -268 125 -81 153 134 84
5110H4k81J18J39j0J6j40L15m68K36J30l81j2L82j63J47j37J75j20P4k51K30l4
$$ 84 -197 -79 60 50 66 -74 241 -227 9 139 -242 -254 128 -35 112 -25 150 30 104 -147 83 49
5132D9Qj41mK21k9j56L06m74L18q9j67J27j22J47j45K58o9L39l18l4O8p8o3O7
$$ 49 57 -84 -88 133 104 -52 254 -220 98 9 -158 -31 -153 -6 -151 107 38 377 59 25 93 15 -48 19
5156A9j06n5j85K49j7P0Lj19Q8J15l07O6L51k31L27p8k15l7J76J10k03Jj08p2
$$ 19 -87 -142 -327 -78 -95 -25 -22 -141 -53 62 -245 -179 172 -59 268 190 -25 -62 114 224 21 22 -86 -158
5180a58L27j58P2l68J45%L87k51M3k1K1P8m16L74J85l88J66K35n22K24n3j83N2
$$ -158 169 11 83 -285 -140 -140 247 -4 39 18 39 117 -299 75 260 -128 38 273 -249 -25 -78 -261 -209
5203b09Q8J87n6J87j56N1j09K69j61P2n0j08j29K7J65K31n6j39k0O8k41mpJ94
$$ -209 -121 66 10 197 41 92 -17 252 91 163 113 5 -124 -97 68 299 243 104 84 152 -89 -93 -100 94
5227I4j31R2l42l9K60O7j90J16J48J04j65Q3q5Qo3k71M66r4K19l80R2j46K26l
$$ 94 -37 55 -287 -326 -66 1 -189 -73 75 179 14 97 12 20 -43 -314 152 58 277 -103 -11 -157 69 66
5251F6Q9k80P7J78mj51N8j5j08K4K41k48p7J55m1l3L7l5j7MO9O1j67K28m8j95
$$ 66 155 -125 -48 130 126 -25 33 18 -90 -66 175 -73 -150 5 -36 -69 -32 -67 -84 -80 -11 50 -117 111 63 -132
5277a32r9O56k79O4k92q4L88j88N7m8J71l12L62j54J60l64k6K98l21L49l15N5
$$ -132 -231 425 146 210 -82 -166 222 34 91 43 214 -98 264 110 270 -94 -120 178 -143 206 -109 -54
5299e4O7k08R8J36p0k14L86q9j57J60p9m8k8L46k67J71j91J61k14L65j69l1n7
$$ -54 13 -195 -97 39 -31 -245 141 52 -105 55 -24 -72 -100 246 -21 150 -41 120 -94 271 102 71 14
5322A4q1q0MK65l97J3N57l16j62J56r5j32K80k85M8K85l5J62m15o0K93j8Q6K02
$$ 14 -67 -147 -143 122 -275 -262 295 -21 -183 -27 -122 -254 26 -259 -211 74 39 201 -214 -274 19 1 87 289
5346B89k10J3R0l9K7j36P7J84l93j03L10k06J29L7j15KP7k46K59k67J90j53L8
$$ 289 79 92 182 143 170 34 111 295 -98 -201 109 -97 32 69 -46 -44 33 -213 46 -221 -31 -184 -146
5369a46J55K4j03KJ51k45K49k30J22m8J26J14k68O2j39j15L27j86j39K56O4m8
$$ -146 9 33 -70 -68 83 -162 87 -143 -21 -69 57 171 -97 -35 -174 -289 38 -148 -287 -31 33 -15
5391a5L9J8j32k26L95j2l2l1p6J51K38l29O0K2Pmm1n4J03P0n2j86K43l4k53m2
$$ -15 24 42 -90 -316 79 67 35 4 -72 79 317 -12 48 70 77 73 32 -22 81 151 99 -87 156 122 -131 -173
5417a73J48m2k06M71n01L46k44R0K36k43O8Q7P2l4j04p3L52j44j37K5o1k7J95
$$ -173 -25 -67 -273 198 -303 43 -201 -111 125 -118 -50 37 109 75 -29 -102 250 106 -31 -6 -67 -94 101
5440A01J8k22K73j39r1j21N4K52l66j16N08k13K36j3j49J9j20J21J7J5j2J21k41
$$ 101 119 -103 170 31 -60 -181 -127 125 -241 -357 151 -62 174 161 12 31 -89 32 49 64 52 173 -68
5463f8J04j1J93J0m04j8L38k44O6K93l25N1o1J6N6q7M11l24K5m5K6K39j0j68L07
$$ -68 36 25 218 228 -176 -194 144 -100 -34 259 -66 -15 -76 -60 -4 -91 320 -4 21 -24 2 241 231 63 370
5488C70m54p9k4K28O9l05K07q9J01k47J50P2k29M76m14K78N5Q2l48L10j67L88
$$ 370 -84 -163 -187 41 110 -195 12 -77 24 -223 -73 -1 -230 246 -168 110 165 247 -101 209 42 430
5510D30k00n0Nj32r6J97j50K0qj21P8j07J41k51k6L21j32l7N24n02M7k50J70J64
$$ 430 230 180 185 53 -43 154 4 24 16 -105 -27 -134 7 -244 -270 51 -81 -118 406 -96 -49 -299 -129 35
5534C5J1L27j39m03L08j76q4O3Lk80L14O8j65J50j55J43J05j55K4l9o5O7l01N03
$$ 35 46 373 234 -169 139 -37 -121 -58 -55 -335 -21 47 -118 32 -123 20 125 -30 -6 -45 -110 -43 -344 159
5558A59r6J6q0r8J51o4j00J04n0J09k76L48K1rj04Ol5k16O1K46k38N28l39K0k28
$$ 159 63 79 -1 -99 52 -12 -112 -8 -58 51 -225 123 144 135 31 37 2 -214 -153 93 -145 383 44 64 -164
5583a64K0K14k58M11l98J13j05K07k52J35P8l0O2N8l4O3k55J19J18M1j50jM4L0
$$ -164 -144 70 -188 223 -175 -62 -167 40 -212 -77 1 -29 33 91 57 120 -135 -16 102 143 -7 -8 36 66
5607F6n2J68k36j3J75m41N1K64k1j6L1p2L22O2k90K22k82m8J92j19Q7J8k47J80
$$ 66 14 182 -54 -67 108 -333 -282 -18 -39 -55 -24 -96 226 288 -2 220 -62 -110 82 -37 50 68 -179 1
5631Aj26J04J64j74J08l94K99J40k6p3J70j49q8k39K49J34j44RM1J12p4Q2k04
$$ 1 -125 -21 143 -31 77 -317 -18 122 96 23 193 44 -44 -283 -34 100 -44 -35 6 118 44 126 -78
5654g8J37j46j49J02P1Q5J3j8j14J53k03J17l6R3k16K79P1q4j28P6n7r3L6k74
$$ -78 59 -87 -236 -134 -63 22 35 17 -97 56 -147 -30 -66 27 -189 90 161 77 -51 25 -32 -125 -89 -363
5678c63N56j85r2Q6j52L01l46J31Q5k9k01j03N34k87j08Q8O6J88j7m0j77k65K76
$$ -363 193 8 -84 2 -150 151 -195 -64 21 -8 -209 -312 222 -65 -173 -85 -19 169 152 112 -65 -330 -54
5701e4R9N1mj50K33k87J70o8R5j06J74j73N9M5j89K09j90L8J20k82L17J98k60
$$ -54 45 96 92 -58 175 -112 58 -10 85 -21 153 -20 39 84 -105 104 -86 -48 72 -210 107 305 45
5724D5J14l49J10K5k4J6o4k00K95m3L12k46j32pJ96j48J63Ql88L86J5r2J49j27
$$ 45 159 -190 -80 -55 -79 -63 -127 -327 -32 -75 237 -9 -141 -148 48 -100 63 71 -317 69 84 -8 141 14
5748A4j24R5J98j26J56m82L31j45K14O5k51J62p2k1M4m3j45M09m04M54m74K66
$$ 14 -110 -15 183 57 213 -269 62 -83 131 196 -55 107 35 14 58 15 -130 279 -125 329 -145 121
5770A21J05k40K50r8l45J75R1rJ73j66P2l30K86j58N2kj09J43J22Nm7k09L16k68
$$ 121 226 -14 236 138 -207 -32 59 50 223 57 129 -201 85 -73 -21 -23 -132 11 133 138 91 -118 198 -70
5794g0M23l27k35J25p8M7L34m35K97j0m4J87k66o1J81r2j34N9r0L6J47k62l9J29
$$ -70 353 26 -209 -84 -162 -115 219 -216 81 71 27 214 -52 -113 68 -24 -158 -99 -189 -153 -6 -268 -307 -178
5818a78K75P5q3r9o3jJ65k1o7L2K58m04pk3M50o30J79L35l90j13L31J17k24K90
$$ -178 97 172 89 -10 -73 -74 91 70 3 35 293 -111 -118 -141 309 -321 -142 193 -197 -310 21 138 -86 204
5842B04k16J29n3j54m42P62r8r0j42J6j2LJ27j70N4L45k01K57m45J75L9j85R7
$$ 204 -12 117 64 -90 -532 230 132 42 -100 -84 -96 -93 34 -136 -82 263 62 319 -126 49 88 -97 0
5865@k06r0K97P9O2N5l20J85j62j24J52k5K98k58J81j65N7O9N1j26j7j18J56K60
$$ 0 -206 -296 1 80 142 197 -123 62 -100 -224 -72 -97 201 -57 124 -41 16 85 136 10 -7 -125 31 291
$$ [...]
8191h0
##END NTUPLES=NMR FID
##END=
