##TITLE=1H_Pr 5180
 200.13Hz, CDCl3.
 8 sc
30.8.7.2026
##JCAMPDX= 6.0         $$ Bruker NMR JCAMP-DX V2.0
##DATA TYPE= NMR FID
##DATA CLASS= NTUPLES
##ORIGIN= UXNMR, Bruker Analytische Messtechnik GmbH
##OWNER= pz
$$ XWIN-NMR		Version 3.5
$$ Thu Jul 30 13:22:56 2026 Russian Standard Time (UT+4h)  she@DPX200
##.OBSERVE FREQUENCY= 200.1313
##.OBSERVE NUCLEUS= ^1H
##.DELAY= (6, 6)
##.ACQUISITION MODE= SIMULTANEOUS
##.ACQUISITION SCHEME= undefined
##.AVERAGES= 8
##.DIGITISER RES= 18
##SPECTROMETER/DATA SYSTEM= spect
##.PULSE SEQUENCE= zg30
##.SOLVENT NAME= CDCl3
##.SHIFT REFERENCE= (INTERNAL, CDCl3, 0, 14.3821)
##AUDIT TRAIL= $$ (NUMBER, WHEN, WHO, WHERE, WHAT)
$$ ##TITLE= Audit trail, XWIN-NMR		Version 3.5
$$ ##JCAMPDX= 5.01
$$ ##ORIGIN= Bruker BioSpin GmbH
$$ ##OWNER= she
$$ F:/spectra/data/she/nmr/H-C/1/audita.txt
$$ ##AUDIT TRAIL=  $$ (NUMBER, WHEN, WHO, WHERE, WHAT)
(   1,<2026-07-30 13:21:36.60 +0400>,<she>,<DPX200>,
      <created by zg, POWCHK disabled, PULCHK disabled
       configuration hash MD5:
       00 E9 B6 7A A2 85 ED C7 34 08 36 98 17 FE 4E 26
       data hash MD5: 16K
       04 42 5D B7 A2 99 A7 4A 25 C1 50 8F 80 9E 46 DF>)
$$ ##END=
$$ 
$$ hash MD5
$$ AB A0 74 2B 1F E6 FC 41 0C 7D 9A 40 F7 34 AC 08
##$RELAX= 
##$RELAX= 
##$RELAX= 
##$RELAX= 
##$RELAX= 
##$RELAX= 
$$ Bruker specific parameters
$$ --------------------------
##$DU= <F:/spectra>
##$EXPNO= 1
##$NAME= <H-C>
##$PROCNO= 1
##$TYPE= <nmr>
##$USER= <she>
##$AMP= (0..31)
100 100 100 100 100 100 100 100 100 100 100 100 100 100 100 100 100 100 
100 100 100 100 100 100 100 100 100 100 100 100 100 100 
##$AQSEQ= 0
##$AQ_mod= 1
##$AUNM= <au_zg>
##$AUTOPOS= <>
##$BF1= 200.13
##$BF2= 200.13
##$BF3= 200.13
##$BF4= 200.13
##$BF5= 200.13
##$BF6= 200.13
##$BF7= 200.13
##$BF8= 200.13
##$BYTORDA= 1
##$CFDGTYP= 0
##$CFRGTYP= 5
##$CHEMSTR= <none>
##$CNST= (0..31)
1 1 145 1 1 1 1 1 1 1 1 1 1 1 1 1 1 1 1 1 1 1 1 1 1 1 1 1 1 1 1 1 
##$CPDPRG= <>
##$CPDPRG1= <>
##$CPDPRG2= <>
##$CPDPRG3= <>
##$CPDPRG4= <mlev>
##$CPDPRG5= <mlev>
##$CPDPRG6= <mlev>
##$CPDPRG7= <mlev>
##$CPDPRG8= <mlev>
##$CPDPRGB= <>
##$CPDPRGT= <>
##$D= (0..31)
0 0.7 0 0 0 0 0 0 0 0 0 0.03 0 0 0 0 0 0 0 0 0 0 0 0 0 0 0 0 0 0 0 0 
##$DATE= 1785403295
##$DBL= (0..7)
120 120 120 120 120 120 120 120 
##$DBP= (0..7)
150 150 150 150 150 150 150 150 
##$DBP07= 0
##$DBPNAM0= <>
##$DBPNAM1= <>
##$DBPNAM2= <>
##$DBPNAM3= <>
##$DBPNAM4= <>
##$DBPNAM5= <>
##$DBPNAM6= <>
##$DBPNAM7= <>
##$DBPOAL= (0..7)
0.5 0.5 0.5 0.5 0.5 0.5 0.5 0.5 
##$DBPOFFS= (0..7)
0 0 0 0 0 0 0 0 
##$DE= 6
##$DECBNUC= <off>
##$DECIM= 32
##$DECNUC= <off>
##$DECSTAT= 4
##$DIGMOD= 1
##$DIGTYP= 9
##$DL= (0..7)
0 120 120 120 120 120 120 120 
##$DP= (0..7)
150 150 150 150 150 150 150 150 
##$DP07= 0
##$DPNAME0= <>
##$DPNAME1= <>
##$DPNAME2= <>
##$DPNAME3= <>
##$DPNAME4= <>
##$DPNAME5= <>
##$DPNAME6= <>
##$DPNAME7= <>
##$DPOAL= (0..7)
0.5 0.5 0.5 0.5 0.5 0.5 0.5 0.5 
##$DPOFFS= (0..7)
0 0 0 0 0 0 0 0 
##$DQDMODE= 0
##$DR= 18
##$DS= 0
##$DSLIST= <SSSSSSSSSSSSSSS>
$$ [...]
##$SUBNAM0= <"">
##$SUBNAM1= <"">
##$SUBNAM2= <"">
##$SUBNAM3= <"">
##$SUBNAM4= <"">
##$SUBNAM5= <"">
##$SUBNAM6= <"">
##$SUBNAM7= <"">
##$SUBNAM8= <"">
##$SUBNAM9= <"">
##$SW= 18.0517328524113
##$SWIBOX= (0..15)
0 0 2 0 0 0 0 0 0 0 0 0 0 0 0 0 
##$SW_h= 3612.71676300578
##$TD= 16384
##$TD0= 1
##$TE= 0
##$TE2= 300
##$TE3= 300
##$TEG= 300
##$TL= (0..7)
0 120 120 120 120 120 120 120 
##$TP= (0..7)
150 150 150 150 150 150 150 150 
##$TP07= 0
##$TPNAME0= <>
##$TPNAME1= <>
##$TPNAME2= <>
##$TPNAME3= <>
##$TPNAME4= <>
##$TPNAME5= <>
##$TPNAME6= <>
##$TPNAME7= <>
##$TPOAL= (0..7)
0.5 0.5 0.5 0.5 0.5 0.5 0.5 0.5 
##$TPOFFS= (0..7)
0 0 0 0 0 0 0 0 
##$TUNHIN= 0
##$TUNHOUT= 0
##$TUNXOUT= 0
##$USERA1= <user>
##$USERA2= <user>
##$USERA3= <user>
##$USERA4= <user>
##$USERA5= <user>
##$V9= 5
##$VALIST= <valist>
##$VCLIST= <CCCCCCCCCCCCCCC>
##$VD= 0
##$VDLIST= <DDDDDDDDDDDDDDD>
##$VPLIST= <PPPPPPPPPPPPPPP>
##$VTLIST= <TTTTTTTTTTTTTTT>
##$WBST= 1024
##$WBSW= 4
##$XGAIN= (0..3)
0 0 0 0 
##$XL= 0
##$YL= 0
##$YMAX_a= 550604
##$YMIN_a= -588085
##$ZGOPTNS= <>
##$ZL1= 120
##$ZL2= 120
##$ZL3= 120
##$ZL4= 120
##$ABSF1= 10
##$ABSF2= 0
##$ABSG= 5
##$ABSL= 3
##$ALPHA= 0
##$AQORDER= 0
##$ASSFAC= 0
##$ASSFACI= 0
##$ASSFACX= 0
##$ASSWID= 0
##$AUNMP= <proc_1d>
##$AZFE= 0.1
##$AZFW= 0.1
##$BCFW= 1
##$BC_mod= 2
##$BYTORDP= 1
##$COROFFS= 0
##$CY= -3
##$DATMOD= 1
##$DC= 2
##$DFILT= <>
##$DTYPP= 0
##$F1P= 0
##$F2P= 0
##$FCOR= 0.5
##$FTSIZE= 0
##$FT_mod= 4
##$GAMMA= 1
##$GB= 0.15
##$INTBC= 1
##$INTSCL= 1
##$ISEN= 128
##$LB= 0.25
##$LEV0= 0
##$LPBIN= 0
##$MAXI= 10000
##$MC2= 0
##$MEAN= 0
##$ME_mod= 0
##$MI= 1.114404
##$NCOEF= 0
##$NC_proc= 0
##$NLEV= 6
##$NOISF1= 3.799351
##$NOISF2= 2.8
##$NSP= 1
##$NTH_PI= 0
##$NZP= 0
##$OFFSET= 14.38212
##$PC= 1
##$PHC0= -4224.01
##$PHC1= 17.3923
##$PH_mod= 1
##$PKNL= yes
##$PPARMOD= 0
##$PSCAL= 0
##$PSIGN= 0
##$REVERSE= no
##$SF= 200.129724274929
##$SI= 16384
##$SIGF1= 3
##$SIGF2= 2
##$SINO= 400
##$SIOLD= 16384
##$SREGLST= <1H.CDCl3>
##$SSB= 0
##$STSI= 0
##$STSR= 0
##$SW_p= 3205.1282051282
##$SYMM= 0
##$S_DEV= 0
##$TDeff= 0
##$TDoff= 0
##$TI= <>
##$TILT= no
##$TM1= 0
##$TM2= 0
##$TOPLEV= 0
##$USERP1= <user>
##$USERP2= <user>
##$USERP3= <user>
##$USERP4= <user>
##$USERP5= <user>
##$WDW= 1
##$XDIM= 8192
##$YMAX_p= 0
##$YMIN_p= 0
$$ End of Bruker specific parameters
$$ ---------------------------------
##NTUPLES= NMR FID
##VAR_NAME=  TIME,          FID/REAL,        FID/IMAG
##SYMBOL=    X,             R,               I
##VAR_TYPE=  INDEPENDENT,   DEPENDENT,       DEPENDENT
##VAR_FORM=  AFFN,          ASDF,            ASDF
##VAR_DIM=   8192,          8192,            8192
##UNITS=     SECONDS,       ARBITRARY UNITS, ARBITRARY UNITS
##FACTOR=    0.0002768,     1,               1
##FIRST=     0,             0,               0
##LAST=      2.2672688,     0,               0
##MIN=       0,             -588085,         0
##MAX=       2.2672688,     550604,          0
$$ Real data points
##PAGE= N=1
##DATA TABLE= (X++(R..R)), XYDATA
$$ [...]
1964a291L776j991k572K319J649k785n69K995j221k469K293J709k786q87K974
$$ -1291 2485 494 -2078 241 1890 -895 -1464 1531 310 -2159 134 1843 -943 -1830 1144
1979A144M43l221J121K618k005j976K702O24l004Q41K324j081k675K207J560k854
$$ 1144 1587 -1634 -513 2105 100 -1876 826 1450 -1554 -713 1611 530 -2145 62 1622 -1232
1995a232l91L051p36k476J369K316k094j432K834M07l010N37K826j828k067K444
$$ -1232 -1623 1428 692 -1784 -415 1901 -193 -1625 1209 1616 -1394 -857 1969 141 -1926 518
2011E18J261k871p3K607q77k274J480J884k157j119K988l38k538J060K128j613
$$ 518 1779 -1092 -1165 1442 565 -1709 -229 1655 -502 -1621 1367 1029 -1509 -449 1679 66
2027F6j464K025R11k935O04K309j028k387J951J459k713j04K382k61k697J575
$$ 66 -1398 627 1538 -1397 -793 1516 488 -1899 52 1511 -1202 -1306 1076 815 -1882 -307
2043c07J688j945q36K506r8j997M85J891j373j542K256P50k843L79K153m89k464
$$ -307 1381 -564 -1400 1106 1008 -989 -504 1387 14 -1528 728 1478 -1365 -986 1167 678 -1786
2060a786J734J387j890q52K391m06j828R86J854j688j486K467P66k635M1K221
$$ -1786 -52 1335 -555 -1407 984 578 -1250 -264 1590 -98 -1584 883 1649 -986 -945 1276
2076A276r55j605J534J340k654k9K334o44k515J767J925k062j080K522n9j977
$$ 1276 321 -1284 250 1590 -1064 -1093 1241 597 -1918 -151 1774 -288 -1368 1154 1095 -882
2092h82L13J872j087j637J826J102k403r7K461r56k019J141J518j418j133K189
$$ -882 -569 1303 216 -1421 405 1507 -896 -993 1468 512 -1507 -366 1152 -266 -1399 790
2108G90k01j869Q15J890j833r78K225N28k299M32J677n42j763J349R61j991J3
$$ 790 589 -1280 -465 1425 -408 -1386 839 1367 -932 -500 1177 635 -1128 221 1182 -809 -796
2125g96J678l96j859J392J129j433j018J759N00j750L18J685j298q20J502O80
$$ -796 882 486 -1373 19 1148 -285 -1303 456 956 -794 -476 1209 -89 -909 593 1273
2141A273k160J82J948q31j883J521J341j929m57J674n6j793R24J359j546j140
$$ 1273 -887 -705 1243 412 -1471 50 1391 -538 -995 679 623 -1170 -246 1113 -433 -1573
2157a573K398L78j986j80K162n26j906J162J165j609m80J866n34j774J345J523
$$ -1573 825 1203 -783 -963 1199 673 -1233 -71 1094 -515 -995 871 337 -1437 -92 1431
2173A431j868j076K046L79j828L70J472m79j238J312O18j835J73J704n72j862
$$ 1431 -437 -1513 533 912 -916 -546 926 447 -791 521 1139 -696 -523 1181 609 -1253
2189a253J227J183j238r45J472K02j582O39J027j040m75J342M25j807J86J974
$$ -1253 -26 1157 -81 -1026 446 648 -934 -295 732 -308 -783 559 984 -823 -637 1337
2205A337p48j571J220P65j471m12J660o21j438J183J169j561r35K049L57j757
$$ 1337 589 -982 238 1003 -468 -880 780 159 -1279 -96 1073 -488 -1423 626 983 -774
2221g74J80J444n41q94Q74O96j625K2J589r11j113J262J150j525q57J630j45j118
$$ -774 -594 850 309 -585 289 985 -640 -618 971 60 -1053 209 1359 -166 -1023 607 462 -656
2239f56N52J136j412m51J582j36j524K93J882r43j174Q57J144j394o22J634k82
$$ -656 -104 1032 -380 -831 751 615 -909 -616 1266 323 -851 6 1150 -244 -866 768 486
2256D86j298P60J108j388m76J174M55j748K98J169l58r32R28K91j207K48J511
$$ 486 -812 -52 1056 -332 -808 366 821 -927 -629 540 182 -750 178 469 -738 -490 1021
2273A021p22j200R27J337j735n10J538J09j288L16Q60n29r70J230L88j642N07
$$ 1021 299 -901 26 1363 -372 -882 656 765 -523 -207 653 124 -846 384 772 -870 -363
2290c63J140l30j330J179M69r27m54J247k76j104O99R28j197k92Q31M19j722L19
$$ -363 777 447 -883 296 765 -162 -616 631 355 -749 -50 878 -319 -611 220 639 -1083 -764
2308g64J466o60r26Q98O69j216N8J112k07j177N77J218j177o72J487Lj434j9J451
$$ -764 702 42 -884 14 683 -533 -475 637 430 -747 -170 1048 -129 -801 686 689 -745 -764 687
2327F87p26j035J114M90r18k00J534q07q51P71P55r57k64J317m32j121N74Q21
$$ 687 -39 -1074 40 530 -388 -588 946 139 -712 59 814 -143 -407 910 478 -643 -69 752
2345G52j101o79J497L1j505N91J013n31r74J033R54j336k64J305o69r19J060N57
$$ 752 -349 -1028 469 500 -1005 -414 599 68 -906 127 1081 -255 -519 786 117 -802 258 815
2363H15j177o19J694j97j344O87J049q49j122J583r2j261M31R68n19q85J009P95
$$ 815 -362 -981 713 516 -828 -141 908 59 -1063 520 428 -833 -402 566 47 -838 171 966
2381I66j471j79J269j86j023K54J013r62n12J077K61r75RJ103n98o97R30N49j249
$$ 966 -505 -684 585 399 -624 -370 643 -319 -831 246 507 -468 -459 644 46 -651 279 828 -421
2400d21k6J191l80j127P34R07q87p52J490j93j090N08O26o46q67R11O76r54L8
$$ -421 -447 744 364 -763 -29 878 -9 -761 729 536 -554 -46 580 -66 -933 -22 654 -300 -262
2419b62R04k91q68M99O08o94m11J235l51r04N31P76r59l73J021J21j291M42P17
$$ -262 642 351 -517 -18 590 -104 -515 720 369 -535 -4 772 -187 -560 461 582 -709 -267 450
2438D50o77o20J020K62r53k51J471l52j136O29J088q71m27Q63Q7j090j0J235r27
$$ 450 -227 -847 173 435 -518 -769 702 350 -786 -157 931 60 -367 496 583 -507 -517 718 -209
2457b09m40R89J90j114R6J144m83o35P11M14q74k32J018j10j208R08P55j232n07
$$ -209 -649 340 530 -584 -488 656 173 -462 249 663 -211 -443 575 465 -743 165 920 -312 -819
2476h19J243K1q46J08Q29l95p02N36N52q66j20R87k79j073O54Q93o84n40R65P4
$$ -819 424 445 -401 -293 536 141 -561 -25 527 -339 -459 528 249 -824 -170 723 39 -501 464 538
2496E38r25L07O49p09p05J040J02p94J26J269o85j087R88M49q01j47R80l46p37
$$ 538 -387 -80 569 -140 -845 195 297 -497 -371 898 213 -874 114 563 -238 -385 595 249 -488
2515d88O63M77o89o07J132l6j173L73O38k22p30M76Q40j135j8J054J0j195O02
$$ -488 175 652 -37 -644 488 452 -721 -348 290 68 -662 -186 654 -481 -499 555 565 -630 -28
2534b8N76m46l93N55J78r24M21N41o87l90O54K65j183N43Q07n43n57L98P93r82
$$ -28 548 102 -291 264 442 -482 -61 480 -207 -597 57 322 -861 -318 489 -54 -611 -213 580 -402
2554d02j46R72j90o07K97P27p39m87J234J04j250k1J064k07p77M53L81q53O4Q92
$$ -402 -548 424 234 -373 -76 651 -88 -575 659 763 -487 -508 556 349 -428 25 406 -447 -383 509
2574E09j42r64P59M21o44l34R55j42j071M61R20j42j003Q81N9r75K56L75n0o68
$$ 509 367 -597 162 583 -61 -395 560 418 -653 -192 728 586 -417 464 523 -452 -196 179 129 -539
2594e39P88J40q59j43J039l4r02M67O63p58j48L80N50r09K80M06n97l48Q21K8
$$ -539 249 389 -470 -613 426 392 -510 -43 620 -138 -286 94 644 -265 15 421 -176 -524 297 325
2614C25q23P7O46K7r39N00O50q10J84L99K70j121M52Q65p92m49O90L25p38o0P52
$$ 325 -498 -421 225 252 -687 -187 463 -347 -163 236 506 -615 -163 702 -90 -539 151 476 -262 -322 430
2635D30m03o33N27M37p31k34J093m46p27P53O97j035j71Q74j29q94N08N42o34
$$ 430 27 -606 -79 358 -373 -607 486 40 -687 66 763 -272 -443 431 302 -592 -84 458 -176
2654a76j65M14N97r38j26O80k20q11R74M6m40m97J071o4p01N09M05p94j54M63
$$ -176 -341 73 670 -268 -394 286 66 -745 229 275 -165 -662 409 345 -356 153 558 -236 -390 73
2674G3M80o60m6L90m2o93N15M83r72j32J066j57j000N92L57m0o06R52k61p34K42
$$ 73 553 -107 -153 237 195 -498 17 500 -472 -604 462 305 -695 -103 254 214 -392 560 299 -435 -193
2695a93P36n81o40J082K27r33m78J208l64o73O74L21n41j74Q65k27r55P58L53
$$ -193 543 -38 -678 404 631 -302 -780 428 64 -609 65 386 -155 -329 536 309 -646 112 465
2714D65q44j77R70Lp90K66N73p13j49M27J58n22j00R85m42q23O19O41p33m40O90
$$ 465 -379 -556 414 417 -373 -107 466 -247 -396 31 189 -333 -433 552 110 -713 -94 547 -186 -626 64
2735F4K52p00L91N25l23p90Q99K03n06l35J097o71p51P71L17q58j8Q21l06o11
$$ 64 316 -384 7 532 209 -581 318 521 15 -320 777 106 -645 126 443 -415 -433 388 82 -529
2755e29N82M85n59m32Q38Pq61K77P62m99l50J27N05o89Q4N15K0q54L25P52q82
$$ -529 53 538 -21 -453 385 392 -469 -192 570 71 -279 -152 353 -336 -252 263 283 -571 -246 506 -376
2776c76k76P97K98q20M40N55k62q84J060J41r62PQ73n69p29O87K40l31m78R12
$$ -376 -652 145 443 -377 63 618 356 -528 532 673 -289 -282 591 22 -707 -20 220 -111 -589 323
2796C23k70o80N96M82n70l68R20j2o49J18N30m07n00N17L32m01j48P38n74q67
$$ 323 53 -627 -31 451 -119 -487 433 421 -228 -110 420 13 -487 30 362 -39 -187 551 -23 -890
2816h90N57M50m11K1N25j3q71N82P29m89p11Q50K31j043N8Q55k19m50K83N20p38
$$ -890 -333 117 -294 -273 252 239 -632 -50 679 190 -521 329 560 -483 -425 430 211 -239 44 564 -174
2837a74k11O71k72m41M98N07q64j12P60J61r93K70O34k22l80K25N31m92k32N92
$$ -174 -385 286 14 -427 71 578 -286 -398 362 523 -470 -200 434 212 -168 57 588 96 -136 456
2857D56k34p28P33J70o21k15P13k3n57O8N93j61p31Q87p1m27Q7L88l70k48M50
$$ 456 222 -506 227 397 -224 -439 274 251 -306 -238 355 194 -537 350 279 -148 -61 327 -43 -291 159
2878A59J09n28k08P16j68o38K60P11n81k79O64k39m47M00N10n51m13L74O04p42
$$ 159 268 -260 -468 248 80 -558 -298 413 -168 -447 217 -22 -469 -69 441 -110 -523 -149 455 -287
2898b87Q0Q19o40l82O06K9m00q1N62K2q20O16J26m93K1M94P6p61J74O04l46m07
$$ -287 -207 612 -28 -410 196 225 -175 -256 306 328 -492 124 250 -243 -222 272 348 -413 -239 365 19 -388
2920c88O80N8o60M2M68j14n97N17N07p17k87N01R1p52N03L76l44k78N48K02o44
$$ -388 292 350 -310 -268 200 86 -511 6 513 -204 -491 10 101 -651 -148 228 -116 -394 154 356 -288
2941b88J15M80lp88K61P86q19K36J40l3k20k81P29o23M1M74K6o98L55M10j49J7
$$ -288 -173 307 304 -484 -223 563 -256 -20 120 87 -133 -414 315 -308 -267 207 233 -465 -110 300 151 168
2963A68P4J17o63L68K57k59l96K73L61o04K0K58L00r66Q43J96n04j6O05k48k71
$$ 168 242 359 -304 64 321 62 -334 -61 300 -304 -284 -26 274 -692 151 347 -157 -173 432 184 -87
2984h7O9K15k76j02L70K03o29L7M73l06o09P24J79o53J80L21Ql94j7O32l44l62
$$ -87 -18 197 -79 -181 189 392 -237 -200 273 -33 -642 82 261 -392 -212 109 117 -277 -294 338 -6 -368
3006c68O68j00m83J31M69k30n27N05N2m05O3K56m6j20J18L80l10m22K06L38n79
$$ -368 300 200 -283 -152 317 87 -440 65 117 -288 -225 31 -15 -135 -17 363 53 -369 -163 175 -404
3027d04l4P38j62k21J83J04l32q5N50k01n86O60L63p95j54O50k04m83K75L07j53
$$ -404 -438 300 138 -83 100 204 -128 -213 337 136 -450 210 573 -222 -376 274 70 -413 -138 169 16
3048A6k73J56J05j88O2M95l92j47M21J93n85l84N17J31p37L63N61k81m03N51J53
$$ 16 -257 -101 4 -184 -122 373 -19 -166 255 448 -137 -521 -4 127 -610 -247 314 33 -370 181 334
3069C34n89R8N31m56j28P11on35j68M67l18l49M29L55n31j33O42l90m6p5L26k01
$$ 334 -255 -157 374 -82 -210 501 495 -40 -208 259 -59 -408 21 376 -155 -288 354 -36 -82 -157 169 -32
3091c2m06O30K66p37J43J05L40o83N68J28n38J24L25j55m33M39K60q53M79L30
$$ -32 -438 192 458 -279 -136 -31 309 -374 194 322 -216 -92 233 78 -355 84 344 -509 -30 300
3111C00j85m80L49L5jj26L98J23l96L8K09l67l43N20o0j38K53J58k04j69M03j74
$$ 300 115 -365 -16 19 18 -108 290 413 17 55 264 -103 -446 74 14 -124 129 287 83 -86 317 143
3133A43m18k40P95k64q1K23O9m64n2K55L17k94l24P20k60j34J30k2j93r9J17K5
$$ 143 -275 -515 280 16 -65 158 227 -237 -289 -34 283 -11 -335 385 125 -9 121 99 -94 -193 -76 -51
3155e1k64N08q5l49J08M83l26l4Q2L10k14l97k8N46j63m83L89k49j40J54L99l05
$$ -51 -315 193 108 -241 -133 350 24 -10 72 382 168 -229 -257 289 126 -357 32 -217 -357 -203 196 -109
3177a09j66K61N5j91n5L09K9j92L25j26k47J15N3K4p4j35K60m15k99M93K78l8
$$ -109 -275 -14 41 -150 -205 104 133 -59 266 140 -107 8 61 85 11 -124 136 -279 -578 -85 193 155
3199A55l80M28k75K8M5K94l37J20J95j54l63p1P93n94J86L13j79m76O2L71n37
$$ 155 -225 203 -72 -44 1 295 -42 78 273 119 -244 -315 478 -116 70 383 204 -272 -210 161 -376
3220c76P7J80K55l8l26K75lk55L97O5k00j32K72k36k63K89L8j36j91O09k35l60
$$ -376 -299 -119 136 98 -228 47 44 -211 186 251 51 -81 191 -45 -308 -19 19 -117 -308 301 66 -294
3242b94M18J2k59p1L10j58jJ87J34m14KJ50rJ34j79J86k53K58m01K59p0k51L37
$$ -294 124 136 -123 -194 116 -42 -43 144 278 -136 -134 16 7 141 -38 148 -105 153 -248 11 -59 -310 27
3265B7O4l28O9L4mr9M79o8k28j30K96r9n2P9k16n0J09K66j09k75J67L47l11J5
$$ 27 91 -237 -168 -134 -138 -237 242 174 -54 -184 112 13 -39 40 -176 -226 -117 149 40 -235 -68 279 -32 -17
3289a7J57k70J62j14J63K29m29K71k63R3Q5o5j05k2K40O2j29k30K29J27n81M49
$$ -17 140 -130 32 -82 81 310 -119 152 -111 -18 67 2 -103 -125 115 177 48 -182 47 174 -407 42
3311D2L14j58k20J85j4K38n35J25l3J95r6J50l02M2J51j20l49L36L54m06k37K01
$$ 42 356 198 -22 163 149 387 -148 -23 -56 139 43 193 -109 -67 84 -36 -385 -49 305 -101 -338 -137
3333a37M54m8l20n0R0j49K88j62l08L09K80k28j43K1J84k13N8K36p2l34M15j13
$$ -137 317 269 -51 -101 -11 -160 128 -34 -342 -33 247 19 -124 -103 81 -132 -74 162 90 -244 171 58
3355E8m9k46K94L7q1j40K35k00J50N5k6qr4K15k40o1L95k78r6J60o7L4n05K31
$$ 58 9 -237 57 94 13 -127 108 -92 58 113 87 79 -15 200 -40 -101 294 16 -80 80 13 47 -458 -227
3379b27L76L1m55M01rlk63J70J39m77L25J13k42l6O4J40j47r2N52m36M5j4jj3
$$ -227 149 180 -275 126 117 114 -149 21 160 -317 8 121 -121 -157 -93 47 -100 -192 360 -76 -31 -45 -46 -59
3403e9j34L14k23L3K37n17K75J68k38M06l48L8J01k31O1L67r1j20j04K4K55m19
$$ -59 -193 121 -102 -69 168 -349 -74 94 -144 262 -86 -48 53 -178 -117 250 159 39 -65 -41 214 -205
3425b05J78J58M7m44L64j58K76r7K70k08l34J23Nl8J56j74J3l79O23j90p0J5j48
$$ -205 -27 131 178 -266 98 -60 216 119 389 181 -153 -30 -25 -63 93 -81 -68 -447 176 -14 -84 -69 -217
3448b17J72N0%J01j32q0M80k73l31K04j44qJ45K0J14j43L5L8K7j79L32k97j83
$$ -217 -45 5 5 106 -26 -106 374 101 -230 -26 -170 -178 -33 -13 101 -42 -7 31 58 -121 211 -86 -269
3471b69N8j7K71J88k46K08l22N6K4L20o39K88M8j19P7J40o7j77M40k81j49k6N8
$$ -269 -211 -228 43 231 -15 193 -129 -73 -49 271 -368 -80 -32 -151 -74 66 -1 -178 262 -19 -168 -194 -136
3494a36J70L7j61J68K42k62l6Q1O6k54Q9K81k78j54Q6K52j05Oo1j24P2K15R4j24
$$ -136 34 71 -90 78 320 58 22 103 169 -85 4 285 7 -147 -61 191 86 92 31 -93 -21 194 288 164
3518A64l88M01j60p4O7L8P4l43J73R2L5j98K55m36l3O03l30j11J17M29m39j12
$$ 164 -224 177 17 -57 10 48 122 -221 -48 44 79 -119 136 -300 -333 270 -60 -171 -54 375 -64 -176
3540a76K71L4k27K80O6r8k21j8J43Pk76M33k13L1o5j4J19m73L04J01j53L92J06
$$ -176 95 129 -98 182 248 150 -71 -89 54 61 -215 218 5 36 -29 -43 76 -397 -93 8 -145 247 353
3563C53n37J43K9J72k9k28R1J02j39J17o9n7j7K59j38j13J0J62L6j87Nj36M3o4
$$ 353 -184 -41 -12 160 131 -97 -6 96 -43 74 5 -52 -69 190 52 -61 -51 111 147 -40 -35 -171 -128 -192
3587a92J56J06O6j17J91m82K14M5K01M4o47P66m51J32J24j32j04K98k32l2R1J6
$$ -192 -36 70 136 19 210 -272 -58 -13 188 232 -415 351 -100 32 156 24 -80 218 -14 -46 45 61
3609F1j37L52l13o2J16j03O3pL1j72K28J22l9k63j58K20L6k6J06q6qNPK74r3J12
$$ 61 -76 276 -37 -99 17 -86 -23 -30 1 -171 57 179 140 -123 -281 -61 -25 -51 55 -31 -39 -34 -27 247 154 266
3635B66l77l02N06k08L8Q1J55r8j45K55l52K54l01M68k90J26O3j50j21J00J37
$$ 266 -111 -413 93 -115 -77 4 159 61 -84 171 -181 73 -228 240 -50 76 139 -11 -132 -32 105
3656A05j88j03J52J33o5k5Q9j34r5K19MMj5n9O7l14M43K4j29p1r0pj12J99J04
$$ 105 -83 -186 -34 99 34 9 98 -36 -131 88 92 96 81 22 89 -225 218 242 113 42 -48 -55 -167 32 136
3681A36j14r1J10n2j50LJ63m4N9q6J94RL8o7%j34k0J58q7k13L74j54O9m06M88
$$ 136 22 -69 41 -11 -161 -158 5 -39 20 -66 128 137 175 108 108 -26 -46 112 25 -188 186 32 101 -305 183
3706A83J97n90K82j50M83m76M0J22j39R7j07J00K1J19k60n2J06K33l12m2L40j55
$$ 183 380 -210 72 -78 405 -71 -31 91 -48 49 -58 42 63 182 -78 -130 -24 209 -103 -145 195 40
3728D0j66L0l8J93l07L67k2l62J78K0J66r2k96L78J32l51o3M39j92l38L27J40
$$ 40 -126 -96 -134 59 -248 119 97 -265 -87 -67 99 7 -289 89 221 -130 -193 246 54 -284 43 183
3750A83m08J95N3K16l85K44j52J83l56L97j19j36J42R3k43r5j64O31n00L59R0
$$ 183 -225 -30 23 239 -146 98 -54 129 -227 170 51 -85 57 150 -93 -188 -352 279 -221 138 228
3771B28k58n7o4M07k34j68L10k30j28K07M9j45k1K19j24k88nQ1k07L91K69k17
$$ 228 -30 -87 -151 256 22 -146 164 -66 -194 13 62 -83 -104 115 -9 -297 -302 -221 -428 -37 232 15
3793A5k79k1J08K16J74l5m5l9l45L59j80J34l96L84N8n68M50l50K57J13K08k68
$$ 15 -264 -285 -177 39 213 178 133 94 -251 108 -72 62 -334 50 108 -460 -10 -360 -103 10 218 -50
3815e0n3l5J45j35P0R4j7m7J74%m7l8n1J72n09K89J92p7k34L08j72k52K10P7j63
$$ -50 -103 -138 7 -128 -58 36 19 -28 146 146 99 61 10 182 -327 -38 154 77 -157 151 -21 -273 -63 14 -149
3840a49M6J50K6P3l13L6R2Q2J10Kl3l4L48m61j03k4K36j67N0j81L23j33q1J03
$$ -149 -103 47 73 146 -167 -131 -39 43 153 155 122 88 436 -25 -128 -152 84 -83 -33 -214 109 -24 -105 -2
3864bo7N1P3K38l65L6M3K55n76K75K40l72PL06k44m3m3R6O3k04K15R0k65J97K5
$$ -2 -69 -18 55 293 -72 -36 7 262 -314 -39 201 -171 -164 142 -102 -145 -188 -92 -29 -233 -18 72 -193 4 29
3889B9P9j02K2jm1K16J63k27k72L03J68k85j37J16m16K33K70k75Q7j71K99P6l84
$$ 29 108 6 28 27 -14 202 365 138 -134 169 337 52 -85 31 -385 -152 118 -157 -70 -241 58 134 -250
3912b50J91J28o9o1N2L23n27N0M40n2m69O7N22l13k77J31n4L24k48j1J31n4J99
$$ -250 -59 69 0 -61 -9 314 -213 -163 277 225 -244 -177 345 32 -245 -114 -168 156 -92 -103 28 -26 173
3935A73j43Nk70Q7J73O7K5J37j08k83L72J47n84n2N7L01p0k16K17q7k42J71P5
$$ 173 30 35 -235 -148 25 92 117 254 146 -137 235 382 -202 -254 -197 104 34 -182 35 -52 -294 -123 -48
3958d8K25k51K52m03L28J00L3k73J19j18J12j80L7r3Q9K49l1j70P8J20l03J02
$$ -48 177 -74 178 -225 103 203 236 -37 82 -36 76 -104 -67 -160 -71 178 147 -23 55 175 -128 -26
3980b6j10J74k07J38j78K87l2j86L95l6k89Q1J88k35j72K78M4J0k49K1L76n62
$$ -26 -136 38 -169 -31 -209 78 46 -140 255 219 -70 11 199 -36 -208 70 114 124 -125 -104 272 -290
4002b90K02K38j21RM3j48k46L10L11n64K64j09J84R9l74J15K84l28l1L42j53r0
$$ -290 -88 150 29 38 81 -67 -313 -3 308 -256 8 -101 83 182 -192 -77 207 -121 -152 190 37 -53
4024e3Rl5q0J71J49L2n46K43L57j94j98L32k16n0K16q6k54K29K29q6j96n0K67
$$ -53 -44 -79 -159 12 161 193 -353 -110 247 53 -145 187 -29 -79 137 51 -203 26 255 169 -27 -77 190
4047A90m42K66r2J42l10K52J03k68l5K21j64k2o9N14k75j97L89l17p2J55J23J01
$$ 190 -252 14 -78 64 -246 6 109 -159 -194 27 -137 -159 -228 286 11 -186 203 -114 -186 -31 92 193
4069A93n17K08J81k85K45J03L8j96n8K12l95K10K73j70q5K84j18j81k38M45j06
$$ 193 -324 -116 65 -220 25 128 166 -30 -88 124 -271 -61 212 42 -43 241 123 -58 -296 149 43
4090D3j61L16j00R8j49j71L97j73K95l62m1k7MJ76j44l58K9K71k3Pk41L22l28
$$ 43 -118 198 98 196 47 -124 273 100 395 33 -8 -35 -31 145 1 -357 -328 -57 -80 -73 -314 8 -320
4113c20L13p9K64j94L27k94L7n2P8k33K42j3k78J07J66p8o9j07J02K75p6mL7j1
$$ -320 -7 -86 178 -16 311 17 54 2 80 -153 89 76 -202 -95 71 -7 -76 -183 -81 194 118 114 151 140
4137A40k88K55j90o8k6K88k5q7N5J49j08R5k0j32k28O7K56k24j64K96R4m01L53
$$ 140 -148 107 -83 -151 -177 111 86 -1 54 203 95 190 170 38 -190 -123 133 -91 -255 41 135 -266 87
4160H7r0J39j21q4L30l21M8L40k01k87P4k68K89l9k0L69n22P7L08J00m54J49J5
$$ 87 -3 136 15 -69 261 -60 -12 328 127 -160 -86 -354 -65 -104 -124 245 -277 -200 108 208 -246 -97 -82
4183h2J80j3k00M15m85L70j02j64J49m3j28j04j29K72J23o3k85L55k15M62j47
$$ -82 98 85 -115 300 -185 185 83 -81 68 25 -103 -207 -336 -64 59 -4 -289 66 -149 313 166
4204A66j78j39M2J68j87j63J88J68k67K86k03jK6J03O1l99L08K7J3k24J63R5j06
$$ 166 -12 -151 -109 59 -128 -291 -103 65 -202 84 -119 -120 -94 9 70 -329 -21 6 19 -205 -42 53 -53
4227e3nM17J44l60j47K0J0k06R2K76k87j88K15j61L49l60J90k3j61M71l94K18
$$ -53 -58 359 503 143 -4 16 26 -180 -88 188 -99 -287 -72 -233 116 -244 -54 -77 -238 233 -161 57
4249E7l26K31K6P7ML6L9J2kl15J21Q9j3j88K07r1L7m36O07l47j15J87O2L15j17
$$ 57 -269 -38 -12 65 69 105 144 156 154 -161 -40 49 36 -152 55 -36 1 -435 172 -175 -290 -103 -41 274 157
4274A57j84K55j48M5K3q1j11L14k3m05J16Q2J22n5o2J03l2M5m2q2j19Q6J50j26
$$ 157 -27 228 80 125 148 67 -44 270 247 -158 -42 40 162 107 45 148 116 161 119 37 -82 4 154 28
4298B8L0J35l85j0L76m6k32j77M14j52j55j04L89M5m00N7M31p2k74Q4K04j01q8
$$ 28 58 193 -192 -202 174 128 -104 -281 133 -19 -174 -278 111 156 -244 -187 244 172 -102 -18 186 85 -3
4321cmk26J31J15J97j98o1M8K82m14ON3p5O4K68l41l5k6J46K22j72J09L3Mk13
$$ -3 -7 -233 -102 13 210 12 -49 -1 281 -133 -127 -74 -149 -85 183 -158 -193 -219 -73 149 -23 86 119 123 -90
4346i0J38r5L4O6j88P7N9j16J27j99J90P0k49K42P2j18p4J70mK3l30L03p8o1O3
$$ -90 48 -47 -13 53 -135 -58 1 -115 12 -187 3 73 -176 66 138 20 -54 116 112 135 -195 108 30 -31 32
4371C2K28k16k79K93r3N3k9o9k2o4j81M17k26J32j18M24l67J3K47k74J83o0j23
$$ 32 260 44 -235 58 -35 18 -11 -80 -102 -166 -347 70 -156 -24 -142 282 -85 -72 175 -99 84 24 -99
4394i9Q7K02n3l34K81R8n1j11J0P9j98j39L92%k18J32p8K5J72k10j71L58m15L12
$$ -99 -12 190 137 -197 84 182 131 20 30 109 -89 -228 164 164 -54 78 0 25 197 -13 -184 174 -241 71
4418G1K1j20L6l0pk72j4O16k80k47L51p0qJ0J03k0j89L02k63j83K85P3j64o6j7
$$ 71 92 -28 8 -22 -29 -301 -315 301 21 -226 125 55 47 57 160 140 -49 253 -10 -193 92 165 1 -65 -82
4443h2k3J2q7K30k1p8j61M57j76l57M41j21j61O0o4P7M0j05M4J9M9PL19k42j07
$$ -82 -105 -93 -180 50 29 -49 -210 247 71 -286 155 34 -127 -67 -131 -54 -14 -119 -75 -56 -7 0 319 77 -30
4468c0j14n2J95M0L18o07K25pk00J90r2J08j67Q3K57j03j16M9q8j88Q4Q6L42p7
$$ -30 -144 -196 -1 39 357 -250 -25 -32 -232 -42 -134 -26 -193 -110 147 44 -72 -23 -111 -299 -215 -129 213 136
4492A36k63K69L2P1k75J20K6k01J67m06M33k86K68k02J71L1j47J05J26q7o2R3
$$ 136 -127 142 174 245 -30 90 116 -85 82 -324 109 -177 91 -111 60 91 -56 49 175 88 26 119
4514A19j8Qj20J41Kj02k84J00K72l31M46j42j73M4J42k13o3J94J41k07l9MJ18
$$ 119 101 109 -11 130 132 30 -254 -154 118 -213 233 91 -82 -38 104 -109 -172 22 163 -44 -83 -79 39
4537C9m1N8L29k79k42L15mm12J92P2M79m39k4j65K42j21R8J27l83o6R5J16j75
$$ 39 -2 56 385 106 -136 179 175 -237 -45 27 506 67 43 -122 120 -1 97 224 -159 -225 -130 -14 -189
4560a89K07l5J86n06N14k14M59n74K20l2l61M97j99p5k7J01l5k65K21Q2J32j38
$$ -189 18 -17 169 -337 177 -37 422 -152 68 36 -325 172 -27 -102 -129 -28 -63 -328 -107 -25 107 -31
4582c1rO4j08m7J67J44k06l9J21L23n52K80l5k16n9J83R7j43K09q8l50L42q0j05
$$ -31 -40 24 -84 -131 36 180 -26 -65 56 379 -173 107 72 -144 -203 -20 77 -66 143 55 -295 47 -33 -138
4606a38p3J63K3k0k3J08K9k12R1J68o5J22k65J83k84K74k32K01J31K4k77j8k75
$$ -138 -211 -48 -25 -45 -68 40 69 -143 -52 116 51 173 -92 91 -193 81 -151 50 181 205 -72 -90 -365
4629c65K69R1l6R2m7o8j96L02m5K5r7J19P3j14J02O7o3O3n4l00j48N73q8j10k3
$$ -365 -96 -5 -41 51 4 -64 -260 42 -3 22 -75 44 117 3 105 172 109 172 118 -182 -330 243 155 45 22
4654B2j08M57n16K15J75l17R9l5K2j20K31k24J88k82j69L29N8k3J89j94j12J74
$$ 22 -86 371 -145 70 245 -72 27 -8 14 -106 125 -99 89 -193 -362 -33 25 2 191 -3 -115 59
4676E9o4J18j06Q4lj48Q2j06K03o0L24l70l47K56J39Mk16K70k0l5J19j89K31j61
$$ 59 -5 113 7 91 88 -60 22 -84 119 59 383 13 -334 -78 61 65 -151 119 99 64 183 -6 225 64
4700F4k2J01j98o3L22j59j15K34j17j84j5K93j09k55J06R7Q4j05pK22Qm6j28K22
$$ 64 42 143 -55 -118 204 45 -70 164 47 -137 -152 141 32 -223 -117 -20 64 -41 -48 174 182 136 8 230
4724B30l38J04K55l40p9J27Q7k18K42n0J73m09L37j93n9P5j69K58k0n6p2L11j49
$$ 230 -108 -4 251 -89 -168 -41 46 -172 70 20 193 -216 121 -72 -131 -56 -225 33 13 -43 -115 196 47
4747D7q4K6k7O6Qn4j43J38L2Q4l3oj69L2j16M0M97m25j29L31l24L86k57K21k54
$$ 47 -37 -11 -38 28 36 -18 -161 -23 9 93 60 54 -115 -83 -199 -159 338 -87 -216 115 -209 177 -80 141 -113
4772a13K51K53n46M37j12R4k29J52l9j81J91j16L2n4M3L57o52L13k58L29j75r2
$$ -113 138 391 -155 282 170 264 35 187 148 -33 158 42 74 20 63 420 -232 81 -177 152 -23 -115
4794a15J46q7j3J3K48j08j3Kj84J32Pp4J79l79L48jJ38j34j93J59j8K50k36rK9
$$ -115 31 -56 -69 -56 192 84 71 73 -111 21 28 -46 133 -246 102 101 239 105 -88 71 53 303 67 58 87
4819H7m6LL6k31L86p5j21j74K8N9K6K4M8J28k01J52k34lK6N2L50j56J82k01j96
$$ 87 41 44 80 -151 235 160 39 -135 -107 -48 -22 2 50 178 -23 129 -105 -108 -82 -30 320 164 346 145 -51
4844e1p8j65J73NlJ76m77M94L73m37k63L27J03K9j10j46j00K05L0k03j11K40O2
$$ -51 -129 -294 -121 -116 -119 57 -420 74 447 10 -253 74 177 206 96 -50 -150 55 85 -118 -229 11 73
4867G3L6p3j82M99l88r7qK20K2P4j51k26K16J48k14R3K86l73J63j43Qj2L8J45
$$ 73 109 36 -146 353 -35 -132 -140 80 102 176 25 -201 15 163 -51 42 328 -45 118 -25 -17 -29 9 154
4891A54k87K36j83J60j00K1J71l30J81l4j52J54K42k42N6j52M90k83p8N8J6r0
$$ 154 -133 103 -80 80 -20 1 172 -158 23 -11 -163 -9 233 -9 47 -105 385 102 24 82 98 8
4913HR5m39J98QJ87j70J04n9j26L52k20N3J64j95M6l2l1Q3j09J57m8J70l40J51
$$ 8 103 -336 -138 -130 57 -113 -9 -68 -194 158 -62 -9 155 -40 6 -26 -57 26 -83 74 26 196 -144 7
4937Gj40J90qJ52j2nk86M1R4K20j82J4m69M08k04L08p0J64j38R0j81K58l07j58
$$ 7 -133 57 49 201 189 184 -102 -61 33 253 71 85 -384 24 -180 128 58 222 84 174 -7 251 -56 -214
4961b14R5L4QP5j63M49j78j58K59j16j48M03o82L93k07K79q2L2J31k37K70k55
$$ -214 -119 -85 -77 -2 -165 284 106 -52 207 91 -57 346 -336 57 -150 129 47 79 210 -27 243 -12
4983a2J1l02M55l90K06M7Q5%j90J97J07l01K75j93k3K57j73L54m25j32J29J9R8
$$ -12 -1 -303 152 -238 -32 15 100 100 -90 107 214 -87 188 -5 -28 229 56 410 -15 -147 -18 1 99
5006I9n1o6K0n0K4M2q8j64K35q5kj00J42p6K66j15P4q0Q1n1j65J69O9q2j86J34
$$ 99 48 -18 2 -48 -24 18 -70 -234 1 -84 -86 -186 -44 -120 146 31 105 25 106 55 -110 59 128 46 -140 -6
5032fn1K35l27J00JK12j33J3l3j69K79l25N41m34J16j35J58Q6K0q2j7j34k03N06
$$ -6 -57 178 -149 -49 -48 164 31 44 11 -158 121 -204 337 -97 19 -116 42 128 148 66 49 -85 -288 218
5056B18l41J71j67L75k35J74n3m20R4J38RL42j91l34K63P6j69j6j24n4K56j69
$$ 218 -123 48 -119 256 21 195 142 -278 -184 -46 -37 305 114 -220 43 119 -50 -66 -190 -244 12 -157
5078a57L67o1k65RkK45O4k28L44k58P8m14M21m05L07j65K50j98J98j44P5L40m65
$$ -157 210 149 -116 -107 -109 136 200 -28 316 58 136 -278 143 -262 45 -120 130 -68 130 -14 61 401 -64
5101f4J62K0k63j39K89J39m1J2j20j79Q8K33k13J28K02n98J60L17k72L68l05R0
$$ -64 98 118 -145 -284 5 144 103 115 -5 -184 -96 137 -76 52 254 -344 -184 133 -139 229 -76 14
5123A4K46k08K7j8k2jJ89l51L08j19q8j02J83qj69R5K3K08m42J80j50L30j30l0
$$ 14 260 52 79 61 39 38 227 -124 184 65 -23 -125 58 50 -119 -24 -1 207 -235 -55 -205 125 -5 -35
5147c5M01k56o3o2j38K29J38k35O7k18K12P1l71M65n40P3L97j39nJ58J1Q6m46
$$ -35 366 110 47 -15 -153 76 214 -21 46 -172 40 111 -260 205 -335 -262 135 -4 -9 149 160 246 -200
5170b00m7J54M69m5m00J75j97Q3M7Mk6J41k07j59L79j80K4k0J98n94K75n5L50
$$ -200 -247 -93 376 331 -69 106 -91 -8 39 43 17 158 -49 -208 171 -9 15 -5 193 -401 -126 -181 169
5193A69j15j01K76j82k35Q6K75k1l27O58o88L05J10l48O3J1Nk27K10P2j91K39
$$ 169 54 -47 229 47 -188 -102 173 152 -175 483 -205 100 210 -138 -75 -64 -59 -286 -76 -4 -195 44
5215D4O5m21K64N1J71o1j32N04l68L9k6j08k38K45j71J16k19L13k53M5j08J26
$$ 44 109 -312 -48 3 174 113 -19 485 117 156 130 22 -216 29 -142 -26 -245 68 -185 -140 -248 -122
5237a22p6K52k03K43p6j82L12j70l17M03l4K1j99K29k49Q7O6nL30m16M5k9Q5j68
$$ -122 -198 54 -149 94 18 -164 148 -22 -339 64 30 51 -148 81 -168 -81 -15 -20 310 -106 -61 -90 -5 -173
5261a73K33M4K6k09K54J16j9kk96N5k0J95j17RQ0j45J68l26L72m56K26o4N6L84
$$ -173 60 104 130 -79 175 291 272 270 -26 29 9 204 87 96 176 31 199 -127 245 -211 15 -49 7 391
5285C91n93K42J73j38j74K28j91m7o7J86j58J81pJ53J0q4l24K9l0L82K7l95M5
$$ 391 -202 40 213 75 -99 129 -62 -109 -176 10 -148 33 26 179 189 105 -219 -190 -220 162 189 -206 -161
5308a61K20kP7q1o4Q2k82J84Pj40K6J36J6j68J68k85L28L1k15J15K1R5k74K27
$$ -161 59 57 134 53 -11 71 -211 -27 -20 -160 -134 2 18 -150 18 -267 61 92 -123 -8 13 108 -166 61
5332F1k25K68j55P9m2o4q1K46N6l4J00k75K4Jj5M4L2mj7k25K05r7J71R0j42L0
$$ 61 -164 104 -51 28 -14 -78 -159 87 143 109 209 -66 -42 -41 -56 -12 20 16 -1 -226 -21 -118 53 143 1 31
5358C1J6l4J4J39j29Qk2J7j79J5r5M45k64Q0p7J78r3n0n9J37k03J08j36L15p8
$$ 31 47 13 27 166 37 45 23 40 -139 -124 -219 226 -38 42 -35 143 50 0 -59 78 -125 -17 -153 162 84
5383H4k51J53J58o6r0L48l15R4M7k51k36K59j79P9J31k82L63q8K92l39Q3j23K5
$$ 84 -167 -14 144 78 -12 336 21 115 162 -89 -325 -66 -245 -166 -35 -317 46 -42 250 -89 -6 -129 -104
5406a04J28p6k37J78J3k98J11R8K90k83L19l36K98PK96m83N6j17K18l44P5j19
$$ -104 24 -52 -289 -111 -98 -396 -285 -187 103 -180 139 -197 101 108 404 -79 -23 -140 78 -266 -191 -310
5428c10L94j89J99m20L23L5N7M5k09O6j09J38k45M15j03o8k50K47j88L4K50r9
$$ -310 84 -105 94 -326 -3 32 89 134 -75 -9 -118 20 -225 190 87 19 -231 16 -172 -138 112 13
5450A3J36q6K02j89j61O5j36K36j3K44m59k37L85j62L13k35nm5j07J42K48n9R1
$$ 13 149 63 265 76 -85 -20 -156 80 67 311 -148 -385 0 -162 151 -84 -89 -134 -241 -99 149 90 181
5473A81m72K59J02j31j62l6K60j79K39q6pJ29j83qJ21q1J29q5p2J37j64J78n5
$$ 181 -291 -32 70 -61 -223 -259 1 -178 61 -25 -32 97 -86 -94 27 -54 75 -10 -82 55 -109 69 14
5496A4n4q6K03M9J04K4j73m4P8m4L03n29K63q0Q3l14K79l3J39k6P6n28M33j75
$$ 14 -40 -126 77 126 230 254 81 37 115 71 374 -155 108 28 111 -203 76 43 182 156 232 -296 137 -38
5520c8J2qJ22l31K35J60j57k28M96k22j26J11Pj79K12J09k11nJ09j04q2J17J79
$$ -38 -26 -34 88 -243 -8 152 -5 -233 263 41 -85 26 33 -146 66 175 -36 -41 68 -36 -118 -1 178
5543A78j1n19M77j51K01k98K91k14K7L34m26J9L4J83M7j63J55r7P5k27J3J33j0
$$ 178 167 -352 125 -26 175 -123 168 -46 -19 315 -111 -92 -58 125 172 9 164 67 142 -85 -72 61 51
5566E1m2L24l59L4LR3k42K1k53L97rk8P1J8q3J8K40k11o8J55m3M8j47k27N69m48
$$ 51 9 333 -26 8 11 104 -138 -117 -370 27 18 -10 61 79 -4 14 254 43 -25 130 87 135 -12 -239 330 -118
5592a18J01k81K51J57k41L34j21n3k14R8J90J59k29j84K56R7q7l37L55J81k75
$$ -118 -17 -298 -47 110 -131 203 82 29 -185 -87 103 262 33 -151 105 202 115 -222 133 314 39
5613C9Q9j37k25K93k0n4k55K7J39K14o8j45l5K64j96K61l03K03l42M09l05K42
$$ 39 128 -9 -234 59 39 -15 -270 -243 -104 110 42 -103 -138 126 -70 191 -112 91 -251 158 -147 95
5635I5J56l49J96l12K95r3K43j11o8j50J38j57j68R7L55k89O8Q4K9l22PK82j89
$$ 95 251 -98 98 -214 81 -12 231 120 52 -98 40 -117 -285 -188 167 -122 -54 30 59 -263 -256 26 -163
5658a63J99k09K70k81J82Ql3J43j77L8p2L26j24j49J11p4j29K26Ql0j72K0P8Q3
$$ -163 36 -173 97 -184 -2 6 -27 116 -61 -23 -95 231 107 -42 69 -5 -134 92 100 70 -102 -82 -4 79
5682G9J6l18K41l56L28j12J28J59k20R1R4mJ03k72M2J21j6p5P5j60l36P7K17J44
$$ 79 95 -223 18 -338 -10 -122 6 165 -55 36 130 126 229 -43 -1 120 104 29 104 -56 -392 -315 -98 46
5706D6o3NK56j85K8pj00j36J22q0Q4l0k33O15m48Q3J23K45j69m21J22K86l14J77
$$ 46 -17 -12 244 59 87 80 -20 -156 -34 -114 -30 -60 -293 322 -126 -43 80 325 156 -265 -143 143 -171 6
5730Fl23L77rk5m2PJ32k54o2R4kK27l05J92k35K34nJ71k0m30K31lK6k33K51j76
$$ 6 -317 60 51 26 -16 -9 123 -131 -193 -99 -101 126 -179 13 -222 12 7 178 158 -272 -41 -44 -18 -251 0 -176
5756a76K85k14PJ68j24L19l71j9J44Jj47Q7j40J79P7j88J23k82K14J41j43k8l8
$$ -176 109 -105 -98 70 -54 265 -106 -125 19 20 -127 -40 -180 -1 76 -112 11 -271 -57 84 -59 -87 -125
5779a25nK67j18k20J53mqJ52M1J36M4k16N6r2J99j70p0j51J95M4j12K53o33N40
$$ -125 -130 137 19 -201 -48 -52 -60 92 133 269 313 97 153 61 260 90 20 -131 64 108 -4 249 -384 156
5803A56q2j35K91j86J42P3k70j02J05n3K31p9Q7l9k53k95M73j01n5o4K84o8j2
$$ 156 74 -61 230 44 186 259 -11 -113 -8 -61 170 91 178 139 -114 -409 64 -37 -92 -156 128 60 48
5826D8J49k94m9L45o4p5NJ00j19j70L74m40N8R5O2J4J16k92M50j74J53l52K25
$$ 48 197 -97 -146 199 135 60 65 165 46 -124 250 -190 -132 -37 25 39 155 -137 313 139 292 -60 165
5849A65j62M1j23R4J9K79n03L26k41Q4Q6K2j80k71M80j80L4j4J24j80qp5K3L08
$$ 165 3 44 -79 15 34 313 -190 136 -105 -21 65 87 -93 -364 116 -64 -30 -44 80 -100 -108 -183 -160 148
5873A48p2j88K3n7J44J89l95J92M8j74O5j46K48r1r8J83l57K80M7j17Q3N2O3J76
$$ 148 76 -112 -89 -146 -2 187 -208 -16 32 -142 -77 -223 25 -66 -164 19 -338 -58 -11 -128 -45 7 70 246
5897B46K24m69M8L5J06N4k75k71L12P5j46q0K92l07L8L22m86K53j0J84m9l19M0
$$ 246 470 1 49 84 190 244 -31 -302 10 85 -61 -141 151 -156 -118 204 -282 -29 -39 145 96 -223 -183
5920a83K26M8k52N9J82L8k8j50j99L25qk9j73K12k17L24j21j61J80n0J04n26N16
$$ -183 43 91 -161 -102 80 118 90 -60 -259 66 58 29 -144 68 -149 175 54 -107 73 23 127 -399 117
5943A17p0N9J1j62n8k22M02m04L09j1k17Q6K13lO3m6Q0k0k81K22j45K7J09K31
$$ 117 47 106 117 -45 -103 -325 77 -327 -18 -29 -246 -160 53 50 113 67 147 127 -154 68 -77 -50 59 290
5967B90j3l52R0k8K8l2K18j90j38K04oRR0l07J26J29j89K56l06K57l9r2R9k78
$$ 290 277 -75 15 -13 15 -17 201 11 -127 77 71 80 170 -137 -11 118 -71 185 -121 136 97 5 104 -174
5991a74J80n5J23k02j74M11%p3K68j88j14J41l56J50k31n1M14ML5j42j40L19j87
$$ -174 6 -49 74 -128 -302 109 109 36 304 116 2 143 -213 -63 -294 -345 69 73 108 -34 -174 145 -42
6014d2r8J41J3j58R6J7j63K50k39r6r5L12J72j21j58K83q6K17k50p4QJ95l77M96
$$ -42 -140 1 14 -144 -48 -31 -194 56 -183 -279 -374 -62 110 -11 -169 114 28 245 -5 -79 -71 124 -253 243
6038B43n47M06p7k13L60j43p3R2k52j93N33j65K28m01K15K46l77J72K19k38M5
$$ 243 -304 102 25 -188 172 29 -44 48 -204 -397 136 -29 199 -202 13 259 -118 54 273 35 80
6059H0j15pJ18l73L83k27J6Q0J84l0r9p5K83j92l0r5r0L15p1J25j69k29J75J08
$$ 80 -35 -42 76 -297 86 -141 -125 -45 139 109 10 -65 218 26 -4 -99 -189 126 55 180 11 -218 -43 65
6083F5j00l13J60r4K77k51L70r7k9J34m3M7j74J50L72n25j05m6L56O4q4k12p6
$$ 65 -35 -348 -188 -282 -5 -256 114 17 -12 122 79 126 -48 102 474 -51 -156 -202 154 218 134 -78 -154
6106a54M88k90k1J14k94J34K28l05N2J68Q1j60r1k49LK19J14k41K95j37J00J19
$$ -154 334 44 23 137 -157 -23 205 -100 -48 120 201 41 -50 -299 -296 -77 37 -204 91 -46 54 173
6128A73j99J30k30J98J45l33j30L25k06J38K40l97L82r2j80j41K54p0M1k27K93
$$ 173 -26 104 -126 72 217 -116 -246 79 -127 11 251 -146 236 144 -36 -177 77 7 48 -179 114
6149A14j12k09L23k05O2O2j92J59k25j4K8K82m1l22L63q7J2k86L93j34K25L9q4
$$ 114 2 -207 116 -89 -27 35 -157 2 -223 -237 -209 73 32 -290 73 -14 -2 -288 105 -29 196 235 151
6172A51n32L04J64k39J35jj4j09K20o2J68j71Q9k96J83l8J83k6K05m04J76J0j53
$$ 151 -381 -77 87 -152 -17 -18 -32 -141 79 17 185 14 103 -193 -10 -48 135 109 314 -90 86 96 -57
6195e7J63L5k53L56l22k4K22l99M51l41K37k07j74N8M27ok21j5rL07ok43O2Q9
$$ -57 106 141 -112 244 -78 -102 120 -279 172 -169 68 -139 -313 -255 172 166 -55 -70 -79 228 222 -21 41 130
6219A30j10k16N8J46K7K78j97j11J7L4n8J91j14k53K02r3K61j80k42L04o8j31
$$ 130 20 -196 -138 8 35 313 116 5 22 56 -2 189 75 -178 24 -69 192 12 -230 74 6 -125
6241a25L48j86j61J54J8j53J13L50k40p3l3J07l4j26j7J48j04k12K35J30k21p7
$$ -125 223 37 -124 30 48 -105 8 358 118 45 12 119 85 -41 -58 90 -14 -226 9 139 -82 -159
6263a59j38L89J00k13j84K91m0r4j5nQ6Jj27L44N8j13k98K93k55J55J24l69L43
$$ -159 -297 92 192 -21 -205 86 46 -48 -63 -68 18 19 -108 236 294 181 -117 176 -79 76 200 -169 174
6286A74j8k37j21K39j37J66k11l3J44j9m7Q9J04L9n3q1j54NJ69k63K99kJ83k59
$$ 174 156 -81 -202 37 -100 66 -145 -178 -34 -53 -100 -11 93 132 79 -2 -156 -151 18 -245 54 52 235 -24
6310b4k6q8L3M52j55o7M6k58L44k21nl9lJ84m17L16n6P0j07P3k29P0L4l7K99m4
$$ -24 -50 -138 -105 347 192 125 171 -87 257 36 31 -8 -11 173 -244 72 16 86 -21 52 -177 -107 -73 -110 189 145
6336A45q8r7M4r0O4m4K36j09m3j30l5Q7K31k35l2L6M0J89k53j35j0j7M35p9l0
$$ 145 57 -40 4 -86 -22 -66 170 61 18 -112 -147 -60 171 -64 -96 -60 -20 169 -84 -219 -229 -246 189 110 80
6361H0j01p8L8J04m1j11JR2P3Q4k57Q2J85k20j97k45P31k58o9PL1KK20j51p4J14
$$ 80 -21 -99 -61 43 2 -109 -108 -16 57 141 -116 -34 151 -69 -266 -511 220 -38 -107 -100 -69 -67 153 2 -72 42
6387D2p5j6J06j66J47j73M6K43n67L42L58m25K33j80M27m58J45l7N4j32K0j6J05
$$ 42 -33 -49 57 -109 38 -135 -89 154 -413 -71 287 -138 95 -85 342 -116 29 -8 46 -86 -66 -82 23
6410B3k1M2J03k66J50Q2k98J14J33m03K75k00N7M10k31J31q7p2K92q9k95N32j46
$$ 23 2 44 147 -119 31 113 -185 -71 62 -341 -66 -266 -209 201 -30 101 14 -58 234 145 -150 382 236
6433B36j21K51j49k30k79J11K3K31j47J39r8Q7kj36K18m12R3K98Mk02L3J85o3
$$ 236 115 366 217 -13 -292 -181 -158 73 -74 65 -33 54 52 -84 134 -278 -185 113 117 -85 -52 133 70
6456G0Pj61P1Q9j58K67m42J68o4Mj46L79p3j4j52J31p3j5K69r9j63K25j40K01
$$ 70 77 -84 -13 76 -82 185 -257 -89 -153 -149 -295 84 11 -3 -155 -24 -97 -112 157 58 -105 120 -20 181
6480A81k20J35p7k0Q8j70L19o2j62l5J95j49j92J16M22l14l38L53Pk55L04J9J2
$$ 181 -39 96 19 -1 87 -83 236 174 12 -23 172 23 -169 -53 369 55 -283 70 77 -178 126 145 157
6503A57N8j37k22K68l11l6L26j62J53l82M06k2r3p5L4K20q0r1J72l0l56K39l3
$$ 157 215 78 -144 124 -187 -223 103 -59 94 -288 118 96 3 -72 -38 182 102 11 183 153 -203 36 3
6526CM4j18L4J66r3P1j63J56j22N3PJ22p5j77R8j36M88k87m1M4k66L10p7j36Q8
$$ 3 47 -71 -37 129 36 107 -56 100 -22 31 38 160 85 -92 6 -130 358 71 30 74 -192 118 41 -95 -7
6551gK45r2P4k06k53N56j85j40L1j17J71P4m6L7j96O8j91O2K34j43J70m0L3j4
$$ -7 238 146 220 14 -239 317 132 -8 23 -94 77 151 105 142 -54 14 -177 -115 119 -24 146 106 139 125
6575A25k27l26K52P3N6M8O5j32j28J67R1K7l21J69J96j69k4p3J30j84M09l63j40
$$ 125 -102 -428 -176 -103 -47 1 66 -66 -194 -27 64 91 -230 -61 135 -34 -58 -131 -1 -185 224 -139 -279
6598b79K45P5K67j36k74J03K21m16P6K64j09j17J15ol8q6q8L06k77K09m36K48
$$ -279 -34 41 308 172 -102 1 222 -194 -118 146 37 -80 35 29 -9 -95 -183 123 -154 55 -381 -133
6620a33L00j72K45k09l0l7P7j07J12J04j11j36K35j57JK06K6k46R0m9K27j25k97
$$ -133 167 -5 240 31 1 -36 41 -66 46 150 39 -97 138 -19 -18 188 214 -32 58 9 236 111 -186
6643a86q5K16L8N8L5N8m01L36N7J42l08J93l29J91j26K55k26K14L4n5n6k3j73
$$ -186 -271 -55 -17 41 76 134 -267 69 126 268 -40 153 -176 15 -111 144 -82 132 166 111 55 32 -141
6666a41L5j7K05j21k31K16K1J52J5j67KJ99j63R6k71K97R1l35R7r1k1J36L5k51
$$ -141 -106 -123 82 -39 -270 -54 -33 119 134 -33 -31 168 5 101 -170 127 218 -117 -20 -111 -132 4 39 -212
6690b12j09M02k43J65J47m2j69j30M80m23K90k6L61m31Q3j86L%K93k43q9Mmn7
$$ -212 -321 81 -162 3 150 108 -61 -191 289 -134 156 130 491 60 143 -43 -40 -40 253 10 -79 -75 -79 -136
6714a36K91k09j60J26j39L02k2l3j63M9K69k91J70j68J84N5p8j42Q5K99l79K79
$$ -136 155 -54 -214 -88 -227 75 53 20 -143 -94 175 -116 54 -114 70 125 47 -95 -10 289 -90 189
6736A89j60j1J44o3l99M21k96L06q5K49m16M13L4pk30j23K34k08o2l07O05n82
$$ 189 29 18 162 99 -300 121 -175 131 46 295 -121 292 326 319 89 -34 200 -8 -70 -377 228 -354
6758c54M39rj06R3p8J91j60n1J65j89M16k93j07JJ13R8j75j89M73k75j17jL26
$$ -354 85 76 -30 63 -15 176 16 -35 130 -59 357 64 -43 -42 71 169 -6 -195 278 3 -114 -115 211
6781B11m19N22k08k20K21j48Rj06J84M5k12j29M38q9l7n0r1J80j84Q2q4j7pK9
$$ 211 -208 314 106 -114 107 -41 -32 -138 46 91 -121 -250 188 99 62 12 -79 101 -83 -1 -85 -102 -109 -80
6805h0k8L26j63k10J58p7J82j08K0n4K5K29l06L94l76L76j69k90K16p4j28L84
$$ -80 -108 218 55 -155 3 -74 108 0 20 -34 -9 220 -86 308 -68 308 139 -151 65 -9 -137 247
6827B47mJ35l70q9J03N4q2J92o7M8p4m5j50o1J64l7J1M3o1j77N64j20j20j81K50
$$ 247 243 378 8 -81 22 76 -6 186 119 167 93 48 -102 -163 1 -36 -25 18 -43 -220 344 224 104 -77 173
6852A73l56J56K62l89L50p6k29r8J77M9j60L08k36K49n2r4q2n0J42J85l67J40
$$ 173 -183 -27 235 -154 196 120 -109 -207 -30 19 -141 167 -69 180 128 34 -48 -98 44 229 -138 2
6874Bj60K91J79j43m20M48j26o8k76K62R4k21Q6O1N9j46q4m2K2L22j34k08J18
$$ 2 -158 133 312 169 -251 197 71 3 -273 -11 83 -138 -52 9 68 -78 -162 -204 -182 140 6 -202 -84
6897h4mj47K65l3r6j20K65L13k90P4j54k60J45R2p1J92j60j8k57L49L2q0L60m67
$$ -84 -88 -235 30 -3 -99 -219 46 359 69 143 -11 -271 -126 -34 -105 87 -73 -91 -348 1 33 -47 313 -154
6921a54K04mL37j78m05K82k44K9P6K55l92K13O0Q4k3k31j27J50m4L44p3l36J49
$$ -154 50 46 383 205 -200 82 -162 -133 -57 198 -194 19 79 163 140 -91 -218 -68 -112 232 159 -177 -28
6944b8kN1Q5R2p7J4M5k87m4L40j0n63L24p2l93P68q6k1N8q3r8M6oO7j80J09jm4
$$ -28 -30 21 106 198 121 135 180 -107 -151 189 179 -384 -60 -132 -525 243 157 136 194 111 13 59 53 120 -60 49 48 4
6972DJ17N9l37N05l14M2j08L6kp5J30q7Q7o9n0l6Q0N4J53M3k79K15J28n48L58
$$ 4 121 180 -157 348 34 76 -32 4 2 -73 57 -30 57 -12 -62 -98 -18 36 189 232 -47 168 296 -252 106
6997A06j05O0N3l04j69N74m99K52l00K43r6K90j81L3j3m3J23k30J10n6N7N04m87
$$ 106 1 61 114 -190 -359 215 -284 -32 -332 -89 -185 105 -76 -43 -56 -99 24 -206 -96 -152 -95 409 -78
7020g8j08M75k81k27J57o2j33J91k36L68j75Q0m7K1J03j8J57p3K0q4l6J44mk78
$$ -78 -186 289 8 -219 -62 -124 -257 -66 -302 66 -109 -29 -76 -55 48 30 187 114 134 50 14 158 154 -124
7044a24K38p7j66K33l75J48J56j35q1M5K97p3P4l39l5L65k74J59j68N41q7l59
$$ -124 114 37 -129 104 -271 -123 33 -102 -183 -138 159 86 160 -179 -214 151 -123 36 -132 409 322 -37
7066c7L42j64o6LK1j84p9L56j13L9m41L96P3Q4J48k33o3k30J12P4j17r4K26j67
$$ -37 305 141 75 78 99 -85 -164 192 79 118 -323 73 146 230 378 145 82 -148 -36 38 -79 -173 53 -114
7090a14K18k30n8K19j17K64k28J5J57k31K87j4l0m26L23K2K18o35M16j52j7L66
$$ -114 104 -126 -184 35 -82 182 -46 -31 126 -105 182 168 138 -288 35 57 275 -360 56 -96 -113 253
7112B53k64n5J18R1l8j17J06j4k34J96k11J76J39ok71M2J44j20M13l86J17k80
$$ 253 -11 -66 52 143 105 -12 94 80 -154 42 -169 7 146 140 -131 -89 55 -65 348 -38 79 -201
7134b01K57l67K26P1j99j6NM64l17K1R7l36N13j05k44J73k9j51L20j78j11K06
$$ -201 56 -311 -85 -14 -213 -229 -224 240 -77 -56 41 -295 218 113 -131 42 13 -138 182 4 -107 99
7156I9k00J67j96R8nO5K01p4j59L7K7j52j9N9q5J41j76K99j22k12M79m11j6m6
$$ 99 -101 66 -130 -32 -37 28 229 155 -4 33 60 -92 -111 -52 -137 4 -172 127 5 -207 272 -139 -155 -201
7180b01J23J05J6j63J93j45J96k63K36nj8j29J85k86K8J51m8L3l0j09K22n3J26
$$ -201 -78 27 43 -120 73 -72 124 -139 97 92 74 -55 130 -156 -128 23 -25 8 -22 -131 91 38 164
7203A64k33r3L41j60L00l43q1J53k17J95o9j93K71k48K42p2R6j83L38p4o5j37
$$ 164 -69 -162 179 19 319 -24 -105 48 -169 26 -43 -236 35 -213 29 -43 53 -130 208 134 69 -68
7225f8J38r4K2k0K53l96J44n0l0K05j65R3q1J98k31m9O3K54m0j81O0J19k48J5
$$ -68 70 -24 -2 -22 231 -165 -21 -71 -101 104 -61 32 -49 149 -82 -131 -68 186 146 -35 25 144 -104 -89
7249h9l4L0O4j84J98r7J81Q7m35L67q4K8L8j64K74k22L29j39m5o2j49o4J93j08
$$ -89 -123 -93 -29 -213 -15 -112 69 156 -279 88 4 32 70 -94 180 -42 287 148 103 41 -108 -172 21 -87
7273h7l1P2K56l64Q6K03NL0l81J41q1L51l60J50j34J54J1j71K43r7j10K93r2J14
$$ -87 -118 -46 210 -154 -68 135 140 170 -211 -70 -151 200 -160 -10 -144 10 21 -150 93 -4 -114 179 87 201
7297B01k07r3R9m7J15k1K12k81J34j70k38K18j34L45q9q7k4j02O4K03l0m8K5k65
$$ 201 -6 -99 0 -47 68 47 259 -22 112 -58 -296 -78 -212 133 44 -43 -67 -169 -105 98 68 20 45 -220
7321b20J40j2J01J78Lo7Mj85M9r2l31L41j02O6kP9m6rJ40L5j62J96j6j4p3q9L00
$$ -220 -80 -92 9 187 190 123 127 -58 -9 -101 -432 -91 -193 -127 -129 -50 -96 -105 35 70 -92 104 88 74 1 -88 212
7348B12k18ro5N9j56JJ82N8l2M1j44J86j53n5J70j46k5J40l9p5O0q6R6K6j11K15
$$ 212 -6 -15 -80 -21 -177 -176 6 64 32 73 -71 115 -38 -93 77 -69 -94 46 7 -68 -8 -94 2 28 -83 132
7374A32j95j63J05K53L02n80m6N8l8L9NJ03j36K53j28O6l70L02Q7q8O8k2k24M60
$$ 132 -63 -226 -121 132 434 -146 -192 -134 -172 -133 -128 -25 -161 92 -36 30 -340 -38 49 -39 29 7 -217 243
7398B43k80l52M76k0m5o8K36k20O9l5p4R1K31j26p9j16J33J78k30J33RK1j38j2
$$ 243 -37 -389 87 67 22 -46 190 -30 39 4 -70 21 252 126 47 -69 64 242 12 145 154 175 37 25
7422B5rm1k51M14k6O1j89j3j86j6K56O8L12k68k08J92j4J36j58M4l03J08k5l06
$$ 25 16 -25 -276 138 112 173 -16 -29 -215 -231 25 93 405 137 -71 121 107 243 85 129 -174 -66 -91 -397
7446c97Q12m25L8J81J7m30K07j25J16k69M52l08K45k46K54m0K2k51K05K71m38
$$ -397 415 -10 28 209 226 -204 3 -122 -6 -275 177 -131 114 -132 122 82 104 -147 58 329 -109
7467a09Q3J72L7l14L2MQ6k11K48q8q0P0O1K4k68L36j47J61k7j42j29L55k68J48
$$ -109 -26 146 183 -131 -99 -95 -9 -220 28 -60 -140 -70 -9 15 -253 83 -64 97 70 -72 -201 154 -114 34
7491C4n3n5l8J62j12K87l91K18J22j30k07K01k08j2L91O8k77k23K17J7J81J3p3
$$ 34 -19 -74 -112 50 -62 225 -166 52 174 44 -163 38 -170 -182 209 277 0 -223 -6 11 192 205 132
7514A32l37K75r0K22l8m50O10k58o0k27J84K20K07o09j4J02J12K10j63J07j01
$$ 132 -205 70 -20 202 164 -286 324 66 6 -221 -37 183 390 -219 -233 -131 -19 191 28 135 34
7535C4j67k3K38j95o8K74jQ8k43J64j33J11j99k%J78N7k82L23k8l76K38j92L98
$$ 34 -133 -156 82 -113 -181 93 92 180 -63 101 -32 79 -120 -122 -122 56 113 -169 154 126 -250 -12 -204 194
7559A94k01r6j09J64Q7r4J76k47K00j36o6O2J60K0q9J50r4k41K79j39J31N1n01
$$ 194 -7 -103 -212 -48 39 -55 121 -126 74 -62 -128 -66 94 114 25 175 81 -160 119 -20 111 162 -339
7582c39J69k5J04lj02J40o6j5K39q8K10n19L26JJ02o1J02m8j96J43k46N3K45k77
$$ -339 -170 -195 -91 -94 -196 -56 -122 -137 102 14 224 -295 31 32 134 73 175 127 -69 74 -172 -119 126 -151
7606a51k1M17k51K13m03O3J48k9Q1n2k82K51J23j08n2j59K19k01J60l0r6L41k48
$$ -151 -172 245 -6 207 -196 -133 15 -14 67 15 -267 -16 107 -1 -53 -212 7 -194 -34 -64 -160 181 -67
7629f7j7j35L07Rk70l67M31j2L45j73l47L75R5j72O7k29K72k24K39J23m26K9L42
$$ -67 -84 -219 88 97 -173 -540 -109 -121 224 51 -296 79 174 2 69 -160 112 -112 127 250 -176 -147 195
7652A95K79n26N3l7Np5J22Lk67K83j0M2M2K3j38j27K17j7Q8n10J91M24k41k02
$$ 195 474 -52 1 -36 -31 -106 16 19 -248 35 25 67 109 132 -6 -133 84 67 155 -355 -164 260 19 -183
7676a83M39k93J29J5l75N92k88K46o9qj14J2j11r8L16j95j73nM01j99K3l6k51
$$ -183 256 -37 92 107 -268 324 36 282 213 205 91 103 -8 -106 210 15 -158 -163 238 39 62 26 -225
7699b25O8Q3K2k88K62K6N5J83m1m85N72l79K29P7k58J17m9P5P8j06pk5r7K40J65
$$ -225 -157 -74 -52 -340 -78 -52 3 186 145 -340 232 -147 82 159 -99 18 -31 44 122 16 9 -16 -113 127 292
7724B92k71j03J01r2K16k53M2K46lm1l01j06M41j35o2oP4m2j61K14j27K9k62J14
$$ 292 21 -82 19 -73 143 -110 -68 178 175 134 -167 -273 168 33 -29 -35 39 -3 -164 50 -77 -48 -310 -196
7748a96J83N3j94K32l86M19k03J58k32M35j37P1k94NJ65k17J59o0k0J92K18n88
$$ -196 -13 40 -154 78 -308 111 -92 66 -166 269 132 203 -91 -86 79 -138 21 -39 -59 133 351 -237
7770b37M21J06j61pp4k02K00Rr3j07K61l13L23r6J19j85M4J44k08L90k71Q4k86
$$ -237 184 290 129 122 48 -154 46 55 -38 -145 116 -197 126 30 149 -36 8 152 -56 334 63 147 -139
7793a39L13j72N6L5o3Q8k8J04P4l51L96l62j7p9K0j36N91j65n42N15p4o2j40O4
$$ -139 174 2 58 93 30 118 90 194 268 -83 313 -49 -66 -145 -125 -261 330 165 -377 138 64 2 -138 -74
7817g4L88j03j75r1J76r5O3m7J36j28q3K31q5o4M0j76R2O3j80K53J23k87j09L14
$$ -74 314 211 36 -55 121 26 89 42 178 50 -33 198 113 49 89 -87 5 68 -112 141 264 -23 -132 182
7841A82j57j29n2K86j41j21L28k57J31K00k07j63O0l64L98r9L57J54k89p7o4k44
$$ 182 25 -104 -156 130 -11 -132 196 -61 70 270 63 -100 -40 -404 -6 -105 252 406 117 40 -24 -268
7863b68M05ko8J3N1k33r2L32J75m55K79k86K8L57l27K82j28l73M10o8J44j55k03
$$ -268 137 135 67 80 131 -102 -194 138 313 -142 137 -149 -121 236 -91 191 63 -310 100 32 176 21 -182
7886a82J35J69O1o4k45K10J79k44j29J03j7j96M69k12j5j62J97r0q9j3K47N6P6
$$ -182 -47 122 183 119 -126 84 263 19 -110 -7 -24 -220 249 37 22 -140 57 -33 -122 -135 112 168 244
7909B44m17k9J0Q8j64L02k96K95p7L1J7J4n5R7n0K9J1j50J18j3J1j47K77j9J13
$$ 244 -173 -202 -192 -104 -268 34 -262 33 -44 -13 4 18 -37 60 10 39 50 -100 18 5 16 -131 146 127 240
7934B40J04l90k24K10Q3J21k19r5J52J98J05j37q2j23J64l04J68j21K25n0j45
$$ 240 344 -46 -270 -60 23 144 -75 -170 -18 180 285 148 66 -57 107 -197 -29 -150 75 25 -120
7955a20Kj45L36K32m47K64L7m01J27m5M15k99J27k44K58J4O5j22J14j71K68k57
$$ -120 -118 -263 73 305 -142 122 159 -242 -115 -160 255 -44 83 -161 97 111 176 54 168 -3 265 8
7977HJ8p4N9j3q7J5k7J51k24N56m34Q0k2K88q7j36o7j64J52p2L34l31j0P9Q9j69
$$ 8 26 -48 11 -2 -89 -74 -101 50 -174 382 -52 28 6 294 207 71 4 -160 -8 -80 254 -77 -87 -8 81 -88
8003h8k4J06k88J54K44J3k11j39L87k30J23q2L13m11N17n12n1J34P6p9K39j50
$$ -88 -112 -6 -294 -140 104 117 -94 -233 154 -76 47 -35 278 -133 384 -128 -179 -45 31 -48 191 41
8025D1J68j5l50K13k31J31N0N6K7j29j27Q5J91m3j27K54m17J01J59k84M0L71K6
$$ 41 209 194 -156 57 -174 -43 7 63 90 -39 -166 -81 110 67 -60 194 -223 -122 37 -247 -207 164 190
8048A90j56m4K14Nk12j50K12j41M27k79j13j54J62J86K23m27L7L38j22Ok51J21
$$ 190 34 -10 204 209 -3 -153 59 -82 345 66 -47 -201 -39 147 370 -57 -20 318 196 202 -49 72
8070G2j63L54l0l4l48J67o2K07k5j01o9K2N0Q1J57k96K47k95J89Kn8k71L76j98
$$ 72 -91 263 233 199 -149 18 -44 163 138 37 -32 -10 40 121 278 -18 229 -66 123 125 67 -204 172 -26
8094b6p4O9L1NJ6j09K77l0k03j06K6J71J7p9o1N4P1K23k19k3j50R2R6k06P8L8
$$ -26 -100 -31 0 5 21 -88 189 159 -44 -150 -124 47 64 -15 -76 -22 49 272 53 30 -120 -28 68 -138 -60 -22
8120b2J6J28p8l1P1m1q0O7m8R5p3L88j63k98R3K24M3l46K64l91J69n1K22l10K8
$$ -22 -6 122 44 13 84 43 -37 30 -18 77 4 392 229 -69 24 248 291 -55 209 -182 -13 -64 158 -152 -124
8145a24J51j86J35Rj29J96J5j94K01Q3l42J96j44K40J94l69J28j17J4l10L28j4
$$ -124 27 -159 -24 -15 -144 52 67 -127 74 157 -185 11 -133 107 301 -68 60 -57 -43 -353 -25 -39
8167c9J32k51L94k45j5J23Qk93J07J89j95Q2L9j43J2J29k72K63j23L41k73Q4j45
$$ -39 93 -158 236 -9 -24 99 107 -186 -79 110 -85 -3 36 -107 -95 34 -238 25 -98 243 -30 54 -91
8190i1P2
$$ -91 -19
8191a9
$$ Imaginary data points
##PAGE= N=2
##DATA TABLE= (X++(I..I)), XYDATA
0@%%%%%%%QqQj6J6k4L2m0N2o3P5q8J12j39J63j92K25k65L14l67M23m87N62o46
$$ 0 0 0 0 0 0 0 0 8 0 8 -8 8 -16 16 -24 28 -35 40 -48 64 -75 88 -104 121 -144 170 -197 226 -261 301 -345
31c45P35q33R45j070J207j355J516j697J898k114K347k603K887l195L528l893
$$ -345 390 -443 502 -568 639 -716 800 -897 1001 -1113 1234 -1369 1518 -1677 1851 -2042
47b042M294m735N216n743O326o975P695q498R403j0430J1608j2970J4569j6479
$$ -2042 2252 -2483 2733 -3010 3316 -3659 4036 -4462 4941 -5489 6119 -6851 7718 -8761
61h761J8811k1727K5486l0552L7783m8989O8789j13745L91264m6176q60268N94252
$$ -8761 10050 -11677 13809 -16743 21040 -27949 40840 -72905 318359 272183 -588085 6167
73F167M28374o18104j59357P00439k40802n85313N26806M92394p47798k72690
$$ 6167 434541 -183563 -342920 357519 116717 -468596 58210 550604 -197194 -469884
83d69884P61280J2249p17689K86678N64948m80127l48085O30863Q4739o59115
$$ -469884 291396 303645 -414044 -127366 437582 -42545 -390630 240233 324972 -334143
93c34143J42607N65110l85510l81740N74215J93267o64631R867O35315j93022
$$ -334143 -191536 373574 -11936 -393676 180539 373806 -290825 -280958 354357 161335
103A61335n23117L24104L07667m08971l8740M77077j95392m77941L62965M07588
$$ 161335 -361782 -37678 269989 -138982 -177722 299355 103963 -373978 -11013 396575
113C96575m59106k86637M60366J18210l89093R0085K93248k75892j92500L88251
$$ 396575 -62531 -349168 111198 229408 -159685 -69600 223648 -52244 -244744 143507
123A43507P0746m36064M1095M11385j32622l12104K23513J90938k89819p5864
$$ 143507 214253 -221811 -180716 230669 98047 -214057 9456 200394 -89425 -165289
133a65289L00767l5449k61746J37364J96486k07507j04631K54640P068k91119
$$ -165289 135478 100029 -161717 -24353 172133 -35374 -140005 114635 121703 -169416
143a69416N4515K80420r1461k19621J19488J32407j33391k8761J42263p8737j59172
$$ -169416 -114901 165519 74058 -145563 -26075 106332 -27059 -55820 86443 7706 -151466
154a51466J58439J75134j90484j56509J95351J10998j80057m7622J43998l7668
$$ -151466 6973 182107 -8377 -164886 30465 141463 -38594 -86216 57782 20114
164B0114j11432J20320Q6568j79663n3077K07118M478k12627M7349J91237r9141
$$ 20114 -91318 29002 115570 -64093 -117170 89948 94426 -118201 -70852 120385 21244
175B1244j45040J51658R5264j79383l1311J77485m7716j54561J25951J13761j92384
$$ 21244 -123796 27862 123126 -56257 -87568 89917 42201 -112360 13591 127352 -65032
186f5032n9941K36236K445k48031M7700K11641j02041j39681J54790N0342j89823
$$ -65032 -124973 111263 113708 -134323 -86623 125018 22977 -116704 38086 88428 -101395
197a01395M8599K07665j33269j98494J91510J54876k19384p8847K22411j3239
$$ -101395 -52796 154869 21600 -176894 14616 169492 -49892 -128739 93672 80433
207H0433j99546J05746J48810j87178q5895K34199J0193k44814P2826K22616j48914
$$ 80433 -119113 -13367 135443 -51735 -137630 96569 106762 -138052 -65226 157390 8476
218H476j68328K05712R0514k31894J113K26362q9726j83456J71157J15516k33010
$$ 8476 -159852 45860 136374 -95520 -94407 131955 42229 -141227 29930 145446 -87564
229h7564l6770K58936m8267k48565J23911J97319j81156j15262K14156J4951k22829
$$ -87564 -124334 134602 86335 -162230 -38319 159000 -22156 -137418 76738 91689 -131140
240a31140Q5865K04442j69471j53894K29007Q3500k50063K243K34538q9996j89450
$$ -131140 -45275 159167 -10304 -164198 64809 148309 -101754 -99511 135027 45031 -144419
251a44419J64190J20020k16793l6841K36638n3094k24088J31991J77688j93266
$$ -144419 19771 139791 -77002 -113843 122795 69701 -154387 -22396 155292 -37974
261c7974j06508K28360K5195k29792O1547K02192j38108j45859J97128P0032k27197
$$ -37974 -144482 83878 109073 -120719 -59172 143020 4912 -140947 56181 126213 -100984
272a00984J3757K25278r3733j93428J57015J31435k00922n3690K16468l4208k02495
$$ -100984 -87227 138051 44318 -149110 7905 139340 -61582 -115272 101196 66988 -135507
283a35507J16919J61667j80077r8016K18827K2295k23491N8321K00097j30309
$$ -135507 -18588 143079 -36998 -135014 83813 106108 -117383 -59062 141035 10726
293A0726j48023J84938P5695k15488N331K12131q5295j82422J50024J27133j94990
$$ 10726 -137297 47641 123336 -92152 -86821 125310 40015 -142407 7617 134750 -60240
304f0240n5538K12823k3814j99170R9353J60740j58665r8267J96582K6452k05472
$$ -60240 -115778 97045 73231 -125939 -26586 134154 -24511 -122778 73804 100256 -105216
315a05216M7695J87058j15009j43704J64271P9452j92683o429J91645o6833j66787
$$ -105216 -57521 129537 14528 -129176 35095 114547 -78136 -84565 107080 40247 -126540
326a26540J27703J20348j70472n7974J90809j0790j82146P9618J50344j34035
$$ -126540 1163 121511 -48961 -106935 83874 73084 -109062 -29444 120900 -13135
336a3135r7403J70622L2882j83336L3962J70755r7179j36831J44426Q1831j73086
$$ -13135 -110538 60084 92966 -90370 -56408 114347 17168 -119663 24763 106594 -66492
347f6492j7799J75886m8260j55239J06974J15793j48872o0792J73410n1j72004
$$ -66492 -84291 91595 43335 -111904 -4930 110863 -38009 -98801 74609 74558 -97446
358i7446O1846J48214j12455j05109J46299M8330j61600J1129J54111p0046j28482
$$ -97446 -35600 112614 159 -104950 41349 89679 -71921 -60792 93319 23273 -105209
369a05209J16800Q5312j47177l2620J57323k2616j44287P4330J14770j13514o9528
$$ -105209 11591 96903 -50274 -82894 74429 51813 -92474 -18144 96626 -16888 -86416
380h6416J40171J6328j46711L9350J33316q8886j04100J24425N9904j45214j0619
$$ -86416 53755 70083 -76628 -37278 96038 7152 -96948 27477 87381 -57833 -68452
391f8452J45345m1437j27370Q7462R3205j22591m5015J42013o072j41029N7435
$$ -68452 76893 35456 -91914 -4452 88753 -33838 -78853 63160 57088 -83941 -26506
402b6506J23064r8591q8666J28309M1396j40407R884J33156o1834j10086J03530
$$ -26506 96558 -2033 -90699 37610 79006 -61401 -51517 81639 19805 -90281 13249
413A3249P0432j31823k4457J42895k5309j35239P2474J10606j07430o9065J28855
$$ 13249 83681 -48142 -72599 70296 44987 -90252 -17778 92828 -14602 -83667 45188
424D5188K0618j31744L2236J18296q0495r0564J17636N0598j40100o242J40451
$$ 45188 65806 -65938 -33702 84594 4099 -86465 31171 81769 -58331 -64573 75878
435G5878m0278j22228P9936Q6849j10665l9887J28503j1115j28468O2292J12402
$$ 75878 35600 -86628 -6692 80157 -30508 -70395 58108 46993 -81475 -19183 93219
446I3219j02483p8904J29790L5125j38973J2940J30443o0840j05356R8915O4025
$$ 93219 -9264 -88168 41622 76747 -62226 -49286 81157 20317 -85039 13876 77901
457G7901j26726j3905J35215l8504j27022Q4794J02990j17570o4122J34109J8533
$$ 77901 -48825 -62730 72485 33981 -93041 -8247 94743 -22827 -86949 47160 65693
468F5693j30572L4425J09388q2770p3599J20708K9712j42080J4184J41663n6972
$$ 65693 -64879 -30454 78934 -3836 -77435 43273 72985 -69095 -54911 86752 29780
479B9780j22118R1525Q1527j15755k9634J25002k4727j18109P5060R7441j12583
$$ 29780 -92338 -813 80714 -35041 -64675 60327 35600 -82509 -7449 89992 -22591
490b2591o1543J36123J7865j40663K9686J27094p2930r5769J02958N0501j19768
$$ -22591 -84134 51989 69854 -70809 -41123 85971 13041 -82728 20230 70731 -49037
501d9037N03J19779n4541j06757J00962Q0510j32432m3677J43089K108j29575
$$ -49037 -48534 71245 16704 -90053 10909 91419 -41013 -84690 58399 60507 -69068
512f9068M3104R9172q4091n4343J16978O048j35828M0303J33137p9754j10206
$$ -69068 -25964 73208 -10883 -65226 51752 57800 -78028 -37725 95412 15658 -94548
523i4548J04585O8640j17796j7901J16863l6284j01795Q3839P4456j16949l4660
$$ -94548 10037 78677 -39119 -57020 59843 23559 -78236 5603 80059 -36890 -71550
534g1550J34169r158j30822N2259J12545q7167q0082J08357L6096j14139J3158
$$ -71550 62619 53461 -77361 -25102 87443 276 -79806 28551 64647 -49492 -36334
545c6334J02459o3980q0496J05828M9371j32262j6609J38784j6194j21899M9261
$$ -36334 66125 2145 -78351 27477 76848 -55414 -72023 66761 50567 -71332 -22071
556b2071Q7036p7069l8001R8640j1859j09124N6288J05168q9166q5719J06432
$$ -22071 64965 -12104 -50105 48535 36676 -72448 -16160 89008 -158 -85877 20555
567B0555M9948j11008o675J01439l9867q0321P8001N0725j03030j3905J13918
$$ 20555 70503 -40505 -47180 54259 14392 -65929 12072 62797 -40233 -54138 59780
578E9780k4566j08442O2318R0838q9649o1673J03524K5485j01615J4529Q3827
$$ 59780 35214 -73228 -10910 79928 -9721 -71394 32130 57615 -44000 -29471 54356
589E4356n5703n7899R0194K7055j15396L326J21174k9741j06942N1385P6167o7074
$$ 54356 -1347 -59246 30948 58003 -57393 -54067 67107 37366 -69576 -18191 57976 -9098
601i098l2255P9151j3167q3088N4416P8763q4582o2785R9801L4804j00835k257
$$ -9098 -41353 37798 24631 -58457 -4041 74722 -9860 -72645 27156 61960 -38875 -41132
613d1132Q9347l3059o9917O2490M2114q2911r594R1807k5365q5887N8294P1203
$$ -41132 48215 15156 -54761 7729 49843 -33068 -42662 49145 23780 -62107 -3813 67390
625F7390q1218m7520R3118J9726r0803J2097P3613m5080m7667P4168J5489r5624
$$ 67390 -13828 -61348 31770 51496 -39307 -27210 46403 1323 -46344 27824 43313 -52311
637e2311J3309J02680l7892r3827N5622P0252o7028l3193P3078q072p0940M6697
$$ -52311 -39002 63678 25786 -68041 -12419 57833 -9195 -42388 30690 22618 -48322 -1625
649a625O3719p5859m6776R1273K3489r4645M514Q4236l4158o5617N8226L8028
$$ -1625 62094 -13765 -60541 30732 54221 -40424 -35910 48326 14168 -51449 6777 44805
661D4805p3585p475P8220k4838p1799N5201N7827p7237l5805Q9429J0237q5876
$$ 44805 -28780 -36255 41965 17127 -54672 529 58356 -18881 -54686 34743 44980 -40896
673d0896J6783P0069m3134m4302O5170J2574q1855J7578Q6322m3976p8888O2534
$$ -40896 -24113 45956 2822 -41480 23690 36264 -45591 -28013 58309 14333 -64555 -2021
685b021N7480p1500k6719P3373q586o6115M3364N3188o9279l2833Q5012P956q7724
$$ -2021 55459 -16041 -42760 30613 22027 -44088 -724 52464 -16815 -49648 35364 43320 -44404
698d4404J8799P7169m4320n7925O2691L0394p3487N4P2640l0721o2225N8014M3777
$$ -44404 -25605 51564 7244 -50681 12010 42404 -31083 -31029 41611 10890 -51335 6679 50456
711E0456p5946j9653Q4315n116p8644K8859O2961m9076l7086O3466N798p0945
$$ 50456 -25490 -45143 39172 34056 -44588 -15729 47232 -1844 -38930 24536 30334 -40611
723d0611K3826O8220m9680n6946O5424L6595p2787r909P0439j8443n8623M5185
$$ -40611 -16785 51435 1755 -55191 10233 46828 -25959 -35868 34571 16128 -42495 2690
735B690M0950o3999j7555P4228o715p2872L0073O1873n0280m2540O2421J7272
$$ 2690 43640 -20359 -37914 36314 29599 -43273 -13200 48673 -1607 -44147 18274 35546
747C5546o6906Q762O0754l3988m7779N4022K8761o6466o328P1000j6220o3307
$$ 35546 -31360 -22598 38156 4168 -43611 10411 39172 -27294 -33622 37378 21158 -42149
759d2149L6559M8108n0933k5525N9005l6n9704K4241N2657m5170l9756N8133K0062
$$ -42149 -5590 42518 -8415 -33940 25065 25029 -34675 -10434 42223 -2947 -42703 15430 35492
772C5492o3778J487N9738k2296m8750M1120L2814n3623j2017O0126q908n7758
$$ 35492 -28286 -26799 32939 10643 -38107 3013 35827 -17796 -29813 30313 21405 -36353
784c6353K9748M7330m5219l1651N4423J1330n7245R150N2307l0237m0609M5868
$$ -36353 -6605 40725 -4494 -36145 18278 29608 -27637 -18487 33820 3583 -37026 8842
796H842K3618n6187l071N7828j6022n1684L4318L9942m7354k1462N4651P52n4917
$$ 8842 32460 -23727 -26798 31030 15008 -36676 -2358 37584 -9770 -31232 23419 24171 -30746
809c0746K0557M6992l8545l3948N0547J5317n6539L905N4268k3528m5177M0150
$$ -30746 -10189 36803 -1742 -35690 14857 30174 -26365 -22460 31808 8280 -36897 3253
821C253K9641n0614j0201N5456j0184n0723K9245M1209m3597k5643N2649O168
$$ 3253 32894 -17720 -27921 27535 17351 -33372 -4127 37082 -6515 -32158 20491 26659
833B6659n4980J3383M9059l1620l7610M4501K0575n2500j621N3071j7782m5703
$$ 26659 -28321 -14938 34121 2501 -35109 9392 29967 -22533 -24154 28917 11135 -34568
845c4568L5138L2882m6621j4657N2169l980n0266K2747M1861l8157k8112M7683
$$ -34568 570 33452 -13169 -27826 24343 20363 -29903 -7156 34705 -3452 -31564 16119
857A6119R167n1156R861M6957k8217l7081M1397K2186m8651m516N0414j2999m4946
$$ 16119 25286 -25870 -16009 30948 2731 -34350 7047 29233 -19418 -23934 26480 13481 -31465
870c1465L0822L3194m2321j7231M8595l81m8324J7956M1120l3327k9911M3453
$$ -31465 -643 32551 -9770 -27001 21594 21213 -27111 -9155 31965 -1362 -31273 12180
882A2180J3520m7977L505M5503k0079l7124L3281K4712m1678q408M5460p901m2468
$$ 12180 25700 -22277 -18772 26731 6652 -30472 2809 27521 -14157 -22565 22895 14994 -27474
895b7474K3686L4275l5537k1284M2428N233m4189J0779L9166k5740l0035L6593
$$ -27474 -3788 30487 -5050 -26334 16094 21327 -22862 -12083 27083 1343 -28692 7901
907G901J6555m3442n40M3619j4884l7372K8016K7638l6884j3190M2100k335m1483
$$ 7901 24456 -18986 -19526 24093 9209 -28163 -147 27491 -9393 -22583 19517 17182 -24301
920b4301J8065L4842l1489k3518L9790Q861m3519N975M0543k0570l3167L2242
$$ -24301 -6236 28606 -2883 -26401 13389 22250 -21269 -15294 25249 4679 -28488 3754
932C754K1458l9427o289M1688r383l7173K3622K9410l3961j7224M0320K620m0970
$$ 3754 25212 -14215 -20504 21184 11801 -25372 -1750 27660 -6301 -23525 16795 19415 -21555
945b1555J1522L5824k5319k6131L4340J2477l9498K103L8763j6172l3031K8872
$$ -21555 -10033 25791 472 -25659 8681 21158 -18340 -16237 22526 6354 -26677 2195
957B195K2698l6410r508M0603m910l7685J9210K9662k9837j8538L6695M182l9562
$$ 2195 24893 -11517 -21025 19578 14668 -23017 -3807 25855 -3982 -22520 14175 18357 -21205
970b1205R972L6215k3727k7952L3082J5834l7796k176L7858j1424l2409K4444
$$ -21205 -11233 24982 1255 -26697 6385 22219 -15577 -17753 20105 8681 -23728 716
982G16K3121l2866j0466L7641l266l6703J5697L0779k6440k0767L2694P699l5344
$$ 716 23837 -9029 -19495 18146 14880 -21823 -6126 24653 -1787 -22554 10140 17839 -17505
995a7505N534L2226j8538k5187K8523J5597l4396l245L6063q220l2049J9195K4410
$$ -17505 -11971 20255 1717 -23470 5053 20650 -13746 -16991 19072 10852 -21197 -2002 22408
1008B2408k7387j2778L1362R3l1956J2140K7533k2854k0486K9764J0578l3809
$$ 22408 -4979 -17757 13605 13698 -18258 -6118 21415 -1439 -21925 7839 18417 -15392
1020a5392J165L2365j2291k6378K2026J7315k8128n841L1492n828k9658J6206
$$ -15392 -14227 18138 5847 -20531 1495 18810 -9318 -15159 16333 10505 -19153 -2947
1032b947K5046k4820j7123K9559O057l0285M479K7040j5938k0033K4410J0822
$$ -2947 22099 -2721 -19844 9715 15772 -14513 -10034 17006 1068 -18965 5445 16267
1044A6267k9675n16L1099q779k8059J8107K1174k3696j1680K7317K67k7021J0615
$$ 16267 -13408 -13924 17175 8396 -19663 -1556 19618 -4078 -15758 11559 11826 -15195 -4580
1057d580K3510k0873j6782K6968P518l0087J639K9100j0903k4076J8907J6367
$$ -4580 18930 -1943 -18725 8243 15761 -14326 -12687 16413 5510 -18566 341 16708
1069A6708k4648n199K6976n422k5600J5999K1433k3553j4880K7943N875k8867
$$ 16708 -7940 -13139 13837 8415 -17185 -1186 20247 -3306 -18186 9757 15632 -13235
1081a3235M076K4680j3930j8081K1542Q786k6569O01K8387r779k5487J8133J9634
$$ -13235 -9159 15521 1591 -16490 5052 13838 -12731 -12130 16257 6478 -19009 -876 18758
1094A8758k3268j0599K6116l4k5023J0433K0587j9053j4106K4766N533k8529M231
$$ 18758 -4510 -15109 11007 10973 -14050 -3617 16970 -2083 -16189 8577 14110 -14419 -10188
1107a0188K6697j2620k2248J9078J4438k2749m240K4159o297k1276J5646J7219
$$ -10188 16509 3889 -18359 719 15157 -7592 -11832 12327 6030 -15246 400 17619
1119A7619k2892j0803K7240K750k6999N139K2845j3295j5902J8715P351k3233
$$ 17619 -5273 -16076 11164 13914 -13085 -7946 14899 1604 -14298 4417 11768 -11465
1131a1465K344K3855j1036k1117J7848J5728k1590p756K3760r81k1884R607J7479
$$ -11465 -9121 14734 3698 -17419 429 16157 -5433 -13189 10571 9590 -12294 -2687 14792
1144A4792j7213j0694K2047K007k4199N963K2602j3245j8610J8353J2044k1191
$$ 14792 -2421 -13115 8932 10939 -13260 -7297 15305 2060 -16550 1803 13847 -7344
1156g344l485K1442n628j8102J4224J3258k0226o999K4076j08k3723O512K0803
$$ -7344 -10829 10613 4985 -13117 1107 14365 -5861 -12860 11216 11108 -12615 -6103 14700
1169A4700j3374j4332J7616N374j9973K563K0020j0518j7476J6998J2243k0120
$$ 14700 1326 -13006 4610 9984 -9989 -7426 12594 2076 -15400 1598 13841 -6279
1181f279n733K1950j844j9702R190J5643j5341q698J8647J168k0167O168J8828
$$ -6279 -12012 9938 8094 -11608 -2418 13225 -2116 -10814 7833 9001 -11166 -4998 13830
1194A3830j2963j5562J7776R015j9719k136J9294n458j5587J2563J0218j7000
$$ 13830 867 -14695 3081 12096 -7623 -9759 9535 4077 -11510 1053 11271 -5729
1206e729m616K0651j421k1056Q138J7226j2751j2030J6015M945j8032K895J6557
$$ -5729 -10345 10306 8885 -12171 -4033 13193 442 -11588 4427 9372 -8660 -5765 10792
1219A0792r912j3923J5622R052j8853k836J9435l200j6880Q894J3314j3570p396
$$ 10792 880 -13043 2579 11631 -7222 -10058 9377 6177 -10703 -1809 11505 -2065 -9461
1232i461J6180J103j7051N558J5472j1915j2132J5972O651j7606j257J7360n182
$$ -9461 6719 7822 -9229 -3671 11801 -114 -12246 3726 10377 -7229 -8486 8874 3692
1245C692j4580J1080R949j5012l575J7020j903j6924P710J4671j2154j0297J5045
$$ 3692 -10888 192 10141 -4871 -8446 8574 6671 -10253 -2543 12128 -26 -10323 4722
1258D722L929j6231K286J4563q187j1767J2914P172j5701k463J7392l294j5750
$$ 4722 8651 -7580 -5294 9269 1082 -10685 2229 9401 -6300 -8763 8629 5335 -10415
1271a0415Q697J2490j2717o978J4989J140j5067M920J3301j0010j0649J3869N579
$$ -10415 -1718 10772 -1945 -8923 6066 7206 -7861 -2941 10360 350 -10299 3570 9149
1284I149j5970n85J5539m899j3279R813R315j3052m277J5671j864j4974P262J2840
$$ 9149 -6821 -7406 8133 3234 -10045 -232 9083 -3969 -8246 7425 5561 -9413 -2151 10689
1298A0689j1682q649J4116M002j5065J308J4015p173j1366J1685O905j4623j668
$$ 10689 -993 -9642 4474 8476 -6589 -5281 8734 1561 -9805 1880 8785 -5838 -7506
1311g506J5355l819j3832Q606J1220j2136o497J4573P36j4448M867J2784r750
$$ -7506 7849 4030 -9802 -1196 10024 -2112 -8609 5964 6700 -7748 -2881 9903 153
1324A53r504J3139M565j4947K32J4572n898j2250J0318Q289j3082l266J4384j834
$$ 153 -9351 3788 8353 -6594 -6362 8210 2312 -9938 380 8669 -4413 -7679 6705 4871
1338D871j3624P558J0699j0976p113J4020J969j4488L064J2971p955j0152J1223
$$ 4871 -8753 -1195 9504 -1472 -8585 5435 7404 -7084 -4020 8951 996 -9156 2067
1351B067N645j3377q81J3648m201j1795Q875Q217j1653l929J3365n04j2996N204
$$ 2067 7712 -5665 -6546 7102 2901 -8894 -19 8198 -3455 -7384 5981 5477 -7519 -2315
1365b315J1313r206p857J1811L194j2920J725J1993o416j0056J0033O267j2132
$$ -2315 8998 -208 -8065 3746 6940 -5980 -4255 7738 1322 -8734 1299 7566 -4566
1378d566k003J2427k278j1211O491R092r923m824J1639R70j2176L626J0756q034
$$ -4566 -6569 5858 3580 -7631 -1140 7952 -1971 -6795 4844 5814 -6362 -2736 8020 -14
1392a4p902J0224M718j2131l58J2152m788j0052Q034P009j0215k993J1441n81
$$ -14 -7916 2308 7026 -5105 -5463 6689 1901 -8151 -117 6892 -3323 -6316 5125 4544
1406D544j1363N291R461q261o318J0185K378j1045J419J0584n601q470Q380N116
$$ 4544 -6819 -1528 7933 -328 -6646 3539 5917 -5128 -3709 6875 1274 -7196 1184 6300
1420F300j0324j966J1497k182j0472O315P690q453m269R914R16j0380L459R005
$$ 6300 -4024 -5990 5507 3325 -7147 -832 6858 -1595 -5864 4050 4966 -5414 -1955 7050
1434G050o938o922R584L183j0610J52J0183l579q960O854O342r367k782J0504
$$ 7050 112 -6810 2774 5957 -4653 -4501 5682 2103 -6857 -3 6339 -3028 -5810 4694
1448D694n97j0206M322Q805p830n395R467K373j0274J240R557m797p841P462M701
$$ 4694 4097 -6109 -1787 7018 -812 -6207 3260 5633 -4641 -3401 6156 1359 -6482 980 5681
1463E681r489j350J0160k363r159N340P460p689m503R384J031r336K662Q623o014
$$ 5681 -3808 -5158 5002 2639 -6520 -1180 6280 -1409 -5912 3472 4503 -4833 -2171 6452 438
1478D38n995P988L172r494l8R330l508q456O600N841q551k594R390j080q809M191
$$ 438 -5557 2431 5603 -3891 -3929 5401 1893 -6563 37 5878 -2673 -5267 4123 3043 -5766 -1575
1494a575P640o781n093R245J770r706J703Q763m769p068O958M211q579j180R129
$$ -1575 6065 -716 -5809 3436 5206 -4500 -2797 5966 1197 -5871 1087 5298 -3281 -4461 4668
1509D668k535q475N806O142p770l352R020J58q541K868P630n262n866Q126K350
$$ 4668 2133 -6342 -536 5606 -2164 -5516 3504 3662 -4879 -2011 5619 357 -5509 2617 4967
1524D967q676P27Q243m046p062O226M906q105j857Q621j189p749M012O042o254
$$ 4967 -3709 -2982 5261 1215 -5847 379 5285 -2820 -4677 3944 2755 -4994 -982 5060 -1194
1539a194l466Q061Q05q780K551Q028n175o402O990L687q374o12Q066k610o808
$$ -1194 -4660 3401 4206 -4574 -2023 6005 830 -5572 1418 5105 -3269 -3881 4185 1575 -5233
1554e233N030N232p598j983Q140k26q301L289P078n367m684O674K206p457Q14
$$ -5233 -203 5029 -2569 -4552 3588 3362 -4939 -1650 5428 61 -4623 2051 4257 -3200 -2386
1569b386P318l842o446O404L742p387j901Q024j124o970L242N788n493l303P250
$$ -2386 4932 1090 -5356 1048 4790 -2597 -4498 3526 2402 -4568 -1326 4462 -1031 -4334 2916
1584B916K64p505K769O961n044n338O462L213p195p78O940k409n773M637L622
$$ 2916 3180 -4325 -1556 5405 361 -4977 1485 4698 -2497 -3275 3665 1256 -4517 120 3742
1599C742o011j930P692p09p610K990O733n029m395O320J671o060Q26O197l803
$$ 3742 -2269 -4199 3493 2784 -4826 -1836 4897 -132 -4527 1793 3464 -2596 -1770 4427 624
1614F24m993N362L461p225j156P552j311o941L276N183m952k552O120M13o777
$$ 624 -4369 993 4454 -2771 -3927 3625 2314 -4627 -1351 3832 -1120 -3672 2448 2861 -3916
1629c916K407O104m577m633O363K622o802n61O478j717n502L534L859n597j473
$$ -3916 -1509 4595 18 -4615 1748 4370 -2432 -2993 3485 1768 -3734 -200 3659 -1938 -3411
1644c411O380p13o382L104N645m677m200N641K428o163L93N427k746m311M976
$$ -3411 2969 2256 -4126 -1022 4623 -54 -4254 1387 3815 -2348 -1955 3472 726 -3585 1391
1659A391K083n984o57O520j071o509L064N041m355l070N408M43n399J817N553
$$ 1391 3474 -2510 -3167 3353 2282 -4227 -1163 3878 -477 -3547 1861 2304 -3095 -1278 4275
1674D275m643l896N976K367o423o25O410j488n260K920L988n019j339N611j130
$$ 4275 -368 -4264 1712 4079 -2344 -2969 3441 1953 -3307 -387 3601 -1418 -2757 2854 1724
1689A724o064L217N220m373l751N613J915n641J20N519k659m000M338K273n497
$$ 1724 -4340 -1123 4097 -276 -4027 1586 3501 -2140 -2020 3499 840 -3160 1178 3451 -2046
1704b046n13N940j565n630L068M259m539k887N711K41n016J770M343k953l829
$$ -2046 -2559 3381 1816 -3814 -746 3513 -1026 -3913 1798 2039 -2977 -1207 3136 183 -3646
1719c646N402J560n889O8N769j787m696L295L157m647j263N162j006n082L039
$$ -3646 1756 3316 -2573 -2505 3264 1477 -3219 76 3233 -1414 -2677 2485 1479 -3603 -564
1734e64M335m443l173N546J330n449O15M859k334l842M128K134n096n8N095j814
$$ -564 3771 -672 -3845 1701 3031 -2418 -1803 3056 722 -3120 1008 3142 -1954 -2012 3083 1269
1750A269m763L368L548m443k349N147K13m776J465M338l540k645M670J194m968
$$ 1269 -3494 -126 3422 -1021 -3370 1777 1990 -2786 -1321 3017 -523 -3168 1502 2696 -2272
1765b272M38N109k159m309L417K804m271j091M257o87m383K319L660l818k159
$$ -2272 -1834 3275 1116 -3193 224 3028 -1243 -2334 1923 1236 -3147 -828 2832 -986 -3145
1780c145M755P64n122J230M312k462k997L570J590l940k69M223j317m183L145
$$ -3145 1610 2374 -2748 -1518 2794 332 -2665 905 2495 -1445 -1714 2509 1192 -2991 154
1795A54L330m446j844M398J85m289J421L515k766k512M399O89m321O33M386k074
$$ 154 3484 -962 -2806 1592 1777 -2512 -1091 2424 -342 -2854 1545 2234 -2087 -1454 2932 858
1811H58l745L402K369l840r31L909o88m182K190L273l359k123M434K41m218Q91
$$ 858 -2887 515 2884 -956 -1887 2022 1334 -2848 -658 2615 -744 -2867 1567 1808 -2410 -1519
1827a519M183k097l266L322K042m169n0L982j369l583K501K867l555j733M072
$$ -1519 2664 567 -2699 623 2665 -1504 -1554 2428 1059 -2524 -23 2844 -711 -2444 1628
1842A628j67m018J360L621k715k406L674Q38l586K71L993k241k961L022K403l816
$$ 1628 1461 -2557 -1197 2424 -291 -2697 977 1815 -1771 -1500 2493 252 -2709 313 2716 -1100
1858a100r39L999n78l563J832K821l022k058L724L65l806J457L417k629k474L442
$$ -1100 -2039 1960 1382 -2181 -349 2472 -550 -2608 1116 1481 -2325 -868 2549 -80 -2554 888
1874H88J305l522q6L693j312l077K344K413l747j241L996m70l623J756K974k631
$$ 888 2193 -1329 -1415 2278 966 -2111 233 2646 -1101 -2342 1654 1184 -2439 -683 2291 -340
1890c40k265L469R74l601M12L531j731k385K649J632l654k02L573q98l423K025
$$ -340 -2605 864 1838 -1763 -1351 2180 449 -1936 713 2345 -1309 -1511 2062 1164 -2259 -234
1906b34K377k837j373L018L92l536J360L162k401k304L029J308l337J93L343j021
$$ -234 2143 -694 -2067 951 1343 -2193 -833 2329 -72 -2376 653 1961 -1376 -1183 2160 1139
1922A139l040K239J728k903o92L224l08l568J709K480k817j640L303R98l730M99
$$ 1139 -1901 338 2066 -837 -1529 1695 1387 -2181 -472 2008 -809 -2449 854 1852 -1878 -1379
1938a379L368j475k540K391J722l236j06L238q88k990J769K178k517j672L034
$$ -1379 1989 514 -2026 365 2087 -1149 -1255 1983 1095 -1895 -126 2052 -465 -2137 897
1953H97N24k934P60K631k011j719K595Q29k990j13L345j088k760K070K086k629
$$ 897 1421 -1513 -753 1878 -133 -1852 743 1572 -1418 -1531 1814 726 -2034 36 2122 -507
1969e07j112K850j11k824J427K169k183j860K998P04k969r7L310j465k606K748
$$ -507 -1619 1231 1120 -1704 -277 1892 -291 -2151 847 1551 -1418 -1515 1795 330 -2276 472
1985D72J417l164K37K536o27k583J529K133k384j215K790j00k642N62K647j635
$$ 472 1889 -1275 -1038 1498 871 -1712 -183 1950 -434 -1649 1141 1041 -1601 -1039 1608 -27
2001b7j697K550N93k929L49K828j225k414K328J551k442j007K880k16k573J326
$$ -27 -1724 826 1419 -1510 -1161 1667 442 -1972 356 1907 -535 -1542 1338 1122 -1451 -125
2017a25J835k093j154K367L37k846R10K509j888j699K388J305k740k00K523q20
$$ -125 1710 -383 -1537 830 1167 -1679 -769 1740 -148 -1847 541 1846 -894 -1094 1429 609
2033F09k150J608J732k507q39K763k61k025N36K187j777j653K125Q40k646O45
$$ 609 -1541 67 1799 -708 -1547 1216 955 -1070 -534 1653 -124 -1777 348 1188 -1458 -813
2049h13K234j019k120K297J095k343r87K981k90k363R19J839j706j110K171r5
$$ -813 1421 402 -1718 579 1674 -669 -1656 1325 1035 -1328 -409 1430 -276 -1386 785 690
2065F90k143Q13K035j300j955K120J057k255j29K432l54k278J523J156j841n31
$$ 690 -1453 -640 1395 95 -1860 260 1317 -938 -1067 1365 1011 -1267 256 1412 -429 -960
2081i60J986J51k702J161K186k084j354J782J061k212r0K219q60j768J674J260
$$ -960 1026 1177 -1525 -364 1822 -262 -1616 166 1227 -985 -1075 1144 284 -1484 190 1450
2097A450k010o03K306j23k161P34J934j603j107J749J61j858M88J940j436j238
$$ 1450 -560 -1163 1143 1020 -1141 -407 1527 -76 -1183 566 727 -1131 -643 1297 -139 -1377
2113a377J755J007k196n13K352k80k104J146J426j433n87J902k85k089R23J775
$$ -1377 378 1385 -811 -1324 1028 748 -1356 -210 1216 -217 -804 1098 813 -1276 -353 1422
2129A422j312j480J732N81j580r8J659n09j679J452Q46j753j60J889l23k028J079
$$ 1422 110 -1370 362 943 -637 -735 924 415 -1264 188 1034 -719 -879 1010 687 -1341 -262
2146b62J958j615j155K063k16j679N63J436j134j554K348K43j575p11K287o37
$$ -262 1696 81 -1074 989 773 -906 -343 1093 -41 -1595 753 996 -579 -1290 997 360
2162C60j502R09J305j100n77J071L51j848J014J314j567j139J927O17j749k01
$$ 360 -1142 -233 1072 -28 -605 466 817 -1031 -17 1297 -270 -1409 518 1135 -614 -815
2178h15J688q27j256J387R46j579l47K027n03j651O23J387j048j100J709M06j881
$$ -815 873 46 -1210 177 1123 -456 -803 1224 721 -930 -307 1080 32 -1068 641 1047 -834
2195h34L82J488j111j034J683K99j656l1J623k27j776J110J090j111p53J664k06
$$ -834 -452 1036 -75 -1109 574 873 -783 -814 809 582 -1194 -84 1006 -105 -858 806 600
2212F00j486R77J113j429j159J982O48j949l3J455k88j607J357M65j508O9J493
$$ 600 -886 91 1204 -225 -1384 598 1246 -703 -736 719 431 -1176 181 646 -862 -793 700
2229G00j28j579R86J256j077j278J485M84j666O96J166r50j233J499J10j317K33
$$ 700 572 -1007 -21 1235 158 -1120 365 849 -817 -121 1045 95 -1138 361 471 -846 -613
2246f13J436o60j297O63J293q42p78J418k95p47N28J031j274o81J434L03j347
$$ -613 823 163 -1134 -471 822 -20 -798 620 325 -422 106 1137 -137 -818 616 919 -428
2263d28j39J264j24j306N07Q66j028m31J580m45j204Q45R38r58q33J316N04j671
$$ -428 -567 697 573 -733 -226 640 -388 -819 761 316 -888 -43 895 -63 -896 420 924 -747
2281g47L97J201m70j036R46M60j589M37J559p93j279P21Q96p04r26J578j38r65
$$ -747 -350 851 381 -655 291 751 -838 -401 1158 365 -914 -193 703 -1 -927 651 513 -452
2299d52K17J137q47q95J082P83j688J17J263l23j285J000L64j035j57J294mj562
$$ -452 -235 902 55 -840 242 1025 -663 -546 717 394 -891 109 473 -562 -719 575 571 -991
2317i91P96J439j340o93J565R1j636L81J191n06j214J085N69j399l3J281n62j237
$$ -991 -195 1244 -96 -789 776 867 -769 -388 803 297 -917 168 737 -662 -695 586 24 -1213
2335a213R89J443j416q25J583n0j266L71J152r53m08J169K80j461J38J243m27
$$ -1213 -224 1219 -197 -1022 561 511 -755 -384 768 -185 -593 576 856 -605 -467 776 349
2352C49j446R01R03j244l47J247l1q80M85P16q07p03J437K34j453L45J241p99
$$ 349 -1097 -196 707 -537 -884 363 332 -548 -63 653 -154 -857 580 814 -639 -294 947 148
2370A48q61N59P05j124J14Q72q8j179Q36J163j330m73J295j99j233N11J103p76
$$ 148 -713 -154 551 -573 -459 413 325 -854 -18 1145 -185 -658 637 438 -795 -284 819 43
2388D3q62J256K28j223K2J143n15r87J033M55r28j49R31J10j204L61J309r10p21
$$ 43 -819 437 665 -558 -536 607 92 -895 138 593 -335 -484 447 557 -647 -286 1023 113 -608
2407f08J028j17q07L63J161j174m19R25L19j043j88J154l56r51M47R24j052m60
$$ -608 420 303 -504 -141 1020 -154 -573 352 671 -372 -560 594 238 -713 -266 658 -394 -854
2425h54J276p3j384O54J147p88o75O82P77p44p7Q19p95n21O90M44r85m01J445
$$ -854 422 349 -1035 -381 766 -22 -697 -15 762 18 -59 760 -35 -556 134 578 -407 -808 637
2444F37j59j209N85P98o86n81J154k70q01K54J039n74q85R29M93j156j98J083
$$ 637 478 -731 -146 652 -34 -615 539 269 -532 -278 761 187 -698 231 724 -432 -630 453
2462D53J95j493O79O49r04j59Q67P5j073M62J166p69r05J002M20o81j36P28l37
$$ 453 648 -845 -166 483 -421 -580 287 362 -711 -249 917 148 -757 245 665 -16 -152 576 239
2481B39r41O95N52p31l89J121l59j066N57P63k77p90J029m4p88J89R09n68p16
$$ 239 -702 -7 545 -186 -575 546 187 -879 -322 441 164 -626 403 359 -429 -240 669 101 -615
2500f15O94N71j008k13J426n96q99N45Q85r57k51Q10k79p53N25Q83r89k69Q52
$$ -615 79 650 -358 -571 855 259 -640 -95 790 -167 -418 392 113 -640 -115 768 -221 -490 362
2519C62lo37m0J145n13j050Q82M86j079k22J242o2j062K59P28n33n64Q71J56j018
$$ 362 359 -278 -318 827 314 -736 146 632 -447 -669 573 511 -551 -292 436 -97 -661 210 366 -652
2539f52L29P77m90m37P30K82o68r8Q79k58j305P21J082j035k35M34j6o40N37P12
$$ -652 -323 454 -36 -473 257 539 -129 -227 652 394 -911 -190 892 -143 -378 56 40 -600 -63 649
2559F49j098j09O93K69r21L50O98j00j081Q62O19j167k7P28j06j001O90N35n93
$$ 649 -449 -558 135 404 -517 -167 531 431 -650 212 831 -336 -363 365 259 -742 -52 483 -110
2578a10o13R75M8p75J76R07o00m14N82M53j126J67Q25k63o90J87Q91r42l76J003
$$ -110 -723 252 300 -475 -299 608 8 -406 176 629 -497 -330 495 232 -458 -271 620 -322 -698 305
2598C05K21j276N61N02l01o98Q34O68j281m8J021k59j030O62Q49j142j16P60k61
$$ 305 526 -750 -189 313 12 -686 148 816 -465 -513 508 249 -781 -119 730 -412 -528 232 -29
2617b9n01K52Q81j063j76J008j33p94J75Q47k69p43P83L59r47j00R74m36l06M68
$$ -29 -530 -278 603 -460 -636 372 239 -555 -380 467 198 -545 238 597 -350 -450 524 88 -218 250
2637B50L56r61j32J125l80r01L83Q74m20q38Q21P8q48M18Q72l95n95L05M03n92
$$ 250 606 -355 -487 638 258 -643 -260 614 194 -644 177 255 -593 -175 697 302 -293 12 415 -177
2657a77l71R09j17p67K77Q81o79l40R35j51j189L18R03n09m80O90N09r24K0N45
$$ -177 -548 361 244 -523 -246 635 -44 -384 551 400 -789 -471 432 -77 -557 133 642 -282 -262 283
2677B83j26m73O76J30o26l13J187m97o57K05N24l77o83Q86M3o45j71J361o05j171
$$ 283 157 -316 360 490 -136 -449 738 241 -416 -211 313 -64 -747 139 182 -463 -634 727 122 -1049
2697a049J182M09q42J94L38J38q92M25P92q28m43R33r9p71N15M58n01n98R61K62
$$ -1049 133 542 -300 -106 232 370 -522 -97 695 -133 -576 357 258 -513 2 460 -41 -639 322 584
2717E84p06j0O65l49p51R98K73q75q7Q94j05q51N2O36l69o28O47K23n18m6O12
$$ 584 -122 -132 533 184 -567 431 704 -171 -258 636 531 -320 -268 368 -1 -629 18 241 -277 -323 289
2738B89j59q05Q57N13j126J14P98k20m00J84M30n78RK82On94M37M45n76j70N17
$$ 289 130 -675 182 695 -431 -317 481 261 -139 45 475 -103 -94 188 194 -400 37 482 -94 -264 253
2759B53J16p13j44R60j39p88N28j6m24k6J077o04p23O61P13q56j42M68j1q70M22
$$ 253 369 -344 -488 472 333 -455 73 57 -367 -393 684 80 -643 18 731 -125 -267 201 190 -680 -258
2780b58P13l72p03O83L66m67k46P00l52m77O35J36n27j36P36P0r07N14K32l25
$$ -258 455 83 -620 63 429 -38 -284 416 64 -413 222 358 -169 -305 431 501 -406 108 340 15
2800A5l72N13J62o35P1P88o24l48N99L37o63j71R43q1q39M07O07r40l41Q15j08
$$ 15 -357 156 318 -317 -246 542 -82 -430 169 506 -157 -328 615 534 -305 102 709 -231 -572 243 135
2821A35n65L22J29j32m66N32L70k28k90N10q0p21P10K85n79m28J231m07q36M35
$$ 135 -430 -108 21 -111 -577 -45 325 97 -193 317 237 -484 226 511 -68 -496 735 328 -508 -73
2841g3M51m95M2K84j6m80j85J119n86j34n6N40n23M1K76J60p51N23K62o32j02
$$ -73 378 -117 -75 209 193 -287 -472 647 61 -73 -129 411 -112 -71 205 365 -386 137 399 -233 -335
2862c35O65R3p38J91O73q05l68Q30K67p63M1M60k04m23L75Q29j088J81K95j1n10
$$ -335 330 423 -315 -124 549 -256 -624 206 473 -290 -249 211 7 -416 -41 788 -300 -119 176 165 -345
2883c45L96K67l82o50J165l97l21K69N53n56l65L92K69o01J14J97l5k37K71M96
$$ -345 51 318 -64 -714 451 54 -267 2 555 -1 -366 26 295 -306 -192 5 -30 -267 4 500
2903E00m22j12K83J99q72J13J038j042J85K44K18o74o5O71Qp70M32M54m54l26
$$ 500 78 -34 249 448 -424 -311 727 -315 -130 114 332 -342 -407 264 272 -498 -66 388 -66 -392
2923c92Q61k98n42L96L76l19l44M88K94p54K44L00l11l80L93M61o12k02R12l52
$$ -392 469 171 -371 25 401 82 -262 226 520 -234 10 310 -1 -381 12 473 -139 -341 571 219
2943B19l15L09N8j99n17Q47j89l80R6L32l84j33L10L92q72L21L19j00m13L22L77
$$ 219 -96 213 271 72 -445 402 213 -167 -71 261 -123 -256 54 446 -426 -105 214 114 -299 23 400
2964D00p66K79M98l22n36K09O86n29l52L43L68k98j18M82k43m74O23l62o0k85
$$ 400 -366 -87 411 89 -447 -238 448 -81 -433 -90 278 -20 -138 344 101 -373 250 -112 -172 -457
2984d57P50m33j14R0M36k20k05N29j30n13K28O15p85q5L98N3m43J43L03k9p00
$$ -457 293 -140 -254 -164 272 52 -153 376 246 -267 -39 576 -209 -294 104 157 -286 -143 160 131 -569
3005e69M30K46k40j86M67q7k99K52N21p00p9M18k86K6j40L19o2m32N70j24m88
$$ -569 -139 107 -133 -319 148 61 -238 14 535 -165 -244 174 -112 -86 -226 93 31 -401 169 45 -443
3026d43J56L11o8m03K43O24o37k18O49m7k89J09M20n11k09O59k15j23l22N91k07
$$ -443 -287 24 -44 -447 -204 420 -217 -435 214 167 -122 -13 407 -104 -313 346 131 8 -314 277 70
3047G0l69K94K1k16J0K25O4l84q7P48n38J76J65K41n50K36K36n83k16M52op0k43
$$ 70 -299 -5 16 -200 -190 35 99 -285 -372 376 -162 14 179 420 -130 106 342 -241 -457 -5 -11 -81 -324
3070c24N12k69m24N32J90j45l51M75J15m44Q3M26l65j77N38k86m58K03M47M7p66
$$ -324 188 -81 -505 27 217 72 -279 196 311 -133 -50 376 11 -166 372 86 -372 -169 278 325 -441
3091d41M95K90n38OK36j49j98L92L61l52m63P72j42l87j14O61n05l34N25j02k24
$$ -441 54 344 -194 -188 48 -101 -299 93 454 102 -361 411 269 -118 -232 429 -76 -410 115 13 -211
3112b11R6J57l8j75L20l3l08K36K56j0n30N31O5l68j08L39M3m35K33N5j05j85
$$ -211 -115 42 4 -171 149 116 -192 44 300 290 -240 291 356 -12 -120 219 262 -173 60 115 10 -175
3134a75J41L33k22j09L20j4p99L50M74j85n08O82l47k15L13J70l11m3J22J45r1
$$ -175 -34 299 77 -32 288 274 -525 -175 299 114 -394 288 -59 -274 39 209 -102 -145 -23 122 31
3155C1l45O51p02J28M33o0m98L17K69k88P9J39L91m71m31P67l39l51K23J71N6
$$ 31 -314 337 -365 -237 196 136 -362 -45 224 -64 15 154 545 74 -357 410 71 -280 -57 114 170
3176A70k01L1M76n14j10K94j77q7J38K02k77K7L91m88j01J22L66l49J39J80j5
$$ 170 -31 0 476 -38 -148 146 -31 -118 20 222 -55 -28 363 -125 -226 -104 262 -87 52 232 217
3197B17k37L39j12m34j12M22K10m02L7K92p1l82K27m3r3o2N40k80n6j27L34k03
$$ 217 -20 319 207 -227 -339 83 293 -109 -72 220 149 -233 -6 -49 -142 -204 336 56 0 -127 207 4
3219Dl14L95P3k94n4K18q4j32k3J75J67j4J31j62l91J45K04r8K3K00j28k55N7
$$ 4 -310 85 158 -136 -190 28 -56 -188 -211 -36 131 117 248 86 -305 -160 44 -54 -31 169 41 -214 -157
3242a57L81m5o17M60J74m12l9L40k83K2K79J1k33N0R9K88m57K5K09O4k71L59K14
$$ -157 224 179 -438 22 196 -216 -255 85 -198 -176 103 114 -119 -69 30 318 -139 -114 95 159 -112 247 461
3265D61p25J65%J98j2L0K16m97j46M31k45%J80r0j52k10N45o4j65p1K51k27J2
$$ 461 -264 -99 -99 99 87 117 333 -164 -310 121 -124 -124 56 -34 -186 -396 149 85 -80 -151 100 -127 -115
3288a15q7K97k32K5K02j96k67L43J50l08PJ94J52k02kK58k09n14M44k6p1p5L66
$$ -115 -202 95 -137 -112 90 -106 -373 -30 120 -188 -181 13 165 -37 -39 219 10 -504 -60 -86 -157 -232 134
3311A34k16k06N20k19J14l80L12q4j96L78r0j44j7J18jk5k9N30m88r5J79J05k23
$$ 134 -82 -288 232 13 127 -253 59 -25 -221 157 67 -77 -94 24 23 -2 -31 499 11 -84 95 200 -23
3334b3k85K38J40k28J02J93m36J87Q0J08k94N1M58k9l83J39J68j39j8j93%j53
$$ -23 -308 -70 70 -158 -56 137 -299 -112 -32 76 -218 -167 291 262 -121 18 186 47 29 -164 -164 -317
3356c17J54M5OLJ78K7j97q3O5K43l09K28R0k43r3L23J26k76P0J14l99J03M67m52
$$ -317 -163 -118 -112 -109 69 96 -101 -184 -119 124 -185 43 133 -110 -203 120 246 -30 40 154 -245 -142 325 -127
3380a27L4K02j21J01l20K90J03j9j58n5K95m00J29R7J11k91L19n48K61j71O27
$$ -127 -93 109 -12 89 -231 59 162 143 -15 -70 225 -175 -46 51 162 -129 190 -358 -97 -268 359
3401C59l78m8J29Q7j61qL52n40M00j19P1j15k40J22Q6J2K37l36P5J21N2l79j13
$$ 359 -19 -67 62 149 -12 -20 332 -208 192 73 144 29 -211 -89 -3 9 246 -90 -15 106 158 -221 -334
3424c34J94K93k63L8K7K36m77K1J28N5pL83o4l07N3K10p0k93K53k22J22M3j80
$$ -334 -140 153 -110 -72 -45 191 -286 -265 -137 -82 -89 294 230 -77 -24 186 116 -177 76 -146 -24 19 -161
3447a61J13j70R6Q7O6kK41l41Q6j2J0J01r4j40J99M1m49L18J67k08J90N4k98J42
$$ -161 -48 -218 -122 -35 31 29 270 -71 15 3 13 114 20 -120 79 120 -329 -11 156 -52 138 192 -106 36
3471C6K22l13o3J73j81K26l02J98K85l60K25J92n31K57r2K88j79q6J30K2j65j
$$ 36 258 -55 -118 55 -126 100 -202 -4 281 -79 146 338 -193 64 -28 260 81 -5 125 147 -18 -19
3493a9K95l26j52N2K09j11L09l67M01n33K31J78k21L1j6J36r0rM5j47j69L80P
$$ -19 276 -50 -202 -150 59 -52 257 -110 291 -242 -11 167 -54 -23 -39 97 7 -2 43 -104 -273 107 114
3516A14k06K02j61p7J80l7J03m3j03K5J96l74K14J91j71q7p0j31K85l42J72O9
$$ 114 -92 110 -51 -128 52 15 118 75 -28 -3 193 -181 33 224 53 -34 -104 -235 50 -292 -120 -51
3538e1K55j19M0k29J67J09k31j21N7N03l01p0O6J19k68N9J9L63m45k16N57o1l00
$$ -51 204 85 125 -104 63 172 -59 -180 -123 380 79 9 75 194 -74 -15 4 367 -78 -294 263 202 -98
3561i8O3O6l98O14j46l23J72K93k9k61qJ04p4K7j75L71n61L62k98J61R4L6K05
$$ -98 -35 31 -367 247 101 -222 -50 243 214 -47 -55 49 -25 2 -173 198 -363 -1 -299 -138 -44 -8 197
3584A97l37K23j18M2k9P6M6l6q7K94k34k3K27M2j89k81J38J61l21L65j86Q6n5
$$ 197 -140 83 -35 7 -22 54 100 64 -23 271 37 14 241 283 94 -187 -49 112 -209 156 -30 56 1
3607AJ65K1k42n7P2j40R7j16J16J25k21Q2%O2Q3K00l39n1n7M87n14K48K40j52
$$ 1 166 187 -55 -112 -40 -180 -83 -199 -83 42 -179 -97 -97 -35 48 248 -91 -142 -199 288 -226 22 262 110
3631A10j14M9K96Mm47O5l5J4K55l91J23J13R8J71l25j17J6K11j64J69K9m6j48
$$ 110 -4 45 341 345 -102 -37 -72 -58 197 -194 -71 42 140 311 -14 -131 -115 96 -68 101 130 84 -64
3654f4O9L00k51j42K54J96l01m5k3l4j70L89j74K8K51Q0m72M7K0J72Q2o8J95m50
$$ -64 5 305 54 -88 166 362 61 16 -7 -41 -211 178 4 32 283 363 -109 -62 -42 130 212 144 339 -111
3678a11m9N5l7K44j52M5L7r3j07J53k5r5J07P5k64K98J54k42j40J3N86n81K64
$$ -111 -160 -105 -142 102 -50 -5 32 -61 -168 -15 -40 -135 -28 47 -217 81 235 -7 -147 -134 452 -129 135
3701A35o5K4n81L64L46k83N0K04j90j27L1Q1l4L9K35j73k27K68p3o3O8P5k6K01
$$ 135 70 94 -487 -123 223 -60 -10 194 4 -123 -92 -11 -45 -6 229 56 -171 97 24 -39 29 104 78 279
3725B79l95J09M9j66L0K07jk73K85j03q9j12K87l0q3J80l52K29r4k5n4P0L35j14
$$ 279 -116 -7 42 -124 -94 113 112 -161 124 21 -68 -180 107 77 -6 174 -178 51 -43 -68 -122 -52 283 169
3749A69k32m0K24j00l05pK13J16P1n5K2m03J07L45j61J01K39j90j73k4Q0J11k13
$$ 169 -63 -103 121 21 -284 -291 -78 38 109 54 76 -327 -220 125 -36 65 304 114 -59 -83 -3 108 -105
3772a05M14k79k11K86m8Lk78J65K43l47j1R4K52k16J92Jp5j20P4L76p02K24K95
$$ -105 309 30 -181 105 57 60 -218 -53 190 -157 -168 -74 178 -38 154 155 80 -40 34 410 -292 -68 227
3795B27q7j50kn4L4k24K54k1JN1l5K55m96Q2M62k06k16L05j14m11J90L15qj19
$$ 227 140 -10 -12 -66 -32 -256 -2 -23 -22 29 -6 249 -247 -165 297 91 -125 180 66 -345 -155 160 152 33
3819C3K85l8l99j94L13k4j02R0OK31k82K22l40j9O70l53j22L5j26J4J9K14K81
$$ 33 318 280 -119 -313 0 -24 -126 -36 -30 201 -81 141 -199 -218 452 99 -23 12 -114 -100 -81 133 414
3842D14m02l31K18K85k50p5J75k17J09J23J26k62O1k9J85l54L70K36m08O5L57
$$ 414 12 -319 -101 184 -66 -141 34 -183 -74 49 175 -87 -26 -55 130 -224 146 382 -26 39 396
3863C96m34k88M12N4k13J27Q9P2m29K85Q2m38k8K77n1J9R8K27k28j82J25K50j96
$$ 396 -38 -326 86 140 -73 54 143 215 -214 71 153 -285 -313 -36 -87 -68 30 257 29 -153 -28 222 26
3886B6k50L39j32k5J16J8k36K1K49J0O7j07j30n3ML6N51o18J50J80k84Q4j3P0
$$ 26 -224 115 -17 -42 74 92 -144 -123 126 136 203 96 -34 -87 -83 -47 504 -114 36 216 -68 16 3 73
3910G3j84K97J0j26O2j54k32K53j44J66K33j29k21L80l33K6j0J44k37lK12k53
$$ 73 -111 186 196 70 132 -22 -254 -1 -145 21 254 125 -96 284 -49 -23 -33 111 -126 -129 83 -170
3932a70J03N1Q1j06mj34K73N7l27K45J29k32J40j76j8K84j10L0k31K55J66n31
$$ -170 -67 -16 65 -41 -45 -179 94 151 -176 69 198 -34 106 -70 -88 196 86 116 -115 140 306 -225
3954b25j07N83l00k98M57k36J25k77K50J62n1K33k64Mj39K51j98j1J43K4N5k88
$$ -225 -332 251 -49 -347 110 -126 -1 -278 -28 134 83 316 52 56 -83 168 -30 -41 102 126 181 -107
3976a07Nm5J87J45k93J41k18J07J40q8j04J80J78k41l0L40k33m15M21M6j32o1
$$ -107 -102 -147 40 185 -108 33 -185 -78 62 -26 -130 50 228 -13 -43 297 64 -351 70 116 -16 -77
3998g7J70l35N2K55j28m6L0k03N57k99O5J47j70k58M92r6l76L61o6j32kJ33l0
$$ -77 93 -242 -190 65 -63 -109 -79 -282 275 -24 41 188 18 -240 252 156 -220 141 75 -57 -59 74 44
4021D4j26j9L51O4n82J36L04l03l4K15RK4k1J63r4R0m02N19m62J42M00m51OJ13
$$ 44 -82 -101 250 314 -268 -132 172 -131 -165 50 59 83 62 225 131 221 -181 338 -124 18 418 -33 -27 86
4045H6N1j71JK68l57J8rJ63k27mK51K25l72K91j33r3l6j9j85K62p7K6J19r3j60
$$ 86 137 -34 -33 235 -122 -104 -113 50 -177 -181 70 295 -77 214 81 -12 -48 -67 -252 10 -67 -41 78 -15 -175
4070a75J57j1k49M68q7j35L11q4l99J93L57j60k45l2M51j45j93o2L59k05m8K04
$$ -175 -18 -29 -278 190 103 -32 279 195 -204 -11 346 186 -59 -91 360 215 22 -40 319 114 66 270
4092B70l92L9J50o3Q3j21N6L85m48kL6M2QJ40J18k98j47L11j93j95K98j02j21
$$ 270 -122 -83 67 4 87 -34 22 407 -41 -43 -7 35 43 183 301 3 -144 167 -26 -221 77 -25 -146
4115a46P0j17L2Q0J58k16R7O1J22l6k48K08o3J88j54J43k28j24l9K44n9q9J70
$$ -146 -76 -193 -161 -81 77 -139 -42 19 141 105 -143 65 2 190 36 179 -49 -173 -212 32 -27 -116 54
4138E4l6j22J53r3M46m88j14R3K06M3j10K55j12k90J46L2J39j25l03K40j60J90
$$ 54 18 -104 49 -44 402 -86 -200 -107 99 142 32 287 175 -115 31 63 202 77 -226 14 -146 44
4160D4j35k23K28J28P5rm2N7j33Q1o4k65K76K66j25j73L57k45K94l59J31q3j24
$$ 44 -91 -314 -86 42 117 108 66 123 -10 71 7 -258 18 284 159 -14 343 98 392 33 164 81 -43
4183d3k6p2j48L49k46M51m19o5J07R3N8m6K76k21P6O7J0k50O4k03K19j03j03M02
$$ -43 -69 -141 -289 60 -186 265 -154 -219 -112 -19 39 -7 269 48 124 191 201 -49 15 -188 31 -72 -175 227
4207B27l73J11P7Pl56L06J23k78L27k05J41j31j48J46N7p1p7K92l08O1J22j64
$$ 227 -146 -35 42 49 -307 -1 122 -156 171 -34 107 -24 -172 -26 31 -40 -117 175 -133 -72 50 -114
4229a14J39j22J13j75J3K23q2nk35M79o8J77j6k91J48l94M56k10m0j77K63j57
$$ -114 25 -97 16 -159 -146 77 -5 -10 -245 234 166 343 327 36 184 -210 246 36 -4 -181 82 -75
4251g5j70J85K37k93K46k7j87r4J31K71j70m9K4Q3l12M41j29K3l74J91J75n2j58
$$ -75 -245 -60 177 -116 130 103 -84 -178 -47 224 54 5 29 112 -200 241 112 135 -239 -48 127 75 -83
4274h3K85j18l13K47j14J6K66o2K13m39R8M35l77q4m5j73J49J84j34k2J27O0J4
$$ -83 202 84 -229 18 -96 -80 186 124 337 -102 -4 431 54 -30 -75 -248 -99 85 -49 -71 56 116 130
4297A30r4j12L30m38K21j86L6J03K3K38l31L5%J38J11o5j68P0r7k79L41J61k23
$$ 130 36 -76 254 -184 37 -149 -113 -10 13 251 -80 -45 -45 93 204 139 -29 41 -56 -335 6 167 -56
4320e6R3k05j25K50M53n74R5J56j80l4J1p8K41J8j81J45k9j16J32m3n3L01l0k31
$$ -56 37 -168 -293 -43 410 -164 -69 87 -93 -127 -116 -194 47 65 -116 29 0 -116 16 -27 -80 221 191 -40
4344d0n4M27l72k64L92j36M1n5K78J78m98J69j14l9j48K03n9J17J5M4j24n2Q0
$$ -40 -94 333 -39 -303 89 -47 -6 -61 217 395 -103 66 -48 -87 -235 -32 -91 26 41 85 -39 -91 -11
4367a1J48K91l69l2J84l57L72k32J04j86J05M2K0K9j8j52O8j08k10L38j94M79
$$ -11 137 428 59 27 211 -146 226 -6 98 -88 17 59 79 108 90 -62 6 -102 -312 26 -168 311
4389C11l13L2j40K66j32q5L26p0l02J13K5j51q4N5J77k70Q9j17J14K63j17J70
$$ 311 -2 30 -110 156 24 -61 265 195 -107 6 31 -120 -204 -149 28 -242 -153 -270 -156 107 -10 160
4411A60k55J80j72O0O7j84L96l86P8K15k95O5l2J03j83J38J73K1j31n5J42J58
$$ 160 -95 85 -87 -27 40 -144 252 -134 -56 159 -136 -71 -103 0 -183 -45 128 149 18 -37 105 263
4433B63j50n6Mr4j30J78K83k72n3K8R6j88n0L45K9m16L35o4m11M78K0k74L6J42
$$ 263 113 57 61 -33 -163 15 298 26 -27 1 97 -91 -141 204 233 -183 152 88 -323 155 175 -99 -63 79
4457G9k63L12K3k46L5J12l1k9J7Q1j7J50k54j06K66p7l6N7j30Mp6L76m36j0M36
$$ 79 -184 128 151 -95 -60 52 21 -8 9 90 73 223 -31 -137 129 52 16 73 -57 -53 -129 247 -189 -199 237
4482B37k34JK53k30KP8p3J37j1j04P9j61k94J20R5j16K80p8K75r1l52N8P6l03
$$ 237 3 4 257 27 29 107 34 171 160 56 135 -26 -320 -200 -105 -221 59 -19 256 165 -187 -129 -53 -356
4506c56J23K43k9J07j41l7R9L83m32m8%o9K68k61j23M44m40J71J69R4j17O0O4
$$ -356 -233 10 -19 88 -53 -90 9 392 -40 -88 -88 -157 111 -150 -273 171 -269 -98 71 165 48 108 172
4529A72J27n35M51k75j92J87L20r6l00j32L71L3j51J14Kl26L37j76Q5Q2k02L03
$$ 172 299 -236 215 -60 -252 -65 255 159 -141 -273 98 131 -20 94 96 -230 107 -69 16 98 -104 199
4551A99P9j89k16N2J31j00O5J3JR0j19n5Q3q4N4R8k44N0n8J10K91l27J12K4j09
$$ 199 278 89 -127 -75 56 -44 21 34 35 125 6 -49 34 -50 4 102 -142 -92 -150 -40 251 -76 36 60 -49
4576d9j07K9K26j7n0J3q4p7L0P7J60j42K99l09Lm3n2r6L2K02j98l6M19N2j52l44
$$ -49 -156 -127 99 82 32 45 -39 -116 -86 -9 151 9 308 -1 2 -41 -93 -189 -157 45 -153 -189 230 282 130 -214
4602b14L23j69m8J77p1K0l76L95l8j38J66m1J34j5J71j83k5k97K17L2r5J43q9
$$ -214 109 -60 -108 69 -2 18 -358 37 -1 -139 27 -14 120 105 276 93 68 -229 -12 20 -75 68 -21
4625b1J00m0M3j37J34J56k61m7j41J4L93q7j74P6O7k7k37R3QM1K8K0p8N1O2n7
$$ -21 79 39 82 -55 79 235 -26 -73 -214 -200 193 106 -68 8 75 48 -189 -96 -88 -47 -19 1 -77 -26 36 -21
4651b1J09qJ7p1l1QJ07k95j9K45PNQk22M38j42j93n4q1O4J6K26j23l4M4j92R6
$$ -21 88 80 97 26 -5 3 110 -185 -204 41 48 53 61 -161 277 135 -58 -112 -193 -129 -113 113 -10 -44 0 -192 -96
4678i6%j51M93l55L90lj55M0k92J84p3K16k0k39K54j12N4k64L66k40j14K27J20
$$ -96 -96 -247 246 -109 281 278 123 163 -129 55 -18 198 178 -61 193 81 135 -129 237 -3 -117 110 230
4701B30o7j71j22J67K02l44L30k78J61j43L42k61J88l24j4K6J44j75J59O1J27
$$ 230 163 -8 -130 37 239 -105 225 -53 108 -35 307 46 234 -90 -104 -78 66 -109 50 111 238
4722B38j63M0Rk62P2k39N08k41N2J83r1q3r6J33k1j40j09K04Q9j45J6j45J30r8
$$ 238 75 115 124 -138 -66 -305 203 -38 14 197 106 23 -73 60 39 -101 -210 -6 83 -62 -46 -191 -61 -159
4746a59J89m5J81K9k54K51k31J89j69O1Q3M8J68m63J10K80l17j43K39k00K6J38
$$ -159 30 -15 166 195 -59 192 -39 150 -19 42 125 173 341 -122 -12 268 -49 -192 47 -153 -127 11
4768A1j50K03J63j54M7q3J02Q1k20k6m7j16K31j09J41k38k9L8J81J08j23J01j73
$$ 11 -139 64 227 73 120 37 139 220 0 -26 -73 -189 42 -67 74 -164 -193 -155 26 134 11 112 -61
4791f1mJ19J0k9J50k80K43l1l02K49n5k09L57L3k85j72L66j65R2j27l64M50R0
$$ -61 -65 54 64 35 185 -95 148 117 -185 64 9 -200 157 190 -95 -267 99 -66 26 -101 -465 -15 75
4814G5o3j86J99mJ00jK05l55J7M3M7R7l42L92m02J72J99N7p9j74m53K90O30p37
$$ 75 12 -174 25 21 121 120 325 -30 -13 30 77 174 -168 224 -178 -6 193 250 171 -3 -456 -166 464 -273
4838b73J44J17L2J85M8p3j48O7o4k01O5M4pj70Q3J18J89l58L18n57O35l6l86L77
$$ -273 -129 -12 20 205 253 180 32 99 35 -166 -101 -57 -64 -234 -151 -33 156 -202 116 -441 194 158 -228 149
4862A49L3k07N5L06n10J71k15M18j78L6j33N7J72j61n7K88k73p1L01j22k64K58
$$ 149 182 -25 30 336 -174 -3 -218 200 22 58 -75 -18 154 -7 -64 224 -49 -120 181 59 -205 53
4884E3j25K39n2j74J33j78L68m02K05P1j82q0L04l57J77j38j13K06l6K44k36J80
$$ 53 -72 167 115 -59 74 -104 264 -138 67 138 -44 -124 180 -177 0 -138 -251 -45 -81 163 -73 107
4906A07Q2l5j5j21k23K4L33j97OL69l01j54l5R6j4K09J26n66L11l7J6J01j48j38
$$ 107 189 154 139 18 -205 -181 152 -45 -39 330 29 -125 -160 -64 -78 131 257 -309 2 -35 -19 82 -66 -204
4930b04J1j42K92L9j37J71O8k70J22j1m7on7K9J09p0Mj02K23j61K93j26j86k15
$$ -204 -193 -335 -43 -4 -141 30 98 -172 -50 -61 -108 -114 -171 -142 -33 -103 -99 -201 22 -139 154 28 -158 -373
$$ [...]
8191G5
##END NTUPLES=NMR FID
##END=
