##TITLE=1H_Pr 5168
 CD3OD
 8 sc, 
 16.11.2022
##JCAMPDX= 6.0         $$ Bruker NMR JCAMP-DX V2.0
##DATA TYPE= NMR FID
##DATA CLASS= NTUPLES
##ORIGIN= UXNMR, Bruker Analytische Messtechnik GmbH
##OWNER= root
$$ XWIN-NMR		Version 3.5
$$ Wed Nov 16 14:37:09 2022 Russian Standard Time (UT+4h)  she@DPX200
##.OBSERVE FREQUENCY= 200.1313499994
##.OBSERVE NUCLEUS= ^1H
##.DELAY= (6, 6)
##.ACQUISITION MODE= SIMULTANEOUS
##.ACQUISITION SCHEME= undefined
##.AVERAGES= 8
##.DIGITISER RES= 18
##SPECTROMETER/DATA SYSTEM= spect
##.PULSE SEQUENCE= zg30
##.SOLVENT NAME= MeOD
##.SHIFT REFERENCE= (INTERNAL, MeOD, 0, 15.7039)
##AUDIT TRAIL= $$ (NUMBER, WHEN, WHO, WHERE, WHAT)
$$ ##TITLE= Audit trail, XWIN-NMR		Version 3.5
$$ ##JCAMPDX= 5.01
$$ ##ORIGIN= Bruker BioSpin GmbH
$$ ##OWNER= she
$$ F:/spectra/data/she/nmr/H-F/1/audita.txt
$$ ##AUDIT TRAIL=  $$ (NUMBER, WHEN, WHO, WHERE, WHAT)
(   1,<2022-11-16 14:35:40.42 +0400>,<she>,<DPX200>,
      <created by zg, POWCHK disabled, PULCHK disabled
       configuration hash MD5:
       00 E9 B6 7A A2 85 ED C7 34 08 36 98 17 FE 4E 26
       data hash MD5: 16K
       94 31 01 94 D4 74 39 16 29 C0 35 F3 F3 E5 F8 B3>)
$$ ##END=
$$ 
$$ hash MD5
$$ 9A F5 D4 05 0E D0 0B BB E5 FF C5 FD 1B 8A A5 75
##$RELAX= 
##$RELAX= 
##$RELAX= 
##$RELAX= 
##$RELAX= 
##$RELAX= 
$$ Bruker specific parameters
$$ --------------------------
##$DU= <F:/spectra>
##$EXPNO= 1
##$NAME= <H-F>
##$PROCNO= 1
##$TYPE= <nmr>
##$USER= <she>
##$AMP= (0..31)
100 100 100 100 100 100 100 100 100 100 100 100 100 100 100 100 100 100 
100 100 100 100 100 100 100 100 100 100 100 100 100 100 
##$AQSEQ= 0
##$AQ_mod= 1
##$AUNM= <au_zg>
##$AUTOPOS= <>
##$BF1= 200.13
##$BF2= 200.13
##$BF3= 200.13
##$BF4= 200.13
##$BF5= 200.13
##$BF6= 200.13
##$BF7= 200.13
##$BF8= 200.13
##$BYTORDA= 1
##$CFDGTYP= 0
##$CFRGTYP= 5
##$CHEMSTR= <none>
##$CNST= (0..31)
1 1 145 1 1 1 1 1 1 1 1 1 1 1 1 1 1 1 1 1 1 1 1 1 1 1 1 1 1 1 1 1 
##$CPDPRG= <>
##$CPDPRG1= <>
##$CPDPRG2= <>
##$CPDPRG3= <>
##$CPDPRG4= <mlev>
##$CPDPRG5= <mlev>
##$CPDPRG6= <mlev>
##$CPDPRG7= <mlev>
##$CPDPRG8= <mlev>
##$CPDPRGB= <>
##$CPDPRGT= <>
##$D= (0..31)
0 1.2 0 0 0 0 0 0 0 0.06 0 0.03 0 0 0 0 0.0002 0 0 0 0 0 0 0 0 0 0 0 0 
0 0 0 
##$DATE= 1668594939
##$DBL= (0..7)
120 120 120 120 120 120 120 120 
##$DBP= (0..7)
150 150 150 150 150 150 150 150 
##$DBP07= 0
##$DBPNAM0= <>
##$DBPNAM1= <>
##$DBPNAM2= <>
##$DBPNAM3= <>
##$DBPNAM4= <>
##$DBPNAM5= <>
##$DBPNAM6= <>
##$DBPNAM7= <>
##$DBPOAL= (0..7)
0.5 0.5 0.5 0.5 0.5 0.5 0.5 0.5 
##$DBPOFFS= (0..7)
0 0 0 0 0 0 0 0 
##$DE= 6
##$DECBNUC= <off>
##$DECIM= 32
##$DECNUC= <off>
##$DECSTAT= 4
##$DIGMOD= 1
##$DIGTYP= 9
##$DL= (0..7)
0 120 120 120 120 120 120 120 
##$DP= (0..7)
150 150 150 150 150 150 150 150 
##$DP07= 0
##$DPNAME0= <>
##$DPNAME1= <>
##$DPNAME2= <>
##$DPNAME3= <>
##$DPNAME4= <>
##$DPNAME5= <>
##$DPNAME6= <>
##$DPNAME7= <>
##$DPOAL= (0..7)
0.5 0.5 0.5 0.5 0.5 0.5 0.5 0.5 
##$DPOFFS= (0..7)
0 0 0 0 0 0 0 0 
##$DQDMODE= 0
##$DR= 18
##$DS= 0
##$DSLIST= <SSSSSSSSSSSSSSS>
$$ [...]
##$SUBNAM2= <"">
##$SUBNAM3= <"">
##$SUBNAM4= <"">
##$SUBNAM5= <"">
##$SUBNAM6= <"">
##$SUBNAM7= <"">
##$SUBNAM8= <"">
##$SUBNAM9= <"">
##$SW= 18.0517283424941
##$SWIBOX= (0..15)
0 0 2 0 0 0 0 0 0 0 0 0 0 0 0 0 
##$SW_h= 3612.71676300578
##$TD= 16384
##$TD0= 1
##$TE= 0
##$TE2= 300
##$TE3= 300
##$TEG= 300
##$TL= (0..7)
0 120 120 120 120 120 120 120 
##$TP= (0..7)
150 150 150 150 150 150 150 150 
##$TP07= 0
##$TPNAME0= <>
##$TPNAME1= <>
##$TPNAME2= <>
##$TPNAME3= <>
##$TPNAME4= <>
##$TPNAME5= <>
##$TPNAME6= <>
##$TPNAME7= <>
##$TPOAL= (0..7)
0.5 0.5 0.5 0.5 0.5 0.5 0.5 0.5 
##$TPOFFS= (0..7)
0 0 0 0 0 0 0 0 
##$TUNHIN= 0
##$TUNHOUT= 0
##$TUNXOUT= 0
##$USERA1= <user>
##$USERA2= <user>
##$USERA3= <user>
##$USERA4= <user>
##$USERA5= <user>
##$V9= 5
##$VALIST= <valist>
##$VCLIST= <CCCCCCCCCCCCCCC>
##$VD= 0
##$VDLIST= <DDDDDDDDDDDDDDD>
##$VPLIST= <PPPPPPPPPPPPPPP>
##$VTLIST= <TTTTTTTTTTTTTTT>
##$WBST= 1024
##$WBSW= 4
##$XGAIN= (0..3)
0 0 0 0 
##$XL= 0
##$YL= 0
##$YMAX_a= 250581
##$YMIN_a= -483005
##$ZGOPTNS= <>
##$ZL1= 120
##$ZL2= 120
##$ZL3= 120
##$ZL4= 120
##$ABSF1= 10
##$ABSF2= 0
##$ABSG= 5
##$ABSL= 3
##$ALPHA= 0
##$AQORDER= 0
##$ASSFAC= 0
##$ASSFACI= 0
##$ASSFACX= 0
##$ASSWID= 0
##$AUNMP= <proc_1d>
##$AZFE= 0.1
##$AZFW= 0.1
##$BCFW= 1
##$BC_mod= 2
##$BYTORDP= 1
##$COROFFS= 0
##$CY= 11.3945322036743
##$DATMOD= 1
##$DC= 2
##$DFILT= <>
##$DTYPP= 0
##$F1P= 2.36226072786647
##$F2P= -0.459571619588291
##$FCOR= 0.5
##$FTSIZE= 0
##$FT_mod= 4
##$GAMMA= 1
##$GB= 0.15
##$INTBC= 1
##$INTSCL= 1
##$ISEN= 128
##$LB= 0.24
##$LEV0= 0
##$LPBIN= 0
##$MAXI= 10000
##$MC2= 0
##$MEAN= 0
##$ME_mod= 0
##$MI= 1.114404
##$NCOEF= 0
##$NC_proc= 0
##$NLEV= 6
##$NOISF1= 3.799351
##$NOISF2= 2.8
##$NSP= 1
##$NTH_PI= 0
##$NZP= 0
##$OFFSET= 15.70392
##$PC= 1
##$PHC0= -18032.54
##$PHC1= 11.8007
##$PH_mod= 1
##$PKNL= yes
##$PPARMOD= 0
##$PSCAL= 0
##$PSIGN= 0
##$REVERSE= no
##$SF= 200.130013532006
##$SI= 16384
##$SIGF1= 3
##$SIGF2= 2
##$SINO= 400
##$SIOLD= 16384
##$SREGLST= <1H.CDCl3>
##$SSB= 0
##$STSI= 0
##$STSR= 0
##$SW_p= 3612.71676300578
##$SYMM= 0
##$S_DEV= 0
##$TDeff= 0
##$TDoff= 0
##$TI= <>
##$TILT= no
##$TM1= 0
##$TM2= 0
##$TOPLEV= 0
##$USERP1= <user>
##$USERP2= <user>
##$USERP3= <user>
##$USERP4= <user>
##$USERP5= <user>
##$WDW= 1
##$XDIM= 8192
##$YMAX_p= 0
##$YMIN_p= 0
$$ End of Bruker specific parameters
$$ ---------------------------------
##NTUPLES= NMR FID
##VAR_NAME=  TIME,          FID/REAL,        FID/IMAG
##SYMBOL=    X,             R,               I
##VAR_TYPE=  INDEPENDENT,   DEPENDENT,       DEPENDENT
##VAR_FORM=  AFFN,          ASDF,            ASDF
##VAR_DIM=   8192,          8192,            8192
##UNITS=     SECONDS,       ARBITRARY UNITS, ARBITRARY UNITS
##FACTOR=    0.0002768,     1,               1
##FIRST=     0,             0,               0
##LAST=      2.2672688,     0,               0
##MIN=       0,             -483005,         0
##MAX=       2.2672688,     250581,          0
$$ Real data points
##PAGE= N=1
##DATA TABLE= (X++(R..R)), XYDATA
0 0 0 0 0 0 0 0 0 0 0 8 -8 8 -8 16 -16 24 -24 32 -40 48 -56 71 -80 96 -112 130 -153 177 -205 234 -269 306
32 306 -347 394 -446 502 -564 633 -706 787 -878 975 -1082 1198 -1327 1465 -1618 1783 -1966
49 -1966 2163 -2384 2627 -2897 3195 -3530 3908 -4335 4827 -5399 6068 -6874 7857 -9093
63 -9093 10698 -12878 16026 -20987 30015 -51778 221082 72831 -296987 41642 30283 -142766
75 -142766 -104650 -6488 -138557 -11777 250581 162114 -86947 -10683 15256 -128435 -139454
86 -139454 -29699 -1569 51419 118308 91953 35165 102044 78493 -118970 -194183 -108489 -67063
98 -67063 14446 98188 53591 21061 106636 108637 -42483 -112913 -67703 -126947 -135675 62483
110 62483 157242 72238 79175 128027 44859 -61700 -61083 -81916 -171555 -134724 -5964 52548
122 52548 116812 146884 39753 -15507 46782 14681 -106987 -103445 -26354 -45866 10804 177815
134 177815 109931 -72842 -10039 53066 -101496 -156802 -21500 5410 -46931 66664 158579
145 158579 57384 41884 95304 -53036 -183692 -77308 11193 -43052 -35285 68374 89709
156 89709 64538 89815 27171 -102552 -109473 -67538 -62802 -19918 36847 57833 82838 111983
168 111983 72117 -9876 -27687 -55691 -142643 -106286 15419 25495 14546 78054 88958 15765
180 15765 -9555 14788 -46273 -111962 -46864 11177 16467 81015 110520 28905 -24002 -562
192 -562 -17764 -93283 -98236 -45742 -26972 37747 119178 80325 29475 45910 7366 -73834 -80938
205 -80938 -44666 -50492 -32316 53146 71005 44748 88152 59943 -68758 -95827 -42298 -49268
217 -49268 -62360 -793 51687 41564 72646 107003 25673 -48252 -42486 -66977 -83309 -26605
229 -26605 22787 23278 32592 64643 52450 11873 -2557 -54886 -107647 -52356 13275 19144 43130
242 43130 71089 51743 23370 24733 -4904 -86827 -98640 -40265 -28071 887 74883 80709
254 80709 37724 29382 25065 -26849 -72737 -53087 -43173 -51381 14592 78049 66127 53946 38704
267 38704 -14598 -53609 -45119 -36777 -60119 -43197 23096 50774 68901 86731 28192 -38390
279 -38390 -39100 -36015 -53929 -44563 -4302 12991 22687 74604 80211 10829 -22748 -36407 -72386
292 -72386 -61662 -10350 10712 6637 34983 76202 57056 20127 -439 -54914 -86472 -48877
304 -48877 -17367 -1713 28162 52913 49489 35634 32799 1522 -56300 -63539 -50370 -44428 6556
317 6556 56938 52263 36963 35049 19521 -20332 -40419 -39251 -63366 -52101 19531 54024 51793
330 51793 55516 33466 -8667 -26799 -23151 -41200 -67096 -35995 13236 33223 64753 71130 20698
343 20698 -14992 -21893 -35864 -49278 -38240 -14590 -5902 23441 72578 61774 20321 1597
355 1597 -33249 -61986 -44286 -19001 -13776 -3797 36189 58969 41516 35383 13787 -45249 -63418
368 -63418 -39751 -26315 -8114 20654 38595 33272 33632 40961 4547 -43495 -50786 -54597 -41749
381 -41749 8487 39898 40134 37239 37034 22744 -6050 -20646 -40952 -71682 -47321 6580 30094
394 30094 46402 49572 25213 4085 -1105 -9795 -41825 -58231 -30461 -3525 23707 59219 49785
407 49785 16935 2657 -11298 -30494 -41304 -35533 -24231 -13548 23266 56078 48340 34676
419 34676 10018 -30803 -43612 -32895 -24412 -18716 -3842 25249 39590 42017 44115 8271 -38091
432 -38091 -47301 -42761 -32319 -9927 13513 27225 29026 42638 48152 12205 -23094 -42026 -59361
445 -59361 -38628 4516 20666 15851 19875 36937 31050 6352 -9420 -40022 -61170 -26432 8321
458 8321 16820 30834 39665 29170 11590 733 -16333 -45557 -43540 -23233 -19510 11060 53630
471 53630 48643 23423 8305 -6100 -22769 -31795 -28629 -32525 -23689 21335 49435 45441 35515
484 35515 6378 -22552 -27445 -28609 -32362 -30135 -10432 17268 30013 44523 46540 13432 -17399
497 -17399 -31309 -35543 -24477 -13863 -3651 10653 23752 37890 31974 6636 -11698 -34315
509 -34315 -45854 -27105 -4096 10708 20976 30968 36253 20898 8256 -230 -34785 -55846 -37086
522 -37086 -11202 14449 33337 32160 20757 15449 17102 -5274 -38097 -36878 -30643 -25915 13011
535 13011 43252 35756 24091 17269 2840 -19300 -25933 -25118 -37127 -26086 10410 28728 40740
548 40740 40253 8471 -15402 -15781 -15978 -24005 -26540 -10026 5306 19118 44116 40872 9002 -15782
562 -15782 -32885 -33696 -19706 -12546 -6023 4379 21526 41531 39038 20061 -8245 -37559 -38913
575 -38913 -24145 -10883 920 5405 17915 35270 29679 16237 -2331 -28236 -39540 -32829 -13774
588 -13774 8264 20679 26642 22865 16851 17622 -415 -24565 -30853 -38422 -28264 10318 34752
601 34752 28860 16075 13867 9240 -7017 -14754 -25689 -41103 -19856 13098 24607 33752 31595
614 31595 10375 -6079 -11104 -16043 -28905 -28511 -12039 -3636 17130 44622 35785 12359 -2605
627 -2605 -20291 -26472 -19563 -13968 -14058 -6129 20453 34373 27919 23170 1181 -30014 -33202 -21769
641 -21769 -11197 -2045 4118 14834 23533 28796 27762 1928 -26928 -36547 -31531 -10932 5974
654 5974 10573 15587 18202 22621 22931 1964 -18906 -31370 -36686 -19372 5920 20763 23039 18110
668 18110 16934 10974 -1660 -8468 -26815 -39299 -19500 3798 18187 30053 26504 12617 -292
681 -292 -3318 -7707 -25336 -28320 -17405 -7614 16883 36927 29318 12840 -2283 -13304 -16182 -17576
695 -17576 -17258 -18194 -7443 18267 29281 28782 23596 -1238 -21802 -22543 -20056 -16300 -11061 -46
709 -46 12762 19778 30289 27361 1385 -17849 -25678 -26267 -14221 -2286 6763 11546 13131 23327
723 23327 21267 3622 -11019 -27521 -32736 -17065 1641 14995 17466 16634 18844 11014 4251 -4537
737 -4537 -26955 -32790 -17893 -4477 11890 25122 23666 12150 2763 3533 -6991 -24082 -22088
750 -22088 -18548 -12057 14405 31682 25948 14104 3052 -5470 -14819 -16914 -16173 -22473 -13051 10985
764 10985 22688 28131 23910 3444 -11824 -16575 -14771 -12147 -12262 -3550 5442 14068 27619 22323
778 22323 2409 -11488 -22970 -23187 -13454 -3923 4487 6928 13346 25252 21354 9032 -6895 -25608
792 -25608 -28145 -17061 -3009 8965 9957 13380 17342 12567 9065 -3014 -22480 -26789 -21205 -7775
806 -7775 11044 20739 21031 13361 7757 8123 -3999 -16822 -20968 -26055 -14641 9502 19969 19631
820 19631 13251 6314 110 -7997 -7944 -13148 -21641 -9027 7784 16764 25152 20071 2675 -11088
834 -11088 -15805 -12231 -13669 -14163 -5033 1165 14065 29142 23471 7683 -6970 -18093 -18751 -14695
848 -14695 -6699 -773 -295 11941 22510 18917 12026 -3182 -20822 -24361 -17316 -4181 3184 5041
862 5041 12958 15356 15027 16426 1596 -17045 -23696 -21018 -7851 4626 11521 14167 8086 7937 9350
877 9350 -1399 -10241 -17447 -21857 -9653 7021 17828 20115 12660 6522 -370 -6342 -7552 -16833
891 -16833 -22399 -11559 1425 15498 25136 18960 6975 -4298 -7829 -7551 -13761 -14086 -9831 -5336
905 -5336 11712 24254 19652 9780 -3797 -13037 -14858 -12494 -6142 -6267 -3907 10359 17564 17856 15403
920 15403 -291 -15930 -19781 -13838 -4421 -1123 3397 8731 8848 16150 17242 84 -14198 -20808
934 -20808 -19391 -7520 4040 11471 9821 7223 13338 11107 808 -6978 -18902 -23093 -11492 2087
948 2087 13306 14915 11053 8816 3653 1189 -2494 -15328 -19493 -12766 -2156 12395 18053 14556
962 14556 6550 -3538 -3756 -4433 -11781 -12886 -10498 -3955 10486 19747 20453 10328 -4546 -9855 -12447
977 -12447 -11412 -7038 -10178 -6661 7387 16444 20263 14696 998 -10421 -15379 -10098 -4862 -6602
991 -6602 -326 5184 8224 16415 13591 940 -8866 -16435 -16385 -8236 1429 8149 5457 7426 13273
1006 13273 9442 4901 -3021 -17800 -19787 -10643 211 9777 11283 9579 5505 2724 4716 -3909
1020 -3909 -15823 -15836 -13444 -3784 12244 18237 15450 7525 1312 1082 -4147 -10285 -14516 -17720 -8818
1035 -8818 5298 14385 17536 8894 241 -2387 -5332 -4319 -4494 -9794 -5785 3684 11674 15653 9518
1050 9518 320 -11018 -16229 -8603 -5213 -5671 -284 3534 9705 18883 15245 3617 -8452 -14892
1064 -14892 -12783 -8745 -130 3525 803 7830 13898 10467 6054 -4640 -16846 -18128 -11891 -1283
1078 -1283 6122 8616 10497 8984 10477 10742 -1387 -10642 -13687 -15968 -7151 4262 7005 6636 3581
1093 3581 2694 1523 -1146 -2209 -9092 -11043 -470 7523 13248 15907 6637 -2080 -6440 -8287 -7936
1108 -7936 -11396 -11697 -6094 1544 13504 18410 12835 6193 -4555 -10246 -7049 -7295 -6278 -3158 -862
1123 -862 7755 14398 13305 6407 -5788 -12423 -13784 -11170 -2190 -1081 -2641 6614 12391 13086 12049
1138 12049 2114 -8863 -13207 -7734 522 924 2192 2978 -933 3851 6224 -2855 -9461 -12238 -9937
1153 -9937 366 9772 14524 11394 6425 6448 1844 -2876 -7205 -17193 -17493 -7203 1374 10070 13011
1168 13011 8285 4035 417 388 -2913 -9170 -9473 -8047 -1097 12099 14627 9989 5098 -3740 -6637
1183 -6637 -6044 -7264 -8012 -9015 -3772 5570 10068 12866 7725 -2327 -4741 -4828 -3329 227 -1026 197
1199 197 3639 6026 8424 3524 -6292 -12384 -14305 -8428 -964 2576 8005 8386 8629 13170 9608 858
1215 858 -7040 -14583 -14268 -7867 200 5941 4250 4724 6952 3627 3116 -1376 -10896 -11433 -6538 1034
1231 1034 9165 10216 7932 4090 619 1655 -2134 -7860 -9591 -10679 -3944 6201 8894 7299 1729
1246 1729 -3530 -1905 -1783 -1908 -2076 -4224 929 6937 11174 12006 2627 -5804 -9551 -12142 -8770 -5113
1262 -5113 -5157 -823 4605 11314 15790 10682 2926 -5337 -10644 -7279 -4449 -2554 -15 -672 3931 9267
1278 9267 6897 2695 -4714 -11176 -9583 -4207 2421 4654 3380 5405 5353 4982 5856 -1687 -9586 -9753
1294 -9753 -6976 -29 6182 6376 3482 -717 330 1045 -4255 -5773 -7209 -8033 2040 10540 12336
1309 12336 10377 3749 -370 -3543 -5931 -6121 -10350 -11564 -4518 2858 10129 12760 7314 1940 -2781
1324 -2781 -3803 -1784 -3741 -5605 -3385 -305 5925 9315 6214 827 -7080 -7952 -4628 -3433 -736
1339 -736 388 -153 4968 8748 8052 3497 -4783 -8791 -8103 -3478 3040 3050 2036 3868 3629 4813 3691
1356 3691 -4529 -10324 -11167 -6904 1264 6076 8210 6565 3550 5591 3794 -1611 -5526 -11320 -11126
1371 -11126 -3237 2981 6953 6380 2835 1499 145 412 -964 -7141 -7046 -2656 1844 8517 9011 3993
1387 3993 -968 -4685 -3468 -2896 -5092 -4042 -4236 -476 7786 10173 7095 1231 -4799 -5728 -5088 -3253
1403 -3253 -563 -2351 -562 5428 7905 7843 3269 -4431 -8284 -8910 -3856 193 24 1801 3556 4673
1419 4673 8196 6031 -1339 -6793 -9531 -5779 -431 2698 5100 2308 1166 4734 3319 89 -4142
1434 -4142 -9090 -7206 -1957 4100 7491 5087 2436 1976 399 597 -2757 -7940 -7914 -4532 2246 7858
1450 7858 7490 4955 702 -2293 -823 -1892 -4297 -5296 -5962 -878 6013 8139 7148 1256 -3351 -3809
1466 -3809 -3806 -1892 -1803 -3697 -316 3789 6810 8086 3042 -3406 -6500 -6647 -2729 -1345 -1042 1295 1684
1483 1684 4924 8930 5046 -844 -5960 -8424 -5330 -1316 2391 2918 985 2815 5121 3628 1792
1498 1792 -3781 -8662 -7310 -3157 2653 5273 3775 3402 2054 1971 2776 -1704 -6054 -7203 -4811 1424
1514 1424 5422 5583 3960 -1084 -1550 514 -1053 -3575 -5050 -4882 558 5747 9222 6905 81 -2364
1530 -2364 -3740 -4583 -2402 -3871 -5802 -2139 2860 7969 7924 4418 -489 -4947 -4170 -1128 -2390 -2096
1546 -2096 -1107 145 4891 7355 4058 -552 -5460 -6535 -4120 -1262 1727 580 194 3669 4736
1561 4736 4690 3042 -4133 -6882 -5304 -2216 2165 3134 2527 1652 601 2497 1583 -3302 -5548 -6668
1577 -6668 -4549 2532 5100 6323 4720 1947 1784 498 -1719 -3936 -7394 -6439 -1981 2374 6571
1592 6571 4870 1276 328 -1161 -1178 -152 -3045 -4328 -2213 1919 5980 5861 3864 -907 -5539 -3361
1608 -3361 -1515 -2963 -1548 -1233 -519 3862 6595 5161 352 -4101 -4355 -4011 -922 2312 -44 1
1624 1 3002 3777 4707 1651 -4210 -7507 -7083 -2249 1678 2572 3122 2468 3225 5740 3267 -660 -4772
1641 -4772 -7956 -4984 -69 2513 3294 1580 833 1726 1533 1326 -2628 -6053 -3693 -825 3093 6431
1657 6431 3700 404 -411 -757 -476 -1740 -4185 -4481 -3321 1936 5857 4802 3415 -800 -3620 -1687
1673 -1687 -1325 -1960 -1708 -2182 830 4688 6115 4762 -395 -3684 -4507 -4886 -1896 -664 -2326 -207
1689 -207 3006 4636 6025 3321 -1598 -4667 -4584 -1301 -246 447 1555 -395 1490 4366 2126 -624
1705 -624 -4198 -5880 -3176 91 3496 3655 1518 1694 1624 1389 1001 -3148 -5789 -4710 -2110 2977 5071
1722 5071 3249 1397 -116 -156 305 -1342 -3480 -4973 -3520 2141 5096 5121 3765 -792 -2091 -1178
1738 -1178 -1323 -2131 -3777 -3809 -610 2875 5521 5072 405 -1928 -2578 -2142 131 -854 -1902 -428 1138
1755 1138 4104 4697 1326 -1987 -5170 -4232 -1272 150 1373 894 398 3239 4225 3004 194 -4343
1771 -4343 -5911 -3657 -580 2344 1887 1046 1859 1738 2820 1663 -2978 -4590 -4671 -2250 2482 3422 2817
1788 2817 1388 174 1406 1084 -1251 -3522 -5126 -2942 1316 3495 4817 2460 -1138 -673 -304 -656
1804 -656 -1357 -3149 -3182 -661 2723 5863 3696 479 -1404 -3577 -2279 -525 -1929 -2184 -942 1242
1820 1242 4471 5055 2950 -746 -4351 -2995 -1569 -611 254 -1386 -442 2637 3710 3992 1022 -3614
1836 -3614 -4545 -2916 105 1606 996 832 704 1611 3653 1054 -3140 -4274 -4654 -1712 2219 2807 2264
1853 2264 772 1334 2344 941 -569 -2993 -5609 -2712 896 2525 3800 1988 -15 -172 -184 365
1869 365 -1502 -3998 -3206 -1395 2165 5132 3443 1297 -1186 -2503 -177 -289 -1655 -2058 -2169 467
1885 467 3620 4233 2489 -1669 -3597 -1538 -1291 -50 317 -1127 84 2752 4470 3441 -454 -3277
1901 -3277 -4038 -3379 81 441 -396 616 848 3074 4257 1563 -1405 -3740 -4443 -1218 769 1769
1917 1769 1389 394 838 1885 1199 276 -2823 -4567 -2173 -290 2584 3614 1245 4 -174 810 1007
1934 1007 -1780 -3295 -3511 -1915 2516 4564 2491 466 -1873 -1378 -182 -601 -1339 -2759 -2415 1695
1950 1695 3941 4183 2358 -1040 -2242 -1743 -1428 -556 -2237 -2555 286 2032 3785 3537 346 -1556
1966 -1556 -2754 -1541 233 -384 16 48 138 2415 3049 917 -1162 -3713 -3539 -1485 524 2040 1284
1983 1284 -36 1311 2089 2042 881 -2963 -4094 -2669 -294 3009 2290 574 415 78 1396 744 -1633
2000 -1633 -3325 -3771 -1311 2769 3153 2515 995 -871 211 644 -748 -2181 -3730 -2189 747 2763
2016 2763 3466 1391 -855 -1039 -1106 -350 -381 -1783 -1136 -100 1348 3483 2691 344 -1953 -3171 -1493
2033 -1493 -757 -734 -158 -836 192 3206 3297 1740 -828 -3262 -3114 -1040 570 1331 -431 -21 1634
2050 1634 2004 2543 315 -3435 -3775 -2086 294 1570 1103 766 596 1076 2358 380 -1554 -3109 -3206
2067 -3206 -687 1138 1654 1879 285 -40 994 241 -590 -1664 -2576 -1523 263 2354 3360 1158
2083 1158 165 -601 -1713 -357 -28 -1695 -1997 -857 1471 3266 3022 1191 -1837 -2884 -260 -83
2099 -83 -182 -672 -1667 -115 2908 3444 1734 -1269 -2992 -2178 -770 1180 439 -1194 346 1476 2682
2116 2682 2876 -315 -2611 -2853 -1959 40 1104 713 390 207 1771 2295 338 -715 -2569 -3162 -762
2133 -762 1133 1527 1610 249 422 542 610 254 -1920 -3073 -1901 -171 2809 3082 757 38 -826 -397
2151 -397 825 -458 -2223 -2475 -1149 1768 2917 2024 514 -2105 -1276 184 -403 -539 -965 -1299 769
2168 769 2958 3108 1092 -1334 -1795 -2002 -1385 224 -837 -1190 750 1355 2429 2551 606 -973 -2187
2185 -2187 -1536 257 320 761 332 -319 1158 1535 956 -87 -2356 -2888 -916 557 2044 1284 64
2202 64 -44 674 1651 814 -1751 -2161 -1903 -9 3036 2101 592 -613 -1158 63 350 -1122 -1951 -2671
2220 -2671 -514 2601 2912 2623 1005 -1209 -470 -488 -747 -1402 -2630 -2108 281 1486 2501 1362 -110
2237 -110 -555 -1211 132 759 -465 -676 -327 349 2130 2092 219 -1563 -2888 -1270 -75 424 1031 -555
2255 -555 -715 1301 2021 1438 -608 -2507 -1977 -735 1336 2451 258 -104 541 797 990 -732 -2488
2272 -2488 -3172 -2528 303 2407 1516 1492 1043 863 2008 1105 -560 -2196 -2970 -1006 112 472 1118 -153
2290 -153 -804 -150 43 667 64 -808 -394 388 1861 2781 990 -540 -2018 -2023 -475 49 -488 -885 -1157
2309 -1157 1057 2653 2029 596 -1551 -2721 -692 401 1111 218 -793 856 2235 2442 1569 -1417
2325 -1417 -3484 -2832 -1718 -77 152 -564 -169 800 2557 2632 736 55 -1503 -1292 549 451 192 -348
2343 -348 -971 -643 561 125 -269 -1279 -1387 362 1315 2899 2496 246 -426 -457 -517 123 -1008 -2322
2361 -2322 -2117 -402 2362 2324 892 -129 -1723 -1103 668 -108 -1190 -1360 -579 1616 3026 2340 803
2378 803 -1241 -1460 -621 -588 -495 -1529 -1985 28 1253 1991 1406 -270 -871 -248 471 1361 849 143 -412
2397 -412 -528 977 610 -997 -1181 -2522 -1948 224 1314 1563 880 455 813 867 1126 -6 -2294 -2206
2415 -2206 -1078 514 1726 1129 -489 -374 57 889 477 -1284 -2260 -2057 38 2594 2091 1226 -4
2432 -4 -540 534 789 -343 -1040 -2028 -1139 518 1238 1055 -227 -1276 -428 -413 737 719 -421 47 692
2451 692 1218 1955 618 -892 -1841 -1929 -1004 177 142 170 -318 536 1637 1467 920 -455 -2390 -1382 109
2470 109 447 1074 -168 -483 532 1094 1190 -571 -2395 -1632 -1054 648 1686 701 -143 206 910 1472
2488 1472 316 -938 -1809 -1725 215 1628 821 483 -469 -705 18 -59 -120 -757 -1251 -214 1215 2014 1905
2507 1905 277 -711 -823 -1037 96 -282 -1318 -826 -359 1004 1835 1370 -370 -1459 -1266 -42 155
2524 155 132 -501 -1057 556 1849 1393 483 -1232 -2002 -951 525 850 -6 -604 18 446 1409 1246 -728
2543 -728 -1400 -1260 -829 553 1235 99 113 137 767 624 206 -583 -1720 -1599 513 619 968 625 -210
2562 -210 -473 198 296 -201 -1093 -1470 -661 271 1825 1519 172 -346 -739 -243 510 -438 -1257 -966 -458 1264
2582 1264 1601 909 -342 -1236 -974 -228 -12 120 -907 -832 1023 1729 1384 563 -1195 -1619 -877 384
2600 384 599 -644 -562 -83 401 1726 1395 -489 -911 -931 -295 191 638 145 -237 -233 654 580 262 -561 -1709
2621 -1709 -1206 540 1229 1259 308 -235 32 638 498 -325 -1539 -1319 -990 391 1889 582 -73 -533
2639 -533 -688 194 571 -775 -1298 -1113 -9 1385 1331 1217 137 -857 -354 215 -751 -432 -1356 -747 320
2658 320 1141 1232 175 -691 -643 -366 376 583 -195 3 -89 385 1314 834 -630 -1150 -1342 -695 235 826
2678 826 590 -401 340 962 803 545 -398 -1761 -1327 33 349 903 122 -216 -150 666 923 -6 -1353
2697 -1353 -1478 -1267 332 1294 789 240 -206 -59 1024 542 -152 -1088 -1490 -166 755 762 773 -671 -721 14
2717 14 253 519 285 -523 -291 734 1412 1324 -28 -833 -1190 -976 63 116 -513 -490 -189 551 1621 1022
2737 1022 16 -1074 -1234 147 347 303 63 -562 27 848 917 463 -836 -1238 -916 -319 470 476 -401 -160
2757 -160 378 740 1267 -69 -551 -618 -588 698 983 310 -98 -832 -123 335 3 -294 -1172 -1076 229 965
2777 965 1263 1208 -335 -250 -313 -113 333 -935 -1288 -844 391 1115 1178 288 -230 -605 -50 760 93 -291
2797 -291 -697 -407 1109 1302 759 27 -1207 -588 -42 152 124 -590 -746 303 784 1202 476 -582 -726
2816 -726 -542 127 1016 344 51 -49 -106 571 790 -608 -1127 -1449 -512 605 545 774 92 97 640 830 255
2837 255 -414 -1308 -1189 -208 465 1095 326 -438 -204 15 576 299 -579 -771 -666 412 1320 575 69 -386
2857 -386 -726 1 550 20 -370 -866 -179 1045 842 633 -352 -1072 -424 -49 376 57 -295 -343 285 689
2877 689 1326 248 -830 -1011 -824 -100 455 -257 -59 -107 689 1117 739 250 -575 -1298 -466 277 693 241
2897 241 -376 -334 544 867 495 -470 -1049 -814 -154 930 817 199 -416 -61 4 618 85 -734 -1108 -732
2917 -732 230 633 893 232 -554 -508 251 204 -148 -380 -855 8 657 964 673 -80 -565 -309 -167 473 -498
2938 -498 -793 -271 12 951 1100 394 -365 -849 -470 465 404 -283 -529 -547 501 970 537 249 -856 -1214
2958 -1214 -96 399 705 464 -139 -4 344 731 521 -504 -1180 -823 -140 819 569 -171 3 -195 518
2977 518 812 -220 -613 -882 -499 179 939 521 204 -356 -61 164 176 54 -745 -916 -144 819 1149 436
2997 436 -318 -209 -307 262 361 -470 -571 -322 -99 703 858 36 -334 -870 -806 215 33 -59 -651 -226 547
3018 547 728 761 204 -1001 -1086 -265 -83 398 216 -502 -295 641 791 352 -538 -407 -627 -278 1007 374
3038 374 -227 127 -94 267 350 157 -449 -1039 -480 409 570 607 307 -385 14 252 236 137 -814 -754 9 509
3060 509 853 98 36 -604 -667 242 355 -622 -538 -375 36 902 763 339 -332 -380 -209 120 160 188 -1008 -236
3082 -236 417 557 893 147 -867 -678 71 371 450 -249 -307 -473 444 1017 236 -701 -948 -824 -163 503
3102 503 182 -87 -213 278 695 428 291 -633 -1012 -110 59 591 672 -191 -526 226 461 198 -301 -818
3122 -818 -689 -423 594 541 53 198 -85 -256 512 158 -657 -467 -602 171 549 393 320 -468 -461 109 -204
3143 -204 188 -73 -535 176 522 495 651 35 -665 -504 -292 289 -267 -146 -163 -157 657 910 327 -326 -327 -599
3165 -599 -254 290 348 -218 -402 354 458 414 208 -557 -834 -426 91 457 297 -399 -214 199 294 358 -150
3186 -150 -361 -541 -75 689 440 42 218 -608 -362 221 -50 -289 -666 -468 296 605 726 346 -598 -86
3206 -86 3 163 177 -249 -780 -357 418 790 393 -74 -481 -625 171 378 19 -255 -111 -486 539 742 57
3227 57 -227 -835 -380 -176 157 212 -105 -459 102 414 701 172 -783 -703 -229 -147 572 168 -374 -196 293
3248 293 762 622 -271 -596 -655 -115 421 607 93 -135 -253 -28 217 254 27 -886 -276 177 328 613 136
3269 136 -444 -216 -86 445 405 -582 -590 -521 393 703 337 -95 -480 -386 176 318 -171 -431 -564 16 932 768
3291 768 621 -251 -555 -105 166 123 51 -399 -431 95 417 730 -22 -414 -429 -209 287 504 158 -110 -408
3312 -408 -234 642 -278 -211 -815 -626 69 565 496 142 -244 -127 177 368 269 -581 -799 -145 4 698 481
3333 481 -56 -298 -274 453 548 246 -483 -446 -478 320 791 427 134 -490 -192 309 341 2 -550 -821 -49 138
3355 138 709 406 -304 -447 -296 82 459 125 -276 -113 159 628 379 -151 -625 -863 -505 341 158 -197
3375 -197 -428 -142 275 812 312 -201 -792 -422 -207 375 459 -59 -589 -141 377 276 223 -389 -696 -573 101
3396 101 526 98 -301 -185 -125 359 521 -52 -174 -308 -34 214 411 135 -47 -580 -452 116 200 51 -494
3417 -494 -83 512 703 789 554 -232 -643 -363 48 179 -320 -460 -336 5 631 534 170 -295 -228 25 325
3438 325 104 215 -303 -190 298 668 605 -159 -796 -432 139 10 303 -112 -565 125 23 195 334 -425
3458 -425 -441 -228 361 684 223 -198 -216 -500 155 16 -292 -311 -547 -6 427 759 750 188 -42 177 258 -102
3480 -102 -216 -892 -693 -42 178 800 96 -225 -197 -24 409 251 -228 -390 -80 266 834 425 -68 -385
3500 -385 -561 -24 284 -73 -177 -750 -129 183 203 315 -78 -456 -221 57 104 583 -192 -70 61 174 212
3521 212 -255 -494 -780 -526 95 298 173 207 -3 167 419 323 357 -333 -422 51 111 313 128 -614 -161 150
3543 150 118 131 -16 -658 -347 48 333 616 381 169 -424 -170 319 44 30 -406 -622 153 305 125 -180
3564 -180 -412 -414 -24 -62 337 -298 -160 -128 497 433 645 -250 -635 -274 -56 132 114 -373 -442 28 317 579
3586 579 358 258 -439 -137 299 434 8 -212 -495 -218 171 146 -13 -621 -524 167 242 503 232 -183 -160
3607 -160 115 354 14 -172 -510 -279 -125 500 549 40 -229 -223 -71 88 -208 -187 -488 -378 281 643 559 47
3629 47 -221 -161 -114 199 177 -330 -503 -124 -156 198 312 -32 -249 -158 439 426 -9 -95 -350 50 521 209 -136
3652 -136 -114 -555 -129 318 -29 195 15 -111 -92 121 632 71 -630 -196 -245 -68 441 174 -396 -100 128
3673 128 166 235 -237 -675 -435 -50 468 189 -98 -226 -598 328 344 280 -243 -381 -385 42 352 318 -118 -331
3695 -331 0 150 357 43 -471 -382 -87 202 629 103 -103 -287 -163 186 271 -131 29 -300 -169 439 329
3716 329 -3 -176 -180 -283 -42 599 -52 -537 53 145 319 394 -219 -556 -42 -55 38 542 -75 -242 -262 -80
3738 -80 346 283 -301 -518 -389 188 472 328 345 14 -118 294 294 201 -213 -658 -182 -41 384 234 -527 -430
3760 -430 58 -57 361 19 -177 -43 -133 327 307 123 -89 -609 -385 283 99 16 -197 -402 208 282 312 149
3782 149 -275 -169 -229 178 544 -65 -207 -345 93 388 412 -140 -365 -542 -322 98 171 -218 -234 -331 331 486
3804 486 300 20 -171 -243 65 257 57 -116 -351 -187 196 84 54 -466 -450 -340 217 274 65 -313 71
3825 71 97 34 302 20 -355 -608 12 383 750 26 -187 -461 -308 118 -59 -89 -64 -398 74 340 360 104
3847 104 -111 -416 -265 321 -40 -317 -461 -219 11 273 173 110 -351 -217 -63 161 48 108 -250 -151 181
3868 181 430 -5 80 -306 -328 117 47 274 -80 -355 -164 182 259 281 -423 -335 -143 148 327 52 -144 -87
3890 -87 -180 -31 -73 -354 -129 -362 19 625 126 153 -63 -154 273 46 136 -11 -568 -384 -12 357 175 -258
3912 -258 -137 -54 -9 468 197 29 -188 -65 29 427 88 110 -414 -482 2 280 262 -284 -237 -179 256 405 -40
3935 -40 -82 -519 -154 163 166 368 -170 -258 35 343 345 -48 -491 -261 -296 67 350 72 -9 -39 181 290 233 124
3959 124 72 -334 -128 -152 22 -167 -181 -109 22 95 429 -73 -356 52 51 219 334 71 -165 -264 -25 55 -69
3982 -69 -324 -246 -452 204 409 -41 -23 -165 -273 -159 97 110 -254 40 -110 283 197 282 -29 -187 -143 68
4004 68 67 -62 -241 -314 60 84 427 -223 -332 -278 27 343 -31 -52 -53 -364 -60 379 146 -184 -562 -305 243
4027 243 -56 428 150 -128 -71 81 114 225 43 -518 -350 -26 446 275 -76 -128 -70 69 128 -119 -190 -312
4049 -312 -31 253 212 186 33 -379 -167 75 119 150 105 -44 153 231 425 33 -316 66 -331 -74 181 61
4071 61 63 -226 164 355 254 -180 -97 -422 -181 -10 -44 54 -354 -340 392 269 109 -188 -223 -78 -67 383 373
4094 373 -114 -211 -180 186 288 -17 -228 -190 -125 147 430 142 -8 -208 -308 49 134 -34 65 -219 -275 81
4116 81 302 42 -299 -35 -35 98 178 -78 -466 -36 -130 313 474 54 -122 -195 37 78 201 -68 -294 -340 61
4139 61 92 134 117 -158 -441 113 194 203 -267 -245 -212 91 368 218 -293 -300 -117 -14 235 389 70 -89 87 213
4163 213 265 -105 -109 -222 71 168 130 -46 184 -247 -56 314 191 227 -148 -514 -113 495 137 -18 -80 -241
4185 -241 -190 77 168 -82 -352 -88 -48 278 387 -13 -190 -250 234 52 122 -37 -445 -215 438 286 30 140
4207 140 -304 -228 318 -102 39 151 -60 -82 -8 627 -57 133 -121 27 158 52 217 12 -142 -51 347
4228 347 199 241 171 9 -215 297 -6 -43 -97 -362 -103 184 53 -11 -367 -287 -153 164 514 83 88 -203 -138
4251 -138 202 358 -250 -284 -83 -1 340 189 228 -63 -204 -192 52 268 -185 -136 -462 165 228 87 279 -272
4273 -272 -160 -97 194 403 -218 -88 -84 -53 208 77 -114 -255 -273 94 145 24 -39 -113 288 294 317 98 -147 -238
4297 -238 -136 162 158 189 -149 -262 29 223 310 -5 -299 -74 -62 497 247 177 -80 -43 27 -34 109 -162 -250
4320 -250 -111 -193 380 242 355 155 154 306 154 75 -156 -269 -286 -85 223 116 -17 -369 5 -356 0 110
4342 110 -462 -229 3 154 101 7 -7 -96 -181 29 358 117 -33 -336 -178 133 -114 -168 -324 -610 -34 323
4364 323 105 54 -41 288 82 235 28 -168 -242 47 150 72 202 -70 63 -43 255 132 24 -116 -221
4385 -221 -15 40 330 239 -167 -290 21 -11 27 190 -116 -156 119 232 316 281 -99 -39 118 -38 212 79 -223
4408 -223 25 43 473 365 369 -81 -307 115 56 351 55 -126 -357 -9 341 333 -1 -220 -135 204 408 218
4430 218 6 -309 -54 62 -7 180 -19 -297 -335 6 110 317 -45 -202 -374 33 100 166 -144 -154 -263 72
4452 72 126 181 -138 -148 -122 189 223 -10 -56 -450 -69 165 346 104 -55 -184 -106 74 6 -319 -131 -195 -133 156
4476 156 29 47 -97 -350 -111 -173 50 22 -338 -165 102 31 330 -39 -131 -104 -146 175 263 -65 -24 -171 57
4499 57 425 259 20 -107 -185 -198 303 -18 -14 -293 -206 0 127 69 -77 -235 -302 171 322 349 -27 -203 81
4522 81 106 262 60 -152 -101 -7 71 195 -230 -105 -305 -159 126 -28 -49 -155 -162 134 185 141 60 106 -215 9
4546 9 -151 97 29 -10 61 -93 -38 59 -197 -133 -74 -59 393 227 -195 -134 129 66 274 52 -192 -103 -39 129 119
4571 119 65 16 -369 -99 275 34 -37 -145 -10 -270 120 264 170 -358 123 236 -129 110 -67 -406 -382 -312
4593 -312 192 160 -276 -73 -105 94 193 357 120 -148 -139 105 -100 199 145 -137 -299 -32 121 333 6 22
4615 22 -192 169 327 161 -103 -143 -131 76 189 -2 33 -69 31 122 172 50 -39 -196 85 338 -121 132
4637 132 18 -67 80 110 434 324 -342 -90 -368 36 133 194 -54 -230 -18 321 351 -376 -7 -16 290 -57
4659 -57 142 110 -509 -424 84 -12 67 -262 -273 -274 115 314 284 21 -110 -26 -1 268 111 -181 -417 38 125 152
4683 152 77 -158 -47 -174 78 269 -103 -247 -364 94 180 190 129 25 -272 -30 357 119 118 -307 -165 -177
4705 -177 395 164 -169 -179 -186 -118 -123 282 77 -101 -81 -86 10 218 -212 -232 -223 153 55 200 7 -362 20 100 277
4730 277 -227 -243 -111 -54 123 222 83 -57 -256 -144 123 247 -54 -196 59 161 42 381 121 -95 -210
4751 -210 -50 142 250 245 -50 -90 -32 234 229 88 -161 -142 -95 98 109 -18 -242 -177 -96 127 168 -148 -155 -312 -191
4776 -191 208 -18 21 22 -395 14 250 145 41 -368 -337 124 52 136 -133 -115 90 -48 -73 158 -358 -144 116
4799 116 90 399 -108 -68 -148 -71 -59 292 -79 -381 -256 -273 64 229 -40 -47 -4 254 199 -36 286 -156 -93 -42
4823 -42 -74 40 -121 -125 -425 -81 181 -284 4 -145 -144 -112 131 224 -268 -36 -225 -176 159 27 -194 -34 160
4846 160 267 156 138 -99 -361 -275 253 148 40 -143 -468 53 292 167 187 -191 -15 -260 89 221 -79
4867 -79 -107 -44 -50 296 473 126 -94 -171 -226 -112 158 183 -103 -42 -168 88 55 99 -168 168 -254 436 382 98
4891 98 -189 -113 -95 62 321 -282 -303 172 -66 151 -75 -195 -302 -200 -29 112 112 -101 -212 0 162 -113
4913 -113 301 -132 -597 56 275 137 -52 -97 -85 -138 9 -14 -144 -257 13 24 53 374 24 -111 -173 86
4935 86 66 153 -29 -141 -255 45 207 78 41 188 -134 14 125 452 -22 -240 0 -131 455 202 -85
4956 -85 -73 170 145 121 59 -81 -253 -73 -157 157 120 -46 -378 -209 330 165 -56 -12 -184 -109 -8 118 123 -230
4980 -230 -242 39 226 391 -76 273 -47 185 171 361 194 -288 -350 -254 131 62 -183 -147 -318 252 494 57
5002 57 11 -124 -342 313 158 102 -69 -232 -415 83 70 -14 -154 0 -63 -72 146 -6 97 -199 -5 4 45 130
5026 130 -121 -327 -238 -163 34 0 -214 -341 -30 239 50 -272 -73 38 9 63 80 -121 -305 9 -158 -56
5048 -56 -321 -212 -117 -207 -139 141 244 -4 -23 5 188 232 138 -155 -160 -231 298 130 224 -131 -156 -233 151 141 30
5073 30 -3 -125 -93 143 -4 -40 -99 -157 -56 130 166 154 -116 -119 93 -4 52 -161 -140 -98 -95 301 96 177 127 75
5099 75 103 29 114 -39 -268 -335 -326 -41 217 -153 8 -220 -96 330 246 -95 -177 58 -291 63 -1 -65 -54 -282
5123 -282 -2 27 106 101 -244 -70 -15 51 170 348 -137 -99 -47 287 47 60 -146 69 205 446 -170 -376 -395
5146 -395 -256 186 132 147 94 -95 75 425 89 -72 47 -69 -30 260 224 282 -377 -241 -13 268 56 -339
5168 -339 -253 -25 85 269 76 -214 -254 -107 -186 222 194 -224 -25 -320 93 224 243 -68 -140 -159 106 191 -11
5191 -11 -376 -267 -73 -56 -21 144 -134 -121 -62 209 116 -79 -297 -324 -13 343 -60 -115 -81 -324 -108 127 -28
5214 -28 504 22 -325 147 187 321 269 -47 -230 78 311 238 30 32 -285 -111 267 152 46 -339 -49 77
5236 77 416 153 -109 -300 -195 -100 214 227 -82 -243 130 -25 34 201 -236 -78 7 323 152 68 32 -378
5258 -378 -316 211 86 40 -168 32 -290 21 123 -43 -241 -111 -115 31 215 71 117 121 310 -8 -60 -172 -126
5281 -126 229 21 167 286 -230 -318 -413 -317 43 113 -140 -135 205 128 118 106 -149 90 -139 -126 -19 -83 -321 -134
5305 -134 64 33 140 126 -102 -110 -199 -105 107 391 26 -159 -81 -4 232 -95 -365 -152 1 -91 407 5 -290
5328 -290 -177 -39 193 19 -31 17 -85 -15 216 -56 -59 9 -29 -5 64 235 18 -276 -56 82 -159 -62 -359
5351 -359 -104 -20 127 13 257 105 -217 73 161 278 -9 -109 -285 -222 111 216 92 -44 12 -175 173
5372 173 305 187 -205 -120 -48 222 233 114 -192 -176 -16 67 -111 -68 48 132 -4 27 371 -58 -90 -156 -29
5395 -29 60 82 -168 -393 -167 38 278 101 -270 -316 -195 185 333 123 1 -405 -76 50 341 251 -143 -94
5417 -94 -255 166 259 356 -150 -205 -216 215 134 118 -184 -48 -242 271 129 -120 -164 -383 -40 79 160 -76 -170
5440 -170 -290 25 296 212 97 -160 -120 -48 -112 233 -55 -183 -287 40 291 89 117 -311 -239 41 -315 -30
5462 -30 7 -105 -171 78 166 76 -205 -232 60 62 115 329 -80 -223 -143 -134 105 -2 -155 -297 -60 76 439 -2
5486 -2 -89 -237 53 88 -59 61 -183 -173 2 126 266 -63 92 -180 -41 73 282 -275 -243 75 -63 390
5508 390 123 45 -253 -174 49 311 15 -10 -237 -290 -210 223 109 91 -96 -288 176 90 292 -15 -174 -225 1
5531 1 203 89 -230 -81 -214 -92 108 285 1 -386 -118 -127 169 -128 53 -158 -152 -109 214 41 -58 -129 -146
5554 -146 33 108 77 46 -123 65 34 177 16 -357 -277 181 158 253 15 -44 -63 180 173 94 170 -214 24 189
5578 189 278 206 195 80 49 270 374 118 -118 -334 46 24 -124 67 81 106 -40 56 48 100 -263 1 -293 225
5602 225 157 45 -143 -271 97 113 166 -123 103 -304 -238 232 110 58 -150 -154 118 141 163 40 -300 126 27
5625 27 211 451 -19 -76 8 119 249 124 93 71 -266 158 354 194 -170 -73 67 23 1 110 -2 -371 231
5648 231 153 -47 251 -87 -160 -81 226 74 213 -166 -128 -42 307 135 47 141 0 27 92 298 -17 -138 45
5671 45 137 43 -247 -113 -149 -115 -95 159 -19 -39 -494 3 193 80 159 209 -46 -14 28 -16 129 -70 -248 -98
5695 -98 -212 91 69 102 -61 -13 11 258 62 80 34 -226 245 138 107 -333 -63 -141 109 137 24 -87 -209
5718 -209 227 -157 362 82 -131 -333 -73 119 34 -52 -35 -264 -41 17 -45 -43 -133 -211 -19 124 191 90 -41
5741 -41 139 153 122 165 27 -52 -145 -27 76 146 256 -264 -104 122 236 -213 -204 -43 -8 -143 19 -75 -188 -381
5765 -381 -56 200 245 211 32 -387 -22 65 153 110 24 -212 -53 190 178 38 -118 -84 -133 267 93 -175 -337
5788 -337 -157 -16 285 194 29 34 119 -28 138 178 55 59 -141 283 82 100 -187 -427 91 -277 88 224 -244
5811 -244 -340 -120 69 491 12 31 -167 -232 -31 196 207 -115 -259 -93 202 -13 7 167 -279 -252 44 38 -30
5834 -30 -238 0 66 227 355 91 -241 9 -6 185 417 -46 -118 -210 -5 147 -76 221 27 -15 -125 116
5856 116 235 -193 -275 -204 -176 13 148 58 -100 -109 -111 127 232 131 -176 -174 5 56 216 51 -193 -249 -3 530
5880 530 -65 38 18 -70 62 90 402 19 -197 -94 157 -19 108 146 -128 -75 82 335 -38 -340 -147 -49
5902 -49 71 -197 155 -16 -184 -429 26 85 -312 -297 -139 113 58 40 14 -67 -64 177 126 -10 173 -80 -376
5925 -376 -44 14 92 -232 -213 -275 -25 179 282 -27 -11 -28 56 339 -61 -153 -323 -74 -60 211 80 -57 -308
5948 -308 190 403 469 348 -383 -146 86 -14 262 178 -37 9 -47 44 216 133 13 13 -169 192 2 -362 -364
5971 -364 -229 -128 418 237 -21 -74 -159 264 5 -42 192 -305 -71 72 113 269 14 -323 -322 -47 347 -49
5993 -49 64 -181 -26 -151 91 92 -156 -239 -235 -150 22 21 64 -351 -225 43 27 168 -153 -17 163 -28 127 136
6017 136 -18 -178 -289 158 51 175 -111 -192 -71 239 76 -43 -142 -379 51 120 -10 41 -12 25 157 117
6039 117 182 -99 -218 -137 223 288 185 309 91 -114 -48 363 29 15 -177 -336 6 214 -17 4 -175 54
6061 54 -42 271 -50 28 -166 -47 157 32 31 -38 -108 268 293 128 -36 -319 -190 -61 254 -189 201 -240 110
6084 110 -163 269 251 69 -112 -125 107 148 323 -87 -11 -187 -114 200 74 76 -452 -142 131 84 225 -35 -100
6107 -100 -83 54 -90 186 -209 -260 -21 -101 90 14 -177 -105 -231 -3 297 -60 -158 -204 -222 120 287 89 -103
6130 -103 -81 137 -26 -105 105 -103 -81 9 41 229 -65 -201 -52 137 10 76 46 -172 -171 -114 148 233 21 38
6154 38 -283 70 57 45 -49 -269 -247 23 275 139 -49 -63 -170 157 245 0 55 -192 142 279 39 11 -207
6177 -207 -269 68 346 234 189 -213 34 55 -17 117 190 19 124 -49 121 -28 145 -149 100 100 14 91 51
6200 51 112 -107 363 28 72 195 -384 -148 160 -14 341 -38 -193 -298 0 -87 23 -86 -241 -55 48
6221 48 252 64 -239 -308 -76 64 420 144 -113 -229 -54 245 34 -50 127 -151 112 121 58 -66 128 -326
6243 -326 -161 -65 267 -166 -24 -274 -191 113 110 62 -52 21 404 360 139 208 -506 -84 -55 151 137 -24 -30 46
6267 46 26 264 89 -151 -97 -135 -73 50 167 31 -384 -97 -1 366 217 101 129 -290 59 -7 387 -73 -5
6290 -5 -186 -41 94 -77 15 -152 226 -67 118 -49 -149 -187 -59 37 35 -285 -62 -169 -67 185 48 -36 -89
6313 -89 -357 271 126 185 28 -383 -138 84 -39 218 -10 -335 -5 -101 207 218 -273 -72 -136 -18 157 23
6335 23 -330 -107 -216 18 226 -39 -262 -315 -81 -22 11 88 -44 -107 130 305 34 -51 -326 -267 63 47 255
6358 255 -9 -177 -287 -44 -143 268 -182 -20 -181 -18 68 1 43 -88 -265 -84 200 70 28 10 -519 106
6380 106 -5 64 -19 -302 -143 -23 -18 115 -34 -332 89 69 406 67 -76 -349 -8 34 -37 33 1 -148 151
6403 151 106 185 -36 -30 -98 -70 -51 203 -142 -26 -181 156 146 70 31 -238 -326 -139 -63 361 113 -305 -281 -69
6427 -69 125 570 -90 -121 -227 20 197 215 -92 1 -244 274 240 -48 72 -6 -120 -22 342 224 -52 -272
6449 -272 85 55 53 -201 -121 -128 91 108 341 340 40 -52 -56 -79 117 -271 -38 -115 -91 43 205 -106 108 -378 -175
6474 -175 81 -74 175 -159 -211 43 166 247 83 19 -96 -181 163 306 -115 -415 -334 -34 63 -88 -142 -126 -71
6497 -71 16 228 164 -463 -82 34 -41 100 112 10 -300 -81 130 191 188 191 -256 -179 70 243 80 150 -75 -75 -74
6522 -74 331 126 -129 -35 -87 -38 126 198 8 -117 -65 -10 135 181 -102 -155 182 -107 239 -54 -296 -140 -65
6545 -65 173 69 -191 -235 39 -66 319 461 -28 31 -250 -10 415 123 -163 -44 -80 -208 -35 21 120 -22
6567 -22 80 105 43 47 -230 -512 -10 7 294 -140 -226 -224 -231 273 411 22 125 -3 -405 -170 148 41 -357 -204
6591 -204 -102 101 171 296 -143 -227 3 -47 62 162 -26 -221 60 54 -64 50 -138 -334 78 414 128 -80
6613 -80 -93 10 -224 127 231 -295 -170 -161 -126 122 -152 -248 -336 -23 -141 76 195 -250 -21 81 275 251 225
6636 225 -261 -237 42 107 105 -102 -201 -317 50 -5 -86 66 -38 -187 -156 65 128 -28 -227 -79 332 210 295
6659 295 206 -256 -209 -77 212 181 91 -86 -43 260 100 222 166 -288 -169 154 4 -49 -214 -252 51 -5 366
6682 366 308 -78 -245 -84 28 270 153 458 -203 -89 170 209 234 -229 -267 -312 86 383 -52 -390 -209 -27
6704 -27 146 -50 131 -217 -228 48 398 69 45 -82 -285 -151 281 -85 -178 78 -8 39 169 267 35 -114
6726 -114 -84 65 28 -26 -87 -73 -159 -322 195 79 -165 103 -92 326 75 253 -33 -33 -262 -125 340 94 -280
6749 -280 -304 -74 9 29 160 -326 -157 -74 135 98 -39 -109 -88 187 -124 260 64 -219 -211 174 118 279 28
6772 28 -227 44 -129 -30 -88 -99 -154 -165 127 224 27 24 -83 -189 17 32 70 -133 -164 -69 253 99 48 -101 -175
6797 -175 -279 -312 130 95 -48 -47 -70 469 20 162 -34 -9 -55 235 355 -24 -49 -296 16 78 225 232 -336 -409
6821 -409 110 372 114 62 -29 -153 -43 86 116 208 -318 -135 -89 90 141 78 -179 -96 -209 213 -27 -167 93
6844 93 -24 -63 13 87 -171 27 125 -142 241 181 -2 -131 -107 137 72 -5 -58 -300 -160 -26 211 142 339 -213
6868 -213 -10 169 -42 53 -114 -360 -88 -47 90 -106 -367 -239 -53 72 -119 -59 -115 -30 -9 -128 153 142
6890 142 -197 -383 34 280 -133 66 146 -122 277 65 251 116 -221 40 12 -120 143 -66 -286 -150 142
6911 142 -43 -81 -90 11 -219 -269 271 118 -136 -178 -268 -14 158 29 3 7 -257 77 249 70 -179 -219 -57
6934 -57 -46 57 156 -102 -206 -32 153 156 33 -110 -497 150 211 -116 -36 77 -41 -55 40 111 131 -103 -7 -193
6958 -193 339 156 -150 -127 -158 15 59 222 348 -415 -98 -10 -17 161 -175 -150 -89 106 214 -75 -42 -77 151
6981 151 -190 -4 -172 -189 -261 -129 367 8 75 -143 -161 74 -74 -170 381 -350 -132 267 272 392 -11 22 -59
7004 -59 -27 170 -172 19 -69 -328 -232 -6 166 181 -186 -244 -79 147 -18 -267 -29 -40 209 144 190 -145 -319
7027 -319 -210 249 152 326 48 223 -101 -56 349 30 -449 -420 64 266 216 241 -55 -114 344 318 -36 -22 -144
7050 -144 -149 94 -77 169 -16 -105 -251 80 -21 -68 31 -191 -112 -70 -1 221 -61 -226 122 35 26 -47 230 -263
7074 -263 -400 -13 428 1 21 -79 -23 143 -143 115 60 -6 -100 358 135 190 -121 -50 -164 76 129 -190 -128
7097 -128 -258 -203 12 241 -35 -88 -127 -26 23 -89 -180 -25 -312 137 313 -229 89 -344 -61 61 294 53
7119 53 165 0 -137 148 -117 203 134 -126 -84 -150 248 -114 -34 -440 -107 86 131 191 -51 -180 -181 -96 -73 -21
7143 -21 -36 13 -59 101 23 38 -122 22 -42 110 358 -10 -139 -15 -25 67 220 -17 -31 -145 -89 66 320 175
7167 175 -86 -167 -70 229 153 28 -128 -145 46 192 133 -89 67 -68 -125 -33 79 -92 54 61 53 25 142 -153
7191 -153 -150 -17 298 168 -59 233 -25 -48 -96 -3 -79 78 -244 -241 48 239 89 -50 -308 -15 -197 165 -20
7214 -20 5 93 -79 -12 167 19 8 -69 -48 -290 385 -89 -172 -121 -30 304 39 308 -112 -389 -90 -93 54 6
7238 6 48 -90 38 190 55 57 -49 -219 -58 194 27 10 33 -275 -94 466 362 -124 -257 -183 -132 211 48
7261 48 -365 -222 -178 9 330 207 226 -135 -30 -86 154 164 -234 -12 -199 -129 204 187 -92 -200 42 59 131
7284 131 2 -144 -52 -120 132 271 -19 -28 -265 -104 256 77 40 -67 -423 184 119 67 70 -317 39 393 202
7307 202 57 26 -214 128 -28 3 7 -191 -119 -155 60 -55 -5 90 -63 31 225 308 130 215 -209 -148 140 119
7331 119 204 -208 -420 -175 35 133 72 98 -153 -257 129 127 -5 -108 116 -54 154 248 -1 -73 -174 65 169
7354 169 50 -206 -200 -335 -57 276 -121 56 -141 25 142 187 355 97 -377 124 -169 112 202 -243 -46
7375 -46 -221 -82 221 -82 -147 135 -237 79 529 241 109 -32 37 -29 42 187 53 -21 -128 184 237 49
7397 49 -4 -44 -132 14 108 36 161 3 30 198 424 -69 88 -127 -104 157 120 -194 -221 -71 -76 16 83 247 1
7422 1 -28 -113 271 -18 77 -344 3 -92 21 31 148 -102 -135 67 307 44 -49 102 -24 222 429 -41 -237
7445 -237 -144 -57 91 109 137 -56 -90 -6 257 205 137 -332 -72 -137 29 203 -86 -164 -151 29 -44 -55 -161 1
7469 1 -171 -179 -2 -144 -209 -71 77 -55 199 -1 10 -26 -7 116 119 44 110 -474 11 79 150 273 -51 -223 -45
7494 -45 20 177 192 104 201 -180 -4 -34 132 -144 -437 -169 49 -67 10 -172 -292 -57 259 1 30 -2 -187
7517 -187 -159 -7 136 -20 129 -31 151 134 146 -109 -46 -213 -154 126 68 -148 120 -291 20 238 20 -271
7539 -271 -231 -215 22 29 36 42 -173 -344 55 183 77 232 -208 -183 72 202 220 -163 -110 -168 -118 246 98 -106
7563 -106 34 -247 89 129 11 -47 -120 -285 38 -133 43 -126 -247 157 -127 248 6 75 113 102 202 123
7585 123 -102 -251 30 -259 383 214 -198 186 -87 -20 155 249 -197 -135 -259 -82 63 499 24 53 -131
7606 -131 -78 168 68 38 -185 -94 -96 191 8 -164 -199 -110 129 -48 -11 87 -209 -33 -283 -69 -81 45 26 5
7630 5 58 263 -224 -197 -36 155 120 281 112 -245 -39 277 9 46 -44 -337 -130 -350 24 190 -8 -90 -60
7653 -60 64 130 7 33 -55 -253 -154 249 -55 30 -132 -302 -8 156 42 -55 30 -105 -217 -43 98 57 -67
7676 -67 41 56 170 -45 -34 -1 -362 163 171 64 -185 -225 -151 211 77 19 50 -307 101 149 -38 195 84 49
7700 49 58 -102 311 111 122 -13 -8 -27 -26 1 109 72 -200 -146 119 -52 58 -271 62 270 20 -71 -257 -318 107
7725 107 15 135 44 -179 0 -9 -157 257 -31 -92 -125 -40 125 -124 224 88 31 -76 50 -30 -221 28 -166
7748 -166 -5 58 -77 -137 -377 -172 189 148 -28 -19 0 29 100 79 -82 -198 -59 73 37 102 401 -314 -129 -162
7772 -162 -80 79 171 -144 -173 -128 271 188 -24 165 -81 -38 -1 263 108 -100 18 201 63 49 43 -194 -237 201
7796 201 275 27 113 -64 -95 101 39 56 -202 -92 -69 -197 219 155 -2 0 226 35 -91 8 -186 -131 -69 143
7820 143 -15 -19 -321 -263 273 272 -13 -142 -22 -93 67 38 129 35 -244 83 87 157 35 -81 -54 -32 217 -64 214
7845 214 195 -244 -119 238 -69 55 84 -34 -50 -104 264 102 -19 104 11 -47 82 148 -213 -159 -21 242 26
7868 26 156 -24 -34 63 120 258 -5 -248 60 38 317 84 237 -112 -29 138 34 189 -49 -513 -402 -243
7890 -243 -106 180 -366 8 -171 116 39 -108 221 74 -56 303 95 172 184 -40 30 44 244 40 -358 -325
7912 -325 1 165 67 21 -97 -98 112 -63 -77 306 7 -142 -242 96 201 -249 -223 -182 -157 -87 -125 32 -142
7935 -142 11 -211 285 43 56 -272 -120 -26 -38 167 -309 -144 -40 158 -90 102 -23 -250 -137 73 314
7956 314 283 -136 254 -188 70 -27 -189 -303 -216 -241 -20 -150 146 63 -155 -286 109 93 -126 241 46 -207
7978 -207 -25 55 146 -159 -15 16 112 -153 18 57 78 -111 136 139 339 -49 40 93 186 166 -11 -83 -142 27 -62
8003 -62 -1 117 -28 -162 -212 -80 231 91 -95 -37 -55 238 158 80 -31 -80 110 277 322 123 -24 -125 17
8026 17 -142 -41 166 -137 -20 32 -153 -15 -217 -200 9 73 222 24 -207 -177 -115 43 167 62 -322 -48
8048 -48 -46 261 81 -78 29 -391 -236 29 112 -2 -185 -312 -44 211 91 -21 -113 -195 134 -150 302 44
8070 44 -181 -23 37 -154 -160 -54 -448 122 -59 59 -159 62 -61 -59 54 44 176 -8 -125 -124 142 3 488
8093 488 -26 -126 -56 18 50 120 -178 -76 -134 -65 127 261 -185 -43 -330 41 171 -190 -323 64 -57 104
8115 104 365 143 57 -157 -35 -24 138 -40 -166 -236 -322 277 -115 -229 -404 86 -142 122 350 145 -181
8136 -181 25 207 -1 116 -115 -230 129 -79 163 81 80 -273 -347 20 44 292 -112 -171 -118 -14 15 23 306
8159 306 278 -124 -99 -64 191 141 -180 -59 119 -105 -244 75 -81 39 170 -18 75 45 -302 290 67 -44
8181 -44 118 -69 -185 154 -119 114 -207 -368 -150 28
8191B8
$$ Imaginary data points
##PAGE= N=2
##DATA TABLE= (X++(I..I)), XYDATA
0 0 0 0 0 0 0 0 0 0 0 0 0 -8 8 -8 8 -8 16 -16 16 -24 24 -32 37 -42 48 -58 67 -77 88 -101 117 -133 149 -169
34 -169 190 -215 239 -270 299 -333 371 -411 454 -502 557 -613 675 -746 820 -904 996 -1096
52 -1096 1209 -1336 1479 -1639 1825 -2039 2290 -2591 2957 -3413 4001 -4789 5899 -7582 10420
67 10420 -16071 31571 -162377 -483005 -25855 148971 -48047 -4300 158552 64342 75951
78 75951 238917 86558 -235123 -176116 -48826 -143521 -122815 53770 104509 104347 128267 76293
90 76293 -15890 -2038 -14275 -166781 -190175 -13466 76453 103388 140353 70654 -6143 37158
102 37158 26173 -119654 -175893 -73479 -46344 -46591 115626 186080 40174 -10715 43576 -14877
114 -14877 -100354 -60859 -13424 -49788 -8607 115378 120244 67127 28973 -87023 -146297 -56088
126 -56088 -28282 -95602 -46519 88620 103801 97528 178970 85058 -136090 -101854 5290 -110185
138 -110185 -155425 16323 85572 13984 69784 144840 19627 -59868 -14 -83496 -177323
149 -177323 -30136 101016 39703 13374 96434 97125 14029 -4723 -44555 -140007 -108473 -6561
161 -6561 14103 33295 71540 61055 39759 31859 -13314 -80175 -72726 -33678 -52451 -1546 121664
174 121664 108898 30094 36748 20280 -71733 -104592 -57189 -62008 -85245 10181 103245 86381
186 86381 91027 88887 -11572 -76014 -41598 -33593 -82609 -66558 19449 50146 66812 102220
198 102220 37772 -48096 -33462 -38115 -88926 -63684 9783 28319 32206 86916 85823 14049
210 14049 8542 -8989 -110849 -109454 -6160 17589 -276 44004 80834 40176 16223 24620
222 24620 -47979 -112153 -60132 -20304 -11796 50484 92847 63154 32111 29673 -1001 -59045
234 -59045 -72347 -76072 -84736 -6511 78351 66649 51684 57352 21037 -22513 -28057 -38182 -82367
247 -82367 -67640 21065 48588 43266 78493 57121 -17144 -37717 -29995 -55103 -72416 -25799
259 -25799 19492 19236 57793 96624 45584 -8182 -25955 -59764 -73087 -35974 -614 -2175 13371
272 13371 68341 73316 37225 17526 -38596 -93790 -62866 -19116 -12738 6877 48543 61031
284 61031 42939 49790 32315 -49202 -81869 -55123 -50497 -22337 38626 55188 34564 36697 51848
297 51848 14794 -41557 -52046 -63368 -63025 -412 45819 43798 47563 46616 19999 -12120 -24867
310 -24867 -40925 -71133 -51649 812 21855 53213 79870 43412 -1529 -14410 -26522 -51326
322 -51326 -54975 -26699 -15211 3690 65557 80898 36166 8916 -16509 -50859 -52437 -28081
334 -28081 -19332 -23491 13521 63177 59270 43947 24912 -33123 -65093 -45373 -30689 -23007 1051
347 1051 31619 39186 42449 58546 26000 -36628 -51059 -52112 -53502 -14470 25313 29890 29102 45735
361 45735 47339 6216 -22405 -33986 -66617 -59316 -4382 24654 34157 47812 45535 21807 734
374 734 -5082 -33726 -68155 -49075 -15948 7069 47247 62107 34041 9863 -1300 -15501 -36249
387 -36249 -39291 -29656 -29826 3892 57958 59483 35905 15735 -18414 -39508 -34722 -28230 -34161 -28421
401 -28421 15570 49237 52138 53757 23859 -25604 -38000 -34690 -36986 -28686 -7046 15857 27586
414 27586 44147 53976 20852 -16245 -34786 -55262 -46736 -12216 8517 17360 27753 42618 40817
427 40817 17850 948 -29072 -61735 -46028 -13459 5603 24782 35790 32403 18553 9908
439 9908 4742 -28917 -53635 -40285 -22876 9010 50948 50917 23741 9873 9664 -4637 -35675
452 -35675 -44419 -43579 -38314 9590 50965 43428 33352 26313 3188 -19877 -28458 -31192 -38704 -23474
466 -23474 12922 22978 33698 54399 28976 -15716 -29393 -30642 -31531 -25556 -9112 3110 13626
479 13626 44509 54591 21881 -6339 -28302 -44455 -30505 -11969 -4735 5023 21571 38069
491 38069 32364 17395 3504 -30483 -51859 -38782 -18178 5883 24182 29544 34206 30932 21835
504 21835 2195 -30494 -44166 -42084 -33537 -822 27345 32584 29836 24468 16388 -4108 -22130
517 -22130 -23213 -35689 -38416 -1278 30611 39688 37102 17998 -4527 -13876 -13470 -24375 -42132
530 -42132 -24503 4488 14192 37160 50871 20913 -8058 -15600 -22693 -31297 -25186 -7306 -2175
543 -2175 10132 40466 42960 23468 5153 -28351 -45876 -29698 -14057 -9178 -1722 18659 34460
556 34460 33297 33705 16203 -25109 -43413 -37800 -23272 387 11490 13795 20022 25382 28132 11128
570 11128 -17414 -35668 -42847 -24781 6284 20390 24642 21831 18898 21418 4849 -18942 -30210
583 -30210 -38391 -29569 -4119 18957 34078 31563 19579 6182 -7958 -11154 -20452 -34796 -24143
596 -24143 -7783 8440 39029 46970 20374 -5702 -12865 -14133 -24749 -26295 -18109 -15929 8971
609 8971 41830 38000 22753 8984 -15522 -28269 -23237 -16571 -15804 -8113 14596 23842 26876 34714
623 34714 12160 -22816 -30460 -29992 -22341 -3411 8511 11514 16300 30239 31046 6196 -11528 -25000
637 -25000 -41774 -28817 -420 13148 18623 18850 19461 18471 9207 -2664 -24482 -41762 -29552 -6181
651 -6181 16102 29240 22173 15563 10442 3395 -3015 -20911 -34083 -26754 -13203 10109 32735
664 32735 32995 19839 4090 -4835 -9948 -20503 -21363 -21561 -19704 8217 32380 31764 24422 8742
678 8742 -11203 -21373 -19128 -14039 -18707 -13248 8854 20639 29930 34456 10534 -15417 -24730 -25246
692 -25246 -17400 -9247 -2430 4544 13838 30288 29417 9844 -4793 -23477 -34362 -19829 -4265
705 -4265 3480 10303 16735 21823 17664 10611 655 -24329 -34928 -23225 -8758 8778 20930 21798
719 21798 18516 11029 8176 671 -20195 -29093 -27000 -17945 6356 25036 26657 18560 7125 2082
733 2082 -5985 -15379 -17181 -24552 -19192 7246 22467 25959 25471 11182 -6240 -16229 -13820 -14712 -23072
748 -23072 -12120 4555 11256 27222 32525 11249 -8505 -16902 -17545 -16179 -11435 -1733 644 7745
762 7745 26606 26032 11773 -2257 -21873 -29866 -20620 -8059 2444 6755 14213 21742 19499 17417
776 17417 4103 -19927 -28188 -24352 -14408 2747 12571 15721 14180 11702 14226 3938 -14257 -22661
790 -22661 -26358 -16106 4927 18281 21968 15459 8413 6794 -2367 -10311 -16148 -25845 -18354 -74
804 -74 13840 24567 22483 9891 -2269 -10017 -8317 -12108 -18316 -10520 -2069 10112 28547 26558
818 26558 9464 -4792 -14282 -17395 -18128 -13379 -7006 -6156 8681 26887 25080 17762 5340 -14646
832 -14646 -22995 -18468 -8472 -3332 -1961 8145 14006 16537 19903 6115 -14760 -22622 -21097 -11322
846 -11322 872 8702 13215 10856 13132 16594 3994 -9698 -18574 -25537 -16292 742 13370 16742
860 16742 10719 9571 7405 -1057 -4595 -14459 -25489 -17015 -1113 14396 23299 19452 12007 804
874 804 -5812 -5886 -14628 -20461 -15718 -9199 6908 22702 23460 15311 2282 -6979 -9947 -12525 -9761
889 -9761 -10271 -10450 4585 17716 20100 17452 2393 -12245 -17324 -14242 -6594 -5214 -2819 6500 11289
904 11289 18584 20997 5313 -10521 -19015 -20221 -11312 -2332 5420 8463 7528 15596 16332 4672 -4343
919 -4343 -16496 -24809 -15850 -1414 10104 12234 10718 12019 7935 5001 1983 -14609 -24107 -17246
933 -17246 -6119 8552 17474 15755 9231 1396 2499 128 -11813 -15348 -15160 -10789 6608 18702
947 18702 19534 12241 642 -4734 -8164 -10516 -9063 -13387 -10289 4769 15631 21038 17370 3722
961 3722 -7142 -14215 -12778 -7303 -9435 -6832 2014 9128 18083 18742 9120 -4444 -16559 -15516 -8316
976 -8316 -3956 2473 2688 3646 14053 15194 7054 -3564 -15888 -19289 -12944 -1965 7835 7067 9427
991 9427 13483 9437 7811 550 -14495 -19117 -16381 -7995 4850 12545 14449 8278 3558 6094 -624
1006 -624 -9263 -12272 -17491 -11809 4703 15099 17694 12323 4047 -1324 -5285 -5161 -9457 -17003 -10539
1021 -10539 87 8224 17592 15041 4176 -5044 -9114 -5450 -4535 -6733 -4092 -545 8123 17798
1035 17798 15203 5813 -7193 -17487 -14800 -10833 -5974 554 1114 6611 16986 18159 12736 764
1049 764 -11622 -16748 -15831 -4829 2490 321 4623 8503 9232 11561 3312 -10091 -16224 -14090 -4610
1064 -4610 3371 8725 10968 4987 5955 9707 1334 -6314 -11817 -16825 -9701 1854 9904 11664 6624
1079 6624 2586 -1311 -3505 -2570 -9216 -12498 -4291 1953 11534 20013 14361 4588 -3646 -8671 -10547
1094 -10547 -12973 -11998 -10483 -6508 8247 17474 16529 13210 2404 -7135 -7183 -6377 -4992 -5278 -5009 1654
1110 1654 7561 11900 10084 -1234 -8629 -12201 -12168 -2732 1760 2245 5981 7036 9559 11115 3599
1125 3599 -6003 -13819 -12948 -5363 1016 8134 7913 1521 4384 6030 -875 -5781 -12714 -16498 -9292
1140 -9292 3824 14800 14846 10885 9655 2777 391 -943 -12327 -18881 -14753 -7518 4313 12389
1154 12389 11737 6345 873 1753 486 -3760 -4368 -7836 -5838 6187 10832 10242 5735 -3796 -8235
1169 -8235 -8465 -6122 -4645 -6267 -2729 4135 8659 14978 11300 -519 -6047 -10092 -8665 -2030 246
1184 246 1649 3077 5935 10451 7644 959 -7395 -16701 -15019 -6944 -1428 5616 7632 8681 12640
1199 12640 11352 7945 30 -11189 -14342 -11574 -4819 2217 2790 3560 3876 1376 4481 2513 -5626
1214 -5626 -7942 -6720 -1473 7657 11518 10350 3348 -2243 -1517 -5049 -7165 -7205 -10561 -5678 4725
1229 4725 10303 12716 7720 458 -4007 -6499 -4194 -3756 -5708 -1849 2735 8407 14969 10290 1210
1244 1210 -7227 -12711 -10149 -7127 -5816 -2920 -734 5912 13049 13557 9626 -153 -8121 -7109 -5308
1259 -5308 -2246 1059 -1067 130 3288 4369 4450 -2105 -8997 -9547 -6552 1945 7854 7496 7436 4775
1275 4775 3769 4753 -2108 -8458 -11209 -12075 -4186 4366 9133 8734 3388 1797 1150 -2495 -3381 -7472
1291 -7472 -11511 -4719 3710 10027 13400 9069 2523 -2516 -3842 -3359 -8556 -10392 -6945 -4013 4793
1306 4793 12119 9064 3793 -1010 -3412 -2044 -1750 -756 -1786 -2643 3735 7329 6356 2842 -5649 -10192
1322 -10192 -9138 -5706 565 2511 2004 5610 7847 9268 7248 -927 -7871 -11642 -9398 -1414 1703
1337 1703 3371 5059 3431 5385 5909 437 -5569 -10814 -10731 -3903 2560 7927 7381 3388 4674 3707
1353 3707 1424 -855 -8118 -10883 -7004 -794 6092 7277 4286 1201 -1736 -349 32 -3988 -4776
1368 -4776 -3779 -580 7519 10350 6895 2104 -4316 -6096 -5664 -4807 -3576 -5310 -2285 5601 8883 10531
1384 10531 7045 -1815 -6228 -7300 -4556 -1394 -2519 -1055 1908 4316 8779 7314 -220 -5969 -9238
1399 -9238 -6529 -1621 500 3070 2390 2267 6851 6367 1704 -3184 -8934 -8709 -3805 1804 5855 3398
1415 3398 1909 3280 2013 1843 -1104 -7717 -9207 -5727 994 7125 7582 6039 1964 -1355 531
1430 531 -1093 -5922 -6871 -7291 -2483 5229 8229 8066 2689 -1970 -1645 -2728 -2692 -3267 -6082 -2760 2984
1447 2984 7109 9010 4297 -1608 -4924 -5930 -2805 -1219 -2588 -1259 1106 5046 9128 6163 458
1462 458 -5007 -8566 -5933 -2350 -163 1455 352 3211 7128 5803 3266 -2588 -7837 -7194 -3524
1477 -3524 966 3138 1856 2911 2942 2907 4672 -1021 -7120 -7337 -5591 457 4711 5887 4477 548
1493 548 871 2106 -941 -3746 -6122 -7805 -2360 4226 7141 6789 2015 -898 -1688 -2518 -1368 -4116
1509 -4116 -6290 -2491 2378 8049 9009 4412 58 -3931 -5031 -1831 -3015 -5208 -3474 -1084 4481
1524 4481 7930 6933 2707 -4283 -5195 -2413 -1833 403 293 -1819 1617 5555 5462 2192 -3557 -7286
1540 -7286 -6851 -3193 2468 2339 1545 3563 3583 4792 4522 -1606 -6232 -7766 -5525 109 3239 4205 2947
1557 2947 785 2763 2597 -833 -3021 -7308 -7426 -1247 3465 6693 6005 3013 1502 -150 295 -1281
1573 -1281 -5986 -6397 -3792 -843 5022 6239 2797 570 -1888 -1691 -477 -1650 -2057 -2626 -193 4934
1589 4934 6262 5090 835 -4984 -5138 -4335 -3252 -478 -844 -947 3104 6166 6879 3534 -1571 -4862
1605 -4862 -6750 -3159 936 -45 855 2314 2229 4290 4456 -245 -5598 -7599 -4785 -1174 1671 4708
1621 4708 2355 1323 4436 3824 1520 -1565 -6247 -6600 -3181 1751 4510 2594 537 -73 -512 1270
1637 1270 -369 -3878 -4132 -3135 1558 6977 6286 3084 55 -2128 -1947 -2193 -3065 -4391 -5430 -491
1653 -491 4413 5823 6456 1765 -2853 -2723 -2159 -1439 -1531 -2742 -1071 1743 5104 6800 2505 -1548 -4384
1670 -4384 -5671 -2425 -501 -1109 28 889 2959 5569 4290 1089 -3652 -5124 -2816 -1114 1297
1685 1297 2624 -33 795 2977 1840 626 -2348 -5535 -5460 -2098 2900 4535 3153 3275 1400 549
1701 549 1861 -1450 -4881 -5649 -4689 -344 3636 4974 3991 171 -337 539 -980 -1622 -3425 -4445 -1161
1718 -1161 2494 5195 5503 1154 -1560 -2184 -2048 -740 -1881 -3222 -2271 298 5022 5935 2253 -337
1734 -337 -3474 -4193 -625 103 -507 -639 -38 3368 4470 3741 575 -4702 -5601 -3437 -1329 1041 1550
1751 1550 364 2396 3320 4108 2513 -2155 -5356 -5187 -3055 1198 2300 2084 1427 356 2703 2544
1767 2544 -801 -2881 -4842 -4217 292 3518 4320 2409 -148 412 90 -258 -1076 -4679 -4211 -866 2241
1784 2241 5330 4296 784 -774 -1844 -1042 -232 -2501 -3154 -2144 755 5048 4828 3050 -264 -4014
1800 -4014 -2872 -961 -1494 -1442 -1368 -601 2558 4655 4786 1245 -3072 -3469 -3225 -1655 1249 257 -288 1238
1818 1238 2318 3926 1951 -1497 -3708 -4962 -1953 1489 1636 1964 877 762 2988 2079 -442 -3028
1834 -3028 -5914 -4111 224 2587 3892 1797 915 859 730 1474 -1116 -4989 -3924 -1507 1210 4364
1850 4364 3117 1034 -593 -640 591 -996 -2167 -2349 -2876 614 4242 3983 2710 -244 -3048 -1964
1866 -1964 -1280 -592 -1444 -2495 -443 2311 3962 4739 569 -2742 -3389 -3218 -541 639 -866 -169 598
1883 598 2896 4533 2419 -832 -4367 -4805 -1277 63 391 822 242 1461 3723 3085 796 -2729
1899 -2729 -4538 -2489 -89 2539 2435 53 329 948 850 1320 -1660 -3960 -3411 -1447 1916 4231 3210
1916 3210 1618 -380 -479 443 -979 -2211 -3366 -3614 628 3298 3671 3251 111 -1561 -1007 -571 -536
1933 -536 -2042 -2819 -663 1585 4696 4827 771 -2006 -2712 -1813 26 -707 -1513 -1328 -265 3182 4466
1950 4466 1987 -719 -3014 -2609 -428 -35 960 261 -657 1759 3007 1653 54 -2940 -4269 -2770
1966 -2770 -442 2068 1474 1110 1321 993 2092 1915 -1691 -3434 -3609 -2018 1276 2445 2331 1209 -621
1983 -621 450 1013 -252 -1341 -3479 -3062 383 2407 4033 2412 -631 -895 -563 23 -502 -2529 -3034
2000 -3034 -1290 1182 4299 2781 56 -1274 -2091 -717 424 -890 -1503 -1483 754 3504 3580 2091
2016 2091 -770 -3340 -2253 -1197 -838 475 -757 -370 2134 2766 3074 852 -2067 -3038 -2747 -558
2032 -558 1409 496 610 425 627 2724 1696 -1439 -3026 -3728 -1739 1297 2302 1838 336 -198 1474
2049 1474 1002 188 -1702 -4170 -2541 533 2414 3060 1040 -225 -102 -94 604 -1076 -2857 -2181 -844
2066 -844 1849 3511 2116 973 -375 -1519 -555 -702 -1725 -1412 -1315 378 2412 3073 2577 -543 -2035
2083 -2035 -1292 -1614 -416 288 -866 -779 1441 2698 2765 1054 -1439 -3164 -3127 62 1126 120 194 35
2101 35 1191 3003 1712 -649 -3137 -3698 -909 931 1740 912 -593 643 1776 1507 559 -1822 -3612
2118 -3612 -1940 -23 1752 2336 798 37 47 570 796 -1338 -2293 -2014 -984 1787 2955 1890 1113
2135 1113 -653 -1028 -218 -521 -797 -2053 -2266 488 2258 3080 2543 -395 -1844 -1391 -724 484 -548
2152 -548 -1470 -443 1339 3180 2784 844 -1286 -3037 -1961 472 -400 -847 -406 85 1690 2853 1797
2169 1797 -655 -2335 -1599 -186 236 1377 435 -366 731 1256 932 -83 -1803 -2395 -1901 -513 2120
2186 2120 1949 1308 1122 -334 560 533 -598 -1662 -2756 -1992 947 2148 2310 863 -945 -731 -110
2203 -110 162 -684 -2804 -2029 326 1964 3918 2228 -741 -1061 -550 227 99 -1533 -2319 -1574 361
2220 361 2887 2003 162 -894 -2013 -255 877 671 486 -314 155 1889 1516 621 -1261 -2960 -2252
2237 -2252 -1411 -250 1518 408 488 1523 1525 2056 884 -1431 -2709 -2529 -242 1575 1057 1345 -130
2254 -130 -393 1133 1033 -284 -2318 -3443 -1614 953 1905 2460 280 -433 1023 1111 1067 -324 -2238
2271 -2238 -2028 -285 1312 1657 -258 -1120 -1183 -813 466 147 -762 -623 231 2085 3000 2005 735 -1276
2289 -1276 -2635 -1521 -1177 -763 -924 -1256 189 1803 2659 2525 319 -1516 -1319 -1060 200 356 -492
2306 -492 -326 -282 1188 2375 435 -1414 -2185 -2483 -321 1226 730 -184 -910 625 2091 1648 682 -1252
2324 -1252 -2023 -179 1245 1470 854 -774 -1336 -408 -264 -515 -1603 -2373 -791 551 2648 3128 1736
2341 1736 1338 -155 -631 41 -1167 -1899 -2591 -1929 149 1213 1954 1402 -815 -815 225 106 231 -413
2359 -413 -1150 -601 1059 2581 1676 -896 -1268 -1761 -830 834 221 -1026 -936 -242 1666 1856 365 -1130
2377 -1130 -1925 -941 1146 1209 1069 189 -349 834 1130 39 -1110 -3095 -2836 -1053 256 1501 1473 829
2395 829 898 1330 1688 989 -1283 -1895 -2001 -1299 687 817 335 -277 -503 368 692 226 -460 -1683 -751
2414 -751 1083 1786 1999 606 -1071 -890 -344 237 228 -1524 -1566 -50 961 2040 936 -752 -1338 -1072
2432 -1072 174 1253 -241 -403 305 1049 2381 1786 470 -1454 -2454 -1412 -773 -451 6 -495 -263
2449 -263 1765 2068 1654 391 -1254 -1451 -898 341 910 222 -114 -267 -30 971 238 -704 -1557 -1977
2467 -1977 -183 1624 1315 915 -151 -361 436 452 458 -1199 -2298 -842 913 1466 1594 -201 -942 -479
2485 -479 123 93 -476 -1641 -970 55 1767 2467 867 119 -822 -1178 -71 -144 -852 -1140 -1072 448 1592
2504 1592 1480 946 -549 -1208 -533 66 567 343 -764 -43 1030 1052 1337 -162 -2048 -1603 -848 656
2522 656 1067 455 52 -455 806 1820 551 -1003 -1770 -1567 7 1299 971 426 -237 238 575 757
2540 757 134 -1593 -2151 -184 421 1196 1222 290 -79 225 297 -86 -786 -1191 -863 -491 1221 1386 750 182
2560 182 -633 -686 254 193 -500 -764 -710 268 922 1605 816 -909 -1070 -912 -447 725 -98 -889 -38 499
2580 499 1555 1426 -415 -1273 -1735 -562 573 465 -86 -416 -387 1428 1567 293 -807 -1612 -1596 113
2598 113 1174 575 -280 -524 385 327 779 170 -1515 -1731 -549 427 1076 1313 449 -131 -52 836 552 -590
2618 -590 -1184 -1418 -706 1158 1134 508 -88 -1136 53 390 121 -284 -1184 -923 637 1364 1818 354 -1065
2637 -1065 -520 -523 -104 515 -711 -1160 -253 566 1507 694 -376 -1086 -1375 -111 913 -77 82 203 -172
2656 -172 1144 1078 146 -1104 -1527 -959 -435 279 860 84 134 829 875 1324 520 -1279 -1435 -1028 -94 823
2676 823 676 63 -557 -289 888 421 -266 -915 -1417 -425 874 1156 738 80 -846 -252 201 349 -373
2695 -373 -1512 -679 586 1123 1495 -18 -963 -798 -603 394 216 -689 -684 -13 1064 1875 814 -84 -871
2714 -871 -1542 -452 -206 -253 -674 -960 42 1217 1612 815 -468 -879 -401 -380 775 606 -804 -571 197
2733 197 501 866 -7 -924 -1322 -592 801 986 210 109 -406 148 910 507 -594 -923 -1222 -113 853
2752 853 997 377 -249 -494 4 245 209 -749 -1407 -299 359 1669 1753 207 -22 -325 -210 301 -291 -764
2772 -764 -1331 -766 559 1124 519 -5 -906 -215 219 485 415 -377 -430 119 712 670 398 -769 -1288 -968
2792 -968 -130 544 223 -361 -62 118 1061 1179 27 -833 -1249 -782 572 643 726 49 -275 411 575 173
2812 173 -382 -1721 -1109 -58 417 1016 527 -35 103 269 592 447 -599 -1156 -858 -62 776 388 -73
2831 -73 -365 -603 71 607 -151 -572 -748 7 1047 1164 939 107 -1176 -374 -171 88 -20 -898 -704 229
2851 229 774 1226 492 -610 -852 -844 206 478 -201 -347 -368 319 1172 977 -124 -927 -1317 -592 149 -49
2871 -49 163 -606 68 514 1000 586 -72 -1062 -734 -55 449 755 72 -477 -282 28 517 11 -720 -1017
2891 -1017 -388 448 1321 531 534 -149 -345 260 219 -525 -823 -1155 -9 694 1047 764 -331 -570 16 315
2911 315 443 -71 -983 -549 162 1143 715 42 -65 -776 -764 350 232 -214 -665 -324 442 952 612 22
2931 22 -770 -669 2 158 408 -7 -678 -39 641 690 734 -614 -1326 -867 -379 665 630 -58 -78 -4 795
2952 795 952 -94 -442 -818 -841 236 664 740 -82 -140 130 401 424 141 -881 -871 -229 572 843 794 -140
2973 -140 -339 95 87 362 -262 -911 -758 248 1032 1030 117 -273 -783 -260 265 -404 -165 -635 -558 618 1045
2994 1045 413 -31 -691 -781 -172 21 508 -250 -681 100 522 1148 735 -599 -889 -433 -186 462 183 -235
3014 -235 -225 -307 537 748 165 -198 -837 -519 477 566 448 162 -307 -36 640 314 -107 -962 -742 -355 411
3035 411 1024 442 -236 -114 -155 124 243 -395 -751 -564 -172 984 424 38 -325 -841 -282 250 -123 -108
3055 -108 -421 -389 735 667 961 75 -401 -588 -267 255 65 -560 -596 -61 183 971 789 -485 -979 -638
3075 -638 152 432 -55 78 -377 33 1074 636 39 -569 -1089 -849 127 300 470 -270 -250 301 314 1032
3095 1032 81 -1008 -581 -401 198 808 236 -248 -293 44 370 270 -397 -728 -824 341 985 390 322 -519
3115 -519 -676 208 281 -90 -173 -965 -161 182 787 633 -99 -474 -182 -6 491 -234 -687 -344 -45 673 1088
3136 1088 459 -160 -695 -413 285 -35 -196 -259 -454 -11 1064 660 472 -61 -653 -203 89 348 78 -358
3156 -358 -19 -109 345 721 -178 -642 -677 -274 422 839 461 95 -531 127 566 96 -292 -730 -926 204
3176 204 489 546 295 -564 -391 145 254 -1 -431 -833 -298 412 924 711 -133 -357 -298 -113 630 130 -552
3197 -552 -716 -236 405 875 448 -275 -780 123 175 248 217 -243 -499 -12 562 357 96 -887 -727 -245 177
3218 177 537 -212 -445 -18 124 869 741 -298 -562 -565 -198 487 294 143 -180 -463 421 502 112 83 -882
3239 -882 -419 392 584 587 231 -187 -8 137 661 236 -742 -464 -232 272 1009 546 -118 -314 -82 70 247
3260 247 -398 -173 -399 -122 667 834 415 -163 -819 -180 7 170 66 -618 -484 -146 508 760 89 -216
3280 -216 -283 -286 278 235 -79 -393 -26 113 543 234 -308 -773 -671 240 466 406 255 -515 -126 440 417 45
3302 45 -496 -882 -199 189 383 730 101 -162 126 489 372 -224 -707 -616 -473 250 569 109 -339 -247 -210
3323 -210 308 370 3 -389 -645 196 670 438 518 -377 -601 -153 267 287 125 -478 -41 284 468 448 -18
3344 -18 -474 -620 -219 470 100 -160 -273 -233 723 636 416 -188 -821 -635 -140 -122 249 -124 -599 19 606
3365 606 475 671 -37 -342 -178 -206 535 406 -276 -205 -168 271 318 -360 -419 -783 -369 499 370 542 196 -433
3387 -433 -175 429 -27 109 -405 -612 19 354 575 200 -452 -386 -202 -195 301 -161 -596 -194 342 663 612
3408 612 18 -160 -248 -92 509 -332 -307 -618 -530 602 425 203 88 -322 -149 561 216 300 -299 -369 -115
3429 -115 218 583 291 -422 -1178 -395 417 511 192 -177 62 171 521 459 -112 -139 -642 -143 358 374 406 -264
3451 -264 -558 -64 144 15 -334 -699 -746 -39 321 637 130 -107 144 -36 638 365 -325 -282 -431 190 499
3472 499 509 -140 -345 -365 133 551 189 336 -157 -42 549 566 516 -57 -555 -290 -135 248 124 -161 -425
3493 -425 -85 393 719 130 -215 -239 -499 209 424 266 37 -173 18 743 307 -139 -539 -832 -487 13
3513 13 502 358 -171 -187 353 348 484 150 -195 -59 94 221 397 -178 -403 -271 -159 440 77 -239 -311 38
3535 38 313 895 453 65 -557 -374 24 204 -207 -301 -565 -46 520 649 136 -285 -303 -330 80 504 -22
3556 -22 -260 102 214 614 656 161 -247 -462 -166 12 353 -140 -466 -485 40 420 78 161 -267 -384 101
3577 101 466 465 164 -218 -232 149 139 161 -615 -469 -172 -166 490 648 -34 114 -101 -144 439 97 -517 -694 -653
3600 -653 363 530 208 119 -50 -4 174 65 122 -447 -806 -107 298 693 326 -251 -222 -79 12 276 -79
3621 -79 -241 -117 -91 204 362 58 -698 -320 193 64 56 45 -262 -16 199 328 -150 139 -597 -476 -9 36
3643 36 330 -90 -198 83 15 245 446 18 -305 -356 -86 325 511 -57 -52 -14 -108 29 161 -261 -535 -452 194
3666 194 353 316 -69 -455 -97 205 236 45 -378 -301 38 -16 599 358 -320 16 -316 121 134 -237 69 -181
3688 -181 -44 583 337 -15 -248 -481 -218 361 192 82 -142 -406 371 318 178 107 -391 -218 31 277 301
3709 301 -198 -269 -330 585 399 237 -98 -276 -300 -24 505 159 -367 -372 243 421 290 147 -409 -573 -92 216
3731 216 311 292 0 -122 93 157 340 20 -184 -353 -117 -7 355 54 -199 -333 -220 339 669 -427 -321
3752 -321 -479 -72 199 429 260 -310 -243 -5 -227 -15 -94 -454 -110 272 340 252 -42 -398 -363 -171 316 58
3774 58 -272 102 -67 339 387 259 -168 -723 -165 -2 -24 75 -113 -159 390 366 55 80 -245 -163 158 321 377
3797 377 194 -325 -467 -388 225 550 -178 -398 44 -216 271 483 185 77 57 -172 212 155 -293 -317 -350 1
3819 1 201 208 52 3 -146 44 35 321 -27 -428 -169 -67 308 349 -212 -127 -349 -284 323 93 -112 -231 -223 360
3843 360 260 -71 -187 -356 -56 83 254 231 -38 -148 24 346 -60 84 -392 -414 -213 274 376 257 125
3864 125 -56 30 85 395 -353 -103 -444 -36 280 289 21 -262 -187 222 415 93 -315 -404 -295 310 234 366
3886 366 131 -82 -149 302 490 289 -165 -273 -165 0 173 221 63 -545 -544 244 323 350 123 -232 -7 382
3908 382 347 134 -176 -612 -235 -192 50 88 -234 -272 234 471 342 174 -328 -204 -68 178 425 -81 -199
3929 -199 -407 -164 583 67 -133 -528 -510 147 5 312 281 -381 -347 76 234 273 116 -206 -411 -34 146
3950 146 215 -27 -468 -273 21 354 99 -136 -208 209 166 657 279 13 -134 -405 171 27 -59 -365 -379 -144
3972 -144 204 272 37 -137 -108 -6 160 4 -87 -296 -57 -15 382 430 53 -101 -421 -147 78 233 -96 -177
3994 -177 31 -70 262 -40 87 -146 -133 180 -2 242 -79 -146 -101 160 139 96 7 -338 -337 250 224 -101 -83
4017 -83 -10 -286 139 264 215 -97 -413 -297 -38 214 301 -229 -239 20 441 253 65 -218 -388 337 70 312
4039 312 126 -255 -272 -176 111 36 -255 -123 -12 -166 464 272 -40 -145 -515 69 281 67 54 -270 -61
4060 -61 199 261 239 156 -398 -107 -182 110 219 301 -264 3 48 80 195 197 -267 49 261 185 -1 -355 -263 -157
4084 -157 -13 76 30 -258 -195 -162 257 184 185 -147 -417 -21 171 -46 -136 -329 -311 -170 394 119 177 -22 -461
4107 -461 -38 542 -69 -18 -68 -75 62 273 165 70 6 -481 -226 119 189 -81 -3 -34 -20 435 300 -105 -528
4130 -528 -453 -118 102 274 -103 -396 -118 361 547 34 -308 -353 -120 171 503 219 -183 -195 69 251 402
4151 402 152 -554 -174 67 241 396 81 -82 -255 398 297 582 75 -118 -131 270 198 316 81 -315 -300
4172 -300 -161 277 131 11 -166 -173 129 390 292 -112 -187 -365 -161 108 -269 32 -461 -391 327 385 211 -156
4194 -156 -370 29 68 351 249 7 -180 20 221 342 281 31 -437 -159 -52 -124 -28 -117 -353 256 -80 357
4216 357 252 -407 -284 57 268 264 72 -234 -27 -234 14 -6 -160 -446 -204 -10 238 332 278 16 -375 95
4238 95 31 3 53 -608 -274 -19 548 132 30 -342 -96 217 274 278 -393 -259 -30 201 147 -53 -205 -176 -71
4261 -71 78 204 -38 -93 -249 -101 265 248 153 -134 -294 -29 93 15 53 -49 -206 -154 31 71 364 -392 -319
4284 -319 140 181 67 195 -201 -130 -108 323 468 -428 -251 -146 10 110 -30 -247 -94 -67 278 -21 -134
4305 -134 -222 -8 -196 -22 117 283 -355 -188 -109 95 298 8 -258 -294 101 211 217 -161 -64 -52 -247 427
4327 427 171 -238 -18 -371 -82 244 -37 184 -64 -644 -157 206 143 196 16 -212 369 242 392 -136 -294
4348 -294 -42 81 58 293 43 -275 14 63 322 -23 -410 96 -264 159 285 -99 126 -194 14 55 48 95
4370 95 2 -125 201 72 253 1 106 -64 190 87 122 -81 -185 77 -9 68 429 168 49 -208 -162 245
4392 245 120 37 -177 -377 -27 130 381 164 -82 -279 238 236 248 -69 -163 -173 152 184 369 -99 -88 -119 -72
4415 -72 461 -196 80 -335 17 194 262 68 -311 -415 -67 243 66 -90 -89 -162 -134 344 543 284 -189 -425
4437 -425 -42 -105 52 76 -307 -392 45 61 205 139 -32 -182 -126 324 335 -58 -152 -465 123 206 79 -106 -38
4460 -38 -56 118 -44 121 -21 -451 -293 96 149 23 -322 -373 -146 69 107 331 -259 -458 -169 13 276 25
4482 25 -118 -26 -59 34 184 118 -202 -225 -78 338 77 193 -66 -210 -219 39 365 57 16 -206 -164 177 418
4505 418 97 92 23 -224 342 111 -9 -172 -227 -263 83 103 340 -159 79 -164 368 398 -51 -343 -306 149 25
4528 25 200 -11 -118 -77 -95 182 73 -175 -70 -196 -134 268 -54 -72 -209 -319 291 2 89 -91 -156 -186 195
4551 195 136 212 -54 -214 -408 -38 -7 315 16 -247 158 25 277 122 -57 -209 29 291 244 -123 -107 -204
4573 -204 19 198 114 -219 -142 -266 153 61 54 -110 -150 -65 237 160 6 -195 -334 -5 -48 61 -27 -259 -72
4596 -72 23 1 274 -9 -106 139 -153 80 479 -115 -87 -94 -96 -82 206 -175 -306 -350 -186 195 89 -5 -173 -101
4620 -101 -109 -64 162 54 -328 -344 -6 375 162 -10 -451 -161 -144 54 70 78 -197 -182 145 96 67 -1 -195 -113
4644 -113 53 348 263 -4 -258 -240 -33 168 129 -107 -138 1 221 457 282 -83 109 -279 267 212 -213 -107
4666 -107 -76 -35 342 14 20 -130 -407 -22 149 162 -17 -244 -367 155 296 212 -148 -424 -249 -70 -40 67
4688 67 -43 -135 -47 -181 457 37 -50 -92 -365 94 391 2 -16 -2 -199 146 146 -31 77 -364 -103 -25 277
4711 277 145 105 53 294 182 350 33 -161 -45 -98 161 414 148 34 -160 12 213 -45 -205 96 -113
4732 -113 39 273 326 -86 -97 -237 105 136 25 -102 -243 -115 82 9 198 -122 -194 53 -67 5 -75 -91 -284
4755 -284 93 26 348 144 -220 28 -103 -103 53 -23 -59 -216 -186 -179 -129 119 119 -333 -18 148 182 78 -313 -72
4779 -72 46 -33 145 -138 -299 -404 -53 441 111 -27 127 -14 34 132 274 130 -180 -77 -7 227 192 -106
4801 -106 -341 -208 50 259 -77 -111 -245 -81 45 89 208 -113 -193 -126 -39 -148 -19 24 -25 -103 204 260 107
4824 107 26 -269 82 -23 352 89 -229 -388 -57 108 144 248 -254 -317 155 144 217 72 -182 -175 -173 -58 136
4847 136 -69 85 -186 174 48 127 371 102 -271 12 53 228 -247 -207 -216 -92 58 223 -25 -236 -177 98
4869 98 185 120 207 -244 -494 -36 345 161 158 106 -133 248 11 120 133 -386 14 -1 153 192 183 -219 -53 15
4893 15 52 152 67 -285 -4 73 45 265 -194 -112 143 -28 23 137 -86 103 -32 -57 -70 94 -3 -268 78
4916 78 223 269 181 17 -69 -27 56 64 -392 -185 -96 -151 257 186 -18 30 -182 -267 -46 -152 -84 -62 225 -20 243
4941 243 215 -258 -113 -171 -69 56 87 -27 -74 39 602 206 186 -362 -287 -20 43 33 -46 -148 19 -135 286
4964 286 327 -76 -173 -397 -323 270 178 158 -108 -161 34 42 366 -241 -311 95 -51 70 90 -78 -375 -220 -19
4987 -19 302 263 130 -44 173 215 190 109 -290 -9 -133 -229 198 96 -308 -248 -85 134 -5 161 -61 -343
5009 -343 -73 155 77 -34 -265 -175 -74 -8 159 -53 -240 -293 30 15 512 -109 -21 -10 25 283 78 129 -40
5032 -40 -178 28 175 -8 -2 -175 -239 162 412 38 -161 -88 192 321 98 189 264 -181 37 54 251 -4 -147
5055 -147 -257 88 277 211 164 -87 -7 22 62 151 83 -58 -160 -206 154 265 134 57 -157 102 311 68 110
5078 110 29 -644 -52 253 126 150 -224 78 115 433 36 -74 -305 -136 -94 62 195 -275 170 -399 17
5099 17 117 36 34 -214 -65 158 83 -2 130 -208 -33 -135 226 185 -164 94 -144 -218 169 142 117 -176 93
5122 93 169 105 11 -229 53 -124 132 82 -1 -73 -99 -30 268 72 -40 -145 -110 -53 17 236 16 -230 -109 115
5146 115 218 515 -210 -277 -187 -52 -165 158 -67 -148 -323 213 176 -30 -35 -247 -81 149 50 209 51 13 -45
5169 -45 71 175 199 -7 -176 -13 -123 35 -26 257 -142 -60 23 185 -40 -113 42 -194 220 53 278 54
5191 54 -281 55 109 -45 196 -304 -150 247 40 134 -141 -205 -51 13 -53 180 -68 -109 -214 39 211 -6
5213 -6 82 -43 -294 2 256 -7 -163 -245 -7 31 141 94 -22 -53 -41 74 112 -163 61 -40 54 77 -27 -41
5237 -41 138 -37 -71 145 244 41 -25 -361 18 4 -132 127 -309 -177 -89 132 256 290 -52 -99 5 493 103
5260 103 -200 -360 -117 24 193 64 48 -139 -213 -132 213 105 89 -232 -113 36 174 249 -358 -305 -110 125
5282 125 130 70 99 -107 -27 172 254 -149 -42 -246 -154 4 78 -154 -242 -54 -155 25 350 261 -267 -294 -180 -29
5306 -29 139 90 -28 113 195 76 216 -21 -194 -307 95 11 120 260 -66 103 209 386 45 114 70 90
5328 90 -102 164 161 -68 7 -25 48 94 204 -65 -152 86 211 394 -27 -137 -84 -104 -66 73 290 94 -281 -183
5352 -183 134 128 198 34 53 -46 90 123 -16 -17 29 -171 107 248 -104 -182 -189 -74 246 90 96 -18 -90 -37 209
5377 209 270 97 -105 -72 99 -54 93 89 -243 54 38 65 173 106 -176 -196 19 189 150 -148 110 6 232
5400 232 192 341 -21 -187 -27 207 299 -88 -57 -360 -49 130 314 113 37 -11 -2 200 120 -40 -256 -173 112
5423 112 -80 284 -103 -218 64 -87 38 274 -65 74 -273 121 106 204 -160 -245 -225 126 95 135 124 -11
5445 -11 -84 21 44 250 -165 -257 -283 -32 209 -116 -113 -14 -69 214 100 70 241 88 -207 104 84 -297 -283 -298
5469 -298 -101 74 287 -109 -371 29 66 -103 27 68 29 -228 -122 179 315 65 -191 -273 30 298 2
5490 2 -122 -253 -21 247 372 -47 -200 -325 -193 223 232 116 119 -154 127 181 191 394 -49 -10 -292 -83 382
5513 382 83 -46 21 -227 -42 238 53 58 -9 -89 600 216 115 180 -430 -68 120 352 -78 -423 -110 -140
5535 -140 206 243 173 -59 0 -50 -43 253 -57 -216 -59 143 109 383 -182 -271 -71 176 191 -32 233 -78 -35
5558 -35 365 324 38 -15 -225 -77 -35 40 244 -191 -222 -63 12 125 63 7 -140 235 -55 193 -75 -208 -104
5581 -104 -67 -46 110 -243 57 -54 61 84 66 -163 -61 -203 14 205 -12 22 21 186 -94 147 162 50 39
5604 39 10 -135 -66 326 54 -225 -210 90 347 -38 215 -73 -237 -128 345 141 116 -132 44 161 128 -15
5626 -15 -211 8 174 -294 180 115 -409 -255 88 54 -23 123 -225 -110 -227 335 -171 -63 -273 -222 41 367
5648 367 146 -145 -119 -254 181 74 153 30 42 -232 136 198 69 -147 -86 -20 28 126 328 -152 -52 113 32
5671 32 143 43 -174 -105 9 106 235 65 -80 -237 -47 270 135 -54 -107 90 -8 202 398 86 -59 -333
5693 -333 118 -115 71 -14 -54 -219 -217 28 254 -226 -269 -211 13 232 284 211 -268 -56 -16 349 270 89 53 -226
5717 -226 30 129 109 -242 -222 15 198 227 43 85 -71 -55 -105 220 362 -133 -71 276 320 103 95 -100 -271 -134
5741 -134 111 173 72 20 -205 -22 160 167 247 -205 -339 -95 217 77 -38 -119 -164 221 -116 69 45 -300 -52
5764 -52 -38 177 42 -40 16 -147 163 -23 -71 -24 -226 10 -64 -152 119 -57 -143 -239 123 284 299 -273 5 -175
5788 -175 -65 141 191 -293 -97 32 72 174 62 36 -156 -13 261 225 25 -98 -297 -14 320 170 -74
5809 -74 110 -236 58 159 34 257 -225 -178 11 -21 188 77 -47 -213 -35 11 44 -87 56 -94 -114 209
5831 209 -31 -166 -424 -33 132 174 247 -340 -80 87 -4 179 232 -37 31 -7 -190 167 216 -247 -80 -56 127
5854 127 69 -61 219 -157 -155 141 143 88 -156 5 -16 15 164 114 -80 -248 -25 -23 247 -153 -86 -277 -354 -100
5878 -100 244 -50 -257 194 -24 317 277 -56 -97 84 132 -281 110 -21 -21 -39 156 105 422 -103 -252 5
5900 5 -40 204 171 127 -170 -24 17 366 213 -46 53 -12 57 224 18 -381 -137 113 124 118 -121 -283 -47 -127
5924 -127 181 41 43 -263 25 -47 3 -18 52 -121 -370 -140 -156 121 237 -71 8 -63 271 104 -101 -33 -81 -20
5948 -20 331 26 -230 -73 -321 -54 -98 59 41 -136 -295 35 167 164 -59 -45 -10 -24 230 -33 -138 -28 -172
5971 -172 59 205 271 -114 98 -92 242 1 131 -193 -162 32 230 142 -82 -198 -56 -42 62 302 -108
5992 -108 217 -14 -180 45 414 -10 -104 -389 146 -11 419 70 -217 -123 -192 265 25 -16 -368 -271 132 356
6014 356 100 -39 -194 14 116 385 -18 -232 -90 -10 151 162 111 19 -233 -238 34 -4 109 -78 17 -190 128
6037 128 308 -104 -373 -249 -52 -124 208 -7 -66 -234 -206 311 254 110 77 -395 35 214 -32 -149 -219 -63
6059 -63 -2 237 94 2 10 1 -173 88 177 -180 -73 -149 50 90 18 -84 -197 -76 240 168 -44 81 -216 -154
6083 -154 146 131 55 -206 -335 -73 324 357 42 89 -125 -108 89 356 -144 -45 -392 -111 44 -132 47 -9
6105 -9 -523 -65 1 -132 -102 -119 -198 119 8 157 -163 -190 -16 81 232 62 -213 -346 -16 -87 115 208 75
6128 75 20 -242 146 323 166 -160 -316 -149 18 416 45 -8 -187 -58 374 -117 183 68 -262 -103 98
6149 98 -183 -9 -189 -173 -221 192 468 302 -368 -52 1 118 283 -84 -417 -264 31 224 -142 152 -301
6170 -301 -259 16 302 -148 172 -94 -125 263 182 18 -6 -192 -405 111 284 57 -139 -242 15 169 54
6191 54 38 -366 -132 -7 19 17 332 16 -378 -91 -107 18 -204 -301 -212 -118 405 79 9 -301 -178 -38 -57 -58
6215 -58 -37 -144 -397 175 99 13 39 -170 -104 177 295 358 124 -102 -247 188 174 468 54 -203 -171 110 -18
6238 -18 -30 67 -241 15 137 129 48 -11 -384 125 -35 261 87 66 -114 138 -4 212 44 -103 -94 -150 175 77
6262 77 -95 -318 -473 -42 -14 106 34 -173 -11 -136 220 258 -94 -217 -122 -26 114 218 -268 -382 59 135
6284 135 97 79 -40 58 -143 -122 101 94 -193 -257 -62 279 127 -28 -192 24 54 -67 400 43 -12 -170 110
6307 110 -16 146 3 -76 -117 -7 -13 125 -224 -355 -259 -177 140 -122 -23 -52 -97 -289 -262 242 92 -73 -39 -54
6331 -54 124 249 -15 -221 23 -237 -175 349 -142 -147 -98 165 254 -61 233 25 -218 -20 272 41 -82 -220
6353 -220 -211 229 563 -82 -100 89 391 240 375 45 -93 -138 -218 68 181 10 -19 -276 -48 17 23 286 132
6376 132 -376 -173 -35 348 92 -307 -491 102 157 111 101 -187 -203 -17 128 159 -36 40 -53 -162 136 148 5
6399 5 -170 -36 87 26 341 -126 -20 -98 -70 71 -28 65 -1 -124 -200 -114 146 34 -166 -95 159 -11 -36 74
6423 74 -231 -90 -127 36 -73 43 -57 56 187 339 144 31 -268 -36 155 -59 -60 -57 -310 -69 230 126
6445 126 219 -244 -15 211 71 70 -2 -110 -78 54 118 192 63 -109 18 51 577 267 -129 -37 -149 -27 253
6468 253 229 -55 -170 55 -55 187 289 23 -279 -28 -28 105 -192 -40 -193 -112 92 86 -52 -265 -95 -131
6490 -131 60 255 227 -241 -180 148 -75 103 15 -18 -31 -29 352 150 -137 -4 -142 86 -36 -108 89 -256 -94
6513 -94 -233 165 163 -28 138 83 -176 57 287 37 -84 -149 -58 103 307 -75 29 -149 331 23 117 25 -416
6536 -416 -228 -107 115 130 295 -149 182 408 236 157 -101 -178 60 73 -42 -74 -148 -29 -50 447 219 253 -93
6559 -93 -136 238 406 92 -81 -55 -153 341 517 -131 -323 -180 -201 -78 100 -2 34 -278 -42 -29 70 279 4
6582 4 64 29 97 266 -82 -137 -105 -214 -20 125 233 -212 -357 -37 176 206 89 -72 -3 -286 14 -55 -106 -86
6606 -86 -186 66 15 127 78 -251 -238 -148 85 381 -103 -233 -257 -183 149 186 28 57 -310 79 161 85 93 -88
6630 -88 -298 155 333 61 6 -241 22 68 208 97 -162 -186 -168 159 298 131 -178 -296 100 121 118 284 -1
6653 -1 -62 132 32 123 62 82 -310 10 189 -14 -111 -114 -207 -129 152 50 98 -46 -172 73 -21 -30 -195 -168 -231 -125
6679 -125 85 157 -102 -380 -106 -86 50 -95 -93 -91 -202 -56 313 103 -48 -225 -268 71 9 124 96 -318 -282
6702 -282 -11 70 122 -34 -238 -74 97 156 190 -120 -61 188 196 51 154 -111 -269 65 89 -107 33 -128 -229
6725 -229 106 -7 132 24 -149 -22 -353 -18 179 49 -292 -125 -169 22 246 -91 -419 32 -205 223
6745 223 274 36 108 -52 -136 266 -26 57 -260 10 -10 -148 351 252 -194 -25 6 232 258 40 -13 -265 144
6768 144 303 119 -161 -4 -1 -132 71 166 24 -176 28 126 306 48 -106 -200 208 199 263 151 -56 60 -157
6791 -157 -115 -72 149 50 -175 270 101 219 89 -131 -121 -329 122 139 175 -90 -261 310 231 -72 -12 -107 -219
6814 -219 -207 -375 256 -13 -85 43 106 154 34 -60 -268 -141 52 342 118 11 -121 -115 209 327 310 -76 135
6837 135 -146 -212 283 59 -66 -183 68 -19 -23 50 -185 -113 22 -85 -17 -156 -114 144 66 -28 328 -219 -188 -12
6861 -12 3 463 162 -176 -310 -284 18 179 174 -81 16 -82 -52 298 -147 -50 -21 -82 -61 -323 -74 110 -337 -131
6885 -131 117 62 174 -129 117 131 -53 30 135 -167 19 -34 -63 2 -105 -45 54 -178 212 240 177 -223 -300 -59
6909 -59 286 338 85 -233 -47 -172 265 131 189 18 -169 12 140 -25 160 211 61 -162 -25 120 -68
6930 -68 125 -335 -54 85 81 14 -123 -170 163 -39 99 -30 -383 141 226 273 54 -28 -115 -75 -27 229 142 197
6954 197 -160 -204 129 256 50 185 -139 -164 165 345 254 15 -73 18 182 31 268 -221 -438 -23 36 114
6976 114 -87 -244 -298 -200 96 36 174 -138 -83 33 107 100 -356 -358 -106 -14 215 31 -226 -165 -117 93 222 31
7000 31 -91 -78 -131 -4 206 213 52 -297 49 47 62 14 -217 -309 -92 13 116 1 -162 146 -233 213 297 -147
7024 -147 246 -171 -188 147 79 -85 -127 -254 94 191 9 40 -403 -94 -234 231 125 -78 -19 -144 161 300
7046 300 -133 -204 -124 -115 -146 294 327 -12 -274 -425 18 -113 90 288 -96 -183 -9 102 285 16 -443 -242
7068 -242 -7 253 202 -452 -146 -83 -186 375 168 74 -137 -189 -177 92 49 -147 -284 85 -185 72 178 -253
7090 -253 -259 -136 175 152 91 -97 178 -51 151 -70 15 -28 -138 -72 160 273 18 -31 -17 83 326 96 166
7113 166 -233 -362 14 -119 113 -17 -75 -113 103 -60 250 -364 -218 59 121 192 94 25 -254 -259 15 95 79
7136 79 -48 -26 -21 -2 223 114 -125 -272 -95 -94 315 1 -122 -217 -29 -1 118 -37 -160 51 50 -15 159 3
7160 3 388 -4 17 -87 106 -73 27 -208 105 84 -68 -83 -2 65 176 232 200 119 -403 69 12 389 84 -216
7184 -216 -329 -139 -44 21 159 84 -279 -135 15 223 -30 -492 -74 110 199 204 -168 -209 -45 -124 236 201 -57
7207 -57 -24 -158 14 55 16 -27 7 14 -15 97 114 103 -255 -30 -244 -67 -70 20 7 -92 0 -9 31 -42 119 -305 107
7234 107 164 -78 -52 -69 -149 37 92 323 -120 -43 78 296 190 255 -41 -100 -169 31 177 33 -72 -126 34
7257 34 -46 187 75 -299 -479 -303 115 176 -199 -8 -115 -169 224 148 173 -180 28 66 220 194 -129 -141 -109
7280 -109 257 373 55 -35 -167 -248 -53 -27 103 294 -304 81 201 270 -86 -186 0 138 274 147 197 -88
7302 -88 -335 -80 -38 136 108 66 -95 50 283 125 176 -100 -103 -111 31 183 -91 -61 54 -321 65 18 -90 -57
7326 -57 -102 55 -65 -30 218 -151 -332 112 -64 136 9 245 -14 61 185 114 82 -169 252 212 386 227
7348 227 52 -278 -149 304 119 -14 -110 165 -151 145 150 61 178 -266 -400 84 182 -179 155 -149 -55 114
7370 114 540 418 9 -233 -77 65 257 169 -128 -56 144 150 87 26 76 -211 -234 226 258 -82 -91 -165 -191 122
7394 122 -29 31 -271 54 200 157 100 -59 -163 -51 -53 143 -18 83 -162 -204 124 91 249 7 -83 -152 268
7417 268 94 71 -133 -166 -26 104 301 11 -115 -171 -203 142 196 39 -61 96 106 124 156 -98 -242 -99 135
7440 135 240 313 -53 -170 -424 -182 293 124 40 -487 -119 -144 131 -22 8 -74 -347 207 -30 300 57 -36
7462 -36 -6 225 159 47 54 -411 -264 -61 254 89 -113 53 -403 -16 224 -22 161 146 162 287 -25 37 -138
7485 -138 -336 -26 157 237 167 -141 -13 -250 13 8 116 149 -191 -21 65 87 -101 -27 98 26 -16 55 -80 -154
7509 -154 -184 32 199 -63 -2 -139 -92 -85 95 218 -51 -251 126 -139 -133 242 -162 -84 -171 140 287 253 22
7532 22 -291 -273 18 295 -105 -287 -81 107 164 -22 39 -210 -298 -231 83 -217 139 -194 -218 210 -4 273
7554 273 50 -205 -181 213 85 143 233 -329 -360 -146 121 143 -76 -13 -190 -168 242 232 -220 -152 -51 238 -17
7577 -17 35 56 123 -150 -161 23 34 34 31 245 -58 149 151 29 -124 78 -212 68 150 10 -117 -130 -48 150 -119
7602 -119 -38 61 -189 100 118 -83 -262 -153 -23 -68 240 -15 -281 -120 -88 112 51 5 -230 -107 106 152 99
7625 99 65 77 -88 -57 179 -208 -142 -192 -231 27 276 -33 7 -214 -61 123 8 128 -125 -210 -102 42 227
7648 227 373 -363 26 37 88 -58 -71 53 10 76 11 61 -40 -105 -321 35 23 222 -2 37 -228 33 213
7671 213 -150 88 -123 -228 208 -60 154 112 -48 61 198 84 218 314 -87 -436 -45 331 194 -178 -282
7692 -282 -171 -129 202 347 168 -129 -48 -120 378 -115 31 -191 -116 6 -38 192 -199 -134 -96 18 416 50
7714 50 -147 -162 -108 33 -30 197 31 114 -315 82 115 -121 -115 -204 -195 43 92 -113 -277 -312 1 -16 -6 107 277
7739 277 -72 74 131 77 -188 -222 -79 40 41 -137 -234 -141 -261 67 360 243 -320 138 -33 18 -80 44 44 82
7763 82 -48 291 70 5 14 26 107 -148 -7 125 -285 -108 -210 -69 -24 318 44 -302 154 126 24 206 4
7786 4 -11 76 118 543 -83 -355 -261 51 253 91 121 -53 -228 -272 193 -10 135 62 204 45 261 332 125
7809 125 91 0 318 177 -18 -69 60 -53 57 169 -98 8 -108 106 -252 28 64 19 14 -89 45 -95
7831 -95 -177 -103 -136 -128 317 244 268 10 -83 80 54 163 56 -25 -290 -123 152 164 253 -93 -325 -152 106 122 -10
7856 -10 41 -102 83 238 17 35 -212 27 175 2 141 -27 38 -122 199 -128 56 -20 -105 -314 68 37
7878 37 -123 -122 -268 -74 18 195 -177 -114 -119 -136 141 184 132 7 -94 -105 -4 9 -24 -86 262 -6 -118 189 100
7903 100 -36 -290 -90 68 33 313 -83 -354 -17 313 179 120 -355 -89 25 -194 -126 -259 -42 -176 147
7924 147 -9 108 -106 -86 -36 62 109 -37 -203 -160 -181 175 229 84 -95 -196 -217 5 -60 153 -108 -214 -132
7947 -132 1 279 192 -309 -40 45 -5 37 -364 -76 -59 -15 213 33 -60 138 -163 123 65 -22 37 -71 45
7970 45 9 220 27 116 -95 -179 229 249 -121 10 -39 -307 -223 -12 -183 -137 -147 -79 98 -55 287 77 70 113
7994 113 -2 63 279 -238 -43 -136 89 330 76 19 -129 -83 15 -88 195 -109 -193 234 96 -137 35 -331
8016 -331 -237 -183 -59 270 164 -118 -259 15 -61 9 10 -177 -170 243 114 281 416 -110 -99 102 27 215 284 5
8040 5 -1 122 280 240 129 -17 -226 -273 80 -298 -195 224 66 94 19 -153 -157 59 -61 44 183 -89 73
8063 73 -90 36 -35 -138 -330 146 -323 27 388 245 163 81 22 103 -29 259 -37 100 0 -57 377 -81
8085 -81 188 -48 -117 19 -3 68 -262 101 -207 -134 45 263 -215 -14 -184 49 -97 83 -166 -104 -144 -49 -26
8108 -26 359 7 -129 -12 108 -18 205 -133 -436 -59 198 254 193 -228 -60 178 261 112 -25 212 -78
8129 -78 -126 2 238 144 -127 28 -109 7 71 12 -28 23 86 -208 149 -24 -99 35 272 191 86 94 -158 -88
8153 -88 -27 245 209 299 -241 -257 89 -183 290 -66 -152 20 -66 -12 148 172 -121 -43 128 130 -32 -180 -248 -74
8177 -74 94 114 286 79 -232 -338 27 264 -87 121 -195 -209 111 117
8191A17
##END NTUPLES=NMR FID
##END=
