##TITLE=1H_Pr 5168-2
 MEOD
 8 sc, 
 17.11.2022
##JCAMPDX= 6.0         $$ Bruker NMR JCAMP-DX V2.0
##DATA TYPE= NMR FID
##DATA CLASS= NTUPLES
##ORIGIN= UXNMR, Bruker Analytische Messtechnik GmbH
##OWNER= root
$$ XWIN-NMR		Version 3.5
$$ Thu Nov 17 16:36:48 2022 Russian Standard Time (UT+4h)  she@DPX200
##.OBSERVE FREQUENCY= 200.1313499994
##.OBSERVE NUCLEUS= ^1H
##.DELAY= (6, 6)
##.ACQUISITION MODE= SIMULTANEOUS
##.ACQUISITION SCHEME= undefined
##.AVERAGES= 8
##.DIGITISER RES= 18
##SPECTROMETER/DATA SYSTEM= spect
##.PULSE SEQUENCE= zg30
##.SOLVENT NAME= MeOD
##.SHIFT REFERENCE= (INTERNAL, MeOD, 0, 15.7039)
##AUDIT TRAIL= $$ (NUMBER, WHEN, WHO, WHERE, WHAT)
$$ ##TITLE= Audit trail, XWIN-NMR		Version 3.5
$$ ##JCAMPDX= 5.01
$$ ##ORIGIN= Bruker BioSpin GmbH
$$ ##OWNER= she
$$ F:/spectra/data/she/nmr/H-F/1/audita.txt
$$ ##AUDIT TRAIL=  $$ (NUMBER, WHEN, WHO, WHERE, WHAT)
(   1,<2022-11-17 16:35:27.46 +0400>,<she>,<DPX200>,
      <created by zg, POWCHK disabled, PULCHK disabled
       configuration hash MD5:
       00 E9 B6 7A A2 85 ED C7 34 08 36 98 17 FE 4E 26
       data hash MD5: 16K
       6B 9E 4C AB 0B 50 5F 67 5E 1F C3 87 95 41 C0 AC>)
$$ ##END=
$$ 
$$ hash MD5
$$ 1C 5E 14 CC 2D 09 C6 59 F9 F6 C6 87 83 8D 62 11
##$RELAX= 
##$RELAX= 
##$RELAX= 
##$RELAX= 
##$RELAX= 
##$RELAX= 
$$ Bruker specific parameters
$$ --------------------------
##$DU= <F:/spectra>
##$EXPNO= 1
##$NAME= <H-F>
##$PROCNO= 1
##$TYPE= <nmr>
##$USER= <she>
##$AMP= (0..31)
100 100 100 100 100 100 100 100 100 100 100 100 100 100 100 100 100 100 
100 100 100 100 100 100 100 100 100 100 100 100 100 100 
##$AQSEQ= 0
##$AQ_mod= 1
##$AUNM= <au_zg>
##$AUTOPOS= <>
##$BF1= 200.13
##$BF2= 200.13
##$BF3= 200.13
##$BF4= 200.13
##$BF5= 200.13
##$BF6= 200.13
##$BF7= 200.13
##$BF8= 200.13
##$BYTORDA= 1
##$CFDGTYP= 0
##$CFRGTYP= 5
##$CHEMSTR= <none>
##$CNST= (0..31)
1 1 145 1 1 1 1 1 1 1 1 1 1 1 1 1 1 1 1 1 1 1 1 1 1 1 1 1 1 1 1 1 
##$CPDPRG= <>
##$CPDPRG1= <>
##$CPDPRG2= <>
##$CPDPRG3= <>
##$CPDPRG4= <mlev>
##$CPDPRG5= <mlev>
##$CPDPRG6= <mlev>
##$CPDPRG7= <mlev>
##$CPDPRG8= <mlev>
##$CPDPRGB= <>
##$CPDPRGT= <>
##$D= (0..31)
0 1.2 0 0 0 0 0 0 0 0.06 0 0.03 0 0 0 0 0.0002 0 0 0 0 0 0 0 0 0 0 0 0 
0 0 0 
##$DATE= 1668688526
##$DBL= (0..7)
120 120 120 120 120 120 120 120 
##$DBP= (0..7)
150 150 150 150 150 150 150 150 
##$DBP07= 0
##$DBPNAM0= <>
##$DBPNAM1= <>
##$DBPNAM2= <>
##$DBPNAM3= <>
##$DBPNAM4= <>
##$DBPNAM5= <>
##$DBPNAM6= <>
##$DBPNAM7= <>
##$DBPOAL= (0..7)
0.5 0.5 0.5 0.5 0.5 0.5 0.5 0.5 
##$DBPOFFS= (0..7)
0 0 0 0 0 0 0 0 
##$DE= 6
##$DECBNUC= <off>
##$DECIM= 32
##$DECNUC= <off>
##$DECSTAT= 4
##$DIGMOD= 1
##$DIGTYP= 9
##$DL= (0..7)
0 120 120 120 120 120 120 120 
##$DP= (0..7)
150 150 150 150 150 150 150 150 
##$DP07= 0
##$DPNAME0= <>
##$DPNAME1= <>
##$DPNAME2= <>
##$DPNAME3= <>
##$DPNAME4= <>
##$DPNAME5= <>
##$DPNAME6= <>
##$DPNAME7= <>
##$DPOAL= (0..7)
0.5 0.5 0.5 0.5 0.5 0.5 0.5 0.5 
##$DPOFFS= (0..7)
0 0 0 0 0 0 0 0 
##$DQDMODE= 0
##$DR= 18
##$DS= 0
##$DSLIST= <SSSSSSSSSSSSSSS>
$$ [...]
##$SUBNAM2= <"">
##$SUBNAM3= <"">
##$SUBNAM4= <"">
##$SUBNAM5= <"">
##$SUBNAM6= <"">
##$SUBNAM7= <"">
##$SUBNAM8= <"">
##$SUBNAM9= <"">
##$SW= 18.0517283424941
##$SWIBOX= (0..15)
0 0 2 0 0 0 0 0 0 0 0 0 0 0 0 0 
##$SW_h= 3612.71676300578
##$TD= 16384
##$TD0= 1
##$TE= 0
##$TE2= 300
##$TE3= 300
##$TEG= 300
##$TL= (0..7)
0 120 120 120 120 120 120 120 
##$TP= (0..7)
150 150 150 150 150 150 150 150 
##$TP07= 0
##$TPNAME0= <>
##$TPNAME1= <>
##$TPNAME2= <>
##$TPNAME3= <>
##$TPNAME4= <>
##$TPNAME5= <>
##$TPNAME6= <>
##$TPNAME7= <>
##$TPOAL= (0..7)
0.5 0.5 0.5 0.5 0.5 0.5 0.5 0.5 
##$TPOFFS= (0..7)
0 0 0 0 0 0 0 0 
##$TUNHIN= 0
##$TUNHOUT= 0
##$TUNXOUT= 0
##$USERA1= <user>
##$USERA2= <user>
##$USERA3= <user>
##$USERA4= <user>
##$USERA5= <user>
##$V9= 5
##$VALIST= <valist>
##$VCLIST= <CCCCCCCCCCCCCCC>
##$VD= 0
##$VDLIST= <DDDDDDDDDDDDDDD>
##$VPLIST= <PPPPPPPPPPPPPPP>
##$VTLIST= <TTTTTTTTTTTTTTT>
##$WBST= 1024
##$WBSW= 4
##$XGAIN= (0..3)
0 0 0 0 
##$XL= 0
##$YL= 0
##$YMAX_a= 415520
##$YMIN_a= -715820
##$ZGOPTNS= <>
##$ZL1= 120
##$ZL2= 120
##$ZL3= 120
##$ZL4= 120
##$ABSF1= 10
##$ABSF2= 0
##$ABSG= 5
##$ABSL= 3
##$ALPHA= 0
##$AQORDER= 0
##$ASSFAC= 0
##$ASSFACI= 0
##$ASSFACX= 0
##$ASSWID= 0
##$AUNMP= <proc_1d>
##$AZFE= 0.1
##$AZFW= 0.1
##$BCFW= 1
##$BC_mod= 2
##$BYTORDP= 1
##$COROFFS= 0
##$CY= 11.3945322036743
##$DATMOD= 1
##$DC= 2
##$DFILT= <>
##$DTYPP= 0
##$F1P= 2.36226072786647
##$F2P= -0.459571619588291
##$FCOR= 0.5
##$FTSIZE= 0
##$FT_mod= 4
##$GAMMA= 1
##$GB= 0.15
##$INTBC= 1
##$INTSCL= 1
##$ISEN= 128
##$LB= 0.24
##$LEV0= 0
##$LPBIN= 0
##$MAXI= 10000
##$MC2= 0
##$MEAN= 0
##$ME_mod= 0
##$MI= 1.114404
##$NCOEF= 0
##$NC_proc= 0
##$NLEV= 6
##$NOISF1= 3.799351
##$NOISF2= 2.8
##$NSP= 1
##$NTH_PI= 0
##$NZP= 0
##$OFFSET= 15.70392
##$PC= 1
##$PHC0= -18024.93
##$PHC1= 1.8007
##$PH_mod= 1
##$PKNL= yes
##$PPARMOD= 0
##$PSCAL= 0
##$PSIGN= 0
##$REVERSE= no
##$SF= 200.130013532006
##$SI= 16384
##$SIGF1= 3
##$SIGF2= 2
##$SINO= 400
##$SIOLD= 16384
##$SREGLST= <1H.CDCl3>
##$SSB= 0
##$STSI= 0
##$STSR= 0
##$SW_p= 3612.71676300578
##$SYMM= 0
##$S_DEV= 0
##$TDeff= 0
##$TDoff= 0
##$TI= <>
##$TILT= no
##$TM1= 0
##$TM2= 0
##$TOPLEV= 0
##$USERP1= <user>
##$USERP2= <user>
##$USERP3= <user>
##$USERP4= <user>
##$USERP5= <user>
##$WDW= 1
##$XDIM= 8192
##$YMAX_p= 0
##$YMIN_p= 0
$$ End of Bruker specific parameters
$$ ---------------------------------
##NTUPLES= NMR FID
##VAR_NAME=  TIME,          FID/REAL,        FID/IMAG
##SYMBOL=    X,             R,               I
##VAR_TYPE=  INDEPENDENT,   DEPENDENT,       DEPENDENT
##VAR_FORM=  AFFN,          ASDF,            ASDF
##VAR_DIM=   8192,          8192,            8192
##UNITS=     SECONDS,       ARBITRARY UNITS, ARBITRARY UNITS
##FACTOR=    0.0002768,     1,               1
##FIRST=     0,             0,               0
##LAST=      2.2672688,     0,               0
##MIN=       0,             -715820,         0
##MAX=       2.2672688,     415520,          0
$$ Real data points
##PAGE= N=1
##DATA TABLE= (X++(R..R)), XYDATA
0@%%%%%%%Qj6J6j6K4l2M0m8N6p2Q8j12J36j60J92k30K74l22L74m33N05n85O73
30C60p74Q84j004J140j290J454j633J833k055K295k558K846l159L502l875M282
46B248m729N217n751O337o983P692q476R348j0320J1413j2647J4059j5689J7593
60I312j9856K2599k6003L0354l6148M4294n6676P7983j24642M08726k46605n24518
72d41180O06107p5929l40642J14477J15058k88465K56657L98008j91991k59162
82a07062K29972M333k38689l1824M5424l6479J32554Q2519q7249M9116K04970
93B47585n3045j93420o3578l7127m3572R5550J105j19599R6146K33487K706j14323
105E1915J5923m721j55188m2523J16276j6519j01940J01573J77848m682n6413
$$ y = [0, 0, 0, 0, 0, 0, 0, 0, 8, -8, 8, -8, 16, -16, 24, -24, 32, -40, 48, -64, 72, -88, 104, -126, 148, -174, 200, -233, 272, -313, 360, -414, 470, -534, 606, -684, 770, -863, 970, -1085, 1210, -1348, 1498, -1661, 1841, -2034, 2248, -2481, 2736, -3015, 3322, -3661, 4031, -4445, 4903, -5417, 5996, -6651, 7408, -8281, 9312, -10544, 12055, -13948, 16406, -19742, 24552, -32124, 45859, -78783, 329943, 83338, -441180, 164927, 88998, -251644, -137167, -22109, -310574, -53917, 344091, 152100, -107062, 122910, 127243, -111446, -143270, -97846, -134325, -1771, 80748, -6501, 42615, 247585, 194540, 1120, -62458, -99585, -143157, -47607, -46502, -166101, -69955, 163532, 166238, 51915, 67838, 63117, -92071, -134594, -18318, -34837, -136777, -35204, 142644, 137962, 81549]
116H1549O7584k3247k01843p6887N8070m2201j3287R0969j183L2747K22197P4705
128B69173j78154m6019L5931j64221m8143J51780j26556j68718K73837K04570
138B03480j95970p290K02498j23884j84695J04443l4468j82991J49450J69385
148I9958j64782n41K61132j552j72679P067q626j12116K3569M1024j03286J4223
160a16609J61210L4395j9421K9456n9535n6236N6724l5228j25041M6912J19095
171C5722m0443j4731J34394K2570j08980j2831M955r7624n1039N3928J9311k7257
183h2025N6469J08840K0509k1414K1958k5484j04073m7348L3553k1566n3301N6379
195e7503P7343J478M9997N8418p7963o9603L1303l6386q6478K7669M5562k6295
$$ y = [81549, 149133, 125886, -75957, -152844, -94774, -136975, -150262, -59293, -60476, -27729, 194468, 269173, 91019, 45000, 80931, -83290, -131433, 20347, -106209, -274927, -1090, 203480, 7510, 220, 202718, 78834, -105861, -1418, -35886, -218877, -69427, 99958, -64824, -65365, 195767, 194215, 21536, 28603, 19977, -92139, -68570, -27546, -130832, -116609, 44601, 78996, 59575, 89031, 29496, -26740, 29984, -5244, -130285, -83373, 35722, -4721, -19452, 114942, 137512, 28532, 15701, 20656, -76968, -128007, -74079, -54768, -82025, -25556, 83284, 103793, 82379, 104337, 78853, -25220, -72568, -39015, -60581, -113882, -57503, 19840, 21318, 71315, 129733, 51770, -17833, 13470, -22916, -109394, -81725, -36163, -62458]
207f2458N9751J04678l5163j9859P5275o9470j29854M1113K3234j00705J9004
218i4454J10634j8826q611J12938o947j07536L0168J7849j08666m958P5207l0157
230c3359q523R1260J9935l5688L7689j2855j11197j0784M9362n1659j8455P3680
242a0594J3184J653P9745K2647p4579k7259J4415n4342m4834L6100Q803j6875
254e1936N1952N9721K502j0154l818k6335m8635k3607N128j0821l018L9378M1803
267B2160K0189J9701J6067k6796n3883j8287r546l0962P086K3695n213L3182O5070
280F2463K976l0348J504j8943n6119k455K3053l5591j020P0696J4009j0457M8251
293F8019J037p4125k0081K0708l4600k5045L7373N229p573O8689M2068m1553j4540
$$ y = [-62458, -2707, 101971, 66808, 46949, 122224, 52754, -77100, -35987, -12753, -113458, -94454, 16180, -2646, -11257, 101681, 94734, -12802, 17366, 35215, -73451, -78409, -3202, -33359, -41882, 49378, 69313, 33625, 71314, 58459, -52738, -63522, -14160, -65819, -84274, -10594, 2590, 4243, 83988, 106635, 32056, 4797, 19212, -35130, -79964, -43864, -35061, -51936, 16, 59737, 62239, 52085, 48267, 21932, -26703, -50310, -45182, -56003, -59021, -19643, 22160, 42349, 62050, 78117, 51321, -2562, -20849, -30395, -61357, -54271, -30576, -35789, -2607, 62463, 65439, 35091, 36595, 17652, -38467, -40922, -17869, -53460, -54480, 16216, 30225, 19768, 68019, 69056, -5069, -25150, -4442, -39042, -64087, -26714, -21485, -29058, 39631, 81699, 40146, 25606]
306B5606L421m4636k6688J6933j3676k0976M1401M2615k972K3915K6057m4057
318B6943l7464Q537k0106l3230J2895K0003l771K7231N5134J585l0230M65j4128
331A3864m1544q274J0344j3723n190L4818L5416Q591J3747M044l8676k8724M239
344a1068j2992k0863Q896J6778P692K7816L7349p021k8089k405j6721l2431M238
357b8821P063j9268R308M5479K3969j606Q025r924m1629j0622J0183k5181j7906
370e0930K1559J7480J2215L1516K2676j7050k2020l254j9585k5103M999J381r914
383c6030J9252L4428J3966J006K071j3851k9955o721M086k1055p052K3300J3095
396c460J3033L0214Q366k7774j7831K542j8547j8948J3018l981j3766L4066L7117
$$ y = [25606, 29027, -15609, -42297, -25364, -39040, -60016, -18615, 24000, 21028, 44943, 71000, 26943, -10521, -1984, -22090, -55320, -42425, -22422, -26193, 1038, 56172, 57757, 27527, 27992, 13864, -27680, -35954, -25610, -39333, -44523, -9705, 25711, 34302, 48049, 52093, 13417, -15307, -11068, -24060, -44923, -36027, -19249, -11557, 16259, 53608, 46587, 18498, 16093, -628, -33059, -28821, -21758, -41026, -31718, 13761, 37730, 36124, 44149, 34225, -7404, -18026, -7843, -33024, -50930, -29371, -11891, 324, 31840, 54516, 37466, 15446, 12192, -7393, -32496, -27497, -26116, -36030, -16778, 17650, 31616, 32622, 34693, 20842, -9113, -15834, -11748, -32803, -39855, -16555, -3460, 9573, 39787, 48153, 20379, 2548, 5090, -13457, -32405, -19387, -23368, -37134, -3068, 34049]
409C4049n046k961L706k5758k4298J1816j846k9283J0263L0764J858J8095K7102
422D8461k0679k5649N924j0033k9018p26R518j0300J3705M2246Q268n259J1142
435C7600j6191k9270j24j162j8991n225J2856J0841J6269K6319K966j8820p821
448I247q405j3440m514p798m543J2244J4919J8127J7359k566j4573q139n602j2502
462a0186p968k541j1061P790L3847J0501l021R609j2461k1772Q039L43k6270k680
476b7831K1307m60M759L4104J599k6366O036n106l1795M491J1463k4171Q50L8150
490G030J0962l868K0113o081l3915P631Q801l5210p888K0642p449Q208L7285O75
504B6936j8432J2468k423l3974o59J3492k4390n055L0201L201M035K8961l237
$$ y = [34049, 29003, 26042, 29748, 3990, -20308, -8492, -10338, -39621, -29358, 1406, 3264, 21359, 48461, 27782, 2133, 8057, -1976, -30994, -31720, -22202, -32502, -18797, 23449, 31717, 26458, 37600, 21409, -7861, -7985, -9147, -28138, -33363, -20507, -9666, 6603, 32922, 35888, 17068, 9247, 842, -12598, -17112, -24910, -29453, -17209, -2290, 15837, 33196, 30630, 16057, 7918, 2316, -10186, -18154, -20695, -31756, -23966, 9881, 20382, 17361, 26970, 14509, -7263, 776, 1119, -25151, -27831, -6524, -6984, -2225, 31879, 33478, 7112, 13148, 8042, -23753, -19262, -7799, -31970, -31120, 7030, 17992, 14124, 34237, 28156, -5759, 1872, 10673, -24537, -32425, -11783, -19232, -11024, 26261, 26936, 8504, 20972, 18549, -15425, -16084, -2592, -26982, -32037, -1836, 1365, 5400, 34361, 31124]
517C1124k5799J533K11k1860n463O185j1222O789L0987L686n787J0399q450j4796
531b463M338o750j5827M348O042J66J9490J9397j2411r209O222j6796j2094J2763
545b784j2197j7216K1823J6930k737J6829R761k3717p436J1925j9454j7843J8686
558g430l246j3769K8987J8743j3603Q742N179k9471p434J6750j6377j8534K1246
571a0217O322o064L2466J3293l1356J166J4054k5952j1473J3429j5355j0173L1171
584A311J2324j4342J6349J0962k7527m83J3877k5943j1628J9177m314j630K8353
597A6486N767j8725N965N004k1339j21Q915k3285m483K5547J93J997K3690o135
611A9476k1467O687J676j8849K485P388j8974M731L1491k359o348J7282j3198
$$ y = [31124, 5325, 6858, 7069, -14791, -20254, -14069, -25291, -18502, 12485, 16171, 10384, 20783, 12333, -2463, 1875, -4875, -20702, -16354, -10312, -10146, 9344, 28741, 16330, 7121, 13343, -3453, -15547, -2784, -14981, -32197, -10374, 6556, 3819, 20648, 30409, 6692, -744, 11181, -8273, -26116, -7430, -10676, -24445, 4542, 23285, 9682, 18424, 23603, -5868, -13302, 3448, -12929, -31463, -10217, -3895, -9959, 22507, 35800, 4444, 5610, 19664, -6288, -17761, -4332, -19687, -29860, 1311, 13635, -707, 15642, 26604, -923, -1406, 12471, -13472, -25100, -5923, -10237, -11867, 16486, 22253, 3528, 9493, 14497, -6842, -6963, 1952, -21333, -25816, -269, -76, 1921, 25611, 19476, -1991, 4696, 6372, -12477, -9992, -2604, -21578, -16847, 14644, 12285, 5937, 23219, 10021]
624A0021k1801J3197j019k3142P298J4300j0374R668K7385j0680j2795J6487j3001
637E544k4044J6260o57k5187J5277K2490j1061O131K1901j6810j7033J8367o741
650D437k6493J1986O309j7448J9924K4364j6629l490J4408j4323j2030J5605r199
663b579k4981J4456J5552r695J7260J7371k4702o697J7077j2557j2750J1976q146
676h415j7120K0553J9293j0519O355J0778k1985n355J5946j5504j3052J5171k581
689f435p917K2543J1363j6541L272Q843j9220n173J3502j6391j0887K2637M356
702C952o415J6944J611j8310O419Q130j9629o515J1409j1019k085K6274P45j3328
716a817J3523L69j8211O951O272k1000m204J6923k107l22K0895k849j7942R859
$$ y = [10021, -11780, 1417, 398, -22744, -15446, -1146, -11520, -1852, 25533, 14853, 2058, 18545, 5544, -18500, -2240, -2897, -28084, -12807, 9683, -1378, 4753, 26654, 9844, -7189, 11178, 4437, -22056, -10070, -3761, -21209, -1285, 23079, 6450, 2960, 17368, 3045, -8985, 6620, -2579, -27560, -13104, 2448, -7247, 10013, 27384, 2682, -4015, 13062, 505, -12245, -269, -8415, -25535, -4982, 14311, 3792, 10147, 20925, -1060, -6415, 9531, -5973, -19025, -3854, -6435, -14352, 8191, 19554, 3013, 6285, 15128, -4092, -9265, 4237, -12154, -23041, -404, 3952, -2463, 14481, 16092, -2218, 4201, 12331, -7298, -13813, -2404, -13423, -15508, 10766, 11511, -1817, 11706, 12075, -6136, 815, 7087, -13913, -18117, -1194, -3301, -3623, 17272, 14423, -3519, 6340]
730F340K971j7128L309L016j6925K993K0002L94r14J2412o985j4529J0510J709
744G175j9242K731O199j1183R087J8820o720m823J0115o756j2002Q115k194j7224
758a7902P650J2647p307Q497J3552j3372m930J3105p466j3098N645k720j1810
771a7509J2707J5465r480L40J0595j1596m693J2014q613j2517Q201K529m232J2753
785E964R199j2538j924R006j0347o490Q444j0045r879J5836P286m602Q568L821
799A2299j1855J87Q718j0150r815O722m036m257J7097N523r329N305K113j0751
813b229J243M664j1410o635R407K266q21J2801J667j0728N733L708j0847j487
827b668P02r964J026J2420Q47k810O756q81q196O802L233j3478j219N598n541
$$ y = [6340, 9311, -7817, -4508, -1492, -18417, -15424, 4578, 4972, 4058, 16470, 9485, -5044, 5466, 7175, -12067, -9336, -3137, -14320, -5233, 13587, 6867, 2044, 12159, 5403, -6599, 1516, -678, -17902, -10252, 2395, -4912, 3585, 17137, 3765, -1165, 11940, 4474, -8624, -2979, -5699, -17509, -4802, 10663, 1183, 1523, 12118, 522, -4171, 7843, -770, -13287, -5086, -2557, -6789, 5964, 15163, 2625, 701, 9707, -640, -7130, 1314, -8731, -18610, -2774, 4512, -90, 8478, 12299, 444, 631, 9349, -801, -10616, -3894, -7930, -12187, 4910, 10433, 1104, 6409, 8522, -2229, -986, 3678, -7732, -14367, -4960, -2694, -3515, 9286, 10953, 225, 5958, 9666, -1181, -2668, -1966, -11930, -10904, 1516, 2363, -447, 6309, 5428, -2768, 4034, 7267, -6211, -7430, -1832, -7373]
842g373M788J2604l321o270M258o14o993K648L72j1678J214J1211j521J941Q667
857I933n345n094O037j151q332o82M70n046M726J1444k117l345N042m104l962
872a526N218l977r554R51M133J283N997O738m084l437M792k159n803J457m456
887d427o773N370O157J29K295K343k797j566L727j940p130n24L25m78O860M453
903F024k971l73J20j317N04r93m650m591J836M276K451M471P62m470R66J936l061
920I20j774k038l643R00N018L860j00L01K16k825Q81R28n679l499N88R35M523
937d88M583P67j765j115J357l12k373k155m406j708L774L912K928O84j299j36
953B248O0j21q55m353k500P77J908M370K177r06p00o16J272l73l483k630k565
$$ y = [-7373, -2585, 10019, 6698, 428, 4686, 4072, -2921, -273, 99, -11579, -10365, 846, -675, 1266, 9933, 4588, -506, 5531, 4380, -3952, -4634, -4164, -9210, -4484, 6960, 4843, 1498, 6540, 2436, -1526, 3692, -285, -9839, -8888, -4755, -3472, 2525, 9263, 5179, 1742, 6534, 4375, -1428, 29, -4427, -11200, -5830, 327, 456, 2751, 5094, 2297, 731, 4458, 2518, -4612, -5136, -4811, -5289, 1571, 6024, 3053, 2680, 2800, 1483, 1987, 994, -3656, -8247, -6411, -2135, 316, 4787, 5549, 1079, 2045, 3981, 920, -854, -2892, -6535, -5635, -617, 3243, 3143, 3444, 3660, 835, 1716, 2644, -3035, -6534, -5946, -5011, -488, 4095, 4862, 3097, 1982, 3339, 3027, 654, -1501, -5907, -7615, -3841, 71, 2999, 3683, 2384, 2248, 2308, 2187, 1332, -3021, -5521, -4744, -2836, 1534, 3711, 2805, 2105, 1489, 2761, 2388, -1095, -3725, -6290]
970f290N61N801K422K11O83j560k48J146o81l317l942l89J353K080N541P41l345
987G67K070L23j977N22k077m942q64M050L028J16J740Q5l038K648J727n114j928
1004b864n76k334L142M892K96j022Q30K1j665J682j5o615j041L325r25L550M120
1021D801l876j630K921j65k363M7j663m275L126O561j807J44L280m366j563N020
1037D192k942o294J45O63j162M782O193l597k225N067j706k657L443m513o900
1052g511L888L273j514L257K288m049k36N815k948n372K417k604m001P543L679
1067C925m871K040K784l547J610L697n180o404L996O32k697O068J198p198K968
1082i79M802m039j14K315m864k069P082J718l852L363O45o312L338L211p962j694
$$ y = [-6290, -5729, 72, 2494, 2705, 3388, 1828, 1580, 2726, 2045, -1272, -5214, -5603, -4250, -2170, 3371, 4112, 767, 2837, 3160, 1183, 1705, -372, -5314, -6178, -2128, 900, 1016, 2756, 2841, -197, 2451, 4178, -936, -2864, -3440, -5774, -2632, 2260, 2556, 1534, 2364, 2385, 720, 2402, 2387, -4228, -5269, -1944, -2869, 681, 4801, 925, -705, 2216, 2051, -312, -265, -1928, -6203, -3077, 3484, 1677, 1821, 5101, 735, -828, 4192, 1250, -5044, -4899, -4236, -5398, -616, 5577, 1980, -245, 4822, 3116, 459, 3902, -611, -7511, -3623, -350, -1864, 1393, 3681, -368, -604, 5211, 2263, -3109, -692, -3296, -7297, 246, 3925, -946, 1094, 3878, 331, 1941, 5638, 458, -5946, -1950, -1318, -4015, 2053, 3251, -3947, -979, 3823, -216, -330, 1985, -2879, -4948, 2134, 3852, 0, 3363, 4008, -2304, 1034, 4245, -3717, -5411]
1098e411L526l416J101Q101n36m600M600J692n401K790J892r562o89O673l173
1113b413k51Q018l042n001N851J314p251J033K459p349N66R326l008k556P492
1128E188j552l925O024k46q799J51L096m526J227O682m771m009P629o7l833N682
1144C951j688p736M280N008l551O76M127n833l077P736j954o942M281q18n809
1159g349P290N495o290M51M787m409j109O092m147p467N414K444m799O320L323
1174F046q500J660N989n974k109M103m977m716Q110L050n605N357M100p143L063
1189B454O307q915m278N402l956l312P821j96p692M886O303n772J749N703r286
1204b782l164R693j743m455O369j520p690N242N925o789j458M470o810j418J0105
$$ y = [-5411, -1885, -5301, -4200, 3901, 3365, -1235, 3365, 5057, -344, 2446, 4338, -5224, -5913, 760, -2413, -2664, 5354, 2312, -2689, 3162, 4476, -2775, -1742, 717, -6632, -6066, 3260, 252, -2304, 5188, 3636, -289, 5735, 5489, -3310, -3159, -63, -4589, -3362, 3320, -1451, -5460, 2169, 2102, -1731, 3951, 2263, -5473, -1193, 3815, 264, 940, 5067, -766, -3843, 3893, 1939, -5003, -722, -1540, -7349, -59, 5436, -854, -403, 4384, -25, -1134, 4958, 811, -6656, -1242, 1202, -3597, 2723, 6046, -2454, -794, 5195, -779, -2888, 1215, -3762, -8478, -368, 2682, -2923, 2434, 6534, -609, 2454, 8761, -154, -4432, 970, -2986, -6298, 1523, 1327, -6365, -1479, 4824, -948, 801, 6504, -2782, -5946, 3747, 2004, -2451, 3918, 2398, -5292, -50, 5875, -914, -2372, 2098, -4712, -6130, 3975]
1219C975j760n672N845l52n910N792L216p747n38N519l542q14P751l356o254O368
1235B521M7o809M058J076p867K437P285l201n54O439k850m114P304j83r223K225
1251a409J968o862L738N879n789j405O749r78k816N506j924q437M254M660n578
1266b444K491M539p300k97Q243k385m435L474k357o623N958N158o733Q00M923
1281C012n832M46Q431m124n362M897m06m374N252L128p020k27N673m866j821N686
1297B493m428m362O806J615m095L842K061n017J862M919n092l594L826l298k517
1312d979P059j57n355L652K229l656K617L002o337k515N178j301k009N748j207
1327A969n616N339L075m937Q80J304o076j50O159j865k958L894p40l452N673K599
$$ y = [3975, 2215, -3457, 2388, 2036, -3874, 1918, 5134, -2613, -3151, 2368, -1174, -1988, 5763, 2407, -3847, 2521, 2568, -4241, -183, 893, -6974, -4537, 2748, -453, -1007, 5432, 2582, -1532, 5772, 5589, -3634, -1409, 559, -6303, -2565, 3314, -2475, -3880, 2869, 1891, -925, 4581, 2657, -5780, -1526, 3134, -2444, 47, 4586, -2714, -3011, 5232, 2847, -1588, 1886, -471, -7094, -1136, 4022, -2711, -1911, 3012, -2820, -2374, 6057, 1933, -3429, 1468, 1062, -3312, 1940, 5068, -1952, -2179, 3494, -1372, -3193, 2493, -1935, -6297, 509, 2124, -1971, 1871, 3932, -1085, 777, 5696, 604, -2990, 836, -2462, -4979, 2080, 1923, -3432, 220, 2449, -1207, 1410, 4412, -1925, -4440, 738, -563, -2572, 3176, 1969, -3647, 1692, 4767, -170, 710, 2014, -4062, -4212, 1947, 82, -2876, 1018, 278, -3174, 2499, 5098]
1343E098o588Q19K226m191J475N297l661l278L813m0l085L726M60o459J942M463
1359B017l578J137M076m215j377N424r63m144J636J88m446K900N021m503j340
1374b167M316k247j351N112k103n085K081J645k195K170L084m092j055N018j663
1389A468k017L039k962m027M068J576k717J209J427k567R04M361k184l214K221
1404E85j357k080M572O46m522J466J990j903R78K403l532k719L177P22j657K792
1420A561j5l820K384K727k653m07J135k914n51L681O1k540J464N88j836K381J781
1437C027l974j023J925j583P23L046j685k414K033J622j406Q60N33l969rL376
1453A082j092o54J737j428j140K844R96k509n00N41j410N26K939j413j956J754
$$ y = [5098, -1490, -671, 1555, -2636, -1161, 4136, 475, -2803, 1010, 970, -2115, 1611, 2071, -4388, -2446, 2017, -1561, -424, 3652, -563, -1940, 3484, 2521, -1623, 13, 201, -4245, -1345, 3676, -827, -2167, 2149, -98, -1449, 3663, 1560, -3525, -1444, 201, -1994, 176, 3260, -832, -1887, 3131, 1468, -549, 2490, -472, -4499, -431, 1145, -1572, -363, 1064, -1503, -599, 3762, 1578, -1636, 585, -772, -2852, 1720, 2366, -2156, -690, 1300, -603, 375, 2778, -754, -3473, -296, 426, -1231, 1561, 1546, -2274, 110, 2837, 184, -223, 912, -2002, -2553, 1128, 1189, -1351, 113, 701, -1135, 1246, 3027, -947, -1970, -45, -1628, -905, 2141, 456, -1958, 75, 1697, 291, 1151, 1684, -2285, -2294, 1082, -10, -664, 1073, -355, -1495, 1349, 2345, -164, -664, -123, -1533, -1007, 1932, 519, -1437, 317]
1469C17j64l8J913q05k975J45J265K83M99Q29j777o38K117K81j014M01j453j576
1487b390J726J232n72k21M79m63M04K109p20k259j67O8l92J667J66j730J21Q70
1505g2Q23N23J44j314j725Q76J264k92M35m61j322Q39J446j9p58j016n37J3R73
1524a80P45o02n85K43L18J047L93j449q54Q4O81Q53L11q01p52j50J215N81n26
1543E72j067j076k41J310J119L05r15o27J154N33M66L9j931j143L81R21K71l19
1561b48k99j87N93J635r9j529j47o08r8J592K99j126m95J90J050N41M79j099j701
1580a257K54Q31n6P12n33j490J007R31J60K94k64j232k60J622N57j338J31Qr59
1599h82J483P00k015m66M93m74P25J803n48j566Q13J024n87O71M35k685o28J797
$$ y = [317, 153, 115, 2028, 1223, -1752, -1607, -342, -59, 440, 1269, -508, -1146, 971, 1252, 238, 639, -814, -2390, -664, 568, -4, -225, 254, -209, 195, 2304, 1584, -675, -842, -774, -1166, 501, 667, -1063, -942, -72, 751, 1274, 1418, 104, -1621, -745, 519, 227, 662, 201, -1121, -282, 1164, 1145, 387, -629, -1166, -1153, -180, 565, -37, -622, -379, -61, 986, 1379, -70, -924, -840, -159, 694, 1005, 204, -548, -698, 517, 1098, 572, -495, -1571, -1812, -502, 617, 922, 7, -620, 534, 1067, 1533, 1572, -359, -1502, -1121, -200, 71, -248, -547, -734, -141, 1494, 1395, -134, -281, -889, -987, 605, 904, -222, -717, -527, 523, 1064, 1543, 444, -1257, -1003, -172, -228, 484, -49, -1539, -532, 399, 559, 853, 589, -643, -903, 719, 1276, -62, 69, 77, -882, 601, 1301, -714, -1180, -687, -1161, -436, 1367, 819, -747, 66, 1090, 503, 1174, 1609, -1076, -1704, 93]
1617I3n09L3J012j092o84J781Q22j138k83J20j902Q19K394j412j127J562m57m18
1635c86K537l70k716l0R04q32N77J502k104j287K582N83r03J411q40k316J416
1652b72J664j015n50P57j426n01K749l89k182Q66J30j351K124J008k439K4J547
1669G44o11K26J512j744k246J668J157j382J326L36k858J159K538j403o93J065
1685G94j687j293K784O51k478J146J169k180J825J982k750j296J666r70n67K252
1701A048n53k627J386J971j551Q91J494l315k78K877r44j132J698q91k229K416
1717B61J692k561J1J691k525K09L167j740j897K201K6j464K093L09k956K80K304
1734A101j357l50K362k167j771L167M11k230J460k40k618J554K540j899p60J614
$$ y = [93, -416, -383, 629, -463, -1147, 634, 1456, 318, 35, 155, -1747, -928, 1466, 54, -1073, 489, 32, -386, 2151, 1781, -935, -965, -61, -893, -316, 1186, -918, -2205, 377, 960, 57, 1468, 628, -1688, -272, 1392, 377, -173, 584, -842, -1343, 1406, 1017, -1165, -299, -169, -1520, 604, 1612, -827, -803, 744, 133, 359, 1871, 127, -2119, -451, 706, -676, 650, 986, -1872, -713, 1825, 422, -271, 794, -893, -2186, 598, 1249, -1229, -83, 1086, -1094, 731, 2713, -37, -1333, 333, -637, -1204, 1048, 495, -2132, -746, 1225, -326, 565, 2059, -1256, -1534, 1343, 399, -733, 965, 74, -2155, 261, 1953, -608, -597, 1094, -1431, -1222, 1945, 205, -1692, 509, 535, -929, 1164, 1473, -1483, -1203, 1101, -256, -606, 1756, -411, -2182, 985, 1396, -834, 626, 386, -2232, -678, 1862, -37, -797, 817]
1750H17j319o89L430m72l094J135M88k165J955J532k668o87K591p00o46K379j053
1767H34k944K111J561k672J196J348l088L37L377j405j629K016q90k218K708J130
1783A772l078N15K084k361Q17K561k456j615K470l00j673K091K99l240J396K591
1799A873j995m72K229k729j184L716k12k483J615K29k389J733K788k929j089K169
1815H70j776r02L800r55l011J873R49j678J491J454l090n37K553j061j188K561
1831A353j108k327K516J231k542J100R17k465N07K494j480j438J995n38j662K532
1847A085M99l207J219J350k071P61K028k204j167K651j02j744J922j55k867J453
1863e49K188j913k20J496k118k29K898k89k059R10Q5j938J868J854k922k25J926
$$ y = [817, -502, -1191, 2239, 1767, -1327, -192, 296, -1869, 86, 1618, -1050, -1737, 854, 154, -492, 1887, 834, -2110, 1, 1562, -1110, 86, 1434, -1654, -1317, 2060, 655, -974, 1042, 152, -2066, 642, 1772, -1306, -791, 1293, -1068, -251, 2310, -146, -1761, 709, 409, -1264, 827, 1126, -2114, -718, 1873, -122, -594, 1635, -1094, -2278, 1438, 1226, -1257, 358, 587, -1802, -69, 2719, -210, -1299, 870, -906, -1808, 1992, 1037, -1974, -101, 848, -830, 661, 2115, -975, -1512, 1041, -20, -1208, 1353, 245, -2082, 434, 1665, -877, 223, 1140, -1325, -818, 1676, 196, -1242, 753, 215, -1447, 1085, 1584, -1623, -404, 946, -1125, -364, 1664, -540, -1707, 944, 842, -902, 1020, 865, -2002, -549, 1639, -274, -494, 1002, -1116, -1345, 1553, 1264, -795, 115, 200, -1738, 130, 1984, -938, -1163, 763]
1880G63j300P7K410j337k198J504P91j777J170J071k502K52K419j150j010K151
1896A334j281j597K290L19j963O32R16j616N03J977j467j521K006n35j095K304
1912A206k79k345J124R03r50P51R46j779j191K252j2j160J223m73k073K052J390
1929A585k019O3P78j437N4K281o51j870J194L32j154J916M94k500J26J267r28
1946d69K56J247j238j225J446P72j022N47O48k027P06J583j431l36J167j023m99
1963h98J817m4j616M76O93j138N81J480j788p91J774l84n03J411n52j538P14J049
1981G43o50O9M87j413m09K137n07p32O48n57j209J530Q38j354j07N68m34L09J369
2000A326p68j524J006K18q11R26J19j552K77J313m34o5P42p89q04J258J46r65
$$ y = [763, -537, -460, 1950, 613, -1585, -81, 710, -1067, 103, 1174, -1328, -1076, 1343, 193, -817, 1334, 53, -1544, 746, 1065, -898, -266, 650, -966, -463, 1514, 47, -1474, 532, -3, -1098, 1206, 927, -1418, -294, 609, -341, 410, 1356, -423, -1614, 638, 626, -534, 689, 216, -1857, 195, 1585, -434, -371, 407, -1030, -976, 1305, 654, -1216, -22, 310, -844, 1072, 1566, -934, -808, 459, -469, -213, 1034, -204, -1429, 17, 789, -233, 314, 962, -1065, -359, 1224, -207, -543, 624, -399, -898, 919, 875, -741, -265, 428, -710, -129, 1351, -437, -1228, 546, 162, -341, 1070, 518, -1020, -306, 743, 93, 162, 649, -764, -1173, 964, 457, -275, 373, -184, -1393, 137, 975, -379, -486, 82, -352, -43, 1326, 558, -966, 40, 258, -553, 373, 492, -1060, -783, 530, 96, 31, 773, -16, -820, 438, 584, -381]
2018c81N81L2j248P54J190o55l40J94o05r0J049J41j326K87M49k95O72M28j245
2037d08m97R72J29P0M51p83p18O20R09m82k17M5q80L06J216m90m11J96k92N2P67
2058E55J83q60l79N84k85K52N39j021k94P46K27j68M78l83o51K32N10K6k90N3
2078E4n44n2Q68J67l79P8k65k58M98K03k70k72k60J01K47O81j74p49K20J00J11
2099A05M39m34o45j7N82L10N8l82l18k04O76M08l92k51k13qL74K69m5l77m22P3
2121d14N25P0j10p7m42L64J48L37k08l97J58j52J11M59k31m68J12P9K61M29m59
2142I5l52j40L24K73K4j13m09k19O89K94k39rl79k61M71L94k26m13p6j03L17P70
2164G12m29q91K59M68j81N54k25q38M3P11J78k49K2k29o82R98L47o27J43r4m32
$$ y = [-381, 200, 232, -1016, -262, 928, 273, -67, 127, -478, -568, 481, 622, -704, -417, 32, -263, 409, 837, -408, -905, 67, 196, 266, 717, -66, -784, -164, 745, 263, 46, 91, -789, -483, 733, 243, -168, 28, -264, -212, 555, 738, -122, -501, 83, -202, 50, 589, -432, -726, 20, 247, 79, 557, 174, -477, -245, 265, 291, 1, 54, -490, -542, 326, 493, 114, 192, -73, -331, 167, 370, 100, -172, -432, -331, -84, 597, 423, -326, -106, -6, 105, 544, 110, -535, -552, 30, 340, 398, 16, -302, -506, 170, 578, 186, -65, -278, -286, 88, 357, 312, -65, -487, -414, 111, 181, 71, -6, -448, -84, 64, 401, 193, -204, -46, -198, -87, 372, 141, -327, -215, -136, 125, 554, 95, -257, -397, -73, 200, 224, 111, -298, -517, 172, 466, 227, 218, -161, -422, 49, 443, 217, -196, -272, -375, -58, 712, 283, -608, -349, 119, -62, 492, 267, -571, -528, 183, 361, 112, 134, -95, -777, 221, 568, -59, 84, -10, -442]
2185d42K63N70j73k38l3j28q9N86K22r27J19K52l86O07M13p55l09O38j17k29N64
2206D08k19o65L70O53m86M7J94q70rJ162k79n69K42k03k23Q33L58r76K1K86l8
2227C7j72R10r27n33Q77O0m03N33k16o30R1O43q7l90P02q57l14J152j05n18N81
2248D34k98p34M74Q28o50n16M93l66j84J114j04j140O04L96p05P61J87r20k02
2267e28Q53n5n91Q03n45o76P28O29q14J96J62p78N79O75m85m54N01k68n89J152
2287D95J35j175L43N59p00M54O76j092l97R09J27o80N48J28j070M99R76p20J3
2306B8O64j145q9J085k43q14O26k26p92Q08R21j111q5Q46p95k1J286p00r36O46
2326d7N96o83L88Q3j134K42J242o70k68P37m27j068J773j58j193L23M79n60M7
$$ y = [-442, -179, 391, 218, -20, -53, -181, -270, 316, 538, -389, -270, -18, -404, 203, 616, -139, -448, 190, 73, -156, 408, 189, -476, -106, 547, 61, 108, 302, -568, -577, 585, 306, -263, -21, -224, -447, 386, 744, -232, -211, 75, 37, -135, 775, -152, -685, 192, 252, -151, 382, 166, -464, -373, 270, 183, -207, 495, -362, -676, 476, 371, -147, 434, 136, -598, -124, 704, 54, -462, 31, -335, -519, 595, 491, -649, -45, 351, -354, 407, 594, -326, -528, 325, 270, -321, 482, -63, -739, -11, 618, -196, 0, 162, -616, -37, 638, 153, -301, 200, -68, -657, 495, 630, -545, -202, 357, -343, 111, 787, -305, -702, 207, 334, -346, 202, 330, -740, -241, 735, 15, 28, 692, -453, -542, 543, 300, -514, 112, -114, -906, -98, 823, -288, -373, 473, -322, -343, 943, 243, -693, -47, 549, -134, 254, 337, -797, -555, 687, 17, -251, 486, 59, -1009, 764, 606, -587, -264, 215, -345, -298]
2345b98J079o40p11Q43k55m61J023j81j233O50M71p44L54P41p99m73J185l82m48
2364b79P98j56j149Q31N59j107P8O28q86J19J168l87n93N02Q4p90Q61O38j482
2383e63M7J005p77J83P41q03m98P97K58p67L34M30j026K83J202r52l66Q09n64
2402b27k57J173j19j111O85J97n61L08O56j017l65R14m44k15J013j92j263O69
2420a56P85p79K10O37r35m67J196k42q24Q00k40r61J177M30r03P3N54p05J72P50
2440E72k73r75O91R3l39N41K80j216K74Q71n85k10O60p00m19J095J50r08L85K63
2460B50q68N92O67p51j64N95n13k53R20m4r15J92O15o75L62N80r74j20R07l13
2480I0j23O08m31p15L80P36o30L7L63q51m2J295n64n28N73k82l58P42J08p53N7
$$ y = [-298, 781, 141, -570, 273, 18, -443, 580, 399, -834, -184, 287, -457, -103, 638, -161, -634, 551, 169, -279, 519, 363, -786, 45, 604, -503, -425, 203, -683, -564, 604, 217, -376, 126, 210, -580, 281, 919, -563, -516, 489, -288, -105, 636, -167, -665, 132, 390, -377, -43, 387, -639, -356, 846, -106, -472, 337, -227, -484, 689, 570, -541, 144, 341, -220, 88, 744, -273, -638, 276, -168, -383, 630, 438, -825, -156, 629, -150, 60, 697, -238, -705, 491, 249, -575, 225, -15, -976, 201, 631, -272, -199, 355, -350, -178, 572, 299, -676, 15, 108, -231, 310, 590, -626, -352, 519, -66, -276, 384, -316, -735, 360, 510, -398, -13, 250, -618, -26, 641, -110, -274, 321, -192, -445, 475, 431, -484, -292, 323, -352, 10, 590, -384, -504, 403, 90, -33, 575, 144, -571, -191, 545, -85, -48, 315, -536, -578, 717, 153, -375, 198, -84, -442, 300, 408, -345, -288]
2501b88N17l64M4Q08o40p69R89j27m96O11Qp07K78O47n08qK42l37m99J004M6p67
2523c16M04p7n64M52P14q64P8K58l3k42N91j03p29N12J80n40N77K69j010j1R14
2544D60m74n3J09j59k61L74N22n92Q1L04o86J03Q55n70k79L50k11k15N57O0o23
2565c48K03K85j82Q0K01o39m3N71N8j78J83k45l74M16K38k31j98K68k73j72O34
2586B54K0o49M52q2l25M06K60l65k78M16k11Q3M45l46l80K61J93k46K81K6n53
2607c38J57M72p4k94K37k62q8L88J53n45J30J16l57K24L52l21j67J46O8j61M25
2628B61o2m61K07J35j0n4J59l58k2K61J5J4M5j23k89K02M05j94k34R2j47J13L85
2651C40j75k93M5J40j29K74j66q1k12J48J02r3J54j52m6J27L20o0j99j11J03j45
$$ y = [-288, 229, -135, -91, 717, 77, -692, 297, 170, -326, 285, 293, -414, -136, 511, 3, -5, 237, -100, -599, 405, 451, -316, 88, 11, -553, -101, 613, -251, -173, 85, 52, -190, 401, 298, -431, 81, 261, -279, 298, 567, -443, -454, 460, -14, -67, 42, -117, -378, -4, 518, -74, 7, 311, -375, -272, 583, 13, -266, 84, -127, -342, 215, 275, -348, -145, 140, -42, 38, 239, -400, -443, 128, 186, 8, 191, -54, -428, -12, 226, -5, -203, 65, -208, -380, 254, 274, -375, 77, -5, -330, 76, 336, -29, -307, 109, -102, -19, 426, 80, -300, -39, 154, -92, 189, 215, -338, -181, 291, 217, -77, 160, -102, -190, 198, 351, -194, -64, 52, -305, -81, 271, -50, -217, -71, -3, -164, 261, 199, -262, -55, 80, 70, 16, 175, -183, -205, 56, 71, 85, 130, 7, -282, -80, 325, 131, -103, -11, -158, -45, 340, 165, -128, -83, 57, -72, 202, 36, -45, -257, -109, -7, -100, 54, -98, -144, -17, 303, 243, 44, -67, 36, -109]
2673a09L56m7k14l2j79J89K88l5k74P8j46J68qj4J3j68K8L08j45K07j75k17J93
2696F5rj73J19j53j00K88nJ58j32q3j25O2J49Q9p0L8k54m9L53J6j52k45L1j27
2720c09L11j23O1n7P2JJ45K00l63l5N2n4M8J93m12M3K31J08j5o9p9j08K3M29k35
2745E8j04J69k11j16N12p1k53L1j16n3J77K44l13j60K44k58J82K82j71k54K02
2766B1R7j70K52m4l36K76j1J10k58K08j89l82N91J16k92QP1m05M09J84j34l55
2788b33J09K00k59L51J05o32Q3L65k19K23N1j55j70K72j9kP7m3m24M03J28j26
2810H5k62L28k86J2M03k13l33R1J03j00L52j8k22j08K65q4j24L77r2l90K01J78
2832A63k62K97J18n53J01L20j78k32M39m33j44N99J04l77N3l9k04L02J32k34j52
$$ y = [-109, 247, 200, -14, -46, -225, -36, 252, 217, -57, 21, -125, 43, 35, 21, 34, -134, -106, 202, 57, 264, 89, -128, 65, 56, -117, 2, -151, -251, 37, 32, 190, 58, -25, -150, -88, 61, 150, 80, 118, -136, -185, 168, 184, 32, -213, -182, -309, 2, -121, -60, -117, -45, -44, 101, 301, -62, -97, -45, -99, -51, 142, -270, -227, 4, 112, 97, 28, -51, -159, -136, 293, 58, -46, 123, -88, -204, 308, 237, -16, 15, -101, -154, 23, 267, -46, -206, 38, -220, -38, 244, 73, -181, 21, 118, -52, 200, 156, -180, 96, 85, 195, -63, 145, -44, -426, 165, 281, -11, -3, 68, -337, 72, 256, 122, -233, -124, 76, -183, 168, 273, -359, -276, 89, -130, 93, 144, -11, -181, 91, 72, 70, 147, 104, -320, 83, 211, 85, -177, 151, -135, -123, 280, 67, -266, -175, -72, -172, 180, 162, -60, -168, 97, 13, -111, 266, 174, -216, -15, 163, -99, 198, 316, -237, -136, 184, 6, -226, 213, -220, -364, 235, 339, -38, 15, -24, -228, 74, 206, -28, -180]
2853a80K69p7p1M82l37n08L31K69l9j99K91l80K9L36j61j25K4l5k18K96K98m76
2875a81K38j11k02J70L92n02J41K52k81j1K89m5m51L27K20l41P9K23m11N5K09
2896E9J50j43K98j76n43L80M38n54o2M90m78JL66J5o79L92J69k32K55L07n92j40
2918b79O12m00k0L61k03m20M57O5l26K71K44n06k30Q13l46l52N18l82j57N42j5
2939B47l19KL24l98J64L58m79l14N36r3l99N45J48p12K03M20l19K1L12m61o3N19
2961B42j51k96J14M89q65O31K26o18N8L23l29L7M13q2n66L40L31l97J63J26m06
2982b17j00N32r7l67O08l22k24L48J66m07k9J95m97J75M73k23l07M24k41j07M18
3003B01j7l69O7K40k56J79L72n10j90M12m1l24N31k95m41K46N66n12o6L09l37
$$ y = [-180, 89, 12, -59, 423, 86, -422, -91, 178, 139, -60, 231, -149, -120, 216, 55, -70, -46, -81, -299, -3, 295, -181, 57, -54, -256, -86, 306, -196, -55, 197, -84, -95, 194, 149, -302, 25, 245, -96, -17, 206, -205, -150, 59, 209, 66, 364, 188, -355, 25, 463, -91, -153, 337, -141, -140, 226, 241, -438, -46, 123, -109, 146, 453, -139, -279, 333, -67, -87, 274, 71, -349, 108, 173, -153, 118, 362, -144, -374, 439, 93, -259, 259, -123, -280, 262, 247, -72, -70, 254, -144, 20, 378, -101, -415, 121, 28, -371, 174, 322, -390, -187, 233, -86, -65, 247, -214, -277, 242, 91, -205, -91, 398, -467, 164, 390, -228, -170, 153, -176, -139, 274, 192, -374, -34, 297, -100, 63, 189, -217, -317, 215, 118, -249, 359, 37, -187, 161, 327, -80, -109, 86, -411, -236, 237, 14, -293, 131, -110, -217, 201, 184, -185, -118, 122, -134, 45, 417, -93, -283, 129, 88, -236, 295, 0, -441, -195, 371, -141, -207, 102, -235]
3024b35k01O12q6j37L41l50l09L96N02o34k44N71l77p8N07k03m60N05M3m22L94
3045A35K3m80K60L12j44j80L43l29k35N56j20l16J91K85o22L65M82n73k32L84
3065A05J6j81J54M0m42J95K87j78q8L54m54j16N29p4j79J87n6m35K19K92j86R3
3087H2lj73j16M35j00l25L92k43k09K22L09l12j41N37l65n4M80n50k1K33m8k28
3109a98J33J27l66J27M57l30j57L95k04j72L77r6l03J47O2m43N54J85l36j87K66
3130C8K7j24K96j91l01K56j07P3m4K49l01r9L64o7k33K08j35k19L83O2k07k0J82
3153I0j34j31M67l03k35K96J4j55J65L9j67j48L47j47k4M2n1j59L25J32l44kN8
3176b5j24k02L35N2l38K90l2q3K05J08m11K94q0M1J40J80m22k23L42qj73K66j65
$$ y = [-235, -436, 176, 90, -47, 294, -56, -365, 31, 533, -101, -345, 226, -151, -229, 278, 75, -385, 120, 163, -259, 135, 158, -322, -62, 250, 106, -74, 269, -60, -295, 261, 141, -175, 16, 301, -321, 44, 526, -47, -279, 105, 121, -60, 94, 134, -308, -113, 174, -4, -92, 262, -192, -308, 221, 147, -32, 155, 99, -336, -117, 175, -11, 82, 79, -94, -210, 225, 125, -200, 192, -51, -260, -38, 271, -41, -182, 355, -10, -64, 416, -134, -155, 78, 30, -198, -65, 62, -304, -177, 280, -50, -207, 188, -16, -188, 189, 93, -210, -63, -1, -444, 110, 295, -41, -228, 38, 65, -59, 237, 46, -255, 1, -106, -33, -77, 172, -129, -228, 136, 69, -164, 44, -91, -310, 73, 135, -72, -92, 90, -44, -175, 292, -11, -246, 50, 64, -91, 74, 113, -54, -202, 145, -2, -26, 16, -35, -194, 131, 263, -81, -83, -25, -149, -351, -16, 36, -302, -12, -44, -127, 78, 186, -225, 69, -11, 30, 170, 350, -72, -295, 47, 39, -134, 132, -33]
3199c3k19L04M9l7k2M5j68n8K54jq1L4j48K7O7K24l30n0K48j99K10n7l1k39J21
3224i0R9j71L58j49j71J8K42j87j2K0o8K5J57K00k18p0j00l6J29K21j17k02L17
3247A95j89m2L43l15q9j18J70J89j34J32m7j75L3J14O6r5K6k01K33o3K25l43j05
3270a90M1J04J58k00J59p8k16J10J52j4q9OJ45j87J35l2J22l62K08O8P3j90J5
3293f2N7j71L37k5n1j97K57j31j9N1N9k10K03j85K64j83M8n8j49K52m6N1m6r1
3317d5J05j21K13j62O6j52O2K97k22kq6k3K9o0J0J47m1p2k1N6K1M5R0j73j1K24
3343A74q4j61P5l4j33L76p8k46Mn9Q6J56O3j65j29J00K2j3n9o2K14n9J30j49M
3368b7n1J8pK52p4j29O9j15p8J40L14n02O3K51j96M8L62l78j94L14j09m3K18o6
$$ y = [-33, -252, 52, 101, 64, 42, 87, -81, -139, 115, 114, 33, 67, -81, -54, 13, 237, -93, -143, 105, -94, 116, 59, 28, -211, -90, 9, -162, 196, 47, -124, -106, 136, -51, -63, -43, -111, -86, 71, 271, 53, -17, -117, -153, -24, 197, 80, -122, 195, 6, -36, 307, -8, -97, -215, -45, 144, 10, 142, 95, -80, -47, 67, 133, 38, 64, -137, 96, 33, 258, -85, -190, -149, -45, 113, -87, 72, -6, -222, -112, 40, 26, -63, -57, 88, -99, 36, 4, 126, -236, -28, 40, 113, -77, -62, -5, -176, 161, 136, 85, -112, 145, 14, -5, 46, 105, -105, 98, -87, 177, -6, 42, -16, -165, 87, 41, 92, 46, -45, 60, -61, 152, -10, 56, -96, -34, 263, 41, 39, -47, -70, -41, -101, -91, 56, 15, -57, -78, -22, -1, 44, 134, -39, -50, 174, 90, -71, 4, -30, -163, 213, 135, -111, -107, -166, -80, 76, 139, -26, -155, -55, -33, -46, -105, -167, 47, -12, 118, -31, -27, -78, -60, -67, 185, 111, -18, 51, -64, -142, -2, 312, -190, -127, 124, -72, -24, 338, -40, -234, 80, -29, -72, 146, 80]
3392H0k05J36rN1JK18l32j09K34J16k40K55j59l7N2K53l00l4L1q7J9K73j00j07
3416@r6J52r0J13J3k37p6K80j03l5L37k65j55K03J11p9J31j61j51j4M36l04j78
3439a68K56l2j50K83j58q6R1J1j35J15J91k73j73K23J41k60K33j05l1J16J56k95
3461e0j00L02l31J00M41k04k47J14N4j61M6J50o8k31K45o1m4P8N2k40J52R9k04
3484a08J56n5k74J6K82L2m7R8k57M4J48K72l76o6L48k58J49J41k63k85M92j45
3506D4k50J99Q8k39J85K5j54J25J97l49n7L15j87RN6M4l67N12L6l03L2K47l21
3529a13r4L63r4l02L40q6m2Q2n0j15j79M05L1k17J48j24k05L64K2j69K1J16l73
3552b71J49L10k66r2K45k40K7L15k1m05K13Q2j03J46J25k73P9j3j02o7L40j56
$$ y = [80, -125, 11, 2, 53, 54, 272, -60, -169, 65, 181, -59, 196, 37, 0, 52, 305, 5, -29, 2, -85, -66, 207, 107, 0, -96, 56, -34, 79, 92, -145, -221, 59, -44, -79, 258, -7, -162, 41, 152, 73, 204, 43, -108, -122, 314, 10, -168, 88, 56, -94, 189, 31, -55, 36, 47, -88, 27, 218, -55, -228, -5, 136, -124, 109, 4, -27, 89, 245, -50, -150, 152, -179, -79, 362, 158, -89, 25, 79, -82, -36, 114, 46, -185, 60, -1, -45, 33, 85, -155, -3, 96, -108, 48, -7, -281, -265, 17, 49, 2, 100, -157, -113, 35, 307, -69, -135, 213, -45, 104, 245, -18, -303, 189, 44, -206, -7, 81, -158, 27, 52, -102, 23, 220, -129, -186, 129, -58, -49, 7, 51, -316, 196, 232, -71, -39, 208, -113, -207, 156, 62, -240, 100, 14, -28, 54, 4, -111, -290, 115, 146, -71, 77, -47, -252, 112, 134, -35, -14, 102, -271, -122, 188, -78, -170, 75, -165, -138, 177, 156, -249, -36, 46, -57, 89, 214, -59, 20, 7, -95, -162, 178, 22]
3574B2l12K64K06l31K07J45j80QJ46j60q5J40o4l42L14K86l77R2K42m14J36L09
3596B52k12j72K50p3k35M04j47m6lM7QJ9Pk93k3N01j29q4m9Pk01R8L95l28j12
3621a19K56k45j10M84p9k99P0O3k35K74J91m33j10M03j39P9J44j80l23M77N4k36
3643a3J32j74q4J1K77q7n7q2Q6l30M48J4l44J10K62j13J23R1l04j18J67J1o8K44
3667B02k52l64M15P0j15N4j7j03r0L76j24r8J52p6q2K98j04j48p2J78j56j22K61
3690H3r6j65K41k6k7r9N0j12j0L42j28j29K22j76j68L68n2l25J08J80l38K65P1
3713G9j37k77M25k2l80N09j04j62Q4o9k1J13Q7k38n4K76J37m31K63j32j55J74
3735c5K97k09j04J07k79J56J71K4k27J09j87J37J26K8j92l3J53j18M5J89k71R4
$$ y = [22, -290, -26, 180, -151, 56, 201, 21, 29, 175, 15, -70, 70, 6, -336, -22, 264, -113, -21, 221, -193, -57, 252, 40, -132, 118, 45, -190, 214, 67, 21, 18, 65, 73, 92, 99, -194, -217, 284, 155, 71, 22, 29, -172, -74, 321, -7, -119, 137, -108, -218, 266, 187, -112, -42, 21, -214, 60, 251, -182, -292, 111, -28, 51, 195, 15, -308, 169, 223, -13, 119, -55, -139, -128, 149, 62, 5, -77, 9, -321, 127, 141, -203, -93, 169, 56, 179, 270, -34, -152, 15, 26, -42, 202, -50, -414, 1, 71, -44, 10, -7, -110, -200, 176, 52, -46, 106, 30, -52, 246, 142, -6, -78, 100, -56, -178, 83, -13, -178, 63, 37, 10, -89, -39, -151, -161, 181, 53, -76, 146, -30, -198, 170, 118, -207, -99, 81, -257, 8, 79, -58, -335, 90, 68, -312, 197, 93, -69, 15, -54, -75, 38, 125, -113, -167, 109, 246, -185, 78, -54, -209, -35, 262, 53, -51, 56, -223, -67, 104, 128, -99, 10, -177, -40, 86, 114, -78, -111, 42, -76, -31, 158, -113, -19]
3757a9J18j01p9K71k6k87J61pO9p9r7J59j84K06N2l05R7K39k79R8R1j49j48K69
3781G0N2k54K58j71k01J28K29m2l04L86k80q4K64K91l86J48j68J56r4L5j04%J61
3804I0j20Q0j0n8j54R6L9J31m4n0QM5L9J3Pm4k77J11l5K25j76J31j65O8l2Q6j3
3831iN7j60k6J46J62j18o3j78K82k05K16m6j76J27j01J09jn0k2K9R3r8J43k38
3855a27Q9k0n7J27l2N5j14p1J92p8o7K95k69l4J08R5q0o8R8r4P7O6p0r3r4M0M0
3882h6O9j25P9O6o9N4J73j76Rp1K5J45o3ko2q2l6K28k3J04k30j97K71%k1J44j88
3909f4j3Q6Q5l3k60J80j01J57r7Q9m3L7k03R9N4K7Q1L7k23J90n8j95L11j35j6
3934hj4O1l2M2p6l20L22J40j51j02O0j4M2K11j68k34nK86J45k27J58k13J12j51
$$ y = [-19, 99, -2, -81, 190, 164, -123, 38, 31, 100, 21, -76, 83, -101, 105, 157, -148, -51, 188, -91, 7, 98, -51, -199, 70, 122, -132, 126, -45, -246, -118, 111, 69, -235, 151, -129, -213, 51, 342, -44, 104, -64, 92, -2, 33, -71, -71, 90, -30, 50, 40, -18, -172, -76, -37, 94, 50, 0, 8, 53, 92, 105, 112, 68, -209, -98, -133, 92, -84, 47, -118, -50, -82, 4, -9, 48, -112, -138, 8, 170, 52, -11, -189, 93, -112, 104, 58, -118, 9, -92, 17, 16, -34, -56, -27, 66, -32, 111, -127, -38, -58, -115, 12, -20, 35, -79, -150, 42, -36, -103, 192, -77, -111, -3, 92, 12, -56, 42, -52, 25, 91, 21, -72, -166, -126, -86, -17, -142, -63, 3, -66, -12, 161, -15, -6, -77, -52, 93, 30, 28, -34, -116, -152, 76, 53, 157, -73, -270, 1, 1, -20, 124, -64, -77, 9, 94, 61, -199, -19, -120, 37, -60, 29, -14, 23, -180, -81, -27, 0, 81, 118, -105, 85, 27, -168, 143, 8, -8, -22, 39, 7, 49, -27, -347, -25, 115, -36, -138, -78, -92, -50, 161, -7, -241, -246, 40, 185, -42, 116, -97, 15, -136]
3958a36L43k01l2K03k92J60n5M6j63J48k3M3M0r4L9j13M1o0K76j07p0j9n7J5R9
3983C1N3k20p1J98J44j22j15Q0o2J67n3J7r3J79k43N5M5M4k15K47j10j15P4O2
4007b3j06o1M14k62L6J15j6r6j23K26q6K8Q3k60J68J46j68J28q6k21J37o7J64
4030G0p9j7ko1O9J35j95OJ84k25J65j6n0j7L3J90l00K60j03k04R5J08q9J70n7
4055G0j25l45M44J4j22J4J94l7j74P4q2r2J20J67j86J74n9j12J59K1k7r6J19j74
4079f1N7L9J13k01N4j01Q4L0k6J06j52N6k5j04K23R4k2k10p7J2J09j2j99J97K5
4104Ip1M3K15j51j57m5J95j22K42Ll73P1L19o6l8j33J70k14M7J98k05mP0j35J46
4129A4j7J16k84N9R7o6J65N6j55j9R5j90nJ37n0q7P8L3j41J48P9j91K14J46k84
$$ y = [-136, 207, 6, -26, 177, -115, 45, -10, 36, -127, 21, -2, 41, 81, -13, 26, -87, -46, -106, 170, 63, -7, -26, -83, -68, 31, 84, -136, -207, -9, 135, 13, -102, -22, -84, 83, 30, 47, -46, 133, -110, -55, -10, 34, -181, 66, -44, -159, -85, -23, -129, -190, 224, -38, -2, 113, 97, 1, -122, 104, 18, 46, 129, -131, 37, 183, 15, 143, 57, -164, -27, -94, 70, -9, -26, -28, -89, -20, 115, -80, -74, 110, -115, 50, 34, -16, -33, 0, 190, -110, 150, 47, -157, -62, 46, -43, 127, 70, -55, -400, 44, 58, -64, -50, 144, 107, -67, 7, -75, -167, -47, 120, -66, 108, 49, -63, 96, 117, 90, -6, 113, -61, -4, 35, 148, -53, 1, -100, -16, 14, -12, 94, -58, -2, -27, -131, 92, 186, 164, -46, -123, -111, -2, -14, -213, -16, 9, -62, -19, 196, 45, -112, -157, 38, -84, 158, 161, -212, -141, 178, 112, 74, -59, 111, -103, -56, 142, -63, -67, 3, -132, 14, -3, 113, -171, -112, -15, -81, 84, 140, -15, -34, 61, -129, -134, 3, -47, -134, -56, -23, -164, -16, 63, -128, 86, 232, -52]
4154e2l1Ln3J03J24M5k57J39J07j41J7J67k72P0J00k4k72K20Q7k60J98J71l00
4177a11L8J6k4J4K78o6k40K23j82P9l1O0k63L32j00n2J87j46J6j2M3k5K3K9n9
4202B7o3P7P5l6k05K24j97J01m3m1J67m7j30n4K50J24k24k64K76k90K25J39j30
4225c9k18J99J1N2n9J93k98j7K98l21K41j0n9k7P8K1j20K35p6k52J84j37o0J7
4249a64N3K1N6J88j85j0J2J36nl5J72j47p9n0Rk4M5l9j9J14J26j60r3%n4J68J
4276C7j4n3pq8J13j1Q1p7P2l9j83L96r7k43q2K29L7j40O1jk3J84j28k7J04j2k83
4303a94K4K39J49l18K13j66p1j2j7o9Q9J20Q2j96K49q3j69Q0P6R7M1j48j53K3
4327a14K20J1k18Q2L2o2k8J78j82J35rk38Q9J20j2K6k41K01N7J4j26P0j67J52
$$ y = [-52, -83, -80, -133, -30, 94, 139, -118, 21, 128, -13, 4, 171, -101, -31, 69, 45, -227, -7, 80, -180, 18, 189, -111, -73, -57, -81, -67, 211, 145, -95, 128, -54, 25, -6, 54, -209, 123, 23, -29, 158, 12, 28, 16, 59, 34, 57, 86, 27, -36, 41, 116, 80, -125, 99, -98, 3, -40, -81, 86, 39, -91, -145, 105, 229, 5, -259, 17, -273, -48, 91, -39, -257, -58, -47, 5, -54, 139, -159, -176, 122, -199, 42, 32, -27, -54, 24, 45, -75, 160, 84, -168, 16, -121, -181, -164, -111, -90, -34, 154, -31, -41, -29, 107, 102, 67, 239, 92, 13, -37, -28, -52, -7, -46, -65, 49, 175, 15, -78, -78, -132, 36, 37, 23, -30, -37, -125, -12, -23, 58, -19, 53, 14, -169, 227, 130, -113, -195, 34, 71, -69, -8, -9, -32, 152, 24, -3, 101, 89, -194, -170, 69, 218, -100, 113, -53, -124, -136, -153, -222, -133, -13, 69, -127, 122, 39, -130, -50, 26, 123, 164, 16, -137, -114, 106, 117, -101, -19, 13, -49, -77, 101, -81, 54, 45, -193, -104, 16, 4, 30, -211, -10, 47, 61, -65, 5, -162, -10]
4351a0M7L4n7j81K9K76j43J35m2K9k16J31N7j64J01Nj5N7R6j07j86J30j0q9J25
4376C2n8P8l8Q1j80J38j50j48J97J60j6j52R7l1J50j73j06K40j02K1p8O6K15j34
4400A09j20o5o4J49P1pP7k82K0J73m0QN2j76K25j30o0J18j06J20r0o1K88k39J68
4425A38m7n6P4o3K4l2m5lK9L4j00J93L2j02j69LJ57k11J60P6k26MJ42j0r9J31
4451C4o2Q6k7j11J14L71l25o2j91J10K10q4q7N3J0p0L9P7l3p3j6j30J32O7o1k5
4477e4mj25J17NO7k4o1o0J76n8o9%K7L0k7J54k86K44n9p8K44J5j25j58R4OJ45
4504A36n6m8J07l22K44r7J1J57l17J39j78K82L4k11O8j53L09q8P6j17j73p0L06
4527C9l5J9ok34L3K47J15k02Q6j16Q5j60P9N6O3j64L6o7K5J17jm7Q6O5k93K20
$$ y = [-10, 37, 71, 14, -167, -138, 138, -5, 130, 88, 117, -99, 32, 89, -75, 26, 31, 16, 73, 169, 62, -124, 6, -4, -93, 32, -26, 52, 14, 95, -85, 53, -97, -245, -48, 112, 96, -56, 41, 10, 160, -13, -119, 121, 19, 40, -38, 28, 243, 109, -11, -76, -140, 9, 80, 73, 150, -132, -112, 61, 21, 29, 81, -95, 130, 0, -60, 58, -48, 72, -18, -79, 209, -30, 138, 91, 35, 109, 46, 70, 38, -7, -10, 19, 53, -47, 146, 178, 76, -93, -90, 67, -144, 16, 92, -134, -130, 12, 2, -97, 34, -28, 58, 31, -80, 34, 405, 80, 18, -173, -63, 147, 63, -24, 29, 39, -31, 8, 85, 52, -21, -37, -167, -35, 32, -29, -54, -58, -183, -66, -61, 6, -18, -79, -139, 37, -21, -90, -90, -63, -33, -60, 94, -192, 52, -7, -85, 159, 174, 49, -109, -15, -9, 136, 80, 32, 139, -183, 61, -36, -25, 132, -185, -46, -224, 58, 92, -119, -51, -204, 105, 17, 93, -24, -197, -267, 39, 4, 23, 17, -217, -184, 63, 178, -24, 62, -54, 31, -129, -50, 6, 69, -95, -59, -126, -101, 16, 15, -32, 54, 119, -174, 46]
4553D6r8KO9j56R7M0O5o8p3M8O1n5j44J22j22J91L15l72o2J29J2l0j69N6J29k9
4579DPJ60j14K9j87R6J26j1j10J26k15p6R1J28q8M5q2j15M19k70O1q0m7J10j44
4604a37K35o2k2%l8K3MJ67k06l9O3L1r3P2r3J05M1N7p5j11Q5m7k7J00q0Kp8J81
4632E8k8L3J21j25K5p2K0jO7k26K42m9o2K5j88J48j57J81OK62j86k59K81j19K16
4657B13j77O1j64K47k71Q8o7J64o8%n6KJ89k13N1j45J58Q9j59R0m2k71L00J27
4681A46j03r6J9qJ69rj47j44J92j63J11J1P4k60L03n8k8P0j6j66J20J0M1m9n5
4706c6j69JK38j62K33j44M3O5l6p7%m9L4p6N4Q7R8r6P4j19K7Q5r8M9j14R8R4j12
4734hJ38j21j23J54l7j35L0J52k8Mk6J51j80J13k2j10mJ99k30j4O5k3J55j62J90
$$ y = [46, -52, -50, 19, -137, -40, 0, 65, -3, -76, -28, 33, -22, -166, -44, -166, 25, 340, -32, -94, 35, 47, 17, -152, -96, 33, 4, 11, 171, 57, 86, -101, -5, 121, 110, 0, 126, -89, -165, -74, 54, -34, 11, -71, -186, 233, -37, 24, -56, -103, 7, -137, 98, 36, 14, 14, -24, -1, 3, 170, -36, -75, -12, 19, -74, -2, -95, 10, 51, 108, 33, -78, 7, -40, -67, 33, -47, -45, -123, 58, 30, 63, 184, 59, 84, 12, 32, 31, 98, -128, 114, 65, 3, 28, -160, -12, -169, 12, 18, 280, 94, -165, 116, -3, 213, 36, 97, -67, 180, -91, -3, -70, 94, 26, 26, -30, -28, 161, -52, -1, -146, 12, 101, -58, 32, -10, -281, 19, 146, 43, -53, -34, -42, 127, 118, -29, -173, 19, -144, -33, -22, 52, -208, 95, 37, 9, 79, 63, -103, 17, 27, 68, 19, -36, -205, -204, 34, -128, 105, -39, 4, 69, 33, -44, -44, -93, -59, -135, -81, 6, 104, 8, 82, -37, -10, 75, -23, 26, -88, 10, 104, -8, 130, 9, -114, 40, 3, -132, -102, 50, 22, 26, 0, 151, -29, 84, 62, -48, -52, 147, -83, -97, -32, -55, 100, -62, 128]
4759A28j82l2J68j31J7J33j83N7J35p5j60R1J4j00j8K77k59J37L0j30Q8n9R3q5
4783d6k1P3q9Q3M8p4N3p7k0J70j16p2R0K9p9J39k1j4K8Qp7J22k31Q4k0M2l7q1
4811a06O1M5k2J45Rj59N7o2Q6q2l0p2K4Q3R3j27J02K5j14M7O9p2L4j13R0l3P0
4838D8m6j36P4J8O3O9j74J71j10m3J67l7r1R7m1j88K66j38J8M1J08j14j19K81
4862A84k10J29m2N2k71J69P1j4r8J88j61QJ52k59J3O0M1l0Q1k00J49N6Rj41R9
4887C5r8j37P9K30p5Q3j39l8K2%J37j86K85rj08M3j25qL0P5L1j82J36N1k06p1
4913a45K24J37k25QL9j61K24j78O3lN0q9m1J18Q6j18K8j63m0K57j15J22l1m7j89
4938a89K16O7k3l9j39Q3K8J45L5k90K99j52K2k18m0K30J7L1j59J66r2n9Q9J63
$$ y = [128, -54, -86, 82, -49, -32, 101, -82, -25, 110, 35, -125, -34, -20, -120, -138, 139, -120, 17, 47, -83, 5, -54, 39, -46, -67, 6, -83, 0, 48, -26, 27, -50, -70, 100, -16, -88, 2, 31, -48, 91, 70, 56, 84, 92, 15, 137, -94, -10, -30, 12, -25, -106, -45, 0, -22, 123, 132, -27, 30, -32, 54, -28, -58, -130, -106, -23, 70, -57, 45, 70, -44, 3, 72, 0, 34, -79, 11, -22, 48, 2, -134, -60, -42, 21, 90, -84, 87, -23, -66, 101, 64, -27, 70, 29, -159, 107, -31, -13, 28, 136, 22, -97, 184, -26, 103, 61, 113, -158, 11, 82, 68, -30, 158, -3, 5, 157, -102, -89, -29, 12, -18, 63, -137, 12, 68, 77, -64, 35, -63, -200, -121, 109, 34, 117, -22, -60, -38, -38, 99, -87, 198, 189, 81, 124, -1, -9, 21, 96, 127, -55, 81, 132, -74, -145, 79, 216, -9, -1, 38, -123, 101, -77, -14, -17, 33, -56, -97, 21, 107, -11, 17, -146, -186, 71, -44, 78, 47, 0, -189, 27, 94, 71, 32, -107, -24, 4, 149, 184, -106, 193, 41, 63, -155, -195, 35, 52, 83, -76, 90, -2, -61, 28, 191]
4962A91n5j93J5q2J47O0o8j0j4j1J17j03J44r6j31Q9P9j80J15O1j64P4O9l5l2
4987a3j86J50l0qJ43q6J45k16MJ18l5q8O7J46j20J0L3j23Q9J00k8n1j38K30j77
5012f4K04o8j64J53m2O8j07m9K23j58K9j23R4N2l1NP1k5m9m0J55j27Lk2J04n6
5038C6K7j32K9p6J83j45j2J56p2k30k1K02J49j89J17k0J33j57K12j41l6P4l6N9
5062A10j44J16pk9p1m0J31j83J43l0q5J29R3j71p4J34L3m5J3K1M7j12kJ25j36
5087c4J5m0J7Q6r4J10o7P2j60J81j6j36p2P3MJ63m7n9%k9M7J39k50k3j6K10j0
5114F4j6p8q1J09J00k3j23J0KJ18l2l6n9J38j61p1J40n8J88n6j86R5q2J64l4O7
5140I9j43K9o0J30l4k0m0n3m4K04j3l8Q5j45P5k33K41r7P1%m0M3K3j36M3J09p2
$$ y = [191, 136, -57, -42, -124, 23, 83, 15, 5, -9, -20, 97, -6, 138, 42, -89, 0, 79, -101, 14, 75, -89, -15, 54, 19, -13, -199, -49, -79, -87, 56, -30, 115, -101, -97, 21, -14, -102, -35, 111, -9, 1, 34, -89, 0, 100, 72, 21, -117, 113, -64, 140, 72, -92, 61, 19, 87, -20, -69, 154, -4, 25, -98, -4, 48, 17, 22, 93, 68, 19, -21, 134, 7, 10, -12, 92, 36, 63, -69, -40, -116, 67, -78, -90, 66, -6, -236, -257, -55, 94, -95, 22, 2, 135, -22, 190, 49, 13, 87, 51, 110, -34, 82, 75, 46, -25, -65, 66, -117, 26, -4, -89, 40, 133, -38, -112, 22, 55, 10, 23, 44, 91, -21, -23, 102, -34, -19, -59, -42, 44, -50, 60, -7, 65, -95, 86, 70, -66, -138, -65, -61, 102, 55, -4, -4, -33, 14, 153, -97, -120, -136, 74, 64, 48, -30, -111, -2, 98, 75, -48, -38, -36, 82, 50, 14, -45, 93, -68, -139, 1, -57, 131, 75, -111, -16, -98, 66, 32, 99, -44, -15, -75, 55, 21, 1, -39, -92, -136, 68, 55, 17, 102, -43, 32, -201, 40, -57, 14, 14, -26, 17, 40, -96, -53, 56, -16]
5167a6k4N2L5KL1j49Q1J34k61P5o4Q2r4J41n5n0l6K98j83N8N5K2j88L5j01O6K8
5194b6j62J97j34K54j37K1o8J32k35L78l37J37Q7n4m5M3j24M2P2j01J13p6RJ01
5218H7j07J14M5j81R5o8J11L1M5j83M8j76K13L6j55K50n29L43n5N1j21K31k30
5241a05J93k00N3J30j06O2r2J64j44M3M1Qo8Q1l1j23L7j18J69r1R3L4N8k03J83
5266F8nK7j29j2q6J37P7l11K44n8%o2K73j17j9j29K43j00J5p3k5q5J55j22M4M
5292d6P6n0O7rk3J15l6Q4k12Q2m3NJ26j68j31L08M1l63J91k7q7l4J66rp0L7P8
5319F8k45K44m3k6q2J08O4j3L3j83J70q6Q7m9k10J49k1L3J21k16J51Om5o4N9P8
5345H8j26N3K1N2rj04N1j62J18J20r1N1o8n7K1P3q1K82j23k02Q7j9M4k26L49j30
$$ y = [-16, -40, 12, 47, 49, 80, -69, 12, 146, -115, -40, -104, -22, -116, 25, -30, -80, -116, 182, -1, 57, 112, 134, -54, -19, -120, -54, -26, -188, 9, -125, 129, -8, 13, -55, 77, -158, 220, -117, 20, 107, 53, 8, 51, -73, -31, 41, -60, 53, -23, -14, 87, -20, 94, 139, -42, 53, -15, 96, 127, 172, -11, 37, -139, 74, 110, -45, 205, -324, 19, -36, 15, -106, 125, -105, 88, -112, -59, 71, -35, 27, -65, 99, -45, -2, 39, 47, -21, 60, 29, -94, -57, -175, -6, -97, -4, 30, 88, -115, 68, 63, 90, -39, -51, -137, 0, 77, -234, 10, -48, -48, -110, 163, 46, 27, -102, 141, 41, 56, -17, -42, -127, 28, -94, -50, -46, 30, -20, 47, 38, 15, 130, 94, 178, -34, 48, 5, 10, 136, -32, -163, 145, 186, -177, 14, -13, -100, -134, 32, 23, -47, -10, 68, -177, 67, 24, -2, -84, 24, 88, 75, 108, -75, 95, 9, 96, 47, -163, -14, -35, -2, 119, -97, 54, 60, 15, -49, 10, 88, -38, 15, 36, 88, 79, -25, 26, -136, -18, 102, 11, 62, -6, -63, -42, 31, -50, 232, 109, -93, -6, -25, 19, -207, 142, 12]
5371A2O5K3jk26J12N6m6k5O6r8J08m6P6l1m9o9P1O0J8r7o5j4O5j21K89k4j98j4
5399a03J75J60k70R8m1l6N4j5J37j70R5m2m0oJ33q7k3o8p9J31j44R5L0j44L27
5424A67l49J67J0L8n6K5l3J98k60J69q1J1q2N5J73n0r0O0j08k9J12O7j93J14m6
5449a1K2j08j8J31J29n8j44L9L7k0j27M1lJ57o5l8M4l9J29j21K25k4j39j83J56
5474A2J28k32MP1J07j36M7L9r4J67j33J35Q1l30J26j69rJ87j12K07r0K4k9l2J2
5499a9M8K7m8J42k68J77j56l3O4K01k16M9PJ23k9k48J22J61k15J02O9j05J39r7
5523cP3j48J23j30K83j96J2QM1J6j9J19j11n9j78J73K24j39j77J71q5L0J5m1O0
5548F2j7l9j57J50j1R6j65J62o2QM2j12m7K33k71j25K16p0J20N5p3l1J18o0k14
$$ y = [12, 77, 100, 99, -127, -15, 41, -5, -30, 36, -62, 46, 0, 76, 45, -4, -73, -2, 58, 76, -21, -86, -100, -35, -156, 133, 109, -89, -103, 72, 232, -38, 60, 19, -17, 37, 22, 159, -11, 84, 42, 2, -4, 129, 42, 19, -49, -128, 3, -141, -46, -16, -160, 167, -182, -15, -5, 33, -23, 2, -31, 167, -93, 76, -5, 6, -76, -21, 152, 102, 12, 72, -36, -65, 47, 114, -79, 35, -11, 11, -97, -115, 16, 145, 87, -57, -18, 19, -1, -128, -87, -90, 67, 2, -36, 8, -31, 98, -23, 202, 178, 39, -144, 12, 140, -92, -88, -17, 90, -46, 1, 40, -54, 113, -20, 115, 196, -134, -8, -177, -186, 1, -111, 96, 6, 30, 1, -31, -19, 29, 56, 8, 150, -118, 59, -97, -130, -66, 135, -81, -32, -25, 98, 69, -179, -57, 104, -111, -9, 60, -45, 94, -3, 70, -78, 45, -85, 198, 2, 14, 22, 63, 79, 60, 179, 68, 9, -169, 4, 228, 89, -88, 83, -2, 28, 43, 2, 62, 45, 6, -151, -1, -12, 84, -81, 81, 19, 27, 69, -43, -90, 143, -128, -253, -37, -107, 13, 68, -5, -36, 82, 22, -192]
5573a92K02K0j46J03j93K02N1J2k5jj0j3m9p3K73k54J46K8p0Jm3J0q0J75k60J28
5599e8O8mO0n4J8o4P7J8l12K37J3J8o7R8j79J34Q8n6JQ5k29N5L2n6P6j5j38J30
5627b4R9j49J24j45J62m6M5j27J94j91Q8j33L1l7J75k9k13J82m2Q2j72J79j28
5650g5O2j9%J23j35M3Q0j24j33N8J60j24j2J24n0K32j43n3j18p0J23J7j41K58
5674H3j52J62l1m3p4O9m4MJ08j3Q0nk50J63j45K88j62j18R0n4%J34l8o1n9R2k1
5701Cn9M2K27l93K50j63R3P4p8M0q8R4k2J92j25j53n9K06O2k59K16r5j09R2J23
5726A11q3j2Oj69J42m2j00R8J35j41lJ79j43kQ3Q4j25m0m4Q4J34j59J9R4j10J7
5752A3N3j13J14K7j50N9J4N1m0J2k2pP2j41J06Qj20n9N6O3m5J00J0j57R9pK01
$$ y = [-192, 10, 30, -116, -13, -206, -4, 47, 59, 34, 33, 23, 10, -39, -112, 161, -93, 53, 81, 11, 12, -31, -21, -101, 74, -186, -58, 10, 6, 66, 12, 30, -34, 43, 61, -251, -14, -1, 17, -50, 48, -131, 3, 91, 35, 36, 121, -108, -53, -21, -77, -1, -16, -154, -24, 75, -74, 50, -95, 67, 21, 66, -61, 133, -58, 30, -103, -72, -109, 66, 37, -176, 6, -36, 46, -126, 53, -75, -13, -32, -32, 91, -44, -1, 79, -45, -178, -120, 40, -84, -96, 28, -22, 210, 67, 14, -104, -174, -51, -34, -175, 83, -69, 93, 62, 19, -55, 14, -30, -26, 82, 69, 149, 144, -106, 57, -88, 200, 38, -80, 10, -44, -44, 90, 52, -9, -68, 24, 3, -56, -14, 213, -180, 70, -93, 0, 74, -4, 36, -52, 42, 20, 212, 87, -66, -125, 81, 143, -116, 100, 5, -104, -12, 111, 28, 16, 22, -147, -5, -47, -147, -49, 86, -55, -58, 121, -22, -24, 59, 143, 18, -22, -66, 18, 152, -7, 12, 106, -4, 13, 66, -47, 67, 94, -56, 3, 17, 68, 28, 40, 18, 11, 83, -58, 48, 56, -64, -123, -67, -4, -49, 51, 61, -96, 3, -4, 197]
5779A97j56Q7O3r9m6j12jj54L47q6J64q7r0l7R0j21K7N7j11OJ54k0k48J60k1q0
5805a17J34q4N2M6J51j44l8j70J77pK1N7j17J7p0P1oJ1n3J31j00J02j23N9O9k21
5831a52K28k8mo1L9K1q2K10k68l3K30j11Qj70L48j67m8kj15J65p4M7q8L12j55
5856E0Q5k55P6J61j30k6Q4l42L87j35J32j10qM0J84j51j3j41K84k08Q5Qj16nM7
5881a7p7J16j19J57k6p5M0q5J27j62K17M5j55J46%L5j66j04o0K27j17K0J00o2
5905Ek6k1j2M8K0Jl0o1J79j25J7N5l3R0k01J07j49K41k0q0q9m7K7P8M4j82J87
5932B3J4q0R0m9l2N9LJ20k03K8J84j78q2K22J2n7j42J30p6K5j07J11RP0r0j09
5958a05J20J3P0p4J52p3q0l9J38r2K4j5p2j7L4kj34J04J30j3l2Mn4J05qr2L0k6
$$ y = [197, 41, 128, 191, 92, 46, -66, -67, -221, 126, 40, 204, 117, 27, -10, 80, -41, -14, 43, -68, -62, 92, 72, -176, -16, -37, -117, 17, -67, -15, 31, 182, 38, 0, -170, 7, 0, 21, 78, -39, -22, -92, -21, -27, -16, -69, 62, -38, 64, -59, 0, 69, -152, 76, 48, 44, -17, 22, 43, -39, 171, -97, -130, 100, -11, -3, -173, 175, 8, -40, -42, -157, 8, -66, -19, -107, 205, 50, 135, -120, -44, 117, -13, -39, 45, -297, 90, -45, 87, -23, -31, 9, 193, 42, 29, -112, 172, -36, 49, 57, -59, -64, -17, -94, 22, -97, 60, 34, -41, -1, -86, 41, -121, 96, 141, -14, 132, 132, 167, 1, -103, -163, 64, -53, -33, 67, 5, -21, -42, -54, -6, 14, 15, -15, -76, 103, -22, -5, 50, 17, 107, -94, 13, -136, 105, 85, 5, -84, -131, -104, -26, 18, -164, 23, 37, -43, 47, -2, -34, 25, 28, 148, -55, -27, 157, -21, -103, 119, 131, 74, -68, 62, -14, 11, -96, 15, 24, 94, 4, -105, 15, 28, 98, 24, 176, 103, 23, -16, 122, 30, 54, 39, -33, -50, -16, -18, -152, -48, 82, 69, 37, 41, -13, 92, 84, -8, 22, -4]
5986dj57K01K0j30J94j41Kj41J68N8m0K8Pj10J49j5Kj46J80j60o9K40j21p4J09
6011E0r7J30j09O6Q4n4j87J38N8j40l0J92p9k4j27J81j36R9j52K86k7k76J46r5
6035a03J83j00J2J08j10K6J9k46J98J01j97K24n9j6m3k0j10J12M7P5o4j0n3J04
6059G8m0oJ52l07J95m3P6J0k61K16q7pj13K11m3p1j31J24K0Q4Q0j11j53K27M9
6084A49j30j53J72J20k67J25M7M0m6K7k75J83KL9R1r2K2n9P2k1q8Q7L0N9k11J01
6110B4L4k09J34p5N2l8O1J08j66J81m6j6n0p8M3k8J23J27j39j06K1J38j77J63
6134H1M8j81oNJ10j72J70K1r4p1J42J50k28M1K1K8mj27k8K0K2j8J74J5k16rK26
6161A20j75j49K11p2O5n0J45q4n7K9j33K80l4l3n2l4O8r3N8Q4j17M9J89m3l01
$$ y = [-4, -161, 40, 60, -70, 124, -17, -15, -156, 12, 70, 30, 58, 65, -45, 104, 89, 91, -55, 125, -35, -104, 136, 15, -59, 50, -47, 83, -26, 40, 124, 70, -117, 21, 79, -61, -91, 101, 22, -2, -129, 52, -84, 15, -137, 149, 122, -154, -8, -103, 80, -20, -8, 100, -10, 16, 35, -211, -13, 88, -109, 115, 56, 40, -3, -23, -133, -21, 26, 101, 37, 27, -26, 78, 38, 32, 184, -123, 72, 29, 105, 115, -146, 70, -17, -24, -137, 74, 31, -40, -171, -47, -27, 57, 137, 26, -127, 100, 149, 19, -134, 38, 158, -109, 16, 63, 103, 57, 84, -191, -8, -6, 33, 124, 32, 54, -5, 67, 46, -42, 45, 75, 134, -77, 24, 58, -151, -17, -92, -40, -78, -17, 91, -75, 106, 60, 44, -6, -84, -41, -69, 54, 181, 42, -64, -43, 95, -82, 81, 129, -52, -58, -53, 57, -115, 55, 76, -18, -89, 53, 203, -25, 16, 37, 65, 61, -66, -94, -74, -52, -70, 104, 119, -97, -106, 120, -55, -204, 7, -65, 0, -50, 95, 11, -46, -17, -150, 130, 96, 63, 11, -23, 45, -48, 10, 94, -23, 26, 215, 172, -129]
6186a29O8M4P0j06N3m1J65l04J51M9j13lK24r9N5k2rL6j33N7M0j36K87k22j07
6211a25J11N6l0k59K31l2K08k66J18n2l4P4o3mJ34r0o6J05l9K05k46QJ57q0r1
6236g0O4n0J40N1r8n4Nj31J65p6J36qj40o0J80Jj28J29j19Qll8m7K44j62mJ64
6263I9j59J65n4J9l3j9O5j40K3J08j51JJ52n1lK4p9J9o3J22O5j35J36K7j74K13
6289A77m2j66J19j79j2K00k0rQM9l9J04k43M7N1q3j60L12j61o4K05j58O0k6L0
6314@q2J13J01K0j88j10K97l08J37K0j21QJ89q2N2o5J60r3m0p9J33O7k24K14k38
6339a19J51j35J09o5M0P3k12J71n3j46J9J64j26O5pJ23q3ll5N6j09j44K60k4k7
6364e7O8n0l3O7p4K79o6j64O6J34k12J99k21J02k50J06J14o7M6r3J54J7j08M9
$$ y = [-129, -61, -17, 53, -53, 0, -41, 124, -180, -29, 20, -93, -96, 128, 29, 84, 62, 53, 89, -44, 13, 53, -83, 204, -18, -125, -14, 42, 12, -247, -16, -48, 160, -106, 12, -40, -74, 0, -63, -67, 67, -23, -89, 16, -23, 182, -64, -56, 101, 21, -70, -6, -56, 84, 135, 37, -17, -12, -143, 22, -54, 82, 74, -66, -126, 54, 55, -73, 56, -63, -55, -58, -96, -143, 101, -61, -65, 99, -60, 105, 51, 70, 37, 18, 83, -57, -34, 74, -77, -76, 76, 25, 22, 46, -33, -14, -77, 45, 110, -25, 111, 138, -36, 177, 135, -31, 88, -91, -103, 97, 77, 68, 76, 125, 86, 190, -53, -6, 45, -38, -198, 114, -47, -111, 94, -64, -4, -30, 0, -82, 31, 132, 152, -36, -146, 151, -157, -20, 0, -121, -113, 76, -6, 46, -19, 141, 48, 8, -71, 62, 129, -95, 119, -119, 32, -103, 6, -59, -19, 54, -158, 13, -40, -186, -167, -3, -129, -64, -71, 52, -31, -34, -69, -13, -122, -266, -6, -30, -57, 11, -39, -72, -5, -79, 200, 134, -30, 36, 170, -42, 157, -64, 38, -212, -106, 8, -59, -13, -106, 48, 65, -43, 6]
6388Fl9J27j57J04n7J05l5k0m7P4J0j13K1O6n5J17j36L6M2p6l2M5j3j17J12j9
6414e1j0M2M9M8K9j40p8J78K5m3r1J85j48J3l4K8N1Pp1n5j7J02P6p6l1O5o6R0
6442G7j08j75K99j52Q1J38j73L3j55J43J0K0j14P9P7j58R7m9r4R2L2J81k36J18
6466F3j35J77k16J28o7R8j69r4L61l11J66l9R6j76J01Q7k26J86p5J2K9N5j35J69
6490H5K3j47Q4j33PK92k02l6r0R4j4M9O5N1mJ73l12L8J17j40P3p4K2J7k01J90
6516B7q4Q0llm6J05kj77R8O4j09J03j12J53p6K7j75K42q7M6J42l48Q8P2J6j19
6542g8R9J9l8r4J48n4K3K13k33n4j16J11N8k6k23K37J30j86P7p5Q8j32J37j5j55
6567a39NJ42J07j41Q0l1k05J19J15l4j9j41J28Mj6O8O9j5j90K40k55K52k12J49
$$ y = [6, -33, 94, -63, 41, -16, 89, 54, 34, -13, 61, 71, -42, -21, 45, -10, 107, -29, 7, 49, -27, -59, -14, -27, -144, -32, -51, -61, -19, 30, 78, 107, -33, -111, 67, 92, 49, -42, 143, -5, 8, -26, 2, 53, 60, -11, -66, -83, 19, 95, 19, -12, 53, -13, 77, -31, -206, 93, -59, 22, 160, -13, 20, -135, 8, 18, 38, -76, 3, 80, -78, 19, -30, -124, -32, 0, 181, -55, 63, -72, 105, -111, 17, -50, 48, -121, -215, 146, -165, 1, -38, 58, -118, -17, 70, -156, 30, -45, -33, -4, 51, -84, 85, 108, -39, 45, -88, -81, 211, 9, -27, -117, -23, -37, 12, 77, 128, 124, 297, -15, 23, 140, 0, 73, -1, 21, 38, -163, 27, -57, 23, 20, 17, -29, 76, 74, -103, -5, 59, -50, 53, -59, 94, 18, 45, -130, 112, 25, 71, 213, -135, -47, 25, 41, -78, 21, 40, 2, -92, 56, 2, 25, 238, 5, -49, -165, -54, 4, -22, -245, -8, 122, -64, 13, -62, 26, -106, 31, 16, -139, -134, 8, 115, -26, 54, 23, -182, -63, 52, 18, -1, -142, -14, -10, -26, 42, 111, 96, -94, 146, -109, 143, -69, 80]
6591H0N4j71j53J23K0n4J90n5k07K16J3j39J86N1q5j58K45m2r6K2l6q5P6J48k64
6616a21Q5K6J19n4Jj01O2Mk8K1j09J22j34P5K8p9O8K1J80j54j46L16k70J66j70
6641g2J45r5J21k03J98L0j19O0j27M8K8QL6j7q9J26k22J00l5J46j44L8Q8J54k70
6666f7J07q8N8pP4m3o1r5J89J26l00OJ03K0j91j6J22r8J43pPP6Pj99J14j8J48
6693A10M4j36k7m6K2j22L21k37KM8K9J14j87P1PPpq6N2l9MK14j12J54j58M8j43
6720e3j38K05L0o6J25k8O9n4l2J01k20j3J70k20l4J29j24L21j36J10j05L9j02
6743b6K7j3p9K48j60mJ53j56K8JJK3L8p5O3l9j14J16n6Nl0P2m8K1L2Oj25m3P8
6772e6J72j11P8O1j6j46p1M5K3l1J8N8n9LJ79l3j67J21m8j25R3j6j8n0N6P1n7
$$ y = [80, 134, -37, -190, -67, -47, -101, 89, 34, -173, 43, 56, -83, 103, 154, 69, -89, 156, 114, 18, 40, 4, -81, -5, 143, -121, -36, -10, 109, 55, 56, -45, 17, 21, -7, 14, -95, 27, -107, -32, -4, -83, -15, 6, 186, 32, -114, 202, -68, 98, -72, 73, -22, 99, -104, 94, 124, 5, 65, -62, -14, 14, 22, 58, 41, -48, 78, -144, -44, -79, 67, -77, -39, 49, 203, -67, 40, -48, 10, 3, 77, 34, -27, -122, 67, 193, -107, -101, 2, 22, -169, -185, -63, -161, -18, -25, -18, 58, 65, -134, -20, -38, 110, 154, 18, -9, -55, -33, -155, 166, -71, -69, -21, 8, 122, -65, 6, 13, 20, 13, -73, -21, -60, -56, 158, 46, 200, 42, 90, -53, -191, 14, 44, -22, 103, 75, 144, 90, 58, 159, -61, -74, 96, -124, -158, -29, -153, 168, 32, 142, 37, 76, -26, 1, -12, -91, 157, -3, -7, 146, -10, 18, 19, 20, 43, 81, 6, 69, 30, -84, 32, -24, -19, -49, 23, -25, -4, 28, 34, -91, -134, -56, 116, 5, 83, 144, 128, -18, -89, -44, -21, -52, -34, 24, -35, -32, 147, 114, -53, 68, 20, -105, -12, -28, -46, -96, -40, 31, -26]
6799b6J00j40K51l66K21lm2M7j18o4K1O5N5M1j54K24J12j39k67L18j14J01r6j39
6823a12q6K56j76K32j70R7O0l54L08N0j76j3N1mJ38m6l1J93q4j68R6k11R2J17
6847E9n8P3j28M3N2R6j40N7j64J38K5j12K14j52J88k83n1J01J73j14kj09RK12
6871A27p9k29J83O0k10K93r3p7j39R5J96k61J21P2ql17J15K07m5J60j58L8j4j05
6895f8K23j75J01q4J16j47M8o9p0J49JJ0j39O5J46Rj12j09K56j73q3j96L31r3
6919f3j8J83l7j48k6K90j04J8L3j32QPP5M7k16M5M8M8oj41K26j24J16k88K25p9
6945a3K0q1J29j1K9Q0or9j6L6p8j09K16k38J07m0K7rn8K65j67R3j14O6j45J23
6971Gl7R3j50Q7K7k5j16K14n3l0p9N3O2Q1q8q0R5k53L63k33J4N4N2K5j14q0jM8
$$ y = [-26, 74, -66, 185, -181, 40, 37, -5, 42, -76, -140, -119, -54, 1, 42, -112, 112, 224, 85, -182, 136, 22, 123, 27, -112, -198, 58, -118, 114, -56, 41, 101, -253, 55, 105, -71, -84, -33, -37, 101, 55, 24, 217, 133, -35, 61, -150, -58, 59, 1, 74, -54, -11, 41, 137, -3, 54, -110, 28, 53, -59, 155, 3, 191, -92, -143, -42, 131, 17, 15, -94, -85, 127, 48, -181, 2, 62, -148, 145, 52, -25, -164, -69, 127, -134, -13, 59, 51, -266, -151, 56, 11, 171, 13, 51, 37, -68, 155, -20, 81, -3, 113, -34, 14, -55, -125, 24, 25, 35, -104, -39, 107, 116, 4, -105, 151, -22, -105, -301, 30, -63, -81, 102, 65, -83, -109, 181, 77, 95, 128, -4, 4, 11, 86, 133, -83, -38, 10, 58, 52, -89, 137, 13, 129, -159, 66, -13, 7, -74, 55, 44, 73, 153, 147, 48, 32, 68, -10, -119, 97, -141, -34, -74, -47, -56, -114, 151, -16, 77, -37, 29, -116, 7, -30, 63, -87, 0, 27, 2, -114, 100, 47, 17, -62, -9, 53, 134, 46, -34, 61, -192, 171, -62, -48, 6, 58, 83, -31, -111, -112, -64]
6999f4K6J95j23JP6j08q1k4J60k2k4K9j7k1m8n2K78l7j30J30l04N6n8J73r9Q9
7025Aj12L14j09j29l3J42m0m3r1J61o4P1m7j21J50r8J14j13J50r7n0P7j90J90
7049C3j84J80n9j20J0J52RO2k4m9J5O5j46J26p6k9O9j5Q9k49O6K9R4j32K12j32
7075dP9m1j78J21N1j12J11p3p5K37l9N0k18K14l0J2K9j97J30Nj03k39L31j07O7
7100B1m8N9n2PP3K9o8NQ5L2k77Q6q0J25l6Q0o7J8J05j50m6J15N3j16O0O1r1o8
7128h5K31j84j9l4R2K3O8r7k2N0n1o0N7j81L76j51o5r8K27j17K28j50j30K40j47
7153AL4M1K5l54K11j25K91O1j36p3qK2m7J47K6o8Jj35P8j8m1Q0l6j44Q0K41q9
7180F5o7o4J23O6k13J35j25L5%k3k1M4M6j80K17M2o9o8J07r4J21j26l0J46o3P0
$$ y = [-64, -38, 157, 34, 35, 111, 3, -78, -102, 58, 36, 12, 41, 24, 3, -45, -97, 181, 144, 14, 144, -160, -104, -162, 11, -88, 1, -111, 203, 94, -35, -68, 74, 34, -9, -100, 61, -3, 68, 21, -100, 50, -48, 66, -47, 103, 6, -44, 33, -157, 33, -151, 29, -30, -150, -140, 12, 21, 83, 59, 10, 25, 90, -56, 70, -6, -35, 34, 19, 108, -141, -75, -46, 48, -84, 128, -4, 75, 34, -144, -23, 28, -84, 27, -46, -121, 116, 77, 127, -91, 123, 93, 105, 134, -63, 67, 72, -31, -270, 61, -46, 21, -27, 32, -20, -13, 60, 89, 21, 26, 111, 143, -134, -48, -128, -3, -39, 41, -26, -8, 97, -53, -99, 16, 69, -47, 13, 74, -17, -85, 146, -38, -57, -91, 1, 24, 92, -5, -27, 23, -28, -88, -31, -212, 164, 13, -52, -150, 77, -40, 188, 38, -92, 148, 1, 35, 76, 101, -253, -42, -167, 124, 185, 49, -24, -32, -10, -57, 90, 116, 48, 49, -86, -8, -26, -67, 13, -23, -167, -87, 154, 65, -2, -66, 57, 123, -90, 45, -80, -45, -45, -68, -89, -45, 1, -179, 38, 80, 11, -57, 50, -44, 77, -49, -79, 67, 4, 74]
7206G4q0j4O5M9j95O5J9o6NJ82j04J48j60Q3o2J18J07l12O7J6P5j2j34Q2q2N2
7232a4rJ37n6n9NkO7o4O1m9j21J01n8o2J51k2k7k10L56j78j6J54qj32r0J28Lj37
7260a51L30o4r3m6J13L2k26J52Q6k47R4J44j90J17o9j51K73M7j19j01R9j05j34
7283b09J13j2J87p8k38J91J32j74k1rJ26j17J31N7o1k8J2j29K61nk16N2l7OO3
7308cQ2j09P5k9J0j84J64M6j61J23P0j38J09n2K7M0k7MM3p7L2j57Q8j44O2J78
7334G2M2j75j24J28j4p5J48j1J58j20o4p8K38q3j12O9O8M3q1J09j95o8K05k30
7358a50m8J98k11K06K3J86k43J53l0k03J37J8r5JJ07p5k2K66k69O6O3K4n1k5M1
7383F7j12j3K06k63J33n0K34k01K1M6j48l3J47m9J60k75K6R1J34k59J2MK33j18
$$ y = [74, -6, -20, 45, 94, -101, -36, -17, -83, -78, 104, 0, 148, -12, 71, 9, 127, 234, -78, -11, 5, 80, 68, -66, 16, -66, -14, -23, 114, 58, -1, 4, 2, 69, 5, 66, 17, -104, -3, -61, -123, 28, 6, -21, -231, 125, -53, -69, 85, 77, -55, -145, -17, -14, -151, 179, 115, 22, -24, 89, 121, -105, 47, 133, -114, -20, 124, -66, 51, -18, -169, 104, 151, 32, -69, 30, -75, -209, -96, -108, 79, 1, -237, -46, 86, -88, -109, -118, 8, -109, 22, 79, 18, -10, 2, -127, 134, 129, -87, -35, -72, -66, -3, 79, -30, 45, 16, 26, -158, 6, 52, -109, 14, 84, -54, 55, 3, 30, 70, 43, 47, 90, 13, 45, -112, -24, -168, -106, 72, 114, -61, -185, -57, -71, -146, 2, -9, 149, 29, -35, -113, 125, 42, -70, -1, 67, 110, 29, 138, -57, -125, 80, -150, -198, 0, -211, -5, 18, 204, -39, 114, 84, -119, 18, 36, -59, -58, 49, -26, -48, 218, -51, 15, 78, 102, 51, 26, 67, -45, -58, 148, -115, 18, -32, 202, 1, 22, 68, -80, -113, 34, -15, 145, -130, -104, -13, 121, -138, -126, -122, 111, -7]
7407gN3J16j87P5q6J03j29j9M1N8M9p7r4J37j2N8k05K05j05l8j03L74k16j18J03
7432b4N4Qj18K8l5K09j41J47j62O6K7j04O4j30J83j30J00q2J1J50r0n3QK13p4
7457A25j31kJ16j16Q3n1n5J04j17Q2L0l7j99J38m2P7l4L4o3%L1n1M3pJ49j32K28
7484B03j71j35J5K2o0k7K32p8j34J67qJ2R4j22R5k25J56k1k5%M7q6J21j09o8J39
7510C4j33J60L5o8O6j41L3N3M6j03J05rj59L5P2lPj7j70J99j93L01j64M7j42K22
7536A13nk27J07P1Nl8k09K54j9L5p2k6J24o9o0j42R4l4J86r6L8j6J47k11O1O7
7562G8n6k3j1N0j79J29Q2j35rJ30n9k41L27j35l2K2om0J43N5j97J55J0q1p6J48
7588D9p9R2k74J04J95j70K37j68pr6K74j70O6R5p5j4j49L00k88P0k11K13j28K11
$$ y = [-7, 46, 162, -25, 50, -36, 67, -62, -81, -40, 18, 67, -10, -104, 33, 21, 79, -126, 79, -26, -64, -167, 207, -9, -127, -24, 30, 38, -80, -52, -87, 122, -19, 128, -34, 32, 59, -45, 19, -111, 72, -58, 42, -40, -29, 121, 31, -22, -14, 199, 125, -6, -8, 108, -8, 75, 24, -31, 73, -44, 38, 68, 31, -168, -30, -72, 5, -29, 5, -58, -58, -27, -78, -35, -42, 107, -25, 203, 32, -103, -88, -66, -126, -153, 79, 1, -133, 34, 26, 38, 132, 10, 105, -120, 36, 15, -10, -10, 37, -49, 72, -37, -105, 34, -99, 61, 96, 28, 94, -47, -14, 39, 85, -18, 87, 78, -81, -46, 26, 23, 30, 13, -157, 42, -151, 150, -14, 33, -109, 113, 108, -119, -12, 59, 64, 26, -183, 71, 52, 87, 15, -11, 113, 44, -16, -158, -64, -98, 88, -8, 30, 14, 161, -50, 11, 78, 22, -1, -12, 38, -141, -12, 70, -65, -74, 56, -3, -244, 83, -52, -84, -62, -68, -108, 35, 90, -107, 48, 58, -23, -99, 49, -30, 62, -212, -108, 87, -83, 154, -14, -21, -117, 157, -13, 53, 148, 73, 59, -90, 210, -78, -8, -219, -6, -134, 77]
7612G7N2j64O9j87L05k37%N4o4K2P5M2j94J51N6p4n6J15j19J02j28R9J53l20J75
7637DJ20p6m6J14k6j22rN4n2P5J74r4J4j33L6o2J4j39J52l7L6Q3j57O5j90L79
7663A77k26J9K2l6J28j84J07n5o4Q5p3J04M8j60qRM6K32k29R7J6M2q0j53O0O4
7689a2K0r1k3J07l9k21K98K2J7p1j18j80L05N2j26P9l7r8NL6nK41k53P6N4j46
7715a08L41l91K51p7M7j41K9J74k3p4r1J00P0k62O3J65k63K12j25J43j18J71p1
7738B2j12j5R7q1M6N7j3n1P4k3%p3J06jn7p4Q1j13N1KM4K3o6J27J2p6Q9k04P8
7767e0Q6N4j52J59j35l7J31O2p0L3q9m1L7m6J2L9j97J23J0o9J74RrP5J4k67J77
7794C3K3N3k00J63ko1j39J66mj37O5Q3n0n1N5L0L8j78J55j9j92J53nK9o6J7R1
$$ y = [77, 129, -35, 34, -153, 152, -85, -85, -31, -95, -73, 2, 44, -150, 1, 57, -17, -73, 42, -77, 25, -103, -4, 149, -171, 4, 124, 48, 2, 116, 90, -32, -41, 13, -39, 36, 210, 116, 130, -3, 33, -29, -15, -154, -2, -39, -3, 80, -77, -12, -202, 177, -49, -30, -8, -44, 84, -100, 7, -48, -112, -27, -100, 4, 52, -108, -116, -107, -61, 171, -58, 39, 55, 97, 17, -136, -76, -12, 8, -83, -106, 1, -38, -259, 39, 61, 78, 7, -111, -291, 14, 66, -60, 19, -18, -116, -111, -75, -80, 161, -92, -16, 38, -108, 233, -158, 93, 16, 63, -78, -49, 125, 102, 28, -63, 37, 107, -155, -92, 73, -190, 22, -103, 40, -78, 93, 22, -90, -105, -8, -89, -43, 14, 1, -50, 24, 1, 1, -72, 34, 33, -24, -98, -17, -130, -79, -77, -33, -10, -76, 51, 63, -13, 76, -128, -50, 36, 90, -62, 97, -38, -75, 56, 118, 48, 81, -8, -49, -12, -58, -46, -7, -204, -81, -71, -140, 34, 43, 34, 109, 123, -144, 33, 56, 109, -91, 72, 70, 9, -130, 36, 32, -105, -40, 43, -7, -58, -3, 27, 65, -113, 42, 23, -169, -16, -21, 8, -58, -41, 50]
7821E0M3j69J44q6J37j36K1N1j57M7J93j85MJ17j0n5l5J3nJ12l8O5m3k9j03J05
7847E1J33k01R9m8n3J73m1L5k35J41j06j49J87J76k28j2M6k1Q9m8j47K38o6O9
7871H2M4j31J23j03M4j21K91k76M2LL5j1M9J04q9q4q2R4O0P6l7j92J06k8J41n3
7897H7r6J0L4J9j0R3j46o8j21K34R9k1k65J70o2O1j77J31k2L4L2qQKk5m9Q4r1
7925f3K34j17j0o9K02j14r6J8PM9R9p6K4K0j81Q2J7o5Q5n8L0K6l5j15J44O3n4
7952D7l4j19l8N7Q5q7R1R1J02k06j1M5o9J13m7o1O8kM8j07j19P1O1M3nj51P3J71
7980A10j94J17j18J74j34P4p8M8j48K57j5p7l6o7J65k4q9J51p5q3K1K06k34J26
8004G7j75J31k13J44N1j0o7o2M7J46j40N1P2q4R1M1o1j9k5J37j51k3P0jK0N4q4
$$ y = [50, 93, -76, 68, -18, 119, -17, 4, 55, -102, -55, 138, -47, -43, 74, 64, 9, -26, -13, -18, 94, 56, 121, 78, 49, -54, 51, 184, -17, 82, 34, -19, 154, 113, 148, -87, 54, -52, -201, -14, 162, -66, -78, -32, -53, 36, -12, -159, 79, 13, 82, 126, -5, 118, 15, 59, -62, 229, -47, -5, -2, 33, 22, 71, 175, 86, 2, -80, 14, 74, 150, 113, -79, 27, -1, 140, 87, -9, 1, 35, 54, 44, 137, -9, -77, -198, 36, 135, 114, -151, 19, -43, 18, -159, -28, -50, -16, 16, 8, 16, 18, -7, -56, 28, -63, 171, 54, 44, -25, 177, 63, -33, -15, -8, 41, 140, 64, 88, 108, -73, 9, 26, -39, 46, -12, 18, 44, 9, -106, 38, 101, 47, 13, -106, -144, -87, -2, -89, 2, 93, 195, -11, -22, 23, -46, 67, 20, -41, 27, 25, 73, -34, -153, -82, -21, 22, 17, -134, -61, 110, -84, 33, -85, 89, -45, 29, -49, -1, -149, 108, 93, 16, -20, -87, 78, 54, -35, 116, 41, -42, -21, 185, -49, 77, -98, 33, -180, -36, 15, 5, -62, -124, -77, 69, -71, -20, 52, -32, 59, 100, 39, 20, -5, 132, -19, -42, 28, 27, 47, 101, 17]
8031A7rk05K34N1J1j06j69K15LL1j49J90o8K6j15K2O8r8J99j72r3N0j5J23j9M7
8057F9kj13M5J49j98K03j31j12N6R1n5N6k68K12p5K32mj42O9j2j02J40m1j34K01
8082A34j18j03jL2J28r8Mj50J33P9n1o6Q8q9n1J80j52K00Kp9p5q6N0K7K85m2o9
8109A12l8n5j01P2r4j6K18j03O3j06L3O8J74k60J56j51J49r5o1m1J66l1j51K5
8133f7k0J12N9l4o0j11K00r1O0MJ15j21n4l0O7k7l7k4o9J43q9J30j49J39l3K8
8159D1q8J50O1k38O1pK3M3J5k23K98j20R4m0j10J85j43m6L3P4j55l8J13K4J0r
8185Hp5m2p0J55R1M1
$$ y = [17, 8, -197, 37, 88, 99, -7, -176, 39, 42, 73, -76, 114, 46, 72, -43, -21, 47, -51, 148, -24, -117, -67, -82, 41, 22, 69, 67, -46, -1, 148, -50, 153, 22, -90, -34, 57, 2, 58, -210, 2, -73, 159, 155, 13, 82, 70, -32, 108, 67, -67, 134, 16, -87, -88, -56, 72, -26, -22, -172, -39, 40, -11, -77, 11, -78, -129, 51, -101, 99, 101, 22, -53, -139, -89, -62, 223, 181, 112, 74, 19, -82, -10, -104, -120, 98, -5, 58, -48, -15, 53, 227, -33, 123, -28, 121, 26, -35, -76, 90, 59, -92, -67, -87, 25, 84, 50, -10, -121, 79, -12, 48, 52, 167, 46, -8, -38, 29, 2, -35, -59, -128, 15, -74, 56, -93, 46, 13, 41, -47, 103, 164, -74, -13, -20, 3, 46, 61, -162, 136, 16, 110, 70, -40, 145, 2, -44, -11, 63, -92, -130, -17, 7, 17, 8, -67, -109, -179, -24, 67, 108]
8191A08
$$ Imaginary data points
##PAGE= N=2
##DATA TABLE= (X++(I..I)), XYDATA
0@%%%%%%%%%%Qj6J6j6J6k4L2m0M8n6P2q7J03j20J36j59J87k16K48k82L22l68M17
33B21m72N33n98O70p51Q38r32J038j154J279j415J564j728J906k101K315k549
50a336K810l098L413l766M165m616N128n721O415p234Q222r445J1003j3054J5891
65H777k0079K6868l9643P1531k90290m72984P52663K15416m05146J22377K71033
76B40523k16922Q2277L09642k84483m15514J78030R2399k39830R743J94600M0242
87i293J05899J02134r9214k9565J18368j03912k52624l5175P8583K2428J05590
98C219O3959p1538P8144J93308o8739k21075n1428M830j16523k6041J52945M4421
110a4518o8062J10622J84764k6442j16800J3714j8146j73314n5170J21541J0825
$$ y = [0, 0, 0, 0, 0, 0, 0, 0, 0, 0, 0, 8, -8, 8, -8, 8, -16, 16, -24, 24, -32, 40, -47, 56, -64, 72, -87, 100, -116, 132, -150, 172, -196, 221, -251, 282, -316, 354, -397, 441, -491, 547, -607, 672, -743, 821, -907, 999, -1102, 1213, -1336, 1474, -1624, 1789, -1977, 2188, -2428, 2700, -3021, 3394, -3840, 4382, -5063, 5940, -7114, 8777, -11302, 15566, -24077, 47454, -242836, -715820, 36843, 252259, -152887, -30510, 240523, 23601, 105878, 415520, 131037, -284477, -106447, -14048, -253878, -244135, -49535, -9293, 96606, 198740, 99526, 69961, 188329, 84417, -168207, -203382, -124799, -102371, 3219, 67178, -4360, 73784, 267092, 198353, -22722, -74150, -69320, -185843, -211884, -58939, -14518, -82580, 28042, 212806, 186364, 69564, 83278, 65132, -108182, -163352, -41811, -30986]
121c0986l8018P9029J9683j8617J22164J9356k21285p8348J11180m8367k8464
132a12673J85697j8526j54855K13524J90611k61235j37743J73060q9708k15646
142b27494J22460R6429j24395J24070K06689j52316q5759K11411k6476k51840
152a07221j5233P3028n6682M0023J09363l9920P584J50307K316j19423l4815n9700
164e0373p8687M4688J3534p5285P3948J64237q868m4109J00234J1579j47914m6719
176d3735K7628o8167l6992P9948M6544k3241L5744Q1736j3433p0574j0347j6681
188a1570p4592j4251P4781K6261k9009N3816P8918k7423k3121J6063q5356q3774
200i9257M7242J4835n4461M6755Q5458j4398J3747O9059n7757q0306M4573l5277
$$ y = [-30986, -69004, 10025, 29708, 11091, 133255, 152611, -68674, -147022, -35842, -84209, -112673, 73024, 54498, -100357, 113167, 303778, 42543, -95200, 77860, -11848, -227494, -105034, -8605, -133000, -8930, 197759, 45443, -40316, 171095, 144619, -107221, -122454, -49426, -106108, -66085, 43278, 3358, 10942, 161249, 163565, 44142, 9327, -50373, -129060, -84372, -70838, -146123, -72175, 92062, 83194, 39085, 139319, 150898, 2984, -43735, -16107, -84274, -121266, -41318, 5226, -18015, 17729, 99465, 86032, 15458, 5111, -11570, -86162, -100413, -25632, 629, -28380, 25436, 104354, 76931, 53810, 69873, -15483, -99257, -52015, -37180, -91641, -44886, 40572, 26174, 39921, 108980, 51223, -29083, 15490, -19787]
212a9787j10632O3497R3497n5718J6098J21895j7626p1601N0556k2531j38892
223i1244L503N9496o8898N367J20352J0787k1428P6438J3629p8820j0929r616
235H637r7132j0529Q3822j4640k1605Q3856L0520k8567L5069M13r4740m0539L5696
248b9739j7655k7228N7301M1479j3553L5245M3463l1297m6679j9281k3170l0814
260f1928j105L1500J5798P333L8303L1136p671j6971j4062l5813m5435R69K7731
273c0215J375J8888M0582J776Q340L3444k7072o5164j6586l812l1676J3321N2853
286c946k572R37O7682J4063m5773P628j0113p8932k0996M5604l854j5208M9146
299C666K8721j4177L8074K3619o8134m2338J1533k4222j6214L7217J5543q690
$$ y = [-19787, -130419, -66922, 26575, -29143, -13045, 108850, 91224, 19623, 70179, 47648, -91244, -87741, -28245, -97143, -91776, 28576, 39363, 17935, 94373, 108002, 29182, 18253, 8637, -88495, -99024, -15202, -29842, -51447, 32409, 62929, 34362, 69431, 69844, -24896, -65435, -29739, -47394, -74622, -17321, 24158, 10605, 45850, 89313, 58016, 11337, -7944, -31114, -61928, -63033, -31533, -15735, -8402, 29901, 61037, 53366, 36395, 22333, -13480, -58915, -57946, -30215, -28840, -9952, 30630, 32406, 40746, 74190, 47118, -18046, -34632, -38444, -70120, -56799, -3946, -6518, -5581, 62101, 76164, 30391, 38019, 27906, -51026, -72022, -26418, -30272, -45480, 3666, 32387, 18210, 56284, 79903, 11769, -30569, -19036, -43258, -59472, -22255, -6712, -15402]
311a5402L8928M1129k1162j4914N542m8424m3906K2181Q798j5524K6986L7663
323B1895J292R721L0255j8999n5299j2089o25k6132N947L3507O272K864L3255
336C1864K5230j5101j8940j3179l8558k5058K0499J1312n218K1990K8962P637
348C1440Q692J2257k5885m5642q584j076j8300J4203K8100k192J1671M0850J0668
361E6202k7287j6385j3649l4429o195K6333m698q360L2554K5217m7P627J46l2580
375D449l1881Q88r44r599J8694K2029M08J7081K5650n181k3695j6260j6989k3285
389c8635Q18K0079j766K609L3010J7242j987O853r861l9082k2267J0543j094q701
403c2239K2440J6636o022K6365K9034k4715k8755n577k0726j9884J8011J4688
$$ y = [-15402, 23526, 64655, 43493, 28579, 34121, -14303, -58209, -36028, -27230, -42754, -15768, 21895, 23187, 32908, 63163, 44164, -11135, -23224, -23849, -49981, -44034, -10527, -4255, -1391, 31864, 57094, 41993, 23053, 9874, -28684, -53742, -33243, -21931, -27149, -5159, 23803, 31440, 40132, 52389, 26504, -19138, -27722, -28798, -47098, -32895, -4795, -6987, 4684, 45534, 56202, 28915, 12530, -1119, -35548, -41743, -15410, -20108, -28468, 4086, 29303, 29256, 36883, 37029, 4449, -27432, -26544, -27488, -37087, -18393, 3636, 4044, 21125, 46775, 41594, 17899, 1639, -15350, -38635, -37817, -17738, -19504, -16895, 16115, 33357, 31370, 38223, 28362, -10720, -32987, -22444, -23538, -32239, -9799, 6837, 815, 27180, 56214, 31499, 2744, -2833, -23559, -43443, -25432, -10744]
415a0744j5458J4853M0999K485l896J1408k6902l5123P335K996j9689N872K3613
428b251R60P835L1627k636k8972l371j1220k4960Q337J6251o224L365K2230J3399
442B4370L747N836j2452l1554j2089J558m451N009P606N224J7590J4813M071r95
456B8283j6734k3508q720J617j154J636J1155N802J1115K7669J634k4865q090
469E840j3599k3617P393J1752j4277M491L2776R609l372J9975l617l8088n003
482i737N505k4892L657K4126j1507j67L7559Q709k1567K486n236l3153L271K1596
496F50k2346n941L4516M817k355K5599n677l3306R69L692k7420n99K6609r467
510a0259o004L3633O637j3460J2524q020l3411n78J2161j1519K47J9759J810L860
$$ y = [-10744, -26202, -11349, 29650, 32135, 28239, 39647, 12745, -22378, -15043, -12047, -31736, -25864, -2251, -1291, 6544, 38171, 35535, 6563, 3192, -8028, -32988, -24651, -8400, -14624, -11259, 10971, 24370, 28117, 33953, 21501, -10053, -22142, -20584, -25035, -20026, -12420, -7196, 10394, 25207, 29278, 28283, 11549, -11959, -20679, -19062, -20216, -18580, -7425, -1623, 9492, 37161, 38795, 13930, 5840, -7759, -31376, -23983, -12231, -26508, -22017, 10759, 20368, 16996, 36971, 33354, -4734, -9737, -4232, -29124, -25467, -1341, -12848, -13015, 24544, 33253, 11686, 14172, 8936, -24217, -20946, 650, -21696, -27637, 6879, 11696, 9341, 34940, 29263, -4043, -3074, 618, -26802, -27401, -792, -10259, -16263, 17370, 24007, 10547, 23071, 15051, -18360, -18938, -6777, -18296, -18049, 1710, 3520, 7380]
524G380K4411l394k4313j946p665j8606N207N187p519J1959J8429M076J0016J0079
538C3301k0041k0795M289q255j2942J5413K137j2337K3197K2214j0519j99L591
551A9054k5500j3668J5484p345j5440K2701J2163j3033K1073J9504k4330q111
563B552N982k4318r468K3314m278j6860K3162J6855j2445J4256R497l6758r407
576a7916K2335j5639j2568K3081Q32r148K6835J2812k5598j414R735k7736q778
589b3167K1463j2985j0304K8663Q360p075J9062K454k8302m374Q631j7374m375
602a9323J7036j0039l616L0822N657j1671J1368p806k8274L419J0121j4139J409
615a5036J6692p293K113K9935k396k1822P526p432k4527J1864J0484j8576O618
$$ y = [7380, 31791, 28397, 4084, 2138, -5527, -24133, -18926, -13739, -21258, -9299, 9130, 13206, 23222, 33301, 13260, -7535, -3246, -11501, -24443, -9030, -6893, -19230, 3967, 26181, 15662, 15463, 19054, -6446, -20114, -4630, -11975, -27415, -4714, 7449, -5584, 15489, 34993, 10663, 2552, 8534, -15784, -25252, -1938, -6216, -23076, 86, 16941, 4496, 18752, 28249, -8509, -17916, 4419, -11220, -23788, -707, 125, -9023, 17812, 30624, 5026, 3612, 13347, -14389, -23167, -1704, -14689, -24993, 3670, 12030, 4955, 24017, 26471, -1831, -6205, 2426, -14948, -19323, -2287, -12326, -15942, 14880, 20537, 8866, 20234, 12428, -15846, -12427, -2306, -16445, -15036, 1656, -5637, -3524, 26411, 24015, 2193, 9719, 2287, -22240, -10376, 108, -18468, -11850]
628a1850K2664o179k93K0853j1812k4477J2073k090k3403J5998J4135j9823J1428
641b776K7561j3099r263J5112j5190k3777J6450N210k3290J1938K1050j2698J0029
654G257K3139k1111j7100J3597q661j5991J4986K082j9597J5490K5199j0861J454
667I883J3278k5162j5844K0180m958j6016J4123M112j2351J8019K1414j6329q332
680B017Q624j8207j1194J9467n424j4314J8884P893r584J4970R996k2204p008
693f084J0775j3729q972J7922m566j0665K3757R870j4734O406K078k1108M61J2239
707C650j4309p321J8360O03m856K1855K163k2829M814M912j9724K094J2184j4449
721a2853l666K2719M255p045J2539k274k2595M900R512j5785l15J0884r848K347
$$ y = [-11850, 10814, 4635, 4342, 25195, 13383, -11094, 979, -1111, -24514, -8516, 5619, -14204, -2776, 24785, 11686, 2423, 17535, 2345, -21432, -4982, 228, -23062, -11124, 9926, -2772, 7257, 30396, 9285, -7815, 5782, -2879, -18870, -3884, -1802, -21399, -5909, 19290, 8429, 9883, 23161, -2001, -17845, 2335, -2623, -18639, -4516, -404, -12755, 5264, 26678, 10349, 2017, 10641, -7566, -18760, 707, -4717, -19031, -147, 7746, -1838, 13132, 23128, 924, -6084, 4691, -9038, -18010, -88, -4654, -15319, 8438, 18308, 3574, 9980, 12058, -9050, -8589, 3650, -10659, -17980, 380, 983, -3873, 17982, 20145, -2684, 2130, 7042, -12682, -10588, 1596, -12853, -16519, 6200, 10455, 3410, 15949, 13675, -8920, -4020, 5492, -10293, -10608, 276, -9572, -7225]
735g225K1719l02j1427M838n076j5930Q188Q421j5537J891J5264n509L604J6769
749A9688r350j4202O840l248j2920P007N683j2044O916J8424o801k163J0532j3475
763H87j1649J2763k553j3862P950P357o757J0451J5926j2200r788Q368r099j0500
777a2706J1367l005j2123J1113J0656l685P508P602j3759p317R290o054j0107
790a1220R225j760r199J5746J0521j0153J106L480j2064k717R782o089r635R579
804c398M594m168J2874N954j5002r68M610r992j130P232o510n185J2098N858m751
819B116N552Q91j3914J231P147r143k132P392l041K224J3181J57r134J046q87
834B686j0207K204N686j0973j197J2384J38K096J1185m643j0669K497J283p635
$$ y = [-7225, 14494, 14192, 2765, 7603, 2527, -13403, -5215, 3206, -12331, -10440, 4824, -685, 2919, 19688, 10338, -3864, 2976, -272, -13192, -6185, -502, -12546, -5630, 12794, 5993, 3830, 14362, 887, -10762, 2001, -552, -14414, -6464, 893, -5864, 4587, 20513, 8313, -1475, 6893, -2206, -12706, -1339, -4344, -16467, -5354, 5302, 1617, 9125, 16727, 2968, -4349, 4941, -1113, -11220, -1995, -3755, -12954, 2792, 13313, 3160, 4266, 7746, -4318, -7035, 2747, -3342, -12977, -3398, 1196, -2972, 9902, 15856, 854, -114, 4496, -5496, -6626, 606, -5904, -11089, 1009, 6867, 2116, 7668, 8559, -5355, -4124, 3023, -6120, -8252, -860, -3901, -1677, 11504, 11661, 2527, 3573, 2686, -7521, -5317, 369, -10604, -11801, 583, 721, 2817, 14002, 9359, -1310, 1187, 2470, -5165]
848e165J14L665p126J161J3984J39m307N706n118q336M798P74q283L05N420n07
864b776L818J0442l418q129L340j678o051M055j138p929L073P995J095J970K902
879G571n561o276M087R62o138K423J325l616O608P516l047k381l61l985l535K274
895b134m92n633K029N630J866M913L412n914l369M26j723j009l83k849j385M545
911b070O333J214N48j299n929p54K377l179k271N90k16L400N864K413k181k416
927B424n78k724r13J293m350k177L903L260L364K435j924l557j664J210k1k562
943b581j038q53R56N832L506l94j637l345j508m2p98o32k240l56L902L589L114
960E475k6k925k133q68K39n72l051j378J179K549N693J637k497j436j733r97J065
$$ y = [-5165, -5051, -1386, -8512, -7351, 6633, 6772, 2465, 8171, 3053, -5283, -485, 289, -7994, -7689, -2269, -2776, 1042, 11484, 8066, -63, 3277, 1599, -4452, -397, -1535, -9464, -6391, 1604, 2699, 4669, 7571, 2010, -4266, -179, 783, -5355, -2932, -1607, -5223, 1385, 8901, 5854, 3473, 3112, -873, -4408, -2134, -2626, -8259, -6230, -600, 1266, 6179, 9591, 3677, 308, 734, -989, -1998, -2381, -5230, -6615, -2070, 4263, 5477, 6025, 4726, -1203, -1957, 420, -2759, -5030, -4440, -4656, -1256, 4608, 7021, 4840, 2424, 1846, -878, -1791, -498, -4848, -7025, -3122, 138, 3502, 5937, 4013, 456, -1208, 2, -19, -2581, -3619, -4472, -3516, 2316, 5822, 5428, 3791, 446, -1062, -1104, -1902, -2534, -4774, -5130, -1228, 2361, 5475, 5449, 2524, 391, -477, -238, -810, -3861, -5239, -4060, -1511, 4182, 5819, 3322, 1886, 153, -844, 221]
977B21j153k577j468K004L726J973K435m03n344j60J317k866K6rk567J685N728
994B568K977j877j122n37l418L86K143m984j890L033N69L415M526j282l326o38
1010E43j16j971M7O64m284q0O591J339Q78K770m140l931K564m56l529p40K04j690
1028e337L574P245j773l069L163k252l273M478j465o709J135L858o32K773L725
1043E441m250m833M397M18m366L188j019n068N442O078k680k6J168m184k091M491
1059B106j754o086K902K014k776O103M356o768j087L273l479j043L599l572m665
1074f877N671N228k571L272J983p992n61N291n340l521K820k219j389P701L736
1089E232m711J940K853n447Q44M468p435l733N594j114j326O645p40o497K864
$$ y = [221, -932, -3509, -4977, -2973, 753, 2726, 5161, 4758, -586, -746, 571, -2295, -2269, -2278, -4845, -3160, 2568, 5545, 3668, 2546, 2009, -1409, -1023, 1120, -3864, -5754, -2721, -2152, 1263, 5789, 4507, 1181, 543, 427, -1544, -1497, -833, -5117, -5197, 1394, 2733, 3611, 6381, 2241, -1690, 874, 418, -3111, -3851, -3647, -5337, -1763, 5482, 3709, 640, 3803, 1551, -1722, 2756, 1291, -5418, -4283, -425, -1057, 1716, 5441, 1191, -3642, 755, 1173, -3193, -5, -1024, -6092, -650, 5428, 2748, 2722, 3890, -294, -2385, 2106, 352, -5734, -2832, -818, -3594, 2509, 6865, 97, -990, 2283, -1196, -2239, 1360, -2212, -6877, -1206, 4022, 1451, 4723, 6706, -1286, -1847, 3444, -1896, -5417, -2597, -4816, -6205, 1496, 5232, 521, 2461, 5314, -133, 711, 5179, -2256, -5989, -395, -1509, -2835, 3810, 3070, -3427, -563]
1104e63L781n170L76M251o795j561R370j196l544O244j828p057M468L151p041
1119c114o04N175m105j300Q994k215o627N317P8o203M697K372p137J256P320j497
1135B407p04N606m103p275N222P52p349K603R69o382M521Q675k518j017M242l526
1151B123m164O152m63q985K418L054n422N037O598o841k152N992k867l457N047
1166B070j848p600M985N893m888K952M902p838o20P888m475m584M562k275n272
1181f148O361L863p363J077N437o143k46Q101n553m742Q224O44m433N784O68r018
1197c487J280O578o566l119O035n270l825J1471K072o510M767J147p712L167O089
1212F117o982m557N789k286k939R767N47q549M031K402o896K666M059p438j950
$$ y = [-563, 3218, -1952, -1576, 2675, -4120, -5681, 3689, 2493, -1051, 5193, 3365, -3692, 776, 3927, -3114, -3718, 1457, -2648, -3948, 5046, 2831, -3796, 1521, 1599, -4604, 93, 2465, -4672, -3416, 3904, 2407, 1703, 7309, 3206, -4069, 1153, 1905, -5444, -2841, -1872, -8254, -3733, 4942, 2424, 1407, 5649, 2123, -2041, 4111, 3648, -5337, -2919, 135, -5287, -250, 6348, -493, -2645, 3347, 480, -2977, 2070, 222, -7378, -2393, 3500, -1388, 1564, 6466, -1372, -1992, 5896, 1421, -3163, 1399, -876, -6148, 213, 4076, -3287, -2210, 3227, -2916, -3162, 4939, -614, -5356, 2868, 3512, -921, 4863, 5531, -3487, -2207, 4371, -2195, -5314, 721, -4549, -8374, 3097, 5169, -1341, 3426, 4573, -3139, 28, 6117, -865, -5422, 367, -1919, -4858, 4909, 5456, -3093, 938, 3340, -3556, -890, 3169, -4269, -6219]
1227f219P191o55k261O749l34p119N140L391p893J122L120p283M07P732l208l868
1243c988N270k72m950N952K710q336J564N991m783P63O380n946m563O177k26n544
1259c801L486Q40o888L529P902m609j092N322n466k928Q076j595o892L214J295
1274C93m823N140O546o691k801N716m393l246P208k927p514N353L518m123M242
1289A598M922o275j760O587l211m886M815k380o055O173L194n482J863L674m332
1304a555N53N574l713m818M765J51l518N446J152o958K126L758m162L21L479m985
1320b384k826O325R12l811L534Q20o298L270M882n462j024L538l584l34O488q45
1336C201n005K554P62m632K979K926o703m38N237k215N55N706k710m309L863J270
$$ y = [-6219, 972, 317, -1944, 4805, 4471, -2648, 2492, 5883, -2010, -888, 2232, -5051, -4644, 3088, -120, -3988, 1282, 1010, -3940, 2012, 4722, -3614, -2050, 3941, -842, -79, 6301, 355, -4208, 1969, 1743, -3801, -315, 525, -6363, -2834, 5068, 459, -633, 4689, -777, -3705, 4371, 2776, -4116, -902, 393, -4430, 710, 7256, 565, -2236, 3480, -913, -4159, 3049, 122, -7392, -2039, 1479, -2644, 1598, 6520, 245, -1515, 5072, 1861, -3025, 1790, -590, -6645, -472, 2722, -2760, -897, 2777, -1555, -1002, 4572, 859, -3959, 806, 957, -2561, 2885, 4037, -2921, -795, 2963, -1199, -878, 2601, -2384, -5210, 1115, 2027, -1784, 1750, 2570, -3728, -458, 4424, -1038, -2062, 1476, -2108, -2442, 4046, 3201, -1804, 750, 1512, -3120, -141, 2785, -3918, -4356, 881, -1334, -779, 4927, 2217, -2092, 1771, 3041]
1352C041m141J244J230n735P43O150k658j549M588k673k756N205J46n447J221
1367a391K184l177J579N160m000l144N024q23l072L808j001n479K150L580k094
1382f96O88K608l305j824M934n36l654K431m72l827L937L173l679j91J976k478
1398i15n02L728j730m404K770J344k186L721J589m654M83K972j905n31J772k726
1414a174k719L399K333k572J452J174l614J279L394k870j779J791j290o83L583
1429A704L86l055M16J939j755N83K183l883j627L277l29k91K562j249k719J773
1445h5K135j967l38P18k636l93M228k02k272J901p32j326K045Q54k949q50J451
1462d18k90K08K686j279k470J946P40j069P67n80k551L68K219K40o9N12j149q55
$$ y = [3041, -1100, 144, 1374, -4361, -3618, 2532, -126, -1675, 2913, 240, -2516, 2689, 2835, -2612, -1391, 793, -2384, -805, 4355, 355, -2789, 2235, 1412, -1660, 2148, 1147, -4332, -2182, 1398, -696, -8, 2600, -705, -2529, 2405, 1869, -1785, 646, 174, -3653, 284, 3457, -222, -413, 1563, -915, -1417, 2311, 581, -3823, -1053, 291, -1895, 1826, 3415, -1239, -756, 2216, 311, -220, 1552, -1174, -3893, -494, 1839, -733, 719, 1893, -1721, -442, 2952, 82, -1697, 94, -1196, -1879, 1704, 2090, -965, -549, 1390, -365, 218, 2401, -1482, -3109, 168, -161, -452, 2110, 861, -1858, -85, 2050, 83, -255, 463, -2173, -2566, 1662, 1460, -812, 1089, 357, -969, 1076, 1930, -1019, -1869, -418, -708, -500, 2186, 907, -1563, 383, 1123, 54, 821, 241, -2310, -1942, 277, 517, 448, 960, -189, -1044]
1480a044K010Q34j851k22n46j122J774J589j169p28M23k24K74J081k90k503O00
1497a114J329k33J154K94k038j68J247J74l28m74j111p33J263J898j97n14K2j075
1515f04P96J221q13j039o91k90Q97J365K00o57p21N26K24J59J14j925n66P44O43
1534d17J120J15p49j90K78J248K46j273j301n87K93J419L25m39n96p36J371O73
1552H00k97r0q37q32J569O26j11o15m45j69L68R62l23j708m18R41J42J488J78
1571A229j546n06Q84O60J72l65j026j288R84J753r0J5l18j328N75J139p58o62
1589d76m85o59K58J641Q06j197Q4Q23o98R86J018k469j171J237k82J31J159p75
1607f9j459Q54J810o30j42P27k061n01K554o9j156R06j011r26J763P58j502n74
$$ y = [-1044, 966, 1800, -51, -273, -819, -1941, -167, 1422, 253, -475, -52, -276, -2, 1079, 789, -1714, -1114, 215, -18, 1136, 1430, -608, -776, 471, 645, 317, -157, -1268, -2001, -738, 1160, 963, 449, 471, -604, 192, 1413, 600, -439, -1130, -1420, -523, 842, 1042, 385, -336, 190, 414, 573, 687, -1238, -1804, -1060, -417, 703, 818, 69, -121, 157, 1405, 1651, 378, -923, -1510, -1217, 202, 527, 88, -508, -1244, 127, 800, 503, 413, -424, -1256, 313, 939, 828, 213, -232, -401, -33, 929, 606, -1102, -1520, -579, -437, 1051, 1229, -317, -823, 61, 721, 893, 528, -498, -1786, -802, 951, 861, 876, 558, -770, -195, 944, 186, -476, -961, -1620, -1362, 279, 1085, -112, -28, 795, 97, 1083, 2101, -368, -1539, -302, -584, -453, 706, -69, -1528, -674, 1136, 506, 364, 1091, -970, -1471, 1083, 1014, -142, 764, -247, -1173, 590, 1348, -154, -728]
1625g28O37r93L30K342j266j789J483K54q06J467J19k489K49J837j47l20J290
1642A470j593j808K488Q71k367N44o9j901J567K571j045r57R55l75p07K010q5
1659A569l150N40Q94j004J406J111k315m22K220K8q33J060r01k372K072J647j912
1676c62L65J065k258O72K776j552j650J026o68j217K642Q41k776N3J957j541N88
1693c9K203k279j752K238M02j130J467P9k743P06K475j661q54J651k111q85L676
1710A443j74k033J331P7k033J925J934k908j268K173j287p35L212p07k990K298
1726B58J189k214J174R70k894j56K982j021j234J966q12k057K873J273l060N61
1742b02R05k426P62L044j891j825J775j15j170K721L26l679Q85J927j794P29K117
$$ y = [-728, -91, -1084, -754, 1588, 322, -1467, 16, 270, -536, 931, 1050, -1439, -1190, 647, 500, 180, 1470, -123, -1931, 557, 1428, -939, -395, -464, -2365, -798, 1773, 728, -229, 726, 351, -356, 1654, 1569, -1581, -1041, -147, -1151, 255, 1366, -949, -1371, 849, 877, 44, 1104, 203, -2169, -97, 1550, -362, 3, 1068, -1190, -518, 2258, 706, -944, 82, -586, -1803, 839, 1680, -1096, -1043, 914, -627, -39, 2164, -115, -1867, 371, 773, -357, 1110, 1189, -1554, -848, 1627, -34, -888, 763, -1348, -2233, 1443, 1269, -764, 567, 644, -1389, 536, 2470, -438, -1706, 467, -820, -1555, 1657, 950, -2040, 258, 1447, -767, 407, 1377, -1517, -1673, 1309, 288, -946, 1020, 208, -1849, 1024, 2297, -763, -202, 703, -1723, -961, 2083, 192, -1633, 142, 27, -1143, 1578, 1904, -1775, -890, 1037, -757, -28, 2089]
1759B089k639j408K655L06j775J500p7k973J683K653k557p9K140k212m82L248
1775B072j166k694J882K01j872J709J852k955k78K872j700n86K365j767k326K796
1791D05M86j839J144J077k690N99L148j909j634J991j190j905L574L63l162J076
1807d66J462k221J240K474k452k090K600m84j373K770J11l797J546K117k029O82
1823I0J596k686j023L030n7j751J573Lk522J937J928k913j50J762j893j16K471
1840A279p68k169K042M44j899J621J186k998J40K384j560n96K204j570j519K428
1856F49Q13k306R59P96k517P09K950k155r84J836j032q68K586M7k811O56J003
1873C31j207R96J844k571j083K473k52j143K026q93k634J877J558j575K42J340
$$ y = [2089, -550, -1958, 697, 1003, -772, 728, 651, -2322, -639, 2014, -543, -622, 1518, -694, -1176, 2072, 906, -1788, 94, 295, -1577, 132, 1984, -971, -1249, 1623, -77, -663, 1702, -65, -2391, 405, 891, -948, 196, 1273, -1417, -818, 2330, 421, -1213, 778, -412, -2317, 1257, 1620, -1542, -466, 996, -1225, 15, 2489, 37, -2053, 547, 63, -1310, 1460, 1571, -2226, -680, 1437, -592, 90, 1686, -1000, -2023, 1007, 950, -801, 772, 775, -1747, 190, 2118, -795, -945, 817, -1076, -1192, 1279, 511, -1658, 384, 828, -1071, 550, 1736, -1262, -1122, 1262, -298, -894, 1310, -260, -1779, 649, 1462, -844, 115, 911, -1606, -897, 2053, -102, -1086, 750, -282, -1150, 1436, 1483, -1328, -672, 331, -876, 120, 1964, -607, -1690, 783, 531, -612, 1414, 521, -2113, -236, 1322, -253, -11, 1329]
1889A329j906o51K704p79k167J791k13j763K087Q02k040J79J745j359k31J986
1905A514j242j953J779O29j761J456Q23k593Q30J740j114k51J091j584q80K140
1921F24N18j876Q49M01j867J258J852j857q29J342r22l20J976n13k127J064J138
1938G11j189Q43R69k373l74K334n73o65J211p64j403J272J381j753m4R70j492
1955i39j05K153r72j162J480j97r84J528L33j767M2J023r06J14J401j244j118
1972a320J911K06j081R18j59j676P95J473j028l30Q10r85n03J841L24j635L13
1989a26K66j014J086P37j361n28J105l1k73R65m12j521Q36J026r45L56M99j491
2007h26K97J375m65o15L96m98o86J249P26j247P9P78j067N04J133r61n75L88p6
$$ y = [1329, -577, -1228, 1476, 697, -1470, 321, 108, -1655, 432, 1234, -806, -627, 1118, -241, -472, 1514, 272, -1681, 98, 727, -1034, 422, 1245, -1348, -518, 1222, 108, -143, 948, -636, -1516, 624, 1142, -734, 115, 516, -1351, -93, 1759, -98, -927, 415, -507, -827, 1149, 636, -1491, -427, 711, -478, 365, 1334, -1039, -1413, 921, 348, -317, 894, 130, -1273, -1, 1380, -373, -417, 553, -939, -1044, 1109, 137, -1025, 455, 258, -726, 802, 1135, -632, -590, 433, -473, -359, 1042, -202, -1320, 591, 797, -284, 634, 475, -1201, -406, 1067, 39, -291, 519, -466, -969, 872, 1196, -439, -126, 140, -874, 212, 949, -412, -940, 165, 134, -139, 826, 414, -1107, -271, 755, -190, 166, 665, -826, -529, 846, 381, -234, 162, -336, -1022, 227, 953, -294, -215, 563, -504, 0, 1133, 172, -403, -15, -91]
2026i1l02R56n5r97j04J108n04K14L66j004l19J006L6l48M32n33n63P60J067o04
2046E21p28O2l62J38J124m62r63J95L87ON71J68r29l81Q53J16l01N43p29n96R50
2067A83K63l44O5l05l97L68N74j47l68l9j3j48O50L48p23k29m5M7O83K9l33k88
2089a69p2M50p9L11m84l86J34L37K54j47l9n24Q7P65Q7l71l29k94J29N44K17l78
2111D3n92K78J39N75O5l11k49m42L06O73l48j78j56p4K55L38m2k45k96n3K29j7
2133a02L78k34n07K78L19K00p9k56m40k2N42L06k14j56m36n5P52M45n39k76j85
2154b81j81O01L40m42n81J92M82j06L66j65r19L23N10q1L53n1q18Q2O85k3p8j60
2176D8j22l41M20O29n90l56L99m36K32O93m86l40O0J80j33M63N2n85j00P16m91
$$ y = [-91, -393, 563, 508, -489, -593, 515, 11, 225, 591, -413, -732, 274, 310, -38, 394, -139, -702, 58, 1125, 521, -207, -145, -507, -369, 755, 293, -670, -475, -88, -82, 489, 657, -272, -653, 200, 316, 15, 558, -171, -767, 183, 446, 102, 167, -138, -535, -167, 407, 260, -108, -147, -160, -308, 342, 690, -33, -262, -307, -260, 423, 452, 119, -169, -241, 209, 130, 441, -43, -429, -295, 42, 296, 149, 110, -414, -327, 438, 525, 154, -175, -469, -340, 204, 421, 43, -549, -271, -132, 443, 508, 197, -52, -494, -188, 485, 137, -41, -197, -271, -16, 322, 280, 35, -261, -314, -85, -102, 276, 42, -465, -187, 132, 332, 253, -3, -443, -465, 77, 383, 169, 13, -423, -478, 274, 719, 180, -96, -281, -462, 139, 479, 37, -544, -352, 130, 24, 390, 225, -694, -371, 139, 58, 411, 360, -458, -376, 309, 286, 208, 48, -74, -415, 5, 634, 44, -312, 87, -349, -117, 576, 90, -250, -190, -10, -143, 320, 372, -213, -313, 403, -88]
2197h8K16N15r54k39N46P0j22J66j38n17L50J014k98n39L27q64O4J122j95r84
2217e48K28K45k72N70L95p61l61P29k45k68Q46n11p25Q35L32o57J98K94j019M12
2237b83R74n50o29N79j90m33Q94K38j005K78K01o20N97O60l92q83P70p2m85Q44
2257D93q3j120K86O97o15L55M24p28l11J048J63p11J76J5q44Q49P81j244m5N54
2277A40m47J30R06m92p74N15K3k56M42L07j130L4J232m24l94J109q80p56J020
2296C05j0o52K51K76o54N9J152o74n38Q26n26k91J347l20r30K74M32p33L59O57
2316F10p81o45R57k8n17J068n01j157R33P00r27L85M04j070n2J345l96r42N94
2335b0R1p38J002M04j212K6O65l70N6Q49o69p97O95N60q27O13N58j395O8J030
$$ y = [-88, 128, 643, -311, -550, -4, 66, -56, 110, -28, -545, -195, 819, 521, -18, 309, -555, -491, 631, 436, -548, -320, -75, -347, 223, 618, -143, -504, 225, -20, -288, 558, 47, -678, 157, 489, -168, 30, 324, -695, -283, 691, 141, -488, 91, -99, -532, 362, 600, -405, -127, 74, -546, 51, 711, 319, -564, 206, 134, -351, 493, 410, -710, -424, 273, -342, 13, 437, -291, -602, 446, 609, -102, 74, 89, -755, 94, 875, -369, -414, 140, -307, -177, 729, 237, -537, -22, 1, -255, 187, 494, -636, -602, 630, 206, -188, 921, 41, -715, 305, 295, -357, -106, 170, -484, -425, 727, 53, -485, 341, -185, -476, 871, 551, -379, -105, 327, -406, -47, 610, -171, -816, 141, 113, -404, 664, 163, -994, -61, 639, -288, 97, 501, -569, -621, 724, 328, -614, -20, 71, -667, 335, 739, -473, -447, 218, -152, -96, 753, 84, -713, -18, 542, -285, 328, 886, -509, -441, 589]
2355E89p83n5N93n00p19R68L40r10O54K39j013N33J124j015l95Q94r01j51J256
2374G48m34j097O11N54p12L35P59j074k81J188m44m98J030o90q31R57O23r76j5
2393b47M89n93J08J143r77n57P68j28n92J095R1j228L35P78o99J71P33n37q59
2412g06R16K29r62P19j06r23O51P22m94j76P21p45l82J108L0j011L92K04r40Q69
2432A16P63j118j50O52k51m18Q64l5j052N16P11q84K56O55j047k4J012k81m40
2451a55M99k95n79P95M40j132RQ28r03L31J045r95n15P06J53m78O39%q65J58P13
2472C99l94k68P33p45n34R70J46o93P12o3r21N79N46m51k48O11m79m16J133k26
2492C91r10Q12k27n92O84L45j023K4P58j24j85M97m37o81P02M49p11M19j4n20
$$ y = [589, -194, -249, 344, -156, -875, 93, 433, -477, 177, 416, -597, -64, 1060, 45, -350, 544, -357, -508, 748, 314, -783, -172, 382, -330, 5, 764, -310, -591, 597, 153, -345, 685, -5, -836, 121, 744, -232, -247, 242, -351, -243, 900, -77, -634, 134, 6, -586, 509, 600, -628, -293, 485, -214, -43, 690, 153, -706, 210, 439, -523, 196, 90, -833, -182, 540, 46, -130, 591, -154, -536, 572, 602, -409, -17, 187, -753, 116, 879, -239, -389, 263, 12, -406, 458, 423, -629, -113, 598, -286, -30, 625, -422, -446, 566, 285, -155, 344, 49, -530, 265, 705, -427, -418, 410, -493, -162, 883, -112, -627, 79, 232, -246, 393, 393, -472, -314, 399, 5, -263, 470, -275, -809, 161, 307, -386, 326, 263, -658, -79, 467, 16, -232, 379, -100, -516, 617, 391, -519, 293, 66, -526, 158, 503, -520, -496, 262, 138, -47, 450, 13, -668, 34, 483, -228, 191, 177, -343]
2512c43O8O96m42k19L79j02k80N54J13p58K17M71o67L40N32o26l96N94pm23M56
2533A57l9n63K27N85l69r8M57p30r1O86J2l77R3O0m78M97N26n15l68O66o49K02
2555a09P28m99m49L88K24n30L89J73n61m9N36j40k56M60l98l32P34J84p69L24
2575D8j8l51K60L73l69m20M44j41k05O64m3l85OJ38l06L93L43o71K6K96q8m7K64
2598B11K4o94L91L85n08K00K1l96J73M91r9l01p4N2m7K93J03m22R2K72l64L35
2620A38K69l80k03J77k0N9nJ66n75K00M27l6l04K59l01p2K87J99l24J02l4j28
2642i9K25K83l34k96L21k58L77%j79k52J0J28K76l5K2l08k14L51J67j80R4k79
2664a80n8L95rk07K17l36J6K32K73k05k71J14k0p0K50L0k42q0l2L21J44l65J4
$$ y = [-343, -275, 421, -21, -240, 139, 37, -243, 311, 424, -334, -117, 354, -313, 27, 559, -67, -463, 131, 124, -299, 157, 118, -445, -218, 367, -2, -100, 357, -373, -464, 222, 234, -143, -50, 10, -468, 29, 555, 40, -328, 338, -311, -109, 619, 120, -329, 59, 283, -247, 142, 315, -246, -295, 241, 101, -155, 305, -93, -425, 309, 493, -276, 48, 30, -321, -61, 312, -57, -477, -33, -174, -379, 285, 242, -143, -137, 1, -305, 88, 431, -240, -214, 82, -6, -53, 211, 235, -459, -68, 317, -191, 9, 30, -366, -193, 298, 199, -102, -176, -124, -171, 122, 225, -197, -105, 167, -197, 138, 407, 27, -176, 1, -19, 40, 35, 201, -374, -174, 253, 217, -87, 172, -129, -201, 86, 285, -39, 63, 29, -99, 126, 409, 75, -221, 100, -158, 219, 219, 40, -212, -202, -74, 202, 167, 189, -119, -333, 18, 185, 5, 99, -180, -238, 157, 148, -59, 158, -178, -162, 70, 343, 138, -133, -19, -39, -109, 141, 171, -71, -151, -183, 138, 282, -83, -69]
2687f9j71K14J43j10R3o8k09K44P8j05p4j69PK12J52j32j1j15l7P0Q2K06m24J30
2711f3P1o0K31l7j82q8J95m3J66k08K7m03K42K2K17k9j78n2J51N6l8K75k50l01
2735b79K84J11n0m9k00K0J53K69k15r1P4o9k61N71j53j35j49N6L6O4K80j87k22
2758a42J30J67K6R5l15k05J31L05k28m4J22l21J84K47J24l11kk6j19K75J44l50
2780a13n8K19j07k7L90j53l03K59j08J7K58L9m58ML00l20M3K57k24q7L22p6j44
2803g0MJ91k68L5K76j08k11K66j22j29M99j11n45K87J09j85J42K7l19o7M81j12
2825G0r7K16j78n43N56R1l1n3J21j99KK23J10m34J5Q9j87K96J99l86R7J4j77K57
2849G1J54l72k58M64R6k48L98j30m73O8N26l97K1K20k39r2L40J33m29K66j56j46
$$ y = [-69, -240, -26, 117, 7, 100, 32, -177, 67, 145, 40, -34, -203, -196, 16, 168, 36, 25, -90, -127, -57, 25, 231, -193, -63, 8, -52, 179, 142, -40, -128, 67, 24, 190, -18, 9, -394, -152, -130, 87, 58, -120, -172, -21, 35, -3, 272, 22, -279, 5, 116, 66, 17, -183, -163, -10, 259, 44, -47, 27, -42, -303, 268, 115, -20, -169, -113, -77, -13, 267, 80, -142, -12, 155, 181, 276, -39, -244, -113, 192, -36, -80, 42, -279, -95, 152, 276, -35, -37, -63, -182, 93, 237, -113, -171, 48, -59, -86, 304, 151, -152, 107, -1, 16, 274, 313, -145, -141, 159, -161, -118, 139, -85, -172, 150, 74, -70, -66, 125, -143, -108, 168, 60, -151, 115, -7, -136, 363, 252, -293, -6, 103, -82, 60, 87, -232, -299, 182, 70, -27, 189, 11, -532, 24, 115, 84, 31, 152, -47, -45, 178, 288, -146, -131, -42, -229, 67, 266, -120, -23, -9, -186, 71, 225, -147, -405, 59, 155, -93, 305, 175, -298, -230, 296, -101, -80, 140, -99, -191, 149, 282, -147, 119, -37, -183]
2871a83K07K44l90K3K67l33QM29j83m56L26L43m55L21P7n87K03M33k59j80M79
2892C34l69l92O00l2k70J56Pk48J73N22m58m53L94L8j30M18q6m25JM46l73K06
2914E9M56p40k44N66M8k49J88L4n47N29J80l35j6J73j06k69M50j03j99J76K05
2935B56o17M57K67o22N5M87l23p9K98j46l91L70K13k12R0Q1o58K52N48k79j78
2956a31K50k69q7L58K40o37L01J08k36o9M86l27k94M89o8j94L00J39p49L34K47
2977A91l63K02M07p31o2O65k32l84K42K13m06K51K94l05k05M34k56j10M95k69
$$ y = [-183, 24, 268, -122, -99, 168, -165, -157, 272, 89, -367, -41, 302, -153, 168, 245, -342, -139, 294, 35, -145, 334, -35, -427, 173, 141, -129, 27, 34, -214, -41, 481, 23, -430, -36, 2, -128, 290, 204, -221, -220, 226, -147, 59, 515, -225, -469, 97, 145, -104, 84, 118, -429, 100, 280, -55, -71, 102, -4, -273, 177, 74, -125, 51, 256, -361, 96, 363, -259, -204, 283, -40, -119, 179, 33, -358, 12, 225, 13, 103, 184, -474, -222, 326, 47, -131, 119, -150, -237, 121, 361, -276, 25, 133, -103, -172, 314, -13, -307, 182, 114, -80, 220, 359, -390, -56, 191, -172, 30, 437, -294, -356, 309, 77, -307, -65, 148, -258, -7, 287, -18, -223, 211, -45, -155, 340, 71]
$$ [...]
8191D6
##END NTUPLES=NMR FID
##END=
