##TITLE=1H_Pr 5159
 CDCl3
 8 sc, 
 27.10.2022
##JCAMPDX= 6.0         $$ Bruker NMR JCAMP-DX V2.0
##DATA TYPE= NMR FID
##DATA CLASS= NTUPLES
##ORIGIN= UXNMR, Bruker Analytische Messtechnik GmbH
##OWNER= root
$$ XWIN-NMR		Version 3.5
$$ Thu Oct 27 15:22:21 2022 Russian Standard Time (UT+4h)  she@DPX200
##.OBSERVE FREQUENCY= 200.1313499994
##.OBSERVE NUCLEUS= ^1H
##.DELAY= (6, 6)
##.ACQUISITION MODE= SIMULTANEOUS
##.ACQUISITION SCHEME= undefined
##.AVERAGES= 8
##.DIGITISER RES= 18
##SPECTROMETER/DATA SYSTEM= spect
##.PULSE SEQUENCE= zg30
##.SOLVENT NAME= CDCl3
##.SHIFT REFERENCE= (INTERNAL, CDCl3, 0, 15.7039)
##AUDIT TRAIL= $$ (NUMBER, WHEN, WHO, WHERE, WHAT)
$$ ##TITLE= Audit trail, XWIN-NMR		Version 3.5
$$ ##JCAMPDX= 5.01
$$ ##ORIGIN= Bruker BioSpin GmbH
$$ ##OWNER= she
$$ F:/spectra/data/she/nmr/H-F/1/audita.txt
$$ ##AUDIT TRAIL=  $$ (NUMBER, WHEN, WHO, WHERE, WHAT)
(   1,<2022-10-27 15:21:30.01 +0400>,<she>,<DPX200>,
      <created by zg, POWCHK disabled, PULCHK disabled
       configuration hash MD5:
       00 E9 B6 7A A2 85 ED C7 34 08 36 98 17 FE 4E 26
       data hash MD5: 16K
       A6 C9 18 3A 29 33 B3 F9 1C 08 5C 66 35 38 0B FF>)
$$ ##END=
$$ 
$$ hash MD5
$$ 15 BE C4 CD 2E 89 4E 3B A1 61 10 BE DC 17 F2 38
##$RELAX= 
##$RELAX= 
##$RELAX= 
##$RELAX= 
##$RELAX= 
##$RELAX= 
$$ Bruker specific parameters
$$ --------------------------
##$DU= <F:/spectra>
##$EXPNO= 1
##$NAME= <H-F>
##$PROCNO= 1
##$TYPE= <nmr>
##$USER= <she>
##$AMP= (0..31)
100 100 100 100 100 100 100 100 100 100 100 100 100 100 100 100 100 100 
100 100 100 100 100 100 100 100 100 100 100 100 100 100 
##$AQSEQ= 0
##$AQ_mod= 1
##$AUNM= <au_zg>
##$AUTOPOS= <>
##$BF1= 200.13
##$BF2= 200.13
##$BF3= 200.13
##$BF4= 200.13
##$BF5= 200.13
##$BF6= 200.13
##$BF7= 200.13
##$BF8= 200.13
##$BYTORDA= 1
##$CFDGTYP= 0
##$CFRGTYP= 5
##$CHEMSTR= <none>
##$CNST= (0..31)
1 1 145 1 1 1 1 1 1 1 1 1 1 1 1 1 1 1 1 1 1 1 1 1 1 1 1 1 1 1 1 1 
##$CPDPRG= <>
##$CPDPRG1= <>
##$CPDPRG2= <>
##$CPDPRG3= <>
##$CPDPRG4= <mlev>
##$CPDPRG5= <mlev>
##$CPDPRG6= <mlev>
##$CPDPRG7= <mlev>
##$CPDPRG8= <mlev>
##$CPDPRGB= <>
##$CPDPRGT= <>
##$D= (0..31)
0 1.2 0 0 0 0 0 0 0 0.06 0 0.03 0 0 0 0 0.0002 0 0 0 0 0 0 0 0 0 0 0 0 
0 0 0 
##$DATE= 1666869689
##$DBL= (0..7)
120 120 120 120 120 120 120 120 
##$DBP= (0..7)
150 150 150 150 150 150 150 150 
##$DBP07= 0
##$DBPNAM0= <>
##$DBPNAM1= <>
##$DBPNAM2= <>
##$DBPNAM3= <>
##$DBPNAM4= <>
##$DBPNAM5= <>
##$DBPNAM6= <>
##$DBPNAM7= <>
##$DBPOAL= (0..7)
0.5 0.5 0.5 0.5 0.5 0.5 0.5 0.5 
##$DBPOFFS= (0..7)
0 0 0 0 0 0 0 0 
##$DE= 6
##$DECBNUC= <off>
##$DECIM= 32
##$DECNUC= <off>
##$DECSTAT= 4
##$DIGMOD= 1
##$DIGTYP= 9
##$DL= (0..7)
0 120 120 120 120 120 120 120 
##$DP= (0..7)
150 150 150 150 150 150 150 150 
##$DP07= 0
##$DPNAME0= <>
##$DPNAME1= <>
##$DPNAME2= <>
##$DPNAME3= <>
##$DPNAME4= <>
##$DPNAME5= <>
##$DPNAME6= <>
##$DPNAME7= <>
##$DPOAL= (0..7)
0.5 0.5 0.5 0.5 0.5 0.5 0.5 0.5 
##$DPOFFS= (0..7)
0 0 0 0 0 0 0 0 
##$DQDMODE= 0
##$DR= 18
##$DS= 0
##$DSLIST= <SSSSSSSSSSSSSSS>
$$ [...]
##$SUBNAM2= <"">
##$SUBNAM3= <"">
##$SUBNAM4= <"">
##$SUBNAM5= <"">
##$SUBNAM6= <"">
##$SUBNAM7= <"">
##$SUBNAM8= <"">
##$SUBNAM9= <"">
##$SW= 18.0517283424941
##$SWIBOX= (0..15)
0 0 2 0 0 0 0 0 0 0 0 0 0 0 0 0 
##$SW_h= 3612.71676300578
##$TD= 16384
##$TD0= 1
##$TE= 0
##$TE2= 300
##$TE3= 300
##$TEG= 300
##$TL= (0..7)
0 120 120 120 120 120 120 120 
##$TP= (0..7)
150 150 150 150 150 150 150 150 
##$TP07= 0
##$TPNAME0= <>
##$TPNAME1= <>
##$TPNAME2= <>
##$TPNAME3= <>
##$TPNAME4= <>
##$TPNAME5= <>
##$TPNAME6= <>
##$TPNAME7= <>
##$TPOAL= (0..7)
0.5 0.5 0.5 0.5 0.5 0.5 0.5 0.5 
##$TPOFFS= (0..7)
0 0 0 0 0 0 0 0 
##$TUNHIN= 0
##$TUNHOUT= 0
##$TUNXOUT= 0
##$USERA1= <user>
##$USERA2= <user>
##$USERA3= <user>
##$USERA4= <user>
##$USERA5= <user>
##$V9= 5
##$VALIST= <valist>
##$VCLIST= <CCCCCCCCCCCCCCC>
##$VD= 0
##$VDLIST= <DDDDDDDDDDDDDDD>
##$VPLIST= <PPPPPPPPPPPPPPP>
##$VTLIST= <TTTTTTTTTTTTTTT>
##$WBST= 1024
##$WBSW= 4
##$XGAIN= (0..3)
0 0 0 0 
##$XL= 0
##$YL= 0
##$YMAX_a= 327615
##$YMIN_a= -510511
##$ZGOPTNS= <>
##$ZL1= 120
##$ZL2= 120
##$ZL3= 120
##$ZL4= 120
##$ABSF1= 10
##$ABSF2= 0
##$ABSG= 5
##$ABSL= 3
##$ALPHA= 0
##$AQORDER= 0
##$ASSFAC= 0
##$ASSFACI= 0
##$ASSFACX= 0
##$ASSWID= 0
##$AUNMP= <proc_1d>
##$AZFE= 0.1
##$AZFW= 0.1
##$BCFW= 1
##$BC_mod= 2
##$BYTORDP= 1
##$COROFFS= 0
##$CY= 11.3945322036743
##$DATMOD= 1
##$DC= 2
##$DFILT= <>
##$DTYPP= 0
##$F1P= 2.36226072786647
##$F2P= -0.459571619588291
##$FCOR= 0.5
##$FTSIZE= 0
##$FT_mod= 4
##$GAMMA= 1
##$GB= 0.15
##$INTBC= 1
##$INTSCL= 1
##$ISEN= 128
##$LB= 0.24
##$LEV0= 0
##$LPBIN= 0
##$MAXI= 10000
##$MC2= 0
##$MEAN= 0
##$ME_mod= 0
##$MI= 1.114404
##$NCOEF= 0
##$NC_proc= 0
##$NLEV= 6
##$NOISF1= 3.799351
##$NOISF2= 2.8
##$NSP= 1
##$NTH_PI= 0
##$NZP= 0
##$OFFSET= 15.70392
##$PC= 1
##$PHC0= -18394.49
##$PHC1= 12.2007
##$PH_mod= 1
##$PKNL= yes
##$PPARMOD= 0
##$PSCAL= 0
##$PSIGN= 0
##$REVERSE= no
##$SF= 200.130013532006
##$SI= 16384
##$SIGF1= 3
##$SIGF2= 2
##$SINO= 400
##$SIOLD= 16384
##$SREGLST= <1H.CDCl3>
##$SSB= 0
##$STSI= 0
##$STSR= 0
##$SW_p= 3612.71676300578
##$SYMM= 0
##$S_DEV= 0
##$TDeff= 0
##$TDoff= 0
##$TI= <>
##$TILT= no
##$TM1= 0
##$TM2= 0
##$TOPLEV= 0
##$USERP1= <user>
##$USERP2= <user>
##$USERP3= <user>
##$USERP4= <user>
##$USERP5= <user>
##$WDW= 1
##$XDIM= 8192
##$YMAX_p= 0
##$YMIN_p= 0
$$ End of Bruker specific parameters
$$ ---------------------------------
##NTUPLES= NMR FID
##VAR_NAME=  TIME,          FID/REAL,        FID/IMAG
##SYMBOL=    X,             R,               I
##VAR_TYPE=  INDEPENDENT,   DEPENDENT,       DEPENDENT
##VAR_FORM=  AFFN,          ASDF,            ASDF
##VAR_DIM=   8192,          8192,            8192
##UNITS=     SECONDS,       ARBITRARY UNITS, ARBITRARY UNITS
##FACTOR=    0.0002768,     1,               1
##FIRST=     0,             0,               0
##LAST=      2.2672688,     0,               0
##MIN=       0,             -510511,         0
##MAX=       2.2672688,     327615,          0
$$ Real data points
##PAGE= N=1
##DATA TABLE= (X++(R..R)), XYDATA
0 0 0 0 0 0 0 0 0 0 0 0 -8 8 -8 16 -16 24 -24 32 -40 48 -60 72 -88 101 -120 136 -160 184 -216 246 -280 320
32 320 -364 413 -468 525 -589 661 -740 826 -920 1021 -1134 1257 -1389 1536 -1695 1869 -2060
49 -2060 2269 -2498 2753 -3038 3350 -3698 4094 -4543 5057 -5653 6354 -7191 8217 -9500
63 -9500 11163 -13410 16639 -21690 30742 -51971 210391 -84561 -440192 173650 246492 -75142
75 -75142 -87775 46056 -91847 2706 131763 -61421 -168780 107131 130546 -110390 -103426
86 -103426 84595 75824 3444 -58117 -94181 15482 135509 -20321 -152901 -7945 80054
97 80054 -25917 -7556 50658 -40612 -42967 89939 52530 -39868 25037 34472 -52609 19461
109 19461 90156 -46556 -88068 61029 39401 -97243 -24684 85987 -2387 -81443 -17450
120 -17450 36283 29476 8698 -36230 -46340 16032 45048 7044 -27157 -46040 -12202 69624
132 69624 35957 -82782 -24290 109119 18452 -98776 30459 118091 -30042 -83686 42706
143 42706 51528 -27827 -7408 103 -46970 859 52014 -29607 -64725 24304 32844 -40562 -18638
156 -18638 36587 7087 -27121 -12863 4476 25143 26100 -28244 -45089 28087 58052 -8384
168 -8384 -39765 5214 33968 19761 -6402 -18506 12127 37530 -9646 -46909 10185 47348
180 47348 -16807 -55404 -4762 25889 -509 -18245 -18605 -12346 12167 17337 -13076 -18343 10563
193 10563 15140 -4460 -4888 9426 13279 1348 -13139 -1243 30769 18490 -27259 -15927 32115
206 32115 21204 -17983 -9782 10428 637 -4113 183 -11148 -9012 8524 -7591 -28556 -203
219 -203 20486 -10353 -26490 914 13753 2051 -423 -515 -3631 8562 15412 -6 -3644 9504
233 9504 6798 -1365 5675 8153 -1321 -2050 3761 2235 761 -357 -6445 -4344 4500 -4177 -15527
248 -15527 -1902 8058 -9343 -18202 -608 8530 -1940 -8488 -4972 868 9611 9145 -5393 -6126
262 -6126 12724 15969 -1122 -5368 7671 12068 3146 -4564 -2262 6402 8165 -4486 -10864 -505
276 -505 5465 -2874 -8596 -6190 -3461 -1247 -1936 -8212 -7704 2885 2285 -8681 -3887 7738 2673
291 2673 -3479 3470 6531 1585 4076 7788 2609 1164 7208 4433 -452 3180 3624 -3076 -2094 2374
307 2374 -1734 -5423 -3456 -2759 -3969 -3141 -4333 -6224 -2412 -959 -5775 -3433 2949 -36 -3755 1799
323 1799 3549 943 4008 6662 490 566 8967 6168 -1308 3490 6502 -216 -919 4061 727 -4538
339 -4538 -864 138 -6050 -4879 -395 -3610 -6353 -3707 -3425 -3939 -1187 -1246 -3879 -1184 2218 1162
355 1162 632 2986 1926 1977 5956 4550 1069 4109 6043 1583 746 3706 2291 -871 1026 569
371 569 -4296 -2846 1154 -2673 -6897 -4483 -1977 -2741 -3127 -3676 -5032 -2303 1986 -15 -3382 -737
387 -737 3652 4024 1566 290 2775 7065 5398 -478 174 6725 6815 -249 -2181 620 2200 2227 -1314
404 -1314 -5738 -4371 1017 -205 -6266 -6405 -1856 -1084 -3078 -4008 -3795 -338 2199 -924 -3708 1634
420 1634 5234 2014 522 3452 3600 2645 4617 4605 871 857 3667 2959 513 -716 -1250 -172 235
437 235 -2973 -4531 -2013 -1314 -4706 -4059 -1394 -3423 -5066 -301 276 -4170 -2510 3129 3787 -36
453 -36 -1015 1654 5035 6327 2484 -686 1908 5675 4586 2550 -478 -2968 1444 7353 -374 -11166
469 -11166 -3094 9038 59 -14020 -7401 5733 3430 -7850 -10300 -2779 5493 4465 -5087 -8089
483 -8089 1148 9468 5869 -2425 -4825 2758 12502 7788 -6897 -5446 11600 12293 -6434 -9597 5408
498 5408 9939 -1971 -8580 -4124 1463 2859 -2283 -8633 -7093 707 3259 -1646 -7023 -6345 1074
513 1074 6686 1352 -7058 -3123 8226 7738 -2911 -3036 6773 7954 -177 -952 4537 3455 -59
528 -59 2899 2007 -5162 -3320 7474 3753 -11835 -10196 6477 6049 -9297 -11112 1080 3744 -3375
543 -3375 -4992 -1125 94 -326 452 1448 1142 581 1940 4722 3238 -578 2888 6918 1361 -3336
559 -3336 3624 6464 -2031 -4065 2693 1450 -5270 -2258 2908 -2185 -8281 -4580 2915 1933 -5477
574 -5477 -8969 -1306 7165 2221 -7961 -4420 7052 6194 -2250 -1315 4351 3782 2443 3711 958
589 958 -399 5136 6094 -3361 -5627 5009 8323 -4040 -10604 -667 6826 -593 -9061 -5592 1266
604 1266 528 -4212 -3427 -645 -1104 -2281 768 1828 -616 -62 3238 1907 54 3719 5311 1121
620 1121 -328 3570 3942 1982 1200 173 -693 200 304 -957 -743 -2120 -4988 -2730 2240 -686 -6541
637 -6541 -4290 573 -180 -2266 -698 -191 -685 -287 1342 2372 2896 609 -309 3953 5503 978 -202
654 -202 3882 2387 -1193 1481 3233 -1167 -1903 649 -1849 -3775 689 773 -6175 -6420 1057 2501
670 2501 -3776 -6152 -1681 2564 1612 -2456 -2819 2275 4985 1160 -1836 1656 5487 3941 165 -950
686 -950 2511 5324 2847 -2827 -2493 2918 3269 -1689 -4302 -2296 710 -329 -3895 -4757 -1280 228
702 228 -2145 -3953 -1844 550 365 -735 -901 355 2228 2217 881 1220 2556 2523 2218 2767 1412 921
720 921 1789 1828 259 -490 133 -246 -1049 -1251 -2410 -2689 -951 -1205 -3561 -3319 -693 -327 -1656 -1836 -1516
739 -1516 -173 1633 1099 -917 884 4065 2228 152 1947 3505 2233 1607 1319 1179 1800 2176 -327
756 -327 -2209 95 956 -1875 -2735 -1862 -1772 -1744 -1753 -2358 -2532 -882 -912 -1777 -968 843 -137 -143 1276 997 1365
777 1365 2642 2180 1121 1900 2793 1715 1369 1866 787 113 1079 428 -868 -1137 -1003 -1406 -1639 -1983
795 -1983 -2207 -1836 -1426 -2022 -2259 -1050 -285 -768 -610 -157 369 1141 1170 1068 1381 2222 1874 1455 2198 2203 1242
816 1242 1252 1296 601 602 715 -464 -1434 -871 -472 -1898 -1810 -1518 -2370 -2169 -1155 -1567 -1832 -1004 -753 -559 54
837 54 731 347 644 1282 1108 1700 2403 1963 1152 1554 2095 1270 662 1257 262 -284 -85 88 -1192 -1471
857 -1471 -806 -1570 -2151 -1161 -967 -2120 -2301 -1219 -974 -260 -193 -619 -302 525 1309 1205 1002 1426 1550 2429
877 2429 1512 1392 1627 1691 736 470 743 549 104 -535 -918 -1362 -1062 -1057 -1488 -2404 -2194 -1347 -780 -1191 -2097
898 -2097 -1584 322 372 -409 -299 727 1260 1428 1199 931 1555 2564 1886 233 493 1923 1839 501 -999
917 -999 -571 416 526 -1257 -2746 -1256 94 -1864 -3126 -1807 -851 -1323 -1412 -1082 -684 -82 945 685
935 685 -296 275 1955 2327 1192 451 1274 2624 2196 736 301 1315 1197 -411 139 133 -1082 -1314 -602
954 -602 -1189 -2208 -1445 -818 -1731 -2495 -1748 -127 -184 -1238 -1515 -17 1332 653 12 1052 1509 926 1459
973 1459 2292 1640 294 891 2002 1576 250 -17 741 -88 -1346 -769 -262 -1409 -1848 -1237 -1126 -1798
991 -1798 -1597 -167 -854 -2369 -1465 1304 1193 -1140 -1077 1429 2590 1016 -153 1264 2414 1705 524
1008 524 1204 1796 985 474 650 -486 -833 763 537 -2366 -2716 -44 422 -2030 -2940 -1002 -282 -909
1026 -909 -1689 -981 158 98 -488 459 1320 849 217 1431 2146 560 580 2319 2081 -167 65 1619 1069
1045 1069 -31 -343 -521 -538 -181 -648 -1409 -1582 -1011 -976 -1099 -1417 -2003 -538 529 -1177 -1654 618 2187
1064 2187 -184 -1352 1373 2581 1014 543 1556 1792 1062 929 857 1067 407 -89 -817 27 -109 -805
1082 -805 -1387 -1236 -1399 -895 -800 -1681 -1692 -563 -328 -1202 -1351 390 794 -721 -694 1284 2170 1028 -270
1101 -270 818 2732 2172 415 70 1676 1478 476 -352 -46 523 -383 -1200 -1452 -691 -207 -903 -1844
1119 -1844 -1794 -860 -211 -823 -1757 -526 580 231 -750 411 1640 777 112 1466 1745 1349 828 821 1168
1138 1168 1494 824 -53 333 590 -273 -1059 -491 114 -929 -1678 -1308 -985 -714 -1040 -1582 -1675 -157 329
1157 329 -872 -851 588 910 328 -125 875 1656 1412 457 623 1472 2107 635 -294 762 882 192 -581
1176 -581 -350 -184 -504 -1016 -1154 -1193 -512 -785 -2074 -1431 99 -246 -1319 -837 455 236 -269 364 711
1195 711 1003 997 908 660 1613 1915 438 -8 1089 1290 271 -365 -192 68 -33 -936 -1074 -786 -308 -1456
1215 -1456 -2057 -982 -121 -754 -1389 -827 -78 154 51 -241 68 1041 958 322 649 1795 1310 333 821
1234 821 1327 1189 371 91 48 313 242 -598 -1133 -652 -485 -920 -1469 -1007 -305 -658 -1523 -1052 -71 130 -641
1255 -641 -448 260 1030 721 372 866 1000 1277 753 787 1111 1092 425 333 456 772 117 -324 -640 -357 -606
1276 -606 -651 -1298 -942 -697 -1207 -1438 -843 -142 -672 -989 -673 446 428 392 38 244 1019 1217 840 604 1274
1297 1274 1097 598 653 1090 630 196 -190 -342 -215 -143 -778 -1048 -767 -843 -1064 -1132 -703 -693 -1029 -665 -208
1318 -208 -353 26 17 -111 154 1039 855 277 659 1197 984 351 1077 867 225 637 492 237 -131 -164 -487
1339 -487 -890 -490 -740 -901 -1203 -951 -1043 -667 -678 -817 -282 -436 -342 108 299 493 226 450 645 755 1030
1360 1030 1065 684 545 916 627 177 353 172 412 -381 -392 -225 -481 -658 -1099 -764 -937 -849 -552 -722 -881
1381 -881 -677 -373 -5 -180 -29 648 310 532 839 921 460 782 1056 755 694 736 642 135 -43 142 -203
1402 -203 -210 -528 -655 -673 -617 -711 -1092 -739 -794 -803 -736 -577 -124 -316 12 -91 301 604 646 712 687 708 602 918
1426 918 944 578 262 523 451 429 0 -146 -402 -534 -535 -288 -744 -1121 -709 -529 -881 -921 -297 -404 -700 -280
1448 -280 -77 497 437 363 190 894 904 692 726 699 820 610 527 594 311 -125 129 -77 -448 -353 23 -584 -880
1471 -880 -554 -679 -877 -589 -617 -639 -528 -339 -263 -223 -26 300 129 714 602 461 557 948 548 401 736 730
1493 730 334 95 378 414 -192 -377 -16 -483 -709 -538 -255 -892 -907 -795 -411 -314 -335 -381 -418 -131 209 264
1515 264 537 382 98 743 838 608 525 806 888 233 211 435 402 63 -294 32 -83 -655 -642 -419 -892 -910
1537 -910 -809 -868 -565 -568 -696 -480 -100 24 -266 -36 276 277 390 818 587 433 726 727 621 335 642 608 113
1560 113 97 63 292 -423 -565 -571 -445 -346 -794 -763 -590 -842 -1055 -487 -312 -307 -481 -58 -53 21 472 624 138 403
1584 403 934 832 714 688 635 666 3 395 419 51 -246 -270 -565 -144 -407 -768 -1004 -329 -206 -758 -736 -722
1606 -722 -331 -517 -59 171 296 254 238 63 454 1026 782 532 579 442 489 500 398 284 170 214 -271 -470
1628 -470 35 -227 -787 -749 -311 -784 -787 -755 -276 -359 -382 -463 -164 53 -49 31 55 577 662 524 196 779 930
1651 930 675 484 421 765 611 303 27 -9 313 -164 -474 -495 -334 -341 -915 -842 -135 -284 -443 -615 -412 34
1673 34 -20 -94 -80 287 530 339 488 761 787 743 378 647 476 577 393 166 -90 292 61 -582 -369 -86
1695 -86 -486 -696 -667 -355 -461 -432 -644 -257 -44 -32 -210 -217 87 36 222 420 485 282 462 287 694 680 725
1718 725 363 161 284 402 -91 -435 -101 1 -307 -451 -504 -386 -565 -542 -607 -650 -139 -210 -109 -566 250 133
1740 133 250 38 367 464 145 221 573 583 685 68 200 556 730 76 -178 15 -207 -273 -441 -398 -599 -590
1762 -590 -850 -586 -261 -244 -289 -446 -245 112 48 -132 34 288 386 466 273 557 587 551 551 534 653 344 -63
1785 -63 -20 -139 183 -192 -218 -471 -90 -81 -542 -527 -365 -612 -573 -288 -337 -215 -160 -50 8 218 463 285 18
1808 18 522 337 496 427 398 397 511 195 -41 358 277 -17 -137 -110 -114 -617 -391 -307 -415 -689 -477 -348 -333 -115
1832 -115 -16 -328 35 142 140 153 291 429 394 585 121 249 514 132 330 371 581 127 25 -247 -130 93
1854 93 -166 -218 -513 -475 -126 -532 -184 -266 -346 -248 -316 14 16 -237 -93 248 52 344 483 502 429 440 427 531
1878 531 231 335 345 46 243 124 -66 -169 -252 -153 -245 -446 -506 -499 -303 -399 -500 -396 -262 -134 -192 -86 228
1901 228 57 273 389 323 403 377 515 646 418 150 324 284 431 239 24 -212 -244 80 -220 -320 -528 -478
1923 -478 -389 -613 -410 -297 -452 -318 -422 -77 -52 96 42 -15 328 226 365 314 273 401 364 485 59 286
1945 286 120 -161 103 -12 43 -412 -278 -313 -507 -270 -210 -302 -590 -282 -373 14 -32 -36 -252 -229 23 194 305
1968 305 175 234 570 661 649 559 267 295 398 197 218 79 -153 -146 -136 -208 -302 -174 -584 -468 -434 -284 -273 -361 -244
1993 -244 -251 -69 -77 -64 -63 62 340 316 393 360 423 213 379 738 337 269 62 250 -27 -51 101 -209 -442 -68
2017 -68 -249 -215 -329 -314 -318 -414 -320 -142 -327 -232 -129 -164 70 343 232 72 458 282 319 264 386 302 182 378
2041 378 244 13 269 143 -84 -388 -174 -310 -123 -463 -437 -90 -476 -220 -216 -126 16 -411 -338 -28 91 109
2063 109 288 461 469 175 110 412 23 321 314 390 241 98 75 -41 103 -190 -206 -46 -390 -226 -321 -271 -350 -479
2087 -479 -343 -372 -116 -77 -136 -55 7 25 303 207 125 -13 240 407 402 228 248 336 218 -92 -123 -211 194 -116 -28
2112 -28 -294 -311 -184 -419 -265 -353 -235 -135 -281 -478 -180 -100 -288 -170 116 257 155 171 247 415 511 315
2134 315 268 248 134 285 -128 -152 69 -6 -380 -105 -190 -200 -191 -182 -456 -183 -26 -136 -300 -301 179 -199 79 33
2158 33 101 -122 245 171 632 307 45 337 43 467 213 101 386 205 41 -67 21 -101 -204 -272 -462 -125
2180 -125 -190 -303 -365 -520 -146 -165 -260 -136 -34 13 54 157 -14 337 117 343 217 164 521 171 161 -101 164
2203 164 130 -21 154 -81 -129 -437 -216 -334 -305 -301 -264 -379 -160 -240 -199 -352 -99 78 -19 22 323 340 418 144
2227 144 306 361 46 255 36 11 377 -37 177 -100 -10 103 11 -322 -212 -156 -208 -291 -322 -31 -293 -380 -266
2250 -266 -114 -108 -113 23 -125 70 324 178 208 390 369 357 195 199 187 356 147 57 375 -117 -22 -3 -257 -176 -420
2275 -420 -504 -76 -65 -113 -290 -282 36 154 2 -222 5 251 222 382 40 287 133 302 296 201 400 448 -56
2298 -56 285 198 231 -93 -24 -126 -228 -1 -19 -168 -285 -98 -116 -139 -263 -66 -209 -275 81 228 16 65 -48
2321 -48 -22 79 264 283 271 1 406 195 163 314 244 12 84 -59 -90 -429 -98 -26 -336 -195 -143 112 -320
2344 -320 84 -274 -235 -57 -229 -68 0 -105 164 84 415 239 103 14 167 273 323 128 192 161 -151 153
2366 153 -336 -87 -112 -139 -67 -114 -154 -166 -151 -283 23 -150 -177 -207 -134 -71 117 267 263 -73 28 306 183 111 324
2391 324 332 28 416 132 -67 -22 -10 -30 -68 -50 -121 -55 5 -143 -141 -212 -327 -203 -196 -277 69 72 48 -112 73 114 -78
2418 -78 216 13 276 60 223 403 301 175 19 341 84 133 159 -109 118 -189 -199 -260 -256 -216 -239 -338 -274 -280
2442 -280 -42 -250 -52 96 -113 -110 11 28 226 182 195 150 429 332 46 251 -54 152 -178 -10 119 168 -128
2465 -128 -57 222 -162 -177 -219 -215 -20 -307 -281 -223 -175 -139 -172 95 -314 74 -8 119 181 7 172 94 265 102
2489 102 -263 -106 310 153 -1 -50 -120 132 -135 -224 -161 -413 -22 -320 -157 -448 -112 -231 -270 23 296 -60
2511 -60 -17 -164 124 72 96 -6 100 186 386 274 145 -16 260 180 -94 112 83 -255 -215 -37 -34 -307 -279 -301
2535 -301 -195 2 -47 -98 116 -119 -81 111 165 5 117 266 14 235 155 282 298 279 78 -61 151 254
2557 254 -2 -136 -23 -82 -170 -32 -29 -289 -392 -44 -349 -319 -73 -63 -124 74 -131 -204 -411 139 124 128 152 115
2581 115 208 83 51 180 0 -159 193 242 -4 13 73 -26 -45 -145 -256 -140 -229 -1 -111 -525 -253 -193 -32
2604 -32 -232 -2 -106 -204 95 92 20 -100 292 188 215 258 213 214 127 145 274 15 -147 -211 29 -307 135 -25
2628 -25 -141 -275 -127 -220 55 -32 15 77 -227 -128 -248 -65 -69 -28 36 -112 204 195 282 10 126 2 159 151 265
2653 265 -102 -245 70 -35 10 -23 -245 -58 -38 -119 -140 -51 -390 -130 -156 -81 -87 -143 34 37 -74 -25 121 320 136
2678 136 169 271 71 228 201 208 21 88 131 -95 144 -8 -16 -267 -54 -32 -161 -208 -297 -150 -186 -52 -172 -16
2702 -16 -148 -168 -86 96 -42 38 -193 35 112 182 89 -56 32 277 77 222 -86 181 -209 -269 -72 -34 113
2725 113 -47 10 110 -225 51 -255 -282 -109 -147 85 -162 57 -16 184 177 -151 91 -67 93 -65 39 83
2747 83 53 24 -19 157 -105 -25 84 -166 -171 -20 -211 32 -105 -251 -152 -36 -203 216 -44 -11 -65 19 115 34
2771 34 164 118 -30 140 -149 333 5 42 152 47 -2 33 -10 -180 279 -42 -81 -47 76 -74 -210 -16 52
2794 52 -117 -244 62 -62 -23 -1 53 68 -228 16 44 91 12 113 157 128 -89 154 408 209 -15 -328 -84
2817 -84 -123 46 -44 -88 -268 -276 -52 -44 -181 54 -110 4 140 112 211 -36 24 0 4 -33 34 162 -112 216 158 66
2843 66 -60 70 105 103 39 170 -62 198 -103 -132 89 1 -161 118 150 148 -122 -54 -129 -38 -86 76 133 -217 195
2868 195 -16 313 -76 257 67 164 8 -4 114 193 193 -39 -113 -110 -31 51 136 40 3 -152 -143 15 -229 -54 -212
2893 -212 -190 -194 14 9 253 228 -97 234 7 69 -27 301 -23 227 60 24 25 -70 63 -135 211 -125 -135 -65 -112
2918 -112 76 -75 -13 -347 -148 -109 -72 -52 8 -6 108 -183 -10 -50 154 -18 149 -28 166 270 88 50 -65
2941 -65 -1 164 -104 -76 120 -240 -88 259 9 -173 -197 -24 85 52 113 -202 -165 -85 195 -19 267 21 145
2964 145 296 198 93 264 -118 -199 92 -134 124 -105 -56 -19 191 90 83 109 114 -231 80 -65 -195 171 -43
2987 -43 -252 215 -139 -119 52 -154 -11 -111 -55 -61 -166 108 176 79 331 181 -189 227 234 -20 -6 90 137 33
3011 33 71 140 -237 103 -96 -115 185 -252 -100 -100 -78 77 -153 196 70 -10 -18 28 85 109 246 175 -10 229 -31
3036 -31 -85 80 -82 -115 -32 -30 -253 21 -145 -268 69 -74 65 16 -133 -58 -78 -82 -13 52 50 106 -140 -32 95
3061 95 45 52 27 139 -147 7 27 292 77 164 121 67 -19 -208 -25 72 183 167 -228 -116 -90 -68 34 -190 -16
3086 -16 -18 -47 -19 -47 294 104 -154 28 -61 73 140 317 86 -135 -59 172 64 146 -230 -14 176 13 -23 -125
3110 -125 -116 -141 10 -44 -173 116 15 -59 -64 236 33 -142 39 38 114 -82 119 79 34 298 192 -53 105 -77
3134 -77 -46 101 -250 211 46 -28 -100 -263 217 23 -130 -15 -285 37 -158 76 -19 153 -19 38 -29 170
3156 170 23 56 263 -153 122 -98 -141 -97 -34 79 -32 -143 135 143 -2 -99 9 6 -3 -24 -107 -277 -218 -66 -119
3181 -119 142 -125 94 -58 8 148 -65 -28 -97 -91 -202 -32 -163 366 -20 64 -46 -84 -49 217 140 -86 175
3204 175 27 114 90 -149 -204 -170 -190 29 -266 -29 -82 -25 114 -23 -132 -330 -148 -3 -74 87 -114 -101 -115
3227 -115 51 273 -57 7 -28 194 29 166 245 -112 13 97 1 -67 33 -193 201 149 -47 -176 -15 -79 131
3250 131 -91 140 297 -47 -31 338 283 132 -64 51 154 118 58 0 -37 3 108 -61 58 166 -78 180
3272 180 -46 -138 160 71 56 64 -86 179 18 218 -200 130 130 -209 -52 -136 290 -123 57 -186 22 28 119 159
3296 159 -301 -197 77 -64 -59 -98 -183 111 -142 -56 -46 -236 17 238 -102 -21 55 177 22 -178 19 24 23 2
3320 2 3 74 255 -50 86 -92 -104 287 -79 199 -211 60 59 -3 146 64 94 1 -92 -14 82 134 143 138 50 295 -226
3347 -226 -167 -245 32 -41 -146 -291 91 65 69 160 -32 -72 162 99 -69 158 -30 -20 -52 -184 -19 -171 -181 -17
3371 -17 -109 -110 -152 -200 195 22 76 -20 136 -260 48 280 463 23 -113 -31 -29 -155 -90 -81 56 -79 -247 -99 -142
3396 -142 186 15 123 101 32 -82 92 -93 -264 160 -116 65 55 63 -8 -60 -6 75 23 212 -142 -7 57 46
3420 46 114 136 123 48 -30 -178 -74 124 193 34 79 73 -127 -35 -6 -31 28 -120 39 100 33 168 -263 -197 96 -116
3446 -116 209 22 19 43 56 -84 -234 -194 30 -54 19 -120 132 -128 79 22 -139 -114 68 114 -156 378 -262
3469 -262 -74 -87 -285 7 -68 86 63 80 56 -128 -37 9 91 119 108 -44 -5 -102 21 40 64 41 120 47 74 29
3495 29 -104 18 0 75 110 -144 104 -197 -141 -221 29 211 135 49 -237 -133 66 -193 19 198 -48 -167 -214
3518 -214 100 -188 115 -132 64 5 41 -39 -82 135 98 2 -47 -15 1 -194 -126 -120 214 -187 -15 192 -99 -161
3542 -161 -60 -47 -94 59 -53 -60 77 -292 165 134 -18 -45 67 -93 184 113 6 172 9 -125 -226 9
3564 9 200 112 -199 5 173 -87 84 -57 126 -25 -269 62 219 81 -270 16 211 70 -108 88 112
3585 112 256 27 -56 208 -58 -77 0 235 -175 132 -34 -1 -19 -35 -292 161 187 99 -198 -157 -5 0 15 -70
3609 -70 69 11 123 120 63 -131 -16 -136 -68 141 39 -87 226 -220 170 156 98 -84 -55 147 -182 -192 69
3632 69 45 7 189 -70 221 -46 -27 -127 -288 44 177 -99 93 111 19 -116 60 20 126 70 107 -44 7
3655 7 2 -68 -22 101 -61 -1 240 337 6 169 173 21 -220 -119 -121 -39 -3 179 134 -8 -90 -145 -259 146 153 230 124
3682 124 -51 101 -371 19 -117 -204 -89 137 -54 -207 -15 239 -76 112 70 17 -2 122 -94 -173 -279 7
3704 7 49 -29 133 -144 140 -38 52 -175 -121 -295 -260 -42 50 26 -51 -11 -172 -149 -135 -98 -280 -161 40 -179 -78
3729 -78 -28 -1 -42 -133 -63 152 -19 -21 231 -31 100 -75 60 2 -104 -171 214 -284 120 58 -264 245 -191 -183
3753 -183 118 -97 -176 -133 -152 -122 -168 86 36 -188 47 97 49 151 -113 -137 -38 76 180 -67 -41 -221 -92 51
3777 51 -24 -67 2 -144 -201 211 156 -147 -119 43 28 -77 204 -83 214 -154 -79 42 0 -61 -45 -113 -52 34 -70
3802 -70 0 -161 -87 158 281 108 -106 42 59 187 -3 -177 95 71 2 25 31 -67 39 9 134 -18 208 231
3826 231 -172 -115 7 -67 -82 48 33 -248 75 92 -93 122 -63 -27 -2 -155 28 -29 206 36 -47 14 -13 -197
3850 -197 -204 -24 24 22 -15 -146 -165 -37 -64 120 -32 59 -64 23 111 -80 -185 248 123 -115 -71 201 140 4
3874 4 -16 85 122 -74 -205 -159 -9 62 130 -132 172 -198 -98 301 137 -83 -36 -39 -94 13 253 176 -67 176
3898 176 -60 -18 -191 -92 103 119 -288 214 25 -47 -225 -124 -67 249 -72 -181 235 -229 60 -52 -183 -14
3920 -14 53 114 309 -273 85 -108 -182 324 -30 58 -29 29 -212 -29 -187 14 116 -176 -218 -66 82 -82 -40
3943 -40 56 -138 -24 39 107 111 -187 -296 -72 -185 -14 11 255 9 -9 -92 -39 120 11 139 145 -160 6 -100
3967 -100 20 126 124 65 151 -130 26 -340 -69 -16 -6 100 -198 27 -138 -1 -23 106 58 -161 43 7 -221
3990 -221 -143 -27 238 6 93 297 -240 -114 -136 263 38 197 -21 109 45 -113 21 67 -155 228 -125 -14
4012 -14 -77 -479 12 -195 128 -129 134 126 -59 -187 -152 -3 13 -76 5 72 -1 63 -38 46 150 63 84 73 83
4037 83 142 -230 -119 -44 153 43 68 12 -71 151 66 -199 -157 90 37 -114 -22 78 49 156 -140 134 -170 -228
4061 -228 -150 135 -31 41 -71 189 -238 87 47 -18 26 -49 -216 -139 -223 -14 -95 185 146 140 -121 182 109 -28
4085 -28 5 55 174 141 0 26 78 -161 -79 -28 50 -63 54 -179 106 -300 -115 -70 -129 1 -45 132 52 120 -151
4110 -151 -135 -33 -197 -61 -84 120 21 -71 322 -25 196 18 -12 40 244 46 175 -5 2 12 -91 177 -9
4133 -9 -158 57 221 -103 22 -366 -25 -85 73 -86 -85 -53 28 162 -84 131 -232 23 -203 93 -27 -130
4155 -130 -192 -63 -12 -11 204 -7 -130 -145 -126 36 0 -49 109 44 27 -164 -276 154 -68 184 -139 124 -141
4178 -141 74 267 52 -61 16 -199 98 69 60 84 -15 157 -39 226 -267 -58 -11 -30 139 -338 32 175 21
4201 21 -32 307 3 32 60 36 143 -13 158 -76 -77 123 166 -116 153 -55 36 84 -157 58 -67 -208 -259 -105
4225 -105 -224 151 9 246 -22 -50 4 -124 -56 137 -109 -28 49 101 -89 35 75 -14 159 -108 124 59 -2
4248 -2 -246 -51 -80 173 -383 1 -50 -10 228 -110 86 -69 200 265 -57 47 -218 -104 104 35 -256 58
4270 58 -149 -268 -27 -240 44 3 -48 -155 -218 -98 99 55 -134 -61 129 -211 211 38 2 -276 -209 145 19
4293 19 -27 -25 53 218 1 8 -92 67 120 12 -55 -193 69 5 142 -92 -71 91 21 99 -87 14 -53 20 229
4318 229 96 150 -49 -163 -193 214 -94 105 142 14 264 -86 -98 -148 -223 9 121 156 132 -79 118 79 50
4341 50 18 20 69 44 38 -136 116 5 8 -273 2 113 89 -9 -41 -158 -118 112 -159 -163 -73 -127 24 -58 -131 102 -201
4368 -201 -124 16 -77 36 -115 -57 29 108 -84 425 184 244 88 -140 -99 7 -41 151 83 26 9 7 140 -57
4392 -57 14 -167 5 203 -87 -79 36 -17 131 121 56 -86 104 -118 -180 85 -34 97 -160 176 -67 -19 58
4415 58 -168 125 -118 105 -197 38 -68 85 104 -45 -137 79 159 -197 60 -88 30 -214 110 -63 -186
4436 -186 125 156 -101 66 8 -10 199 78 -110 -138 138 102 94 -65 -157 -32 -77 -58 -112 86 122 -50 144 -30
4460 -30 -151 70 -163 -75 -66 58 9 272 -97 -141 144 -82 -66 122 32 84 -89 168 73 -131 61 -37 -19 -34
4484 -34 152 -153 -273 -270 -38 19 -91 87 -54 -183 20 -402 -37 -19 209 141 240 -62 -82 34 -65 245 27
4507 27 55 92 194 88 6 27 101 -132 -196 -5 -138 -113 -36 -319 82 -4 14 44 47 -203 -68 -242 98 212 26
4532 26 -136 -87 131 25 -75 -318 -148 -251 -136 54 -74 86 -23 -125 121 -93 144 -44 49 -189 -50
4553 -50 200 -60 81 -174 -91 123 72 -80 -25 287 -33 -94 53 111 26 -167 -4 247 210 -30 -62 252 433
4576 433 -2 -46 35 10 264 -215 -47 -243 58 -137 59 -22 -116 -74 -383 -186 -9 189 51 -116 49 49 28
4599 28 -14 -68 -19 -37 35 6 7 -82 9 28 -145 -5 -151 -18 -42 -267 28 54 -190 -43 209 159 102 -125 -132 -27
4625 -27 -3 197 -264 -24 -22 -117 56 -22 -32 308 61 210 -168 236 34 80 -46 50 -89 48 88 -122 -134 -10
4649 -10 -14 -138 163 -241 59 31 -86 103 12 -90 -70 177 88 117 -2 184 59 -88 -94 -110 -6 -203 28 6
4673 6 -67 -118 43 -227 21 148 251 223 65 26 -123 187 109 177 -41 157 -29 74 72 157 -39 243 11 13
4697 13 -188 -76 -79 -26 -179 -13 -215 134 -46 -197 -95 25 82 -145 24 -62 230 -38 -91 -152 -154 -52 32 27
4721 27 354 -52 -79 -140 171 14 82 165 -40 1 40 103 85 38 19 -52 125 -104 -75 -60 7 130 -81 54 143
4746 143 -36 -123 -91 -54 -197 79 -160 1 142 -141 -68 146 -3 -111 54 -75 -17 -175 -92 21 11 129
4768 129 160 -83 348 -86 -92 -129 55 30 60 -2 -42 382 65 114 43 126 62 -63 -28 1 -210 -254 72 305 42
4793 42 -202 84 -134 178 20 -126 113 -5 -38 127 237 -45 129 106 -104 13 -207 -52 -43 46 -203 -39
4815 -39 182 140 -236 -214 -146 -16 14 64 -100 5 67 116 168 -33 63 -154 -107 -128 286 -21 93 -152 -25 -30 359
4840 359 38 -8 219 137 137 -7 -36 132 -152 198 -42 60 99 20 101 -134 217 -82 260 206 424 -54 93
4863 93 20 91 -116 149 -68 277 -107 -178 -318 -64 24 21 124 -58 241 283 61 208 12 15 217 -183 -156 -24
4887 -24 -67 24 -86 23 82 -74 79 125 -97 51 -50 243 3 -138 -19 79 -56 -43 -104 -129 7 -165 -46
4910 -46 -31 64 266 9 -89 -70 83 112 -45 102 65 -74 -91 59 -28 56 -387 1 47 -90 -146 -9 27 -71 -52
4935 -52 -97 77 -106 111 -33 -104 -49 27 181 19 -21 -66 150 70 -28 82 156 33 30 -234 46 178 -43 -64
4959 -64 -99 -158 -46 -55 -161 -55 -100 28 -309 21 284 -73 131 -97 -34 -107 23 60 -251 -121 -85 -52 -78 -5
4983 -5 125 -12 -72 39 -105 -186 99 55 207 -33 10 125 -10 310 1 24 -30 -8 -34 45 82 -58 -160 -25
5007 -25 2 128 -62 -204 -50 145 -10 51 153 55 86 -107 82 31 64 22 162 -42 14 -66 -148 71 -210 -157
5031 -157 115 -204 -78 99 -162 -12 -249 100 35 -1 181 -94 -11 -92 -82 -121 173 -9 205 -27 260 -65
5053 -65 38 45 -132 27 -31 90 -137 -137 -63 165 -138 185 -75 18 -53 -54 51 -69 19 -82 -178 103 130 -146 74
5078 74 -220 -46 -32 115 172 -137 -86 139 141 164 34 -310 -28 170 -39 199 129 -135 273 23 -58 74 230
5101 230 -218 -345 35 332 -54 33 82 154 31 -5 -14 94 142 -171 43 -148 130 35 -168 -66 -215 -115 -32
5124 -32 7 -114 156 77 -40 379 -80 298 67 44 -91 188 -20 -147 62 181 209 -32 -195 120 -61 -40
5146 -40 -13 113 14 -211 189 286 -114 -154 -66 15 69 89 -44 125 44 128 -191 -96 -174 58 -48 -162 -12 81 -13
5171 -13 20 -72 89 -238 -178 -15 -90 7 -13 393 379 179 100 -93 -172 96 -63 -105 -65 267 -49 -209 212 27
5195 27 -50 -76 127 -16 114 32 -124 53 80 74 129 -45 -166 -136 65 47 -152 117 67 -90 13 -47 28 -136
5219 -136 -13 114 251 -188 -154 315 -154 -345 -103 -128 76 104 198 81 -45 -27 -21 -53 54 -39 18 -44 172 257
5243 257 -113 -19 -19 74 -273 -89 23 137 -37 61 25 -27 1 44 -186 -73 -233 123 5 -119 119 -121 -337
5266 -337 88 261 -103 -16 115 61 -178 153 218 188 223 -187 143 -65 425 -158 -32 79 -252 -105 87 -233
5288 -233 -1 33 93 -320 112 112 34 -28 -151 -50 150 10 -53 -35 -63 -49 -148 -6 -153 -56 85 68 129 201 -125
5313 -125 308 -53 194 -15 -11 105 -137 -8 -234 55 -111 -9 9 -136 85 -25 69 14 -129 177 -106 7
5335 7 -6 84 202 -92 -143 34 -224 103 76 127 -135 223 222 -101 -32 106 -23 81 -23 75 220 -79 110 -98
5359 -98 6 168 28 19 -35 45 -38 39 87 191 77 31 131 -259 -147 114 -180 -109 -100 -226 -86 97 11 106 -1
5384 -1 63 -62 -114 100 -239 -86 -32 -15 -38 -72 166 214 -73 -118 -165 155 30 -31 125 185 154 -141 -2 -165 -61
5409 -61 257 -141 64 2 22 45 20 -162 -76 -4 -173 -67 -134 146 -178 -35 170 -58 94 -86 -78 8 -163 -7
5433 -7 55 -15 223 -230 -135 -37 -43 -92 -37 -13 32 130 30 5 -149 106 170 140 87 134 -4 246 25 39 -87 -52 -147
5460 -147 80 8 149 136 43 11 -47 -182 24 -168 -32 245 40 -205 -32 112 143 202 -88 24 15 92 93 61
5484 61 -70 26 181 -119 -124 77 24 64 17 -133 -100 -7 -18 -30 67 12 269 225 -70 -64 73 -92 -80 177 -141 -17
5510 -17 153 -296 142 84 -121 -185 -88 -26 4 -125 -13 -137 87 15 6 101 247 2 18 57 156 -63 -65 -100 -35 -83
5536 -83 -52 22 -151 -46 -127 -188 53 145 147 -54 -34 -218 72 10 -93 58 -155 -97 16 138 213 7 151 -13
5560 -13 32 16 203 -213 -105 -69 -72 24 -167 19 161 208 -166 123 2 73 31 -10 -227 -91 324 -5 73 58
5584 58 124 -281 -2 55 -6 31 10 24 66 6 -75 -63 -69 5 -30 11 -13 -190 -31 -102 37 23 -209 -104 -23 80 72
5611 72 263 148 94 -207 -77 126 79 5 -31 170 -18 -199 -44 76 -72 -68 43 -359 -177 -281 113 70 -78
5634 -78 -111 -49 -79 -13 27 -68 -106 71 276 228 -80 29 38 301 96 -202 181 -31 198 -116 -69 20 69 19 -85
5659 -85 162 14 -128 167 35 3 76 -46 49 -90 -48 79 2 26 107 -146 115 -6 -143 77 -30 137 -119
5682 -119 -26 -18 -160 -260 82 -237 144 17 -54 -111 -158 83 -18 -27 116 -96 -129 -307 153 59 97 70 -44 164
5706 164 -114 241 196 -195 165 279 -35 126 -252 148 115 183 74 -18 32 -20 166 127 -159 148 198 -139 77
5729 77 373 271 -15 -124 -118 -158 -111 -181 -58 98 -229 184 -212 -213 41 167 94 27 -192 -206 60 -86 -65 139
5753 139 105 37 -238 -105 -10 -40 67 8 142 -203 -77 139 2 -149 -84 -146 125 105 24 -387 325 87 -11
5776 -11 139 -109 69 133 107 13 68 -124 96 49 17 -41 -91 16 54 130 226 146 82 10 103 -11 7 -199 76 73
5802 73 30 -42 13 57 -23 264 -150 1 -28 -89 81 160 -117 -70 -213 250 32 26 17 -20 231 22 71 -108 -89 38
5828 38 165 149 -136 165 -186 350 15 84 289 -199 -56 15 -6 324 -48 -100 41 383 109 26 124 -10 136
5851 136 -78 -45 55 -127 -115 -100 -44 12 -304 -252 -27 -61 -187 -222 145 -22 56 -80 -34 9 -63 -51 112 172 15
5876 15 -56 72 98 28 77 210 -95 -165 155 252 -132 -54 -14 -19 251 2 -118 138 -91 69 85 72 338 -66
5900 -66 129 -243 74 78 -272 24 48 314 -221 -146 11 -43 139 137 -163 -2 226 -144 -76 22 -174 -140 -62 -28
5924 -28 60 -43 74 -128 -197 -45 187 -43 112 89 -274 -9 2 -86 -101 74 -253 -66 67 -103 -36 37 251
5947 251 178 -388 -179 -142 -25 -15 -82 119 48 51 42 11 288 248 111 173 153 -108 -107 -139 -80 109 62 -162 31 -52
5973 -52 281 -12 153 -11 257 -28 -73 14 -98 -292 -79 71 101 -71 32 34 -83 -7 -4 -277 299 38 64
5996 64 40 -189 -2 166 -108 9 156 31 -12 -75 29 -34 -43 -36 36 -102 -64 150 -42 108 81 111 204 12 -70
6021 -70 -32 -70 32 -61 -70 -273 54 -89 -211 147 67 -115 -137 -143 -39 84 55 49 -157 319 79 -45 71 -187
6045 -187 -1 -50 75 69 -19 127 -14 -117 166 82 29 -64 -269 -96 126 -37 31 181 -10 -11 -169 102 146 169
6069 169 -126 71 193 -251 -47 -105 -131 40 52 48 -37 127 51 -168 233 -9 -91 90 187 96 -32 17 -15 51
6093 51 101 186 49 -173 -134 -89 -55 -24 -126 35 238 -70 -32 -5 57 70 -7 70 59 55 50 96 5 -104 -143 269 -92
6120 -92 105 -265 -156 -100 430 160 68 114 -169 217 150 256 1 -244 44 109 41 193 140 -105 55 -193 -13
6143 -13 -166 71 83 -130 25 103 296 -56 125 -159 -159 133 -96 -43 -34 -102 155 -141 60 127 -160 192 -47
6166 -47 44 167 -108 -71 -31 24 4 -60 180 75 -67 -51 121 -18 -15 63 -41 -128 1 -60 210 72 10 96 -129
6191 -129 -16 185 42 70 229 -64 366 -261 40 -215 18 137 -257 -26 205 13 165 87 -97 -320 -7
6212 -7 42 -176 292 1 -8 -24 80 -79 222 64 -72 88 -92 -124 116 -52 -52 -55 -111 186 -116 -80 -119 157 32
6237 32 -282 -6 -71 -163 -155 148 -12 180 -20 -130 129 -194 -87 119 111 -346 -76 150 110 -50 61 -30 -96
6260 -96 -5 -309 -23 -296 -248 -52 -56 -52 -301 -97 -109 -110 248 -91 -13 3 64 -129 -19 10 -168 90 -120 -22 -167
6285 -167 -2 -41 224 0 189 78 65 8 170 -147 -114 247 67 417 -80 -114 -211 109 -153 5 156 1
6307 1 26 -55 -164 88 216 -97 -58 153 32 -52 212 -56 40 -62 153 -191 -26 -149 -23 -76 23 -59 79
6330 79 -39 -335 134 -71 177 -79 89 117 -48 -4 22 187 82 27 -115 -7 -56 -63 517 110 -52 0 235
6353 235 -5 -80 -182 53 -2 28 0 84 128 -2 29 56 142 -21 -92 -63 18 24 -55 -54 50 189 55 -209 -65 -189
6379 -189 62 -73 35 -27 87 176 264 54 155 -162 307 34 -20 95 -254 121 149 134 -103 -109 148 50 92
6402 92 -270 49 73 32 -49 -82 30 19 -113 -137 -223 76 345 -94 22 -54 45 53 -9 -14 205 -95 -35 44 261 -119
6428 -119 -75 -66 -34 -155 -24 153 -217 38 -207 7 33 104 -127 108 -27 165 -83 -191 112 34 70 136 34
6451 34 245 21 115 -116 -5 -139 215 -20 -39 -121 19 12 -71 -70 -159 -164 -1 20 208 -10 130 -66 -101 159 111
6476 111 107 55 -14 -29 -172 -155 -153 -182 21 -44 -174 -131 78 4 70 -245 28 121 215 -216 60 98 -173 120 -110
6501 -110 98 14 63 -18 -49 -16 24 149 -188 89 -11 221 24 188 67 71 -83 50 99 38 131 6 130 -2
6525 -2 -26 -61 32 -108 12 35 97 194 88 -9 -76 150 -15 76 -100 -70 112 -2 40 -43 38 126 28 27 -57 -12 36
6552 36 224 10 112 135 -185 -27 67 -34 91 -78 -108 -76 36 201 -223 106 -66 12 101 -37 -84 141 -145
6575 -145 54 71 94 -91 -8 -95 111 137 193 -142 -72 177 -82 -156 -61 91 157 94 -49 -57 49 -35 115 -40 51
6600 51 -181 380 123 45 54 346 44 -204 97 165 -26 -25 164 -259 -37 48 70 164 -67 -25 -54 -44 -122 65 45
6625 45 97 32 -84 -45 70 237 27 128 -84 -187 -25 25 58 97 40 -55 84 65 27 142 -47 70 53 -130
6649 -130 -275 -49 9 -115 3 -81 -147 -47 129 -30 0 -263 45 120 -142 236 172 156 -94 -56 307 -124 -56
6672 -56 -13 41 -188 41 36 -76 66 192 38 17 168 159 265 -143 40 61 84 -160 -148 -14 -96 128 -123 122
6696 122 98 -214 185 217 102 287 183 -118 162 6 -141 166 -8 132 45 -80 68 -268 -84 -75 -76 -45 -35
6719 -35 320 244 288 -59 -1 -70 -95 -192 1 39 176 -14 144 -76 110 -5 21 64 -255 -170 73 -55 -61 -47 -95
6744 -95 99 88 53 37 -160 -79 -20 187 -6 126 81 77 -83 -13 -109 16 -43 -43 320 80 -58 -177 178 58 -83
6769 -83 28 86 184 -218 32 23 72 -48 -43 514 185 159 467 -195 -155 -85 -39 -106 134 -279 -160 -182 107 -39 -179
6794 -179 -142 16 -57 -27 101 216 62 -246 168 68 -60 -54 -187 3 -244 202 -84 -21 44 113 76 64 -61
6817 -61 135 -38 122 63 72 -47 -38 16 -16 -35 -145 0 -48 44 -27 93 -96 -268 7 -115 186 53 97 188 -72
6842 -72 132 -47 189 60 -49 -86 57 -9 -35 -39 -186 -147 107 -217 -57 43 80 3 -133 -83 52 99 171 96
6866 96 -252 161 63 -91 22 64 -156 274 -153 108 134 -222 -144 -98 269 -14 -83 112 24 -117 105 73 132
6889 132 2 100 50 -169 -186 29 93 74 225 135 70 13 -39 -11 73 2 380 -132 33 -131 -80 40 91 -20 9
6914 9 288 35 350 -251 -122 152 -216 76 52 -8 2 -51 -82 140 28 218 -92 11 40 -29 115 -130 -96
6937 -96 51 -184 -347 -165 -126 -161 -14 -75 -167 -58 1 279 -245 130 172 -204 33 -46 191 292 41 -234 69
6960 69 -69 58 26 45 -189 154 -8 20 -85 131 163 44 -96 -34 -36 11 -8 117 203 18 -175 31 -31 64
6984 64 -150 -81 42 -22 -20 4 -12 25 -37 -11 339 -110 -230 -129 11 68 -35 -40 20 -76 -9 -452 -35 79 -194
7009 -194 64 -70 128 34 4 -245 -18 59 104 199 40 9 -80 39 -224 -165 -32 -282 322 -34 50 -101 110
7032 110 -188 111 -65 -42 196 -141 59 99 -109 -475 110 -71 2 -16 -147 -102 -169 -178 111 -101 -30 80 -273
7055 -273 63 -94 -58 150 59 -330 -29 -31 -34 60 -121 -177 15 -74 137 160 -153 -92 -191 8 -70 -42 108 39 168
7080 168 -52 -35 3 58 66 97 -110 -102 -94 182 145 113 -28 -88 4 99 18 -84 0 80 80 -41 78 -78 69 60 -113
7107 -113 30 -91 -21 50 26 -184 222 16 170 27 34 71 109 -83 -17 -74 179 -54 -83 13 92 -160 21 7
7131 7 75 1 65 -87 -234 27 -196 46 -18 32 -87 120 18 -41 -243 11 -211 94 226 -58 42 -36 1
7154 1 104 129 104 -119 304 -26 -81 -95 -84 -56 57 -202 -117 0 0 -7 -28 57 -25 -144 31 169 75 7 -18 -26 -35 -202
7182 -202 -57 153 -82 180 21 -253 276 46 -34 -97 -70 -126 3 -250 -157 -299 -70 31 268 -44 122 11
7204 11 139 117 -178 -29 -25 -17 0 -14 -299 30 20 -5 -162 -74 204 79 3 183 -106 -28 133 21 316 58
7228 58 57 -1 70 22 -194 -140 81 -15 -83 196 63 93 46 -64 -39 37 182 110 30 -116 -186 -409 -77 -39 37 161
7254 161 50 -214 252 47 28 69 98 -166 -3 135 -7 57 76 271 -135 27 57 113 47 -29 -167 -41 143
7277 143 -251 192 -52 -139 165 -19 89 -2 -224 238 118 129 117 -190 118 -95 -48 213 -50 44 89 -77
7299 -77 -53 -34 -117 6 35 -154 122 50 -98 -18 -47 -161 30 14 -48 6 -72 147 223 147 -277 73 141 -123 -96
7324 -96 -151 198 5 -180 -71 -115 314 -28 -69 -134 -115 -22 53 -12 -122 39 -14 55 -294 19 31 -24 -121 232 -95
7349 -95 -89 -10 108 209 11 -11 179 -20 105 -151 91 141 98 -150 -29 95 -28 -1 70 124 66 -67 -72 -171 -30
7374 -30 -34 96 95 -18 130 -48 -12 -88 141 -1 -47 -44 -68 226 13 -38 5 -151 -21 -37 92 95 9 240 -109 2
7400 2 -13 -174 -57 109 173 156 -122 14 -123 53 -55 38 63 33 20 18 -248 14 -110 -83 -30 0 -36 13 95 -131
7426 -131 121 -177 -97 -242 149 -59 131 -105 94 -191 83 161 86 3 151 45 123 -29 -238 238 226 -26
7448 -26 127 -15 -27 -68 17 -49 25 -82 -61 95 180 -149 -94 -329 -429 -46 6 -40 132 -18 103 -149 -117 -49
7472 -49 37 120 -13 -89 -379 14 -183 -83 44 -18 128 98 26 -133 -19 -86 -131 33 -128 -92 -83 125 -20 103
7496 103 139 -21 21 45 -183 220 -65 -29 41 -168 20 -10 -38 -45 -29 77 -27 157 8 -43 -60 51 52 115 -134
7521 -134 42 59 -87 -151 42 14 234 36 -82 152 152 -101 261 71 153 24 -27 -28 -151 -85 -202 45 -33 -179
7545 -179 42 61 -88 -84 -90 -20 86 -147 12 -187 46 197 -86 5 79 -104 1 -375 -41 75 -130 14 -51
7568 -51 -146 105 -104 74 -251 -144 -20 -115 45 -94 90 -32 28 -166 293 24 254 117 2 -197 8
7589 8 -32 -73 -48 4 -69 -65 97 -107 25 133 -127 -162 113 -128 -14 -185 125 -5 13 -20 47 -156 143 43
7613 43 -101 -59 -46 133 -57 149 -259 -237 290 -10 132 204 -180 126 22 -302 -37 13 -87 171 -16 -1
7635 -1 -96 16 -111 113 32 -120 103 -72 201 -120 -1 26 -74 -84 27 -60 -385 -35 -54 70 -246 28 72
7658 72 -176 -183 196 -3 -85 -127 8 94 377 -70 -396 60 31 -17 -9 42 -150 211 -91 65 -26 20 220 194 31
7683 31 -12 5 -88 38 199 -133 30 -12 62 -83 -11 32 190 68 75 85 39 -42 75 -43 140 -194 -135 -157 57
7708 57 256 -90 -152 -106 -113 -11 -78 104 82 -227 -44 -4 60 258 121 -91 114 -95 -76 -93 -4 -43 -175 -121 85
7733 85 -155 107 84 2 -142 -105 -145 136 -90 -26 -9 131 -21 -92 104 -189 106 136 -149 -45 81 71 -134
7756 -134 -143 -61 134 123 -4 53 -15 10 -157 -1 -47 14 100 160 -77 3 115 -50 -157 -87 64 24 -90 185 -113
7781 -113 -125 -17 84 -252 51 -145 268 -37 -30 -45 118 -70 -130 -250 244 95 117 175 -96 73 -18 -116 48
7804 48 23 -141 7 4 18 108 71 -75 -27 -199 89 156 -17 80 -257 -23 -53 -29 -191 160 -161 -117 -110 -25 6 338
7830 338 95 155 -218 -8 -323 -277 28 -78 118 -229 -173 -192 206 -116 -32 -46 9 192 -28 -112 -127 199 -175
7853 -175 -171 153 -22 38 -72 113 -104 164 59 126 -14 160 -125 -75 26 -105 65 -7 140 -107 -224 240
7875 240 -6 -186 -308 100 74 -379 -24 59 69 69 -20 37 129 -88 -107 -33 -373 -195 -140 23 -81 109 10 -100
7899 -100 117 -115 -51 57 46 -42 -68 -41 80 19 -12 214 -114 57 65 -174 317 13 83 -117 61 161 -103
7922 -103 -413 -157 -201 34 -22 -63 -21 -139 -6 -108 85 -368 133 -172 317 -153 59 -109 -122 35 39 -69
7944 -69 -112 83 46 -20 177 -55 -76 12 -47 -104 108 -8 -135 213 -90 84 -25 170 -127 -71 5 160 -116
7967 -116 175 142 -93 149 -182 91 72 -33 -165 437 -146 54 66 26 185 31 -170 -35 73 -131 -92 24
7989 24 105 144 -37 60 355 91 -50 74 -115 71 -127 181 -26 -105 -194 69 105 188 161 -3 202 99 -44
8012 -44 135 8 53 52 215 65 44 -69 -482 -206 150 213 102 91 181 -116 -32 126 -137 -43 -129 184 5 -156
8036 -156 50 118 91 -102 152 179 -129 286 58 -128 -77 -41 52 -112 181 -52 -3 116 -161 -21 159 -37
8058 -37 47 225 161 14 68 132 -94 -125 181 187 27 79 78 95 -51 217 -135 -30 -75 -11 25 69 62 -27 -17 -209 -119
8085 -119 51 86 4 -94 -19 67 109 -45 136 -11 71 29 -61 -64 51 -18 87 178 40 169 -45 -35 -19 75 161 -92
8111 -92 -27 -97 6 235 76 0 65 -193 -224 -110 11 22 -139 -53 -9 -128 -89 148 55 44 62 116 -193 -111 -189
8136 -189 -23 -77 11 -268 32 -1 80 -8 160 -56 124 -205 90 93 94 -129 47 219 -180 0 24 177 232 -65
8160 -65 -10 74 137 36 50 7 -100 78 76 172 -13 12 74 -94 179 146 -46 249 97 86 -222 232 -34 -45 -16
8185 -16 199 97 -331 24 22 -60
8191f0
$$ Imaginary data points
##PAGE= N=2
##DATA TABLE= (X++(I..I)), XYDATA
0 0 0 0 0 0 0 0 0 0 0 0 0 -8 8 -8 8 -8 16 -16 18 -24 32 -33 40 -48 56 -64 76 -88 100 -114 130 -148 169 -189
34 -189 214 -240 269 -301 334 -373 414 -460 509 -564 621 -689 757 -836 917 -1012 1115 -1227
52 -1227 1356 -1497 1658 -1840 2047 -2288 2571 -2911 3324 -3839 4504 -5401 6665 -8587 11833
67 11833 -18309 36028 -181458 -510511 148927 327615 -119570 -174180 69156 -7994 -7634
78 -7634 131623 -11941 -141341 107133 166202 -98566 -108371 111786 89127 -46018 -75285
89 -75285 -59459 23675 109246 -30058 -163538 -7839 114010 -13326 -47645 36086 -21070
100 -21070 -50405 70879 51420 -68450 -16755 38083 -39682 -5687 77689 -29630 -87797
111 -87797 62200 74607 -69769 -19218 104905 17915 -78457 785 64246 23898 -16515
122 -16515 -41856 -39330 18098 38371 -17377 -50366 -37348 -1445 52113 22496 -79389 -33749
134 -33749 97266 25519 -101221 10536 114800 -27607 -98738 43428 74405 -31153 -24206
145 -24206 19734 -15555 7309 58744 -10517 -56647 30617 52039 -32697 -27062 35899 5037
157 5037 -41270 -17364 7457 8969 1452 -36278 -44283 24148 50160 -20249 -50039 9077 40973
170 40973 12840 -12957 -12532 14626 34757 -3992 -36435 15757 52568 -10183 -49339 9214
182 9214 44086 3464 -21963 -10190 497 13337 12408 -17654 -24964 5137 9931 -14428 -16297
195 -16297 573 2269 -9251 -15800 -2336 22393 11778 -26308 -13283 36303 26196 -18662
207 -18662 -8716 20984 11457 -1301 5208 27 -2782 11294 1592 -19221 2636 22516 -9030
220 -9030 -28434 1164 15381 -4902 -12724 -7285 -7662 -560 5731 -8036 -12889 3050 4859 -4681
234 -4681 1714 8287 407 -289 8809 8654 4629 4936 2313 2742 10015 3527 -7696 2414 11798 -5117
250 -5117 -15467 1550 9604 -5750 -14045 -6933 -855 2442 -714 -12881 -12214 5880 8680 -8250
264 -8250 -11046 4867 10440 428 -5165 1584 10498 10630 194 -4183 7258 13721 2967 -3661
278 -3661 864 3933 2853 56 -5541 -5760 1990 817 -10354 -8298 3178 -1822 -10468 -4157 839
293 839 -4400 -3606 1943 -1388 -3081 3686 4138 -746 3186 6910 1611 2240 8218 5311 414 3233
309 3233 4801 2073 1110 730 -1991 -498 189 -4891 -5286 59 -3291 -8507 -3909 -842 -4887 -3632
325 -3632 -217 -4386 -4419 3806 3133 -3634 646 6736 1637 318 6996 5479 187 3966 6947 1086
341 1086 1038 5641 2476 -2529 -2 759 -2226 -1723 -1909 -5643 -4714 -1386 -3488 -5414 -3420 -3390 -3657
358 -3657 -461 -321 -3499 -89 3750 713 -234 4469 4810 1570 4024 5168 1750 2526 6562 3460
374 3460 -1871 649 3788 896 -1438 -2392 -3213 -2283 26 -2901 -7367 -5006 -816 -1711 -4737 -4690 -1844
391 -1844 1847 306 -4083 -1821 5350 5458 -568 -967 4199 6803 5034 2195 -284 2021 6810 4865
407 4865 -1911 -2182 2379 2180 -1789 -3874 -3071 -1631 -673 -3973 -7221 -3182 705 -3297 -5583 -2080
423 -2080 -552 -1504 477 1654 -1011 -206 4222 4553 2088 2005 3079 4420 4725 2205 691 2531 3371
440 3371 -494 -812 1458 -698 -3555 -760 -198 -5483 -5470 -126 -476 -5628 -5818 -2419 568 631 -2548
457 -2548 -4265 -190 4457 3148 604 231 642 4336 8926 2693 -5690 2034 13453 4154 -9632
472 -9632 -2699 10752 5236 -8309 -8805 176 5239 226 -9229 -10118 -478 5643 -718 -9289 -8148
487 -8148 666 7437 1758 -9648 -5863 11239 10792 -6518 -7826 9512 13513 -462 -5879 2013
501 2013 8043 6274 29 -5019 -2045 4941 4511 -2697 -7559 -4850 1322 3548 -3257 -10609 -5965
516 -5965 4491 2533 -8393 -7476 3491 4826 -3293 -3992 3394 4359 346 2484 4031 -546 724
531 724 9816 6555 -6621 -4724 11276 9553 -7527 -8501 4531 6301 -4012 -6395 -1554 -480
545 -480 -2827 -3137 -2230 -2905 -3487 -2108 44 -486 -3675 -464 4630 368 -3296 3233 7752 115 -2190
562 -2190 5494 6188 -787 938 6671 1906 -4441 -34 5927 2562 -5421 -7335 35 5822 -1091
577 -1091 -11242 -6584 4630 2570 -7526 -6255 1179 832 -1650 -272 -655 -798 3689 5292 -1856
592 -1856 -2822 7433 10095 -1631 -6673 4709 11594 1985 -7008 -1894 5714 3267 -3444 -3353 -248
607 -248 -1290 -3611 -1870 -986 -3807 -3838 -1130 -1691 -3369 -576 1417 -2228 -2604 2194 3648 1005 1144
624 1144 1902 1768 2749 3571 2488 2136 1651 -127 1232 4519 1290 -4779 -2663 2570 481 -3842 -2741
641 -2741 -1626 -2733 -2716 -1724 -1541 -1749 -3091 -3263 490 2755 -1671 -2222 2782 2815 -397 1896 4876
658 4876 1624 269 3863 2818 182 3313 3841 -2664 -3089 4045 4056 -3620 -6026 -880 2016 -649
674 -649 -5210 -5094 -302 1491 -2646 -5223 -1136 2696 355 -2725 -1730 2351 4373 1829 -1934 -454
690 -454 5563 5499 97 -1419 2223 4497 2833 -837 -1713 1372 2144 -1324 -3320 -1510 -330 -1482
706 -1482 -3295 -3378 -2248 -741 -976 -2670 -2171 -463 11 -67 482 448 287 1642 2602 1413 1321 2554 2783
725 2783 1973 1542 1480 960 1952 1433 -1226 -1610 604 445 -2222 -2886 -2015 -1642 -864 -1803 -3967 -2434 502
744 502 -1071 -2905 -956 1022 268 -461 686 1373 1833 2611 1255 482 3074 3842 1313 89 1540
761 1540 1948 972 493 -790 -746 -70 -755 -2646 -1805 -684 -2161 -2858 -1605 -1791 -2079 -915 -700 -1617
779 -1617 -414 1038 193 139 1433 1341 1068 2414 2472 1442 1424 2061 1674 863 927 652 599 275 -496 -1256
799 -1256 -790 -521 -2057 -2159 -1914 -1715 -1937 -1607 -2093 -1555 -531 -615 -1196 -45 792 401 1067 1520 1187
818 1187 1819 2427 1738 1011 1939 2228 1090 885 1132 406 -160 82 -226 -1641 -1253 -1464 -1912 -1743 -1408
837 -1408 -1915 -2079 -1445 -1167 -1325 -503 -281 -705 20 1453 1025 816 1744 1880 1240 1692 2558 1649 943 1398
857 1398 1139 150 845 847 -642 -1388 -523 -669 -1298 -1461 -1830 -2193 -1492 -989 -1335 -1758 -1226 -749 -195 -51
877 -51 -378 288 1086 800 992 1473 1813 1735 1323 1445 1510 1509 1546 1026 -161 -284 293 455 -879 -1906 -1782
898 -1782 -597 -1211 -2411 -2444 -1515 -901 -1198 -1055 -1206 -568 558 389 -514 264 2038 2121 712 666 1548
917 1548 2656 2408 992 127 945 2376 567 -900 -171 641 -493 -1499 -1343 -1034 -1321 -1346 -1464 -2679
935 -2679 -1765 -473 -694 -1542 -1747 -484 1277 997 -267 172 1666 2015 996 1339 2325 1543 908 1749
953 1749 1229 242 813 1203 27 -1338 -742 347 -481 -2090 -2160 -1205 -230 -1536 -2242 -1416 -744 -1035 -638
972 -638 321 108 -666 242 1759 1492 603 1139 1866 1412 1025 1516 2393 1080 -40 558 954 -416 -462
991 -462 245 -217 -2498 -1711 315 -379 -2928 -2918 -316 467 -1540 -2434 -578 765 11 -927 280 1563
1009 1563 1126 541 1523 1022 1233 2391 2304 -131 -178 2437 2149 -423 -1539 434 724 -880 -1570 -1075
1027 -1075 -530 -1015 -2229 -1611 -849 -1185 -1874 -888 -34 -992 -910 1084 1379 -727 -22 2240 1936 469
1045 469 890 1369 1347 1493 1198 581 401 681 432 -49 -715 -1115 -563 -183 -1531 -2882 -1024 631 -2077
1064 -2077 -3075 -594 989 -1114 -1621 -71 419 261 302 901 1048 1156 1225 965 1458 1895 1040 446 1051
1083 1051 777 744 682 -482 -693 -29 51 -1569 -1990 -499 -291 -2037 -2451 -118 209 -1238 -2329 -1037
1101 -1037 1008 550 -740 -227 1380 1682 732 485 1468 1875 1491 615 550 1086 1367 249 -302 -294 265
1120 265 208 -894 -1698 -986 -274 -1021 -2456 -1270 -209 -1184 -1555 -776 -81 -274 -433 -236 657 1462 760
1139 760 288 983 1856 1315 285 1432 1927 968 -68 446 646 547 -64 -868 -692 -173 -262 -1370 -1833
1158 -1833 -998 -93 -1813 -1974 -442 -47 -551 -1164 -707 580 1093 399 -89 729 2061 1108 709 1120
1176 1120 1604 1324 835 552 677 825 166 -884 -1005 347 -26 -1587 -1615 -382 -644 -1724 -1327 -657
1194 -657 -573 -642 -488 -952 108 864 -123 -523 954 1866 489 209 1143 1736 1414 631 953 752 886 216
1214 216 -642 463 343 -569 -1374 -1248 -525 -734 -1376 -1721 -1102 -781 -659 -1469 -825 260 82 -925 -224
1233 -224 777 1141 383 549 1260 1248 1489 1005 474 1049 1054 492 160 223 394 -399 -1114 -964 -104 -286 -1376
1254 -1376 -1443 -789 -509 -952 -770 -618 -192 -374 -394 117 552 529 280 287 1120 1436 1130 691 974 1261 907
1275 907 1035 513 336 214 144 -539 -53 141 -628 -1359 -1031 -227 -778 -1182 -1206 -1150 -437 -296 -715 -721 263 161
1297 161 38 200 976 772 367 576 919 1298 1194 981 484 549 903 609 -282 -97 -46 -514 -842 -460 -777
1318 -777 -901 -732 -1245 -991 -404 -616 -1184 -727 41 -25 -160 428 694 451 687 774 973 913 901 565 838
1339 838 1203 746 441 -10 -37 15 -12 -260 -440 -300 -524 -897 -840 -565 -802 -1091 -810 -563 -440 -357 -13 149
1361 149 37 453 722 538 729 1044 766 630 711 1058 828 512 122 307 553 74 -139 -308 -415 -759
1381 -759 -502 -613 -903 -908 -768 -858 -875 -512 -356 -691 -474 209 175 184 451 675 541 791 984 1054 779 829 395
1404 395 432 746 672 -24 -2 -91 -354 -125 -453 -718 -920 -820 -764 -755 -802 -970 -777 -368 -63 -414 123 208 328
1427 328 267 617 904 905 511 738 921 476 927 891 506 29 254 353 -135 -469 -200 -440 -792 -598 -454 -670
1449 -670 -934 -806 -837 -436 -431 -335 -335 -295 194 152 467 766 532 484 854 773 651 549 901 720 265 597 533 116
1473 116 -140 -407 -196 -460 -649 -799 -831 -812 -834 -915 -688 -342 -884 -478 -141 5 -379 219 269 285 390 811
1495 811 1022 627 192 715 703 516 699 491 239 -165 1 54 -199 -210 -581 -566 -742 -714 -730 -663 -694 -892 -328
1518 -328 -230 -328 -337 -188 296 137 332 570 775 415 561 949 781 408 530 491 183 495 416 -72 -43 -176
1540 -176 -367 -413 -485 -364 -955 -706 -452 -718 -833 -290 -414 -484 -171 254 167 295 360 628 566 728 648 721 485
1563 485 393 563 730 716 -20 83 177 -97 -381 -246 -344 -551 -1189 -539 -462 -426 -354 -634 -587 -533 -213 143 -395
1586 -395 -50 252 440 152 480 856 595 614 518 641 746 406 -66 154 403 267 -594 -279 -81 -233 -531
1607 -531 -844 -431 -552 -768 -800 -632 -379 -285 -246 -291 -41 305 310 113 194 599 479 399 478 552 1056 532 274
1630 274 128 578 356 -326 -217 -54 28 -578 -514 -521 -649 -580 -642 -625 -643 -175 -484 -683 -20 504 86 -145 272
1653 272 608 297 563 625 721 775 504 375 672 788 416 -30 -84 -33 60 -319 -619 -428 -303 -401 -924 -679
1675 -679 -421 -380 -390 -489 -401 -161 -220 -180 -33 537 447 323 237 704 957 643 352 624 936 411 -223 212 373
1698 373 274 -530 -332 -302 -369 -308 -628 -943 -456 -618 -815 -746 -150 -120 -371 -440 -10 317 528 243 134 598
1720 598 746 482 258 406 689 361 212 437 250 402 -41 -271 -206 176 -221 -537 -824 -254 -502 -455 -654
1741 -654 -334 -304 -494 -268 -2 193 179 -153 102 525 698 259 391 578 794 587 235 534 169 355 32
1762 32 -60 -234 139 -206 -471 -368 -219 -682 -744 -706 -566 -503 -416 -338 -179 -83 -108 -86 -90 310 313 441 560 637 809
1787 809 266 385 350 549 627 216 46 143 66 -192 -179 -180 -198 -559 -541 -655 -717 -371 -567 -317 -294 -239 -255 -120
1811 -120 190 201 283 199 383 590 915 192 224 549 709 326 274 313 340 -58 25 -69 -333 -180 -396 -454 -378 -472
1835 -472 -366 -601 -253 -403 -384 0 -193 -370 145 182 275 368 465 206 267 373 610 469 580 274 235 238 333
1858 333 83 -216 -269 -264 -223 -378 -178 10 -373 -531 -314 -316 -273 -364 -123 -422 199 55 -124 54 414 351 248
1881 248 370 234 374 385 500 285 358 48 71 90 8 -262 -140 -169 -414 -473 -462 -235 -358 -407 -371 -404 -623 -350
1905 -350 -62 -246 3 19 191 113 218 366 308 334 332 525 588 320 242 252 89 201 19 45 -106 -237 -457
1928 -457 -218 -352 -378 -315 -712 -390 -198 -140 -185 -198 -301 -144 196 160 245 30 427 382 328 701 548 387 649
1951 649 270 80 98 23 -16 -96 111 -355 -247 -71 -255 -659 -597 -437 -375 -410 -503 -336 -242 -142 88 167 -267
1974 -267 348 308 362 420 400 433 527 208 286 294 48 343 130 82 90 -147 -49 -247 -363 -309 -205 -241 -360 -638 -198
1999 -198 -383 2 -177 -23 -177 42 -22 296 177 106 324 426 441 515 437 126 112 208 -181 144 164 -181 167
2022 167 -458 -461 -343 -168 -235 -497 -531 -356 -295 -263 -275 -308 -93 30 -96 148 237 251 236 173 287 549 454 298
2046 298 459 426 186 90 91 75 -161 -82 -314 -92 -290 -404 -360 -546 -397 -279 -244 -357 -391 -276 -129 11 144
2069 144 -2 390 -5 221 667 386 407 450 215 462 325 241 103 421 282 126 -170 -353 -36 -298 -387
2090 -387 -291 -165 -428 -396 -501 -294 -495 -277 84 103 62 26 26 56 187 144 284 406 526 459 133 105 468 319
2114 319 191 238 -73 -177 -58 -277 -349 -187 -193 -425 -421 -312 -190 -339 -447 -48 -153 79 58 5 -116 297 37
2137 37 -78 228 398 303 365 151 251 202 219 266 27 122 76 -189 -53 -158 -230 -281 -265 -168 -78 -204 -401 -167
2161 -167 142 106 -177 -54 -167 309 380 97 171 484 213 128 422 430 181 100 158 -16 228 234 -127 -285 104
2184 104 122 -258 -39 -314 -192 -392 -257 -428 -225 -109 -146 -464 -35 67 78 155 169 401 295 172 80 319
2206 319 254 281 281 473 261 166 -8 163 206 -61 -319 -220 -40 -225 -250 -257 -471 -285 -196 -390 -145 84 -94 -217
2230 -217 -42 122 108 286 -6 299 393 381 22 109 189 452 91 17 216 226 241 -251 -227 -312 -240 -466 -169 -312
2254 -312 -91 -20 -388 -646 -128 -195 24 -169 110 33 33 347 333 422 290 56 123 56 432 125 146 73 48 -147
2278 -147 -92 -371 -360 -290 -302 -469 -166 -181 -204 -217 -259 -22 -188 -81 142 -93 49 102 -171 303 384 314 -12 226
2302 226 303 554 222 -8 -15 159 275 125 97 -22 -245 -297 -125 -246 -124 -152 -225 -353 -88 -112 -279 -311 94
2325 94 -77 28 87 420 311 301 197 128 466 318 344 294 26 180 -31 86 200 15 -227 8 -157 49
2347 49 -85 -126 -217 -80 -254 -171 -269 -246 -269 -169 40 117 -33 -45 -17 114 360 352 156 170 214 243 368 261 108
2372 108 57 149 253 -52 -308 -176 -534 -202 -119 -94 -4 -305 -470 -109 -97 -184 -120 -10 -110 70 157 276 228
2395 228 252 309 150 291 315 -57 190 158 57 178 106 178 -456 -20 22 -138 -219 -421 -238 137 108 -139 14
2418 14 2 -63 -59 -36 149 50 -232 -135 321 371 200 128 281 147 213 120 374 77 -320 -20 115 -237 130 -126
2442 -126 -179 -244 -209 -234 -73 43 -168 54 -203 46 -198 -110 -74 1 -200 188 71 58 150 259 93 69 66 486
2466 486 218 -78 73 -210 198 -76 -245 -145 -17 -170 -308 -211 -372 -222 -112 -80 47 -113 -51 -29 42 -38
2488 -38 156 -47 104 -84 96 273 223 207 307 299 71 230 92 146 175 -55 -126 -246 -105 -112 -214 -179 -160 16
2512 16 -7 -258 -17 14 -310 128 -185 -109 -15 200 62 -79 158 309 116 92 361 186 272 76 80 -2 -82 153
2536 153 92 94 -181 -192 -122 -111 -281 -300 -250 -185 -232 -224 -15 -84 -1 89 122 -283 177 54 111 -31 206 185 254 255 140
2563 140 138 60 -15 -32 167 -53 36 -126 -4 102 -264 -387 -299 -166 -221 2 -170 -244 63 -133 86 -47 48
2586 48 248 -93 261 334 171 186 186 19 157 57 334 91 197 -55 -6 -299 -145 -114 -395 -63 -72 -136 -237
2609 -237 -206 -409 -304 -149 -74 -98 -27 150 -45 -87 -137 131 477 225 75 135 242 248 122 119 -116 -72 -104 -88 95
2634 95 -103 -303 -314 -45 -185 -114 -504 -40 -215 -107 1 -124 -83 -3 57 15 47 34 3 80 43 -97 86 -44
2658 -44 -225 -127 139 119 208 14 -120 90 65 -294 -239 -38 -144 -161 -166 -244 55 -78 -261 -153 -26 132 20
2681 20 138 283 -19 -89 148 120 -109 -52 -136 116 110 8 166 247 140 98 -133 -152 -156 -135 -6 -9 -79 -170 -214 51
2707 51 -60 -249 -51 -309 -136 159 -110 -55 265 205 -46 211 -26 59 152 94 1 19 -67 198 105 63 -3 80
2731 80 18 11 20 -122 -254 -330 -66 -54 101 -84 -78 -207 -225 14 -23 139 135 67 380 175 38 291 44 63 210
2756 210 96 23 -78 87 140 52 14 181 45 -24 14 -161 17 -99 -76 -188 -151 -206 -197 -171 -144 -13 177 32
2780 32 251 94 62 275 107 345 152 -5 60 -179 -15 128 -256 73 -6 -162 -243 62 72 -287 -165 89
2802 89 -183 112 -20 124 162 47 -140 -81 303 20 149 108 44 80 126 16 138 -136 231 286 -58 112 157
2825 157 32 140 24 -90 -201 -174 -453 -121 -175 -36 64 -211 7 101 196 -4 -52 198 98 63 121 152 -141
2848 -141 -147 122 -22 115 148 138 58 82 -64 225 -64 -81 252 -29 -208 82 -57 -209 -253 -86 -183 -123 54
2871 54 -21 -193 -85 38 45 129 88 71 112 56 281 -27 607 37 131 120 -105 -4 -50 -92 56 -352 -193 -186 -307
2896 -307 -218 -253 -201 63 177 -344 -95 32 133 -113 324 74 248 360 187 111 282 65 148 139 26 243
2918 243 -155 239 20 -85 -121 54 -23 230 -26 -142 63 -298 63 -185 -192 -96 195 126 -32 -90 -279 -91
2940 -91 333 21 199 -73 103 249 -2 -105 92 24 9 46 78 178 -255 63 -106 179 -137 -226 27 -109
2962 -109 -71 -150 97 81 65 -65 27 90 125 143 132 -120 347 246 -98 -100 141 -102 -68 133 91 110 -1 -112 -187
2987 -187 57 -85 -176 -103 -155 -49 -75 -112 -114 -221 -124 -30 38 65 -77 -133 -62 -91 72 181 0 68 273 103 -36
3012 -36 47 117 154 106 185 -384 -76 40 -3 -149 -225 -199 -139 -35 -62 -201 -285 12 164 80 -177 111 268 114
3036 114 -1 111 33 369 104 136 73 -91 147 -19 381 97 228 18 -90 0 -121 -111 -81 -33 120 -74
3058 -74 -311 103 119 185 -119 101 117 -44 -10 -106 -114 56 -98 164 -140 33 -9 117 139 -90 161 3 -69 70
3082 70 -8 -163 -48 -16 -5 -48 -11 -225 -130 48 -154 -56 161 30 -258 -40 175 -260 -34 -129 222 17 97
3105 97 120 203 66 25 -81 141 -187 207 275 90 -207 -53 -3 -70 -88 -166 -97 -101 110 -185 35 4 -310 83
3129 83 -13 30 93 -54 -1 -30 111 -62 -183 59 -30 145 -13 237 44 -49 -34 159 -116 -45 -215 155 -376
3152 -376 -65 -14 -131 111 -28 -30 -107 -254 -242 9 -77 75 -97 75 133 25 195 -36 -59 -86 102 16 131
3175 131 152 7 -151 -312 86 14 -78 195 -24 -39 -42 2 90 -251 239 -347 -12 -23 -218 -136 98 -24 -190
3198 -190 51 8 -6 -2 62 -39 61 63 -151 -151 39 45 73 -121 -107 -8 5 -85 222 -22 -140 347 -152 228 -50
3223 -50 -146 -227 -130 118 -118 50 125 -11 98 136 90 -82 -65 177 125 -256 -98 155 -80 -65 -48 428 -163 -135
3247 -135 -24 51 -126 -30 -131 -185 41 -116 32 67 189 112 -55 140 -14 108 133 112 -93 30 149 152 -66
3270 -66 -184 -16 214 -31 -145 -148 -48 14 164 100 106 77 21 -119 -159 -79 179 -69 -161 -66 -134 85 12 13 225 -51
3296 -51 -8 136 61 5 53 -37 -63 131 -44 -67 -55 -99 -109 272 218 105 -137 -47 128 61 106 -290 88 -36 50
3321 50 64 -92 -84 -160 -38 19 -83 273 -17 51 -84 1 -44 -166 203 -29 176 -25 -222 -53 -11 -189 120
3344 120 -6 -2 218 71 -17 -96 34 108 56 -153 181 -123 78 202 43 136 10 163 65 2 78 229 -95
3367 -95 -361 132 -43 -92 -160 195 72 86 200 -248 129 -248 -31 -16 77 174 10 135 -225 63 52 189 27
3390 27 36 -126 177 -109 -149 94 27 59 20 139 52 -299 -32 182 36 163 -88 -46 -176 -102 -82 -40 -21 -105 -60
3415 -60 -202 248 129 107 14 122 -44 22 143 -17 103 -271 70 60 -142 -107 -95 -155 186 105 -112 -103 60 113
3439 113 99 -31 -150 264 -111 153 41 -147 -49 44 249 190 -66 -185 -221 -98 -3 206 -12 -141 49 94
3461 94 -1 -14 -6 -95 157 -86 42 176 -28 -207 52 97 164 1 22 39 -130 -87 -127 -100 -10 -58 -158 246 206
3486 206 29 -72 -34 29 -151 -28 -93 -38 55 -78 -188 120 -95 -132 161 0 -20 -134 -102 -109 33 -66 -328 -204
3510 -204 191 -13 17 161 -82 -111 201 4 46 186 -249 117 -4 -21 -128 56 28 92 133 152 68 106 -50
3533 -50 173 -96 -294 20 -61 -135 42 -58 169 -219 24 -29 -173 -189 -53 183 -312 -72 -154 179 -190 -58
3555 -58 69 127 -48 1 231 126 -14 236 245 134 120 95 -96 43 -72 -15 -114 -224 -99 -21 73 176 -85 -187
3579 -187 -12 282 153 -13 221 84 4 123 153 158 71 60 61 -67 -73 -40 -227 -73 166 88 10 -57 -206 -140 -92
3604 -92 -120 -236 29 -36 -55 -218 183 -94 -200 18 121 -213 140 47 -65 -2 -20 -85 -166 -5 -18 -97 -174 224
3628 224 113 -20 98 -79 54 -150 -5 -4 -21 31 10 127 -78 -57 -232 -55 94 64 -54 -9 95 57 -21
3651 -21 -15 2 54 -176 93 45 67 -85 125 11 21 -83 -317 50 -2 -283 -183 -87 -263 17 160 -206 42
3674 42 -83 -93 46 10 -23 -35 110 -8 -170 198 -4 4 84 -132 100 -21 15 -31 195 119 -228 60 -169 -241
3698 -241 74 -120 -115 28 25 50 -25 124 32 -69 39 55 13 -142 -48 103 139 -151 90 -201 31 244 -51 -103
3722 -103 203 13 17 39 -197 -37 -128 -102 -71 1 -69 -38 274 -13 56 32 129 307 -277 130 68 2 -186 29 -18
3747 -18 -145 146 81 -129 89 -82 57 247 -208 4 115 -56 -269 -261 87 95 210 37 27 57 94 86 44 -16
3771 -16 85 123 -103 52 -295 80 12 -152 -30 -102 113 140 -80 -262 -185 37 141 -70 62 101 -19 166
3793 166 192 78 74 110 -73 176 -44 -64 52 -55 72 -108 99 -44 31 132 81 65 125 -39 -82 -123 -84 -55
3817 -55 31 -102 130 -57 -93 64 -56 156 -197 181 169 106 227 -83 4 -15 127 -37 -180 -84 -64 -72 -30 57
3841 57 -186 -158 129 185 140 11 -81 60 -76 -67 -33 -89 0 183 -105 89 115 -304 -140 142 -285 -22 -191 39
3865 39 -153 119 4 -58 23 -8 11 19 -8 -165 85 49 271 -88 141 90 -102 255 -91 7 -50 -89 -81 -265 17
3890 17 -61 -184 6 152 238 192 -59 -143 88 79 8 -86 -180 87 145 -92 71 -130 82 -95 91 -250 1 -59
3914 -59 199 48 -195 -144 16 103 -46 -80 -190 3 40 68 215 144 364 23 2 -142 -70 130 123 65 -116 -5
3938 -5 -130 -13 -30 94 -116 -107 99 -54 98 161 -21 -252 64 -6 -203 -46 155 -60 -38 28 -15 -157 231
3961 231 -24 105 -83 -221 224 -2 1 11 162 45 68 164 -71 -129 94 -60 -89 -68 232 25 -291 33 48
3984 48 -70 -117 -59 -182 81 -105 -102 176 -145 -64 101 91 151 308 58 92 87 -83 -42 250 43 111 67 174 -175
4009 -175 100 4 83 -62 -111 20 10 2 -65 7 -68 -88 -74 72 -76 161 -148 -244 -60 151 -326 231 -137 -130 24
4034 24 205 112 71 -123 176 58 67 -18 145 -77 222 81 -15 -214 140 -120 299 -88 -85 21 141 139 -102 136
4058 136 -183 321 145 37 -34 -22 -243 134 0 -198 -17 -53 -90 -9 -117 4 45 -257 131 76 31 86 111
4081 111 1 37 -82 -67 -157 -1 5 -53 111 235 -31 214 93 58 -66 218 -10 -302 36 -61 -196 214 139
4104 139 -155 -214 -134 220 -116 171 -1 19 120 42 -257 -13 7 -180 13 23 52 -97 -81 -52 5 35 259 -67
4128 -67 136 81 12 304 267 29 -154 -113 -120 -138 -105 115 -129 14 -57 -243 -56 -31 46 224 -90 -71 59 236
4152 236 -166 -159 222 16 44 -90 -56 -38 -56 225 197 -50 -53 -6 137 -187 -272 223 201 130 -107 7 140 -78
4176 -78 180 84 -324 14 -33 -185 -22 -148 26 156 104 -93 312 88 126 65 43 -39 -23 -82 104 -72 153
4199 153 147 -54 -57 223 71 363 74 224 87 -128 -159 -4 -107 -81 249 -312 -28 -65 2 -135 -271 -13 56
4222 56 97 158 90 -191 119 65 19 -30 41 -293 266 175 -53 -292 22 -94 38 52 -172 26 -242 -264 -72 109
4246 109 13 263 -29 131 -282 -118 -24 -31 -33 -171 21 230 5 -98 156 5 -19 -55 -34 -81 84 132 -137 -136
4270 -136 -9 -69 -162 -109 32 -32 -58 254 -64 -2 111 -108 12 74 158 -105 -41 -103 18 -56 84 116 338 143
4294 143 -87 67 78 -58 202 -235 3 -107 -80 -119 88 -43 51 47 -166 -25 330 123 98 -231 237 70
4316 70 114 151 -148 277 117 97 104 363 -41 31 -61 15 -256 -24 -77 -90 -97 -40 55 42 -60 122 -162 -55 -185
4341 -185 91 -1 160 -198 132 248 67 -67 73 1 -25 115 -163 123 239 28 -49 0 -27 -38 68 -45
4363 -45 38 327 -79 -13 49 94 -66 19 -156 -47 20 24 80 -227 -103 167 -63 -189 -36 62 64 33 130 163 90 9
4389 9 -132 -49 11 -105 48 -77 -217 38 -110 -194 -286 72 -65 138 138 -29 -64 78 84 157 -190 -17 -120 9
4413 9 -57 -123 -70 -82 -246 6 145 121 -107 -76 -206 51 -1 30 260 -240 192 115 -49 111 81 35 -79 197
4437 197 -116 -83 11 -28 -5 -32 -93 39 -10 223 128 -116 -86 -391 -37 52 -73 7 -2 180 61 -130 -163 0 81
4462 81 -13 -5 -103 164 -151 -136 -52 82 156 143 145 144 -49 188 25 39 249 -162 233 25 -200 104 153 -369 -44
4487 -44 163 -169 -2 -402 -108 -86 258 82 -58 -271 -124 76 -201 4 -99 15 -72 21 95 7 -199 60
4509 60 128 98 98 36 73 57 9 59 -85 178 72 -9 -14 197 86 267 -26 136 -80 -315 -44 53 -109 -97 -70
4534 -70 135 152 -65 -89 46 -48 34 -4 -86 82 148 -229 -125 -6 -51 110 -93 84 -39 -82 278 -178 -190 399
4558 399 -31 -76 77 88 -158 42 -10 93 -17 -86 148 58 74 -5 -134 91 112 100 -77 -127 -139 93 44 -69
4582 -69 207 -100 72 253 -30 6 31 350 143 145 -355 -150 -253 52 -123 -42 -15 -117 166 161 201 73 -70
4605 -70 125 -106 -55 -205 63 -5 -415 238 -103 -8 158 116 205 -98 -350 85 -181 178 -72 -110 81 48 139
4628 139 173 -25 118 236 61 128 -73 -93 190 19 195 -9 91 220 0 309 91 246 -48 141 -198
4649 -198 105 -153 58 188 7 -130 148 -48 -207 37 -142 -66 -181 279 -27 -5 231 -83 13 50 99 171
4671 171 -363 -32 -43 39 148 94 24 285 126 240 -113 -94 -281 45 -58 -127 84 90 -144 -14 -58 -23 -179
4694 -179 -43 1 -21 335 -146 37 -392 98 12 -59 -203 81 -229 5 -19 78 16 198 -204 -24 -87 -19 -65
4717 -65 -293 -87 -96 99 -112 -384 -132 -41 174 -224 -98 -33 61 -71 -122 295 -115 104 -120 100 34 -82 279
4740 279 -41 -67 -106 -54 -70 -60 19 -370 12 17 -65 6 -3 133 42 -74 -93 -115 -389 -133 241 -153 -157 120 -131 -117
4766 -117 138 77 56 -12 72 34 -49 -193 -53 -44 -106 93 67 -32 62 -85 -232 -162 18 81 -262 -323 37 136 -86
4791 -86 116 -205 252 128 296 2 178 153 -30 136 161 -96 17 -37 32 92 142 8 55 -48 65 60 -11 222
4815 222 -176 119 -158 141 46 -256 108 -207 -73 -155 -207 -48 -36 84 133 150 -120 -150 -87 53 78 36 38 -107
4839 -107 71 -91 -101 317 -68 19 -139 -98 141 73 -105 50 -157 -181 25 -230 78 157 164 -138 -56 33 -117
4862 -117 279 -191 -207 -112 -46 -42 -75 -49 -27 -41 137 54 84 111 -359 14 -36 -124 182 -83 57 14 280 -229 57
4887 57 -118 -29 42 46 33 -168 115 -46 -178 -213 -90 39 58 41 136 57 -56 -130 41 273 33 77 -44 -1 -143
4912 -143 43 1 73 -9 180 121 -80 3 131 -176 -120 314 90 -64 -110 -39 302 -76 110 -145 149 -222 -88
4935 -88 139 -53 161 199 28 291 -13 70 148 61 27 141 -129 -146 39 -146 26 -137 59 122 -109 -154 -15
4958 -15 0 -54 -20 -113 20 101 8 18 -216 63 143 0 230 -187 443 -5 101 192 -284 97 -104 124 77 204
4982 204 62 33 18 66 195 -247 94 43 113 -39 133 78 -130 198 28 58 113 94 101 -151 -137 67 107 -153
5006 -153 -501 322 49 72 -217 21 269 -166 -218 -62 85 -123 92 -90 120 -4 -110 -304 151 111 -62
5027 -62 181 167 2 220 -34 -86 -71 196 -286 -88 -175 -45 -143 -62 -44 40 -165 61 12 -195 -203 86 33 -122
5051 -122 131 87 164 37 -94 214 -129 303 -15 16 -38 -51 81 123 182 40 -122 162 126 -50 -60 -41 -160
5074 -160 -6 124 90 -126 41 51 -5 13 3 7 -41 193 -82 -23 -96 19 45 -13 9 8 -32 195 -40 -266 160
5099 160 6 -24 -31 -111 -70 250 170 25 -59 -5 -139 30 58 5 199 -57 -113 -83 -60 -69 171 -273 -124 -143 -111 -4
5125 -4 74 -112 -113 -46 -11 208 -66 138 293 42 -61 117 -100 41 134 116 -35 276 -235 62 91 103 -155 15
5149 15 105 -97 99 -29 -56 46 -120 206 -17 259 -263 -160 44 47 314 -93 14 26 -4 111 -148 -200 -168
5172 -168 17 55 156 -9 -67 -24 -13 -62 -126 43 62 8 -111 -208 163 165 203 65 -134 39 -43 101 87 65 103
5197 103 -104 332 -16 -45 -89 -141 -60 -18 31 51 -92 149 -6 -6 116 -153 -80 10 141 -166 434 84 15 61
5221 61 -120 -24 -2 279 297 -27 -227 -121 -201 -293 -98 -24 -3 -49 125 -63 58 -151 110 106 -196 -2 -94 -85 -312
5246 -312 -78 -2 66 -118 92 41 185 -182 -85 -143 -99 2 104 160 233 -1 -4 21 -371 -347 30 241 114 83
5270 83 -233 -120 271 118 -14 6 -222 -74 -26 202 -105 42 33 75 71 154 70 89 41 43 -60 277 -53 86 -32
5295 -32 96 -44 -103 -111 -306 69 -131 67 -153 25 -130 -13 367 -55 -108 32 -23 102 151 -117 34 -147
5317 -147 239 -101 -40 -156 -129 26 -91 -53 -92 48 -18 242 106 -217 197 -260 -105 47 -34 -99 -239 58
5339 58 -216 6 -149 59 -129 95 152 60 -74 106 133 -42 -9 2 -203 202 -158 -35 -59 -40 165 204 170
5362 170 -177 -54 -32 -213 -125 59 -178 85 -38 -127 -6 -47 11 -54 -113 97 134 40 -66 80 56 52 372 63
5386 63 153 295 2 86 -27 -161 -45 123 -195 -8 -234 -116 -60 202 101 -31 72 253 68 -65 -62 147
5408 147 -126 18 -172 7 -122 -80 -189 29 2 -267 75 -109 -12 -158 -102 -51 31 63 -69 -89 -48 242 113
5431 113 164 178 -15 -123 113 -116 95 143 28 7 146 116 -30 30 -22 -9 1 82 -98 -180 94 212 88 -175
5455 -175 -250 -154 -35 109 -46 176 -108 38 -81 149 -402 -139 -23 -147 -99 -137 -96 -38 -62 -247 32 -125
5477 -125 272 109 348 -123 -234 -253 -257 -54 42 224 223 4 7 -67 129 344 63 -239 -136 170 -158 97 -51
5500 -51 -56 -35 -103 -133 -234 199 -213 -4 -67 -60 182 175 153 58 -82 83 14 -210 85 -11 61 -143 -18 -9 19 -299
5526 -299 -206 -37 -66 216 106 323 137 -29 71 8 34 -89 -123 208 -54 169 -44 -65 -6 -102 119 -141 -84
5549 -84 -20 -112 38 -30 42 -116 56 -37 130 -197 -61 -7 -42 -12 -161 -132 -26 134 -136 157 -41 18 32 13
5573 13 -189 162 -103 -53 220 40 49 -53 -30 153 68 113 103 -136 -106 83 -134 -23 247 -219 1 96 -253
5596 -253 -91 -152 169 110 -10 180 -38 -78 -99 -89 141 63 81 -56 -193 55 22 -154 27 -113 39 -72 -251
5619 -251 166 48 122 166 -145 46 120 37 -167 -9 -97 -203 -58 65 -91 -30 -235 -29 111 163 153 -395 31
5642 31 76 -22 57 -342 132 -128 20 -240 -33 268 58 277 -283 174 -37 139 100 -167 227 10 58 -39
5664 -39 306 88 95 183 -6 -139 152 -267 -20 13 -5 32 141 92 252 63 -1 -51 181 110 142 -46 -121 14
5688 14 84 -89 26 24 -234 -33 -162 -93 -90 -103 -43 -29 29 28 -118 122 -65 109 113 183 -47 29 78 118 24 -129 31
5715 31 301 -81 3 -98 173 160 84 25 -190 62 193 -166 64 316 -222 147 -77 40 99 -29 -71 -21 42
5738 42 -167 -201 -156 -156 -97 -120 32 -262 52 -220 -13 -32 -49 160 -182 21 -5 -96 -57 -13 107 145 161 -16 -264
5763 -264 12 77 58 132 40 118 -6 58 -27 179 140 -242 -46 99 -132 -105 105 69 183 -285 10 286 148
5786 148 -215 33 -34 -63 -128 76 -53 164 221 -124 -78 -115 -212 -6 -159 81 98 70 25 45 130 218 13 1 0
5811 0 -58 46 133 144 -18 156 -76 -260 -3 -127 -60 334 21 71 64 -163 110 84 -68 -44 32 -34 36 21 102
5836 102 198 -66 101 -41 -279 114 -5 150 134 22 -156 -153 -116 -75 -3 74 41 -9 41 22 -88 204 299 106
5860 106 98 -148 18 210 -45 -256 -69 -92 -1 97 25 -30 53 131 -171 17 -194 -276 49 24 -56 -40 117 78 44
5885 44 -77 36 -78 -24 89 -65 -125 -149 -137 19 -168 -33 70 49 333 -36 213 -7 -52 128 0 118
5907 118 108 86 103 -24 15 -58 34 -40 -24 163 -148 151 -65 -93 49 119 -103 62 138 -48 80 40 37 -186 -39
5932 -39 151 48 -14 -57 18 117 9 128 61 120 35 193 -35 -252 81 155 29 -134 -4 135 132 -125 55 8
5956 8 -19 29 -196 -221 -42 -41 160 -340 197 139 20 131 98 154 89 -66 -361 73 -110 4 -289 43 -45 -42 24
5981 24 -134 117 -29 86 -147 -186 -55 47 -6 203 -74 67 87 -148 -19 18 228 20 67 -145 -219 -60
6003 -60 148 216 -20 183 59 60 69 212 -165 165 -100 -65 187 -258 -189 156 273 65 296 159 -16 -67 27
6026 27 40 115 -48 39 -53 179 -49 -18 -93 -257 -152 -298 -302 110 68 80 -167 -227 257 -120 102 -36 -106 36
6050 36 -87 -146 -28 -113 -297 23 48 -116 151 -39 -164 252 49 17 -202 -88 -56 60 175 73 -51 -149
6072 -149 27 -137 15 249 131 131 67 156 130 -9 -33 -163 -120 -48 -137 176 94 11 -77 69 358 59 72 153 -53
6097 -53 -143 306 16 -59 86 261 77 82 -4 29 123 93 -1 131 -189 -80 -120 78 75 -27 -81 -161 98 131 24
6122 24 58 128 -207 13 130 -34 -29 141 -199 4 -43 45 49 -124 98 -192 40 23 57 -66 129 36 84 -8 180
6147 180 -115 -126 25 -25 142 -118 84 11 68 3 214 69 -149 0 -16 160 211 220 -22 -8 -112 137 115 97
6171 97 117 -109 193 -415 -68 -133 0 73 -4 -113 137 5 -136 94 19 -159 114 -182 67 95 83 60 175
6194 175 118 -114 22 122 324 56 137 62 344 234 7 48 -117 8 -22 -141 7 -40 -81 -1 -1 192 128 -147
6218 -147 -127 -113 183 48 -211 -66 -51 -139 -11 -116 -244 -126 -288 -202 28 -84 -185 64 -7 125 51 -141
6240 -141 -51 18 87 111 -283 -13 218 39 -280 -82 -238 -13 -183 70 -115 62 101 30 64 -1 73 178 215
6263 215 251 -48 -94 127 56 182 -9 -203 47 45 59 -143 138 107 -114 181 -196 -47 121 -11 -84 -38 9
6286 9 -204 27 1 17 -141 220 -164 74 23 -122 104 -71 -75 73 23 222 -154 -115 49 58 -54 -21 -41 -153
6310 -153 -312 105 119 61 -47 -84 -100 -60 -104 -11 -92 -170 -44 131 21 57 -193 227 163 120 32 -16 8 -213 -103
6335 -103 17 -119 63 31 28 77 -6 -91 -203 -90 58 140 150 -3 172 331 -153 -166 38 175 -27 79 -17
6358 -17 -112 -303 60 -223 74 391 -184 37 93 85 149 -140 -148 -45 -24 -133 88 -19 -45 3 -89 207 -36 -3
6382 -3 292 54 37 -6 79 143 -67 -28 -88 6 -43 -79 -55 75 -90 268 199 275 -145 42 101 170 -255 -222 179 -154
6408 -154 -48 -67 50 131 -12 173 147 27 169 138 3 77 64 37 73 59 -93 -164 216 -70 133 73 -164 172
6432 172 3 -265 122 -144 -24 -74 16 31 -12 -101 40 -19 32 -68 -160 79 -130 74 -148 66 -77 -257 46
6455 46 -69 -218 -34 54 -4 45 136 246 -1 16 123 0 -113 34 81 -175 -26 44 -9 -247 -39 -83 88
6478 88 1 -209 295 -125 25 -205 230 -70 -200 45 85 4 161 51 15 317 -214 -87 -431 -166 33 -16
6500 -16 -67 181 -85 -103 41 -123 -4 10 36 -173 -134 -11 34 80 -267 -103 213 -256 109 142 -48 71 -100
6523 -100 -50 -273 7 -61 84 132 43 -102 -5 -104 83 92 -139 -57 -177 -144 136 114 129 -81 36 -64 109 -221
6547 -221 -10 51 -222 204 5 170 -32 -16 145 41 -115 -16 33 -2 -12 145 -178 -57 -6 -134 -17 -43 -138
6570 -138 56 -6 192 82 -33 -271 187 162 20 114 11 38 -16 -199 158 298 233 -185 43 -83 -116 -17 -246
6593 -246 -78 -125 48 -95 73 -153 -109 160 48 -42 -76 72 -82 -3 213 -36 452 -36 -117 268 31 97
6615 97 -19 -197 -70 17 102 97 -33 -178 123 13 2 62 54 -31 -43 213 23 -163 72 33 -216 48 -43 -204
6639 -204 -63 10 -57 77 28 8 46 48 116 -36 -25 -112 112 36 174 15 45 101 -128 54 -84 -8 -51 64 -35
6664 -35 299 -99 131 -43 -67 -130 70 43 -163 22 -75 -9 226 -2 -10 68 -121 39 30 -44 105 -72 -86 67
6688 67 -39 93 22 -14 -9 -54 -107 44 -167 -25 112 90 91 18 313 109 -71 -24 -43 -157 113 -91 59 -79
6712 -79 -56 -50 188 -11 -213 97 259 61 -43 259 72 -146 57 81 -68 -166 36 -44 -72 29 87 169 160 63
6736 63 80 -22 -90 -43 -81 104 30 -153 -139 52 -49 360 64 -240 -126 -21 -12 -74 161 -15 -24 -55 140 32
6760 32 -127 -67 214 -140 -20 -199 -40 -30 -84 131 -51 45 15 -47 151 10 41 79 -49 -225 -168 158 35
6783 35 45 12 284 81 -97 40 92 -2 56 94 -110 143 -13 9 116 120 -118 -55 7 -175 0 -80 -202 113
6807 113 182 -71 246 -41 -118 18 -149 420 20 18 209 59 8 70 39 6 -115 -16 13 134 73 -71 127 -65
6831 -65 124 197 79 -153 52 11 -30 -71 -132 -96 51 6 185 -19 -97 137 158 110 -45 -300 208 -152 -253 116
6855 116 -248 -159 25 158 42 -85 206 101 25 154 -60 142 111 -177 29 -78 200 -298 164 122 -246
6876 -246 -118 -142 144 99 82 149 46 11 -7 9 -48 -175 6 400 -91 13 37 150 -62 273 62 183 232
6899 232 -46 15 -4 15 79 -44 -52 -42 -74 118 -155 8 183 -135 -134 -62 -87 175 27 166 25 -27 -237 -164 53
6924 53 -106 38 53 -91 -10 -101 142 -154 -227 -11 154 75 3 -24 5 10 85 -29 22 166 -80 -164 11 149 -7
6949 -7 67 -63 155 -2 56 -49 126 -83 -55 -232 -2 -129 154 -142 96 26 207 27 226 -88 44 -198
6971 -198 -164 -27 67 16 117 -53 -4 -63 143 59 28 -141 -123 58 -196 -58 -25 -126 297 61 -229 34 96
6994 96 -117 93 14 140 -45 2 144 -18 187 -154 -37 50 181 29 -294 -191 95 -56 -191 103 -56
7015 -56 53 46 54 181 134 91 -1 -76 24 -131 -91 -35 244 -192 -27 -107 79 47 -37 76 92 208 28 88 -90
7040 -90 78 -59 246 133 125 -182 3 143 -83 -97 -2 -100 -148 -67 125 -123 -170 114 58 -75 9 74 11 -16 -118
7065 -118 -107 102 139 -4 -169 -177 39 -120 -5 57 20 55 202 7 -94 -14 -118 16 -232 16 -20 -260 -40
7088 -40 17 82 43 5 73 37 185 -301 35 -45 -87 157 112 -177 102 -112 -4 6 -43 -14 -28 135 -204 241 14
7113 14 -151 91 87 -48 -5 162 84 12 213 -333 -46 -255 94 -75 -32 22 51 -101 -181 -248 -116 -89 -22 -35 -160
7138 -160 -242 -216 -170 -177 -86 25 23 -9 -292 -15 -36 -22 -57 324 -158 30 46 -64 358 -269 -116 -145 60 -20 -21 50
7164 50 -9 -29 57 -1 183 194 -37 -217 -118 -176 -121 49 138 17 131 159 -2 158 57 135 74 37 5 126 13
7189 13 1 -67 -135 -14 -161 -7 -40 85 333 34 -465 -72 -114 -139 77 275 183 -63 -102 -27 56 -62 116 8
7213 8 12 -55 175 92 -95 -222 -156 25 15 -89 129 43 193 20 214 31 -40 37 -85 65 -164 142 -5 18
7237 18 -64 -22 69 -11 -1 -242 -45 77 -21 -169 -142 75 268 -26 -104 -46 -150 -28 234 -103 423 -23 -22 101
7261 101 10 111 -224 -197 169 -118 6 42 65 -85 6 -176 168 57 -67 -70 59 108 114 -132 161 -1 -113
7284 -113 144 130 -310 101 82 -107 -95 -10 174 -321 -68 -177 67 -56 -32 -57 51 135 -125 133 -170 67
7306 67 -25 -92 -66 -6 -110 -44 169 -263 259 152 33 -128 -225 10 -118 -85 -258 -46 11 -32 110 -212 -169 81
7330 81 -15 58 62 -114 -182 -130 -42 -1 -144 -52 -35 87 -193 154 -257 -210 12 30 86 124 30 85 82 -29 -11 123 189
7357 189 113 -124 -64 110 194 33 51 -235 -94 -8 58 94 30 197 13 123 184 -58 17 46 92 -35 -132 -15
7381 -15 89 181 251 182 -25 89 56 -96 48 101 166 168 140 -127 95 166 -34 168 -75 -29 -138 20 92 94 -88
7406 -88 -115 -70 26 -13 -77 -202 8 -134 88 -51 70 178 -82 133 11 -87 207 -53 149 68 -28 -71 69
7429 69 -71 123 -32 171 47 -37 -122 -185 -102 -118 -115 -12 13 -92 -76 149 104 -43 -59 -49 18 94 -111 -35 13 -133
7455 -133 -73 -64 75 9 56 -222 -56 4 -81 348 -125 -9 -108 -47 123 288 -151 -94 231 17 -55 -77 60 -82
7479 -82 60 -109 43 36 -34 -206 72 -38 48 -218 317 -43 -124 -235 225 71 -169 71 135 21 -214 4
7501 4 185 -219 -251 -18 86 16 22 -277 150 -168 115 24 -104 64 34 -152 97 62 -107 51 161 38 -96
7524 -96 -70 -282 5 48 296 -35 -7 -391 -74 -214 67 19 138 -3 126 -161 6 53 -80 -114 39 -164
7546 -164 104 -132 41 -22 66 31 21 -73 -153 247 20 54 -53 -145 45 235 -329 92 154 -114 -124 51 110 43
7570 43 -15 90 -149 -55 169 184 -44 -98 187 155 24 118 -237 -58 174 -23 -37 8 267 61 -23 -11 -284 -164
7594 -164 84 155 38 -9 5 -186 92 78 107 -83 101 170 -43 91 -204 16 15 115 -221 90 -164 245 46
7617 46 -55 100 160 -118 56 22 188 38 197 -84 -40 179 144 179 -65 29 -110 -91 -237 324 -106 63 -2
7640 -2 70 -178 96 160 108 -174 79 -29 92 -161 115 185 -56 53 -146 38 -204 234 -145 22 13 -16 143
7663 143 223 -57 85 17 197 44 -169 -45 289 -71 125 -24 -55 -194 -81 66 88 252 -344 38 -19 -109
7685 -109 19 60 -144 16 182 123 83 -32 35 -201 39 112 -136 14 -234 -9 178 -92 -26 206 -20 16
7707 16 2 244 4 -27 -162 -113 9 -162 19 230 -3 -115 -71 198 36 82 65 -157 58 162 -19 -58 -57
7730 -57 -173 -296 -412 -151 -92 188 35 141 11 -31 42 -61 -24 -81 259 -60 78 -115 22 -33 -77 209 -153
7753 -153 -73 67 -80 180 256 328 6 62 15 13 18 -46 177 76 -177 -68 350 6 -74 196 126 34 3 107 -112
7778 -112 15 31 131 -127 -70 -217 -22 24 78 226 96 -281 133 -45 -129 105 -102 216 -160 126 -74 32
7800 32 53 80 -289 5 -44 -77 -6 116 30 -20 -66 111 23 94 53 -169 -85 161 -19 -50 -210 129 74 -232 -85
7825 -85 147 -353 -102 -26 -70 269 75 153 -196 114 -150 193 -169 32 -125 -29 96 -43 -248 -171 28 144
7847 144 52 -67 115 -101 6 -74 -87 -6 145 -95 -116 -177 10 -155 4 26 -114 -27 -143 258 31 -37 54
7870 54 71 -81 121 109 173 184 -26 -65 -185 -19 109 30 -125 -98 -178 0 77 -42 -94 -122 64 138 -71 -13 32
7895 32 357 254 76 181 76 -112 -115 -95 111 126 -154 -15 -138 93 -174 63 119 22 148 241 -24 94 118
7918 118 222 142 -141 198 -15 -21 -89 -140 -284 -30 35 45 155 69 98 40 110 71 181 -51 -134 -5 -69 26 -125
7943 -125 3 114 121 -171 -40 56 168 1 82 -36 -67 -141 -142 109 51 196 23 -41 -181 56 -110 179 -132
7966 -132 84 -92 -129 136 -175 -29 -113 290 121 262 112 95 -218 -6 -122 -44 -7 111 -151 -234 92 -60
7988 -60 56 122 -62 263 -164 15 -150 54 22 -112 -76 -40 4 -13 164 -204 3 -69 -76 3 75 -50 -202 131
8012 131 19 -95 -62 2 -164 -16 28 -34 -161 126 -166 63 -42 -173 -130 18 -39 -82 -107 122 -81 251 68
8035 68 14 105 -28 132 99 -53 242 102 3 168 -156 76 199 186 -110 76 -69 38 175 1 -23 -41 -150
8058 -150 59 95 -189 -76 149 -211 -8 20 127 127 -107 56 57 69 -185 34 -36 -153 263 302 -32 -143 -104
8081 -104 49 -26 121 13 143 -88 -65 132 -5 201 -54 -159 173 -170 -54 77 11 -44 87 -34 261
8102 261 -128 -121 -79 3 -31 -35 -153 215 127 83 -210 129 16 139 5 224 -255 -15 135 -147 -63 16 104 -95
8126 -95 -27 -41 -24 1 94 288 72 -190 -99 165 -19 -144 81 97 -19 -137 81 -97 119 159 20 -81 125
8149 125 4 34 28 -107 68 98 48 -35 -254 -30 -20 34 70 -46 -111 -80 -145 -121 155 -44 2 39 -90 13 43
8174 43 -27 57 167 -12 128 -49 165 53 40 -270 -56 134 -151 48 -8 -153 40
8191D0
##END NTUPLES=NMR FID
##END=
