##TITLE=1H_Pr 5154
 CDCl3
 8 sc, 
 21.10.2022
##JCAMPDX= 6.0         $$ Bruker NMR JCAMP-DX V2.0
##DATA TYPE= NMR FID
##DATA CLASS= NTUPLES
##ORIGIN= UXNMR, Bruker Analytische Messtechnik GmbH
##OWNER= root
$$ XWIN-NMR		Version 3.5
$$ Fri Oct 21 14:24:27 2022 Russian Standard Time (UT+4h)  she@DPX200
##.OBSERVE FREQUENCY= 200.1313499994
##.OBSERVE NUCLEUS= ^1H
##.DELAY= (6, 6)
##.ACQUISITION MODE= SIMULTANEOUS
##.ACQUISITION SCHEME= undefined
##.AVERAGES= 8
##.DIGITISER RES= 18
##SPECTROMETER/DATA SYSTEM= spect
##.PULSE SEQUENCE= zg30
##.SOLVENT NAME= CDCl3
##.SHIFT REFERENCE= (INTERNAL, CDCl3, 0, 15.7039)
##AUDIT TRAIL= $$ (NUMBER, WHEN, WHO, WHERE, WHAT)
$$ ##TITLE= Audit trail, XWIN-NMR		Version 3.5
$$ ##JCAMPDX= 5.01
$$ ##ORIGIN= Bruker BioSpin GmbH
$$ ##OWNER= she
$$ F:/spectra/data/she/nmr/H-F/1/audita.txt
$$ ##AUDIT TRAIL=  $$ (NUMBER, WHEN, WHO, WHERE, WHAT)
(   1,<2022-10-21 14:22:28.65 +0400>,<she>,<DPX200>,
      <created by zg, POWCHK disabled, PULCHK disabled
       configuration hash MD5:
       00 E9 B6 7A A2 85 ED C7 34 08 36 98 17 FE 4E 26
       data hash MD5: 16K
       82 47 09 65 F2 EF C2 15 49 E2 72 B6 DD 0D 30 00>)
$$ ##END=
$$ 
$$ hash MD5
$$ 8D 16 44 20 06 76 70 4A 29 94 1B 6F 67 55 9E 55
##$RELAX= 
##$RELAX= 
##$RELAX= 
##$RELAX= 
##$RELAX= 
##$RELAX= 
$$ Bruker specific parameters
$$ --------------------------
##$DU= <F:/spectra>
##$EXPNO= 1
##$NAME= <H-F>
##$PROCNO= 1
##$TYPE= <nmr>
##$USER= <she>
##$AMP= (0..31)
100 100 100 100 100 100 100 100 100 100 100 100 100 100 100 100 100 100 
100 100 100 100 100 100 100 100 100 100 100 100 100 100 
##$AQSEQ= 0
##$AQ_mod= 1
##$AUNM= <au_zg>
##$AUTOPOS= <>
##$BF1= 200.13
##$BF2= 200.13
##$BF3= 200.13
##$BF4= 200.13
##$BF5= 200.13
##$BF6= 200.13
##$BF7= 200.13
##$BF8= 200.13
##$BYTORDA= 1
##$CFDGTYP= 0
##$CFRGTYP= 5
##$CHEMSTR= <none>
##$CNST= (0..31)
1 1 145 1 1 1 1 1 1 1 1 1 1 1 1 1 1 1 1 1 1 1 1 1 1 1 1 1 1 1 1 1 
##$CPDPRG= <>
##$CPDPRG1= <>
##$CPDPRG2= <>
##$CPDPRG3= <>
##$CPDPRG4= <mlev>
##$CPDPRG5= <mlev>
##$CPDPRG6= <mlev>
##$CPDPRG7= <mlev>
##$CPDPRG8= <mlev>
##$CPDPRGB= <>
##$CPDPRGT= <>
##$D= (0..31)
0 1.2 0 0 0 0 0 0 0 0.06 0 0.03 0 0 0 0 0.0002 0 0 0 0 0 0 0 0 0 0 0 0 
0 0 0 
##$DATE= 1666347748
##$DBL= (0..7)
120 120 120 120 120 120 120 120 
##$DBP= (0..7)
150 150 150 150 150 150 150 150 
##$DBP07= 0
##$DBPNAM0= <>
##$DBPNAM1= <>
##$DBPNAM2= <>
##$DBPNAM3= <>
##$DBPNAM4= <>
##$DBPNAM5= <>
##$DBPNAM6= <>
##$DBPNAM7= <>
##$DBPOAL= (0..7)
0.5 0.5 0.5 0.5 0.5 0.5 0.5 0.5 
##$DBPOFFS= (0..7)
0 0 0 0 0 0 0 0 
##$DE= 6
##$DECBNUC= <off>
##$DECIM= 32
##$DECNUC= <off>
##$DECSTAT= 4
##$DIGMOD= 1
##$DIGTYP= 9
##$DL= (0..7)
0 120 120 120 120 120 120 120 
##$DP= (0..7)
150 150 150 150 150 150 150 150 
##$DP07= 0
##$DPNAME0= <>
##$DPNAME1= <>
##$DPNAME2= <>
##$DPNAME3= <>
##$DPNAME4= <>
##$DPNAME5= <>
##$DPNAME6= <>
##$DPNAME7= <>
##$DPOAL= (0..7)
0.5 0.5 0.5 0.5 0.5 0.5 0.5 0.5 
##$DPOFFS= (0..7)
0 0 0 0 0 0 0 0 
##$DQDMODE= 0
##$DR= 18
##$DS= 0
##$DSLIST= <SSSSSSSSSSSSSSS>
$$ [...]
##$SUBNAM2= <"">
##$SUBNAM3= <"">
##$SUBNAM4= <"">
##$SUBNAM5= <"">
##$SUBNAM6= <"">
##$SUBNAM7= <"">
##$SUBNAM8= <"">
##$SUBNAM9= <"">
##$SW= 18.0517283424941
##$SWIBOX= (0..15)
0 0 2 0 0 0 0 0 0 0 0 0 0 0 0 0 
##$SW_h= 3612.71676300578
##$TD= 16384
##$TD0= 1
##$TE= 0
##$TE2= 300
##$TE3= 300
##$TEG= 300
##$TL= (0..7)
0 120 120 120 120 120 120 120 
##$TP= (0..7)
150 150 150 150 150 150 150 150 
##$TP07= 0
##$TPNAME0= <>
##$TPNAME1= <>
##$TPNAME2= <>
##$TPNAME3= <>
##$TPNAME4= <>
##$TPNAME5= <>
##$TPNAME6= <>
##$TPNAME7= <>
##$TPOAL= (0..7)
0.5 0.5 0.5 0.5 0.5 0.5 0.5 0.5 
##$TPOFFS= (0..7)
0 0 0 0 0 0 0 0 
##$TUNHIN= 0
##$TUNHOUT= 0
##$TUNXOUT= 0
##$USERA1= <user>
##$USERA2= <user>
##$USERA3= <user>
##$USERA4= <user>
##$USERA5= <user>
##$V9= 5
##$VALIST= <valist>
##$VCLIST= <CCCCCCCCCCCCCCC>
##$VD= 0
##$VDLIST= <DDDDDDDDDDDDDDD>
##$VPLIST= <PPPPPPPPPPPPPPP>
##$VTLIST= <TTTTTTTTTTTTTTT>
##$WBST= 1024
##$WBSW= 4
##$XGAIN= (0..3)
0 0 0 0 
##$XL= 0
##$YL= 0
##$YMAX_a= 186796
##$YMIN_a= -223458
##$ZGOPTNS= <>
##$ZL1= 120
##$ZL2= 120
##$ZL3= 120
##$ZL4= 120
##$ABSF1= 10
##$ABSF2= 0
##$ABSG= 5
##$ABSL= 3
##$ALPHA= 0
##$AQORDER= 0
##$ASSFAC= 0
##$ASSFACI= 0
##$ASSFACX= 0
##$ASSWID= 0
##$AUNMP= <proc_1d>
##$AZFE= 0.1
##$AZFW= 0.1
##$BCFW= 1
##$BC_mod= 2
##$BYTORDP= 1
##$COROFFS= 0
##$CY= 11.3945322036743
##$DATMOD= 1
##$DC= 2
##$DFILT= <>
##$DTYPP= 0
##$F1P= 2.36226072786647
##$F2P= -0.459571619588291
##$FCOR= 0.5
##$FTSIZE= 0
##$FT_mod= 4
##$GAMMA= 1
##$GB= 0.15
##$INTBC= 1
##$INTSCL= 1
##$ISEN= 128
##$LB= 0.24
##$LEV0= 0
##$LPBIN= 0
##$MAXI= 10000
##$MC2= 0
##$MEAN= 0
##$ME_mod= 0
##$MI= 1.114404
##$NCOEF= 0
##$NC_proc= 0
##$NLEV= 6
##$NOISF1= 3.799351
##$NOISF2= 2.8
##$NSP= 1
##$NTH_PI= 0
##$NZP= 0
##$OFFSET= 15.70392
##$PC= 1
##$PHC0= -18033.59
##$PHC1= 10.2007
##$PH_mod= 1
##$PKNL= yes
##$PPARMOD= 0
##$PSCAL= 0
##$PSIGN= 0
##$REVERSE= no
##$SF= 200.130013532006
##$SI= 16384
##$SIGF1= 3
##$SIGF2= 2
##$SINO= 400
##$SIOLD= 16384
##$SREGLST= <1H.CDCl3>
##$SSB= 0
##$STSI= 0
##$STSR= 0
##$SW_p= 3612.71676300578
##$SYMM= 0
##$S_DEV= 0
##$TDeff= 0
##$TDoff= 0
##$TI= <>
##$TILT= no
##$TM1= 0
##$TM2= 0
##$TOPLEV= 0
##$USERP1= <user>
##$USERP2= <user>
##$USERP3= <user>
##$USERP4= <user>
##$USERP5= <user>
##$WDW= 1
##$XDIM= 8192
##$YMAX_p= 0
##$YMIN_p= 0
$$ End of Bruker specific parameters
$$ ---------------------------------
##NTUPLES= NMR FID
##VAR_NAME=  TIME,          FID/REAL,        FID/IMAG
##SYMBOL=    X,             R,               I
##VAR_TYPE=  INDEPENDENT,   DEPENDENT,       DEPENDENT
##VAR_FORM=  AFFN,          ASDF,            ASDF
##VAR_DIM=   8192,          8192,            8192
##UNITS=     SECONDS,       ARBITRARY UNITS, ARBITRARY UNITS
##FACTOR=    0.0002768,     1,               1
##FIRST=     0,             0,               0
##LAST=      2.2672688,     0,               0
##MIN=       0,             -223458,         0
##MAX=       2.2672688,     186796,          0
$$ Real data points
##PAGE= N=1
##DATA TABLE= (X++(R..R)), XYDATA
$$ [...]
$$ plain form
2038 1617 1633 1889 1952 1972 1711 1703 1377 1073 625 264 122 -468 -872 -944 -1512 -1653 -1530 -1960 -2121 -1661 -1922 -1654
2060 -1654 -1653 -928 -562 -622 -233 227 615 901 1290 1452 1713 1937 1908 1987 1761 1448 1651 1117 616 582 222 -351
2082 -351 -731 -1270 -1134 -1842 -1982 -1744 -1745 -1890 -1908 -1530 -1217 -1514 -819 -299 -224 273 686 1103 966 1416 1885
2103 1885 2067 1919 1752 2117 1634 1199 1231 1171 688 156 -197 -325 -1438 -1008 -1413 -1787 -1915 -1887 -1623 -1881
2123 -1881 -1489 -1436 -1039 -1062 -471 131 279 553 1043 1343 1195 1518 1743 1999 1912 1788 1890 1751 994 1019 605
2144 605 255 -395 -375 -527 -1237 -1533 -1161 -1521 -1809 -1857 -1711 -1624 -1573 -1184 -615 -665 -441 13 571 855 928 1297
2166 1297 1699 1549 1707 1818 1658 1529 1431 1267 1081 705 466 94 -348 -630 -698 -1326 -1711 -1709 -1723 -1892 -1750
2187 -1750 -1384 -1607 -1408 -966 -797 -391 -234 558 921 892 852 1608 1969 1529 1572 2074 1646 1386 1093 1108 732
$$ packed form
2038A617J6K56O3K0k61ql26l04m48l61j42n90m04p2n68j41J23m30j61M60k61K68
2060a654JP25L66o0L89M60L88K86L89J62K61K24k9P9k26l13K03n34n01l4l60n73
2082c51l80n39J36p08j40K38jj45j8L78L13k97O95N20P5M97M13M17j37M50M69
2103A885J82j48j67L65m83m35L2o0m83n32l53j28j113M30m05l74j28K8K64k58
2123a881L92N3L97k3N91O02J48K74M90L00j48L23K25K56q7j24J02j39p57K5m14
2144F05l50o50K0j52p10k96L72l60k88m8J46Q7N1L89N69n0K24M54N58K84P3L69
2166A297M02j50J58J11j60j29r8j64j86l76k39l72m42k82o8o28l85Kj4j69J42
2187a750L66k23J99M42J69M06J57P92L63k9m0P56L61m40M3N02m28k60k93J5l76
$$ plain form
2208 732 258 97 -72 -607 -962 -784 -1131 -1720 -1977 -1717 -1772 -1733 -1360 -1320 -986 -866 -361 -130 98 698 1252
2229 1252 1233 1202 1364 1752 1662 1446 1663 1268 1200 677 953 452 61 84 -299 -718 -1197 -1204 -1282 -1574 -1566 -1584 -1432
2252 -1432 -1655 -1564 -801 -746 -822 -266 202 614 726 1095 1381 1620 1136 1644 1581 1535 1386 1566 1153 619 467
2273 467 275 -148 -339 -592 -877 -1249 -1501 -1456 -1604 -1318 -1779 -1064 -1414 -1376 -914 -541 -386 -96 368 741 859
2294 859 1433 1275 1491 1600 1551 1603 1471 1423 1064 824 365 241 177 -198 -1134 -739 -968 -1512 -1316 -1408 -1467 -1202
2316 -1202 -1470 -912 -1000 -1052 -689 -138 14 84 832 1032 1094 1400 1511 1604 1575 1584 1225 1195 1160 713 650 308 127
2339 127 -199 -424 -921 -1014 -1220 -1392 -1589 -1518 -1281 -1614 -1395 -866 -856 -927 -517 187 71 412 938 925 1232 1145
2361 1145 1548 1540 1277 1425 1541 1136 777 759 366 126 -280 -406 -624 -759 -1389 -1045 -901 -1565 -1609 -1529 -948
$$ packed form
2208G32m74j61j69n35l55J78l47n89k57K60n5L9L73M0L34J20N05K31K28O00N54
2229A252j9l1J62L88r0k16K17l95o8n23K76n01l91K3l83m19m79pp8k92Qj8J52
2252a432k23R1P63N5p6N56M68M12J12L69K86K39m84N08o3m6j49J80m13n34j52
2273D67j92m23j91k53k85l72k52M5j48K86m61P15l50L8M62L73J55K90M64L73J18
2294H59N74j58K16J09m9N2j32m8l59k40m59j24o4l75r36L95k29n44J96r2n9K65
2316a202k68N58q8n2L63N51J52P0P48K00O2L06J11R3k9Rl59l0l5m47o3l42j81
2339A27l26k25m97r3k06j72j97P1K37l33K19N29J0p1M10P04j16L41N26j3L07q7
2361A145M03qk63J48J16m05l59j8l93k40m06j26k18j35o30L44J44o64m4Q0N81
$$ plain form
2382 -948 -1234 -1337 -458 -388 -471 118 537 526 882 1161 1073 1492 1227 1399 1317 1252 1107 859 637 579 226 -200
2404 -200 -564 -351 -897 -1063 -1244 -1312 -1573 -1648 -1329 -1124 -1028 -1034 -860 -259 -158 -188 367 821 721 818 1224 1553
2426 1553 1354 1291 1516 1192 743 828 769 333 288 12 -386 -613 -1058 -1122 -994 -1224 -1170 -1520 -1106 -1191 -1285 -1113
2448 -1113 -787 -503 -412 84 423 397 773 800 1223 1247 1358 1191 1379 1436 1104 949 816 504 339 106 -298
2469 -298 -499 -699 -882 -750 -1310 -1301 -1562 -1435 -1512 -1185 -942 -666 -911 -381 -245 106 212 619 752 870 1129
2490 1129 1414 1140 1215 1237 1038 1129 869 334 225 249 -90 -658 -647 -1025 -1195 -1232 -1212 -1313 -1450 -1428 -1133 -1045 -890
2513 -890 -490 -669 -263 133 195 400 649 799 1049 1063 1111 1298 1233 1160 981 836 408 424 14 -302 -301 -491 -753
2536 -753 -1230 -1023 -1275 -1182 -1227 -1403 -882 -967 -765 -627 -663 87 128 198 386 603 924 1089 1012 1185 1337 1347 1042
$$ packed form
2382i48k86j03Q79P0q3N89M19j1L56K79q8M19k65J72q2o5j45k48k22n8l53m26
2404b00l64K13n46j66j81o8k61p5L19K05R6oJ74O01J01l0N55M54j00R7M06L29
2426A553j99o3K25l24m49Q5n9m36m5k76l98k27m45o4J28k30N4l50M14q5r4J72
2448a113L26K84R1M96L39k6L76K7M23K4J11j67J88N7l32j55j33l12j65k33m04
2469b98k01k00j83J32n60Rk61J27p7L27K43K76k45N30J36L51J06M07J33J18K59
2490A129K85k74P5K2j99R1k60n35j09K4l39n68J1l78j70l7K0j01j37K2K95Q8J55
2513h90M00j79M06L96O2K05K49J50K50J4M8J87o5p3j79j45m28J6m10l16Jj90k62
2536g53m77K07k52R3m5j76N21q5K02J38l6P50M1P0J88K17L21J65p7J73J52J0l05
$$ plain form
2559 1042 1025 1117 1043 316 208 -22 -256 -387 -758 -862 -984 -981 -1176 -1194 -1291 -1169 -816 -977 -491 -608 -282 -81
2581 -81 94 141 889 620 1069 972 731 1120 1058 1214 1219 671 462 665 87 204 -161 -152 -757 -1070 -895 -1237 -1014
2604 -1014 -1080 -1091 -1176 -1008 -806 -748 -441 -293 -15 214 101 578 936 880 1160 1195 1270 1130 1141 1217 919 717 445
2627 445 418 157 -94 -38 -218 -752 -967 -1133 -1160 -1176 -1110 -1050 -848 -824 -763 -461 -203 -294 286 37 479 377 863
2650 863 914 987 996 1251 1073 993 998 732 669 435 129 -3 -306 -457 -575 -685 -837 -904 -1233 -1029 -1061 -799 -742 -924
2674 -924 -393 -278 -291 15 441 319 570 620 890 1136 1069 1091 1045 1037 881 751 595 450 241 21 -288 -600
2696 -600 -529 -844 -946 -1003 -1000 -936 -879 -1068 -552 -440 -847 -359 -349 -228 249 301 406 856 585 959 831 1157 705
2719 705 1022 707 701 629 232 173 4 -90 -436 -476 -670 -774 -973 -1126 -991 -900 -1056 -1000 -566 -519 -358 -262 -45
$$ packed form
2559A042j7R2p4p27j08k30k34j31l71j04j22Lj95j8r7J22L53j61M86j17L26K01
2581h1J75M7P48k69M49r7k41L89o2J56Nn48k09K03n78J17l65Ro05l13J75l42K23
2604a014o6j1q5J68K02N8L07J48K78K29j13M77L58n6K80L5P5j40J1P6k98k02k72
2627D45k7k61k51N6j80n34k15j66k7j6O6O0K02K4O1L02K58r1N80k49M42j02M86
2650H63N1P3RK55j78q0Nk66o3k34l06j32l03j51j18j10j52o7l29K04l2K62N7j82
2674i24N31J15j3L06M26j22K51N0K70K46o7K2m6qj56j30j56j45k09k20l09l12
2696f00P1l15j02n7LO4N7j89N16J12m07M88J0J21M77N2J05M50k71L74j28L26m52
2719G05L17l15op2l97n9j69r4l46m0j94j04j99j53J35R1j56N6M34M7J61R6K17
$$ plain form
2742 -45 14 39 535 633 875 685 1057 887 835 834 1016 854 686 612 332 110 -225 -280 -467 -409 -913 -874 -698 -709
2766 -709 -913 -634 -826 -943 -866 -682 -167 -117 -174 344 304 569 548 806 775 1073 893 669 847 962 574 536
2788 536 404 262 -192 -264 -266 -522 -488 -794 -1004 -1032 -1174 -1124 -793 -654 -644 -631 -267 -115 -275 137 236 577 860
2811 860 783 830 872 918 733 914 695 525 423 675 35 -208 -210 -401 -599 -573 -699 -858 -695 -1013 -950 -730 -844
2834 -844 -800 -448 -360 -272 -107 40 344 129 566 758 705 857 849 779 846 943 544 827 414 353 -86 -14 -242 -329
2858 -329 -715 -660 -608 -1062 -891 -684 -748 -741 -647 -751 -325 -255 -345 90 151 539 358 615 651 805 416 1012 715
2881 715 804 968 570 239 185 188 37 -260 -241 -283 -739 -922 -943 -617 -820 -853 -739 -639 -645 -616 -294 -62 -73 342
2905 342 354 466 606 993 490 625 911 849 907 674 774 675 438 27 75 -246 -484 -411 -533 -457 -607 -822
$$ packed form
2742d5N9K5M96R8K42j90L72j70n2jJ82j62j68p4k80k22l35n5j87N8n04L9J76j1
2766g09k04K79j92j17P7J84N15N0n7N18m0K65k1K58l1K98j80k24J78J15l88l8
2788E36j32j42m54p2kk56L4l06k10k8j42N0L31J39J0J3L64J52j60M12R9L41K83
2811H60p7M7M2M6j85J81k19j70j02K52o40k43kj91j98K6j26j59J63l18O3K20j14
2834h44M4L52Q8Q8J65J47L04k15M37J92n3J52qp0O7R7l99K83m13o1m39P2k28q7
2858c29l86N5N2m54J71K07o4PR4j04M26P0r0M35O1L88j81K57L6J54l89N96k97
2881G15Q9J64l98l31n4Lj51k97J9m2m56j83k1L26k03l3J14J00oK9L22K32j1M15
2905C42J2J12J40L87n03J35K86o2N8k33J00r9k37m11M8l21k38P3j22P6j50k15
$$ plain form
2927 -822 -768 -851 -1054 -676 -596 -553 -429 64 135 -36 252 613 504 717 748 753 698 913 552 692 513 351 291
2950 291 342 212 -87 -237 -563 -542 -553 -742 -431 -997 -642 -650 -853 -553 -476 -332 -92 -48 194 457 322 727
2972 727 772 635 583 421 702 875 742 630 612 400 116 -122 -168 -231 -280 -576 -687 -594 -817 -860 -608 -604 -692 -573
2996 -573 -510 -287 -289 14 103 173 438 323 545 621 690 671 739 564 595 582 375 690 107 476 -168 -232 -516 -411
3020 -411 -554 -833 -867 -837 -227 -750 -857 -533 -332 -437 -316 -348 -140 186 156 428 397 538 893 871 860 698
3042 698 645 606 414 402 270 36 174 -327 -373 -488 -491 -595 -434 -868 -673 -548 -431 -736 -433 -237 -118 -172
3064 -172 -253 257 352 186 427 585 334 628 810 690 548 723 689 633 101 186 158 -285 -273 -468 -316 -320 -628
3087 -628 -648 -853 -498 -589 -654 -643 -590 -360 3 -129 81 407 229 288 512 564 614 448 527 810 665 525 547
$$ packed form
2927h22N4q3k03L78Q0M3J24M93P1j71K88L61j09K13L1Nn5K15l61J40j79j62o0
2950B91N1j30k99j50l26K1j1j89L11n66L55qk03L00P7J44K40M4K42K63j35M05
2972G27M5j37n2j62K81J73j33j12j8k12k84k38m6o3m9k96j11R3k23m3K52Mq8J19
2996e73O3K23kL03Q9P0K65j15K22P6O9j9O8j75L1j3k07L15n83L69o44o4k84J05
3020d11j43k79l4L0O10n23j07L24K01j05J21l2K08L26l0K72l1J41L55k2j1j62
3042F98n3l9j92j2j32k34J38n01m6j15lj04J61m34J95J25J17l05L03J96J19n4
3064a72q1N10R5j66K41J58k51K94J82j20j42J75l4n6n32Q5k8m43J2j95J52ml08
3087f28k0k05L55r1o5J1N3K30L63j32K10L26j78N9K24N2N0j66P9K83j45j40K2
$$ plain form
3110 547 546 25 105 -132 -66 -283 -627 -599 -673 -461 -719 -773 -586 -550 -483 -68 -139 -243 57 181 176 334 270 492
3134 492 426 500 580 575 371 547 387 244 182 359 280 40 -95 -126 -365 -511 -200 -752 -676 -790 -535 -722 -486
3157 -486 -185 -142 -169 -92 329 607 315 139 479 417 596 621 685 465 502 536 379 264 96 52 -55 -156 -123
3180 -123 -239 -371 -597 -635 -409 -548 -640 -714 -388 -361 -72 -285 -150 119 -26 207 364 546 337 587 534 491
3202 491 550 553 597 458 160 107 485 20 -217 -197 -159 -411 -724 -418 -670 -615 -495 -572 -471 -659 -77 -104 -243
3225 -243 -176 -53 386 337 641 381 502 346 306 419 683 708 470 533 432 49 216 -204 -46 -227 -441 -398
3247 -398 -560 -405 -609 -470 -570 -472 -527 -232 -99 -313 -60 306 278 260 371 505 481 406 474 650 592 504 473
3270 473 240 375 287 162 9 -12 -156 -451 -342 -376 -489 -641 -494 -622 -388 -691 -350 -283 106 -243 -170 236
$$ packed form
3110E47jn21Q0k37O6k17l44K8p4K12k58n4J87L6O7M15p1j04L00J24nJ58o4K22
3134D92o6P4Q0nk04J76j60j43o2J77p9k40j35l1k39j46L11n52P6j14K55j87K36
3157d86L01M3k7P7M21K78k92j76L40o2J79K5O4k20L7L4j57j15j68m4j07j01L3
3180a23j16j32k26l8K26j39r2p4L26K7K89k13J35K69j45K33J57J82k09K50n3m3
3202D91N9LM4j39k98n3L78m65k37K0L8k52l13L06k52N5J20p7J01j88N82k7j39
3225b43O7J23M39m9L04k60J21j56m0J13K64K5k38O3j01l83J67m20J58j81k14M3
3247c98j62J55k04J39j00R8n5K95J33k14K53L66k8j8J11J34k4p5O8J76n8q8l1
3270D73k33J35q8j25j53k1j44k95J09l4j13j52J47j28K34l03L41O7L89l49P3M06
$$ plain form
3292 236 282 640 275 468 499 653 202 886 467 311 446 65 135 174 54 -13 -330 -228 -174 -337 -327 -570
3314 -570 -684 -576 -356 -137 -356 -534 -209 23 -139 33 277 327 221 340 320 387 448 453 252 346 457 174
3336 174 181 162 76 -276 -240 -224 -302 -291 -438 -291 -597 -446 -440 -514 -458 -264 -500 -163 -5 36 202 202 269 295 348 346 472
3363 472 437 408 574 347 417 118 2 -95 -139 -175 -375 -214 -459 -304 -396 -705 -654 -584 -217 -562 -426 -250 -213
3386 -213 -172 -33 302 312 410 494 289 283 435 476 323 331 179 463 354 370 -103 -120 -202 -262 -302 -274 -511 -426 -633
3411 -633 -502 -449 -293 -221 -224 -56 -103 -124 70 60 369 231 313 662 595 433 651 397 485 221 71 530 151
3434 151 118 169 -3 -256 -216 -209 -466 -316 -238 -466 -655 -372 -602 -235 -343 -163 -87 51 -63 142 98 366 533
3457 533 460 482 532 472 478 353 109 172 319 279 248 -119 -258 -178 -175 -323 -473 -312 -215 -271 -277 -182 -417 -179 -111 -92
$$ packed form
3292B36M6L58l65J93L1J54m51O84m19j56J35l81P0L9j20o7l17J02N4j63J0k43
3314e70j14J08K20K19k19j78L25K32j62J72K44N0j06J19k0O7O1Nk01R4J11k83
3336A74Pj9q6l52L6J6p8J1j47J47l06J51Op4N6J94k36L37J58M1J66%O7K6N3kJ26
3363D72l5k9J66k27P0k99j16r7m4l6k00J61k45J55r2l09N1P0L67l45J36J76L7
3386b13M1J39L35J0R8Q4k05oJ52M1j53Qj52K84j09J6m73j7q2o0m0K8k37Q5k07
3411f33J31N3J56P2lJ68m7k1J94j0L09j38Q2L49o7j62K18k54Q8k64j50M59l79
3434A51l3N1j72k53M0Pk57J50P8k28j89K83k30L67j08J80P6J38j14K05m4K68J67
3457E33p3K2N0o0Oj25k44O3J47m0l1l67j39Q0Lj48j50J61R7n6oR5k35K38O8J9
$$ plain form
3483 -92 -35 42 259 294 284 232 312 240 583 500 423 492 412 233 435 239 107 16 -338 -51 -225 -267 -698 -474 -374
3508 -374 -375 -394 -467 -293 -219 132 77 -115 -89 313 153 366 260 322 502 568 244 365 252 335 157 175 298 186
3532 186 -54 -182 -332 -175 -176 -110 -336 -239 -303 -60 -23 -278 -310 -298 -105 -271 -189 219 372 31 162 329 308
3555 308 424 152 501 336 417 319 107 301 18 -113 76 -93 -294 -263 -249 -117 -242 -93 -476 -175 -462
3576 -462 -247 -261 -251 -188 -130 -22 60 97 202 138 463 268 335 704 591 333 260 429 74 -35 63 -109 -90 -395
3600 -395 -273 -477 -349 -401 -241 -404 -465 -437 -493 90 -416 -33 42 53 -3 181 285 479 395 496 247 117 281
3623 281 158 474 259 150 100 -30 57 -135 -289 -326 -173 -569 -319 -244 -493 -346 -425 -359 -5 -283 -45 -64
3645 -64 -19 1 234 360 340 178 337 256 383 192 458 82 124 30 -113 260 -14 -87 -141 -21 -329 -369 -420 -462
$$ packed form
3483i2N7P7K17L5j0n2Q0p2L43q3p7O9q0j79K02j96j32r1l54K87j74m2m31K24J00
3508c74jj9p3J74P4L51n5j92K6M02j60K13j06O2J80O6l24J21j13Q3j78J8J23j12
3532A86k40j28j50J57jO6k26R7o4K43L7k55l2J2J93j66Q2M08J53l41J31J67k1
3555C08J16k72L49j65Q1r8k12J94k83j31J89j69k01L1J4J32j25J49l83L01k87
3576d62K15j4J0O3N8J08Q2L7J05o4L25j95O7L69j13k58p3J69l55j09R8j72J9l05
3600c95J22k04J28n2J60j63o1K8n6N83n06L83P5J1n6J84J04J94q4J01k49j30J64
3623B81j23L16k15j09n0j30Q7j92j54l7J53l96K50P5k49J47p9O6L54k78K38j9
3645f4M5K0K33J26k0j62J59q1J27j91K66l76M2r4j43L73k74p3n4J20l08m0n1m2
$$ plain form
3669 -462 -385 -367 -274 -338 3 -267 10 -37 39 82 130 -5 368 422 316 240 316 285 386 399 85 311 214 -35 -114
3694 -114 -120 -373 -378 -138 -183 -325 -100 -346 -270 -458 -263 -39 184 -312 69 -51 91 150 -305 170 256 134 462
3717 462 312 318 460 294 245 259 240 38 31 -167 -61 -134 -205 -401 -267 -467 -156 -242 -149 -155 -191 -290 -64 -256 -276
3742 -276 79 93 292 182 124 221 319 166 306 207 396 361 219 284 24 299 -24 30 -267 -144 -59 -263 -247
3765 -247 -166 -156 -146 -238 48 -163 -66 -98 -421 76 -230 213 111 194 180 326 58 375 391 236 119 84 -61
3788 -61 147 71 -91 -223 -33 -358 12 -260 -453 -253 -262 -251 -306 63 -181 -283 -209 -231 -26 193 64 207 168
3811 168 592 401 200 458 407 121 226 187 254 9 -40 -139 -226 -135 -195 -50 -81 55 -177 -352 -214 -110 79
3834 79 -182 -138 80 -95 49 -253 -89 -80 -63 41 111 250 291 267 163 93 103 160 211 155 -98 8 -143 -292
$$ packed form
3669d62P7J8R3o4L41k70K77m7P6M3M8j35L73N4j06p6P6l1J01J3l14K26r7k49p9
3694a14ok53nK40m5j42K25k46P6j88J95K24K23m96L81j20J42N9m55M75Q6j22L28
3717D62j50OJ42j66m9J4j9k02pj98J06p3p1j96J34k00L11q6R3ol6r9K26j92k0
3742b76L55J4J99j10n8R7R8j53J40r9J89l5j42O5k60K75l23N4k97J23Q5k04J6
3765b47Q1J0J0r2K86k11R7l2l23M97l06M43j02Q3j4J46k68L17J6j55j17l5j45
3788f1K08p6j62j32J90l25L70k72j93K00rJ1n5L69k44j02P4k2K05K19j29J43l9
3811A68M24j91k01K58n1k86J05l9O7k45m9r9q7R1o0J45l1J36k32j75J38J04J89
3834G9k61M4K18j75J44l02J64RJ7J04P0J39M1k4j04p0J0N7N1n6k53J06j51j49
$$ plain form
3858 -292 -362 -241 -23 -190 -320 -296 -118 -154 -164 -296 17 11 -90 -38 37 268 191 34 188 168 -212 366 375 192
3882 192 198 39 -88 62 55 84 -34 -87 -56 -215 -132 -369 -309 -338 -398 -136 -87 -122 89 -177 -222 64 85 67 275
3907 275 206 145 -2 197 105 -27 143 350 290 230 -6 26 16 -30 -109 -322 69 -225 -176 -241 -438 -264 -162 -57
3931 -57 -194 -85 -65 94 -76 -176 -12 158 160 408 166 -14 250 234 339 432 82 -200 90 63 -112 -183 -78
3954 -78 -129 -173 -120 -157 -268 -69 -53 -282 -140 -105 -243 -94 15 17 -29 220 221 237 22 177 339 263 96 99 231
3979 231 67 229 16 114 118 25 -172 -290 -521 -244 -143 -121 -274 -256 -85 -225 -130 -92 56 -30 44 215 162 89
4003 89 76 -47 267 181 61 217 245 241 351 -215 -160 44 138 -38 -166 -139 -110 102 -64 -334 -101 -215 -254 -261
4027 -261 -169 -218 -15 -100 91 226 142 84 291 200 -99 243 175 245 104 152 145 135 26 86 -119 -86 4 -255 -48
$$ packed form
3858b92p0J21K18j67j30K4J78l6j0j32L13oj01N2P5K31p7j57J54k0l80N78Rj83
3882A92Oj59j27J50pK9j18n3L1j59Q3k37O0k9o0K62M9l5K11k66m5K86K1j8K08
3907B75o9o1j47J99r2j32J70K07o0o0k36L2j0m6p9k13L91k94M9o5j97J74J02J05
3931e7j37J09K0J59j70j00J64J70KK48k42j80K64j6J05R3l50k82K90k7j75p1J05
3954g8n1m4N3l7j11J99J6k29J42L5j38J49J09Km6K49JJ6k15J55J62p6j67LJ32
3979B31j64J62k13R8Mr3j97j18k31K77J01K2j53J8J71j40R5L8J48q6P4J71n3p3
4003H9j3j23L14q6j20J56K8mJ10n66N5K04R4j76j28K7K9K12j66k70K33j14l9p
4027b61R2m9K03q5J91J35q4n8K07r1k99L42o8P0j41M8pj0j09O0k05L3R0k59K07
$$ plain form
4052 -48 -91 -196 -378 25 -101 -145 -117 -76 23 -382 61 33 21 -40 -187 -135 87 138 107 257 321 121 107 301 100
4077 100 214 -32 45 79 -93 210 -54 -93 -340 -211 -133 -298 -271 42 -394 2 -109 161 13 302 213 -116
4099 -116 42 325 181 -63 68 141 -104 132 203 75 -17 180 175 222 -298 149 -11 -120 0 -198 -121 -340
4121 -340 -174 -168 -140 -278 -163 20 -139 220 -135 -2 92 -39 139 -48 25 192 422 -154 185 118 191 -23
4143 -23 110 111 -74 -27 -15 -24 -190 -279 -200 149 -252 -67 -308 -189 -222 27 -14 -23 -111 66 148 106 81 -20 318 25
4169 25 14 73 191 32 -90 -136 5 88 -107 -21 90 -292 -167 8 -97 -123 -123 -382 -48 -147 -201 58 79 34
4193 34 39 -1 -20 173 304 62 163 5 131 135 288 185 202 246 134 -174 -14 43 -119 81 -265 -227 -24 58
4217 58 -136 -190 -116 -154 -194 -93 -8 -254 77 -77 -110 114 -241 -172 -26 239 121 -220 351 119 309 -58 178
$$ packed form
4052d8m3j05j82M03j26m4K8M1R9m05M43k8j2o1j47N2K22N1l1J50O4k00j4J94k01
4077A00J14k46P7L4j72L03k64l9k47J29P8j65K7L13m36L96j11K70j48K89q9l29
4099a16J58K83j44k44J31P3k45K36P1j28r2J97nM7n20M47j60j09J20j98P7k19
4121c40J66OK8j38J15J83j59L59l55J33R4j31J78j87P3J67K30n76L39o7P3k14
4143b3J33Jj85M7J2rj66q9P9L49m01J85k41J19l3K49m1rq8J77Q2m2k5j01L38k93
4169B5j1N9J18j59j22m6J41Q3j95Q6J11l82J25J75j05k6%k59L34r9n4K59K1m5
4193C4Nm0j9J93J31k42J01j58J26MJ53j03J7M4j12l08J60N7j62K00l46L8K03Q2
4217E8j94n4P4l8m0J01Q5k46L31j54l3K24l55O9J46K65j18l41N71k32J90l67K36
$$ plain form
4240 178 339 -121 -96 -207 -26 -229 -290 -103 -228 -308 58 -404 -242 -105 -10 -313 -179 -37 183 -58 118
4261 118 1 51 206 231 214 310 218 26 86 97 93 105 -54 59 -309 -77 60 -349 -221 14 -78 -310 128 -160
4285 -160 -351 -79 -45 -20 -195 -235 86 -56 -120 108 296 226 275 -28 -3 -14 -32 25 -115 249 44 -12 -109 -95
4309 -95 -537 16 -225 -199 -157 -235 -208 -4 -79 -142 55 21 -47 -241 -44 -79 -18 178 179 82 -10 232 137 12 174
4334 174 393 62 125 95 421 -175 101 68 -43 -26 20 -52 -355 21 -195 -260 -61 -57 -202 160 68 83 -36 55
4358 55 195 39 -36 34 102 243 84 125 227 62 -66 138 -54 -6 -201 119 -143 -211 -103 -288 237 -22
4380 -22 -43 -229 -364 -318 50 143 -14 -69 4 122 124 54 38 35 194 214 183 186 401 116 162 -94 7 33 -38 -72 -32
4407 -32 64 -61 -161 -266 -240 -144 -16 249 -102 -229 5 83 43 -39 207 -182 -243 85 113 172 69 -143 195
$$ packed form
4240A78J61m60K5j11J81k03o1J87j25q0L66m62J62J37R5l03J34J42K20k41J76
4261A18j17N0J55K5j7R6r2j92O0J1mJ2j59J13l68K32J37m09J28K35r2k32M38k88
4285a60j91K72L4K5j75m0L21j42o4K28J88p0M9l03K5j1j8N7j40L64k05n6r7J4
4309i5m42N53k41K6M2p8K7K04p5o3J97l4o8j94J97l5O1J96Jr7r2K42r5j25J62
4334A74K19l31O3l0L26n96K76l3j11J7M6p2l03L76k16o5J99Mj45L62r2J5j19R1
4358E5J40j56p5P0O8J41j59M1J02j65j28K04j92M8j95L20k62o8J08j85N25k59
4380b2k1j86j35M6L68R3j57n5P3J18Kp0j6lJ59K0l1LK15k85M6k56J01K6p1l4M0
4407c2R6j25j00j05K6R6J28K65l51j27K34P8m0q2K46l89o1L28K8N9j03k12L38
$$ plain form
4430 195 243 -57 -100 26 -114 -48 158 13 46 -46 -91 -144 55 -54 115 -114 -93 -73 63 -49 -170 245 -34
4453 -34 -238 219 132 51 -193 230 -44 100 318 114 164 99 156 82 -76 -107 -208 67 195 -4 -240 22 -75
4476 -75 -94 -32 9 271 -78 75 61 -136 133 135 -106 -16 235 205 -14 17 -56 175 39 160 47 12 -198 28
4500 28 -118 -63 -188 72 140 108 -88 -16 55 -163 129 -78 -128 30 -12 44 13 36 200 -43 182 -106 93 183
4524 183 -112 257 137 -94 -7 67 -106 -3 -20 -98 68 161 -274 -135 -114 138 41 -143 -2 -186 4 -10 100
4547 100 188 102 -13 -210 -124 -165 -144 88 63 79 -224 82 -144 -43 -145 -159 90 -166 -25 -109 90 -336 165
4570 165 -159 8 54 26 -112 -72 225 85 -237 -87 104 -268 73 -66 290 -67 104 -156 -73 -92 219 61
4592 61 76 -80 258 144 129 259 98 -408 99 -198 -6 19 -128 -128 -35 63 -305 80 112 63 -150 -30 109
$$ packed form
4430A95M8l00m3J26j40O6K06j45L3r2m5n3J99j09J69k29K1K0J36j12j21M15k79
4453c4k04M57q7q1k44M23k74J44K18k04N0o5N7p4j58l1j01K75J28j99k36K62r7
4476g5j9O2M1K62l49J53j4j97K69Kk41R0K51l0k19L1p3K31j36J21j13l5k10K26
4500B8j46N5j25K60O8l2j96P2P1k18K92k07n0J58m2N6l1K3J64k43K25k88J99R0
4524A83k95L69j20k31Q7P4j73J03j7p8J66R3m35J39K1K52r7j84J41j84J90j4J10
4547A00Q8q6j15j97Q6m1K1K32k5J6l03L06k26J01j02j4K49k56J41q4J99m26N01
4570A65l24J67M6k8j38M0K97j40l22J50J91l72L41j39L56l57J71k60Q3j9L11j58
4592F1J5j56L38j14j5J30j61n06N07k97J92K5j47%R3R8l68L85L2m9k13J20J39
$$ plain form
4615 109 -128 -6 -74 -22 107 -205 81 -102 161 -24 141 59 -44 11 -121 -97 38 -163 -204 -217 -39 -218
4637 -218 -331 -255 -196 127 118 -134 -90 170 -38 -117 -53 96 -7 136 85 99 -60 238 1 134 -36 -75 -25 -17
4661 -17 -131 58 -29 -226 -104 -79 -22 -80 -88 -272 -139 -32 171 -15 -19 72 108 113 -72 -63 -295 85 -227 -52 82
4686 82 117 258 39 242 -162 130 -71 -89 135 -5 -122 73 87 60 -148 -122 -13 63 -10 -32 136 176 233 -74
4710 -74 -75 38 98 57 22 165 232 -83 -84 146 194 173 250 27 -3 -130 266 132 -37 -45 -60 63 -113 -171 -105 36
4736 36 19 -160 -3 214 -16 -144 -34 190 -122 30 -42 40 247 5 41 8 -252 142 -59 -14 163 48
4758 48 -160 -81 -14 -290 2 109 -503 -214 -75 24 -57 142 -62 -31 -67 -1 24 -150 -37 -125 186 82 -27
4781 -27 -33 108 88 -99 32 171 100 -46 -92 207 -61 -39 26 -139 -9 148 46 68 -65 -192 -261 223 -140
$$ packed form
4615A09k37J22o8N2J29l12K86j83K63j85J65q2j03N5j32K4J35k01m1j3J78j79
4637b18j13P6N9L23rk52M4K60k08p9O4J49j03J43n1J4j59K98k37J33j70l9N0Q
4661a7j14J89q7j97J22K5N7n8qj84J33J07K03j86mR1L6Nj85Rk32L80l12J75J34
4686H2L5J41k19K03m04K92k01j8K24j40j17J95J4k7k08K6J09P6p3k2J68M0N7l07
4710g4jJ13O0m1l5J43O7l15jK30M8k1P7k23l0j27L96j34j69qj5J23j76n8O6J41
4736C6j7j79J57K17k30j28J10K24l12J52p2Q2K07k42L6l3k60L94k01M5J77j15
4758D8k08P9O7k76K92J07o12K89J39R9q1J99k04L1l6O6K5j74J13q8L11j04j09
4781b7oJ41k0j87J31J39p1j46m6K99k68K2O5j65J30J57j02K2j33j27o9M84l63
$$ plain form
4804 -140 -163 -63 52 -18 -75 -118 -45 196 -1 -198 55 3 145 -35 195 24 -90 -115 54 33 -6 170 -96
4827 -96 129 -24 124 -215 50 88 58 25 100 121 -29 220 -113 -254 74 -109 -63 247 -131 68 9 -108 -53
4850 -53 203 131 80 62 -72 77 109 -112 -25 60 194 105 -18 148 -94 -91 -172 1 156 -242 -20 -229 5 -37
4874 -37 32 -47 -137 35 -38 -68 2 61 5 18 -8 -107 -28 130 -139 62 7 -86 92 -190 -103 -154 258 81 -72 -113
4900 -113 -81 -164 93 -68 149 -96 -23 -131 -17 116 64 222 200 43 128 -29 -152 8 -93 -244 211 29
4922 29 70 91 163 -214 97 -62 -19 171 -103 113 142 -42 68 130 3 -176 -295 251 -177 -78 -188 -178 224
4945 224 -33 -41 15 215 -54 -52 67 -365 -69 12 -102 -154 -33 -77 229 -78 91 -53 -84 -107 35 -66 76
4968 76 103 -19 -44 133 42 -94 -21 139 -46 105 220 28 -80 -152 187 -120 -34 -234 -146 96 -93 199 -58
$$ packed form
4804a40k3J00J15p0n7m3P3K41j97j97K53n2J42j80K30j71j14k5J69k1l9J76k66
4827i6K25j53J48l39K65L8l0l3P5K1j50K49l33j41L28j83M6L10l78J99n9j17N5
4850e3K56p2n1j8j34J49L2k21Q7Q5J34q9j23J66k42Lq1J73J55l98K22k09K34m2
4874c7O9p9r0J72p3l0P0N9n6J3k6r9P9J58k69K01n5r3J78k82Q7n1M12j77j53m1
4900a13L2q3K57j61K17k45P3j08J14J33n2J58k2j57Q5j57j23J60j01j51M55j82
4922B9M1K1P2l77L11j59M3J90k74K16K9j84J10O2j27j79j19N46m28R9j10J0M02
4945B24k57qN6K00k69KJ19m32K96Q1j14n2J21m4L06l07J69j44l1k3J42j01J42
4968G6K7j22k5J77r1j36P3J60j85J51J15j92j08p2L39l07Q6k00Q8K42j89K92k57
$$ plain form
4991 -58 -244 10 -263 -17 -138 -108 104 -15 -55 129 -241 -104 114 -24 409 87 62 89 15 -204 -24 -24 54
5014 54 3 -217 -64 -115 -127 155 -244 84 -76 31 12 -2 15 -81 4 -281 79 -204 -144 -164 34 -39 -57 -410
5038 -410 -117 178 -34 -158 -84 114 24 96 154 195 -24 27 5 84 -24 4 -53 56 -89 -49 52 175 -53 141
5062 141 148 -86 189 -212 -230 -82 -55 -67 14 196 133 -246 49 47 41 -48 206 172 -139 0 -96 -139 196 -37 -89
5087 -89 -245 -167 -231 16 50 -66 -341 126 -97 -305 -189 -131 154 -134 -221 -6 -252 76 67 -193 -55 -51 26 145
5111 145 -59 -1 110 106 110 111 -224 -3 32 105 67 -38 37 12 139 111 -115 -34 -64 -123 227 -168 -103 -29 29 -91
5137 -91 -245 184 -80 -74 -106 -160 -50 -45 192 165 -109 232 179 -45 157 209 -45 -161 90 -7 226 93 -100 -166
5161 -166 160 -109 -20 -103 -200 188 -42 71 -183 -74 -28 -267 -112 21 -74 26 35 -99 43 115 120 -113 119
$$ packed form
4991e8j86K54k73K46j21L0K12j19m0J84l70J37K18j38M33l22k5K7p4k19J80%P8
5014E4n1k20J53n1j2K82l99L28j60J07j9j4J7r6Q5k85L60k83O0k0J98p3j8l53
5038d10K93K95k12j24P4J98r0P2N8M1k19N1k2P9j08K8n7J09j45M0J01J23k28J94
5062A41Pk34K75m01j8J48K7j2Q1J82o3l79K95koq9K54l4l11J39r6m3L35k33n2
5087h9j56P8o4K47L4j16k75M67k23k08J16N8K85k88q7K15k46L28rk60J38MP7J19
5111A45k04N8J11mMJl35K21L5P3l8j05P5k5J27k8k26Q1l0n9L50l95O5P4N8j20
5137i1j54M29k64Ol2n4J10NK37k7k74L41n3k24K02N2k54j16K51r7K33j33j93o6
5161a66L26k69Q9q3r7L88k30J13k54J09M6k39J55J33r5J00Rj34J42P2Nk33K32
$$ plain form
5184 119 86 196 -64 100 34 -233 144 -219 -260 34 96 -208 -13 -128 -21 29 -4 108 -88 113 119 -132 -74
5207 -74 84 47 47 -29 193 -100 132 -82 -77 196 -124 12 -43 -82 -190 -23 34 96 -142 -78 2 2 -46 -135 -145 27
5233 27 -189 -16 -3 107 134 98 44 208 -9 -168 214 -32 8 91 21 -28 246 -127 26 31 96 -179 -154 -4
5257 -4 -251 -322 -30 -112 -94 -20 65 -103 70 39 367 92 -166 -75 -233 -96 142 -42 -132 -124 195 -73 -137 -52 73
5282 73 243 -27 57 -104 -8 74 -239 122 6 62 -147 166 -67 -212 -56 17 -47 35 156 -219 -74 187 92
5305 92 -18 -274 138 111 78 172 48 93 -62 5 -20 7 86 -97 194 -195 -61 -57 -156 -186 46 -56 167 -131
5329 -131 29 -129 127 -335 -95 28 -214 88 -54 37 -2 20 47 177 95 106 148 -307 -158 -333 -18 111
5351 111 -270 67 -143 -94 190 -38 -138 -99 -281 -27 8 -91 -80 87 14 5 137 94 -109 -59 199 14 -29 32
$$ packed form
5184A19l3J10k60J64o6k67L77l63m1K94O2l04J95j15J07N0l3J12j96K01Ok51N8
5207g4J58l7%p6K22k93K32k14NK73l20J36n5l9j08J67N7O2k38O4Q0%m8q9j0J72
5233B7k16J73J3J10K7l6n4J64k17j59L82k46M0Q3p0m9K74l73J53NO5k75K5J50
5257dk47p1K92q2J8P4Q5j68J73l1L28k75k58R1j58J37K38j84r0QL19k68o4Q5J25
5282G3J70k70Q4j61R6Q2l13L61j16N6k09L13k33j45J56P3o4Q2J21l75J45K61r5
5305I2j10k56M12k7l3R4j24M5j55O7k5K7P9j83K91l89J34Mr9l0K32j02K23k98
5329a31J60j58K56m62K40J23k42L02j42R1l9K2K7J30q2J1M2m55J49j75L15J29
5351A11l81L37k10M9K84k28j00L9j82K54L5r9J1J67p3rJ32m3k03N0K58j85m3O1
$$ plain form
5375 32 323 3 -4 130 43 -230 -92 -236 35 -214 -119 -40 -81 262 -147 -118 76 -196 -225 105 -130 95 -77
5398 -77 -93 180 42 -17 251 181 -45 -37 -40 324 -109 128 172 -182 -48 43 -170 -134 234 -50 -221 -282 -44 -67
5422 -67 -132 -98 -74 1 99 -108 16 165 -83 34 132 -312 284 14 163 292 49 9 58 128 131 -57 -121 -18
5446 -18 -99 101 -223 18 -147 -180 124 -30 -56 -141 -153 40 150 119 37 -145 -138 75 120 -154 24 261 238 244 236
5471 236 258 -45 -48 115 -30 -40 138 -139 -164 -245 -106 -162 177 -138 -98 71 -211 42 131 145 196 -168 65 -103
5495 -103 39 -87 194 -21 -111 58 -17 60 -127 27 -34 -158 231 -53 -170 47 30 188 8 -147 -138 -150 -160
5518 -160 -111 86 94 -207 2 19 -76 -332 9 82 224 238 228 129 220 36 -84 84 -41 -66 -48 49 -9 -40 -62
5543 -62 -3 -81 -178 31 137 -17 -160 -15 -158 -95 -86 -156 -203 -112 167 18 -15 113 40 80 110 315 191 -20 204
$$ packed form
5375C2K91l20pJ34q7k73J38j44K71k49R5P9m1L43m09K9J94k72k9L30k35K25j72
5398g7j6K73j38n9K68p0k26QlL64m33K37M4l54J34R1k13L6L68k84j71o1K38k3
5422f7o5L4K4P5R8k07J24J49k48J17R8m44N96k70J49J29k43m0M9P0Lj88o4J03
5446a8q1K00l24K41j65l3L04j54k6q5j2J93J10l1q2j82PK13M5k74J78K37k3Oq
5471B36K2l03lJ63j45j0J78k77k5q1J39n6L39l15M0J69k82K53Q9J4N1l64K33j68
5495a03J42j26K81k15r0J69p5P7j87J54o1j24L89k84j17K17j7J58j80j55Rj2j0
5518a60M9J97Ql01K09J7r5k56L41P3J42J4j0r9R1j84j20J68j25k5J8R7n8l1k2
5543f2N9p8r7K09J06j54j43J45j43O3Rp0m7R1K79j49l3J28p3M0L0K05j24k11K24
$$ plain form
5568 204 39 80 -128 12 323 388 -6 -38 -229 -94 187 46 -253 -79 -120 -17 -50 -74 -249 118 -26 -61
5590 -61 34 -68 42 151 -32 -8 162 79 194 30 159 120 89 124 357 43 -8 64 65 54 -8 92 -57 -46 -75
5615 -75 -179 71 11 -408 -151 -63 -113 116 29 4 64 -13 5 11 225 -29 -14 93 200 169 -38 84 -93 -14 28
5640 28 -28 13 -98 -37 -87 -103 18 46 -173 -95 -297 90 -118 13 69 -169 38 -74 365 148 140 104 -36 90
5664 90 162 122 133 -217 193 91 116 121 71 -47 49 -83 -40 -283 -36 135 -124 -147 -76 -241 -43 56 -33 -24 15 -167
5690 -167 76 101 212 -201 24 102 72 6 -108 83 262 183 82 73 -94 -222 -31 -38 -41 -31 -184 94 -21 17
5714 17 -29 -67 67 -129 -155 36 225 48 -91 -182 152 99 -85 -55 86 -96 57 102 164 63 -106 186 -182
5737 -182 -112 77 -134 64 105 -287 -48 -112 -81 -136 -201 -6 -11 149 -168 -89 77 -217 -8 -44 177 -30 149
$$ packed form
5568B04j65M1k08J40L11O5l94l2j91J35K81j41k99J74m1J03l3k4j75L67j44l5
5590f1R5j02J10J09j83K4J70q3J15j64J29l9l1L5K33l14n1P2Jj1o2J00j49J1k9
5615g5j04K50o0m19K57Q8n0K29q7k5O0p7J8OK14k54J5J07J07l1k07J22j77P9M2
5640B8n6M1j11O1n0j6J21K8k19P8k02L87k08J31N6k38K07j12M39k17ql6j40J26
5664I0P2m0J1l50M10j02K5Nn0j18R6j32M3k43K47J71k59k3P1j65J98R9q9RL9j82
5690a67K43K5J11m13K25P8l0o6j14J91J79p9j01rj67j28J91plJ0j53K78j15L8
5714A7m6l8J34j96k6J91J89j77j39r1L34n3j84L0J41j82J53M5O2j01j69K92l68
5737a82P0J89k11J98M1l92K39o4L1n5o5J95nJ60l17P9J66k94K09l6K21k07J79
$$ plain form
5760 149 37 229 -29 179 -81 126 100 -62 -57 -83 -30 26 20 61 -71 -199 -41 -9 -163 -101 -132 12 -45 81
5784 81 176 31 209 -60 134 -117 51 -197 34 -39 71 263 259 157 111 -161 -213 58 -110 -84 -295 -190 -120
5807 -120 28 -109 -3 -57 -5 -112 -231 -140 222 -48 -64 -177 -137 92 -88 342 -82 -141 -143 -68 -40 134 34
5830 34 86 -22 142 -257 42 -31 -283 -239 -215 155 -118 -179 -39 -39 -214 -122 -103 -168 47 -34 -147 -151 43 348 137
5855 137 286 42 228 -36 121 89 101 -15 207 141 -67 -41 350 97 37 184 -100 95 -63 -226 -62 35
5877 35 -93 -116 78 -48 14 -76 -105 171 92 87 -86 90 126 -35 126 58 159 27 -130 -57 -233 80 31 -175
5901 -175 121 -97 -76 -113 -330 -287 -161 -7 304 -23 -60 -25 -97 -20 188 87 131 189 137 -138 141 103 99 137 12
5926 12 38 -12 212 -11 -22 -33 -83 -67 -177 -312 -117 -262 15 -202 35 -149 27 -101 -145 -166 61 47 -10 160
$$ packed form
5760A49j12J92k58K08k60K07k6j62Nk6N3N6oM1j32j28J58L2j54O2l1J44n7J26
5784H1R5j45J78k69J94k51J68k48K31p3J10J92mj02m6k72n2K71j68K6k11J05P0
5807a20J48j37J06n4N2j07j19R1L62k70j6j13M0K29j80M30m24n9kP5K8J74j00
5830C4N2j08J64l99K99p3k52M4K4L70k73o1J40%j75R2J9o5K15q1j13mJ94L05k11
5855A37J49k44J86k64J57l2J2j16K22o6k08K6L91k53o0J47k84J95j58j63J64R7
5877C5j28k3J94j26O2r0k9K76p9nj73J76L6j61J61o8J01j32j57P3j76L13m9k06
5901a75K96k18K1l7k17M3J26J54L11l27l7L5p2P7K08j01M4N8n2k75K79l8mL8j25
5926A2K6n0K24k23j1j1n0J6j10j35J95j45K77k17K37j84J76j28m4k1K27j4n7J70
$$ plain form
5950 160 176 43 344 187 -29 315 137 -42 251 131 196 60 -127 -87 -47 283 -191 1 245 32 -61 -147
5972 -147 -42 -135 -72 -17 -207 -418 -146 142 -31 141 176 -134 336 94 -2 130 60 -37 58 70 -25 90 138 -18
5996 -18 -33 26 78 141 95 -132 -67 -126 -53 -346 -263 27 -69 -88 63 -98 39 65 -124 86 42 201 66 271 205
6021 205 -87 250 405 13 0 -38 176 -98 76 -131 -216 -181 -123 -164 -292 -124 -123 -53 81 19 -157 -107 -3 62
6045 62 -166 -29 -163 11 79 200 -101 220 -212 110 292 113 70 -6 -194 4 -131 -53 -184 -207 -55 -20
6067 -20 -46 8 69 -36 -128 -127 -28 -185 -83 109 46 -201 137 145 45 6 312 157 125 240 -10 -46 223 -77 -23
6092 -23 19 -165 -98 -198 -110 8 -234 -201 -57 134 34 -114 -64 -88 173 128 -126 19 219 -88 356 -95 10
6115 10 -8 144 430 -75 134 176 -47 5 42 56 -11 174 16 -329 -95 -23 -140 -60 -122 -347 78 251 76
$$ packed form
5950A60J6j33L01j57k16L44j78j79K93j20O5j36j87M0M0L30m74J92K44k13r3q6
5972a47J05r3O3N5j90k11K72K88j73J72L5l10M70k42r6J32p0r7R5J2r5J15M8j56
5996a8j5N9N2O3m6k27O5n9P3k93Q3K90r6j9J51j61J37K6j89K10m4J59j35K05o6
6021B05k92L37J55l92j3l8K14k74J74k07q5L5N8m1j28J68JP0J34o2j76N0J04O5
6045F2k28J37j34J74O8J21l01L21m32L22J82j79m3p6j88J98j35P8j31k3J52L5
6067b0k6N4O1j05r2JR9j57J02J92o3k47L38Qj00l9L06j55l2J15k50l6K69l00N4
6092b3M2j84O7j00Q8J18k42L3J44J91j00j48N0k4K61m5k54J45K00l07M44m51J05
6115A0j8J52K86n05K09M2k23N2L7J4o7J85j58l45K34P2j17Q0o2k25M25J73j75
$$ plain form
6138 76 183 -137 114 83 1 44 10 -19 23 160 19 523 11 223 -38 -84 -22 -65 92 -61 -87 -351 -12 -188
6162 -188 4 -153 -139 -122 -138 -187 63 12 -145 26 -78 -61 47 131 184 140 81 -18 160 60 64 4 -201 62 146
6187 146 -50 42 -91 -9 -44 -155 -107 -46 0 -23 -171 -3 -130 -86 11 -103 171 -9 -3 128 -192 -114 -81 -56 137
6212 137 75 167 -122 -96 157 147 240 -104 -80 130 48 -73 129 -300 -145 -211 67 -205 49 -283 -152 -79 -46
6235 -46 60 -37 64 -77 154 228 -11 -105 -36 73 89 -104 203 93 -13 127 -57 -19 -168 68 208 -122
6257 -122 -235 -380 -53 -122 95 -83 61 -58 -46 71 -121 -41 148 -52 -76 -153 -50 275 -105 139 -7 113
6279 113 199 88 -4 67 192 -118 191 -130 -84 263 -191 -168 27 -4 -264 -210 -236 44 7 68 -19 -81 -24 -84 -240
6304 -240 115 50 170 -87 -54 125 -60 76 12 45 149 223 278 -85 -97 52 -111 -43 156 -172 -194 -38 -138
$$ packed form
6138G6J07l20K51l1q2M3l4k9M2J37j41N04n12K12k61m6O2m3J57j53k6k64L39j76
6162a88J92j57J4J7j6m9K50n1j57J71j04J7J08Q4N3m4n9r9J78j00Mo0k05K63Q4
6187A46j96R2j33Q2l5j11M8O1M6k3j48J68j27M4R7j14K74j80OJ31l20P8L3K5J93
6212A37o2R2k89K6K53j0R3l44K4K10q2j21K02m29J55o6K78k72K54l32J31P3L3
6235d6J06r7J01j41K31P4k39r4O9J09J6j93L07j10j06J40j84L8j49K36J40l30
6257a22j13j45L27o9K17j78J44j19J2J17j92Q0J89k00k4p7J03L25l80K44j46J20
6279A13Q6j11r2P1J25l10L09l21M6L47m54K3J95l1k60N4k6K80l7O1q7o2N7o0j56
6304b40L55o5J20k57L3J79j85J36o4L3J04P4N5l63j2J49j63O8J99l28k2J56j00
$$ plain form
6327 -138 -231 162 43 -62 83 -179 -109 48 -5 -61 -277 182 -4 150 80 31 -193 322 227 41 122 179 85
6350 85 -311 47 -337 -30 -204 140 -348 -242 -72 -49 -298 2 -94 -169 89 -133 101 -149 -7 249 -182
6371 -182 -157 226 153 96 -40 8 54 -90 153 152 310 329 -181 -250 32 16 -157 109 -272 -21 81 -12 69 -152
6395 -152 -34 -96 -24 -19 -107 -64 185 -122 61 -167 249 155 377 -5 70 -42 118 -130 56 141 111 -215 -315
6418 -315 82 -76 -114 -169 55 18 -268 49 -329 17 -218 -16 -124 -88 -1 0 230 372 262 34 54 137 42
6441 42 -292 -76 -52 -114 -19 43 98 -150 -25 -33 -397 -334 -45 -186 -353 -245 -26 -288 -271 80 -202 163 -35
6464 -35 213 -32 46 82 112 116 97 -43 87 75 157 34 -50 40 -202 63 156 104 15 -76 -100 76 28 22 -284 46
6490 46 -8 -41 -238 240 -61 57 -82 -119 -126 143 -68 -8 292 -25 240 369 15 141 78 -74 90 -41 -150
$$ packed form
6327a38r3L93j19j05J45k62P0J57n3n6k16M59j86J54p0m9k24N15r5j86Q1N7r4
6350H5l96L58l84L07j74L44m88J06J70K3k49L00r6p5K58k22K34k50J42K56m31
6371a82K5L83p3n7j36M8M6j44K43jJ58J9n10o9K82j6j73K66l81K51J02r3Q1k21
6395a52J18o2P2Nq8M3K49l07J83k28M16r4K22l82P5j12J60k48J86Q5l0l26j00
6418c15L97j58l8n5K24l7k86L17l78L46k35K02j08L6Q7JK30J42j10k28K0Q3r5
6441D2l34K16K4o2R5O2N5k48J25ql64O3K89j41j67J08K19k62J7L51k82L65j98
6464c5K48k45P8L6L0Mj9j40J30j2Q2j23q4R0k42K65R3n2q9r1k4J76m8ol06L30
6490D6n4l3j97M78l01J18j39l7pK69k11O0L00l17K65J29l54J26o3j52J64j31j09
$$ plain form
6513 -150 -200 101 184 44 -224 -64 -232 23 -69 -237 -118 -86 -141 -90 -184 176 -73 -290 -33 -10 208 83 287
6536 287 94 -13 72 305 133 -40 106 96 -119 -210 133 112 189 -114 -44 -466 -142 -407 -86 -269 16 9 95
6559 95 -46 -17 4 -82 -188 -88 413 91 188 80 141 -58 43 214 67 -174 2 42 -2 -84 -232 -31 -316
6582 -316 38 -6 -125 -245 -261 -126 -201 -15 105 80 -78 -140 -197 120 -57 135 80 202 -82 0 40 151 103
6605 103 -133 -116 36 320 -333 238 -53 -90 -122 92 -415 118 -172 -343 -8 236 -180 -18 -65 -164 139 56
6627 56 95 -64 135 226 136 238 102 259 -254 194 74 42 154 27 -182 -10 -234 -310 -201 -257 137 -62
6649 -62 -70 -217 50 -73 -91 -134 46 -165 184 -90 0 210 177 176 235 266 268 40 -4 210 -7 151 356 -22 -49
6674 -49 -270 -154 -123 -14 -6 -233 177 -159 -18 58 -78 -149 -275 -156 -93 -45 72 179 48 175 122 21 314
$$ packed form
6513a50n0L01Q3j40k68J60j68K55r2j68J19L2n5N1r4L60k49k17K57K3K18j25K04
6536B87j93j07Q5K33j72j73J46j0k15r1L43k1P7l03P0m22L24k65L21j83K85pQ6
6559I5j41K9K1q6j06J00N01l22R7j08O1j99J01J71j47k41J76M0m4q2j48K01k85
6582c16L54m4j19j20j6J35p5J86J20k5j58o2n7L17j77J92n5J22k84Q2M0J11m8
6605A03k36J7J52K84o53N71k91l7l2K14n07N33k90j71L35K44m16J62m7r9L03q3
6627E6L9j59J99R1r0J02j36J57n13M48j20l2J12j27k09J72k24p6J09n6L94j99
6649f2qj47K67j23j8m3J80k11L49k74R0K10l3jN9L1Kk28m4K14k17J58K05l78k7
6674d9k21J16L1J09Qk27M10l36J41P6j36p1j26J19O3M8J17J07j31J27n3j01K93
$$ plain form
6697 314 338 271 -79 64 159 33 79 -111 -56 -138 26 -85 -190 -281 -159 -273 -247 -60 44 -26 -75 -35 -96 -277
6721 -277 -19 207 198 3 -119 84 262 249 214 118 112 -44 -33 259 -71 200 -30 -128 102 -2 -194 71 58
6744 58 -295 1 -285 -43 -62 128 -116 124 -49 -91 136 297 3 200 70 262 -14 384 -9 290 194
6765 194 145 -27 32 89 -1 -102 91 -27 -234 66 -150 -215 -155 67 79 -186 -450 -149 15 -127 -58 313 -237
6788 -237 56 125 152 25 62 105 -57 215 -59 50 -2 -182 -194 12 84 -109 -58 -157 105 14 -65 -153 -302 -193
6812 -193 -135 138 -177 -82 -40 85 -149 95 185 140 182 -121 136 9 236 134 42 216 102 -126 71 -274
6834 -274 54 -73 -57 -27 -250 -147 -268 -19 -171 -176 96 -225 166 -173 -126 -8 2 -120 -127 -77 156 -21 347
6857 347 453 134 -96 192 89 -174 249 -11 10 74 -142 -391 138 -135 -122 -233 -165 -222 -172 -63 -239 -16
$$ packed form
6697C14K4o7l50J43R5j26M6j90N5q2J64j11j05r1J22j14K6J87J04p0m9M0o1j81
6721b77K58K26rj95j22K03J78j3l5r6oj56J1K92l30K71k30r8K30j04j92K65j3
6744E8l53K96k86K42j9J90k44K40j73m2K27J61k94J97j30J92k76L98l93K99r6
6765A94m9j72N9N7r0j01J93j18k07L00k16o5O0K22J2k65k64L01J64j42O9L71n50
6788b37K93O9K7j27L7M3j62K72k74J09n2j80j2K06P2j93N1r9K62r1p9q8j49J09
6812a93N8K73l15R5M2J25k34K44R0m5M2l03K57j27K27j02r2J74j14k28J97l45
6834b74L28j27J6L0k23J03j21K49j52nK72l21L91l39M7J18J0j22pN0K33j77L68
6857C47J06l19k30K88j03k63M23k60K1O4k16k49N29k73J3j11O8n7N0J09j76K23
$$ plain form
6879 -16 -61 60 -104 193 71 -111 -43 -82 240 2 -6 -66 35 125 -31 2 202 40 47 20 -295 -22 -24 -291 -244
6904 -244 -333 -87 -330 -155 -317 -60 -202 -222 -11 123 15 -65 52 310 74 77 161 61 139 -35 315 -51
6926 -51 51 185 -123 107 77 97 95 -122 -91 -3 -235 -136 -8 -155 -318 -281 -133 -34 -59 124 143 142 -53 -23 200
6951 200 22 111 387 -150 366 209 31 113 136 -68 -64 231 155 62 5 59 -147 60 -247 -467 -260 -204 -228 -307
6975 -307 -197 -132 -26 320 340 7 245 37 77 80 240 89 50 28 113 130 81 230 189 76 53 63 303 -122
6999 -122 -165 -235 -175 69 -132 53 106 -168 -171 -56 -245 341 -97 87 107 63 118 222 132 233 113 -239 185
7022 185 -154 -17 -4 320 -208 203 119 -137 -62 -280 -79 -164 -299 -129 -255 -263 -93 -180 -244 191 -235 72 79
7045 79 62 -27 6 96 83 121 14 41 -84 370 -84 67 54 -61 -206 -49 -154 -101 -141 -138 -328 -67 -482 40
$$ packed form
6879a6m5J21j64K97j22j82O8l9L22k38qo0J01R0j56L3K00j62Pk7l15K73kk67M7
6904b44q9K46k43J75j62K57j42k0K11J34j08q0J17K58k36LQ4j00P8j74L50l66
6926e1J02J34l08K30l0K0kk17L1Q8k32R9J28j47j63L7J48R9k5J83J9jj95L0K23
6951B00j78Q9K76n37N16j57j78Q2K3k04MK95p6r3n7N4k06K07l07k20K07N6k4p9
6975c07J10O5J06L46K0l33K38k08M0LJ60j51l9k2Q5J7m9J49m1j13k3J0K40m25
6999a22m3p0O0K44k01J85N3k74lJ15j89N86m38J84K0m4N5J04r0J01j20l52M24
7022A85l39J37J3L24n28M11q4k56P5k18K01q5j35J70j26qJ70q7o4M35m26L07P
7045G9j7q9L3R0j3L8j07K7j25M54m54J51j3j15j45J57j05N3m0Lj90K61m15N22
$$ plain form
7069 40 -68 -19 43 -100 186 4 -121 161 27 131 38 216 281 180 346 89 228 1 111 22 283 124
7091 124 22 -81 47 72 -432 -41 -246 -143 -241 -182 -29 -316 -97 -79 108 -70 6 -44 108 81 40 190 120
7114 120 327 36 -47 46 262 197 -25 78 92 -160 8 124 76 154 -304 -178 60 -93 -118 48 109 -13 30
7137 30 16 -25 4 59 -151 276 32 118 215 278 76 353 -162 118 173 -23 113 -113 9 -199 68 45 -60
7160 -60 -184 -157 -108 -133 -139 -265 37 -148 114 -196 -63 -58 10 -56 193 -8 -102 114 145 282 136 151 64 326 116
7185 116 -121 69 30 91 -104 -7 48 7 -244 -138 -94 -113 1 -124 -143 -265 -78 -50 159 137 -11 1 15 -117
7209 -117 191 175 70 70 75 175 323 90 -137 75 -113 -43 -61 173 73 -335 144 -117 -263 41 -236 0
7231 0 51 53 15 -216 -141 -123 -115 -8 253 29 39 -21 297 -43 -30 169 146 225 -146 229 19 -61 19 -102 -112 23
$$ packed form
7069D0j08M9O2j43K86j82j25K82j34J04r3J78O5j01J66k57J39k27J10q9K61j59
7091A24j02j03J28K5n04L91k05J03r8N9J53k87K19J8J87j78P6n0J52k7m1J50p0
7114A20K07k91q3R3K16o5k22J03J4k52J68J16m8P8m58J26K38j53k5J66O1j22M3
7137C0j4m1K9N5k10M27k44Q6R7O3k02K77n15K80N5j96J36k26J22k08K67k3j05
7160f0j24K7M9k5oj26L02j85K62l10J33NO8o6K49k01r4K16L1J37j46J5q7K62k10
7185A16k37J90l9O1j95R7N5m1k51J06M4j9J14j25j9j22J87K8K09k2j48J2J4j32
7209a17L08j6j05%NJ00J48k33k27K12j88P0j8K34j00m08M79k61j46L04k77K36
7231@N1Kl8k31P5J8QJ07K61k24J0o0L18l40J3J99k3P9l71L75k10q0Q0j21j0J35
$$ plain form
7257 23 -46 -163 -156 155 -365 -342 -39 -175 -120 116 -87 2 133 22 96 -6 89 -12 -96 -10 181 42 238 -184
7281 -184 -15 -62 -366 132 -28 -107 54 -95 -24 -16 -121 12 -50 -72 -289 -92 -428 -350 -90 -189 119 40 12 178
7305 178 408 331 245 -6 303 122 131 145 241 123 -94 188 21 -99 -202 -94 -105 -76 -231 -106 -240 -1 -150
7328 -150 -124 -108 -155 -204 -116 266 -81 -18 -107 208 38 30 93 10 56 342 350 -49 148 75 -149 -183 78 -36 -204
7353 -204 -44 -110 -187 -105 -105 -311 -210 -295 46 -29 203 -126 69 23 -201 130 32 88 35 -87 150 83 17 67 -215
7378 -215 61 157 70 -21 -65 -21 -4 -182 -173 -182 -294 -125 -190 6 59 -93 -192 -82 -15 10 72 -57 -114 -44 339 238
7404 238 125 334 121 28 246 17 -134 119 51 74 -191 -196 -28 -218 -55 -33 -115 -283 -5 -204 -44 -211
7426 -211 -98 -103 109 19 27 53 135 28 190 -3 40 191 108 390 147 47 101 -175 138 175 -7 -97 67 -257
$$ packed form
7257B3o9j17PL11n20K3L03j36N5K36k03Q9J31j11P4j02R5j01q4Q6J91j39J96m22
7281a84J69m7l04M98j60p9J61j49P1Qj05J33o2k2k17J97l36P8K60r9L08p9k8J66
7305A78K30p7q6k51L09j81RJ4R6j18k17K82j67j20j03J08j1K9j55J25j34K39j49
7328a50K6J6m7m9Q8L82l47O3q9L15j70qO3q3M6K86Ql99J97p3k24l4K61j14j68
7353b04J60o6p7Q2%k06J01q5L41p5K32l29J95m6k24L31r8N6n3j22K37o7o6N0k82
7378b15K76R6q7r1m4M4J7j78Rrj12J69o5J96N3j52r9J10O7K5O2j29n7P0L83j01
7404B38j13K09k13r3K18k29j51K53o8K3k65nJ68j90J63K2q2j68K78j99J60j67
7426b11J13nK12r0QK6Q2j07J62j93M3J51q3K82k43j00N4k76L13L7j82r0J64l24
$$ plain form
7450 -257 -46 -41 -211 0 133 -221 -159 -276 213 -175 152 26 -105 137 -23 -9 338 267 231 131 -18 67
7472 67 250 99 62 136 -34 -91 12 -5 -226 105 -184 -236 -92 -127 -180 -137 -33 -198 -272 -27 -62 94 175 -88
7496 -88 268 -74 264 -81 92 10 -264 229 60 205 27 194 -8 14 -184 196 44 91 243 -178 -371
7517 -371 -107 -163 22 -283 -137 -154 -72 -124 -74 -129 230 -76 106 241 13 -132 76 154 100 201 -124 -107 52
7540 52 158 153 1 -15 112 -41 -121 -90 15 -71 -191 -53 -146 -199 -181 -208 -76 -25 -171 158 -77 -55 167 137 87
7565 87 177 153 71 -48 141 125 168 114 0 -34 -34 72 -243 -361 -169 -152 -245 -114 -79 -24 80 26 -103 -125 -133 -83
7591 -83 -214 -141 91 157 20 51 63 392 82 -31 202 266 153 108 142 77 -58 -2 -168 68 -22 -127 -85 -235
7615 -235 18 203 -195 14 -231 -191 -7 -5 201 -64 -250 172 15 203 127 101 115 147 158 85 13 -108 234
$$ packed form
7450b57K11Nj70K11J33l54O2j17M89l88L27j26j31K42j60J4L47p1l6j00j49Q5
7472F7J83j51l7P4j70n7J03j7k21L31k89n2J44l5n3M3J04j65p4K45l5J56Q1k63
7496h8L56l42L38l45J73q2k74M93j69J45j78J67k02K2j98L80j52M7J52m21j93
7517c71K64n6J85l05J46j7Q2n2N0n5L59l06J82J35k28j45K08P8n4J01l25J7J59
7540E2J06nj52j6J27j53q0L1J05q6j20J38r3n3J8k7J32N1j46L29k35K2K22l0n0
7565H7R0k4q2j19J89j6M3n4j14l4%J06l15j18J92J7r3J31L5N5J04n4j29k2qN0
7591h3j31P3K32O6j37L1J2L29l10j13K33O4j13m5L4o5j35N6j66K36r0j05M2j50
7615b35K53J85l98K09k45M0J84KK06k65j86M22j57J88p6k6J4L2J1p3p2j21L42
$$ plain form
7638 234 191 154 -80 190 -359 -272 17 -293 -237 -59 -151 -110 -28 83 8 -166 -237 165 -174 68 90 -20 42 -112
7662 -112 236 107 59 57 197 41 119 205 4 294 -90 -220 -80 9 30 -66 1 -34 -307 -53 -87 -118 -460 -148
7686 -148 -34 36 77 -16 367 71 275 292 90 290 8 110 124 116 338 -224 -95 -167 -313 63 -163 -267 -5
7709 -5 -162 -37 -145 -280 -277 -3 -154 -150 -109 -54 296 -21 -74 46 261 194 383 196 277 43 394 36 168 137
7733 137 100 75 5 172 -82 -154 20 -41 -277 44 -229 20 -132 -43 -267 247 -49 137 -172 -275 24 148
7755 148 -68 -133 29 -90 236 95 133 251 271 2 201 -2 248 -51 -110 11 -136 -150 -556 -309 -220 -37
7777 -37 -164 -178 197 -215 -233 -10 -51 384 -78 70 194 277 -27 195 237 80 -27 420 28 -12 184 336
7799 336 -151 -146 18 -100 197 -136 -205 -59 -202 -58 -207 -262 -143 -164 -248 101 13 -37 134 11 220 111 162
$$ packed form
7638B34m3l7k34K70n49Q7K89l10N6J78r2M1Q2J11p5j74p1M02l39K42K2j10O2j54
7662a12L48j29m8kJ40j56P8Q6k01K90l84j30J40Q9K1r6O7l5k73K54l4l1l42L12
7686a48J14P0M1r3L83k96K04J7k02K00k82J02J4qK22n62J29p2j46L76k26j04K62
7709ej57J25j08j35LK74j51MM1N5L50l17n3J20K15o7J89j87Q1k34L51l58J32l1
7733A37l7k5p0J67k54p2J74o1k36L21k73K49j52Q9k24N14k96J86l09j03K99J24
7755A48k16o5J62j19L26j41L8J18K0k69J99k03K50k99n9J21j47j4m06K47Q9J83
7777c7j27j4L75m12j8K23m1M35m62J48J24Q3l04K22M2j57j07M47l92m0J96J52
7799C36m87NJ64j18K97l33o9J46j43J44j49n5J19k1q4L49q8n0J71j23K09j09N1
$$ plain form
7822 162 -138 274 258 43 149 46 314 325 -119 -27 62 -12 53 -111 -165 -83 23 -182 69 -458 -8 -39 92
7845 92 55 -154 -226 -2 -109 24 161 218 156 -99 45 91 -128 210 -106 279 237 3 -54 58 283 85 -68
7868 -68 -174 -279 -37 -82 -40 -56 -258 -160 -189 114 -292 -117 -80 4 -120 81 20 150 -201 -20 23 35 76 392
7892 392 314 -245 135 172 200 18 -198 20 -156 -219 226 -115 13 -247 -41 108 40 -252 -42 66 -7 -18
7914 -18 -24 -416 164 139 -159 120 231 197 93 240 103 -43 160 25 66 383 21 139 66 -193 -205 -10 -196
7937 -196 -51 -412 -63 -212 -251 -2 -27 -39 122 -21 78 -198 185 82 -8 142 219 -4 186 239 124 78 0
7960 0 -119 -69 127 46 -14 -171 -149 -123 22 -210 -164 -239 -48 -102 -94 -86 -44 12 -185 -59 -33 136 333 44 115 93
7986 93 365 189 -26 -10 -216 13 52 146 -195 -107 -91 -77 -277 -105 -127 -110 -321 -250 127 -247 -33 -366 48
$$ packed form
7822A62l00M12j6k15J06j03K68J1m44R2Q9p4O5j64n4Q2J06k05K51n27M50l1J31
7845I2l7k09p2K24j07J33J37N7o2k55J44M6k19L38l16L85m2k34n7J12K25j98j53
7868f8j06j05K42m5M2j6k02R8k9L03m06J75L7Q4j24K01o1J30l51J81M3J2M1L16
7892C92p8n59L80L7K8j82k16K18j76o3M45l41J28k60K06J49o8k92K10J08p3j1
7914a8ol92N80k5k98K79J11l4j04J47j37j46K03j35M1L17l62J18p3k59j2J95j86
7937a96J45l61L49j49l9K49k5j2J61j43R9k76L83j03r0J50P7k23J90N3j15m6p8
7960@j19N0J96q1o0j57K2K6J45k32M6p5J91n4QQM2N6j97J26K6J69J97k89P1k2
7986I3K72j76k15J6k06K29L9R4l41Q8J6J4k00J72k2J7k11P1L77l74K14l33M14
$$ plain form
8009 48 -212 -191 132 -14 191 -54 -25 -174 27 20 210 -199 144 129 15 -2 17 237 96 -76 75 -150 -120
8032 -120 -220 -286 -162 -111 9 -189 -250 -254 9 -11 -164 -153 -1 -15 289 114 231 264 4 141 2 57 -30 127
8056 127 220 -243 -26 -103 -124 26 -66 -310 -11 -94 -194 -136 49 -81 -35 -138 -131 -227 -5 -103 152 113 217 -89
8080 -89 30 220 178 61 322 98 217 -18 -101 300 296 -76 -4 108 -45 -68 -230 -120 -110 70 -111 2 -98
8103 -98 -75 41 -153 -67 12 132 -100 20 21 219 -195 -36 -139 168 67 124 53 59 76 251 158 -35 0 -352
8127 -352 -203 -184 -17 -154 -255 -189 -238 -191 -237 -225 -128 -4 172 242 75 -144 90 272 -173 -33 -4 -12 -104 92
8151 92 4 26 80 300 102 -263 231 78 -132 372 -208 -157 -64 -199 -71 4 52 -114 -73 -22 -149 169 83 -187
8175 -187 190 155 444 56 104 339 137 279 292 5 -84 100 163 -249 -53 92
$$ packed form
8009D8k60K1L23j46K05k45K9j49K01pJ90m09L43j5j14j7J9K20j41j72J51k25L0
8032a20j00o6J24N1J20j98o1mK63k0j53J1J52j4L04j75J17L3k60J37j39N5q7J57
8056A27R3m63K17p7k1J50r2k44K99q3j00N8J85j30M6j03Pr6K22r8K55l9J04l06
8080h9J19J90m2j17K61k24J19k35q3M01ml72P2J12j53k3j62J10J0J80j81J13j00
8103i8K3J16j94Q6P9J20k32J20JJ98m14J59j03L07j01N7p1OJ7J75r3j93L5l52
8127c52J49J9J67j37j01O6m9M7m6J2R7J24J76P0j67k19K34J82m45J40K9qr2J96
8151I2q8K2N4K20j98l65M94j53k10N04n80N1R3j35J28P5M8j66M1N1j27L18q6k70
8175a87L77l5K89l88M8K35k02J42J3k87q9J84O3m12J96J45
8191I2
$$ Imaginary data points
##PAGE= N=2
##DATA TABLE= (X++(I..I)), XYDATA
$$ plain form
0 0 0 0 0 0 0 0 0 0 0 0 0 0 0 0 2 -8 8 -8 8 -8 16 -16 16 -24 24 -30 32 -40 45 -48 56 -64 72 -85 95 -105 119
37 119 -133 149 -165 183 -204 226 -250 276 -304 336 -370 406 -449 494 -546 601 -664 735 -815
56 -815 904 -1010 1136 -1285 1464 -1689 1976 -2363 2904 -3727 5104 -7840 15327 -77432 -223458
71 -223458 36236 177007 1101 -124754 23018 122926 39816 -21028 30947 53223 47307
82 47307 61525 28809 -48480 -12668 91747 55330 -80247 -74207 34418 28788 -62446 -62243
94 -62243 -8758 -17838 -44445 -30232 -33981 -46584 -651 35035 -27036 -70035 12095 81478 21436
107 21436 -34786 16920 64236 31659 9844 32615 34459 22523 32513 19746 -19374 146
119 146 50498 11419 -63915 -32522 34352 -11250 -74921 -21872 27136 -45419 -86209 2586
$$ packed form
0@%%%%%%%%%%%%%%Kj0J6j6J6j6K4l2L2m0M8n4O2p2Q5r3J04j20J36j57J80k00K24
37A19k52K82l14L48l87M30m76N26n80O40p06P76q55R43j040J147j265J399j550
56h15J719j914K146k421K749l153L665m339N267o631Q831j2944K3167r2759j46026
71b23458K59694J40771j75906j25855J47772R9908q3110o0844N1975K2276n916
82D7307J4218l2716p7289L5812J04415l6417j35577O040J08625n630r1234K03
94f2243N3485r080k6607J4213l749j2603M5933L5686o2071m2999Q2130O9383o0042
107B1436n6222N1706M7316l2577k1815K2771J844j1936R990j2767l9120J9520
119A46N0352l9079p5334L1393O6874m5602o3671N3049M9008p2555m0790Q8795
$$ plain form
131 2586 41934 -47045 -70266 28796 49987 -39630 -42169 55600 64767 -15180 -18473 46237 50796
144 50796 13411 17390 29146 10724 11142 29910 7680 -22753 4452 26987 -20803 -54945 -8670
157 -8670 20632 -28472 -57288 -16348 1663 -32315 -33950 1559 -887 -25546 -9331 16621 4591
170 4591 -3153 22115 28846 5943 8758 34583 30294 10661 19304 27417 8263 506 18642 13672
184 13672 -12893 -9205 6250 -14763 -34305 -7878 5698 -33029 -48575 -5061 9282 -34917
196 -34917 -41739 8998 19715 -25029 -28428 19579 32617 1929 -4453 19019 27249 20613 19718
209 19718 15911 11344 23270 28081 2240 -12366 14050 26896 -9997 -34192 -6562 11478 -16597
222 -16597 -35232 -15696 -6782 -22824 -24138 -10071 -12327 -18270 -3894 4276 -9491 -9408 15803 23188
$$ packed form
131B586L9348q8979k3221R9062K1191q9617k539R7769R167p9947l293O4710M559
144E0796l7385L979J1756j8422M18J8768k2230l0433K7205K2535m7790l4142M6275
157h670K9302m9104k8816M0940J8011l3978j635L5509k446k4659J6215K5952j2030
170D591p744K5268O731k2903K815K5825m289j9633Q643Q113j9154p757J8136m970
184A3672k6565L688J5455k1013j9542K6427J3576l8727j5546M3514J4343m4199
196c4917o822N0737J0717m4744l399M8007J3038l0688o382K3472Q230o636q95
209A9718l807m567J1926M811k5841j4606K6416J2846l6893k4195K7630J8040k8075
222a6597j8635J9536Q914j6042j314J4067k256n943J4376Q170j3767Q3K5211P385
$$ plain form
236 23188 3577 1083 21577 27325 15725 13655 19069 15281 13381 16193 7163 -4106 4030 12221
250 12221 -7298 -26096 -10624 5159 -13960 -33221 -18812 -3796 -16374 -25747 -12208 -2983
262 -2983 -10182 -10167 345 2229 808 9533 15455 8995 8504 20137 22414 13275 12801 19573 14768 6685
278 6685 9395 10697 -141 -5214 1288 -2603 -17226 -16388 -4354 -10421 -25713 -21267 -6686 -9700
292 -9700 -20469 -14506 -2261 -3601 -7387 -1026 5922 6986 8997 12373 10605 11657 19291 20009 11359
307 11359 9902 17461 15602 3687 1669 8022 3708 -7589 -8781 -4785 -9214 -15400 -13399 -12023
321 -12023 -17094 -17730 -10834 -9971 -14007 -10426 -2558 -2099 -3537 1878 8265 8103 7964 12052 14255 13205
337 13205 14727 16797 13090 9529 11868 11739 4703 181 2628 940 -7039 -10069 -7048 -8608 -14920
$$ packed form
236B3188j9611k494K0494N748j1600k070N414l788j900K812r030j1269Q136Q191
250A2221j9519j8798J5472J5783j9119j9261J4409J5016j2578r373J3539R225
262b983p199J5J0512J884j421Q725N922o460m91J1633K277r139m74O772m805q083
278F685K710J302j0838n073O502l891j4623Q38J2034o067j5292M446J4581l014
292i700j0769N963J2245j340l786O361O948J064K011L376j768J052P634P18q650
307A1359j457P559j859j1915k018O353m314j1297j192L996m429o186K001J376
321a2023n071o36O896Q63m036L581P868M59j438N415O387j62j39M088K203j050
337A3205J522K070l707l561K339j29p036m522K447j688p979l030L021j560o312
$$ plain form
352 -14920 -15629 -12350 -12997 -15202 -12440 -9185 -8756 -7313 -3297 -661 375 4154 8402 8492 8259 12380
368 12380 15460 13382 11514 13426 13494 10284 7895 7244 4554 1160 -395 -2542 -7703 -9904 -8302 -9148
384 -9148 -14407 -16359 -12246 -9750 -11899 -13230 -9807 -4781 -1999 -2709 -2246 2414 8851 9912 6691 6775
400 6775 13810 18024 12362 6990 10159 15253 11716 3224 1043 3951 3264 -2802 -8042 -8986 -7391 -7734
416 -7734 -11621 -15790 -14789 -9579 -8062 -11680 -12860 -6850 -556 -902 -3473 -96 6787 9818 7343
431 7343 7386 10533 13444 13145 11013 10181 9351 9261 8178 5561 1078 -1706 -975 -1457 -6489 -11472 -10851 -7773
449 -7773 -9609 -13894 -14281 -10277 -8460 -7759 -7594 -6702 -4014 1391 5368 3219 -55 6520 16372 14087
465 14087 3614 4691 17443 19562 5753 -1448 8051 15468 4890 -7532 -5745 2155 131 -9105
$$ packed form
352a4920p09L279o47k205K762L255M29J443M016K636J036L779M248R0k33M121
368A2380L080k078j868J912O8l210k389o51k690l394j555k147n161k201J602q46
384i148n259j952M113K496k149j331L423N026K782p10M63M660O437J061l221Q4
400F775P035M214n662n372L169N094l537q492k181K908o87o066n240r44J595l43
416g734l887m169J001N210J517l618j180O010O294l46k571L377O883L031k475
431G343M3L147K911k99k132q32q30r0j083k617m483k784P31m82n032m983O21L078
449g773j836m285l87M004J817P01J65Q92K688N405L977k149l274O575R852k285
465A4087j0473J077J2752K119j3809p201R499P417j0578j2422J787P900k024r236
$$ plain form
479 -9105 -14343 -11926 -7240 -6737 -12093 -17438 -12837 -2261 -787 -10751 -12657 1630 11598 3058 -5534
494 -5534 3505 17474 14848 3830 4249 14515 16913 8788 3551 5890 8016 5653 1265 -2614 -5206
509 -5206 -3676 -2502 -6912 -14072 -13301 -5783 -6173 -14646 -15352 -5518 -1745 -8304 -9013 651 4669 -348
525 -348 498 9768 11632 4192 5827 16190 15449 3987 3619 14690 14185 645 -3679 5454 6997
540 6997 -4080 -9961 -5956 -3759 -7555 -9913 -11329 -13037 -10125 -4601 -6983 -14324 -10451 2962 4618
555 4618 -6383 -7409 7728 15606 5748 -1481 7914 18071 13781 4251 4578 11489 12318 6316 694
570 694 -3 1985 2357 -1798 -8854 -10527 -5483 -2841 -9848 -17088 -11968 -2072 -4464 -14298 -11904 1028
586 1028 4118 -4661 -5528 5894 11166 4312 3074 10570 12942 7481 7136 12086 10559 3723 4394 8727
$$ packed form
479i105n238K417M686N03n356n345M601J0576J474r964j906J4287R968q540q592
494e534R039J3969k626j1018M19J0266K398q125n237K339K126k363m388l879k592
509e206J530J174m410p160P71P518l90q473p06R834L773o559p09R664M018n017
525c48Q46R270J864p440J635J0363p41j1462l68J1071n05j3540m324R133J543
540F997j1077n881M005K197l796k358j416j708K912N524k382p341L873J3413J656
555D618j1001j026J5137P878r858p229R395J0157m290r530L27O911Q29o002n622
570F94o97J988L72m155p056j673N044K642p007p240N120R896k392r834K394J2932
586A028L090q779q67J1422N272o854j238P496K372n461l45M950j527o836O71M333
$$ plain form
602 8727 4311 -3227 -2706 753 -2994 -8824 -8332 -6704 -9246 -10273 -8221 -9256 -11459 -7330 -1833 -3961
618 -3961 -8021 -2779 6006 5034 -362 2086 10454 12192 7240 5406 9192 12133 10410 5566 3175
633 3175 4534 6160 3065 -3036 -5498 -2850 -1389 -6048 -11721 -11296 -6080 -4725 -10122 -13289 -8317
648 -8317 -1010 -2419 -8350 -5944 3993 7328 1316 -428 7762 12410 8266 5251 7868 11133 9559
663 9559 6750 5288 4377 3830 3158 396 -3754 -4286 -2600 -4762 -8909 -9534 -7118 -7295 -9405 -9174 -6752
680 -6752 -5977 -5419 -3431 -1578 -1051 863 4338 5078 4442 5931 9428 9144 7383 7779 9390 8034 5517
697 5517 4504 4151 2349 513 -1242 -2773 -4245 -5512 -6433 -7747 -8191 -7772 -8071 -8341 -7040 -5803 -5328
714 -5328 -4517 -1840 -63 571 1881 4911 6117 5569 6468 9072 9035 7374 7161 8070 7193 4738 3190
$$ packed form
602H727m416p538N21L459l747n830M92J628k542j027K052j035k203M129N497k128
618c961m060N242Q785r72n396K448Q368J738m952j834L786K941j723m844k391
633C175J359J626l095o101k462K648J461m659n673M25N216J355n397l167M972
648h317P307j409n931K406R937L335o012j744Q190M648m144l015K617L265j574
663I559k809j462r11n47o72k762m150n32J686k162m147o25K416j77k110K31K422
680f752P75N58J988J853N27J914L475P40o36J489L497k84j761L96J611j356k517
697E517j013l53j802j836j755j531j472j267r21j314m44M19k99k70J301J237M75
714e328Q11K677J777O34J310L030J206n48Q99K604l7j661k13R09q77k455j548
$$ plain form
731 3190 2869 1546 -700 -2574 -4192 -4736 -5622 -7059 -8289 -8435 -7099 -7158 -8354 -6994 -4206 -2870 -3424
748 -3424 -2420 1074 3013 3070 4138 6262 7322 7029 7551 8071 7632 7105 6618 5606 3983 2692 1768
765 1768 -166 -1937 -3470 -4602 -5829 -6541 -7169 -7918 -7832 -7144 -6477 -6697 -5813 -3785 -2179 -1589 -353 1648
783 1648 3512 4312 4974 6333 7255 7486 7576 7627 6770 6145 5703 4859 2523 1383 397 -997 -2823 -4479
801 -4479 -5155 -5959 -6720 -7455 -7642 -7638 -7012 -5819 -5494 -5212 -2854 -833 -265 325 2480 4787 5282 4797 6231
820 6231 7817 7767 6835 6475 6262 5892 4751 2927 1317 726 -139 -2423 -4398 -4993 -4749 -6191 -7912 -7952
838 -7952 -6445 -6150 -6881 -6242 -3841 -2533 -2360 -1047 746 2138 3465 4694 4994 5545 6891 7697 7037
855 7037 5827 6414 6336 5005 2908 2070 1386 -304 -1744 -3178 -4484 -5267 -5539 -6124 -7483 -7385 -6121 -5481
$$ packed form
731C190l21j323k246j874j618n44q86j437j230j46J336n9j196J360K788J336n54
748c424J004L494J939N7J068K124J060k93N22N20m39n27m87j012j623j291r24
765A768j934j771j533j132j227p12o28p49Q6O88O67k20Q84K028J606N90J236K001
783A648J864Q00O62J359R22K31R0N1q57o25m42q44k336j140r86j394j826j656
801d479o76q04p61p35j87MO26J193L25K82K358K021N68N90K155K307M95m85J434
820F231J586n0r32l60k13l70j141j824j610n91q65k284j975n95K44j442j721m0
838g952J507K95p31O39K401J308J73J313J793J392J327J229L00N51J346Q06o60
855G037j210N87p8j331k097q38o84j690j440j434j306p83k72n85j359R8J264O40
$$ plain form
873 -5481 -5745 -4826 -2906 -1936 -1302 57 2052 2457 3671 5545 6011 5320 5958 7505 7158 5159 4679 5481
891 5481 4365 1911 556 110 -1372 -2431 -3596 -5199 -6230 -5887 -5500 -6842 -7955 -5919 -3751 -4168
907 -4168 -4823 -2633 -251 570 760 1952 3497 4968 6076 5855 5174 6020 7636 6601 4211 3905 4822
924 4822 3361 619 -204 -149 -2245 -3958 -4002 -4626 -6812 -6529 -4845 -5888 -7560 -6191 -3084 -3247 -4390
941 -4390 -2286 1172 1021 1081 3344 4995 4196 4964 7610 6824 4222 4556 7615 5773 1634 1671 3551
958 3551 1934 -1980 -3159 -2681 -2889 -4791 -5557 -6483 -6656 -5007 -4813 -6196 -6205 -3668 -1282 -1731 -2087 125
976 125 2636 4280 3645 3201 4084 7053 7504 4522 3483 6292 7644 3155 -136 2125 3508 -534
992 -534 -3727 -2544 -2104 -5028 -5740 -4491 -6000 -7805 -5353 -2965 -5519 -6943 -2325 1118 -2138 -2948
$$ packed form
873e481k64R19J920R70O34J359J995M05J214J874M66o91O38J547l47j999m80Q02
891E481j116k454j355m46j482j059j165j603j031L43L87j342j113K036K168m17
907d168o55K190K382Q21J90J192J545J471J108k21o81Q46J616j035k390l06R17
924D822j461k742q23N5k096j713m4o24k186K83J684j043j672J369L107j63j143
941d390K104L458j51O0K263J651p99P68K646p86k602L34L059j842m139L7J880
958C551j617l914j179M78k08j902p66r26j73J649J94j383rK537K386m49l56K212
976A25K511J644o35m44Q83K969M51k982j039K809J352m489l291K261J383m042
992e34l193J183M40k924p12J249j509j805K452K388k554j424M618L443l256q10
$$ plain form
1008 -2948 2456 5163 2249 1847 5943 6992 4181 4684 7592 6039 2246 3518 5620 1997 -1440
1023 -1440 -74 1354 -2072 -4929 -4077 -3505 -5084 -6199 -5452 -5627 -5499 -4575 -3325 -3665 -2989 -821 720
1040 720 675 1269 2655 4074 5379 5198 4405 4477 6963 6659 2920 1972 4953 4791 -385 -2168 618 424
1058 424 -3952 -5410 -3069 -4147 -6413 -5309 -3815 -5899 -6456 -2598 -1261 -4655 -3823 1937 3145 -840
1074 -840 279 6075 6033 2302 3584 7258 6392 3201 4589 5839 2918 935 2619 1869 -1944 -2660
1090 -2660 -1034 -2642 -5705 -5135 -3410 -5001 -6847 -5333 -3642 -4662 -4142 -2300 -1257 -1329 108 1904
1106 1904 2247 2405 4116 4905 4032 5053 6316 4765 3376 4850 5109 1782 146 1791 1154 -2437
1122 -2437 -3203 -1568 -2582 -5579 -4945 -3750 -5372 -6358 -3926 -2697 -4882 -3843 -466 -50 -2081 -8
$$ packed form
1008b948N404K707k914m02M096J049k811N03K908j553l793J272K102l623l437
1023a440J366J428l426k857Q52N72j579j115P47j75J28R24J250l40O76K168J541
1040G20m5N94J386J419J305j81p93P2K486l04l739r48K981j62n176j783K786j94
1058D24m376j458K341j078k266J104J494k084n57L858J337l394Q32N760J208l985
1074h40J119N796m2l731J282L674q66l191J388J250k921j983J684p50l813p16
1090b660J626j608l063N70J725j591j846J514J691j020N20J842J043p2J437J796
1106A904L43J58J711P89q73J021J263j551j389J474K59l327j636J645o37l591
1122b437p66J635j014k997O34J195j622r86K432J229k185J039L377M16k031K073
$$ plain form
1138 -8 3587 3426 1229 3835 6521 4702 3186 5410 5887 3088 2424 4032 2777 -551 -135 894 -1965
1155 -1965 -4240 -3172 -2348 -5118 -5878 -4185 -3687 -5676 -5083 -2622 -2450 -3407 -1329 775 123 464 3134
1172 3134 4006 2983 3698 6063 5101 3558 4733 5531 3711 1745 2736 2712 56 -1566 -646 -1517 -4008
1189 -4008 -3900 -3310 -4792 -5713 -4566 -3661 -4830 -4546 -2131 -1413 -2471 -1198 1436 1462 1000 2883 4861
1206 4861 3821 3294 5300 5615 3613 3567 4927 3606 1103 1603 1893 -259 -2252 -1701 -1801 -4060 -4744
1223 -4744 -3630 -3910 -5610 -4818 -2971 -3888 -4085 -2167 -392 -1548 -1140 1633 2812 1592 2620 4713
1239 4713 4759 3479 4600 5320 4088 3107 3725 3604 1271 226 1092 -73 -2540 -2807 -2241 -3695 -4857
1256 -4857 -3990 -3693 -4750 -4746 -3111 -2652 -3376 -2105 -62 5 -461 1841 3025 2685 2947 4509 4771 3462
$$ packed form
1138hL595j61k197K606K686j819j516K224M77k799o64J608j255l328M16J029k859
1155a965k275J068Q24k770p60J693M98j989N93K461J72r57K078K104o52L41K670
1172C134Q72j023P15K365r62j543J175P98j820j966R91k4k656j622R20q71k491
1189d008J08N90j482r21J147R05j169K84K415P18j058J273K634K6m62J883J978
1206D861j040n27K006L15k002m6J360j321k503N00K90k152j993N51j00k259o84
1223d744J114k80j700P92J847r17j97J918J775j156M08K773J179j220J028K093
1239D713M6j280J121P20j232r81O18j21k333j045Q66j165k467k67N66j454j162
1256d857Q67K97j057MJ635M59p24J271K043O7m66K302J184l40K62J562K62j309
$$ plain form
1274 3462 3755 4893 4147 2506 2532 3026 1048 -569 -311 -284 -2566 -3414 -3027 -3554 -4648 -4309 -3485 -4239
1292 -4239 -4312 -2813 -1952 -2245 -2012 177 1173 402 1375 3398 3432 2947 3808 4722 3981 3433 3914 3621 2277
1311 2277 1657 2080 755 -853 -1147 -1049 -2387 -3813 -3636 -3446 -4363 -4845 -3633 -3294 -3767 -3112 -1466 -1279
1329 -1279 -929 311 1462 1706 1902 3259 3905 3467 3762 4730 4226 3066 3340 3180 2069 1033 845 404
1347 404 -1009 -1514 -1683 -2633 -3755 -3802 -3406 -4100 -4594 -3401 -3156 -3157 -2659 -1100 -302 -338 327 2410 2218 2254
1367 2254 3337 4031 4060 3463 4222 4129 3080 2465 2606 2030 697 -188 -334 -1112 -2389 -2663 -2780 -3671 -3958
1386 -3958 -3921 -3277 -3825 -3688 -2707 -2244 -1876 -1090 -192 672 1228 2063 2709 3196 3499 3860 3634 3483 3773 3622
1406 3622 2968 1880 1915 1306 257 -784 -1048 -1656 -2697 -2943 -3110 -3711 -3812 -3311 -3188 -3561 -3321 -2146
$$ packed form
1274C462K93J138p46j641K6M94j978j617K58K7k282q48L87n27j094L39Q24p54
1292d239p3J499Q61k93K33K189R96p71R73K023L4m85Q61R14p41n48M81k93j344
1311B277o20M23j325j608k94R8j338j426J77J90r17m82J212L39m73O55J646J87
1329a279L50J240J151K44J96J357O46m38K95R68n04j160K74j60j111j036j88m41
1347D04j413n05j69r50j122m7L96o94m94J193K45jM98J559P98l6O65K083j92L6
1367B254J083O94K9n97P59r3j049o15J41n76j333q85j46p78j277k74j17q91k87
1386c958L7O44n48J37R81M63L68P86Q98Q64N56Q35O46M87L03L61k26j51K90j51
1406C622o54j088L5o09j049j041k64o08j041k46j67o01j01N01J23l73K40J175
$$ plain form
1424 -2146 -1488 -1367 -665 722 1505 1704 2219 2753 3186 3293 3603 3879 3584 3048 2929 2642 1936 1013 404
1443 404 74 -881 -2017 -2399 -2563 -2864 -3764 -3807 -3556 -3356 -3465 -3055 -2241 -1969 -1103 -633 252 744 1103 2233
1463 2233 2896 3002 2951 3609 3918 3560 2798 2897 2770 2227 1025 481 236 -530 -1487 -2026 -2455 -2807 -3469 -3457
1483 -3457 -3135 -3535 -3463 -2701 -2550 -2416 -1826 -698 235 337 783 2060 2768 2593 2912 3207 3567 3298 2793
1502 2793 2983 2812 1647 1053 1186 352 -685 -1264 -1407 -1952 -3180 -3253 -2737 -3422 -3797 -3182 -2434 -2337 -2400 -1683
1522 -1683 -458 -205 92 1253 1848 2156 2289 2745 3481 3077 2755 3270 3315 2470 1910 1855 1429 232 -654
1541 -654 -1129 -1149 -2093 -2667 -2961 -2878 -3273 -3417 -3098 -2868 -2896 -2187 -1341 -831 -561 -32 1210 1684 1704 1992 3030
1562 3030 3008 3073 3037 3504 2943 2367 1903 1833 1242 215 -81 -769 -1296 -2265 -2240 -2362 -2844 -3563 -3096 -2411 -3125
$$ packed form
1424b146O58J21P02J387P83J99N15N34M33J07L10K76k95n36j19k87p06r23o09
1443D04l30r55j136l82j64l01r00m3K51K00j09M10Q14K72Q66M70Q85M92L59J130
1463B233O63J06n1O58L09l58p62R9j27n43j202n44k45p66r57n39m29l52o62J2
1483c457L22m00P2P62J51J34N90J128R33J02M46J277P08j75L19K95L60k69n05
1502B793J90j71j165n94J33q34j037n79j43n45j228p3N16o85l75O15P48R7o3P17
1522a683J225K53K97J161N95L08J33M56P36m04l22N15M5q45n60n5m26j197q86
1541f54m75k0r44n74k94Q3l95j44L19K30k8P09Q46N10K70N29J242M74K0K88J038
1562C030k2O5l6M67n61n76m64p0n91j027k96o88n27r69K5j22m82p19M67O85p14
$$ plain form
1583 -3125 -2862 -2045 -1557 -1294 -934 31 794 1314 1552 2355 2644 2989 2957 3299 3253 2719 2453 2410 1560 830 324
1604 324 -47 -321 -1101 -1722 -2028 -2529 -2875 -2909 -2773 -2952 -3123 -2536 -2289 -1771 -1094 -844 -171 481 758 1509
1624 1509 2171 2563 2717 2685 2783 3086 2687 2423 2420 1875 888 726 253 -470 -1049 -1616 -1590 -2512 -2817 -2575 -2695
1645 -2695 -2994 -3005 -2421 -2507 -2065 -1620 -788 -278 408 636 1288 1755 1866 2590 2780 2888 2672 2705 2656 2243 1806
1666 1806 1189 820 111 -188 -741 -1412 -1863 -2156 -2423 -2592 -3001 -2686 -2672 -3012 -2179 -1876 -1449 -1077 -114 216
1686 216 606 1221 1797 2067 2339 2666 2748 2645 2437 2277 2332 1646 1398 1142 680 -132 -776 -927 -1361 -2208 -2399
1707 -2399 -2857 -2630 -3098 -2768 -2250 -2347 -2001 -1437 -941 -469 -302 601 1253 1434 1481 2457 2477 2711 2620 2711 2543
1728 2543 2493 2020 1768 1256 797 260 -701 -953 -1509 -1729 -2308 -2383 -2533 -2619 -2749 -2550 -2170 -2060 -1754 -1078 -755
$$ packed form
1583c125K63Q17M88K63L60R65P63N20K38Q03K89L45l2L42m6n34k66m3q50p30n06
1604C24l71k74p80o21l06n01l46l4J36j79j71N87K47N18O77K50O73O52K77P51
1624A509O62L92J54l2R8L03l99k64ln45r87j62m73p23n79n67K6r22l05K42j20
1645b695k99j1N84q6M42M45Q32N10O86K28O52M67J11P24J90J08k16L3m9m13m37
1666A806o17l69p09k99n53o71m51k93k67j69m09L15J4l40Q33L03M27L72R63L30
1686B16L90O15N76K70K72L27Q2j03k08j60N5o86k48k56m62q12o44j51m34q47j91
1707b399m58K27m68L30N18r7L46N64M96M72J67R03O52J81M7R76K0K34r1R1j68
1728B543n0m73k52n12m59n37r61k52n56k20n79p5j50q6j30J99L80J10L06O76L23
$$ plain form
1749 -755 85 324 1129 1319 1740 2048 2355 2679 2563 2729 2716 2540 1546 1869 1303 643 36 -356 -721 -1435
1769 -1435 -1809 -1905 -2289 -2656 -2876 -2539 -2418 -2654 -1900 -1673 -1211 -771 -204 305 842 1176 1668 1712 2167 2226 2424
1790 2424 2548 2462 2284 2311 1514 1338 921 126 -282 -751 -939 -1830 -1786 -1879 -2214 -2632 -2490 -2498 -2235 -2053 -1649 -1411
1812 -1411 -1023 -508 103 458 894 1293 1644 2349 2460 2380 2495 2416 2210 1993 1884 1535 714 350 221 -389
1832 -389 -1150 -1176 -1516 -2152 -2147 -2493 -2259 -2467 -2318 -1961 -1868 -1429 -1254 -502 32 418 965 1152 1685 1851 2441
1853 2441 2604 2354 2322 2202 2292 1830 1414 1147 755 493 -259 -769 -1163 -1637 -1846 -2482 -2356 -2430 -2235 -2285 -2255
1874 -2255 -1493 -1438 -1018 -722 -233 220 550 1226 1538 1967 1997 2389 2432 2194 2073 2158 1869 1343 966 912 218
1895 218 -173 -914 -1062 -1171 -1651 -1970 -2108 -2074 -2385 -2284 -2041 -1962 -1730 -1232 -479 -225 -69 564 1067 1256 1770
$$ packed form
1749g55Q40K39Q05J90M21L08L07L24j16J66j3j76r94L23n66o60o07l92l65p14
1769a435l74r6l84l67k20L37J21k36P54K27M62M40N67N09N37L34M92M4M55N9J98
1790B424J24q6j78K7p97j76m17p95m08m69j88q91M4r3l35m18J42qK63J82M04K38
1812a411L88N15O11L55M36L99L51P05J11q0J15p9k06k17j09l49q21l64j29o10
1832c89p61k6l40o36Nl46K34k08J49L57R3M39J75P52N34L86N47J87N33J66N90
1853B441J63k50l2j20R0m62m16k67l92k62p52n10l94m74k09o36J26p4J95n0L0
1874b255P62N5M20K96M89M53L30O76L12M29L0L92M3k38j21Q5k89n26l77n4o94
1895B18l91p41j48j09m80l19j38L4l11J01K43P9K32M98P53K54J56O33N03J89N14
$$ plain form
1916 1770 2122 2218 2200 2279 2219 2280 1921 1524 1213 933 474 -415 -537 -772 -1155 -1614 -1969 -1990 -2079 -2220 -2088 -1872
1938 -1872 -1801 -1619 -1255 -841 -422 -67 334 1167 1345 1398 1893 2180 2250 1986 2195 2149 1857 1381 1270 1044 370
1959 370 -93 -82 -732 -1384 -1743 -1708 -1954 -2333 -2255 -1932 -1867 -2032 -1787 -1384 -852 -453 -292 410 755 1155 1478
1980 1478 1668 1902 2046 2038 1945 2107 1648 1561 1502 897 516 -140 -201 -688 -1138 -1462 -1395 -1830 -1992 -2196 -2043 -1965
2002 -1965 -2045 -1702 -1294 -1047 -662 -295 269 785 842 962 1618 1941 1778 2236 2107 1987 1756 1922 1468 1025
2022 1025 434 142 -401 -524 -815 -1023 -1360 -1722 -2185 -1978 -2030 -2180 -2014 -1637 -1701 -1122 -684 -202 222 398
2042 398 971 1181 1478 1670 1974 1908 1914 2079 1616 1718 1549 834 626 555 -31 -612 -837 -1332 -1480 -1539 -1697 -1908
2064 -1908 -2191 -2091 -2104 -1829 -1389 -1207 -790 -378 103 294 739 1362 1549 1378 1699 1897 1827 1705 1691 1670 1350
$$ packed form
1916A770L52R6j8P9o0O1l59l97l11k80m59q89j22k35l83m59l55k1q9j41J32K16
1938a872P1J82L64M14M19L55M01Q33J78N3M95K87P0k64K09m6k92m76j11k26o74
1959C70m63J1o50o52l59L5k46l79P8L23O5j65K45M03N32L99J61P02L45M00L23
1980A478J90K34J44qr3J62m59q7n9o05l81o56o1m87m50l24O7m35j62k04J53P8
2002a965q0L43M08K47L85L67N64N16N7J20O56L23j63M58j29j20k31J66m54m43
2022A025n91k92n43j23k91k08l37l62m63K07n2j50J66L77o4N79M38M82M24J76
2042C98N73K10K97J92L04o6OJ65m63J02j69p15k08p1n86n81k25m95j48n9j58k11
2064a908k83J00j3K75M40J82M17M12M81J91M45O23J87j71L21J98p0j22j4k1l20
$$ plain form
2085 1350 839 916 523 -114 -347 -382 -960 -1607 -1450 -1866 -1809 -2157 -1927 -1637 -1650 -1621 -1066 -625 -466 -307 89
2106 89 488 767 1158 1732 1737 1641 2014 1830 1812 1897 1607 1284 703 591 332 -65 -377 -768 -1080 -1395 -1700 -1602
2128 -1602 -1882 -2086 -1586 -1344 -1510 -1364 -830 -448 -505 146 605 713 950 1291 1668 1676 1436 1809 1925 1807 1219
2149 1219 1215 1320 876 70 89 -196 -972 -1047 -1127 -1379 -1998 -1928 -1807 -1758 -1738 -1403 -1172 -1139 -660 -119 84 302 675
2172 675 980 1123 1212 1704 1739 1682 1554 1848 1696 1393 964 619 174 -103 25 -716 -874 -1209 -1319 -1379 -1950
2193 -1950 -1836 -1513 -1676 -1393 -1124 -962 -943 -317 204 470 445 1185 1111 1582 1404 1789 1985 1499 1501 1400 1574
2214 1574 909 801 678 220 -354 -520 -898 -1266 -1494 -1536 -1484 -1803 -1938 -1452 -1227 -1122 -1029 -568 -524 -288 343
2235 343 596 743 1108 1367 1650 1487 1897 1986 1565 1385 1467 1282 482 362 301 -15 -593 -974 -811 -926 -1717
$$ packed form
2085A350n11P7l93o37k33l5n78o47J57m16N7l48K30K90j3K9N55M41J59J59L96
2106H9L99K79L91N74Nr6L73j84j8Q5k90l23n81j12k59l97l12l91l12l15l05R8
2128a602k80k04N00K42j66J46N34L82n7O51M59J08K37L41L77Qk40L73J16j18n88
2149A219mJ05m44q06J9k85p76p5q0k52o19P0J21M9K0L35K31L3M79N41K03K18L73
2172F75L05J43Q9M92L5n7j28K94j52l03m29l45m45k77J28p41j58l35j10o0n71
2193a950J14L23j63K83K69J62J9O26N21K66k5P40p4M71j78L85J96m86Kj01J74
2214A574o65j08j23m58n74j66l78l68k28m2N2l19j35M86K25J05R3M61M4K36O31
2235C43K53J47L65K59K83j63M10Q9m21j80Q2j85q00j20o1l16n78l81J63j15p91
$$ plain form
2256 -1717 -1635 -1401 -1473 -1705 -1266 -1154 -1145 -968 -371 -106 -138 718 1108 881 1007 1430 1710 1703 1516 1549 1735 1333
2278 1333 759 1045 805 252 -211 -564 -839 -943 -1032 -1208 -1519 -1427 -1530 -1357 -1443 -1167 -527 -706 -529 -72 2
2299 2 297 385 831 832 1118 1702 1727 1575 1493 1547 1369 1101 762 887 147 -86 -311 -685 -823 -1265 -1260 -1135 -1435
2322 -1435 -1483 -1240 -1231 -1471 -1234 -982 -570 -530 -32 374 475 716 817 1017 1373 1587 1557 1625 1151 1433 1224 842
2344 842 700 744 35 -217 -688 -524 -849 -1314 -1417 -1387 -1384 -1591 -1386 -1407 -1096 -1085 -540 -284 -157 105 786 1060
2366 1060 713 1267 1561 1383 1711 1317 1542 1286 1016 1133 995 355 150 15 -289 -713 -1037 -805 -1409 -1330
2386 -1330 -1532 -1259 -1493 -1329 -1083 -1290 -732 -182 -375 43 409 866 1068 1028 1347 1166 1417 1511 1512 1386 1032
2407 1032 885 865 497 388 -253 -120 -465 -985 -938 -862 -1164 -1565 -1349 -1210 -1296 -1148 -797 -678 -711 -374 119
$$ packed form
2256a717Q2K34p2k32M39J12RJ77N97K65l2Q56L90k27J26M23K80pj87L3J86m02
2278A333n74K86k40n53m63l53k75j04q9j76l11R2j03J73q6K76O40j79J77M57P4
2299BK95Q8M46JK86N84K5j52q2N4j78k68l39J25p40k33k25l74j38m42NJ25l00
2322a435m8K43Rk40K37K52M12M0M98M06J01K41J01K00L56K14l0O8m74K82k09l82
2344H42j42M4p09k52m71J64l25m65j03L0Lk07K05k1L11J1N45K56J27K62O81K74
2366A060l47N54K94j78L28l94K25k56k70J17j38o40k05j35l04m24l24K32o04P9
2386a330k02K73k34J64K46k07N58N50j93M18L66M57K02m0L19j81K51R4Jj26l54
2407A032j47k0l68j09o41J33l45n20M7P6l02m01K16J39q6J48L51J19l3L37M93
$$ plain form
2428 119 227 516 583 1165 1001 1250 1420 1492 1101 1080 1322 954 740 440 221 24 -310 -540 -601 -1016 -1082 -1273
2450 -1273 -1375 -1230 -1510 -1328 -1113 -892 -977 -459 -126 61 211 263 825 929 1199 1011 1345 1465 1411 1187 1035
2471 1035 1327 756 442 200 315 -297 -471 -512 -745 -1023 -1347 -1180 -1077 -1196 -974 -836 -1212 -828 -925 -243
2491 -243 43 24 529 418 690 1106 1086 1155 1374 1647 1137 1132 1064 667 602 340 307 96 -300 -626 -843 -1028 -1112
2514 -1112 -1160 -1076 -1339 -1042 -928 -853 -771 -533 -485 -31 46 293 556 413 949 922 1063 1385 1264 1248 1305 1045 834
2537 834 747 779 -85 -136 -216 -510 -728 -1121 -961 -1114 -1262 -1200 -1350 -1476 -1121 -754 -580 -459 -392 -168 171 304
2559 304 492 1124 880 1006 1273 1128 1170 1127 915 812 706 471 319 56 -324 -520 -651 -964 -929 -1153 -1175
2580 -1175 -1072 -997 -1030 -1093 -1000 -819 -395 -230 -257 246 520 566 1069 914 969 1171 1425 1340 1357 1058 814 696 434
$$ packed form
2428A19J08K89O7N82j64K49J70P2l91k1K42l68k14l00k19j97l34k30o1m15o6j91
2450a273j02J45k80J82K15K21q5N18L33J87J50N2N62J04K70j88L34J20n4k24j52
2471A035K92n71l14k42J15o12j74m1k33k78l24J67J03j19K22J38l76L84r7O82
2491b43K86j9N05j11K72M16k0O9K19K73n10no8l97o5k62l3k11l96l26k17j85q4
2514a112m8Q4k63K97J14P5Q2K38M8M54P7K47K63j43N36k7J41L22j21j6N7k60k11
2537H34q7L2q64n1q0k94k18l93J60j53j48O2j50j26L55L67J74J21O7K24L39J33
2559C04J88O32k44J26K67j45M2m3k12j03j06k35j52k63l80j96j31l13L5k24k2
2580a175J03P5l3o3R3J81M24J65k7N03K74M6N03j55N5K02K54q5J7k99k44j18k62
$$ plain form
2603 434 320 -52 -335 -154 -567 -651 -791 -1202 -1095 -1454 -1357 -1132 -1245 -1163 -598 -511 -536 -115 -48 496 549 616 975
2626 975 1015 1132 980 1197 1008 904 653 516 406 59 218 -68 -154 -498 -823 -662 -1190 -1088 -1132 -1159 -1056
2647 -1056 -953 -631 -672 -533 -558 -17 308 366 333 452 696 940 963 946 1497 1074 955 771 802 621 442 166
2669 166 -13 -204 -431 -547 -553 -868 -1163 -1018 -1062 -1283 -970 -632 -728 -600 -273 -260 -116 324 429 553 559 979
2691 979 1111 1128 1174 1090 1033 920 602 775 305 231 131 -274 -413 -291 -835 -810 -752 -1048 -1045 -1068 -914 -977 -770 -511
2715 -511 -626 -322 -62 18 576 375 804 723 830 1114 1000 1019 730 977 738 606 533 343 25 -266 -384
2736 -384 -424 -873 -1059 -804 -891 -995 -835 -1121 -807 -848 -743 -385 -39 -93 23 294 345 568 523 1124 981 1027
2758 1027 1089 894 1056 812 717 524 316 -18 -43 -232 -414 -503 -883 -722 -861 -853 -994 -821 -918 -822 -528 -427
$$ packed form
2603D34j14l72k83J81m13q4j40m11J07l59R7K25j13Q2N65Q7k5M21O7N44N3O7L59
2626I75M0J17j52K17j89j04k51j37j10l47J59k86q6l44l25J61n28J02m4k7J03
2647a056J03L22m1J39k5N41L25N8l3J19K44K44K3j7N51m23j19j84L1j81j79k76
2669A66j79j91k27j16ol15k95J45m4k21L13L38r6J28L27J3J44M40J05J24OM20
2691I79J32J7M6q4n7j13l18J73m70p4j00m05j39J22n44K5N8k96Lk3J54o3K07K59
2715e11j15L04K60Q0N58k01M29q1J07K84j14J9k89K47k39j32p3j90l18k91j18
2736c84m0m49j86K55q7j04J60k86L14m1J05L58L46n4J16K71N1K23m5O01j43M6
2758A027O2j95J62k44r5j93k08l34k5j89j82q9l80J61j39Qj41J73r7R6K94J01
$$ plain form
2780 -427 -551 2 -53 459 442 694 992 643 869 853 734 792 961 816 577 514 418 50 217 71 -153 -529
2802 -529 -783 -776 -868 -1038 -845 -974 -714 -920 -820 -554 -324 -221 28 276 489 681 659 610 894 1013 989 972
2824 972 938 812 768 657 159 153 -31 -16 -398 -505 -605 -849 -1092 -776 -1008 -984 -850 -940 -862 -673 -401 -397 39
2847 39 305 27 469 487 627 753 653 961 776 741 669 730 632 473 327 -7 36 -257 -396 -390 -636 -712 -916
2870 -916 -900 -770 -917 -753 -651 -499 -456 -208 25 -98 45 398 734 364 647 774 977 1021 489 811 569
2891 569 533 453 351 164 -54 -268 -219 -420 -900 -482 -805 -559 -701 -776 -571 -782 -427 -639 -139 -206 64 285
2913 285 528 515 534 892 769 1006 774 766 782 638 589 481 204 212 22 -205 -408 -418 -602 -870 -522 -932 -1235
2936 -1235 -527 -702 -705 -793 -443 -272 -151 -30 -60 190 433 613 1001 998 769 887 594 718 758 723 645 256 97
$$ packed form
2780d27j24N53n5N12j7K52K98l49K26j6j19N8J69j45k39o3r6l68J67j46k24l76
2802e29k54Pr2j70J93j29K60k06J00K66K30J03K49K48K13J92k2m9K84J19k4j7
2824I72l4j26m4j11m98oj84J5l82j07j00k44k43L16k32K4J34r0P8J89K72MM36
2847C9K66k78M42J8J40J26j00L08j85l5p2O1r8j59j46l34M3k93j39Ok46p6k04
2870i16J6J30j47J64J02J52M3K48K33j23J43L53L36l70K83J27K03M4n32L22k42
2891E69l6q0j02j87k18k14M9k01m80M18l23K46j42p5K05k11L55k12N00o7K70K21
2913B85K43j3J9L58j23K37k32qJ6j44m9j08k77Qj90k27k03j0j84k68L48m10l03
2936a235P08j75lq8L50J71J21J21l0K50K43J80L88lk29J18k93J24M0l5p8l89j59
$$ plain form
2959 97 215 -21 -193 -379 -404 -566 -724 -769 -1033 -814 -696 -594 -365 -351 -369 -456 48 154 242 343 537 558 695
2982 695 770 697 593 878 667 621 492 485 170 -132 -139 -100 -474 -594 -544 -526 -639 -811 -796 -773 -724 -458 -244 -331 -280
3007 -280 -152 -179 239 315 163 650 438 714 970 871 832 803 530 632 313 197 67 -9 -113 -255 -260 -513 -707
3030 -707 -616 -763 -715 -607 -762 -491 -520 -424 -171 -44 54 262 181 707 598 582 484 850 695 521 578 471 771
3053 771 463 144 -113 9 -10 -345 -409 -616 -790 -620 -626 -676 -577 -507 -604 -390 -468 -138 -131 -226 37 282 342 795
3077 795 621 788 636 664 857 592 601 388 414 321 142 14 -88 -408 -417 -517 -682 -596 -708 -640 -467 -607 -491
3100 -491 -364 -183 -275 -109 128 -84 93 227 415 373 533 796 717 620 628 720 434 337 264 -110 282 -114 -292
3123 -292 -301 -453 -405 -543 -663 -546 -747 -564 -517 -549 -318 -339 -161 18 246 147 430 449 308 497 782 627 438
$$ packed form
2959I7J18k36j72j86k5j62j58m5k64K19J18J02K29J4j8q7N04J06Q8J01J94K1J37
2982F95P5p3j04K85k11m6j29pl15l02pL9l74j20N0J8j13j72J5K3M9K66K14q7N1
3007b80J28k7M18P6j52M87k12K76K56r9l9k9k73J02l19j16j30p6j04j42nk53j94
3030g07R1j47M8J08j55K71k9R6K53J27R8K08q1N26j09j6r8L66j55j74N7j07L00
3053G71l08l19k57J22j9l35o4k07j74J70on0R9P0r7K14p8L30Pr5K63K45O0M53
3077G95j74J67j52K8J93k65Rk13K6r3j79j28j02l20rj00j65Q6j12O8J73j40J16
3100d91J27J81r2J66K37k12J77J34J88m2J60K63p9r7QR2k86r7p3l74L92l96j78
3123b92rj52M8j38j20J17k01J83M7l2K31k1J78J79K28r9K83J9j41J89K85j55j89
$$ plain form
3146 438 884 641 574 638 178 444 -41 -10 -351 -232 -372 -608 -791 -879 -431 -533 -579 -602 -383 -585 -380 -479
3168 -479 68 -264 156 253 377 349 453 588 673 648 604 581 525 244 391 325 181 -51 -62 -194 -433 -429 -616 -775
3192 -775 -582 -475 -544 -539 -181 -355 -422 -194 42 -17 120 269 189 533 513 437 724 485 359 566 355 382 279
3215 279 208 82 176 -86 -97 -541 -304 -555 -678 -505 -671 -573 -666 -367 -491 -338 -174 -139 -252 53 288 103
3237 103 480 435 717 579 667 787 438 308 576 368 267 40 -150 -42 -374 -484 -595 -422 -291 -697 -461
3258 -461 -715 -632 -685 -568 -425 -403 -138 8 157 -71 374 271 85 600 525 578 501 304 253 304 422 150 269
3281 269 14 -365 -120 -309 -326 -599 -495 -495 -283 -553 -636 -661 -756 -317 -335 -176 12 51 199 161 133 525 367
3304 367 645 468 593 455 514 690 206 199 167 160 98 47 -166 -274 -474 -370 -287 -525 -834 -401 -459 -594 -328
$$ packed form
3146D38M46k43o7O4m60K66m85L1l41J19j40k36j83q8M48j02m6k3K19k02K05r9
3168d79N47l32M20R7J24k8J04J35Q5k5m4k3n6k81J47o6j44k32j1j32k39Mj87j59
3192g75J93J07o9NL58j74o7K28K36n9J37J49q0L44k0p6K87k39j26K07k11K7j03
3215B79p1j26R4k62j1m44K37k51j23J73j66R8r3K99j24J53J64L5j13L05K35j85
3237A03L77m5K82j38Q8J20l49j30K68k08j01k27j90J08l32j10j11J73J31m06K36
3258d61k54Q3n3J17J43K2K65J46J49k28M45j03j86N15p5N3p7j97n1N1J18k72J19
3281B69k55l79K45j89j7k73J04%K12k70q3k5r5M39j8J59J88L9J48l8k8L92j58
3304C67K78j77J25j38N9J76m84pl2po2n1k13j08k00J04Q3k38l09M33n8j35K66
$$ plain form
3327 -328 -384 -82 -178 -169 137 136 70 472 392 423 454 383 623 493 298 183 106 282 -78 -41 -279 -344 -216 -242 -411
3352 -411 -615 -536 -604 -505 -464 -125 -347 -497 -263 33 -219 -129 224 357 284 408 441 660 523 830 658 475
3374 475 320 241 219 133 -8 -82 -146 -205 -314 -521 -462 -676 -420 -158 -409 -445 -527 -163 -152 -207 -266 259 193 434
3398 434 258 387 150 301 519 566 639 776 110 286 335 110 47 -32 -387 -168 -180 -385 -219 -451 -468 -626
3420 -626 -459 -549 -581 -447 -172 -320 -18 25 164 164 209 230 640 455 453 536 595 310 327 640 121 26 145 -52
3444 -52 32 -145 -379 -294 -531 -496 -384 -160 -546 -216 -353 -481 -338 -89 -158 -53 -40 200 141 252 253 468 492
3467 492 378 552 464 707 322 79 120 62 -17 -138 -90 -90 -339 -388 -536 -520 -330 -504 -226 -194 -190 26 -238 -135
3491 -135 -17 -75 196 227 287 357 497 461 349 415 601 333 370 -18 -87 -45 42 12 -107 -179 -394 -166 -303 -518
$$ packed form
3327c28n6L02r6RL06jo6M02q0L1L1p1K40j30j95j15p7J76l60L7k38o5J28k6j69
3352d11k04P9o8R9M1L39k22j50K34K96k52R0L53J33p3J24L3K19j37L07j72j83
3374D75j55p9k2q6j41p4o4n9j09k07N9k14K56K62k51l6q2L64J1n5n9N25o6K41
3398D34j76J29k37J51K18M7P3J37o66J76M9k25o3p9l55K19j2k05J66k32j7j58
3420f26J67r0l2J34K75j48L02M3J39%M5K1M10j85kQ3N9k85J7L13n19r5J19j97
3444e2Q4j77k34Q5k37L5J12K24l86L30j37j28J43K49o9J05J3K40n9J11JK15K4
3467D92j14J74q8K43l85k43M1n8p9j21M8%k49m9j48J6J90j74K78L2MK16k64J03
3491a35J18n8K71L1O0P0J40l6j12O6J86k68L7l88o9M2Q7l0j19p2k15K28j37k15
$$ plain form
3515 -518 -611 -118 -311 -526 -266 -337 -150 -97 24 -81 119 154 -17 161 204 523 322 435 341 350 306 187 386
3538 386 -5 -29 -244 -8 -133 -215 -376 -98 -241 -472 -242 -88 -368 -467 -382 -291 -144 -132 10 41 -77 285
3560 285 487 273 468 426 389 613 328 67 289 121 132 -248 109 -198 -136 -434 -371 -403 -387 -323 -460 -237 -87
3583 -87 97 -339 -417 -52 -45 110 -121 165 210 253 450 431 228 252 460 327 462 166 250 42 66 -29 -190 -75
3607 -75 -132 -161 -365 5 -266 -259 -399 -454 -377 -267 -264 -110 -108 -123 63 -102 61 85 240 437 252 251 23 580 446
3632 446 146 138 298 221 54 -46 -116 -97 -205 -446 -165 -486 -492 -366 -351 -139 -442 -166 -107 -115 31 -40 5 104 21
3657 21 343 339 289 142 173 248 349 335 243 -155 342 -71 32 -41 -111 -169 -135 -397 -496 -248 -438 -83 -303 -129
3681 -129 -290 -75 -62 100 -83 117 61 154 107 240 238 128 401 201 -27 309 461 246 59 -28 -190 10
$$ packed form
3515e18r3M93j93k15K60p1J87N3J21j05K00L5j71J78M3L19k01J13r4Rm4j19J99
3538C86l91k4k15K36j25q2j61K78j43k31K30J54k80r9Q5R1J47J2J42L1j18L62
3560B85K02k14J95m2l7K24k85k61K22j68J1l80L57l07O2k98O3l2J6O4j37K23J50
3583h7J84m36p8L65PJ55k31K86M5M3J97j9k03K4K08j33J35k96Q4k08K4r5j61J15
3607g5n7k9k04L70k71Pj40n5P7J10LJ54Kj5J86j65J63K4J55J97j85jk28N57j34
3632D46l00qJ60p7j67j00p0J9j08k41K81l21oJ26J5K12l03K76N9qJ46p1M5R9q3
3657B1L22mn0j47L1P5J01j4r2l98M97m13J03p3p0n8L4k62r9K48j90L55k20J74
3681a29j61K15J3J62j83K00n6R3m7J33kj10K73k00k28L36J52k15j87q7j62K00
$$ plain form
3703 10 -136 -56 -369 -160 -151 -519 -247 -407 -274 -387 -157 -180 -50 11 -118 -37 320 203 276 262 94 143 516
3726 516 240 352 167 430 173 72 136 -11 20 -337 -114 -268 -327 -93 -96 -149 -43 -130 -73 -285 -212 31 97
3749 97 69 31 170 271 235 63 90 233 363 349 148 392 74 178 236 304 63 -187 40 -174 -252 -211 -208 -75
3773 -75 -203 -178 -492 -283 -13 -265 -42 -98 31 -79 192 279 202 199 313 338 273 355 226 214 -5 507 -2 21
3797 21 -147 -39 -104 -349 -392 -66 -104 -150 -142 -248 -130 -127 -301 -87 -100 55 116 10 -98 36 164 34 490 156
3821 156 104 369 137 136 168 361 209 66 54 -71 114 73 -54 -197 -57 -218 -279 -70 19 -344 -242 -182 -173 -111
3845 -111 -185 160 -222 0 39 100 -15 241 495 98 259 287 103 99 23 99 197 206 32 -65 -418 65 -304 -524
3869 -524 -357 -147 -278 -270 -8 -144 -144 -209 -179 37 -86 -20 54 324 169 140 139 81 273 174 289 147 332 -56
$$ packed form
3703A0j46Q0l13K09Rl68K72j60J33j13K30k3J30O1j29Q1L57j17P3j4j68M9L73
3726E16k76J12j85K63k57j01O4j47L1l57K23j54n9K34ln3J06q7N7k12P3K43O6
3749I7k8l8J39J01l6j72K7J43J30j4k01K44l18J04N8O8k41k50K27k14p8M1LJ33
3773g5j28K5l14K09K70k52K23n6J29j10K71Q7p7lJ14K5o5Q2j29j2k19N12n09K3
3797B1j68J08o5k45m3L26l8m6Qj06J18Lj74K14j3J55O1j06j08J34J28j30M56l34
3821A56n2K65k32jL2J93j52j43j2j25J85m1j27j43J40j61o1K09Q9l63J02O0RO2
3845a11p4L45l82K22L9O1j15K56K54l97J61K8j84mp6P6R8Rj74r7l53M83l69k20
3869e24J67K10j31QK62j36%o5L0K16j23O6P4K70j55k9jn8J92r9J15j42J85l88
$$ plain form
3893 -56 -81 13 -15 -103 -44 -49 -186 -180 -232 -326 -539 -441 -25 -303 -277 -304 -79 -147 77 65 37 105 347 86 255 348 206
3920 206 178 80 249 77 224 174 343 40 -173 -22 -21 33 -352 -357 -162 -201 67 -304 -70 -160 21 -51 102 -195
3944 -195 -174 117 219 70 184 200 119 45 204 287 -14 -81 51 83 26 47 188 -87 -210 -105 -262 -133 -374
3967 -374 -299 -185 -420 -33 94 14 -159 -40 242 1 321 117 -29 157 361 178 212 184 72 59 218 120
3989 120 185 -121 -56 25 239 -13 -399 -93 -53 -109 -248 -176 -203 -291 -105 -57 -238 154 -61 -45 4 82 332 154
4013 154 75 229 150 216 281 33 220 205 -57 -83 -57 -24 70 -133 -69 -320 83 -170 -67 41 -407 12 -79 -367
4037 -367 12 -97 -54 151 -75 -23 -11 60 129 212 42 252 109 207 42 121 285 -15 203 138 -243 -16 0
4060 0 -107 -94 -211 -330 -94 -200 -99 -253 -184 -200 -68 107 -504 -151 -34 37 0 178 145 366 295 133 85
$$ packed form
3893e6k5R4k8q8N9nj37On2r4k13R8M16k78K6k7K25o8K24j2k8O8K42k61J69R3j42
3920B06k8r8J69j72J47n0J69l03k13J51JN4l85nJ95l9K68l71K34r0J81p2J53k97
3944a95K1K91J02j49J14J6q1p4J59Q3l01o7J32L2n7K1J41k75j23J05j57J29k41
3967c74P5J14k35L87J27q0j73J19K82k41L20k04j46J86K04j83L4k8j12j3J59r8
3989A20O5l06O5Q1K14k52l86L06M0n6j39P2k7q8J86M8j81L92k15J6M9P8K50j78
4013A54p9J54p9O6O5k48J87j5k62k6K6L3R4k03O4k51M03k53J03J08m48M19r1k88
4037c67L79j09M3K05k26N2J2P1O9Q3j70K10j43R8j65P9J64l00K18o5l81K27J6
4060@j07J3j17j19K36j06J01j54O9j6J32J75o11L53J17P1l7J78l3K21p1j62m8
$$ plain form
4083 85 97 -72 116 261 193 0 4 -93 -35 -336 -284 -49 -145 -64 -61 -34 -125 -227 -135 -244 242 78 90 -69 457
4108 457 136 117 197 286 139 211 159 153 31 145 -85 -54 144 -422 23 -81 -101 -5 -127 -145 -60 0 -262 -243 135
4133 135 104 -80 208 -25 165 -41 -185 -7 70 121 90 -5 -17 165 7 -93 -164 16 75 -84 -146 -123 31
4156 31 24 -231 -256 -128 -301 -170 -181 -91 -238 -338 101 -304 -114 -338 83 -83 -8 58 -136 56 253 356 391
4179 391 -76 -47 235 264 42 22 8 -64 216 -154 -207 -280 -5 -173 -213 -19 -18 64 -143 177 -235 -9 -146 -64
4203 -64 171 -28 43 -48 197 21 147 333 401 107 344 338 -64 -55 271 271 -98 39 -74 -235 -204 -107 -167 -295
4227 -295 -117 -109 63 4 154 -202 9 101 273 -76 250 29 -37 247 201 162 -54 28 459 69 -249 33 122
4250 122 36 185 0 -45 -28 63 -157 -189 -326 -123 50 -77 -80 190 -23 -100 12 -99 52 87 180 187 114 254
$$ packed form
4083H5J2j69J88J45o8j93Mr7N8l01N2K35r6Q1LK7r1j02R2j09M86j64J2j59N26
4108D57l21j9Q0Q9j47P2n2oj22J14k30L1J98n66M45j04k0R6j22j8Q5O0k62J9L78
4133A35l1j84K88k33J90k06j44J78P7N1l1r5j2J82j58j00p1J80N9j59o2K3J54
4156C1pk55k5J28j73J31j1R0j47j00M39m05J90k24M21j66P5O6j94J92J97J03L5
4179C91m67K9K82K9k22k0j4p2K80l70n3p3K75j68m0J94JQ2k07L20m12K26j37Q2
4203f4K35j99P1r1K45j76J26J86O8k94K37om02RL26%l69J37j13j61L1R7o0j28
4227b95J78QJ72n9J50l56K11R2J72l49L26k21o6K84m6l9k16Q2M31l90l18K82Q9
4250A22q6J49j85m5J7R1k20l2j37K03J73j27lK70k13p7J12j11J51L5R3Pp3J40
$$ plain form
4274 254 49 228 421 86 -36 104 177 26 34 -149 90 -396 17 21 -95 -209 -309 -22 -144 -229 -166 41
4296 41 -8 -261 -134 -56 -52 -74 359 97 104 155 94 86 139 167 84 119 66 211 325 25 59 -270 -65 -172 27 -105
4322 -105 -112 -228 43 -260 -72 -178 -224 -11 115 60 78 -15 -114 -40 89 25 38 -117 206 280 239 81 213 94
4346 94 34 -87 49 143 -101 128 -227 142 -304 -240 -134 -201 46 49 54 134 -38 200 223 281 279 187 125 242 139
4371 139 -164 273 15 132 153 -4 -67 -140 -55 19 43 -113 -124 -165 -148 -108 -105 -50 25 -274 -38 40 -322 -110 -229
4396 -229 -98 99 231 -12 71 127 296 -183 156 127 244 -132 90 184 37 217 42 -92 30 -104 -42 -212
4418 -212 -294 -252 -196 276 -85 19 111 -33 189 -63 -77 23 -169 53 -48 92 -57 -69 331 -84 -14 147
4440 147 -13 -108 166 65 79 -56 -135 -360 136 -91 -207 -93 -53 183 -92 65 -40 -190 85 90 91 267 240
$$ packed form
4274B54k05J79J93l35j22J40P3j51Qj83K39m86M13Mj16j14j00K87j22q5O3K07
4296D1m9k53J27P8Mk2M33k62PN1o1qN3K8q3L5n3J45J14l00L4l29K05j07J99j32
4322a05pj16K71l03J88j06m6K13J26n5J8r3r9P4J29o4J3j55L23P4m1j58J32j19
4346I4o0j21J36R4k44K29l55L69m46O4J06o7K47LNQ0j72K38K3N8kr2o2J17j03
4371A39l03M37k58J17K1j57o3p3Q5P4K4j56j1m1J7M0LN5P5k99K36P8l62K12j19
4396b29J31J97J32k43Q3N6J69m79L39k9J17l76K22R4j47J80j75j34J22j34O2j70
4418b12q2M2N6M72l61J04R2j44K22k52j4J00j92K22j01J40j49j2M00m15P0J61
4440A47j60r5K74j01J4j35p9k25M96k27j16J14M0K36k75J57j05j50K75NJJ76k7
$$ plain form
4463 240 -90 -78 224 103 207 45 151 191 145 64 0 163 124 -34 13 -202 131 140 106 -43 10 -22 39 -300
4487 -300 176 -154 -142 -114 -57 133 45 -15 -15 245 140 -32 292 -77 -248 -120 -103 174 128 -182 66 11 -94
4510 -94 77 -164 -44 -116 1 -89 -143 -29 -37 153 -165 -94 81 -36 111 219 -25 2 -127 69 -74 28 1
4533 1 109 -106 -75 -116 172 -305 -45 98 43 33 -66 -198 -347 -138 -212 189 -233 79 -89 39 132 -234 -26
4556 -26 -215 -119 352 207 -92 -141 174 183 103 265 -58 306 -5 -41 141 -63 22 9 -100 33 -238 -41 -350
4579 -350 118 50 48 -64 -83 -99 59 -109 -64 30 -332 -135 -56 73 11 174 301 67 -51 -92 53 -106 129
4602 129 -56 -81 -129 305 -67 87 2 -190 15 138 -38 -73 -63 -211 -152 -279 -38 42 -244 16 92 93 -32
4625 -32 -74 148 -68 64 34 345 67 99 -61 -89 356 75 174 40 -59 -89 33 129 -9 -145 35 -208 11
$$ packed form
4463B40l30J2L02j21J04j62J06M0m6q1o4J63l9j58M7k15L33Rl4j49N3l2O1l39
4487c00M76l30J2K8N7J90q8o0%K60j05j72L24l69j71J28J7K77m6l10K48n5j05
4510i4J71k41J20p2J17r0n4J14qJ90l18P1J75j17J47J08k44K7j29J96j43J02k7
4533AJ08k15L1m1K88m77K60J43n5j0r9j32j49K09p4M01m22L12j68J28R3l66K08
4556b6j89R6M71j45k99m9L15Rq0J62l23L64l11l6J82k04Q5j3j09J33k71J97l09
4579c50M68o8kj12j9j6J58j68M5R4l62J97P9J29o2J63J27k34j18m1J45j59K35
4602A29j85k5m8M34l72J54q5j92K05J23j76l5J0j48N9j27K41Q0k86K60P6Jj25
4625c2m2K22k16J32l0L11k78L2j60k8M45k81R9j34r9l0J22R6j38j36J80k43K19
$$ plain form
4648 11 -227 -31 11 -24 -117 67 8 39 194 -167 268 333 -87 -66 185 25 14 271 -27 -13 74 -21 69 125 -259
4673 -259 -122 7 -94 25 -292 -138 63 182 -49 -168 -163 -24 -160 -198 161 3 304 102 101 93 18 -40 115
4696 115 -140 45 123 -25 -132 97 10 76 1 156 -72 -144 5 -40 -11 221 -21 -169 87 113 -46 -117 -40
4719 -40 -157 140 -48 -30 -115 84 258 133 252 89 -143 67 151 93 147 41 69 -186 -156 -27 105 -33 -83
4742 -83 91 -176 -131 -203 -34 -7 7 -77 43 -141 28 -130 194 170 250 -5 4 56 -66 -65 -84 22 -53 56 49 -54
4768 -54 87 48 -155 -107 115 140 -189 -192 -79 38 104 64 -82 -37 158 -302 -29 -59 -247 -35 -149 -34 58 -167
4792 -167 52 -43 91 88 47 107 -29 -55 144 144 -76 -12 34 -148 147 29 210 -60 53 102 162 -120 -72 37
4816 37 14 169 -116 126 -74 -97 -76 73 -35 -86 -36 25 338 -38 -75 -46 111 35 178 -217 4 146 -10
$$ packed form
4648A1k38J96M2l5r3J84n9L1J55l61M35O5m20K1K51j60j1K57k98J4Q7r5R0N6l84
4673b59J37J29j01J19l17J54K01J19k31j19NJ39j36l8L59j58L01k02jqp5n8J55
4696A15k55J85P8j48j07K29q7O6p5J55k28p2J49m5K9K32k42j48K56K6j59p1P7
4719d0j17K97j88J8q5J99J74j25J19j63k32K10Q4n8N4j06K8k55L0J29J32j38n0
4742h3J74k67M5p2J69K7J4q4J20j84J69j58L24k4Q0k55RN2j22Jj9J06p5J09pj03
4768e4J41l9k03M8K22K5l29lJ13J17O6m0j46M5J95m60K73l0j88K12j14J15R2k25
4792a67K19r5J34lm1O0j36k6J99%k20O4M6j82K95j18J81k70J13M9O0k82M8J09
4816C7k3J55k85K42k00k3K1J49j08n1N0O1L13l76l7K9J57p6J43l95K21J42j56
$$ plain form
4839 -10 -23 79 148 -55 -89 18 62 81 58 -137 2 31 171 -4 -55 179 204 -67 228 149 39 27 251 33
4863 33 -168 -122 -15 -1 -86 -129 -69 -174 197 193 -220 16 58 -11 38 -120 40 -138 -245 -94 -100 39 200 196 100
4888 100 -20 -141 -80 -201 -36 -28 -321 136 -80 -126 190 -62 12 295 14 -127 198 -100 -137 -56 -113 -99 151
4911 151 -137 136 5 13 96 146 100 -46 -12 -4 -75 42 -202 -9 -264 -59 -43 28 295 -93 156 19 -46 41
4935 41 -122 -156 -14 -8 208 108 74 7 193 -107 -59 -51 119 -168 -31 -7 4 236 56 -7 12 124 119 113 -18 125
4961 125 102 -124 147 -6 185 113 281 -65 -46 -134 107 -64 -35 174 55 232 -82 -111 -61 40 14 245 19
4984 19 34 59 66 -167 38 16 -105 250 189 -86 -64 -142 75 104 -111 -89 140 -164 62 -78 117 32 19 5 -66
5009 -66 0 -104 77 -227 87 386 7 -47 -22 57 64 -125 75 -76 53 -111 -69 122 140 41 15 -15 17 229
$$ packed form
4839a0j3J02O9k03l4J07M4J9k3j95J39K9J40j75n1K34K5k71K95p9j10j2K24k18
4863C3k01M6J07J4q5m3O0j05L71mm13K36M2o9M9j58J60j78j07J51oJ39J61mr6
4888A00j20j21O1j21J65Qk93M57k16m6L16k52P4K83k81j41L25k98l7Q1n7J4K50
4911A51k88K73j31QQ3N0m6j46L4Qp1J17k44J93k55K05J6P1K67l88K49j37o5Q7
4935D1j63l4J42OK16j00l4o7J86l00M8QJ70k87J37K4J1K32j80o3J9J12noj31J43
4961A25k3k26K71j53J91p2J68l46J9q8K41j71K9K09j19J77l14k9N0J01k6K31k26
4984A9J5K5Pk33K05k2j21L55o1k75K2p8K17K9k15K2K29l04K26j40J95q5j3j4p1
5009f6O6j04J81l04L14K99l79n4K5P9Pj89K00j51J29j64M2J91J8r9k6l0L2K12
$$ plain form
5033 229 1 -94 -111 92 -135 -94 77 -89 23 7 122 136 -141 -56 93 -233 18 38 -140 -24 1 109 -286
5056 -286 340 -143 93 193 -315 30 81 232 -159 89 -174 -72 -231 113 -339 12 -296 76 -112 -111 95
5077 95 -16 -183 32 56 139 37 -117 -134 31 268 -35 146 -24 -40 17 -136 216 -254 -44 10 359 -176
5099 -176 -213 -60 -105 -33 -86 -67 -34 -88 223 -51 -143 233 -169 -126 4 -39 -174 -83 -149 272 228 -126 134 -24
5123 -24 84 -151 4 218 -12 81 167 90 9 -84 -67 -19 -342 120 82 12 27 79 20 -149 -387 -29 201 29
5147 29 90 41 165 -102 86 92 233 4 -135 236 29 10 66 -206 59 -39 -121 -81 -49 -11 227 -196 -249 -97
5171 -97 -163 87 -95 -200 -16 -122 -208 187 7 3 -164 -111 488 -139 -1 126 40 151 13 50 -255 224 103
5194 103 206 45 -30 73 -211 -232 -71 -54 -258 -151 -138 -219 -108 -78 -327 102 91 119 204 192 -112 116 126 130
$$ packed form
5033B29k28r5j7K03k27M1J71j66J12j6J15J4k77Q5J49l26K51K0j78J16K5J08l95
5056b86O26m83K36J00n08L45N1J51l91K48k63J02j59L44m52L51l08L72j88JK06
5077I5j11j67K15K4Q3j02j54j7J65K37l03J81j70j6N7j53L52m70K10N4L49n35
5099a76l7J53m5P2n3J9L3n4L11k74r2L76m02M3J30m3j35R1o6M21m4l54K60j58
5123b4J08k35J55K14k30R3Q6p7q1r3J7M8l23M62l8p0J5N2n9j69k38L58K30j72
5147B9O1m9J24k67J88OJ41k29j39L71k07j9N6k72K65r8q2M0L2L8K38m23n3J52
5171i7o6K50j82j05J84j06q6L95j80mj67N3N99o27J38J27q6J11j38L7l05M79j21
5194A03J03j61p5J03k84k1J61J7k04J07J3q1J11L0k49M29j1K8Q5j2l04K28J0M
$$ plain form
5218 130 61 -96 59 -148 -124 -69 51 -4 60 200 170 106 27 18 -207 -207 -162 -74 -61 82 -171 -77 -80 41 -1 -243
5244 -243 -25 92 -318 57 106 15 62 307 50 126 24 318 -14 321 205 -199 63 -97 -27 83 137 -68
5266 -68 -164 -64 30 -148 9 -312 107 158 117 -101 41 52 290 -249 41 166 129 215 101 135 90 260 -12
5289 -12 -37 223 -113 -46 207 136 137 -161 191 22 -178 -61 -173 9 -86 34 -14 -184 -203 -51 -80 -3 -182 129
5313 129 -38 -25 107 271 -110 -34 89 45 -16 129 110 -193 -87 286 -141 123 -131 -169 -90 -183 -13 -106 49
5336 49 146 -251 -92 -143 -200 -58 -93 -51 -122 101 -26 -173 -18 85 -45 -63 -13 -229 -55 -8 69 123 28 -191
5360 -191 -138 -202 -90 -38 -110 85 -102 -144 -39 -16 -172 -120 144 30 59 202 -164 -65 -83 66 137 -195 46 256
5384 256 412 24 -98 -226 154 251 -70 157 -262 -42 -321 128 -55 -93 7 -55 -46 -102 -252 146 80 -90
$$ packed form
5218A30o9j57J55k07K4N5J20n5O4J40l0o4p9rk25%M5Q8J3J43k53R4lJ21m2k42
5244b43K18J17m10L75M9r1M7K45k57P6j02K94l32L35j16m04K62j60P0J10N4k05
5266f8r6J00R4j78J57l21M19N1m1k18J42J1K38n39K90J25l7Q6j14L4m5J70k72
5289a2k5K60l36O7K53p1Jk98L52j69k00J17j12J82r5J20m8j70j9J52k9P7j79L11
5313A29j67J3J32J64l81P6J23m4o1J45j9l03J06L73m27K64k54l8P9r3J70r3J55
5336D9R7l97J59n1n7J42l5M2p1K23j27j47J55J03j30j8N0k16J74M7P7N4r5k19
5360a91N3o4J12N2p2J95j87m2J05K3j56N2K64j14K9J43l66R9j8J49P1l32K41K10
5384B56J56l88j22j28L80R7l21K27m19K20k79M49j83l8J00o2Rn6j50L98o6j70
$$ plain form
5406 -90 -83 -146 -32 -5 76 248 134 -48 -13 55 99 35 104 56 -44 -52 67 28 -5 -57 -311 -190 -128 165 11 102
5432 102 -29 -15 15 -130 118 -75 13 -290 -22 141 71 -30 -195 -86 205 172 175 133 196 350 12 -53 50
5455 50 -159 -136 -110 -80 -34 -112 2 -129 -200 -28 258 -13 -229 -162 64 -189 43 3 75 125 254 116 33 -255
5479 -255 41 39 -64 -19 99 13 110 -7 -126 -13 -10 13 -29 -83 -317 -44 -29 -209 24 18 -102 39 -62 131
5503 131 -151 -72 -90 241 19 52 41 -87 -59 215 179 -17 60 -88 -23 13 124 -165 -279 -37 -163 -102 304
5526 304 -76 -123 25 0 7 -209 56 -74 39 7 -20 4 -66 -37 -6 64 135 -80 -89 -29 -150 -98 235 -2 41 230
5552 230 -53 -124 -180 17 5 -98 -108 -21 -383 93 -74 -107 -174 49 -301 -14 -68 93 -150 -303 -86 21 103
5575 103 20 164 44 59 40 95 160 -154 19 -11 0 61 -135 -288 -92 14 -245 -54 -68 -63 25 -122 -84 -119 -205
$$ packed form
5406i0Po3J14K7Q1J72j14j82L5O8M4o4O9m8j00qJ19l9l3n2k54J21O2K93j54R1
5432A02j31J4L0j45K48j93Q8l03K68J63p0j01j65J09K91l3Lm2O3J54l38o5J03
5455E0k09K3K6L0M6p8J14j31p1J72K86k71k16O7K26k53K32m0P2N0J29j38q3k88
5479b55K96kj03M5J18q6R7j17j19J13LK3m2n4k34K73J5j80K33oj20J41j01J93
5503A31k82P9j8L31k22L3j1j28K8K74l6j96P7j48O5L6J11k89j14K42j26O1M06
5526C04l80m7J48k5Pk16K65j30J13l2k7K4p0K9L1P0P1k15rO0j21N2L33k37M3J89
5552B30k83p1n6J97j2j03j0Q7l62M76j67l3o7K23l50K87n4J61k43j53K17J07Q2
5575A03q3J44j20J5j9N5O5l14J73l0J1O1j96j53J96J06k59J91j4NQ8j47L8l5q6
$$ plain form
5600 -205 -120 47 -25 131 -119 -30 80 -213 165 201 82 276 92 19 222 -67 -45 -64 72 -82 -203 -328
5622 -328 -165 -38 12 -44 73 12 42 -207 -153 -19 -99 59 83 58 136 146 -40 31 257 -102 47 -94 368 8
5646 8 -66 33 -115 284 112 67 2 -191 -219 -295 -194 -145 -123 57 -297 62 109 69 -115 -71 90 -188 24 -180
5670 -180 8 -61 -30 -148 168 139 -156 159 -31 -334 0 16 -12 -64 -180 -105 -183 -63 -53 -170 -194 279 -171
$$ packed form
5600b05Q5J67p2J56k50Q9J10k93L78L6j19J94j84p3K03k89K2j9J36j54j21j25
5622c28J63J27N0n6J17o1L0k49N4J34q0J58K4k5P8J0j86P1K26l59J49j41M62l60
5646Hp4R9j48L99j72m5o5j93k8p6J01M9K2J80l54L59M7m0j84M4J61k78K12k04
5670a80J88o9L1j18L16k9k95L15j90l03L34J6k8n2j16P5p8J20J0j17k4M73m50
$$ [...]
8191c9
##END NTUPLES=NMR FID
##END=
