##TITLE=1H_Pr 5154-Eth
 CDCl3
 8 sc, 
 18.11.2022
##JCAMPDX= 6.0         $$ Bruker NMR JCAMP-DX V2.0
##DATA TYPE= NMR FID
##DATA CLASS= NTUPLES
##ORIGIN= UXNMR, Bruker Analytische Messtechnik GmbH
##OWNER= root
$$ XWIN-NMR		Version 3.5
$$ Fri Nov 18 12:39:37 2022 Russian Standard Time (UT+4h)  she@DPX200
##.OBSERVE FREQUENCY= 200.1313499994
##.OBSERVE NUCLEUS= ^1H
##.DELAY= (6, 6)
##.ACQUISITION MODE= SIMULTANEOUS
##.ACQUISITION SCHEME= undefined
##.AVERAGES= 8
##.DIGITISER RES= 18
##SPECTROMETER/DATA SYSTEM= spect
##.PULSE SEQUENCE= zg30
##.SOLVENT NAME= CDCl3
##.SHIFT REFERENCE= (INTERNAL, CDCl3, 0, 15.7039)
##AUDIT TRAIL= $$ (NUMBER, WHEN, WHO, WHERE, WHAT)
$$ ##TITLE= Audit trail, XWIN-NMR		Version 3.5
$$ ##JCAMPDX= 5.01
$$ ##ORIGIN= Bruker BioSpin GmbH
$$ ##OWNER= she
$$ F:/spectra/data/she/nmr/H-F/1/audita.txt
$$ ##AUDIT TRAIL=  $$ (NUMBER, WHEN, WHO, WHERE, WHAT)
(   1,<2022-11-18 12:37:51.73 +0400>,<she>,<DPX200>,
      <created by zg, POWCHK disabled, PULCHK disabled
       configuration hash MD5:
       00 E9 B6 7A A2 85 ED C7 34 08 36 98 17 FE 4E 26
       data hash MD5: 16K
       3F 6C 38 7E 03 C0 84 D4 79 2E D5 A1 5B 53 CC E0>)
$$ ##END=
$$ 
$$ hash MD5
$$ 13 D6 5F 92 B9 2C F1 33 45 28 DE E0 6C 45 B6 24
##$RELAX= 
##$RELAX= 
##$RELAX= 
##$RELAX= 
##$RELAX= 
##$RELAX= 
$$ Bruker specific parameters
$$ --------------------------
##$DU= <F:/spectra>
##$EXPNO= 1
##$NAME= <H-F>
##$PROCNO= 1
##$TYPE= <nmr>
##$USER= <she>
##$AMP= (0..31)
100 100 100 100 100 100 100 100 100 100 100 100 100 100 100 100 100 100 
100 100 100 100 100 100 100 100 100 100 100 100 100 100 
##$AQSEQ= 0
##$AQ_mod= 1
##$AUNM= <au_zg>
##$AUTOPOS= <>
##$BF1= 200.13
##$BF2= 200.13
##$BF3= 200.13
##$BF4= 200.13
##$BF5= 200.13
##$BF6= 200.13
##$BF7= 200.13
##$BF8= 200.13
##$BYTORDA= 1
##$CFDGTYP= 0
##$CFRGTYP= 5
##$CHEMSTR= <none>
##$CNST= (0..31)
1 1 145 1 1 1 1 1 1 1 1 1 1 1 1 1 1 1 1 1 1 1 1 1 1 1 1 1 1 1 1 1 
##$CPDPRG= <>
##$CPDPRG1= <>
##$CPDPRG2= <>
##$CPDPRG3= <>
##$CPDPRG4= <mlev>
##$CPDPRG5= <mlev>
##$CPDPRG6= <mlev>
##$CPDPRG7= <mlev>
##$CPDPRG8= <mlev>
##$CPDPRGB= <>
##$CPDPRGT= <>
##$D= (0..31)
0 1.2 0 0 0 0 0 0 0 0.06 0 0.03 0 0 0 0 0.0002 0 0 0 0 0 0 0 0 0 0 0 0 
0 0 0 
##$DATE= 1668760671
##$DBL= (0..7)
120 120 120 120 120 120 120 120 
##$DBP= (0..7)
150 150 150 150 150 150 150 150 
##$DBP07= 0
##$DBPNAM0= <>
##$DBPNAM1= <>
##$DBPNAM2= <>
##$DBPNAM3= <>
##$DBPNAM4= <>
##$DBPNAM5= <>
##$DBPNAM6= <>
##$DBPNAM7= <>
##$DBPOAL= (0..7)
0.5 0.5 0.5 0.5 0.5 0.5 0.5 0.5 
##$DBPOFFS= (0..7)
0 0 0 0 0 0 0 0 
##$DE= 6
##$DECBNUC= <off>
##$DECIM= 32
##$DECNUC= <off>
##$DECSTAT= 4
##$DIGMOD= 1
##$DIGTYP= 9
##$DL= (0..7)
0 120 120 120 120 120 120 120 
##$DP= (0..7)
150 150 150 150 150 150 150 150 
##$DP07= 0
##$DPNAME0= <>
##$DPNAME1= <>
##$DPNAME2= <>
##$DPNAME3= <>
##$DPNAME4= <>
##$DPNAME5= <>
##$DPNAME6= <>
##$DPNAME7= <>
##$DPOAL= (0..7)
0.5 0.5 0.5 0.5 0.5 0.5 0.5 0.5 
##$DPOFFS= (0..7)
0 0 0 0 0 0 0 0 
##$DQDMODE= 0
##$DR= 18
##$DS= 0
##$DSLIST= <SSSSSSSSSSSSSSS>
$$ [...]
##$SUBNAM2= <"">
##$SUBNAM3= <"">
##$SUBNAM4= <"">
##$SUBNAM5= <"">
##$SUBNAM6= <"">
##$SUBNAM7= <"">
##$SUBNAM8= <"">
##$SUBNAM9= <"">
##$SW= 18.0517283424941
##$SWIBOX= (0..15)
0 0 2 0 0 0 0 0 0 0 0 0 0 0 0 0 
##$SW_h= 3612.71676300578
##$TD= 16384
##$TD0= 1
##$TE= 0
##$TE2= 300
##$TE3= 300
##$TEG= 300
##$TL= (0..7)
0 120 120 120 120 120 120 120 
##$TP= (0..7)
150 150 150 150 150 150 150 150 
##$TP07= 0
##$TPNAME0= <>
##$TPNAME1= <>
##$TPNAME2= <>
##$TPNAME3= <>
##$TPNAME4= <>
##$TPNAME5= <>
##$TPNAME6= <>
##$TPNAME7= <>
##$TPOAL= (0..7)
0.5 0.5 0.5 0.5 0.5 0.5 0.5 0.5 
##$TPOFFS= (0..7)
0 0 0 0 0 0 0 0 
##$TUNHIN= 0
##$TUNHOUT= 0
##$TUNXOUT= 0
##$USERA1= <user>
##$USERA2= <user>
##$USERA3= <user>
##$USERA4= <user>
##$USERA5= <user>
##$V9= 5
##$VALIST= <valist>
##$VCLIST= <CCCCCCCCCCCCCCC>
##$VD= 0
##$VDLIST= <DDDDDDDDDDDDDDD>
##$VPLIST= <PPPPPPPPPPPPPPP>
##$VTLIST= <TTTTTTTTTTTTTTT>
##$WBST= 1024
##$WBSW= 4
##$XGAIN= (0..3)
0 0 0 0 
##$XL= 0
##$YL= 0
##$YMAX_a= 461923
##$YMIN_a= -718689
##$ZGOPTNS= <>
##$ZL1= 120
##$ZL2= 120
##$ZL3= 120
##$ZL4= 120
##$ABSF1= 10
##$ABSF2= 0
##$ABSG= 5
##$ABSL= 3
##$ALPHA= 0
##$AQORDER= 0
##$ASSFAC= 0
##$ASSFACI= 0
##$ASSFACX= 0
##$ASSWID= 0
##$AUNMP= <proc_1d>
##$AZFE= 0.1
##$AZFW= 0.1
##$BCFW= 1
##$BC_mod= 2
##$BYTORDP= 1
##$COROFFS= 0
##$CY= 11.3945322036743
##$DATMOD= 1
##$DC= 2
##$DFILT= <>
##$DTYPP= 0
##$F1P= 2.36226072786647
##$F2P= -0.459571619588291
##$FCOR= 0.5
##$FTSIZE= 0
##$FT_mod= 4
##$GAMMA= 1
##$GB= 0.15
##$INTBC= 1
##$INTSCL= 1
##$ISEN= 128
##$LB= 0.24
##$LEV0= 0
##$LPBIN= 0
##$MAXI= 10000
##$MC2= 0
##$MEAN= 0
##$ME_mod= 0
##$MI= 1.114404
##$NCOEF= 0
##$NC_proc= 0
##$NLEV= 6
##$NOISF1= 3.799351
##$NOISF2= 2.8
##$NSP= 1
##$NTH_PI= 0
##$NZP= 0
##$OFFSET= 15.70392
##$PC= 1
##$PHC0= -18025.69
##$PHC1= 4.000698
##$PH_mod= 1
##$PKNL= yes
##$PPARMOD= 0
##$PSCAL= 0
##$PSIGN= 0
##$REVERSE= no
##$SF= 200.130013532006
##$SI= 16384
##$SIGF1= 3
##$SIGF2= 2
##$SINO= 400
##$SIOLD= 16384
##$SREGLST= <1H.CDCl3>
##$SSB= 0
##$STSI= 0
##$STSR= 0
##$SW_p= 3612.71676300578
##$SYMM= 0
##$S_DEV= 0
##$TDeff= 0
##$TDoff= 0
##$TI= <>
##$TILT= no
##$TM1= 0
##$TM2= 0
##$TOPLEV= 0
##$USERP1= <user>
##$USERP2= <user>
##$USERP3= <user>
##$USERP4= <user>
##$USERP5= <user>
##$WDW= 1
##$XDIM= 8192
##$YMAX_p= 0
##$YMIN_p= 0
$$ End of Bruker specific parameters
$$ ---------------------------------
##NTUPLES= NMR FID
##VAR_NAME=  TIME,          FID/REAL,        FID/IMAG
##SYMBOL=    X,             R,               I
##VAR_TYPE=  INDEPENDENT,   DEPENDENT,       DEPENDENT
##VAR_FORM=  AFFN,          ASDF,            ASDF
##VAR_DIM=   8192,          8192,            8192
##UNITS=     SECONDS,       ARBITRARY UNITS, ARBITRARY UNITS
##FACTOR=    0.0002768,     1,               1
##FIRST=     0,             0,               0
##LAST=      2.2672688,     0,               0
##MIN=       0,             -718689,         0
##MAX=       2.2672688,     461923,          0
$$ Real data points
##PAGE= N=1
##DATA TABLE= (X++(R..R)), XYDATA
0@%%%%%%%Qj6J6j6K4l2M0n6P2q8J04j28J58j90K24k64L12l68M32n04N87o80P81
30D16q93J021j163J320j491J683j895K125k380K658k962L292l654M053m486M960
46B604n475O037o657P339q084Q903r811J0820j1946J3209j4640J6274j8160K0366
60A0779k2983K6153l0088L5119m1813N1213o5478Q9958j43289M63665k92505m90169
72d09438Q32011j63862l86899K14374n518m45916K72429K22881l71213P730M80288
83B46867j71893k66105J97087R4943l9395J19859k16695k29468K88724J75986
93A99910l42458p6071K49216k6509m4561K06000j02165j53468K76063N1757l00747
104f3033R8022J65848k45422q6989J86221r0359j08053J99346l9515k64239J72931
$$ y = [0, 0, 0, 0, 0, 0, 0, 0, 8, -8, 8, -8, 16, -16, 24, -32, 40, -48, 56, -72, 86, -104, 120, -144, 168, -200, 232, -272, 315, -365, 416, -477, 544, -619, 701, -790, 893, -1002, 1123, -1257, 1401, -1561, 1731, -1923, 2130, -2356, 2604, -2871, 3166, -3491, 3848, -4236, 4667, -5144, 5676, -6270, 6939, -7701, 8573, -9587, 10779, -12204, 13949, -16139, 18980, -22833, 28380, -37098, 52860, -90429, 373236, 80731, -409438, 422573, 258711, -128188, 86186, 80668, -365248, -92819, 130062, -241151, -233421, 246867, 74974, -191131, 5956, 100899, 61504, 181363, -35332, -264800, 23924, 199910, -142548, -218619, 30597, 4088, -40473, 165527, 63362, -90106, 185957, 237714, -63033, 34989, 200837, -44585, -131574, 54647, -35712, -143765, 55581, 16066, -248173, -75242]
115g5242K22304j83917l2728J32236j01913J5297J51066j22126r0061J57390k5731
126D6575j44941J03117L9647j50514J24095J42259k40106j4337K99745j04093
136A01447k26167J78903R6749k01093k0031J09921r3661l3905J41572p5228j43652
147a65145J39947P5970j14884L7035P4090n4104J3643M5084n6191l420Q2246m7834
159B6437j04921P3772O7828q4430l88N5052k9930K7916K8225q0067J166P8369
171E9029l8448o8030L9591J7477o9533Q189M4966m6164K1369O9151p4506l4168
183g1077J09904K3665o0956P905K9103k2554j7425K0093n903q675K0797m0702
195a5825l6050N9375J9135k8043J7255q258k7015K2235J3770k0839m99J8476k9415
$$ y = [-75242, 147062, -36855, -69583, 62653, -39260, -23963, 127103, 4977, -85084, 72306, 46575, -98366, 4751, 44398, -106116, 17979, 160238, -79868, -94205, 205540, 101447, -124720, 54183, 150932, -50161, -70192, 39729, -53932, -87837, 53735, -21493, -165145, -25198, 50772, -64112, -27077, 47013, -7091, 6552, 51636, -4555, -7975, 74271, 26437, -78484, -4712, 63116, -21314, -21702, 33350, 3420, 31336, 59561, -20506, -19340, 59029, 20581, -47449, -7858, 9619, -59914, -51725, -6759, -52923, -31554, 37597, -36909, -71077, 38827, 62492, 1536, 9441, 38544, 15990, -1435, 18658, 12755, 4080, 24877, -15825, -51875, 7500, 26635, -1408, 15847, 7589, -19426, 2809, 16579, -4260, -4759, 13717, -15698]
208a5698l6946M1801J9229l9099K0737J6989l5926K0263L4393j5991j522J8374
220B6604m569j5728J0677Q540l2884n817K5015j2979m987K002k3691J7088K9081
233A8352j6175m444J1756r030j6288Q007K5851q942k0023L209k3113j665N2213
246A9708L498l5424L41J4859N460p49J2425J0613k3453j3216M277o591J5813Q973
260A6534k5476r063M110O475J0076m820J561M946n544M460m424l560J3602o156
274B721q632P836m700m815K86M614J1056o305j034O077j6479N772K0849q452l833
289D961p74j4197k686J0273J2760m485j3790N051n888m798K3809l05j1341J0511
303I101j0821j3477J4888J1935m400r869J481J67j2139J3084J0271j7732R236
$$ y = [-15698, -52644, -10843, 8386, -30713, -9976, 7013, -28913, -8650, 25743, 9752, 8230, 26604, 22035, 6307, 16984, 25524, -7360, -13177, 11838, -1141, -6128, -4126, -27817, -10729, 18352, 2177, -2267, 9489, 459, -15829, -7822, 18029, 9087, -10936, -7727, -30840, -32505, 19708, 23206, -12218, -11877, 2982, 8442, 7693, 20118, 30731, 7278, -5938, -1661, -8252, 7561, 16534, -8942, -18005, -13895, -7420, 2656, -2164, -603, 4343, -1201, 3259, -1165, -4725, 8877, 2721, -5911, 1925, -2775, -7590, -7304, -2690, 8366, 2061, 1027, 7104, -9375, -3603, 17246, 8794, 4961, 4187, -10010, -12696, -2423, 10337, 5852, -7938, -2887, -8775, -13573, 10236, 9931, -1410, 9101, -1720, -15197, -309, 11626, 7226, -2643, -1162, -995, -13134, -50, 10221, -7511, 1725]
316A725O270k1092M893J4362k252J28o74l479n752K567J0031p017L604J0538k2488
331h636l727J8886r466J636J5221j1931j2792P441R134o467j508J5706j3238j9570
345a9311K0260J612j3001J6445l14j7910L770P384J410K545O067k682j2191R162
359C246M151j3229J4843O350k2879N702P405j5043N749J3526p501j2315O411Q258
373D674j4361L175K0209j4728q562J2909j0669l331J5372m21n355J7J013j895
387a953o24J2272j06r379P835n696r211J4953k4q917M249l995q903j080P729P999
403E149p735k427L931q500M807R423n116M020K171p212j986l423P592R701q114
418B281m508r6J027Q608k077j964N628n119m152n863m015J4757L218j1685l415
$$ y = [1725, 7995, -13097, -8204, 6158, 3906, 4034, 3360, -119, -5871, -3304, 6727, -290, 3314, 13852, -8636, -12363, 6523, -2943, -1307, 13914, 1983, -10809, -3368, 5766, -701, -2209, 13497, 259, -19311, 949, 2561, -10440, 6005, 5691, -12219, -8449, -1065, 345, 2890, 8957, 6275, -5916, 3246, 7397, -5832, 9011, 15361, -7518, -1816, 5589, -9454, -3705, 9821, 2320, -9995, -3584, 4674, -9687, -6512, 13697, -1031, -9593, 3316, -7353, -10684, 4688, 4267, -1088, -1071, -58, -1953, -2577, 9695, 9589, 210, 8045, 2349, -6862, 8091, 8067, -850, 3399, -596, -9499, -10579, -2850, 5149, -2586, -5013, -1082, -9582, -4775, 4648, -468, 3552, 5723, -1489, -3475, -6898, 694, 10395, 2281, -2227, -2323, -1296, 7312, 5235, 3271, 8899, 3780, -372, -6235, -10250, 4507, 7725, -3960, -7375]
433g375m913N573J1777m031k522L677J625k604j0002O549J4232o169n784o306
447f273o829J5909P916j0593j408L085J227l968n531Q865O701q69m133j3889L030
462f760J4183n004l486j405o729O766J575q212N971R665p73j1319m118J4446L458
477H258k903L089j0203m378Q405n101q23N788j897Q72k336l066N449P006L919
492A2079j0376r195J1124l388j0826J0911J361r128J601k71m71L938P510N080
506I949p538k122K832m866O307K380r198Q226r34j8339O298J4547m984o551M727
521G34N72j1462O662J5724j0942k369J0335j6137n045J6240k708l834N463n340
535b107o274P227P209q765N62J5182j2943j1629K0564j019j2513J1026k670j2661
$$ y = [-7375, -12288, -6715, 5062, 1031, -1491, 2186, 3811, 1207, -8795, -2246, 11986, 5817, 33, -6273, -13102, 2807, 10723, 130, -1278, 1807, 3034, -934, -6465, 2400, 9101, 8232, 4099, -9790, -6760, 7423, 2419, -1067, -2472, -9201, -2435, -860, -9072, -3101, 6564, 5791, -5528, -9646, 4800, 8258, 5355, 8444, -1759, -6137, 2268, -2833, -3656, 2132, 235, 1107, -1229, -4295, 1154, 8160, 12079, 1703, -7492, 3632, 244, -10582, 329, 1690, -7438, -5837, -6108, -6579, -2641, 4869, 9949, 2411, 289, 3121, -1745, 4562, 6942, -2256, 5970, 5036, -13303, -7005, 7542, 2558, -3993, 734, 1306, -10156, -3494, 12230, 1288, -1081, 9254, -6883, -11928, 4312, 1604, -2230, 3233, -2107, -8381, -1154, 6055, -2710, -2148, 13034, 91, -11538, 9026, 8007, -4506, 6520, 3850, -8811]
549h811P209L411r919K548J6007p092j6838J4661O642j5303J2673O973k2254M027
563f066J3293j2517l338J6951J543j6567M02Q659n524R285P250k2877M470J8850
577A3814k1353n136K6355m750j9694Q115M984j6475R093K4932k0857j5846K9806
590A2988l194k3550J7276P407j5766N463L168j4789N097K0501j0354j7695J9502
603F054L519k5175J2780J2863k0116R025J6950k2172r521K3906K782k0628P386
616b347J2971k0042N84K2275j3940m401K2081j4730j9245J8843Q299j4211K584
629a279R347j5020n620K2758n670j6622J9609j254k4059J3647J3214j3328L572
642g05J2379j1801r582J6510K686j9820R768J2189k0620J238J6712j2019j233
$$ y = [-8811, -1602, 1809, -8110, -5562, 10445, 3353, -13485, 1176, 7818, -7485, 5188, 12161, -10093, -6066, 7227, -5290, -8628, 8323, 9866, -6701, -6299, 2360, -3164, 6121, 13371, -9506, -5036, 13814, -7539, -12675, 13680, 8930, -10764, -2649, 2335, -14140, -5047, 19885, -972, -16818, 12988, 9794, -13756, 3520, 10927, -4839, 624, 3792, -10997, -5900, 14601, 4247, -13448, 6054, 9573, -15602, -2822, 10041, -10075, -1050, 15900, -6272, -15793, 8113, 10895, -9733, -2347, 10624, -9418, -8834, 13441, -499, -4900, 17181, 2451, -16794, 2049, 10348, -3863, -1279, 8068, -6952, -12572, 10186, 4516, -12106, 7503, 6249, -17810, -4163, 9051, -4277, -705, 11674, -127, -9709, 6801, 9487, -10333, -565, 11624, -8996, -7758, 8954, -3065, -4298]
655d298J4935p052j0105P952K157j1184N249J3022j3330m580J3875j2034m475
668i868K2240q067j6897J2201M888j1751M999J5291q387j2433J0827j858j1378
681a0193J6804M290j8699M123P700o340L640M820n715l637M666k593q320J1371
695A917Q088j6054K099J0471j2021P08J1867p654o062R179J705j1008J621J4620
709I476n406q272R095m314p062R914k78m468M986j222n220n77L237K350j485J146
725A900m290n828R257J728o416P558N30r754J813L909K14l96R01J137o213J49
741c801Q396k580j407L318m424n06J314j134M557j096m037J141j680n08P03J388
757c56L218n828j720P043l924n80P309k698l400J190l61m62q65K750J083m812
$$ y = [-4298, 10637, 3585, -6520, 1432, 3589, -7595, -2346, 10676, -2654, -7234, 6641, -5393, -9868, 12372, 4305, -12592, -391, 4497, -7254, -2255, 13036, 4649, -7784, 3043, 1185, -10193, 6611, 10901, -7798, -3675, 4025, -2315, 1325, 6145, 430, -3207, 1459, -1134, -9454, 1917, 10005, -6049, -3950, 6521, -5500, -4792, 7075, -579, -6641, 2538, 4243, -6765, -5144, 9476, 4070, -4202, 4893, 579, -6483, 3431, 3153, -1315, 3671, 2449, -2771, -3348, -111, 2239, 754, 1900, -2390, -8218, 1039, 2767, -3649, 3909, 4439, -5315, -3502, 407, 621, 225, 1126, 2263, -3950, -3801, 4595, 2015, 608, 3926, -498, -1004, 310, -824, 3733, 2637, -1400, -259, -1939, -2447, -1744, -356, 2862, -2966, -4686, 2357, -1567, -2147, 5162, 2464, -936, 254, -107, -569, -1434, 1316, 2399, -2413]
773b413J995J082l100M283j003j810N819l844m515M295L03p52O50N68k912n986
789g340N419N644o613M121M127r999J84O815Q88k66j210k040l833N1P174j099
805B023l041L012n835q31P872k169L44L713n419l099L910L583l080l428M859k938
821e24o184Q057L02p303N553K521m523J433J819n25j461J371L131l838j127J222
837g6m358M795M528n751J268L38n162M043N522r56m105j239J376m136J495R003
853F585n704o547M842k155j91O814k16l339k100K03K199m61L329m81n637K671
869a88m59k551O609j010n415L464N98k253R71K183L92m023K074L017o636J207
885b020N453m840K92L189l376j298P28K007J551j270J219k115k692M388m15j031
$$ y = [-2413, -418, 664, -2436, 1847, 844, -966, 4853, 1009, -3506, 789, 1092, 340, 990, 1558, -1354, -7340, -1921, 3723, -2890, 1231, 5358, -4641, -4457, 2358, 3246, 2980, 1770, -270, -4103, -4052, 3122, 2023, -1018, 1994, -3841, -4672, 3200, 1031, 1375, 5088, -331, -3430, 480, 4063, 983, -2445, 2414, -524, -6708, 1349, 1651, -5652, -99, 2422, -2101, -668, 1151, 626, -835, 536, 3667, -171, -1298, -76, -4434, 361, 4889, -862, 406, 744, -4418, -375, 5147, 4191, 86, -1153, 223, -3913, -2418, 6585, 881, -5666, -824, -2979, -3170, 3644, 3428, 89, -2011, -1808, 391, -70, 3259, 2778, -2859, -188, -647, -3198, 3411, 2401, -3014, 450, 1048, -1205, -234, 1949, 2341, -1682, 392, 3409, -3227, -2020, 3433, -1407, -1115, 2074, -1302, -2600, -1872, 135, 1686, 416, 1635, -480, -3172, 1216, 801, -230]
901b30L632m826k042M144r43Q53K233j423j945k112L472K318l561K705K56o093
917c562J981J774j098K046j581q04J65j828L026J290j472J104k345J31J514j645
933a304L707M22m568K057K41j627K455m11j02L31k416J272k26o19K428k309J15
950e54J258k770J941N90k795L335L76l875O91J102J454N5j020K238l096j087M351
967B194k383l3M579l618k655J142P45K352q16j431p52k200K588Q07j573M067k204
984H09m024K808l29K77L393k080l055l38K147K162k905Q16K211l858J190K239
1000A463k235K644M05l038Q45j91L35O31j137J596r75n82J046m133J399N507l413
1017A67j013J783k977M45J673M15M29j342K72j924j545N428L36l019K298k555
$$ y = [-230, 3402, -1424, -3466, 678, -265, 588, 2821, 1398, -547, -2659, 813, 3131, -430, 2275, 2531, -3562, -1581, 193, -905, 1141, -440, -1244, -1079, -2907, 119, 1409, -63, 1041, -1304, -1173, 341, -1304, 2403, 2825, -1743, 314, 555, -1072, 1383, 972, 870, 1201, -1215, 57, -169, -788, 1640, -669, -554, 704, -2066, -125, 465, -2330, 1005, 1381, -2494, -1803, -701, 753, 808, -212, 2026, -1070, -2157, 2194, -189, -222, 4357, 739, -1916, -774, -29, 2323, 1507, 76, -676, -2876, -288, 519, -1054, 3013, 809, -3215, -407, -736, -459, 2934, 854, -2201, -2539, -392, 1770, -1135, -319, 1892, -1966, -776, 1463, -772, 1872, 2277, -761, 84, -107, 228, 859, -278, 1318, 343, -239, 807, -3326, -1927, 3580, 167, -846, 937, -2040, -1595, 78, 493, 922, -420, -148, -2072, -3617, 1811, 2147, -872, 1426, -1129]
1033a129j058M912r49j131J540m65j776j888K471J966l458J248l56m228M244J694
1049A637m055K514J169k323j02K8J814n79M4Q92m210J093M342l326N78L342k789
1066F9M47P42j344J508J618o65l198j381L717j272k285L487k553j722L242k368
1082a958l75L853m32j616n48M41J051q99J583n44k602L637j396l876M949J429
1098B697k949J459l27j114J054J400q3k833J284J128n125J738L519l902J185J397
1114E28m172J820L243j078j419J323J908l574k55M958l377j248M736m426k508
1129c541N820m81k621J514J822k178j895L976n49l571L988r72o356M426K221m600
1145b997J695J954k851q02L223P80k964L347K785o852J203N816m994p02M855l218
$$ y = [-1129, -2187, 2725, 1776, 645, 2185, 1720, -56, -1944, 527, 2493, -965, 283, -73, -4301, -57, 1637, -2418, 96, 1265, -1058, -1160, -1132, 682, 103, 147, 1039, -3171, -2078, 2264, -1062, -484, 2858, 69, 516, 1258, -86, 1422, 3040, 2375, -823, -2204, 1513, 241, -2044, 1443, -1110, -2832, 410, -1958, -2333, 1520, 1088, -528, -1076, -635, 416, -483, 1100, 556, -2046, 1591, 195, -3681, 1268, 2697, -252, 1207, 880, -234, 820, 2220, 2137, -696, 588, 1716, -3409, -1671, 1848, -2054, -869, 528, -3644, -1824, 1419, 341, -1078, 245, 2153, -1421, -1676, 3282, -95, -1343, 3393, -1033, -3541, 2279, 1798, -823, 691, 2513, 335, -1560, 2416, 1867, -1704, 2284, 1312, -5044, -618, 1603, -2997, -1302, 652, -2199, -3001, 222, 1002, -1962, 1385, 4170, -2682, -1479, 4337, -657, -1359, 3496, 278]
1161B78k509L171O24k862J029M304l697l087N267k244l216N544j708m302L707
1176B99p63l230J825L232j896k659L547M74l392N136J749o319K344K654m488J031
1192d56L307j736k695J159J520k372J079L966m501r00L892l451o14L675k183j680
1208a990J595n04j718N57L142j868j814M922j333l682M991P09l654K530N02l192
1224h07n08K456O84k737J676J103m631J757L202l142J120J454l562K10J963j84
1240E4q52N50O62l158L5M362k001r20M242k636k009L398M28j788L90J060j250
1257E67k147K251P17l126K440L82l461K090O50j864J329Q26j133l65M19N01j343
1274a267J202J679l611J080K593l076R62K726j687k56L50p1l40k43J785r75j850
$$ y = [278, -2231, 940, 1564, -1298, -269, 4035, 338, -2749, 2518, 274, -2942, 2602, 894, -3408, 299, -464, -3694, -1869, 1363, -533, -3192, 355, 829, -2563, 2573, 4322, -1997, 347, 3001, -1487, -456, 2851, 1115, -1580, -421, 1099, -1273, -194, 3772, -729, -1629, 2263, -1188, -1802, 1873, -310, -1990, -395, -899, -2617, -2060, 1082, -786, -2600, 2322, 989, -2693, 2298, 3007, -647, 1883, 2385, -807, -1315, 1141, 1825, -912, 764, 1867, -2764, -1007, 2195, -947, 173, 1627, -1935, -1725, 238, 54, -798, -248, 414, -2744, -2709, 1653, -348, -1268, 2974, 338, -1671, 1727, 2155, 367, 757, 1817, 567, -1580, 671, 1388, -1738, 702, 1084, -2377, -287, 363, -1501, -172, 654, -479, -844, -425, 76, -1267, -65, 1614, -1997, -917, 1676, -1400, -438, 2288, 601, 345, 695, 624, 284, 41, 1826, 851, -999]
1291i99J741j240r98K441j120n21J206k181J73J585j71K46n24K69l28r87K514
1308A106j5k046K140o88k151K342N99p72K48p37J26j23Q0R33j096J91J68j891
1326a586J579M23j973J949o4k091J506O83o79k68P26J016j577l38K033j691K70
1343h2J807j822l21P27q46R00j04n5L65j188J34J64n2J897j284j533J992j263
1361e64m60K221j118n63K24J3M57o62J302Q05k806Q86J211j753J315L22j140L43
1379C3l11m82Q95j74M91p16l11J200j421O18J689k454M51J880k243rJ196k02K1
1398A51m07R79n72j496K183R8j768J705m83j413J137j10KL91q12K3l53M31R48
1417F34j302J170K78k346J749R95j706J107L20j179l25L82J330r16p82J611j588
$$ y = [-999, 742, -498, -1496, 945, -175, -696, 510, -1671, -1498, 87, -84, 162, -362, -93, -421, -1408, 1106, 1091, -955, 1185, 497, -1654, 688, 1287, 515, 763, 26, 152, 29, 109, 1042, -54, 137, 305, -1586, -7, 416, -1557, 392, 328, -1763, -257, 426, -253, -521, 205, 1221, -356, -694, 1339, -352, -82, 1725, -97, -418, 309, -537, 363, 259, 204, 569, -619, -485, -321, -373, 1524, 240, -1293, 699, -564, -1024, 1197, 79, -484, -260, -247, 210, -452, 850, 1655, -1151, -265, 946, -807, 508, 830, -310, 33, -278, -760, 135, -39, 452, -264, -575, 625, -796, -178, 1511, -943, -492, 1388, -855, -864, 332, 130, 151, -256, 723, 151, -1345, 838, 936, -832, 873, 390, -1023, 114, 4, 6, 397, -415, -392, -745, -314, 634, -668, 502, 780, -1566, 183, 1178, -528, 579, 899, -280, -605, -223, 1107, 191, -591, 1020, -568]
1434e68o23K014r14k83J023j335K80K91m65Q87l80L17m0j165J307j53j076J957
1452A074o13j123J408n29o31Q70j5L65j202r2R65j289M99J462j617O4J98o98R19
1471A5n0j33P17j383J89Q58n37J122l84p95J011q96O6J182p84K55J15r52P90n76
1491a70N71P07j605J48P58j194M64K77k06N20j198N41L90p19Q85O9j061J185k42
1510A20k34Q36q63P39M78j377N66M5k09N98r12L87K25j412R93L36r30R28l50o08
1530f44J70k56J213k68j081J186o06o35J346n73K13N92r33L12K51j51P33p35j6
1549A18L57q70Q06l39r95J547o78r18J158k07k59K61l12M48m49P0J076j656M91
1568c51J180j284K16N44p55R09l77l01O06m33L01j8n20J260n19p48P49j153R5
$$ y = [-568, -1191, 823, -91, -374, 649, -686, -406, -115, -580, 307, -73, 244, 204, -961, 346, 193, -883, 1074, 461, -662, 746, 217, -414, 456, 441, 806, -396, -488, 477, -812, -313, 1149, -468, -404, -206, -904, 15, -35, -168, 549, -834, -645, 213, -324, 798, 414, -381, 630, -266, -200, 982, 198, 453, 568, -384, 406, -170, 401, 1108, -497, -349, 409, -785, -321, -44, -250, 270, -928, -387, 3, -716, 169, 238, -823, 362, 120, -114, 722, -141, 598, 1076, -301, 265, 310, 101, 699, -213, 174, 399, -1013, -20, 316, -614, 314, -36, -644, -474, -730, 483, 215, -866, 320, -286, -921, 425, -148, 65, 657, -276, 36, 287, 136, 869, 134, 118, 475, -395, 411, 72, -923, 624, -54, -972, 186, -21, -280, -19, -331, 117, -332, -262, 814, -842, -351, 829, -455, -239, 305, -450, 459, 82, -219, 387, -46, 255, 237, -283, 977, 458, -290, 459, -694, -599]
1587e99J396j099j78L33l79L73m22O63P90j344L78L68q67J435k25j104O63o41
1605d59M59P48r40K44L03n72K98m35N19P22j362N45J84r90Q74n3p87O13j22J33
1625g8L3l99R55r5p48R41o01j50J206j388M13N99j219M85q0k70M78j70K27j39
1645@r41J386k19r42J500m06j070Q49l20j59N31j98M27j049O1J478j046M22N04
1664H08j412O29L99p45O44m3m12l45k34R25n61l68J468r26n47J785j101k75J149
1683H38o79j59r5L66J79r55O50M44j448J077L37j140J030J0q70O08k87j76K25
1702d5q2L94q66J30Q01j302M18J319j210M11R86j104K99J52Q6M6n33M57l90p60
1722g93J524m03r72R89o09k88Q76l53q4K97m33K90o15N53L89j027P88J13j012
$$ y = [-599, 797, -302, -480, -147, -526, -153, -575, 88, 878, -466, -88, 280, -587, 848, 623, -481, 182, -459, 0, 748, -192, 52, 355, -217, 81, -354, 165, 887, -475, 70, 254, -736, 138, 85, -702, -89, -211, -78, -45, -444, 511, 416, -332, 609, 8, -142, 1064, -324, 89, 688, -531, -46, -126, -396, 82, -88, 139, 0, -941, 445, 226, -716, 784, 378, -692, 157, -163, -322, 209, 11, 438, -611, -550, 928, -118, 304, 808, -604, 25, 424, -321, 323, 280, -132, -477, -711, 214, -347, -715, 753, -173, -720, 1065, -36, -311, 838, 159, 0, -95, 271, 450, -505, 145, 589, -859, 218, 555, -585, 445, 455, -415, 193, -94, -270, -45, -127, 267, -599, -469, 332, -970, -552, 767, -443, -32, 954, -150, 149, 301, 387, 433, -100, 357, -33, -793, 731, 328, -644, 345, -264, -552, 324, -29, -113, 184, -249, 41, -574, -21, 368, -659, 129, 242, -770]
1741g70R57L11o52M47J73p2k44p8N30n06o38J327r18o6P24j121J02O47m86J35
1761a98j42J94K38o40O26L58q09N37k10r09J626l01n97N46j43m3L18r2M29r03
1781a15n8P43j172O13P74j354L72K25o06P12k45k14J34m19N07K81n54P35l22l94
1801c57Q25p11L84L05o31L49J97j61M44n56j05K71p37P51l8p22N40k84M5L92m43
1822b42J93J7p51N30R6k63M74l45J26N09o34O83j05n44O94k50m66Q39l44n5r3
1843F9k76N48l37l57N07q17L31N82o88R10k09p70O27l82j47J013o67j4ok31Q08
1864D94l24k00N06o49K46N08n84M49r2m17K57k44J8K67n33K39l4n25Q67k55k59
1885b65O08n10J09K42l18J2L2j60M33o11M64M48j046O14M96o62L48rj63K44l60
$$ y = [-770, 187, 498, -154, 293, 466, 394, 150, 72, 602, 96, -542, 785, -133, -199, 525, -596, -494, 153, -333, -198, -340, -146, 92, -548, 78, 436, -373, 164, -46, -955, 671, 370, -227, 319, 176, 133, 451, 359, 788, -115, -173, 570, -602, 11, 785, -569, -197, 28, -578, 134, -111, -325, -191, -610, -103, 178, -376, 359, 37, -357, 468, -243, 141, 446, -185, 164, 361, 200, 644, 88, -17, 254, -483, 268, 230, -492, 48, -236, -191, 201, -242, -49, -32, -783, -253, -157, -420, 54, -291, -165, 344, -290, 393, 288, -256, 438, 188, -278, 561, 217, 162, 69, -207, 341, 4, -353, 154, -663, -332, 250, -438, 472, 263, -507, 120, -262, -409, 604, -63, -77, -83, -314, 494, 170, -30, 476, -173, 73, 581, -3, 446, 354, -63, 194, -50, -32, 235, -298, -59, -93, -618, 249, -6, -265, 343, -167, -58, 184, -134, -122, -90, -250, 183, -428, 36, 484, -562, 52, 548, -114, 234, 225, 62, 306, -54]
1906e4L76k72k39M26m60k93J070p09k00P98o90j6N11l4j27j46J51J5o26P28R2
1927C01q81O50l1m34O69N3l77J57j82M48Jj93L38q57J04O37q26M86M10r23M33
1948a7K11m64P09m83l5J59j11M75m57k33N45o14r9Q88n92q0K31k67L17M4J4K96
1970D37n14K49Q5n38M81k8o06N41r9jO9k57N6n1o1N55k55k00L43o19K29M48p04
1993d40N08J1k95K28k25K07K97n11N37o9k16N10k52k65M01m84Q9P9l18K90j69
2014h7l3K87n09K16K68o42N57J38n00K62j3j29K80l14L16r3l36O58m11j22P90
2035E83l93q2L30o55M91l6m06M15m33k13M29k99K19J05k38J72j98j02P13l58k74
2056b30L02m61L87j4P8L02l69j32M06l86L04K34l07J12k24L2L02o04K13K43m51
$$ y = [-54, 322, 50, -189, 237, -223, -516, 554, -155, -355, 443, -247, -263, 248, 214, 87, -59, 92, 107, -519, 209, 301, -580, 70, 39, -395, 274, 327, -50, 107, -75, 373, 374, 181, 519, -338, -234, 403, -423, 63, 473, -450, -17, 194, -270, 439, -44, -79, 80, -31, 444, -13, -246, 299, -315, -414, 474, -118, -198, 33, -234, 83, 127, 141, 437, -77, 172, 257, -281, 200, 172, -434, 107, 8, 7, 76, -181, -125, -176, -237, 318, 63, -137, 206, -413, -184, 264, -440, 68, 79, -216, 12, -213, -6, 291, -220, 317, 248, 32, 542, 290, 25, 426, -58, 31, 110, -208, 82, -87, -120, 167, -342, -126, 142, -500, 57, 195, -305, -43, -56, -185, 95, -219, 97, 4, -332, 326, -85, -207, 583, 190, 108, 438, -217, 274, 238, -168, 247, -186, -399, 30, -269, -50, 55, -183, -11, -209, -311, 402, 44, -230, 72, -389, -2, -16, 62, 364, -5, -137, 269, -117, 187, 421, 114, 226, 2, 34, 336, -268, -55, 188, -263]
2077b63K75k14p4L86j81k49M72m03K66M9m08M78k01Q7K73o62L71L12l12L64m9
2098C17l94K66k65K35J31k17J32k91l90N53j31k03L28l08M8K82l69K36J40l10
2118b10J32q0J03K27k06J31O3k85M77k09k4J27k23Q6Pk32K72l81J72L97n25J8
2140a63L36l77K25J02l51K55j98k22K07M0K62k18j26M13l72j07P24n02Q1L82m29
2161c8J53J92o0k07o0R2Ol57L20j3n12N40J19n89O88j75j49K56k40O7k11l5M97
2184B84o48K08L83r16O53M00o51L90J95k78Q1n5L12l42k11L66l50k48Q35o00j08
2205c00O32m78j28N41k13m1J65N5j66l83L85J30q45R85o6r93Q11L3k31M07K13
2226E13j84l82j16N24n09J50O01j037K03K76o34L88L94l86K71NJ84k49R7M28o40
$$ y = [-263, 12, -202, -276, 110, -71, -320, 152, -251, 15, 64, -344, 134, -67, 20, 293, -369, 2, 314, 2, 366, 317, -77, 189, -76, 159, 290, 73, 205, -86, -476, 77, -54, -257, 71, -237, -189, 93, -276, -40, 100, -210, -78, -158, -55, 172, -34, 97, 160, -125, 352, 143, 119, 246, 23, 109, 116, -116, 156, -225, -53, 344, -181, -163, 173, -204, 21, 123, -228, 27, -171, -393, -186, -146, 116, -102, -228, 185, -187, -294, 430, -72, 9, 391, -38, 115, 307, 247, 40, -20, 72, 78, -279, 41, 28, -484, 56, 175, -414, 274, 99, -50, 206, -34, 33, -178, -213, 284, -364, -156, 227, -689, -36, 364, -287, 103, 298, 20, 101, 46, 358, 16, -195, 171, -179, -427, 408, -192, -300, 332, -146, -274, 267, 54, 13, 178, 233, 67, -316, 69, 199, -646, 339, 273, -720, 91, 124, -107, 300, 513, 329, -53, -169, 355, -154, -4, 597, -440, -237, 39, -595, -207, 187, -199, 72, 77, 261, 12, 109, 537, -103]
2247a03j26L84n48k81P90k54k93L69rn2J86M37o2n30M68r1n81N97O7j009P42l18
2269b17k86M99QJ8o1L49J05p34O41L28j000J60N09j020J22P33m03L2J56K84l28
2290a05K2O17j10k66O47o29l26M99m54k85M21k23m16K34K56K3K2O47l19p45Q43
2311C53lr78Q49J24j044J46Q2L3Q5L30K41o34M41N54m60K91N78j000J52L44r33
2332d49P7L46j07o30M56K88k06Q6R58m33n13Q83o38o40O25r3l73j23L20k73k21
2353f60P44J09n66N71L23p30P54K82p62K53J06p26k8L12j99o03M45N83q08N75
2373b5R77q41j95Q16o44l59K46K21l66n3L23m83j02O60l13p4P54k28l79P91j53
2394E73m34L98j55o06m05O95l10o08Q13J91j137R40N71q51O26L41o37j97K42n0
$$ y = [-103, -229, 155, -393, -674, 116, -138, -431, -62, -71, -123, 63, 500, 438, -92, 376, 285, -296, 301, 368, -641, 101, -217, -503, -4, 4, 22, -39, 310, 415, -319, 322, 650, -350, -190, 319, -701, -579, 154, -249, -217, -61, 223, -105, -83, 534, 424, 158, 805, 176, -150, 349, -105, -390, 31, -192, -608, -374, -118, -95, -73, 574, 255, -490, 353, 350, -628, 221, 345, -699, -553, -471, -438, -353, -23, 218, -416, 25, 579, 119, 410, 988, -12, 140, 484, -449, -372, -26, -133, -763, -307, -19, -225, -139, 819, 386, -127, 756, 118, -522, 103, 10, -363, -486, -166, -439, -660, 84, 193, -373, 198, 521, -209, 545, 827, 65, 318, 424, -302, -330, -18, -217, -820, -375, 208, -600, -25, 952, 111, -84, 732, 88, -271, -25, 196, -170, -223, 100, -383, -485, 175, -138, -212, 542, 314, -65, 726, 573, 139, 537, 382, -224, -629, 66, -244, -852, -39, 152, -985, -45, 526, -325, 301, 642, 5, -192, 50, 0]
2414@k38K75K09q19J36O59p79N48P40q59J39P31m77j59J64L13n90n95Q22o50l57
2435g87J152k28o72O93%l96K80M67l34k14R3k24k43L47K37p64O92j55m96O69M58
2456E75n31K48M06k85m00K99J63r84L82L48r44K19O91p49L90L24l89oK18M74l89
2477F0M1K89n41l79Q45k99m45Q26l67p45Q60Q0k42L18K38j41q51P07np28N18J02
2499A41q66K79M23m95K92L29j52l9J50J59l22L90K05o63N2N31o13m3P53l05m55
2520b49M14N0m38L90M31k40p63N94n04j03N87k03l94L72k12j06L07K75k89l4L74
2541B59p0l38M27Q9p07K25N21p22J52N01j32k94K8L31m35m6P25m82j11L45n84
2562c18L0K24K7j35M36m63j51K00L34j21q3L78m60m03P22M6l57M17l9k73k39M03
$$ y = [0, -238, 37, 246, -573, -437, 222, -557, -9, 731, -128, 11, 742, 265, 106, 270, 583, -7, -602, 220, -430, -787, 365, 137, -535, 158, 158, -238, 42, 509, 175, -39, 54, -170, -413, -66, 171, -593, 99, -56, -552, 117, 575, 44, 292, 698, 413, 13, 312, 475, -509, -127, 221, -723, -504, 187, -562, -172, 152, -237, -243, -25, 449, 60, 101, 390, -151, -530, 315, 16, -429, 397, 30, -715, 145, 225, -17, 301, 539, 398, -453, 254, 249, -479, 39, 141, -725, -446, -23, -518, -226, 103, -49, -88, 62, 221, -101, 289, 494, -169, -117, 414, -199, -242, 511, 206, -249, 165, 215, -223, 167, 598, 358, -405, 189, -315, -418, 169, -34, -428, -56, -268, -374, -67, 208, -81, -115, 259, 189, -149, 278, 367, -340, -115, 406, -316, -164, 337, 205, -89, -61, 270, -165, -211, 514, 32, -79, 266, -318, -288, -64, -37, -172, 264, -199, -350, -150, 184, 63, -20, 358, -102, -505, 217, 263, -94, 323, 284, 11, -228, 175]
2584A75J81m10J22P4n52K82K14k50J71K34m90K7J57k9J80Mo3r6j68L25j59O7M71
2607D67n16j41L68r1n8M9j6J69l05J39L2j43O2J04o5j7r7r1J26N6j77L85l69P7
2631e2j84J55L22l36Q8M0l99M03K03m14K71j22j48K01O1J17o3q2M5j11r1K95J6
2654B15k91K15m02K04J45k08K30M1j78J3j28L32l2m23L33k52k7J17J2J50J09k75
2676a00K91j95l06N23N9j00Nj89J02j51j30L23j42k54K03k85L5M59k02J89n7k79
2698b01J11J13o5k3K39j69k71J9M27j53j10K26ql86M39j6n5J0J12m0l23O1K79
2721B16k64J27o3k64P3m7mL40j75j19J26j07J06l6K14P6m66mN54l91O7M99n86
2744a28J00J66J40m0JJ31M5o65K28k7j38L66j85k24Q5j69l3K24L56j86j55L61
$$ y = [175, 356, -54, 68, 142, -410, -128, 86, -164, 7, 241, -249, -222, -65, -94, 86, 90, 27, -69, -237, 88, -71, -4, 467, -49, -190, 178, 87, 29, 78, 62, 231, -74, 65, 97, -46, 16, 120, 55, 38, -59, -150, -24, 32, -145, 240, -129, -52, -236, -81, 241, -95, -7, 33, -366, 37, 240, -174, 97, -25, -173, 28, 89, 206, 143, 61, 106, -5, -96, 199, 215, -76, 139, -263, -59, 86, -122, 108, 149, -29, -16, -144, 188, 156, -267, 66, -186, -213, -96, -84, 66, 175, -100, 191, -4, -310, 213, 272, 172, 177, -12, 90, -61, -191, 132, -10, -264, -61, -346, -311, 148, -54, 135, 78, -201, -90, 23, -42, -65, 174, 5, -266, -247, 180, 27, -83, 143, 135, -251, 188, 172, 117, 127, 239, 199, -124, -63, 216, -48, 79, 16, -248, -175, -222, -226, 114, -61, -180, -54, -161, -55, -91, 123, 199, -267, -271, 283, -108, -41, 458, -128, -28, 138, 278, 238, 239, 370, 415, -250, -22, -49, -187, 179, -6, -230, -145, -314, -347, -123, 233, 47, -108, 253]
2766B53k55k36M36L30p68L10L72p97K97M65k78j41l7L31k96K09L09n13r4L43n19
2787b79r9N97n15L6M10j62k98J83L05l14q0P17n67l87O79q0l76L77K59n42NM57
2809C26k29j91L07n1o06O95J15m39J12L55r09K01M67l40k5L63m4p50M00N76n90
2830b57N9Q06p29j75Q19l70l46N94k02k64J02K05l31j05M75j69k51M58l46l33
2850c60N94l5m86J26K32m95k5N96K30q80O41J56q02N00O99q43QM73l09k85O00
2871C35Nn09K42J73o06J63R26q25j45L13k08k89O06k4k47p6M23o42k40R16k59
2892C2n94R18j23o00M53K26n33K17M01n13j91M20J24l70L97l4o20K52M29o88L05
2913i2O47o36k67M51L0m90L32L46p98j94R87m98j03O97l24m38L73j8k08N15J70
$$ y = [253, -2, -238, 198, 528, -240, 70, 442, -355, -58, 407, 129, -12, -49, 282, -14, 195, 504, -9, -103, 240, -279, -378, 219, -296, -260, 150, -12, -310, -127, 178, -136, -216, 501, -66, -453, 226, 146, -230, 147, 406, -136, -131, 326, 97, -94, 213, 162, -444, 251, 366, -73, 39, 394, -515, -314, 153, -187, -212, 151, 107, -643, -243, 333, -257, -198, 608, -121, -296, 523, 153, -193, 401, 199, -65, 37, 242, -89, -194, 281, 112, -139, 319, -27, -360, 234, 199, -287, -161, 71, -424, -449, 147, 377, -503, 138, 294, -508, -8, 691, -152, -144, 329, 20, -265, 335, 340, -169, 73, 246, -360, -197, 729, -96, -241, 72, -136, -425, 181, 157, -90, -166, 257, -385, -625, 291, 32, -562, 356, 233, -367, 86, 312, -221, -4, 397, -116, -307, 113, 237, -133, 264, 230, -390, -138, 291, -397, -92, 555, -81, -348, 103, 133, -357, -25, 321, -477, -671, 316, -182, -285, 412, 88, -350, 23, 5, -203, 312, 482]
2934D82m55k22L65j81m46Q97q2p70M51%q31O74M94m81j84M46j75m17M86L25q33
2955d57L84K82n13K84L93k93k45L05j21j69K80L41o80J67L83o74N3O68m75j48
2975b35M91k61l97M35K31l30j76M67m64l52N80J27l00M44k21k64J08L03l07J86
2995F5J82l07k45L83J07m03N13K09q84J98N32m40R0L60k79l14K52J12l23k7O11
3016C92p80P4N55m64j80O22n6m31N08j80k87J73L48l63j77O67l57m70R32lq65
3037c42M49P5l71l3L71J88o23L66P1n81L29L50l56MK29m27O3N91m82kK71j07m11
3060c78M83L46m70o5N93o06r1N60j50m96N15j34j53k5L46k11j69L77k02n67N51
3081E4j43k56P41j53p59L76K48j95J4L31N7o61K29M55l91r3O76o39n7M69j71j30
$$ y = [482, 27, -195, 170, -11, -457, 440, 358, -412, 39, 39, -792, -118, 376, -105, -289, 157, -18, -435, 51, 376, -457, -73, 209, -304, -20, 373, 80, -165, 140, 19, -150, 130, 471, -209, -42, 341, -333, -280, 388, -87, -235, 256, -5, -402, 33, 264, -66, -242, 225, -239, -591, -11, 116, -184, 260, 39, -225, -117, 186, -121, 65, 247, -60, -305, 78, 185, -218, 295, 504, -380, -182, 350, -90, 0, 360, 81, -233, 19, 131, -192, -219, 392, -388, -314, 241, -223, -403, 219, 163, -268, 240, 60, -227, -54, 294, -69, -246, 421, 64, -406, 526, 523, -342, 107, 182, -189, -222, 149, 337, -286, 80, 151, -430, -101, 249, -107, -103, 126, -301, -238, 353, -129, -131, 140, 33, -378, 105, 451, -19, -84, 509, -97, -188, 372, 222, -274, 241, 107, -46, -71, 275, 64, -105, 272, 70, -497, 54, -89, -345, 396, 243, -516, -140, 108, -87, -73, 258, 315, -346, -117, 338, -53, -146, 530, -109, -166, 303, 132, 2]
3103BL21nl79k48L05k03j90O73m18k99N83l99j42O62j10k57O4K92l33n6M57j2
3125C08o47M42J32n26L42K06l14O3J16j62M2J45R1k96m7J96m13P1M91m26q7J51
3147a22k03R1K65K7k50M0L35l21q5N55J2n01N85l44j61J26J12q6p6J10m3l75L81
3170G2J9j06J80j43k37P5nK8J14P8k18j61K66K71k11n4L66k65j85M13j87k0K10
3193C00l32P6j08RO6r6J66rk39J78q4MQ2J8r4K40k80K0J01l3K00k30j60M16l53
3218a42K02J53l05Rj76K27M09j63N2j6l55J29q8QP9r8kJ21m71L13K47j34L6j26
3242i1O6k7k49M36Nk85K89J62m23J70R4J22%l35J28O9k86J34J89j67M4j23Q7P8
3266H7l8k8K40l93K9o7J55R2kj10L0j05l3K73l0p5k6N8j75p8K95k03r8M75l22
$$ y = [2, 323, 318, -61, -309, -4, -207, -397, 276, -142, -441, 142, -257, -399, 263, 153, -104, -40, 252, -81, -137, 320, 308, -339, 103, 235, -291, 51, 257, -57, 6, 122, -40, 2, 147, 238, -58, -105, 91, -322, -251, 240, -186, -273, -122, -325, -234, 31, 58, -192, -152, 183, -138, -223, 332, 344, -157, 428, 84, -77, 49, 161, 75, -1, 109, 66, -309, 72, 91, -15, 165, 22, -215, -140, -145, -117, -3, 75, -143, -304, -38, 233, 22, -32, 334, 69, -116, 297, 110, 90, 300, -32, 44, -64, -55, 11, -85, 81, 72, -167, 11, -73, -69, 13, 31, -63, 177, -103, -83, 18, -15, 185, -45, -205, 211, -142, 60, 213, -92, -83, -259, -32, 377, 214, 266, 250, -105, 24, -64, -56, 23, -75, -77, 44, -427, -114, 133, -1, 35, -91, -25, -52, -301, 135, 140, -145, 144, 306, -117, 53, 147, 269, 269, -66, 62, 131, -155, -21, 168, 1, 45, -78, 9, 87, 49, 21, 261, -132, -103, -170, -15, 77, 75, -35, -5, -110, -143, 130, 100, 25, -1, 57, -118, -196, 99, -104, -202, 273, -49]
3291d9m0J75j03J1M7O7k65J03R5Or9K0M4l41L55ok47K78M1l03L7J71N3j00J60
3316A10p1k42qL58j61J47J39l63L7P5N0O2l7P4r6k3q5QM3K78m93j25M74k57q9
3341a95L23j02j94J07j0J3j72L50K33o47M53mk87K39O3k31J00O4r4K6l8J83k82
3364a02K12p0l98J61M74n39J85L19k65l21M72L1l74J90K29j69k13O42k81l99K93
3385G7J8l98M70P9k87J74j1j84k35M95J09m92L63O9p40L75K73l39J9J50l8l55
3407d08L31J91j22p5L07l35m3N02k32LL69m71k60L66j3r9Q9K74n09L9L35k08j74
3430a43M89j86o23K46J16j30K5M04m23j32J79L61n21N44J68m87K49P1n6q4J51
3451B18k02K2N4p4q2K6K34l54J04L38m65j82M51j7l36K15j16j26N7L59q2k52M11
$$ y = [-49, -89, 86, -17, -6, 41, 108, -157, -54, 41, 47, -52, -32, 12, -329, 26, 20, -227, 51, 92, -211, -174, -3, 50, -50, 110, 39, -203, -211, 147, -14, 133, 272, -91, -54, 21, 71, 133, 96, 170, 74, 51, -34, -26, 17, 295, -198, -323, 151, -106, -195, 128, 26, -168, -61, -71, -58, -230, 120, 353, -294, 159, 155, -132, 107, 170, -61, 39, 103, 9, 35, -3, 180, -102, 110, 40, -358, -197, 277, -262, -77, 242, -23, -344, 128, 159, -215, -25, 204, 35, -178, 464, 183, -216, 77, 95, -303, 167, 246, -41, 133, 122, -62, -297, 198, 307, -185, 178, 247, -493, -118, 155, -184, -165, -15, -53, -408, -77, 114, -8, -83, 224, -111, -154, 348, 116, 119, 488, 17, -243, 123, 110, 11, 100, 374, -135, -96, 239, 31, -143, 346, 160, -463, -217, -101, -231, -206, 198, -225, -357, -178, 183, -338, 206, 374, -113, 136, 207, 151, 67, 218, 16, 38, 92, 18, -64, -38, 196, -158, -54, 284, -181, -363, 88, 71, -265, -50, -166, -292, -235, 124, 42, -210, 201]
3474B01j75k47M56j9r2R1M7l90K57j39J2q8O5L2k88K61R7l59K01K51o06L21K54
3497A43j25j03oL18m01J79P4j50Q2K91l05j51K12L9K8L06k03j35M1n5j54P0K18
3520B13k16j94K02k70j29M24J29m73J00K97Rj65J35J23m76K91k2j59L06R1j49
3541F7m3J29j33J60J56k68m4nJ05l28J60K48l53p0L31k73j53M65j35p0R6R9k98
3564a57Q2L63l06lJ32k7k10J21J51k38J72O0l76K38P3k3k14J62o3l28L41K50l74
3587a74J88o5j4m4j1N6L6J04J13k36j17N21l45J06J68n26P7K31k6q0K05k45p8
3610a56L3K72j40r6K28J09m32K91p5k56K69O0k1j63K13j37r4K51o3k72J02L55
3632B78l46J51J04j85j20J66m8j79J58K66j48k12K77l92J14L78l44k2L08j21l82
$$ y = [201, 26, -221, 235, 216, 124, 215, 262, -128, 129, -10, 2, -86, -21, 11, -277, -16, 81, -278, -77, 174, -432, -111, 143, 18, -85, -91, 227, -174, 5, 79, -71, 11, 302, -3, -154, 58, 97, 125, 431, 228, 93, 134, 79, -75, -5, 213, -3, -197, 5, -265, -394, 30, 159, -314, -214, 83, 92, -73, 62, 185, -291, 0, -22, -181, 125, 216, 67, 24, 153, 20, 180, 336, 68, 24, 19, 124, -204, -44, 204, -149, -219, 112, -161, -314, 151, 16, -54, 42, 141, -157, -75, 288, -18, -21, 111, 84, -126, -5, 146, -92, 80, 140, -236, 2, 75, 52, -162, 0, -63, -391, -50, 200, -174, 14, -51, -65, -109, -120, -64, -28, 76, 189, -47, -164, 357, 12, 118, 286, -240, -163, 68, 42, -38, 167, -78, -156, -123, 149, 9, -87, 141, 250, -182, 109, 34, -222, 47, 107, 86, -77, 136, -1, -95, 156, 93, -179, -77, 278, -68, 83, 187, 2, -118, 48, 0, -179, -21, 245, 97, -115, 162, -230, -116, 262, -82, -104, 204, 83, -299]
3653b99K05K07k78M3J64J9k66N41j38l07J23Q9l22K46o3j55Q1J50l7k84M63m3
3675A39l42J17J36j12j04L44j48Nj34M4r7M0J18o3J5J83k01%K13j45QQ0J4j98
3699h8L7J37k98L3J25N9k05K34K72m07J60J19l02K71mn8j86Q2J5j38N4M21m23
3722i0N7K06j18j01o8M2R9J10M2l51j9K33r4RK43j71q8J71j62J4K03k3j46K3n8
3747c7J55j68J70n4m9r4M4j6J85o2j53O2J50k51L3r4QK67j78J97n3j26J55j75
3771h4rK36l12K54j06On2N0K6n6MJ05l5o0j9J43j92K15k14mR8O1r6j7J55n1j14
3798f8Q8J62j80P9n7MM5k2l3M6n0p2P4L6l4P8k06n9J15N2RJ59k42O6r8O3Q9q0
3826c6J00n0o4J30o0m5L2LJ4kq7J95j48rK9j54K09J1n8qj45O3J44r7Q5k6K55j93
$$ y = [-299, -94, 113, -165, -122, 42, 61, -205, 336, 198, -109, 14, 103, -219, 27, -36, -191, -110, 40, 3, -281, 182, 139, -203, -86, 50, -62, -166, 178, 30, 35, -99, -55, -152, -112, 6, -57, -42, 141, -60, -60, 153, 8, 16, 96, 110, -88, -51, 86, -212, -179, -54, 5, -200, 34, 306, -101, 59, 178, -124, 147, 143, 85, -101, -19, -4, -142, -88, 333, -90, -33, 173, 55, -46, -114, -72, 27, 137, 179, -172, -191, 42, -52, -43, 200, 29, -59, 112, -50, -36, 167, 144, -2, 21, -37, 118, -50, 120, 66, 17, -77, -33, -49, 136, 74, -79, -17, 133, -118, -85, -179, -171, 96, -82, 115, 62, -64, 91, -84, -93, 143, -169, 85, -21, -15, -67, -17, 9, -47, -43, 62, 27, -33, -52, 91, -101, 114, -100, -104, -6, 55, -41, -58, 97, 46, -68, 20, 182, 2, 81, 24, 28, 73, 51, 18, 64, 14, -58, 16, 52, 18, 96, -110, -169, -54, -2, 7, 166, -76, -10, -108, -45, 44, -36, 64, 14, -50, 80, 20, -25, 7, 10, 24, 22, -65, 130, -18, -27, 2, -152, 57, 68, 10, 2, -143, -80, 64, -33, 52, 26, 281, 88]
3854H8j39J44n9j80K08l2j41JR0r7K65j92J33J11j60K0n0O0m7j3j29K09k32O2
3878h0J8j52Q0Q8N0kj05J51m2j17L40j50k68J05J82J1N1l13J19p4R5J18k49J29
3902a5J12k06R4J85l46K32r7p6L2J24j27R5P1q1k08K75J34k42N7N3p3o6K4Q6k3
3927A4j60O3O4j04J48M8k56J85r7L4J60pj24P8R4q3k27R2J38j66Q1J26j45j6J23
3952F3k18K59oj29n0J21j27J3j1J46j13j95L31Q7k84J60O3pm1L8j13j2J02r2k20
3977b35K80j49qK40k76J09P4r4k57L42J7m3j1l3p5L4J07p3J0O2J23k33m8K38j97
4002i6mM3K86m8k70K30k2q9L9l23l0K10M4o3J27r4N6O3n9J22l37K04L5p7J74l1
4028I0k67J79o1K42r9J51j33m7qll7q5J93j71P0L8j38L4K02m22M09j42lk76J55
$$ y = [88, -51, 93, 34, -146, 62, 30, -111, -110, -20, -117, 148, -44, 89, 200, 40, 60, 10, 70, 23, 10, -119, 90, -142, -80, -62, -214, -134, -46, 4, 2, -103, 48, 6, -111, 229, 79, -189, -84, 98, 109, 160, -153, -34, -108, -13, 105, -144, -15, 97, -109, -15, 170, -176, 56, -41, -117, -85, 39, -88, 7, 78, -3, -211, 64, 198, -44, 13, 66, -7, -73, -49, 37, 14, -146, -83, -19, -123, 25, 73, -183, 2, -95, -61, 99, 92, -32, 46, 140, 57, -170, -78, 60, -106, -25, 101, -44, -60, 63, -155, 104, 98, -31, -81, 40, -87, -74, -85, 61, -52, -247, 84, 171, -113, 47, 110, 103, 62, 100, -13, -25, 77, -15, -235, 45, -104, -112, 128, -148, -39, 35, -59, -316, 26, 43, 0, -11, -44, -119, -85, 22, -51, -41, 21, 144, -89, -137, 101, -96, -100, -57, 229, 181, -89, 141, 119, 30, 69, -254, -284, -74, -30, -93, 34, -60, -4, 59, 0, 122, -215, -11, 24, -53, 121, 90, -177, 2, -59, 183, 84, 235, 102, 55, 47, 44, 7, -78, 115, -56, 14, 52, -86, -52, 150, -272, 137, -5, -8, -284, -129]
4053a29Q7QR6j44O8j76K51j41J03R3j54j92L48n6L7q8K27j07k47J53j44r1K06
4076Ho9o1r0J04O9j31Q7N0N7r2J0j00R7O7m6J13Oj90K16m9k24K62j21K1J17j97
4102h6K68l05n6K15j86lp7K22j85L05k11Q5j25J91k98M6L39J9j29J09j30j67J59
4125@K3J13j27K4j58p5J89M4j7j80L11k14O3o5PL0J19j93M5K20j86J12j43K11
4149A53k07j32K03j4N0K01l59m4J43K27j87k8j49O6J7J28J27l75K16r4R2Q9j00
4172B3p0J20j80R5P3M7q2j53%p1N5L2K21L4l63K36p3Q5Q6R2k50m8K21r9n6J07
4198H2m4r7J02rq5J57j99J62J38j14k9k17R8nk7L5k03L11j95Q0j20J99J06j20
4222Fr3N8l4J10j68J94O1j59J74o4o5P1j1l8j04K37j62R5j02L9r0J65j10j19J15
$$ y = [-129, -42, -34, 62, -82, -14, -190, 61, -80, 23, 116, -38, -230, 118, 62, 99, 11, 238, 131, -116, 37, -107, -198, 8, -61, -122, -212, -108, -39, -170, -83, -33, 24, -68, -58, -158, -61, 6, -40, 73, 79, -111, 105, 56, -168, 94, -27, -6, 111, -86, 182, -123, -179, 36, -150, -153, -230, -8, -193, 112, -99, -14, -139, 52, -246, -200, 139, 158, 29, 138, 8, -159, 0, 23, 136, 9, 33, -125, -200, -11, 33, 16, -164, 147, -67, -4, -69, -62, -32, 87, -106, -61, 159, -27, 85, -58, 153, -54, -186, 17, 3, 53, 254, -105, -149, -6, 221, 34, 6, -143, -77, -60, 68, 195, -180, 36, -58, 34, 123, 23, -47, 73, -107, -12, 61, 108, 26, -127, -127, -198, -143, -111, 110, 144, -219, 17, -56, 29, 115, 207, -43, -91, 130, 31, -25, 82, 38, -59, 43, 34, -51, 106, -93, 69, 207, 93, 64, -153, -55, -60, -87, -52, -255, 56, -139, -59, -179, 20, 126, 6, -87, -29, -63, 47, -121, 73, 134, -25, 149, 85, 20, 91, 80, 42, -62, 175, 13, 108, 6, 45, -45, 120, 10, -109, 6]
4247FM1j34J51j36M2m6l1J83j71P2M1o4m4K01j54K47j10j98J27r9J5mj08M5OL28
4273B06mk19p5J24m2k3J36k06Q1pl8J2j35K93J3J1p8Nq4p2R9QJ40k98J24J16j12
4300b5k7n2Q7p8J36j9K5m9j54K29k38n8L03n0N3j14j5J06n8j9L7L4P9k37K39j6
4326A19j25J62j00j08Q3m8j20R4q7J82Qj52K5O9R8l2o9j48J13P2j50K36p4p9M4
4351A3j32J13J4j38K14n3j4k2L3L6q2J3P6j37j13J89j46R5J27j68J82m5K7j86
4375a04P3N3m5J05j7J7l2j48N6Q8J16j85J21j01J09J71k12nj49J4K41j56m5o8
4399a03K9n8K01rk5J27j56n0o8J36K6J08j59mq6N5O0r8K33k88P6r3Q0J05L2L1
4425A02J1j1k6L0l96L91l55K01k3J34r7J47j83J6Q2l0L8j80L33k03L3L3p3j25
$$ y = [6, 47, -87, 64, -72, -30, -76, -107, 76, -95, -23, 18, -46, -90, 111, -43, 204, 94, -104, 23, -76, -61, -65, -173, -128, -122, 206, 202, -17, -92, 32, -10, -33, 103, -103, -22, -29, -67, -55, -190, 103, 116, 127, 49, 54, -30, -102, -3, 5, 145, -153, -29, 87, -25, -52, -104, -17, -95, 41, 22, 47, -2, -156, 73, -165, -223, 80, 30, 83, -31, -46, 60, 2, -17, 20, 54, 133, -104, 135, 119, -6, 156, 56, -52, 31, -17, -137, -43, -130, 52, 60, -92, -67, 2, 100, 68, -1, -149, -36, 36, -114, 122, 48, -31, 13, -119, -6, 8, -130, 84, 31, 17, -5, 28, 64, -18, -5, 71, -66, -179, 10, -136, -41, 86, -82, 100, 55, 82, -104, -31, 22, -23, 82, 65, 82, 50, -98, -42, 46, 162, -23, 98, -3, 106, 277, 65, 60, -89, -75, 166, 10, -35, -103, -74, -132, 69, 60, 35, 162, 6, -44, -112, 24, 50, 158, -1, -5, -91, -36, 24, -74, 159, -129, -53, -146, -66, 39, 71, 102, 113, 102, 76, 106, -290, 101, -254, -53, -76, 58, -39, 108, -75, -59, 23, -7, 31, -149, 184, -19, 14, 47, -26, -151]
4449a51K57j43J37j73R6J39j75kPO9j71J76mk32J56k42J20K62r1j49K3Q5o3k4
4473i3K56j19m5O8mn2P9Pl3j86KL14j42j08m2K11j12J45j54j78L29k28K3J60j59
4498f1m8R9L1J11l01J36l5k1J5N9J30r4J6j17Q9j06K22rk2j34j2O0J7j26m4K24
4524G9J9j06j91L13j92P0l5j9j3J27o4j00K96j71j83L13j83M6NK9J24j69L0L8
4548F3o3n6Q7K7j01o8J02j3Nj89J11L8P6j0o4o6J29j10K5K81j67O9k05L9J87k76
4574a49J11K36l22Q4J10L8q6P1r8Q8RM6k12J41K2j57j1M2lL0p3l2J05q3o3o6K26
4601DK7k00J15j8O1k0J64k68K98N0k30p0K01J09j81j98L13k00MJ21O9j72L1p4
4625f4k4J18j64P7O1J8J65k61K13r4k1j75J12k4J07J26l26K05l8j5Q6q9kK6O9
$$ y = [-151, 106, -37, 100, -73, 23, 162, -13, -15, -8, 61, -110, 66, 62, -170, -14, -256, -136, 126, 35, -114, -91, -6, -69, -93, 163, 44, -1, 67, 63, 11, 90, 97, 64, -122, -120, 194, 52, -56, -98, 113, 1, 146, -8, -186, 143, -85, -62, 98, -61, -109, -10, 21, 132, -169, -33, -68, -89, -74, -15, 115, 21, 37, -80, 9, -97, 125, 116, 94, -40, -52, 8, 25, -101, -145, 79, 98, -8, -199, 114, -78, -8, -43, -62, -75, 52, -12, -112, 184, 13, -170, 143, -40, 6, 11, 40, 164, -5, 25, 63, 0, -56, 31, 58, -43, -111, -9, -22, -17, -206, -95, -57, 19, 9, -55, -121, 8, -102, -77, 204, 37, 106, -99, -60, 127, -149, -38, 198, -124, -40, 70, 108, 22, 93, -5, 83, 92, 138, -74, 67, 89, -68, -79, -37, -40, -10, -83, -115, -10, -93, -156, -222, 4, 31, -169, -54, -72, -11, -31, 133, -135, 163, 213, -17, -87, 114, 223, 42, -156, 157, -43, -39, 82, 151, -21, 10, -64, -88, 30, -134, -57, 4, 22, 187, -74, 139, 45, 24, -151, -39, -63, 44, 170, -156, 49, 11, -4, 82, -7, -9, 17, 86]
4650H6l8Lj41q9J25n6J32Pj60Q7O8p0J23q8j61J93N9q5p1J06J8r6k8K5O1jM2O
4678E7N9m6J27j31O9q7M8j1q4l2k5Q4m9j0OJ0m3R2N3n7j9L5j3j47N4Q1R6j44J
4707b6J13j57J93m1m5M4Oj64P8m9J81q8Qp6l6L9j01%O6m4r9J80J97p8K9k02L6
4734c6J8Pj50Q9K1j08K80j28J7M9K7Mk1n9j3j31J19k6J35o8q4R5N9k27k0J76j33
4761a08J71J8j37P6j05J48kJ82j83k86K28k8N0o7J31j63j7K76r6k69K16L3k12
4784a44J08O7m1j13o1p0K68n4J7n5J68n1j77L48k16R4j17J82j76L9N9j3k64K99
4808I7N6j51r1PJ54j02N7J44j02j56J37k29J85p4l4L3j3P8j51J55J11j01J11N0
4832A71k94N1K57n2M6j34l2o9J46m9L7j74P4J53k38L18j95p4kl0N0P3j1j55J56
$$ y = [86, 48, 51, -90, -179, -54, -110, 22, 29, -131, -44, 24, -46, 77, -11, -172, 21, 80, -5, -76, 30, 48, -48, -76, -51, 10, 9, 51, 57, 116, 70, 197, 66, 135, 48, 96, 85, 1, -31, -56, 28, -21, -31, -25, -15, -58, 34, 87, 30, 11, 46, 33, -114, -60, 21, 117, -27, -26, 87, -70, 123, 82, 37, 81, 87, -77, 1, -48, 133, 45, 53, -23, -59, -20, -121, -121, -55, -99, -198, -18, 179, 101, 130, -72, -36, -18, -11, -161, -72, -51, -159, 121, -7, 10, 59, 86, 90, 69, 10, -3, -134, -15, -41, 94, 26, -58, 37, 96, -131, -151, 25, -108, 63, 81, -56, 20, -85, 63, 61, 243, 60, -226, 2, -26, 24, -43, 88, -75, -92, 184, 88, -181, 35, 68, -144, -36, 31, -10, -123, -184, -254, 14, -40, -23, -78, 90, 39, -138, 210, -6, 88, -29, 153, -23, 16, 75, 62, -202, 97, 153, 2, -89, -82, 72, -30, 27, 171, 69, -87, 50, -179, 6, -68, -102, -69, -82, -4, -155, 0, 111, 10, 121, 171, -123, -72, 185, 133, 179, 45, 13, -56, 90, 41, 78, -96, -22, 131, -107, 211, 16, -58, -60, -90, -40, 33, 22, -133, 23]
4857B3j4M9o9K1j4n0J07l9q7oN2Q5l5Q3j94P7q2LO5Q2r4k7J73j25jl3J84j81o1
4886a08J15J08L1n2L0k54M0J14L8j00K09k21j1J13p6m1p4P3J17j18J1J13R4k3
4910A28k21J02j20J90o1p3m7J7J45m8l2r9P7J26J05k70J47j03J5J06J3m3J8J46
4934B18k95Q2Q3r4%r3K35j83J71m1j87J84j58n2K3mJ76m0j7pQ9j28K2M4j2n3j03
4961a40J27j6P0l4L4O1L2j58M4n4O3P8K6j31m9j7N4n5n6O2o5N1k8J85j28O1J46
4988A63n0q5J83k20J08J9k0j26J27o0r0J27l2j69J60L0j44J61O7l4p6k13N1O4
5012e9j16J82k27P7N0kKk3K3O6M4L1j06J9M6P9j51rJ91j66R0m9Q2k4o8J08J71
5039B61l52P1Mj16K23p9J9l6p0O7o8J9O9L4O3%m8l3r6K2P4q7O0r8J73j8j58M7
$$ y = [23, 9, 58, -11, 10, -4, -54, 53, 14, -73, -79, -27, 58, 23, 106, -88, -11, -93, -90, -25, 57, -37, -64, 109, -16, -17, -50, 134, -47, -108, 7, 115, 146, 94, 124, -130, -90, 24, 62, -38, 171, -50, -61, 52, -24, -65, -139, -66, 51, -67, -56, 57, 151, 128, -93, 9, -111, 79, 18, -55, -102, -85, 60, 12, -20, -119, -42, 84, 189, -81, 66, -37, -22, 84, 97, 54, 72, 218, -77, 5, 88, -6, -6, -99, 136, -47, 124, 83, -104, 80, -78, -130, -107, -111, 65, 25, 8, 1, 90, -38, -16, 28, 16, -37, -140, -13, -29, 41, 7, 41, 102, 134, -24, 20, -34, 29, 107, 133, 2, -47, -64, -10, -65, -121, -59, -124, -73, -101, 84, -44, 17, 163, 113, 28, 211, -9, 99, 118, 98, -28, 99, 39, -51, 76, 44, -125, 35, 65, -79, 82, 149, 115, 39, -174, -123, -59, -175, 7, -220, -143, -93, -95, -93, -116, -93, -27, 17, 48, -58, -39, 7, 86, -65, -74, 117, -49, 41, -8, 74, 50, -18, 90, 261, -91, -20, -16, -132, 91, 12, 31, -5, -75, -8, -76, -57, 12, 46, 109, 109, 61, 28, -68, -46, 28, -59, 1, -97, 76, 58, -100, -53]
5067e3J2K33k45P2P0J03qk70J98nj65J2K76k91K02lk30L9K6Q4m1L8Q4j33j88K88
5093A05k03K4J88q7k5lq3mJ79J8j84LJ20o6k1J65o2k22P2O8m8R1N2N2k09K35k78
5120a23kJ19L5oJ13k47P5n9n4R1n4J60j77l1L50o3k47J37mm3p6K21j26M2M1j35
5146f3MJ22J41r3J8k11K12l37M36l08J17Q8k33q1K28P5m2j99K15j08j33J65q7
5169g4j8p2J93q5j09L06j77j46M8j20J57M0k8j00L82j72J0j18J48k10J74J6j2
5192C3k8r8Q8j97K64Q3j56j36J53j27J95J3o9O1p5j00n1L30j25k06J8M0Q6k18
5216b22K61j48J69l1J54l48J76l0J66j61j96K58k19N2J79j23m7M7qPK84l57M5
5239i2K33j95p1L9J34Oj13J39k46J24l7J74k49J06K82k46K8j64K08l4j7j45N0
$$ y = [-53, -41, 192, -53, 19, 89, 192, 184, -86, 112, 107, -58, -46, 230, -61, 141, 138, -92, -53, -27, 57, 16, 54, 138, 5, -183, 105, -98, -74, 114, 27, 2, -1, -84, -88, 91, 109, -75, -72, 48, -18, -39, 126, 64, -158, -86, -18, -66, 25, 77, 129, -80, 155, -123, -125, -6, 29, 23, 136, -111, -36, -95, -149, -58, -112, 48, -129, -160, 190, 127, -120, 17, 13, -30, -106, 115, -11, 31, 72, -63, -59, 63, 204, 111, 129, -82, 130, -207, 229, -79, 38, 126, -107, -188, 40, 115, 73, -126, 89, -19, -152, 13, -74, -92, -164, 29, -56, -165, 141, -36, -182, -134, -254, -97, -57, -85, -185, 197, 25, 35, -83, 65, -145, 29, 45, 33, 5, -93, -5, -202, 62, 145, -11, -147, 6, -121, 74, 87, 18, 79, 4, -96, -147, 183, 58, -148, -130, -90, -4, -222, 39, -109, 60, 29, 183, -165, 11, -19, 147, -14, -210, 48, -171, -119, 60, -63, -110, -63, -71, -64, 220, -137, -92, 141, -54, -125, -86, 48, 54, -59, 80, -166, -42, -79, 95, -154, -48, 234, -12, 16, -148, 60, 26, 9, -136, -86]
5262h6Q0Q1k60K31j4l3j25R2j71J52J21o6j59P7J69k74K81J16k81lK4J97k17J38
5286G0J8o5n8L1M4k41L04Pr8j43N5K9nq7r4K63M3N2j26L4M8j51R1Q7k76M3K15
5313I0k34K23K9M8l42K50J04p5P2j29j3o4J84o6j59J29j22p0J6J34j31J18J15
5336A07j16j80J16J07n7J78l65R3J30J96j70Rk4l0n3RO9j70J30J01n8J40j00k90
5360b28K56or6n9K67k57R8j58J28q9k4J54O8k00N1J92j96L41k63m7J25l8m6p0
5384i7J55Q4j77k7O6r0L45k59r7R7J66k32P9Po2O2r3K10j98j9L05k74q0k3K25
5409G3j80K23R8l38N3O4K4j5Q6j24l8K52j43q0j6lj37Q9J21J75k50K05pj86j64
5434b18J76n1M3J35r0rK6j3o9R1J0J04k35J07M0j55K33j15q9J94K7k58J67pj2
$$ y = [-86, -6, 75, -185, 46, 32, -1, -126, -34, -205, -53, 68, 2, -157, -80, 89, -185, 96, 212, -69, -72, -48, 149, -68, 70, 88, 23, -35, -4, 40, -201, 103, 110, 12, -131, -76, -47, -52, -139, -233, 30, 73, 125, -1, 33, 81, -70, 21, 108, -168, -125, 90, -144, 79, 108, 156, -186, 64, 168, 93, 165, 36, 23, -41, 143, 77, -82, 47, -75, -145, -129, 5, -126, -8, 107, -9, -189, -73, 34, -23, 155, -210, -117, 13, 209, 39, 48, 24, -6, -59, -50, 19, -151, -21, 80, 22, 162, 62, -228, 28, 22, -74, -133, 134, -123, -25, -183, -55, -144, -168, -14, 54, -146, -95, 97, -99, 242, -21, -68, 57, 19, -27, -97, 58, 142, -35, -62, 4, -86, 259, 0, -97, 0, 166, -66, 13, 20, -42, 20, -73, 137, -61, -80, 225, -49, -129, -152, 73, -107, 116, 214, -124, -71, -7, 17, 2, 88, -36, -74, 178, 35, -45, -61, -64, -201, -112, 9, 184, -66, 139, 132, -54, -218, -42, -93, -50, 85, -5, -14, 12, -1, -70, 21, 31, 135, -100, 7, 47, -108, 125, 10, -79, 115, 142, -116, 51, 44, 32]
5459C2J5L6N7o2p6Qk0r6L21k72K3L0K9L8j59J08K8lj67J84J17l6rm2j73K5L15
5486B51k78J25nj83R6m5l7L5L1J0J31Pq7k60K54Q0p2o6N9k61J78R8L2R8k83J39
5512D7N7j40r0Q7J21j39m0J53k5n7M4j21P9L7j00J59J12k18q1Q1Oq2K19k17K7
5537h1J62j99J9M8r0Q2n0R4J28j96l3K46P5l20J76N3j86J24k7j38K22j23R6l84
5561c02L14J13j58O5P2Oj82K3NM8P7l0O1j13n8J0lQ9R0j44J09k3m1j86O4nJ71
5588G2j48N0J07j00j47J14k7M2K1n1K40r3j76M7jMK77l64QJ49K14k42pM4qj40
5614a15J41N1J3k28R2j4q0Q6J9m4P2J09K5k59J61P0j51L2J96k11Q2q9n1J7m1K30
5640A13j61k5J68j52j1L8jj9K0L5j76R8Q1Rj35K81j02j21K03J1k48O4J31j41R9
$$ y = [32, 47, 83, 140, 78, 2, 10, -10, -106, 215, -57, -34, -4, 25, 63, -96, 12, 40, 37, -130, 54, 171, 135, 126, 84, -89, -64, 251, -27, 98, 93, -90, 6, -39, -76, -41, -10, 0, 131, 138, 51, -209, 45, 125, 53, -13, 46, -215, -37, 61, 93, 191, -92, 47, 104, -36, -126, -39, 82, -57, -97, 56, 31, -26, 18, -103, -24, 13, -87, 72, 184, -34, -115, -34, -28, -110, 109, -108, -81, 81, -118, -99, -51, -141, -59, -109, -15, 113, -83, -116, 130, 205, -115, 61, 114, -72, 52, 25, -113, 109, -14, 82, -302, 12, 125, -33, 32, 104, 110, -72, -49, -44, 4, 81, 51, 112, -1, -59, -49, -52, 37, 127, -17, 92, 69, 28, -158, -94, -99, 72, -76, -26, 81, -19, -166, -52, -79, -37, -16, -67, 173, 80, -96, -49, -50, -46, 231, -133, -125, 24, 238, -4, -11, 33, 25, -115, 26, 77, 90, -138, -46, -60, -140, -54, -35, -79, -7, 102, 127, -132, 29, 99, -52, -20, 176, -35, 47, -42, -93, -76, -117, 113, -48, -73, 95, -57, -68, -30, -31, -50, -30, 5, -171, -73, 8, 17, -118, 163, 61, -60, 143, 154, -94, -30, 101, -40, 59]
5665E9j01J21k2j61J43j16L4K29k01J84j64L0J75k88J17J37j44l7j14K12p5j5
5687CL0rj65p8K77q1R1j29l2m4K61pl36J86r2J28j66L25j57j68L94k06o5P4J07
5712A41j95J45J7p8q7jQ4j39K0p6K14j2j21J80k53J39P8j06kJ97j63q0L17j55
5736F4n2K3n9j17J31J98l89L30J2k87J43R6k6o4M9q8j64K18p5k4N6n5j38K93L
5761G8k15oJ21Q4J2o3M6L0q4N2p3k1k5K77j13j31P6j27P8K26j99m3N9q3j10J53
5787aO7j25q4K56p9J3j1L0r6K79k93K7rJ27j5j55J55n1K2l6m4n0Q7l2Q6m9n4j11
5815a46K17j39Q1m9J24m4o1L8J44k42J36K7k09O2K6L0j8R7O7k95J81J07k04p8
5839a48J36j31J36J02j07p6J40l5j55J26J42l6o4P8j76r7J75K4j39J75K0l6j99
$$ y = [59, -42, 79, 57, -104, 39, -77, -43, 186, -15, 169, 5, 35, 210, -78, 39, 176, 32, -5, -119, 93, 18, 3, 33, 24, -141, -219, 58, -23, 68, -61, -93, -137, 124, 117, -219, -33, -125, 3, -163, 162, 5, -163, 231, 25, -40, 34, 141, -54, 91, 108, 30, -57, -58, 26, -113, -93, -169, 45, 33, -88, 92, -161, -22, 56, -50, -52, 145, -18, -98, 219, 64, 12, 35, -24, -141, -10, 188, -201, 129, 141, -146, -3, 93, 67, 3, 52, -36, -200, 18, -57, -81, -25, -80, -218, 75, 78, -137, -143, -22, 62, 74, 11, 57, 87, 3, 55, -18, -39, -64, 213, 100, -31, 45, -82, -4, 222, 23, -20, 39, -44, -154, -1, 66, -59, -143, 113, 34, 47, 36, 66, -30, 249, -44, -17, -26, 101, 86, -69, 86, 35, 57, 21, -23, -73, 14, -18, 68, 19, -35, -146, 71, -68, 13, -36, 88, 44, -17, 21, 165, -77, 59, 86, -123, -61, -35, -5, -23, 74, 141, -154, 27, 134, -70, -148, -12, -143, -7, 95, -12, -88, 52, 17, -138, -12, 130, 94, 30, 108, -68, -165, 10, 34, -105, 70, 90, 54, -145]
5862a45J59j26J06j08k2K5J28k7J01k72J14m8n9K11q4j59Q9Q8j35l9K91j97J47
5885C8O7q4j81K14l9Q6j19L8m1M6M1l9n4o7P3n3J47p9n9K00j9k28J77J27j85m6
5911c9L36k43m2N1j80J27q3J18M3L5Q5k75K57j60Jj4m6J73k01R5M8j44K20L1j12
5936H1m9n0O7j01M9q7K7J64Pj17J54m3p4Oj08J87k5j35L30k61l9Q8j52J01M1n4
5962Gk05K16J6n3J10M3n2j83M2N4n0r2R3J15k2n8oO0r0j15J56o8J62l8Q2k14Q2
5989hR5q2p4O4J9O3j36k0J99Ok50K15j83jK72j02j53R8Q3j21n7J01JJ9M8K6r5
6016B7L0j80J4L05l26P9J21k3m3O0m0J5q7K06Jk06l0K27p9J42j76J27j76MJ68
6041A60j38k14P6J61j66J86j84J2K48k73J19o5M1M6J15j15J7r1J5j42J85o5J11
$$ y = [-145, 14, -112, -6, -114, -136, -111, 17, -10, 91, -181, -67, -115, -174, 37, -47, -206, -117, -29, -164, -203, 88, -109, 38, 105, 21, -160, 54, 15, 101, -18, 20, -21, 25, 66, 27, -27, -94, -21, -74, 73, -6, -65, 135, 116, -112, 65, 192, 7, -39, 297, 54, 12, 63, -117, 10, -73, 45, 88, 123, 208, -67, 190, 30, 31, 17, -29, 144, -57, 38, 86, -58, 162, 193, 81, 32, -18, 49, -52, -3, -90, -63, 101, 108, -9, 145, 102, 28, 34, -74, 113, 88, -47, 283, 22, -17, 71, -81, 20, 61, 7, -198, 18, 34, -19, 91, 134, 82, -101, -59, -5, -55, -147, -54, 61, 39, -19, -25, 35, -55, -170, -14, -82, 80, 42, 124, -90, -8, 87, 5, -69, -5, 14, 77, -59, -79, 120, 126, -124, 91, -92, -93, 179, 77, -76, 22, 105, -16, -73, 28, 29, 48, 96, 122, 27, 57, -123, -109, 196, -130, -51, 70, 47, 4, 64, 24, 39, -48, 158, 159, -47, -77, 150, 71, 213, 37, 164, -12, -8, 160, 22, -192, -116, 45, -121, 65, -119, -107, 141, -132, -13, -78, -37, 9, 124, 9, 26, -65, -50, -192, -7, -72, 39]
6064C9p6n4P5J35k38P7J23k51N1R7o2J84k48jK74k34K35j69K33k15J13l4k3J3
6088D4J6j3R6j75J25k68J35J54%j75J58j71O2oL6k1o7M7j13J40M5j80K0J37j55
6113a29L6J88L4o6J44o8k27J5J69L2j66J69j89J31j84K12J17n3j11o3O6N8j89
6136g4R8J31k68J27J40k13O5O6L2k12K46p1j54J44j99K79p3p4k0J01j61K08p1
6159D7j24mP3j7N5R5k68K2l3Q0R1L3mL1p1jL4K1Lk3K08k61LL7n5L9o1J8J69j71
6189c4N6K7mj06j20Q2K13k35J01J40Mj63M3K8q5Q4l1J37j32j7J25j09n1J4k7J
6215e9O1QJ10j01J10j33O5M9k78J45J11j36Nk6J55n5Q0m0j17NLO9k86L34j35r6
6241a52P5M1j2J03K0j66J45R7j58o7J41Kk04K57l6k08K09m1j15Kj7Q3J9r8J03
$$ y = [39, -37, -91, -16, 119, -119, -42, 81, -170, -119, -22, -84, 100, -148, -149, 125, -109, 126, -43, 190, -25, 88, 54, 31, 44, 60, 47, 143, -32, 93, -175, -40, 114, 114, -61, 97, -74, -12, -18, 18, -3, -70, -23, -136, 4, 49, -131, -111, 26, -129, -93, 95, 129, 63, 207, 139, -88, -73, 96, 128, -38, 131, -58, 73, -111, 101, 218, 165, 54, -9, 57, 115, -74, 24, 155, -113, 14, 154, -59, 6, 72, 104, -108, 138, 67, -87, 57, -142, 137, 64, -10, -30, 71, -90, 118, 47, -77, -81, -8, -25, 30, 125, -143, -121, -154, -74, 17, 50, 46, 77, 6, 5, 39, 60, 63, 40, 248, -13, -10, 27, -28, 11, -50, -32, 137, -34, 22, 49, 45, -61, -181, -99, 114, -121, -20, 120, 124, -39, 4, 32, -53, 31, 0, 137, 5, -12, 113, 4, -47, -33, -60, -59, 2, 10, 120, 19, 129, -4, 61, 110, -168, -23, 88, -48, -43, -69, 86, 31, 111, 71, -46, -41, -38, 31, -255, 79, -56, -152, -77, -36, -48, 55, 75, -91, 54, 151, -7, -74, 67, 69, -135, 122, 86, -122, 87, 46, -69, -67, -84, -1, 18, -80, 23]
6266B3n2p6J41m3m1N5o9Q6K21k90r8R4J68j3j19Q8o1K4K34k33J3M4mk75J05l2
6292a10j5J74k8L9j72P6N3p4J96q9k76J49Q6qJ03O3k68K33o6m9k4N3Q7j99m4J52
6318D2j07R8j11q7L29J3j26q1j2O1j28J25j9p6q7J07p7K70j62J17j24L9o4J50
6342I0K2P9j40o2oL16k61l1O4j42J96J11k13j28rL0K16j60m7N6j9J1Q8J4j05j81
6368b11K11n9Q9j68R9R7J9j28J31j6k2K4P3j27m2J39r9j1j2J04j16J09rj42J13
6393D6J43j67M8K20k67m7J07o0j46K11j03Oj04N5K06k02J34q9k3J68p3m6Nk05
6417a83J43J14k23l6L24j99M8%J0j12o1J74o4k5J52K9j64N6J08n2J3l1O4k14K30
6442A01j93rK45m3m4l61L16k9n1Q6K36l11N9Q4j00R3Oj76P0J24M0k15Np8J70N
$$ y = [23, -29, -105, 36, -7, -48, 7, -62, 24, 245, -45, -143, -49, 119, 106, -13, 75, 14, 38, 272, 39, 52, 96, 92, -183, -78, -110, -125, 49, 21, 60, -112, -36, 17, -57, 139, 50, -226, -77, 9, 1, 104, 167, -101, 132, 66, 17, -7, 46, 133, -66, -110, 42, -65, 33, -78, -165, 164, 177, 51, -30, -42, 19, -109, 16, -3, -79, -166, -59, -136, 134, -28, 89, -35, 4, -60, 90, 112, 191, 51, -11, -17, 299, 38, 7, 71, -71, 125, 236, 23, -105, -114, -84, 132, -28, -75, -19, -38, -27, 61, 75, -30, -211, 0, -59, 30, -138, -39, 58, 77, -51, 80, 64, 42, 66, 139, 12, -30, 109, 10, -1, -13, 91, -25, 84, 75, -67, 46, 189, 22, 70, 290, 23, -24, 83, 23, -123, 88, -15, -9, -113, -58, 148, -54, 80, -9, -32, 136, 63, 17, 22, -183, -40, 74, -149, -185, 139, -60, -12, -12, -2, -114, -175, -1, -65, -90, 62, 91, -73, -17, 91, 39, 52, 21, 85, -129, 101, -92, -101, 144, 101, 57, -304, 12, -17, -68, 18, 254, -57, 2, 86, -14, 79, 85, -91, -21, 103, 143, -72, -67, -145, 25, 30]
6468C0j9M5j89J37O9j58J13K3p2J16j27M5m8O6J0o4Q0j15n8K04rp1J91j51%k4
6494B4Ro2N7J69l47P2J16J2J00k58K4O1nl2L6j09J62j22Q7r5J25O7j99L4o7k3
6520a64K61J27k94N1M6k57L25j56J87j62l7j5J22JN3j15n4M5N1K3O7j22k2J85
6544A46q9q0K65q8k24K5J26l6j71O7Q3m9j68J89o2L27k76nm9J02j7K9k15J53o1
6569g8O4K58k94J58m2p4J04j44m4l2L7N5L2R9k31R8J01j02o9R6r7J69J4K6k8j23
6595d7k0k1J46kj37R4N1m0Rk1n3O3MKk1lQ8p2j61J34M2N6j5j5k20J30pj73M6K57
6625I4Lj43L6J0K11l56J55Q0j56p1J06j7Jj57J76o2M6M7n9J3N4oj04JQJ25k59
6652b24K05K7P8k1q0q0J08p2NP7m5j1J09J5k05J22r5j1j14j3L55p6L9k6m7O7k0
$$ y = [30, 11, 56, -133, 4, 73, -85, 28, 51, -21, 95, -32, 13, -35, 31, 41, -23, 57, -58, -116, 88, 79, 8, 199, 48, 48, 24, 33, -29, 28, 197, -150, -78, 38, 50, 150, -108, -84, -23, -28, -60, -24, -133, 29, -93, -6, -101, 24, 91, -108, -74, -141, -164, 97, 224, -70, -19, 27, -230, 95, -61, 126, -36, -73, -88, 34, 35, 88, -27, -81, -36, 15, 38, 105, -17, -39, 146, 57, -23, 242, 154, -70, -45, 81, 45, -126, -59, 24, -25, -193, -4, -66, 261, -15, -20, -69, 33, 16, 45, -170, -17, -78, -14, 244, -50, 108, 66, -8, 96, -48, -92, -124, -87, -32, 0, 99, -132, -34, 67, -35, -104, -8, -105, 64, 78, 104, 76, -47, -67, -88, 58, 56, -81, 13, 64, 24, 33, 12, -41, 22, 26, 28, 7, 4, 92, 20, -141, -7, 35, 91, 76, 61, -159, -29, -36, -209, -163, 94, 97, -46, -10, 0, 211, -145, 10, 90, -66, -137, -31, -48, -47, -204, -28, -90, -44, 3, -56, -43, 11, 5, -99, -98, -90, 35, -224, -19, 8, 86, 65, -15, -95, 13, -59, -54, 23, -22, -33, 76, 91, -114, 8, -87, -98, -212, -225, 130, 54, 93, 67, 20, 87, 67]
6679F7j02R6n7r6J37J3k2r4L9P6j10L1r1J20o6L13j58j98J09pJ15k47K76q2J0
6704G2p5N2M5k23P7J75j18j51K00Q9j44Nq2m7J69j9m3m5pMO9q0J22K3J4j11mj0
6732d3Q5N3J01k29m9L9J70J05r9j64O1j25M9O0J03r4o6n7J65j6j29J66p4m6j6
6757e0J32n6M2q4J25k48J22qo5K5J32n9N0R9k56J09j31J06N5q5o9M9o6O0l5J03
6783cj40kJ60j42l2L2R3o5J08O6j74J97l7nJ29l29K63o4j1J1r7J5J35j23p0K79
6809A94q0j28J14lj33J52k15J79j94R2j9N1N9L4j16j0j03J87J1m0j58K88j55O5
6833G2l8L8j26P0m4P4M2j54K26j29L4LJ4m7J36j25r1NO6q7R1k3N4j52n3J68L9
6860F3k5J81r1p8O6j64Mq4P5L4J4k3L6k1N9j44J8J90k41J78M8r6J56o2r7P0m3
$$ y = [67, -35, 61, 4, -92, 45, 58, 36, -58, -19, 57, -53, -22, -113, 7, -59, 254, 96, -102, 7, 0, 115, -132, 144, 62, 72, -3, 49, 94, -129, -52, 123, 5, -146, 54, 143, -1, 4, -78, -125, 44, 25, -18, -63, -70, -66, 3, -77, 45, 68, 82, -29, -33, -43, 42, 95, 196, -33, -82, -43, 127, 232, 133, -31, 30, -95, -46, 14, 117, 23, -43, -100, 65, 49, -80, 86, 12, -34, -50, 82, 26, 68, -16, 109, -139, -17, -25, -90, -65, 67, 8, 58, 157, -99, 10, -121, -15, 40, -45, -114, -65, -131, -71, -106, -3, -143, -145, 15, -127, -159, -127, -34, -99, 9, 75, -99, 98, 61, 56, 185, -144, 119, 55, 44, 55, -42, -27, 108, -15, -85, 194, 114, -14, 100, 97, -36, 116, -99, 80, -114, -22, -41, 10, 69, 103, -13, -23, -126, 61, 72, 32, -126, 162, 7, 72, 34, 72, -54, 16, -28, 46, 88, -66, 160, 31, 65, 68, 82, 35, 171, 46, -45, -40, 26, -61, 30, 7, 61, -91, -144, 24, 63, 38, 219, 128, 50, 116, -48, -44, -128, -53, -19, -5, -28, 8, -13, 46, -98, -80, 110, -131, 47, 95, -1, 155, 93, -4, 66, 23]
6887B3q0J34o8n2J31q2J58j36r0n2J24k2k8J26K8p7n4o5M5M5o3J17kL9j16N0k48
6914b15J55N6k15N0l2J69J29O3j53p0J37j95J19J06j03R2J8k80J28M0O6J1JN8
6938A35k26J06o6P6L9q6pl2J33o4j11J38J45j54N1O6k83K68j54n9J9Q5O4j33P4
6963B4M7j22J17r8k38K46Q0N5j28K1o8K0M2N3j53K33o7J63k88j2Q1l5k5P9M7p0
6989DL2r7L9J0j8RJ95q3o2J08l8K8r6M2r6M8m4J13%Rj56Q4l8m2J28j65J83j4p8
7018Ej53L07k82J55m4M4m7J9q2L8J5R7o4J40j68N0J26k81J27m5l6Q3j32J36P5
7043H3l05J31O2J57k38K72j08J02k51J84K9k22J65L3j21Ln7OM4j66K69l7j05J66
7067I6P5k29k74K57J75n9M2m5l9mj1j31J55J0R3j49J87j49p5P1l1J04KN1j48L8
$$ y = [23, -57, 77, 9, -43, 88, 6, 164, 28, -62, -114, 10, -12, -40, 86, 114, 37, -17, -82, -37, 8, -55, 62, 60, 99, -17, 33, -215, -60, -4, -219, -169, -201, -32, 97, 160, 7, -63, 74, -121, -2, 104, 1, 93, 111, -169, -41, -1, 65, 76, 77, 135, -91, 15, -51, 25, 64, -22, -29, -61, 72, 8, -103, 35, 180, 26, 77, 143, -140, 128, -26, -85, -66, 19, 83, -50, 24, 71, -51, 66, -32, -270, -24, 56, 111, -17, 4, -64, -44, -2, 51, -102, 131, 64, 227, -61, -73, 8, -27, -52, 27, 74, 4, 36, -61, -22, -12, -30, -21, 174, 91, 29, 137, 99, 127, 31, 73, -23, 25, -19, 94, 94, 103, -53, 31, -7, -49, 79, -86, 97, 83, 5, -148, 159, -123, 32, -12, 32, -15, 4, -78, -40, -25, 72, 8, 148, -20, 30, 156, -125, 2, -43, -79, 4, -128, 8, 83, -222, -91, -29, 128, -110, 162, 54, 156, -95, 89, 118, -104, 61, 94, -27, -24, -81, -75, -31, -197, 72, 35, -70, 96, 171, -58, -332, -75, 100, 41, 83, 38, -1, -5, -16, -147, 8, 18, 111, -38, 149, 0, -75, -4, -35, 69, 71, 122, -26, 12]
7093A2N0m6L7J5r4J19k34K21j06M9J3M8Oo5j50q5K49O6K24l06Jj14J19j97Q2O9
7119a7o4O9J85j20j1P0o8k6Q1n8M1n6K3j17j03J04MJ37j46n3J44o6j48K54j4j01
7145e6J03j42MR1J52j77Pj25K46M2q7j0R3j91k15L08l9j00J17K2j48N1j22K70
7169I4j94J21j24Q6P3j56O4O3M2r9J5Q8n9Pm1J32k42K68j32J9j34J99J0j27ml2
7195f3J79r8J17j34kR5j7j76K34n2M1m5k98K62k48R9Q4J95j57P1j26p8R3M8j95
7220a71L29m02L11k02J42l1K6o0N3r7J13m5QJ50j40l9P8m6j71K68j43M0R4j10
7244d5J02N5q8L3K9p3l3J42Om6m3j12O3P0k15K85l07J37Q2Oj38Q2n9J3OJ9j02
7271a31J34l1J3L5n5R7m0K6K8o7J03j10O0j13M0J33j54J1J39j1q2lM7n3j50J31
$$ y = [12, 62, 16, 53, 68, -26, 93, -141, 80, -26, 23, 36, 84, 90, 25, -125, -210, 39, 105, 329, 23, 24, -90, 29, -168, -86, -17, -81, -12, 173, 53, 42, 112, 44, 18, 99, 41, 82, 26, 49, -68, -171, -67, -63, 74, -72, -125, 19, -47, -195, 59, 45, -56, 47, -95, -91, 0, 152, -25, -18, -143, 103, 145, 58, 48, 141, -50, -265, 43, 4, -96, 21, 43, -105, -54, -176, 94, -100, 21, -103, -17, 56, -100, -36, 27, 69, -30, -15, 73, 14, 21, -20, 112, -130, 138, 6, 25, -109, 90, 100, -27, -31, -63, 116, 18, 135, 1, -1, 94, 77, -99, 135, 83, 124, 79, -219, 43, -205, -106, -22, 173, 16, 87, -39, -117, -24, 24, -171, 158, -244, 67, -135, 7, -24, 2, -58, -5, -102, 11, -34, -26, 124, -16, -55, 23, -23, -194, 74, -69, -29, 65, -45, 57, 112, 24, 57, 86, 13, -20, 122, 128, 82, 39, -73, -10, 60, -155, 130, -177, -40, 42, 48, -90, -8, -67, -54, -48, -29, -131, 3, -28, -15, 20, -35, 62, 22, 48, 76, 9, 112, 2, 62, -51, -11, 122, -32, -21, 118, 107, 25, 22, 69, 16, -134, -3]
7297cR8j67J40j81J70j05k6N4J6m2J36lj56J0L1oj34J23N0K04k97J26k0O4j82
7322a00o4J22l8J56K5j68P4n8j40K65j62J01N8kp6j8l1J77m9j87J09k3J9K16j11
7347I5r0m4J80k31M2J6j37o2J15J80q8l4p3PJ08P4N4q5n3N5P4Or0j02J59n9L4
7374E1j1k8P3j88J22Kj48J16Q2r5J19o1pj38qJ57K7j44J25kk28Q5J24m1mP6j80
7401a24J28J1p0L4k6lJ1J37o6J17n0j15m3K00p0J29j49j29N1j07K09l4K4m9M6
7426F2%j84J51p9K7M3m7O6mJ4P7j31K3mk8J39j15kj2o5Q0j5J52k44P7k4j14K57
7454A00q6j42J77Ok52L84k72J77j8k12J11j4N9o3N6q4J65q8o9P6j99K40l1N8M4
7479A23o9k6Q9rj49J43k91K72L1n1q3l3J09k33L32p9r8O7O7o0mN0j19m0l6J22
$$ y = [-3, 95, -72, 68, -113, 57, -48, -74, -20, -4, -46, 90, 87, -69, -59, -28, -34, -168, -45, 5, 209, -88, 38, 18, 82, -100, -164, -42, -80, 76, 101, -67, 7, -51, -191, 74, -88, 13, 71, 69, -7, -25, -56, 121, 72, -115, -6, -29, -10, 206, 95, 5, -39, 141, -90, -48, -32, -169, -231, -116, 64, -24, -58, -131, -124, -16, 58, 112, 27, -26, 29, 103, 109, 19, -83, 76, 17, 51, 40, 12, 85, -103, 19, 21, -127, -11, 71, -24, 95, 34, 27, -111, -119, 38, 65, -79, 46, 44, -184, -99, 25, -16, -20, 56, -124, 4, 15, -55, -21, -47, -50, -39, 98, 32, 149, 99, -16, -59, 141, 71, 200, 51, -78, -27, -134, 75, 41, 65, 16, 62, 62, -122, 29, -50, -23, 20, -27, 39, 35, 49, 126, -5, 18, 14, -14, 125, 10, 8, -4, -69, 11, -4, 148, -96, -19, -43, -157, 100, 14, -128, 49, 55, -197, 187, -85, 92, 74, -138, -27, -41, 18, -45, 11, -73, 92, 4, -65, 11, -188, 52, 21, 79, 123, 54, 28, 117, 108, -41, 102, -189, 83, 114, 63, -20, -53, 56, -177, 155, 76, -22, 45, 112, 52, 48, 98, -21, -61, -97, 25]
7505B5L8k6m7j55J82l4k3j07J07Oj46L00l46K38o9R9N6o1n0j49J4J11k35K18P5
7530B1p9J10j14K99k38k8n8L3Q9l2J05j12m3j1p9P0N3k07K99j58J49L8j14o4R9
7555B8j19m3J78r1j89K33j76K91P0j31N9j10J14q1l0k0J3K5j13K4J29l1Pj40M9
7580e4O4l7L3q1Q6j3J3KJ25K3j89N7Q3M6j05r2J01r8K6L0n4J32j41n7J39N8k7
7607G0N1L5r5j42J56N5j55LK3l2j18K13j33J04m6q7J81j73Q6J32K9k11L0%M1Q9
7633A06j54R5nJ0J29j09Rl3q8O6Q1j28JL9m6J23j74M8j16K16J1n8m9k4P0P0j45
7660e5K0J36M9k53J60n7J6J32j06j24P2J72k94N3J21p2n9M0J6J24j78K10j57J69
7684A35n7p3o9J11r4Q8K8j75J27k3J42j53q8K60j92j10J77J37j64J11l43L34j15
$$ y = [25, 63, 37, -10, -165, 17, -17, -40, -147, -40, -34, -180, 120, -226, 12, -57, 42, 98, 37, -13, -162, -148, -37, -272, -54, 21, -58, 52, -62, 237, -1, -29, -87, -54, 35, 3, 108, -4, -47, -58, -137, -67, -14, -221, 78, -80, 69, 107, -7, -71, 28, -91, -134, 44, -47, -236, -3, -179, 112, 182, 51, 110, 0, 114, 33, 3, -17, -4, 21, -92, -68, 61, 30, 37, -103, -54, 10, -27, 6, -75, 11, -2, 11, 13, 138, 161, -28, 29, 112, 158, 53, -39, 62, -36, -10, 20, -34, 98, -43, -100, 39, 97, 70, 121, 156, 61, -81, 75, 130, -25, -22, 1, -31, -149, 64, -69, 35, -11, -98, 83, -90, -4, 128, 157, -54, -24, -24, 17, 106, -48, 47, 42, 52, 181, 72, 81, 48, -40, 26, 107, -21, -20, 19, -27, 96, -78, -30, -146, 70, 81, 23, -26, -50, 20, 90, -55, -35, 101, 150, -103, 57, 0, 16, 148, 42, -82, -10, 162, -132, -79, 42, -30, -89, -49, -33, 91, -87, 123, -34, 135, 78, 5, -64, 47, -47, 41, 69, -106, 21, -2, 140, -13, -101, 159, -33, -143, 34, 171, 7, 118, -225, 109, -6]
7707fm9k1k1M7j37J76nj66J64M8j00mJ02r9Q2J5o2J22l7J4nQ8j23O9k34K90j14
7734C4m4L9R9j6j08J44r6j18KJ9N5j43N6%k7J49Jj47J54K8j41N5q2K21j05J83
7760B12j62k08J87l1p6K4K97j77m6p9O6j51K07n5q7P9Mj25lN5O3R7k25J10%M7
7786B3p5L3n1K6J23p3J18j50J8l3O7%r9J66o7o4R3Qj6L4k02J25n5r1P1K79j65
7813D3L1JK2l5l1j31J38o4n0J89k53J12p8J82j42N0K2Q5j10m5J57r3M5N7j44O6
7839B4pL7j07Q9l2J04j75n9J04m5Nj82K65rn8P8J4N3j59k9Q9J60l28K09m3j7m9
7866f8J29M2r7l6K6p7J24j16j4J5qM4J16j12o4K76j93J10k7m2m6M1O2n2P9j05
7892GK8M0l2J24j06l1j48J60J31l67K88mk67P0R2k2%L4R4n5j88M1J49J00p6q7
$$ y = [-6, -55, -76, -97, -50, -187, -11, -16, -182, -18, 30, -70, -74, 28, -71, 11, 26, -36, 86, 49, 63, 58, 146, 23, 92, -142, 148, 34, -10, 29, 128, 112, 4, 148, 52, -66, -64, -45, 10, -133, -77, -77, -104, 45, 46, -101, 53, 81, -60, -5, -87, 134, 29, 212, 50, -158, 29, -2, -78, -54, 243, 66, 20, -59, 7, -144, 63, 8, -79, 0, 4, -121, -124, -69, -6, 91, -134, -24, -24, 23, -52, -19, -70, -44, 79, 6, 124, -26, -8, -41, 26, 26, -73, 93, 26, -38, 55, 63, 47, 81, -121, 4, -51, -142, -71, 208, 43, 74, 75, 97, 62, 31, -100, 38, -26, -76, 113, -140, -28, -106, 76, -66, -16, 6, 91, -19, -64, 93, 0, 45, 102, -42, 24, 17, 54, -53, 36, 4, 108, -67, -126, -22, -67, -62, -244, 21, 12, -46, 32, 46, 99, -60, -89, 0, 160, -168, 41, -2, -19, -68, 61, 103, 6, -30, -4, -81, 43, -73, -87, -72, -80, -36, 80, -32, -96, 180, -13, 97, 70, 28, -18, 23, 85, 33, 112, 7, 35, 75, 43, 167, 61, 30, -118, 42, 173, -194, 94, 90, -177, -107, -15, -37, -37, -3, 91, 36, -152, -111, 38, 138, 62, -25]
7918b5N5j9k4J85r9j38P0O9P3r2j3O2L8k14J46pr1PN6j6NK6j18n3J40l1Q3Rk24
7947a40K62R4j54j43qJ8j66J21Q9L9n5M9N8p3P9j58K18l18K04l6J11N7p5Rj09
7972b7R7p4J3o8J12j22P5r6j06L09j82R4J04j73L5q4L0l0Q8J33lj83R4K8j40P6
7998@J50j00n3N5j2j8K78k69o6r4K19k49J05L0J19r8P8k61K64qJ0o8o9L0r1K87
8024A69j18J01k73K12o8k2L5r1p3J68J27l89J62J15p5j5r1J60j61J19j33J50K7
8047C6o9j60K78j47ppJ55o7j1M5Nk6olj73Q4J52m9o7J44j58j11J24l6N5j1J86
8074A56k9n2k80J50l0P4O3j98J64Mm3l2P6P0K6J2p8k44K11k89J64O6Q1J4r3J58
8100A21l3K0l34R3P7P2J81r9j43P8J90k73M6l3M9R3Lk09J95j32J13p3K6j2J07
$$ y = [-25, 30, 11, -13, 172, 73, -65, 5, 74, 147, 55, 42, 104, 142, -72, 74, 67, -24, -17, 39, 23, 28, 54, -64, -117, 23, -8, 75, 84, -140, 122, 216, 62, -81, -89, -71, -237, -116, -27, 12, -43, 6, 64, -9, 70, -88, 130, -188, 16, -20, 91, 148, 73, 82, -27, 70, -4, 9, -59, 53, -69, 6, -90, -196, 113, -69, 25, 129, -44, -9, -93, -63, -93, -5, 128, 125, -58, 36, 64, -76, 0, 150, 50, -3, 52, 40, 22, 300, 31, -35, -129, 90, -159, -54, -24, 95, -3, 75, -186, 78, 70, 80, 12, -57, -27, -118, 169, 51, 152, -121, 91, 23, 1, 36, -55, -128, 40, 167, -222, -60, 55, -20, -35, -126, 34, -127, -8, -141, 9, 36, -33, -193, 85, -62, -69, -76, 79, 12, 1, 46, 51, 25, 19, 16, -157, -73, 79, 30, -37, 107, -51, -162, -38, -74, -19, -30, 156, 127, 75, -205, -55, -85, -11, 52, -146, 18, 22, -21, -53, 23, 93, 119, 131, 53, -191, 20, -269, -105, -39, 42, 56, -37, 121, 88, 108, -226, -133, -56, 16, 197, 98, -45, 33, 223, -50, -4, -37, 12, 105, 108, -101, 94, -38, 75, 2, 28, 16, 123]
8125A23j8j70J18j6m7k8J33J11l2j02p6O2p0o1J66k33J52J33l9j30m6J56Q4k33
8149f3O3K1j02J85k86J78M8j19L0L9j03L2O9J12j97k7J07p0Q5j38J39J4L7n5J6
8174A5J70q1k01Q8J06k54L08J36l62l4J15o7l3O6K93j88j46
$$ y = [123, 105, -65, 53, 37, -10, -38, 95, 206, 174, 72, -4, 58, -12, -73, 93, -140, 12, 145, 106, -24, -70, 86, 170, -63, 0, 21, -81, 104, -182, -4, 44, -75, -45, -6, -109, -77, -8, 104, -93, -120, -13, -83, 2, -136, 3, 17, 54, -1, 15, 185, 104, -97, -9, 97, -157, 151, 287, -75, -109, 6, -61, -94, -28, 265, 77, -69]
8191f9
$$ Imaginary data points
##PAGE= N=2
##DATA TABLE= (X++(I..I)), XYDATA
0@%%%%%%%%%%Qj6J6j6K4l2M0m8N6o5P7r6J12j32J56j80K07k40K77l14L57m10M65
33B46n23N91o66P45q34R33j040J154j281J421j570J734j916K113k329K568k828
50a482L113l430L783m175M617n119N690o348P119q036R145j0516J2264j4575J7775
65I825k2506L0191m4654Q0591l21718m50418J002667J77945n28368K06097J91159
76C30811m10760J12504K80236l89802j73500M14562j29849l80594K27765K26535
86A07908r7320O5262o8095j74582K60704J97393l64405j69399K67698j630j75066
97a51532J21906k1977j75389K29723J49524k72291N8216K68824j65051j16985
107g5032K32549j0274j72449J22657P430k73178Q8554K42774k01843j36163J76263
$$ y = [0, 0, 0, 0, 0, 0, 0, 0, 0, 0, 0, 8, -8, 8, -8, 16, -16, 24, -24, 32, -33, 44, -52, 60, -72, 84, -96, 111, -129, 148, -166, 191, -219, 246, -277, 314, -352, 393, -441, 492, -548, 606, -675, 746, -824, 910, -1006, 1107, -1222, 1346, -1482, 1631, -1799, 1984, -2191, 2426, -2693, 2997, -3351, 3768, -4268, 4877, -5639, 6625, -7950, 9825, -12681, 17510, -27144, 53447, -268271, -718689, 283978, 461923, -66445, 139652, 330811, -79949, 32555, 312791, -77011, -250511, 164051, 34202, -346392, -118627, 107908, 10588, 75850, 7755, -166827, 93877, 291270, -73135, -242534, 25164, 23534, -151532, -29626, -51603, -226992, 2731, 152255, -120036, -61820, 207004, 41953, -75032, 157517, 147243, -25206, 97451, 104881, -168297, -79743, 163031, -38812, -174975, 1288]
118A288l3875m7595J55851o4591j21777J52954L3484j62363O2261R3239j43445
129g4569K8934J49403j94482q6008K92176l3796k56154J71434J82080j83148m4647
140d8777J65458m1431q3961J07567m1983j73497R5897J00378j48968k2466R8187
151F404m9208j7993O8033k4304j2989P8801j9262r8573N7746Q6118r0379l9781
163e5387P3736j9921j1679M0887n1215m540R4843j2210o8114M2471M2630o1646
175I855j5524M9361m4495l1682M8722o0466n9222J01394L4005q0560L255N2956
187G599o278j3245K9122J0216j7957J1691j9048l6489N0616K6628n1351j011R775
200B68k1833K4487K8005j6981m707J8174j5736l2799L2208K6395n0699p161K3824
$$ y = [1288, -32587, -80182, 75669, 11078, -110699, 42255, 75739, -86624, -24363, 68876, -74569, -45635, 103768, -90714, -176722, 115454, 81658, -174496, -3062, 179018, -4130, -48777, 116681, 75250, -8711, 98856, 56873, -116624, -20727, 79651, -69317, -91783, 6404, -42804, -60797, 7236, -17068, -30057, 48744, 29482, -69091, -11345, 74773, -15606, -55387, 18349, -1572, -13251, 27636, -23579, -28119, 66724, 54514, -13600, 28871, 71501, 9855, -5669, 43692, -803, -32485, 16237, -44229, -103451, -2057, 31948, -48612, -45357, 7599, 1321, -11924, 17198, 27414, 9457, 21148, 2100, -34389, 16227, 42855, -8496, -9507, 268, -21565, 2922, 30927, 13946, 9239, 27413, 11677, -21122, 11086, 37481, -13218, -20379, 3445]
213C445l7549j48L7549j9573j3455K3347M365q367J3912J8949j7644p025L1273
226B9079p648k1595N750j5098M676K7858k0030j8158J5123j506q842J2867K4517
239B6993p059k7972L411l721p578L6971k808n1709k673K4814O177q33O843J0393
253A1249j5331r697K0435O021P398Q536k6600j3265J2697L440K351p829p367N984
267a978m990J562M016l790J2392j55j3065Q180q3q004L264K155N284o459r025
282a0696Q338o883J329K4000o800j2418N364o399R41J3481O223q452j8107K094
296g985M514o426J7272L290k0143O642K41j1861J7030J3441r423j0740P23O193
310B768o717O231J2797j8258j995J2282j8199K65K0093m709o544q6k947j567K999
$$ y = [3445, -34104, -34252, 3297, -16276, -29731, -6384, -2019, -10386, 3526, 22475, 4831, -2194, 29079, 21431, -164, 5586, -9512, -4836, 23022, 2992, -15166, -43, -1549, -10391, 2476, 26993, 19934, -8038, -4627, -8348, -15926, 21045, 18237, -33472, -36145, -11331, -5154, -5987, 856, 11249, -4082, -13779, 6656, 12677, 20075, 28611, 2011, -11254, 1443, 4883, 7234, -595, -7962, -1978, -6968, -5406, -1390, -5180, 7212, 7057, -6008, 2172, 2089, -5915, -2651, -496, 4788, -1671, -10696, -2358, -9241, -7912, 16088, 9288, -3130, 2234, -4165, -3224, 10257, 16480, 8028, -10079, -7985, -3471, -9897, 7375, 10665, -9478, -2836, -2595, -14456, 2574, 16015, 6592, -4148, -3425, 2768, -3949, 2282, 15079, -3179, -5174, 7108, -11091, -10826, 9267, 4558, -1986, -2072, -5019, -6586, -3587]
325c587J0345l803m707J0317j4161q494K3738l231r538J3155r104j4433J1067
338b436J1978m793n904J0320n615k0137J8313J1903j8946Q354M986k0856K325
351a0508J1815k213j285J357j880q574O835J1925j0676O404J1806k1213K40J6944
365A0977j1605N29J4431r071j3808M764J0055r500l587J9480r176j6295J5789
378B983k164r263J4464p24j1894K21J855O34j05P154J719j2414M509L776q354
393g603J4074P042j2766L288J213q249K238O965M007r153q033N963m566J29J0867
408E416o142k254M386o558L3L382M470P398j0289r805L539J527O312O21m813O623
424C846n80m625K050o0J0952L077j6520m500J897L182R275o304q521L961R25j242
$$ y = [-3587, 6758, 2955, -1752, 8565, -5596, -14090, 9648, 6417, -3121, 10034, 930, -13503, -2436, 9542, 4749, -1155, 9165, 3550, -16587, 1726, 13629, -5317, 3037, 8023, -12833, -10508, 1307, -906, -2191, -834, -2714, -11288, -4453, 7472, -3204, 3200, 15006, -6207, -5967, 10977, -628, -99, 14332, 5261, -8547, -3783, 6272, -3228, -6815, 12665, 3489, -12806, 2983, 819, -8444, 6020, 5296, -6598, -6377, -4522, -3888, -3993, 3161, 4880, -7534, -3025, 751, -7603, 6471, 13513, 747, 4035, 5248, -3001, -763, 6202, 10209, 1056, -6977, -1014, -5580, -5451, 5416, -726, -2980, 1406, -5152, -5119, -1737, 2733, 10131, -158, -9963, -6424, -4897, 1415, 2036, -2777, 3846, 3266, -1359, 691, 631, 11583, 14660, -1860, -6360, -4463, -1281, 7994, 1690, -6831, -2870, -1945, -3187]
440c187l376N612J4619p431j1943m99k590J1730Q494j5015m103O582O38k128l008
455e605P059P342n955m362n519L957J7559m140j0066J853m561L056M364r136J829
470b325P507n236j1309k760J4589O076q368K155j999l810J1833p27o125M734l920
485C15m385m06k501O354O735J63o743o748J2387M935j1745P782N173j3526j679
500c889J532l334J845K640P22p070k876Q922K57L715O519r169K291M490j4881
515h286M312J7712o883j1397K837K330q154K742J5518q541r823J2399o729p634
529i597J8844J88j1540M163k714o866O279O374p962n085J2154o209j4098K0264
543D195P866j6472Q228M770j3697N168O860r699j072J1860n008j7480J1017J4053
$$ y = [-3187, -6563, -951, 13668, 6237, -5706, -6205, -8795, 2935, 11429, -3586, -7689, -1107, -469, -2597, -5605, 1454, 8796, 2841, -1521, -7040, -3083, 14476, 10336, 270, 2123, -2438, 618, 4982, -4154, -2325, 5182, -54, -11363, -14123, 466, 6542, -1826, 329, -1670, -5480, 6353, 5626, -499, 4235, 315, -4070, -4476, -6977, -623, 6112, 6275, -468, -7216, 5171, 10106, -1639, 6143, 11316, -2210, -3889, -2357, -5691, -3846, -1206, -484, -7554, -10430, -1508, -1251, 2464, 8983, -186, 2105, 6595, -8286, -3974, 13738, 6855, -4542, -1705, 625, -7529, -4787, 10731, 2190, -7633, 4766, -1963, -9597, 9247, 9435, -2105, 2058, -656, -7522, -1243, 5131, -2831, -7916, 4238, -1971, -16069, 4195, 12061, -4411, 3817, 8587, -5110, 58, 6918, -2781, -3853, 8007, 2999, -14481, -3464, 10589]
557A0589j5772L546J2609j9155n59J9555q375p770J4013J50j8684k492J3548k473
571a270K52R427j6286j527K4080j2622j2205K5238j236k5150N375J1733j2403
584f594J510K1067j5807k2656K6799P718k7352J2839J7176j7682o9R076j1395
597e370J190J7574p919k0848J4659J1873k3823N612K1540j7332j538K0055j7179
610a506j3424K3590N194k3611P09J6620j4343o627K4353o767j4331K0173n785
623D245k1618J8764J3969j6736k749J1495q837q006J9785K68k2207J2212P709
636H294k4003Q996K0431j4199m180J2597q581j1321J4373O857j8682L305J7824
649A1711j6533n857K0983p558r242J4485l937j2777Q167O520q926J521J2708r832
$$ y = [10589, -5183, -1637, 10972, -8183, -8742, 10813, 2438, -5332, 8681, 8831, -9853, -12345, 1203, -1270, -1018, 8409, -7877, -9404, 14676, 2054, -10151, 15087, 13851, -11299, -5924, 5809, -6594, -5084, 15983, 176, -22480, 4319, 12037, -15315, -2476, 14700, -2982, -3051, 6025, -5370, -4180, 13394, 5475, -15373, -714, 11159, -12664, -7052, 14488, -2844, -4382, 15673, -1506, -14930, 8660, 13854, -9757, -9048, 7572, -6771, -13398, 10955, 4188, -10143, 10030, 4245, -17373, 1391, 15360, -1376, -4125, 7370, -1467, -9473, 10312, 10580, -11627, 585, 8294, -15709, -6713, 13718, -481, -4661, 7936, -645, -11966, 2407, 9264, -9418, -6113, 11711, -4822, -10679, 10304, 2746, -6496, 7989, 4052, -8725, -558, 5962, -2964, -1443, 11265, 1433]
663A433j1051J4629l980j0319J8627k452k1223J0986J0948j1843R89J3303p095
676B952j5240R227O401j1525J0668Q777j9223R93J4551n575j052N647n676m907
690c982M430Q60o620O515R510j5123l825J4777p941m937J3296n025r162Q746L130
705D649r892l21J3141l650j2763P707K416q681R472M301p574L824Q04n626P40
720a453M002J821l597j630j276m425P566N280q886L368L529r994J740P254q58
735B441j740m71K4l825j108Q249j661n727L950k085j363M408K7K627L10n036J161
752A81O78j106J758j82R71m068l541O993r47m358O816j464n565K967J120k16K44
769B81J033J101m839j38L519l565K220J489l711M281o66n061N260K839k200N45
$$ y = [1433, -9618, 5011, 1031, -9288, 9339, 6887, -14336, -3350, 7598, -4245, -3256, 10047, 2952, -12288, -3061, 3340, -8185, 2483, 11260, -7963, -6970, 7581, 2006, 954, 6601, 925, -3982, 448, 1308, -5312, 1203, 10713, -4410, -8235, 6542, -1399, -6336, 6960, 1935, -7227, 1519, 4649, -5243, -5564, 7577, 3927, -8836, -1129, 1287, -7394, 2078, 6379, -1195, 2629, 3433, -2193, -1453, 2549, 4370, 773, -857, -2133, -6558, 1008, 6288, -2598, 770, 4299, -5695, -3955, 3299, 2441, 701, 230, 254, -3571, -4679, 3570, 1909, -3818, 132, -1953, -3316, 1092, 1119, 3746, 4056, -980, 181, 859, -247, 1511, 1329, 2300, -1768, -5309, 1684, 737, -3621, 3195, 1731, -3834, -867, 253, 37, 281, 1314, 2415, -2424, -2562, 957, -2608, -388, 1101, -2610, 1671, 1005, -4056, 1204, 4043, 1843, 2388]
785B388l34j939l984L377O331o932j588N531p801j617R928K94k953j471j260m11
801b441R55O248l31o518J970k208k811P923q42l995L713l188k847N934L355k610
817B307l783L383Q48o468N225L423r020K668M727o484J2L172o98m46J133L189
833C188k615k888L210j991J437N002o372k363L247l698K576N996k573m144m03
848b391K871j97n6P234m359r649N538J746k952N389n73n366o84J758L048j08M51
865A700M35n446J329L713l449M077O77p356K717K751l070J030K344Qk721L54M312
882C405m574j127P183l425k880M189k702k318K023R88O68k329n76L33k303M265
898H20J806l453K261k148l686N489J80j750K029j869j989j46L101K949l775L89
$$ y = [2388, 2054, 115, -3869, -492, 5839, -1093, -2681, 2850, -4951, -6568, 3360, 3654, 701, -770, -2030, -2441, -1486, 4762, 4431, -2087, -117, -2325, -5136, 2787, 1945, -2050, 1663, -1525, -4372, 1562, 4917, 2307, -1476, 1907, 2755, -3713, 1512, 4935, -4085, -1417, 3310, -3174, -3162, 10, -688, -1134, -1, 3188, 573, -2315, 895, -1096, 341, 5343, -1029, -3392, -145, -3843, -1267, 4729, 2156, -1988, -2391, 480, 283, 227, 7461, 3102, -6547, -1009, 737, -2215, 3174, 2601, -2765, -3449, -1691, 1357, 1249, 1700, 2135, -3311, -1982, 1731, -1718, 2359, 3036, -4320, -1603, 1148, -1922, -892, 1452, 1460, -1261, -907, 3405, -1169, -2296, 4887, 1462, -1418, 2771, 69, -2249, -226, 762, 1430, -899, -1475, -1142, -3445, 820, 2626, -827, 1434, -714, -4400, 1089, 1269, -481, 1548, -321, -2310, -2456, 645, 3594, -181, 208]
914B08K600n000J536M307k265J86j079k563J462j015J630K092k861k4o95p88K670
931D01j110J320J562m994J222L002k410J865O43j806J029j668O75J690j218J564
947A767r32j893K164j884N28K485l382J696J770m591L90K127O35k68j955J236
963a07q44k074M453p52k428L905k355l299L237J570J205n39k511K00r86J579K170
980B424k766J772k15m834L149J978j771K737j726l631J400K044J803k935j401
995a972K947l040n64L939k154O71K006l414O49J467k59R88q04K74L52j666J444
1012H64j854k31N140k817l757K952j563l05K979j26n88j133o11J2j030L977J145
1029C054n185J111J9k148M513J96l067J939J80j551O2K309K457l291j136J641
$$ y = [208, 2808, -2192, -656, 3651, 1386, 1572, 493, -2070, -608, -1623, 7, 2099, -762, -786, -1481, -2269, 401, -709, 611, 2173, -2821, -1599, 1403, -1007, 858, 1501, -305, 724, -944, -269, 1421, 203, 1767, 835, -1058, 1106, -778, -250, 2235, -1147, 549, 2319, -2272, -1882, 245, 880, 612, -1343, -107, -951, -3025, 1428, 676, -1752, 2153, -202, -3501, -264, 1306, 2511, 1972, -539, -339, -1325, 254, 2424, -342, 1430, 1215, -3619, -470, 1508, -263, 2474, 748, -2883, -1483, 561, 2364, -571, -1972, 975, -2065, -2629, 1310, -844, -173, 1833, -1581, -932, 535, 276, 1264, 460, 734, 1086, -580, 864, -990, -1221, 3919, 1102, -2655, 297, -1266, -1571, 1408, 1282, 694, -439, -1050, -1038, -2068, 1909, 3054, -2131, -1020, -1001, -3149, 1364, 1560, -1507, 432, 612, -939, -877, 1432, 3889, 598, -538, 1103]
1045A103l459K386L261m943P62K445k744k06J238J212K87j200O86k538m76M786
1061B600k807k605L990k449j541K515q01J171J943j294j734m07L857O63l432K282
1077A951m45l496L172p78k274L610n63k864K52Q43J479n36M4M42k910K130P40
1094G97m375L283K738m687M55J351j347J525J798J92j706O78K511l328j7M889
1110D757l687j848K167l380Q6L612j757k322J169J965k410j022M954j285l699
1125b700M368j757m180N503J032m536R59K251j597j449L529J890l937K652J600
1140C628o055K935M386n310k90K372l058j558K792Q95k987Q42L621n375o87P300
1156C451l232l428N805j828l766L567J234k922J98L698j947m049N030Q93m485
$$ y = [1103, -2356, 30, 3291, -1652, -890, 1555, -1189, -1395, -157, 1055, 1342, 142, 828, -1710, -2186, 2600, -207, -2812, 1178, -1271, -2812, -297, -1098, 73, 2016, 722, -1012, -1419, 2438, 3101, -331, 1951, 1506, -1990, 1182, 404, -1870, 1740, 1177, -1687, -1435, -592, 887, 351, 395, 837, -2073, 57, 797, -3578, -295, 2443, -2244, -1789, -438, -1785, -260, 1538, 1730, 24, 702, 3213, -115, -132, 4757, 1070, -778, 1389, -1991, -1905, 1707, -50, -2372, -1203, 762, -1648, -2670, 2284, 999, -2700, 1668, -89, -4269, 1234, 2266, -2270, -1311, 940, -657, -2106, 1423, 3313, -624, 2028, 3628, -2427, 508, 4894, -416, -706, 1666, -1392, -2950, -158, 737, -2250, -1408, 2213, -3162, -3849, 3451, 219, -3209, 2596, 768, -2998, 569, 1803, -1119, -921, 2777, 830, -3219, 1811, 2704, -1781]
1171a781M601P37n668K862J497m015J000K812k098l400K480J859l925K463L352
1186B776o235Q29N124l747k00M318k026k711J303K214j703l49L348l028k441N007
1202B479j327k424M413j362k876J794L5j917J70K127j217l248L434M13m857L792
1218e71K504m432J675K194k745K7L089P74k553J69K108l496K11M548k961j140
1234e99K615k840m42K934m26j175l12O07j947q71L752j010l206L438r47l406L761
1251g4J203k186M40J516k61j758K215J950l036Q63J696l825Q98K142k389M64J168
1268A026j619l05M14P95q14N6J818k681o62L485k348r04L336j657j635J302k7
1285d20J09K70J254j51j992J728O44j815K056m75j870J475j528o09K272p49o59
$$ y = [-1781, 2820, 3557, -2111, 751, 2248, -1767, -767, 2045, -53, -3453, -973, 886, -3039, -576, 2776, -3459, -2630, 2494, -1253, -1453, 2865, 839, -1872, -569, 1645, -58, -407, 2941, -87, -2528, 2479, 1152, -1272, 3141, 1779, -1097, 697, 732, -1185, -1015, 1112, -105, -3353, 81, 494, -4363, -571, 1933, -2499, -824, 1370, -1375, -1348, 1741, 2515, -38, 131, 2239, -1257, -1046, 3502, 541, -599, 2016, -824, -1266, 1668, 1242, 67, -245, 362, -1585, -2456, 1296, 286, -2920, 518, -429, -3835, -74, 1129, -1057, -617, 899, 638, -1120, 1095, 3045, 9, 872, 2568, -1257, -359, 1783, -606, -142, 1026, -593, -898, -484, 311, -503, -447, 1371, -1310, -1972, 1513, -835, -1739, 1597, -60, -1695, -393, -420, -311, -41, 1213, 1062, -930, 798, 1442, -373, 1683, 1208, -662, 813, -715, -1324, 948, 199, -460]
1302d60r6l27M78o87J728N75k674J397O61k619J901J409j677K43k55j11R14j71
1320B29Q67m87o25J010j484P22J639k300N71R45k675J081J301j375j9M56M41r71
1338f74r27K312o00r53J941j009j060J490o70L21N10p91M65o07k36J121n00J022
1356A155o13j925J848p7j459J971k77j571N24J31J37KJ49J026k082q3K272j261
1374a33l2J492j833K07N72q18J268l48j02k51q63J099n38l10J993j757q04K263
1392A105j401r29J789j95n42k28M71K38j371J476Q93k225J315M19j888J370L77
1409F74m91N88r18k31J88l4R78j070l6Q41k037Q26K133j961K86J047j489R4Q65
1428B53P17m79j188J352m47j412K198j27j277Q93n00m01R71r62O11P5o88L42p46
$$ y = [-460, -556, -883, -405, -1092, 636, 1211, -1463, -66, 595, -2024, -123, 1286, -391, -148, -403, -514, 400, 229, 1096, 609, -16, 994, -490, 232, 1871, -429, 142, 1087, -1588, -507, 794, -581, -600, -144, 297, -674, -1601, 711, 111, -842, 1099, 90, -970, 520, -150, 171, 681, -110, 355, -252, -488, 633, 133, 1155, 542, -1383, 465, 388, -1071, 900, 623, -948, -424, -293, -156, -154, -5, 1021, -1061, -1144, 1128, -133, -165, 1327, -506, -299, 273, -545, 723, 375, 273, 22, -841, 258, -280, -590, 1403, -354, -1158, 1105, -296, -1225, 564, 369, -173, -401, 70, 308, -1063, 413, 1306, -919, 396, 815, -1073, 297, 674, 183, 771, -147, -378, -190, -224, 754, -316, -352, 489, -1548, -722, 1411, -550, -264, 783, -706, -612, 253, 970, 491, -697, 655, 208, -1204, 994, 867, -410, 483, -17, -418, 553, -409, 202, 277, -411, -69, -815]
1447h15M12O74j156J167K79j974J480K75r87P26L93m2k48p49J256m28n03J551
1465A311j248p13J062n85L28M75r08M74p89m24J403m38O8J08j151Q25j97k39J571
1484I33p91m80N86o01M89J03j0R78j338k73J533j295J89O37o10P7m76j30J106
1503F27r19R9N81j386M55O16r01R15l11k55J007j323M42R58o67O51k72l67R14
1522H64j135K27J167j399O16jq61M16P7M70K6j416Q22L51j390J211No04Q34j028
1542g48k7R43l63O68l93n28Q93j10R6L55j200R89L55j604J060L24q66K17m12K76
1562g5j31l86R63o67n85J591q57o94J017m11Q4L32q01O98k21r0M73o06R62J15
1582G11j180R39j67m39J431r24r31O16j19oJ4j28N72r42k37J052o97O79O15j500
$$ y = [-815, -403, 271, -885, 282, 561, -1413, 67, 342, -645, 81, 474, 432, 184, -565, 691, 263, -240, 1311, 63, -650, 412, -173, 155, 630, -278, 196, -593, -1017, 386, -52, 16, 124, -1027, -202, -399, -638, 933, 142, -338, 248, -353, 136, 239, 229, 1207, -131, -404, 1129, -166, 23, 660, 50, 127, -349, -479, 627, -292, -193, 388, -998, -543, 73, -828, 87, -224, -479, 528, -795, -353, 605, -62, 589, 317, -50, 864, -271, -44, 1123, -276, 340, 339, -522, -106, -29, 441, 467, -949, -127, 224, -1166, 45, 50, -554, 280, -748, -775, 168, -195, 473, 80, -448, 445, 335, 431, 786, -414, 575, 930, -674, 386, 710, -156, 61, -351, -75, -206, -592, 371, -296, -881, 710, -147, -841, 176, -235, -151, 181, -620, 78, -143, -233, 240, -366, 596, 711, -469, 470, 303, -136, 1295, 371, -560, 56, -63, -69, -55, -183, 389, -553, -790, 262, -435, 244, 859, -641]
1602f41N46J26j17O16n86j8M17n54J12J33j26R89r62l47J066q39L58M35j062K71
1622a83M44o61N08o58M96K88j124Q61jm41J220q40q4R16p45j7M78m32O0K6k31
1643a20K49p43P39M75j383J189J70j402Q66J06k18L94l09j27l39q8J252p82k44
1662c15R14r81j4J146p47J61O09q55j4j88O40j70j046J298m37j086J455k50j018
1681h98J407k04o76K66M94L2o01J89N23j116L90J003j678O17J012j297N79K64
1699C06l07J28k9J26j28n34P81p01l54J564j065o19J042n56k99R22k21J27m32
1718b49L58M44j072J190K13j406Q05j65p28J045q3m82J87j83J36p2r5P29r92J
1738d19R53j177L06P78j066L20L43k82K52k44N52k3o68J085l16q41J156l08n81
$$ y = [-641, -95, 31, -86, 530, -56, -74, 343, -211, -99, 34, -92, 897, -65, -412, 654, -185, 173, 608, -454, -183, 261, -400, 108, -550, -54, 234, -890, -29, -30, -471, 749, -91, -175, 741, -4, -21, 457, 25, 85, 111, -120, 129, -614, 125, 600, -783, 406, 576, -826, 40, 146, -72, 322, 13, -114, -453, -541, 711, -71, -315, 599, -382, -396, 750, 3, 164, 773, -82, -96, -284, 356, 186, -860, 438, 1, -1085, 370, 120, -898, 509, 305, -371, -105, 389, 421, -180, 9, 532, -584, -194, 809, -869, -252, 760, -537, 42, 306, -1, 127, 98, 224, 96, -438, 343, -358, -712, 852, -213, -832, 210, -346, -645, 277, 56, 183, -249, 109, 553, -519, 671, 884, -522, 283, 118, -610, 435, 352, -130, 57, -126, 10, -62, -157, 572, -420, -419, 534, -643, -337, 441, -625, -305, 38, -244, 8, -236, 316, 293, -375, 710, 394, -447, 709, 401, -180]
1757a80O18k31k19Kk69L98k23n9M71r61L86M21j015Q89M11j021M66K38m04L93
1777A11j30K08k74l04J121n62j99R61p88k91P69o18K84K1m42K22l45K03L05q28
1797e76M15M8o85P87m6j86N40o02L36J47j92L42m53j00O37o46J70O77q43M73J85
1818D28l19M80l32l95L01n59L08L35n24L09l23J2M58m62J3L82r10Q50J40o01Q89
1839D80j65m24K85k89K33K76n13K14j52k5O53m73j07M06q61L75M44p37O39j54
1859A05l18J99k72N26j4p76O98l93l17R47l51o9M78n62M65J1n70O55n28o6N03
1880C51n31K38J57n53N09j24n18O67j85j01K56m20M40o7m46O44n98j62P95o22
1900b70J09M28o40M75m8R2K31o03L46J26n21O53j61o56P67n75j75J055o82n3j
$$ y = [-180, 438, 207, -12, -10, -279, 119, -104, -163, 308, -653, -267, 154, -861, 28, 439, -582, -116, 122, -282, 111, -19, 189, -85, -389, 732, 170, -29, 932, 144, -147, 622, 4, 288, 309, -133, 89, -256, -53, 252, -576, -161, -113, -798, -11, -57, -243, 297, -305, 31, 178, -14, 328, -125, -225, 412, -234, -64, 613, -230, 243, 428, 109, 589, 257, -138, 163, -396, -88, 247, -277, 32, -291, -279, 179, -283, -270, 112, -798, 52, 192, -409, 480, 315, -109, 176, -113, 120, 396, -117, 97, -55, -80, 573, 100, -7, 399, -462, -87, 357, -380, 259, 105, -213, -14, -286, 240, 226, -550, 148, -245, -562, 385, 34, -35, 443, -119, 346, 357, -213, 442, -86, -152, 351, -180, 58, 215, -338, 171, 47, -471, 196, 11, -90, 166, -254, 186, 119, -327, 317, -281, -443, 352, -270, -161, 267, -373, 102, 54, 146, 377, -226, 120, 246, -275, 378, 217, -439, 328, -247, -422, 633, -49, -102, -103]
1921a03k39M51k48L73J66q73K94M24o37N28k0o02N32k30jJ00N4K27l91%M58k12
1943E1k28O49n57J0N65p13J89R0k23K88k39M54l48l78P68j35o48Q19l16o82N03
1964h1k41O9J97j22Q0K6j95N08m51M14N4p06N93R0n03N59m7m42L14j79K42J45
1986C24m97L13l97J81N80o13k8N17p12K03Rk62L38k43oJ67j70L65L0k52N89k14
2008B22m50N39l16Q3M40p11K15J88m43L97k78J24L52o60R7K16k12M45k52j77K19
2029C8l69Q1J26m22P05k13k22M69n12L70M46l85O3J01l52L57j18RL08n14j25K20
2051F1l30N96j40m03K45k66J98R2k78J69Pl66M93l38J12N35n51j1L36k33L69k11
2073H6J73K67m02k3J07l75K80N8j75Q7k98o2L69l53K97j41j10L1m6q0P23n51L5
$$ y = [-103, -342, 109, -139, 234, 400, -473, -179, 245, -392, 136, 116, -486, 46, -184, -185, -85, -31, 196, -195, -195, 263, 51, -177, 472, -85, -75, 490, -223, -34, 56, -167, 121, -118, 336, -12, -390, 378, 243, -405, 414, 98, -584, -81, -322, -253, -56, -178, -98, -72, -267, 241, -210, 204, 258, -448, 145, 235, -268, 291, 244, -198, 116, -63, 179, 324, -173, 140, -257, -76, 504, -109, -137, 380, -332, -129, -120, -382, -44, -287, -293, -126, -296, 69, 99, -153, 436, 222, -228, 311, -5, 78, 518, -193, 22, 210, -233, 164, -114, 10, 362, -298, -201, 15, -197, 248, -4, -181, 38, -331, -250, -124, -546, 159, -54, -276, 193, -319, 51, 497, 112, 175, 276, -76, 281, 163, 172, 480, -34, -159, 61, -269, 327, 187, -216, 29, -237, -39, 53, -225, -56, -49, -415, 78, -260, -148, 387, -164, -175, 161, -72, 297, 86, 259, 526, 124, 101, 208, -167, 113, 171, -4, 83, -215, -277, 92, -261, 36, -105, -215, -184, -230, -310, 413, -138, -103]
2096a03K95m90J53J99j0K61k88m1rj00M43K02o20K46j42o0L69m35J05K42m33K84
2118F8j61j3L39l61mJ56n99O94k0n24P05k46k66M72k32K96K1j91J13k36j78M03
2140B36k79K3K98m71N7J76j73K90j59m3L4k68L49j86l19M97p5l02N11j68l48N65
2162B45j85Lj95J52L02l89M57O9o59L49R9o35M65P8l70M53j93J6J7k1K96l81j00
2185a27L66o40%O58n83j53N47l31m8L70R2J31n38O45j17o65P08j02m96L96j62
2206d9m04M75q2P4P2J35L2m64M19L20q03M08J96j017N00L09n82K89K13k25j13
2227b97J27N83l29j34N99o67p1O91p59O0N69p15mJ79J27k5J57K55q5m01P04k63
2249C01n98Q73m32o86M84j01m21K90J23M8j82J86O00o57L31O02p69K95M6o99K99
$$ y = [-103, 192, -298, -145, 54, 44, 305, 17, -24, -33, -133, 310, 512, -108, 138, -4, -64, 305, -130, -25, 217, -216, 68, -93, -106, 233, -128, -132, 24, -575, 119, 99, -425, 280, 34, -232, 240, 8, 304, 325, 134, 247, 11, -167, 236, -43, -20, 278, -193, -136, 40, -133, 157, -2, -45, -11, -279, 70, -116, -435, 62, -13, -315, 196, 28, -320, 245, 60, 63, -132, 20, 322, -67, 390, 459, -200, 149, 248, -387, 78, 156, -214, 239, 46, 62, 79, 58, 354, -27, -127, 239, -401, -401, 257, -326, -479, 68, -263, -311, 59, 151, 282, -256, 389, 272, -393, 315, 213, -283, 113, -49, -453, 22, -60, 14, 86, 221, 253, -211, 208, 528, -275, 133, 329, -688, -188, 121, -461, -172, 41, -184, -297, -170, 413, 84, -50, 549, -118, -189, 502, -257, -197, 372, -343, -347, -168, -41, -66, 91, 346, 261, -140, 564, 301, -297, 576, 144, -542, -58, -159, -580, -290, -167, -119, -301, -115, 485, -172, 159, 761, -8, 287, 333, -366, -67]
2270f7J93j95k57J32J37j90J65Q83p89m9O60n99j44O60n36j84j20j76Q2k32N51
2291g5p1j84O88j30m23P50o4n65N92k54o52N10j22l7k41K97k2n18N53O22p65L14
2313B03O80r43J16J38k40j66N9j04m25o4P41k86j1P97o48o4Q22m24j39P08l58
2334C92n26m5L85l72l07O40l85m64Q12P1n59R56K49p58o3K67j63n34J07K98r49
2355i48L11M59n55O54P67q82N14L12m80J34L28k52n21J0L73o96j01Q83n40k77
2375e07P08k15m34R06%l84n3K13j82m81M27k19p57P22Pn43Q79L02n41M18M62p44
2397a6k2M66J42p86K63L00r98k6R60p13J26M80m28J39M66K24m17M0K15o82j14
2418c81M48n09j66P62n23k13P61n1k55N24K73l89m40P79l53n08Q51k95r12M82
$$ y = [-67, 126, -69, -326, -194, -57, -247, -82, 801, 12, -37, 623, 24, -120, 540, 4, -180, -300, -476, -394, -626, -75, -146, -330, 358, 228, -195, 555, 491, -74, 518, 264, -388, 122, 0, -37, -278, 19, -3, -521, 32, 654, -111, 203, 883, -60, 56, 194, -46, -212, -153, -257, -682, -746, -5, -291, -302, 495, -153, -217, 605, 181, 42, 750, 392, -134, -179, 206, -166, -473, 167, -218, -682, 130, 201, -358, 598, 847, 89, 26, 293, 130, -404, -297, 1, -948, -637, -178, -733, -79, 688, -194, 320, 632, 152, 286, 614, 362, -159, -149, 224, -472, -573, 310, -230, -507, 201, -14, -448, 458, 458, 74, 21, 234, 52, -429, -2, -221, -978, -256, -249, -792, 87, 389, -152, 266, 728, -16, -38, 428, 570, -216, 47, 347, -651, -677, 283, -430, -304, 176, -252, -113, 353, 577, 160, 200, 415, -267, -381, 67, -442, -608, 154, -369, -582, 179, 128, -127, 397, 670, 281, -159, 620, 267, -241, 610, 315, -597, -115]
2438a15J42o75N79N22n63j48M34Q7n03N53K41r44N7M91r66N36N30p26K25M57j51
2459F3l02N86M65o46j53Q50q17l37R06m28o29M18k94l63N46jr4J42L83l06k72
2480b83O53k30o27N38J80r30M74M52m17J3M01m6n19M91P03r24J92N64p70R9K68
2501B82m82J37R7l10j12J84L70l39J97K38o01o8Q59m30n79J033l86m74L33R2p4
2522c3K8M94k15o43P25R7p05P54%o08O7J7k72J51K53j94k81LK26k62L46M62o40
2545b30J23N01o58J07O48l02l42J30R3l79K41M32k28l02M92l83l24P27j28k25
2565gK13m01j86R9M59p0k15J78j36m55O06J64m89M26o2l47J1L46R7k99k9L41l93
2588a49O3M15k69kO2j97j33L10r3J39P6l86j7nJ51p6%L69m16l07N55q2j44K72
$$ y = [-115, 27, -648, -69, 453, -110, -258, 176, 263, -240, 313, 554, -390, -333, 158, -808, -272, 258, -468, -243, 214, 63, -239, 347, 812, 166, 13, 863, 46, -291, 615, 187, -442, -24, -318, -681, -135, -136, -230, -88, 295, -11, -283, 370, 140, -487, 51, 231, -699, -225, 227, -190, -177, 224, 178, -341, 150, 853, -71, 121, 685, -85, 14, 282, -200, -63, 34, -276, -388, -204, 166, -173, 24, 262, -339, -407, 452, 22, -557, 476, 90, -384, -51, 41, -33, -5, 489, 274, -369, 356, 453, -252, 502, 502, -106, -39, -22, -294, -143, 110, -84, -365, -362, -136, -398, -52, 410, -230, -107, 394, -264, -157, 491, 189, -153, -23, 70, -309, -68, 364, 136, -166, 326, -57, -381, 346, 218, -7, 206, -195, -381, -282, 177, 107, -108, 70, -66, -521, 85, 249, -240, 186, 124, -223, -212, 134, 231, -68, -97, 244, -149, -86, 329, 60, 58, 120, -77, -210, 100, 7, 146, 222, -164, -181, -186, -35, -111, -111, 258, -158, -465, 90, 8, -136, 136]
2612A36Kk03j11K49L5k4J01J44m87R3K1q1K28M8k54K36l28J11j6L3J68j39j04
2635a42L04l38J80L18l51k28K06r4R2J55L6j35k56J80m2m2K77k2m4J04k77m2L49
2658A88j37N8R8k59O1p3J28J30j56j15K04k90J10J15m5N9j65j62K26k59J55L53
2680B24l10J17L2j42J23J1L97l76k82K44L3j02L89k64k31N4j28L34L9j15o8J32
2702A11j46o6j8L33k22l11J98J34n49M28J00R0r5Q8K57l71J51K52k17j57L51l39
2724Bk5J26p7Q6J1k52j2J61Q0j38N4K53n60n9N98j30m06M62k13k38P2P5J29n9
2748f0K93l8k93K58J21k42L48nn12K57j52j44M26L3l59j91O4K75m61M22M44p45
2770b61R4L89m51J59M04m33q8P1J85j2j45N04l90j3L25k02k52O84l68k85L08j13
$$ y = [136, 138, -65, -176, 73, 108, 84, 185, 329, -158, -65, -44, -125, 103, 151, -103, 133, -195, -84, -100, -67, 101, -38, -142, 162, -176, 4, 322, -29, -257, -51, -145, -53, 102, 138, 3, -253, -73, -115, -157, 120, 98, 54, 158, -119, -161, 188, 51, 109, 207, -52, 9, -64, 64, 194, 38, -77, 127, -163, -53, 62, 17, 76, -89, -251, -25, -284, -129, 224, -86, 31, 63, -79, 44, 55, 452, 76, -206, 38, 71, -31, 358, 94, -137, -83, -211, 123, 162, 47, -21, 111, -35, -101, -119, 214, -8, -319, -121, 13, -536, -108, -8, 82, -13, 75, 332, -39, 112, 364, 147, -10, 341, 2, -23, 103, 26, 112, 123, -129, -141, 20, 100, -38, 16, 269, -291, -350, 248, 118, -288, 174, -39, -277, -205, -130, -1, -60, 233, 195, -98, 160, 281, 39, 387, 382, -130, 127, -25, -169, 257, 290, -69, -260, -196, 79, -382, 40, 484, -261, -167, 222, -229, -70, 334, -99, -187, -116, 69, 57, -88, 416, 26, 13, 338, 136, -116, 568, 200, -85, 223, 110]
2792A10l67K36K70k54m11O37j43p73Q10L59o42K35K11q30L20M09L6j60r5J81o39
2813e00L53O47n06K49K72p37M5O22k43k70K64j77m93K49M90n28k66O97m31l43
2833f06R30j41n93N26J35l98M9L40l06k18M28p5n09P15J35r39Q29J71n95R2K86
2854B56l01k90P05j30q47L67N25p82Q7J104r69j51N92k23k93P18L0m84j97M33
2874A50l37K6O76m55m18O55l10l57P24j5l55o8L86n11k16O48J61r08M81K95j076
2895h24P25M37o98J67L83k62l08P44J6m96M01l8o17K60P14p39J91M10n80k66O70
2916B90L8o64J98N55n98k11P92m10m77P33j94o86N44K91l29J44L23m52k50M80
2936A17lk33M68o7p97N29L07n48J69N99n40l80L27K68m36J62N63p57o4N79m08
$$ y = [110, -257, -21, 249, -5, -416, 221, 78, -695, 115, 474, -168, 67, 278, -552, -232, 177, 213, 53, -42, 139, -500, -147, 500, -6, 243, 515, -222, -177, 445, 202, -68, 196, 19, -474, -225, 265, -263, -529, 168, -263, -606, 324, 183, -410, 116, 251, -147, -98, 242, -64, -282, 146, 71, -438, 277, 412, -527, 302, 473, -122, -30, 256, -45, -335, 370, 240, -607, -240, 285, -497, -410, 694, -275, -426, 166, -57, -350, 368, 398, -86, -283, 150, -187, -161, 515, 60, -358, 297, -13, -370, 354, 339, -16, -84, 302, -209, -425, 223, 384, -524, -43, 252, -824, -99, 338, -360, -193, 190, -72, -380, 364, 380, -116, 285, 247, -370, -110, 604, -135, 56, 466, -114, -380, 290, 328, -336, -138, 417, -181, -392, 400, -10, -487, 246, 52, -634, -90, 201, -128, 16, 339, -113, -363, 117, 114, -119, 349, 282, -515, 14, 321, -227, -58, 541, 1, -379, -52, 216, -220, -58, 505, -252, -316, 263, -145]
2957a45l9O27m97k64K82pq4K41R7k09j60M34m07k33P52k78n46P20j66n23M38K98
2979C31j88m22N25k58l19M22L99n27M4J46o35N48K15k10l0P6k82l24N67K29n49
3000b42K96K00o66J79O39m14k55P06l36l17K11N04n46j18M71k84o10O14N0l12
3020b30K29J65n07K16M22n12JM01k84l43M51L73n81J45N58q38K84L78l63j01O84
3041E48k89m53J38K23k96J27M65o05r2M21k59j05O32l54l76L03Q3m09K01L11m75
3062b61k59N40o8l72O46k5m78M01J83m00O0L02j4j75Q0K8m05K30M78p46K00M45
3084C90o99N8L31j42j38M26j57m45kP17n01j89O60l85k30L82K68l51J77j24J11
3105A57k97M23j46l93O53m33l98N27j14j62L92j70k86k5L53J03m85M51N0m97O5
$$ y = [-145, -184, 443, -54, -318, -36, -43, -127, 114, 211, 2, -158, 276, -131, -364, 388, 110, -436, 284, 118, -405, 33, 331, 143, -279, 246, -12, -331, 91, 490, -37, 7, 153, -482, 66, 281, 71, 41, 117, -165, -489, 78, 307, -242, 54, 254, -412, -233, 406, -8, -263, 443, 107, -210, 1, 505, -41, -159, 312, 28, -582, 32, 82, -230, -1, 164, -343, -127, 295, -217, -216, 185, -99, -442, 9, 382, -199, -54, 504, -334, -50, 328, -35, -136, 548, 259, -194, -56, 167, -129, -2, 463, -142, -234, 187, -72, -177, 455, 101, -275, 28, 111, -298, -97, 214, -261, -520, 20, -48, -420, 226, 201, -277, 124, 307, -93, -33, 269, 255, 80, 160, 188, -217, 13, 491, -255, -55, 390, -309, -251, 80, -62, -200, 226, 69, -376, -378, 339, -162, -351, 309, -76, -306, 76, 344, -7, 170, 46, 157, -140, 283, 137, -256, 397, -36, -434, 93, -21, -183, 209, 39, -247, -272, 81, 184, -301, 150, 200, -297, -232]
3126b32K80j53k1M01k65j80K32j58M4K29J21k71J0J37q0j25L60j80l67L68k06
3147e6j17K76j36j29j53L42j48l17N66R2m04R0J95j45J71J48n9j90J36p8j76L1
3169f1K73k08P8j30j86J97J78j22o0J97l57J23L0o0P1l03M06k95j42N15nj10J24
3192A53l33J28K11j34J52Rj21j60R6j87K36J1k5l8k22L21k3k49J57N7P0l42n1
3215b84K59k8j93L95k46J49r5N4J69k09Q3J22j26k1Q8R9q5j10j70J77mN4J91l10
3239d1l4J38j63J16o4r8L51k18j32J35j18j4J11PJ94k40N5L5lJ64q4k24m1L57
3263A89j36J23r2K5l3j84L9M2J43O8l27P6J04k99L21P2k15j75K59l9J06k98L42
3286A11k10j12K66r5k1J03J58k18p6l8K37q6Q1J86p7k47Q7r4J70K07m59K40r9
$$ y = [-232, 48, -105, -126, 275, 10, -170, 62, -96, -52, 177, 298, 27, 37, 174, 94, -31, 329, 149, -218, 150, -56, -173, 103, -33, -162, -315, 27, -121, -438, 128, 220, -184, -94, 101, -44, 127, 275, 216, 26, 162, 84, -92, -61, 212, 4, 82, -48, -234, -37, 141, 19, -41, 156, -201, -78, -48, -108, -37, -340, 66, -229, -371, 144, 139, 29, 153, -180, -52, 159, 25, 177, 186, 65, -95, 1, -186, 50, 61, 36, -2, -224, 97, 74, -175, -18, 39, 109, -233, -284, -25, -53, -246, 149, -97, 52, -43, 11, 180, -29, 54, 176, 50, 29, 117, 216, 131, 21, -149, 28, 24, 78, 269, -41, -75, 63, -100, 16, -48, -146, 205, -13, -145, -10, -128, -142, -31, -24, 170, -70, -15, 20, 17, 181, 97, -127, -168, 189, 53, 176, 84, 109, 76, -108, -69, -27, 116, 184, -143, -67, 37, -262, 59, 131, -84, -259, 0, -39, 67, -231, 111, -99, -211, 55, -40, -61, 42, 200, -18, -94, -132, 105, 19, 100, 286, 209, -38, 49, -45, 125, 332, -127, 113, 14]
3309A4l84K65J94n4m5j15Kj97K09K51j35j63K20l00J77O0r9J54q0N9m2q8K29J01
3333B33jl1j46k87N10L8m40L40K0l64MJ44Q7l17J51K66l92j19M29k49J79Q7k83
3356a41J28N1pJ5OJ20j30j96K29j58Q7L48k42l2J0k2k88L45R1l99q9L69j49k13
3380b67M09o3l22L65J3l33J01K31k30K04o4j01j42L34J11l27J24K99m65J18L82
3401C77m34j6K24r8l54M38%l96K26K20n15j24N99p4q3L28l62j85L90N4k6j56K68
3424C01m29j35L23J69k55K99n5m73R4K61k20J96Oj79k29K27Q7l92K60K41j60k83
3446c46K72j43k3M77j59j55Q5J51j17K0K36k14n0K96m24j34O10k74l94L86l6k48
$$ y = [14, -370, -105, 89, 35, -10, -125, -123, -320, -111, 140, 5, -158, 62, -238, -61, -1, -100, 54, -26, 33, -9, -97, 132, 233, 232, 201, 55, -232, 278, 316, -124, 216, 236, -128, -124, 20, 107, -210, -59, 207, -185, -304, 125, -124, 55, 142, -141, -13, 38, 31, 46, 52, 172, 42, -154, 75, -83, 4, 352, 110, 78, 88, 66, -222, 123, 214, -185, -274, 95, -54, -267, 142, 79, -243, 122, 135, -198, -97, 134, -96, 108, 44, -57, -199, 135, 246, -81, 43, 342, -123, -5, 377, -57, -73, 151, 53, -301, 137, 137, -259, -33, 187, -328, -452, 147, 73, -10, 318, -44, -229, 161, 215, 189, 33, 301, -128, -263, 60, 229, -26, 273, 218, -255, -161, 100, -120, 76, 82, -97, -326, -99, -12, -404, -144, 97, -63, -346, -74, -217, -240, 237, 78, -77, 8, 159, 42, 62, 298, 84, 34, 330, -94, -228, 382, 108, -286, 100, 64, -184]
$$ [...]
8191a00
##END NTUPLES=NMR FID
##END=
