##TITLE=1H_Pr 5154-20m
 CDCl3
 8 sc, 
 18.11.2022
##JCAMPDX= 6.0         $$ Bruker NMR JCAMP-DX V2.0
##DATA TYPE= NMR FID
##DATA CLASS= NTUPLES
##ORIGIN= UXNMR, Bruker Analytische Messtechnik GmbH
##OWNER= root
$$ XWIN-NMR		Version 3.5
$$ Fri Nov 18 12:32:20 2022 Russian Standard Time (UT+4h)  she@DPX200
##.OBSERVE FREQUENCY= 200.1313499994
##.OBSERVE NUCLEUS= ^1H
##.DELAY= (6, 6)
##.ACQUISITION MODE= SIMULTANEOUS
##.ACQUISITION SCHEME= undefined
##.AVERAGES= 8
##.DIGITISER RES= 18
##SPECTROMETER/DATA SYSTEM= spect
##.PULSE SEQUENCE= zg30
##.SOLVENT NAME= CDCl3
##.SHIFT REFERENCE= (INTERNAL, CDCl3, 0, 15.7039)
##AUDIT TRAIL= $$ (NUMBER, WHEN, WHO, WHERE, WHAT)
$$ ##TITLE= Audit trail, XWIN-NMR		Version 3.5
$$ ##JCAMPDX= 5.01
$$ ##ORIGIN= Bruker BioSpin GmbH
$$ ##OWNER= she
$$ F:/spectra/data/she/nmr/H-F/1/audita.txt
$$ ##AUDIT TRAIL=  $$ (NUMBER, WHEN, WHO, WHERE, WHAT)
(   1,<2022-11-18 12:31:17.89 +0400>,<she>,<DPX200>,
      <created by zg, POWCHK disabled, PULCHK disabled
       configuration hash MD5:
       00 E9 B6 7A A2 85 ED C7 34 08 36 98 17 FE 4E 26
       data hash MD5: 16K
       46 AA 9B D3 A1 C9 A4 26 C2 96 F5 68 35 17 3C 9F>)
$$ ##END=
$$ 
$$ hash MD5
$$ F2 9C 3A 3E 0D DE 25 18 B9 E9 F9 2D 10 44 8E F5
##$RELAX= 
##$RELAX= 
##$RELAX= 
##$RELAX= 
##$RELAX= 
##$RELAX= 
$$ Bruker specific parameters
$$ --------------------------
##$DU= <F:/spectra>
##$EXPNO= 1
##$NAME= <H-F>
##$PROCNO= 1
##$TYPE= <nmr>
##$USER= <she>
##$AMP= (0..31)
100 100 100 100 100 100 100 100 100 100 100 100 100 100 100 100 100 100 
100 100 100 100 100 100 100 100 100 100 100 100 100 100 
##$AQSEQ= 0
##$AQ_mod= 1
##$AUNM= <au_zg>
##$AUTOPOS= <>
##$BF1= 200.13
##$BF2= 200.13
##$BF3= 200.13
##$BF4= 200.13
##$BF5= 200.13
##$BF6= 200.13
##$BF7= 200.13
##$BF8= 200.13
##$BYTORDA= 1
##$CFDGTYP= 0
##$CFRGTYP= 5
##$CHEMSTR= <none>
##$CNST= (0..31)
1 1 145 1 1 1 1 1 1 1 1 1 1 1 1 1 1 1 1 1 1 1 1 1 1 1 1 1 1 1 1 1 
##$CPDPRG= <>
##$CPDPRG1= <>
##$CPDPRG2= <>
##$CPDPRG3= <>
##$CPDPRG4= <mlev>
##$CPDPRG5= <mlev>
##$CPDPRG6= <mlev>
##$CPDPRG7= <mlev>
##$CPDPRG8= <mlev>
##$CPDPRGB= <>
##$CPDPRGT= <>
##$D= (0..31)
0 1.2 0 0 0 0 0 0 0 0.06 0 0.03 0 0 0 0 0.0002 0 0 0 0 0 0 0 0 0 0 0 0 
0 0 0 
##$DATE= 1668760277
##$DBL= (0..7)
120 120 120 120 120 120 120 120 
##$DBP= (0..7)
150 150 150 150 150 150 150 150 
##$DBP07= 0
##$DBPNAM0= <>
##$DBPNAM1= <>
##$DBPNAM2= <>
##$DBPNAM3= <>
##$DBPNAM4= <>
##$DBPNAM5= <>
##$DBPNAM6= <>
##$DBPNAM7= <>
##$DBPOAL= (0..7)
0.5 0.5 0.5 0.5 0.5 0.5 0.5 0.5 
##$DBPOFFS= (0..7)
0 0 0 0 0 0 0 0 
##$DE= 6
##$DECBNUC= <off>
##$DECIM= 32
##$DECNUC= <off>
##$DECSTAT= 4
##$DIGMOD= 1
##$DIGTYP= 9
##$DL= (0..7)
0 120 120 120 120 120 120 120 
##$DP= (0..7)
150 150 150 150 150 150 150 150 
##$DP07= 0
##$DPNAME0= <>
##$DPNAME1= <>
##$DPNAME2= <>
##$DPNAME3= <>
##$DPNAME4= <>
##$DPNAME5= <>
##$DPNAME6= <>
##$DPNAME7= <>
##$DPOAL= (0..7)
0.5 0.5 0.5 0.5 0.5 0.5 0.5 0.5 
##$DPOFFS= (0..7)
0 0 0 0 0 0 0 0 
##$DQDMODE= 0
##$DR= 18
##$DS= 0
##$DSLIST= <SSSSSSSSSSSSSSS>
$$ [...]
##$SUBNAM2= <"">
##$SUBNAM3= <"">
##$SUBNAM4= <"">
##$SUBNAM5= <"">
##$SUBNAM6= <"">
##$SUBNAM7= <"">
##$SUBNAM8= <"">
##$SUBNAM9= <"">
##$SW= 18.0517283424941
##$SWIBOX= (0..15)
0 0 2 0 0 0 0 0 0 0 0 0 0 0 0 0 
##$SW_h= 3612.71676300578
##$TD= 16384
##$TD0= 1
##$TE= 0
##$TE2= 300
##$TE3= 300
##$TEG= 300
##$TL= (0..7)
0 120 120 120 120 120 120 120 
##$TP= (0..7)
150 150 150 150 150 150 150 150 
##$TP07= 0
##$TPNAME0= <>
##$TPNAME1= <>
##$TPNAME2= <>
##$TPNAME3= <>
##$TPNAME4= <>
##$TPNAME5= <>
##$TPNAME6= <>
##$TPNAME7= <>
##$TPOAL= (0..7)
0.5 0.5 0.5 0.5 0.5 0.5 0.5 0.5 
##$TPOFFS= (0..7)
0 0 0 0 0 0 0 0 
##$TUNHIN= 0
##$TUNHOUT= 0
##$TUNXOUT= 0
##$USERA1= <user>
##$USERA2= <user>
##$USERA3= <user>
##$USERA4= <user>
##$USERA5= <user>
##$V9= 5
##$VALIST= <valist>
##$VCLIST= <CCCCCCCCCCCCCCC>
##$VD= 0
##$VDLIST= <DDDDDDDDDDDDDDD>
##$VPLIST= <PPPPPPPPPPPPPPP>
##$VTLIST= <TTTTTTTTTTTTTTT>
##$WBST= 1024
##$WBSW= 4
##$XGAIN= (0..3)
0 0 0 0 
##$XL= 0
##$YL= 0
##$YMAX_a= 206713
##$YMIN_a= -409177
##$ZGOPTNS= <>
##$ZL1= 120
##$ZL2= 120
##$ZL3= 120
##$ZL4= 120
##$ABSF1= 10
##$ABSF2= 0
##$ABSG= 5
##$ABSL= 3
##$ALPHA= 0
##$AQORDER= 0
##$ASSFAC= 0
##$ASSFACI= 0
##$ASSFACX= 0
##$ASSWID= 0
##$AUNMP= <proc_1d>
##$AZFE= 0.1
##$AZFW= 0.1
##$BCFW= 1
##$BC_mod= 2
##$BYTORDP= 1
##$COROFFS= 0
##$CY= 11.3945322036743
##$DATMOD= 1
##$DC= 2
##$DFILT= <>
##$DTYPP= 0
##$F1P= 2.36226072786647
##$F2P= -0.459571619588291
##$FCOR= 0.5
##$FTSIZE= 0
##$FT_mod= 4
##$GAMMA= 1
##$GB= 0.15
##$INTBC= 1
##$INTSCL= 1
##$ISEN= 128
##$LB= 0.24
##$LEV0= 0
##$LPBIN= 0
##$MAXI= 10000
##$MC2= 0
##$MEAN= 0
##$ME_mod= 0
##$MI= 1.114404
##$NCOEF= 0
##$NC_proc= 0
##$NLEV= 6
##$NOISF1= 3.799351
##$NOISF2= 2.8
##$NSP= 1
##$NTH_PI= 0
##$NZP= 0
##$OFFSET= 15.70392
##$PC= 1
##$PHC0= -18023.6
##$PHC1= 1.600698
##$PH_mod= 1
##$PKNL= yes
##$PPARMOD= 0
##$PSCAL= 0
##$PSIGN= 0
##$REVERSE= no
##$SF= 200.130013532006
##$SI= 16384
##$SIGF1= 3
##$SIGF2= 2
##$SINO= 400
##$SIOLD= 16384
##$SREGLST= <1H.CDCl3>
##$SSB= 0
##$STSI= 0
##$STSR= 0
##$SW_p= 3612.71676300578
##$SYMM= 0
##$S_DEV= 0
##$TDeff= 0
##$TDoff= 0
##$TI= <>
##$TILT= no
##$TM1= 0
##$TM2= 0
##$TOPLEV= 0
##$USERP1= <user>
##$USERP2= <user>
##$USERP3= <user>
##$USERP4= <user>
##$USERP5= <user>
##$WDW= 1
##$XDIM= 8192
##$YMAX_p= 0
##$YMIN_p= 0
$$ End of Bruker specific parameters
$$ ---------------------------------
##NTUPLES= NMR FID
##VAR_NAME=  TIME,          FID/REAL,        FID/IMAG
##SYMBOL=    X,             R,               I
##VAR_TYPE=  INDEPENDENT,   DEPENDENT,       DEPENDENT
##VAR_FORM=  AFFN,          ASDF,            ASDF
##VAR_DIM=   8192,          8192,            8192
##UNITS=     SECONDS,       ARBITRARY UNITS, ARBITRARY UNITS
##FACTOR=    0.0002768,     1,               1
##FIRST=     0,             0,               0
##LAST=      2.2672688,     0,               0
##MIN=       0,             -409177,         0
##MAX=       2.2672688,     206713,          0
$$ Real data points
##PAGE= N=1
##DATA TABLE= (X++(R..R)), XYDATA
$$ [...]
1781B45p4m13K22j70K65J7j20R4r4K9K2J97j78k59J42m0j5R7J54M1j08N3L8p8
1805F7Ql9j02K42J24m15M12k85l4L07q8k34r2J60j15O0q3L99m69K99l39J20J43
1828D6K07l17J90r1k03K14J16l14J24J75J18m11J81k9j24K09M8o1j1P8r3m4O6
1851G4K69l52L08l66j01N9J15j3J70k27Q4l26K41J05k8j78J60P0K16k0m85J50
1873g5J02K9j02O1k48L86j31q2j51K27l1om4J57J27l9l83K71K7j26J80j3m5q4
1897GJ32P4n33L45l7K88j72j63j80p9J31M8K69l03K03J03k66O1m0K02k03J8M01
1920C06l84J54o4p6j59K62k24L59j77K26k87o9P2j49M17k57O8J00O5k56K18lr3
1943D9J19j55j34J70o6J08j15M0jK6M0q4K5Q0K1j52K11k09j49J01L5K5J41j75
$$ plain form
1781 245 171 -242 -20 -190 75 92 -28 66 -28 1 23 220 42 -217 -75 -115 -130 -33 121 162 54 107 145 67
1805 67 75 36 -66 176 300 -115 297 12 -22 285 197 -37 -129 31 -84 -24 -107 292 -177 122 -217 -97 46
1828 46 253 -64 126 35 -168 46 162 -152 -28 147 265 -146 35 6 -118 91 139 78 67 145 52 8 74
1851 74 343 -9 299 -67 -168 -109 6 -7 163 -64 20 -306 -65 40 12 -166 -6 64 280 260 -225 -75
1873 -75 27 56 -46 15 -233 153 22 -60 -211 16 -15 -21 -65 92 219 180 -203 68 95 -31 149 136 91 7
1897 7 139 213 -320 25 -12 276 104 -59 -239 -318 -187 -139 130 -173 30 133 -133 -72 -112 90 -113 -95 306
1920 306 -78 76 12 -64 -223 39 -185 174 -3 223 -64 -133 -61 -210 207 -50 18 118 183 -73 145 142 49
1943 49 168 13 -121 49 -17 91 -24 16 15 41 81 -3 22 102 123 -29 182 -27 -176 -75 -40 -15 126 -49
1967d9O9j59K00j32JK15R2k03j15JJ2q5P0K5R1J13k1j31L8P7j20R0J26j66j53
1992a14l5R0k9j27M25l99K4l9J38K13k9pr8m2K31m12M31k10O4Q7j93J97k74J78
2016G0l7K5N6N7p0M9k26L09j73k02O5N3J7J37n1k15J10J18j46m3M1j3J24k0J98
2041B33j37K09j39k96K21Rj97Q1JP9q2K8L38n66M39j76J31k01J62k56J40l9j2
2064c0O5k16J19j48M6L31l04L9K15m6P8k50k0j73K37JL20j27l99L09L9k68M07
2087B25j18L0j6p3J85l38P7K9r2pR7J1j47L72l87O3K8j16K9J87M2j4k03o9K25
2112B0k85K49j9j31oQ9J47J87J7j94k15J91nj48K00k36K19j93j76R2P5K46J2m2
2136I4k84K64P0k12J82k86n5K93j08k5j75k3L38R1j85q8O4j19L61k27J96j47j27
$$ plain form
1967 -49 20 -139 61 -71 -70 145 237 34 -81 -80 -68 -153 -83 -58 33 146 125 -6 32 109 -11 79 205 39 -114
1992 -114 -149 -59 -88 -215 210 -189 -165 -204 -66 147 118 111 13 -29 202 -210 221 11 75 162 -31 166 -108 70
2016 70 33 58 114 171 101 150 -76 233 60 -142 -77 -24 -7 130 79 -136 -26 92 -54 -97 -56 -69 55 35 233
2041 233 96 305 166 -130 91 100 -97 -16 -15 64 -18 10 348 -218 221 45 176 -25 137 -119 21 -18 -30
2064 -30 35 -181 -62 -210 -164 167 -137 -98 117 71 149 -101 -121 -294 -57 -56 264 137 -262 47 86 -182 225
2087 225 107 137 121 48 233 -105 -28 1 -91 -98 -1 10 -137 235 -152 -89 -61 -177 -148 39 81 67 -136 -205 20
2112 20 -265 -16 -35 -166 -172 -83 64 251 268 74 -141 50 45 -103 97 -139 80 -113 -289 -197 -122 124 136 94
2136 94 -190 74 144 -68 114 -172 -227 66 -42 -67 -242 -265 73 164 -21 -109 -45 -164 197 -30 166 19 -108
2159a08J67n1m7J84k17JJ3J05r5J6L20l08O5%k04L02j51k85R5J49k02j1L33j5
2183E6k82J66P4k2j86L33j74%Q3j23%p7p6K02K5k6J00Mj69J31N0j75J13o5j08
2208a46N8K04j33l6r0M3K59J1m19J21J83Ok5N0l00j7K34l50J63J82K7j54J2Q2
2232c5K15j88k01N01j11J56l00j10p1J7J82j93K59k08J13J18j05K69m30j10L03
2253G1p9j10J31j62n5J27N4k23K8K29J43l68J12O3K2j81J68k5p7J87J9j56O9J61
2277A48j11q4n4R5j3q2K07p8j00J39j12K2J40k82K11k80J82K99j49q5j18O6K06
2300A67j71K92l04J15n7n5J03j56Q9Q2j7k10j67J08j82L83j8M3j28J55o1J2k10
2323a87L6K75j10M1q8J09o6j30n3K43O3k69J97k9j68J29J49k3l90J97K09j38J63
$$ plain form
2159 -108 59 8 -39 145 -72 -71 -58 47 -48 -32 288 -20 45 45 -159 143 -8 -293 -198 -49 -251 -262 71 56
2183 56 -226 -60 14 -8 -194 139 -35 -35 48 -75 -75 -152 -228 -26 -1 -27 73 77 -92 39 89 -86 27 -38 -146
2208 -146 -88 116 -17 -53 -143 -100 159 170 -249 -128 55 61 36 86 -214 -231 3 -347 -184 -2 25 -129 -117 -35
2232 -35 180 -8 -209 292 181 337 37 -73 -144 -127 55 -138 121 -87 26 144 39 308 -122 -232 71
2253 71 -8 -118 13 -149 -204 -77 -23 -246 -218 11 154 -214 -102 -39 -17 -198 -30 -55 -132 55 74 -82 -13 148
2277 148 37 -47 -101 -6 -19 -101 106 28 -72 67 -45 -23 117 -165 46 -234 -52 247 98 13 -105 -39 167
2300 167 -4 288 -16 99 42 -13 90 -66 23 105 88 -122 -289 -181 -363 20 2 45 -83 72 11 23 -187
2323 -187 -151 124 14 55 -33 76 10 -120 -173 70 133 -136 61 32 -136 -7 142 119 -271 -74 135 -3 160
2346A60j60J79k9k47MJ65j72J83l7kj37K02m9L2j75rJ5q9L0j5J57j23J01P4J43
2371B01l21J45j01j30J94j90K99j68j1K51j35NK18m27K04J49j86P1j7K29l14k36
2393b70K00J16k27J70j70J01k6J37J24j52J32k42QK92r0j49j64K47j44j17M68
2414B44k11J66j58P6O9l22K83o9l27K31j25J63p5J54j63l7o8J95J65M1j58l46
2436b72M36p4J56l32L11k97k3J74j6k95J51L07l47J63K30o12J36J90j01K07l29
2457b37K00J04K16k86k6o6O8o0j10J27L85l14J41R7m09J98P2m1J74M8n26K23J52
2480A30j79p0J61k49R7L1J2J01K41k97J08l02J95N3k13L17l54M86l23L37n78K35
2502f1J33l9k9lq8J25kj74K82K1j98q1K90l42P2J21m4j07Q9R7p0k57L46k56M6
$$ plain form
2346 160 0 179 150 -97 -93 72 -100 83 46 44 -93 109 60 92 -83 -92 -77 -166 -136 -151 6 -117 -16 58 201
2371 201 -120 25 -76 -206 -12 -202 97 -71 -82 169 34 39 257 -170 34 183 -3 68 51 280 -34 -270
2393 -270 -70 46 -181 -11 -181 -80 -106 31 155 3 135 -107 -99 193 103 -46 -210 37 -107 -224 244
2414 244 33 199 41 117 186 -136 147 78 -249 -18 -143 20 -55 99 -64 -101 -169 26 191 232 74 -272
2436 -272 164 90 246 -86 225 -72 -95 79 63 -232 -81 226 -121 42 272 -340 -204 -14 -115 92 -237
2457 -237 -37 67 283 -3 -29 -95 -27 -87 -197 -70 315 1 142 239 -170 28 100 59 233 281 -245 -22 130
2480 130 -49 -119 42 -207 -110 -79 -67 34 275 -22 86 -216 -21 32 -181 136 -218 268 -55 282 -296 -61
2502 -61 72 33 4 1 -87 38 36 -138 144 165 -33 -114 176 -166 -94 27 -17 -124 -35 62 -8 -265 81 -175 -129
2527a29K73j62L6J4J74n8j40j14L5N7K03M8m04K18j7k24K42j41K29q3Ol87M4K45
2551c5qK89l88O5O3K32q4j95Qj4L73j99Kk33J53j43j0J06r7jJ56N6m4k14J30n9
2577i1O2K37m38K07n0K45m4j27m5J43j46R5K21m23K24R2k70K20k44K47j65L5l1
2600d6j95J77J09J75J42l48J01j07r7J45Q0L4l01J58j56J08j66M00K8j04o5k34
2622a62P4j27J87M5P3j54l46M60j59K72k27J64M4K3Q7k76j10K08k11o3K69k01
2644a30J81j1R7l22J92M1L6j90J73j49m2l2J93n7j56L32o8k55J21j41J78q4J05
2667A2p8j13K37j97J39k2j68L14j36N0Q7j72J38j67J33o3N9j54J83j29j8p6L14
2690A73l08k5P8K45j86o3J73j06J73k62j1J26M7L8l30J32%J85J57j19k29J35L5
$$ plain form
2527 -129 144 -18 18 32 206 148 8 -106 -71 -14 189 237 -167 51 34 -190 52 -89 140 57 63 -324 -280 -35
2551 -35 -43 246 -142 -77 -14 218 134 -61 -53 -67 306 107 109 -124 29 -114 -124 -18 -115 -116 40 96 52 -162 -32 -91
2577 -91 -29 208 -230 -23 -73 172 128 1 -44 99 -47 48 269 -154 70 162 -108 112 -132 115 -50 -15 -46
2600 -46 -241 -64 45 220 362 14 115 8 -89 56 136 170 -131 27 -129 -21 -187 213 241 137 72 -162
2622 -162 -88 -215 -28 17 90 -64 -410 50 -109 163 -64 100 144 167 254 -22 -132 76 -135 -198 71 -130
2644 -130 51 40 137 -185 7 48 84 -106 67 -82 -124 -156 37 -20 -176 156 88 -167 -46 -187 -9 -93 12
2667 12 -66 -179 58 -139 0 -22 -190 124 -12 38 125 -47 91 -76 57 -6 53 -101 82 -47 -65 -141 173
2690 173 -135 -160 -82 163 -23 -86 87 -19 154 -108 -119 7 54 92 -238 -106 -106 79 236 117 -112 23 58
2713E8R3k4k95K02K7j33J97l29N38j79M4k90K47k27O4l5N3n6q6n6L54k08P9j70
2737a32O5J39J77m01J06J59pj56j26L91k10Qo4nk03L24k22J36J35k01J1J62Pk5
2761F8N3J84k55j90K45l54J35j19K69j22L2J39k54m3M0K77L7j28j58J42j02K77
2783A73Jm03K29K03r9j51q6J41j2j70J58m6J22O1j67l5J27J6k88N77l98K04k17
2806f0j19M13j41nN9j47K97j73o9k48L77p3j87J26J00k02J2P3O5O2oq3j48O3k00
2831b14K02J77k3k57q8qL57j1k78K29j49j75L53k75K49o8J84m3K3k62j14L61j38
2854C2J52q7j31R6j12J17Kk07N5J12m7J47r9O2j21l6L51l10o2K63j84K12k26q1
2878a02K08J12k90n3l3J03K49j90m3j36J32K33j82J61j36k82K36J22M9k27j3J74
$$ plain form
2713 58 151 127 -168 34 61 -72 125 -204 334 155 199 -91 156 -71 -7 -42 11 -45 -131 -187 167 -41 38 -132
2737 -132 -67 72 249 -152 -46 113 106 -50 -176 215 5 13 -51 -56 -259 65 -157 -21 114 -87 -76 86 93 68
2761 68 121 305 50 -140 105 -249 -114 -233 36 -86 -54 85 -169 -212 -172 105 142 14 -144 -2 -104 173
2783 173 174 -229 0 203 104 -47 -133 8 -4 -174 -16 -62 60 121 -46 -81 46 62 -226 351 -47 157 -60
2806 -60 -179 234 93 88 147 0 297 124 55 -193 184 111 -76 50 150 -52 -40 33 98 160 154 71 -77 -14 -214
2831 -214 -12 165 142 -115 -203 -211 146 135 -143 86 -63 -238 115 -160 89 21 205 162 185 -77 -191 170 32
2854 32 184 97 -34 62 -50 67 69 -138 -83 29 -18 129 30 92 -29 -65 286 -24 -86 177 -7 205 -21 -102
2878 -102 106 218 -72 -125 -158 -55 194 4 -39 -175 -43 190 8 169 33 -249 -13 109 158 -69 -82 92
2900I2J46k70J24K78n41K13j27K64P5k09k05j89M60P4k22J10j0k46K63j62J56
2921G4m3l62L47J44l91K22j16J94j32m5N9J4N4n0K02l65K87jJ65j05k19N7K7k17
2945b00L08k24j11K91l08O1N29m51J14M0j4K26k01M0j46J22J05M3m22J31j60P1
2967a56N1K81m15J50R8j21K02l49M26j28J4k18K47L4j84mL95n43M08J11m20Q9
2989c2M8Q4R1k69M8O6r5K03K60l85k2j75nP1Nj25M60k04K1k18L30J16j38j07L9
3014F7j07J04j10l0l0J77kk33J84j02K91j34k73J42R1J73j13k28o7J82r2J75j46
3037h1J33Lj5J0Kj68M6K66l85L60n3j79P8O9j35J79k03J39k5j26J74k92J76o1
3061h8N3N8j85K45j32K07k65N8K04k82K45j9j17M3Q6j74J74l92K76K56l36J34
$$ plain form
2900 92 238 -32 92 370 -171 42 -85 179 254 45 -160 -349 111 185 -37 73 63 -183 80 -82 74
2921 74 31 -331 16 160 -231 -9 -125 69 -63 -108 -49 -35 19 -31 171 -194 93 92 257 152 -67 -10 17 -200
2945 -200 108 -116 -227 64 -244 -183 346 -105 9 49 35 261 60 100 -46 76 181 224 -198 -67 -227 -156
2967 -156 -105 176 -239 -89 9 -112 90 -259 167 39 53 -165 82 116 -68 -72 323 -220 188 299 -121 -32
2989 -32 16 100 191 -78 -30 36 -59 144 404 19 -3 -178 -183 -112 -107 -232 228 24 45 -173 157 273 135 28 67
3014 67 -40 64 -46 -76 -106 71 69 -164 20 -82 209 75 -198 -56 35 208 95 -133 -200 -18 -110 65 -81
3037 -81 52 55 40 50 52 -116 -70 196 -189 171 118 -61 17 86 -49 130 -73 66 41 -85 89 -203 -27 -88
3061 -88 -35 23 -162 83 -49 158 -107 -49 155 -127 118 99 -18 25 111 -63 111 -281 -5 251 -85 49
3083D9O1j16J07j24q2K43l8j46P8M4j52J10J00k43K61k49J64k25K77j00k0j8L2
3106A3J62k36L27l27j43J04R2p3j92L67k55J12o6M02r1j25k8j63j15J00K19k26
3128a42J12K5j85K13r0n2j43L77Om2o5r5J41J0o3m4O8N3k21pL29l34q6J54J12
3153C1q2pN4n5o4J13K21k86Q9J10j28r9j44L47M0J18j56k30J51l79N61j42j99
3176a36N6Lr0j0L02m4qk7J4Q9l85K66j25l02P9K38J80k17K29k32K64j33J22k23
3200i0o1K91l48M53l24Q2p4L02j24l21M1R6K78j88q9L06j40l09M11k46m2O5k33
3223b64J95J12j62L6j29K67o8k3p6l6J28Q2j9j73P1J55j90j18J67J69k11J74j44
3246e7J25K30j95q8j08Q7r2J9k38M39l04Q9J68k47L00j82K53j36k49J86L03l72
$$ plain form
3083 49 110 -6 101 -23 -105 138 100 -46 32 76 -76 34 134 -109 152 -97 67 -158 119 19 -1 -19 13
3106 13 175 -61 266 -61 -204 -100 -8 -81 -273 94 -161 -49 -115 287 196 71 43 -120 -235 -135 84 -142
3128 -142 -30 -5 -190 23 -67 -119 -262 115 121 79 14 -81 60 70 7 -37 31 84 -137 -144 185 -149 -235 -81 31
3153 31 -51 -58 -4 -59 -123 -10 211 -75 14 124 -4 -103 -247 100 140 258 102 -128 23 -356 205 63 -136
3176 -136 -80 -77 -167 -177 125 81 73 46 60 149 -236 30 -95 -397 -318 -80 100 -117 112 -120 144 11 133 -90
3200 -90 -151 140 -208 245 -79 3 -71 231 107 -214 -173 -77 201 13 -76 230 90 -219 192 -54 -96 -31 -264
3223 -264 -69 43 -119 -83 -212 55 -13 -36 -112 -148 -20 62 43 -130 -59 96 -94 -212 -45 124 -87 87 -57
3246 -57 68 298 103 15 -93 -6 -98 -79 -317 122 -182 -93 75 -172 128 -54 199 63 -186 0 303 -69
3268f9Q9K1l1qJ18J85m27l2J68j42p9J55j07R5j12J74LN0J45l11K82l81L09j43
3292d8R7j72L03n1O1j68Rq1Q2Q6j79Q1L9k49J20L0K3q5K10k9j53J46j61J10rO8
3318H0p2J4P1p8K8J80k5n2j3J44m81J30L23k64J02J2j79q8J82K5Rq6O6K56l18
3343c4R1Jk35J36n8J14N2K4j71m8K3Q2L41m49o0K53N0k8l1k7j32j5Q1M24k84M
3369A04m3k02J64j96J60j86r1K48j29N18m62Q4K77k94K61k29Jk5J02m2J06j99
3391g3P8j7j1M22l96J77k53j9q6j16J67K54j30J7r7J23j24oNJ69k5j01r0K8J39
3416C5j78K01M0mj06R9m9PQ4k62J72m1j43N0J09m7K25k84N0J27j19j16J20K3j40
3441a47J87J7j69K24J06k80O6j31j14K54k58J52J17J26k39J94l1j03R3j73J82
$$ plain form
3268 -69 20 41 10 2 120 305 -122 -154 14 -128 -207 -52 -159 -64 -176 -2 1 51 196 -115 167 -214 95 -48
3292 -48 49 -123 180 129 190 22 31 -50 32 118 -61 20 59 -190 -70 -40 -17 -102 108 79 -74 72 -89 21 12 80
3318 80 8 22 93 15 43 223 198 146 133 277 -204 -74 249 -15 87 99 -80 -168 14 39 48 -38 28 284 -34
3343 -34 57 58 -177 -41 -99 15 67 91 -80 -128 -105 -23 318 -131 -191 62 112 84 53 26 -106 -121 -40 384 100 104
3369 104 61 -141 23 -173 -13 -199 -290 -42 -171 347 -115 -31 246 -48 213 -16 -15 -40 62 20 126 -73
3391 -73 5 -12 -23 399 3 180 -73 -92 -178 -294 -127 127 -3 14 -83 40 -84 -90 -85 84 59 -42 -132 -104 35
3416 35 -143 58 98 94 -12 87 38 45 129 -133 39 -2 -145 -95 14 -33 192 -92 -42 85 -34 -150 -30 -7 -147
3441 -147 40 57 -112 112 218 -62 4 -127 -241 13 -245 -93 24 150 -89 105 74 -29 64 -109 73
3462G3k0Q8j98j03J24P9P6j41l7J33K83k29q8j12K23r5j17O0R5j14R0R2k54r9
3486a91n6K05j5Q2j55J63nrRK9L0j06m2J42r5oR7k32J05O3J56l20LJ76r2J24m8
3513A2J62l02J32mj36K40R3k05o6j92K07J09Q2l15mK69J7j11K0N6k65Q9j36L42
3537I4j17k6L0m2K32P6k52K31n18L52j51P0L0q7K3L07l17J59l08J2J09J73l9K00
3561B41jl56J68N7L5m79M40p0k3K34l95L9Q0j77J94p9N0j21P3k16O7N1L03n1M4
3586A08k73J12l4j0K79l98L57k50R9K06k25J28or2n7J05P4o2O8n5j02lP0p2k7
3611f0p6jK89k68Q0j61K54P3k3L9j71k4q5K7m1K03n06M74j35j29J12J86r3K54
3635B18j63j18K37j35o7m7J54j99J87rM1Q5k33J91O2j21lJ59j54J59m45J62j7
$$ plain form
3462 73 53 141 -57 -160 -36 43 119 -22 -59 74 357 128 40 -72 151 56 -61 -1 94 -20 70 162 -92 -191
3486 -191 -247 -42 -57 25 -130 33 28 19 28 57 87 -19 -61 81 -14 -20 77 -155 -50 13 169 -151 -148 28 -64 60 12
3513 12 174 -128 4 0 -136 104 197 -8 -74 -266 -59 50 132 -183 -187 82 99 -12 8 64 -201 -112 -248 94
3537 94 -23 -49 -19 -61 171 247 -5 226 -292 60 -91 -21 9 -78 -55 252 -65 94 -214 -202 -93 80 41 241
3561 241 240 -116 52 109 144 -335 105 35 12 246 -149 -110 -30 -207 -13 -92 -42 -163 -90 -306 -239 -188 115 64 108
3586 108 -165 -53 -87 -97 182 -216 141 -109 -10 196 -29 99 93 1 -56 49 123 61 129 74 -28 -31 39 -33 -60
3611 -60 -136 -137 152 -116 -36 -197 57 130 107 146 -25 -49 -134 -107 -148 55 -451 23 -112 -241 -129 57 -36 218
3635 218 55 -63 174 39 -28 -75 79 -120 67 58 99 184 -49 142 204 83 80 239 85 244 -201 -39 -56
3658e6k1J61j4q5o9J40J65j37k96J67P8m27M21K8o3n7k54K70Q5P7P1k19J6J6R5
3683I2j12o3P7J40k35J1lK24k37K28j53o3n7J36j63J50l2j46N02l80J08j73L92
3706B43k77LP3K2Nk26l3K60m4R5q1K7q1p7l3o5Q0m4R4j8j0J71J9o5J54k38j86
3733b32n0K89q1p8L45j98J31j61n5K2J58j50Q8O0j25J48k03K9j62L50j86r2j02
3756b55J17K9m6J69k73L93k8k67L03n0j59l3j21K86j13L25l18K29j31R5K7l86
3778b07J55P7k42J49q7K12r8K72q5k69K07k88J08P7J99k70Q8k1R9J52l01r8J09
3801f2r2J43j76J99j90J92J27l5k78J94P3m97O51k61j40L01j7l85L35Q7j31o0
3823b2r0J32L3l20N25j56J1J22l57L23m94L87J27k71K61k33j35J63k15K40j53
$$ plain form
3658 -56 -77 84 70 -15 -84 56 221 84 -212 -45 33 -394 27 55 -8 -65 -319 -49 36 113 184 -35 -19 -3 92
3683 92 -20 -83 -6 134 -101 -90 -93 131 -106 122 -31 -94 -151 -15 -178 -28 -60 -206 296 -84 24 -149 243
3706 243 -34 -31 42 64 69 -157 -190 70 26 121 40 67 -14 -91 -124 -189 -109 -153 -59 -77 -87 84 103 38 192 -46 -232
3733 -232 -282 7 -74 -152 193 -5 126 -35 -90 -68 90 -60 28 88 -37 111 -92 -63 -225 125 -61 -153 -255
3756 -255 -138 -109 -155 14 -259 134 106 -161 142 92 -67 -100 -221 65 -48 277 -41 188 57 152 179 -207
3778 -207 -52 25 -217 -68 -155 57 -41 231 146 -123 84 -204 -96 -19 180 -90 -2 -23 76 228 -73 -171 -62
3801 -62 -154 -11 -187 12 -178 14 141 106 -172 22 95 -402 249 -12 -152 149 132 -253 82 169 38 -22
3823 -22 -112 20 53 -267 258 102 113 235 -122 201 -293 94 221 -50 211 -22 -157 6 -209 31 -122
3844a22O8j84K16J58k1p0k57M8J65k4o5P1r9K39j76j0K82rj42J09j18k76L82j50
3868A5l9P6J86k9l26J04j24j28M85l03J29k42K99l01RJ49K9L6J0j69q3P5R0m3
3892i5k71M13m6J81k5Nl40Q0R4J72m03K70j0j9Lj34J52j32J46l4j94N39m67k02
3916c17L66q7j30J18r6Q9K92J09l68j96L27L5k70J97k0j60J19L44l79l7L00p7
3938A59j25k13M10l60J93l09J72J9Q4k5J43N7j79P7k1m0N3j73lM4O0k0R3n7j6
3963B3j58p4J69M7O2n0l09M32m12N7J74N6K29o6J31k76j8j26j1Q3O8j17j9KK24
3988A21j02l3j23Q7J81l26O1M26k35m2m2J01j84K05J52k82j62J45J48k42N8J22
4010C4OK28l67P7L3OJ58j82Lo3j38J59J34j83J05k10J24J46j02LqM1k2j30M41
$$ plain form
3844 -122 -54 -238 -22 136 115 45 -212 -164 1 -23 -88 -17 -116 123 -53 -63 219 210 68 177 59 -217 165 15
3868 15 -24 52 238 209 -117 -13 -137 -265 220 -83 46 -196 103 -198 -189 -40 -11 25 35 -134 -217 -142 -52 -95
3892 -95 -366 47 1 182 157 162 -178 -98 -4 168 -235 35 25 6 9 -125 27 -105 41 7 -187 352 -115 -317
3916 -317 49 -38 -168 -50 -146 -57 235 344 -24 -220 107 142 -128 69 49 -111 8 352 -27 -64 236 159
3938 159 34 -179 231 -129 64 -245 -73 -54 30 5 148 205 26 103 82 42 95 -78 -81 -37 23 3 96 39 23
3963 23 -135 -209 -40 7 69 19 -290 142 -270 -213 -39 17 246 180 311 35 17 -109 -120 -37 31 -86 -105 -103 121
3988 121 19 -14 -137 -50 131 -195 -134 292 57 15 -27 74 -110 95 247 -35 -197 -52 96 -146 -88 34
4010 34 40 268 -99 -22 11 17 175 -7 -4 -67 -205 -46 88 -95 10 -200 -76 70 -32 -29 -37 4 -18 -148 293
4035B93k54O9j09Kr5J1oP6R0p3J65l27j05K48k1j24L22J04k32o4j93L62N7j76
4059B0M0Nq7j48K35J05j70n9n1Q1J77Q4j18j47J9J7K20l61J00k7k1RL4n0K10j81
4085f4M1k6K4J16n6N3l71M86j82j40j69L98j21k1J20J23l60J69J6j24Q3nm2L8
4109a4k3JL24k85r6J14J31Jl19L64m86L40r7j52K18j13Q6m0j38n1N5O5O7k2K76
4134B06n13M25j62J60J26m03P7K07m9o5j78q3J42N5J68k64K84J85m17J95k11K67
4156A52r3j83q1M08m16J89J12k41L71k06j65j32J76J18Q2l45M08p3j04N8K7n0
4178A2r8J11nQ0j57K22J50n25J69J02m2J64k44J48j53M1R5k63O3R0K74l12j33
4201b11J26K41M1k39q6M2J30j3J5j92J01j8O1k97J50qQ7J21m8N2L4j31PK7oj15
$$ plain form
4035 293 39 108 -1 1 -94 -83 -89 -13 77 4 169 -158 -263 -15 -36 -160 162 266 34 -30 -223 139 196 20
4059 20 60 65 -22 -170 65 170 0 -59 -110 -29 148 232 114 -33 -14 3 223 -138 -38 -65 -86 -77 -43 -93 117 -64
4085 -64 -23 -49 -25 91 35 88 -283 203 21 -119 -288 110 -11 -32 88 211 -149 20 36 -88 -5 -10 -52 -14
4109 -14 -37 -36 288 3 -93 21 152 153 -166 198 -288 52 -45 -197 21 -92 -6 -46 -184 -235 -180 -115 -48 -70 206
4134 206 -307 118 -44 116 242 -161 -84 123 74 9 -169 -252 -110 -55 113 -151 133 318 -99 96 -115 152
4156 152 59 -124 -205 203 -213 -24 88 -153 218 12 -153 -285 -109 9 91 -254 154 81 -23 35 62 12
4178 12 -86 25 20 100 -57 165 315 -210 -41 61 19 183 -61 87 -66 -25 70 -193 -130 -40 234 -78 -211
4201 -211 -85 156 197 -42 -128 -86 44 31 46 -146 -45 -63 -2 -299 -149 -157 -70 51 3 55 89 -42 -35 -8 -14 -129
4227a29M5J22j52J80j63J96K1O3l83K52p3K29J7n7K5j35N9j27K62j73j0k27J58
4250@k39K72k12L53k91Q6o0k6L04n4r1k13J95Q2n4K5M8r7j9l14N35k75n5N5O7
4275B2j31P5j45J73K62l11J4K47q1j16m9l5l5J14j9K00k56P2k0R3n0q6j35j30
4299c27L80L0P5q3j65nJ22J88n7m8j24j10RJ00L32j07r1Nm07K81J43K2K3m21J69
4324f6J20j86J80o2k43K86o1j12k3M16k82J4m57O05j87k68K78L37k93J80Q2k95
4346c7N0p5j23L27j52Q4q0k46K40LM9j7k62J67J67J2R1k62pP2l6R9p4p1R6j71
4372a56J04L18l65mL13k16j64O9N6O6n9j42J06J83m0k18M15k18p2R9RK26j02k49
4396d1K03j05j9O4j99K11j90l8j25K42k4K2J63k10j51J0L42j06J73l19J30oJ7
$$ plain form
4227 -129 -84 38 -114 66 -97 99 120 183 -200 52 -21 208 225 168 193 58 117 -10 252 79 69 -158 0
4250 0 -239 33 -179 174 -117 -31 -91 -117 187 133 42 -171 24 106 52 77 125 28 9 -305 230 -45 -100 -45 22
4275 22 -109 -34 -179 -6 256 -55 -41 206 125 9 -40 -75 -110 4 -15 185 -71 1 -19 74 24 -62 -197 -327
4299 -327 53 83 158 75 -90 -95 27 215 158 110 -14 -124 -115 -15 317 210 119 124 -283 -2 141 163 186 -235 -66
4324 -66 54 -132 48 -14 -257 29 -32 -144 -167 249 -33 -19 -476 129 -58 -326 -48 289 -4 176 258 -37
4346 -37 13 -62 -185 142 -10 74 -6 -252 -12 -9 40 23 -239 -72 95 107 198 -64 -71 1 -35 64 -10 -81 15 -156
4372 -156 -52 266 -99 -103 210 -6 -170 -101 -45 21 -38 -180 -74 109 69 -149 266 48 -24 75 84 310 208 -41
4396 -41 162 57 38 102 -97 114 -76 -114 -239 3 -21 1 164 -46 -197 -187 155 49 222 -97 33 27 44
4419D4R6l64J67K0J95j47j8k14p6J89k5K95j28q2n5O2Q5j66r5L81n00p7L80m0
4443g3K08k63J74j03Q8r4L4j95N06k82n9J18Kj62j37M91l28J3K59j20r8J54J29
4466B62k54j3J66k33L7m0J73j04l4L0m9K03l04p1J08mK88j94J30j65L07k84Q0
4489C5k06P1L19q6l07K92Q0J92p20M13k45J39J10k78L49q8J05n2j24J74q7j19
4511c3J07l93L03j62J92M2p0L38l62J62j06j44J63P3j28P6o1M8j97J22K15j24
4533F1J2j2k10N6Q6J04j06k0K34M8l14M9l8J91j41Kp7K25j72J31k20N4J33oj83
4558a13J35N1j12J94m37Q0J65o3J98l25Q3M6n2K23q3P5l68M11j5r5j33K45j23
4581a3K1k55p6K75j51K86k32L29l99L81L6K9j63j12j39L01J83m23J96k49J22K72
$$ plain form
4419 44 140 -224 -57 -37 158 11 -7 -221 -297 -108 -133 162 34 -48 -103 -41 44 -122 -217 164 -336 -413 -33 -73
4443 -73 135 -128 46 -57 31 -63 -29 -224 282 0 -59 59 61 -101 -238 253 -75 -62 197 77 -21 133 262
4466 262 8 -5 161 -72 -35 -75 98 -6 -40 -10 -59 144 -160 -231 -123 -127 161 -33 97 -68 239 -45 35
4489 35 -171 -100 219 133 -174 118 198 390 -330 83 -162 -23 87 -191 158 70 175 123 -1 173 86 -33
4511 -33 74 -319 -16 -178 14 56 -14 324 -38 124 18 -126 37 110 -18 58 -3 45 -152 -30 185 61
4533 61 73 61 -149 -93 -7 97 -9 -29 205 253 -61 -12 -50 141 0 2 -75 150 -22 109 -111 -57 76 70 -113
4558 -113 22 73 -39 155 -282 -202 -37 -100 98 -227 -144 -98 -150 73 -10 65 -303 108 93 -2 -135 110 -13
4581 -13 8 -247 -323 -48 -199 87 -145 184 -215 166 202 231 68 -44 -183 118 301 -122 74 -175 -53 219
4603B19j19n7J53j16r6J9l21J85K28m70M96L0j03j75K94R3j55j73M6K09j94OJ52
4626A51l80J51j35L51o1j33p7j11L07j81J26pO4k4p8J48l3q9k0l34N47k30j01
4649a49J61n6J86K04j21l6k69J6o4J64q6O3j03l7L99l11K01k62R7j54J33k32K87
4672C1j26K23j89M4j04j63L66l13N98n58L40j35j01J02k33J98m9Q1J87j97o9K75
4694B08j12j72L1K2K09l92K55k00J98N1P3j96PM7R8k3m3J03k42L90m23J11j80
4717a80K07k7J21O2n4j29K20l08L9J19j18k4J08j0q8L13l23r5k01K10J62k10L19
4740A13k42O3j04K6m2L1OP9L06o8l0j38M5j02K25l54N2l1j21O1M52r4k09K62j67
4765A9j96K85j62J76q0M9J7m7j16O6l07L47M6or2L8Q0R9l68J61k73L22k47J70
$$ plain form
4603 219 100 43 196 80 -16 3 -318 -133 95 -375 121 151 48 -127 167 260 105 -68 -22 187 -7 -1 151
4626 151 -229 -78 -213 138 77 -56 -133 -244 63 -118 8 1 65 41 -37 111 78 -11 -31 -365 182 -48 -149
4649 -149 12 -44 142 346 225 189 -80 -64 -128 36 -50 13 -90 -127 272 -39 162 -100 -3 -157 -24 -256 31
4672 31 -95 128 -61 -17 -121 -284 82 -231 367 -191 149 14 -87 15 -218 -20 -69 12 199 2 -67 208
4694 208 96 -76 -45 -23 186 -206 49 -151 47 98 171 -25 -18 29 127 104 61 164 -78 312 -111 0 -180
4717 -180 27 0 121 183 129 0 220 -88 -49 70 -48 -72 36 26 -62 251 -72 -167 -368 -158 4 -206 113
4740 113 -129 -66 -170 -144 -186 -155 -149 -70 236 168 138 0 45 -57 168 -186 -134 -165 -286 -225 227 133 -76 186 19
4765 19 -177 108 -54 122 42 91 108 61 -55 11 -296 51 97 91 -1 37 117 216 -152 9 -264 58 -189 -19
4789a9J02J33l53J86o7K41l08J40n8j9K06l4n3j58R2JK35k26J0l21K01J05N7J7
4813A10k11P9R0j8K50l93nL74j45j7k18K83j46K47l94J19M7r8R8j07o7q1R7J39
4837C3p9j2k2j34J25j8K58j96m6q4J95p4k7K1M2j69K71k17q1M35k46J2N7j48K0
4862h4M2KK9j20j31L7K16J05L0j94j3N9j12J27j2j87K05l94L81o6oR3o7K13l94
4887b41K66j32L16j73J35q1k60K67l38M36j79J27m4PK60m34N9k8N3j16K26J2k58
4910a20J55K67k09J13m12J17K48j82k7P8j24NO7O0O2j82K41o5o9k1K6J17j24k74
4934b53K02J73r6J0k1J70l44J22K65k52k09p8K37q1J74J11k75J15J65O8k67j0
4956g4lO3R2qk21l0pJ14k57L10o4J60m12K76K9L10m22L31j24M9J07l67P6J69j02
$$ plain form
4789 -19 83 216 -137 49 -18 223 -85 55 -3 -22 184 150 97 -61 31 32 267 41 51 -270 -69 36 93 110
4813 110 -101 -22 68 50 300 -93 -98 276 131 114 -104 179 33 280 -114 5 52 -46 52 -55 -122 -203 -106 33
4837 33 -46 -58 -80 -214 -89 -107 151 -45 -91 -175 20 -54 -81 -60 -18 -187 84 -133 -214 221 -25 -13 44 -104 -84
4862 -84 -42 -40 -11 -131 -262 -225 -9 96 126 -68 -81 -22 -134 -7 -19 -206 -1 -395 -14 -80 -86 7 -60 153 -241
4887 -241 25 -107 209 36 171 90 -170 97 -241 195 16 143 99 106 366 -68 -9 -37 16 -100 126 138 -120
4910 -120 35 302 93 206 -206 -89 159 -23 -50 28 -96 -91 -24 36 98 -84 157 92 23 2 28 145 21 -253
4934 -253 -51 122 26 36 15 185 -159 -37 228 -24 -233 -311 -74 -155 19 130 -145 -30 135 203 -64 -74
4956 -74 -77 -14 78 70 -151 -181 -188 -74 -331 -21 -85 75 -337 -61 -32 278 -144 187 63 112 219 -148 -72 97 -5
4981eR1k35j6K37j17j35K27j13J02j18jL88j24j84k2J94r5k73K54k16l7L54p2
5004H4k7J25k53p0K43j28J38j22J38l33N9J37QQPQ6l36J95j11K39j63q6K22k24
5028a64k3K76k21L05k42k28K80J60J44m28NM15k39j1P7j47j28J67k49K40j12j2
5050a35J71L03n4m65K05k35O0j59L79n6J4O2j28j59L50q0M3k04K68k39k2K08j05
5073B2p6J27O2k28J11J32j83j38J73j52R7O5%J19p3P0j11jn1J20P6j51L02j42
5097A70j17J55j40J03p4m12J45J88J37l00K59kj14oQ1R8k80P0l7J97j51p2J88
5120H6k90L05j71J30l7J22j09k19J93J1K60m02J60N5N9k11N4O7o8J8M5J6M1l17
5144b02K56j83m6J87l7k7J68l77N10m68K48K9m16N53k26K5p2J14qj8J40k34jJ55
$$ plain form
4981 -5 86 -149 -165 72 -45 -180 47 -66 36 -82 -83 305 181 -3 -25 169 74 -199 55 -161 -198 156 84
5004 84 57 182 -71 -141 102 -26 112 -10 128 -205 -146 -9 -1 7 14 100 -236 -41 -152 87 -76 -162 60 -164
5028 -164 -187 89 -132 173 -69 -297 -17 143 287 -141 -136 279 40 29 106 -41 -169 -2 -251 -11 -123 -135
5050 -135 36 339 285 -180 25 -210 -150 -309 70 14 28 90 -38 -197 153 73 116 -88 180 -59 -81 127 22
5073 22 -54 73 135 -93 18 150 -33 -171 2 -150 -53 12 12 131 58 128 17 16 -35 85 161 10 312 170
5097 170 53 208 68 171 97 -315 -170 18 155 -145 114 112 -2 -8 73 171 -109 -39 -76 121 -30 -102 86
5120 86 -204 101 -70 60 23 145 36 -183 10 21 281 -121 39 94 153 -58 -4 63 -5 13 58 74 115 -202
5144 -202 54 -129 -175 12 -25 -52 116 -261 249 -219 29 58 -358 195 -31 -6 -78 36 28 10 150 -84 -85 70
5168G0j3k11L17K8k01N2O6j25L9q5r5N08j30L3q6Ok24j16L94l30n7J54j05kQ7
5193b6j48M8K20n1Q8r7J40k7l11J13J4J4j00nK34J13k98J11Q8j23p2k1J53m13
5217c56K94J83j30k9j92L61l53RK98M9j27J11L0l32K23P3K39l79J07j36N3K1J34
5240A51k29L37k03k7J39L8l44l5K00p6J33K30l77j7L64k86K58k50J61m16K83o1
5262b7j66J35P4J54k53l0k5K17j11J37k58J55P5p4L3Q8j50k37J89J12l0j12J01
5285cK0m5p3J29j00O1K18j11p5j06j05J79J52l11R6K38j10l32M39k26O1L6R8%
5309A30k02L9J60m31L62j42J50PO6j87J59k9l1J5J72k4L5O0m77K48J8l0p4k41
5333b47K02LM4l8L89m53J52p5j78o2K98j37j29l4M28N2m09L36k45J00M9j38k6
$$ plain form
5168 70 57 -154 163 191 -10 42 108 -17 22 -63 -158 350 220 253 167 173 -51 -167 227 -103 -160 -6 -111 -113 -26
5193 -26 -174 -126 94 43 131 34 174 147 -164 -51 -37 -23 -123 -128 106 219 -79 32 120 -3 -75 -96 57 -356
5217 -356 -62 121 -9 -38 -230 131 -222 -213 85 134 7 118 148 -184 39 112 351 -28 79 -57 -4 17 151
5240 151 -78 259 56 29 168 206 -138 -173 27 -49 84 314 -63 -80 284 -2 256 6 167 -249 34 -27
5262 -27 -193 -58 16 170 -83 -113 -138 79 -32 105 -153 2 77 3 36 124 -26 -263 -74 38 8 -104 -3
5285 -3 17 -28 -101 28 -72 -11 207 96 21 -85 -190 -11 141 -170 -74 164 54 -278 161 -65 -4 32 130 130
5309 130 -72 -33 127 -304 58 -84 66 73 139 -48 111 82 51 66 238 214 249 309 -168 80 98 68 -6 -247
5333 -247 -45 -42 2 -36 353 -100 52 -23 -201 -263 35 -102 -231 -265 163 215 -194 142 -103 -3 46 -92 -118
5356a18K5k6J98k63K26K11l43M3l2J42K3l04K95l67K07L3J6Q9k9r3j73K22k1j8
5380e7J8K75l68K13n9j68K72k01J15n6l0j28N0J29M3r4J47j25q2N8k5R4J21j18
5404B4l6J08j86J66J88j17k35J44k34L37k03j59J87R3j74O8j22K51J05r8j63K85
5426B29k96J3J27j26J91k00K65k74k18N82j09j69o1K7K05l33K55J52r2n02M05
5447G1r5n6O6M1K3j00j32J55j0j79L54k1k08P1n5Q3J25k01J14M4n6k7N8j10O9
5472B4L8j12j07jp2J61M5L6p5J78k00M7M2PJ68K9j72Q2l70L8K54J4k4j60J38N8
5498F6j77J47l6K2p8K5n8k3j35J73J1q6K69k96R3J80k79N02j72j1j94J99j30l7
5522b5l2J3M4j84K6K61p8O2M5L2l6q1J13j43J83j32j2j33K04j14j60J61J14R8
$$ plain form
5356 -118 -93 -119 79 -184 42 253 -90 -47 -79 63 86 -218 77 -290 -83 -50 -34 55 26 -67 -240 -18 -39 -57
5380 -57 -39 236 -132 81 22 -146 126 -75 40 -16 -46 -174 -124 5 48 -46 101 -24 -106 -48 -73 21 142 24
5404 24 -12 96 -90 76 264 147 -88 56 -178 159 -44 -203 -16 77 -97 -29 -151 100 205 107 -56 229
5426 229 -67 -54 73 -53 138 -62 203 -71 -289 293 184 15 -46 -19 186 -147 108 260 168 -334 71
5447 71 -24 -80 -14 27 50 -50 -182 -27 -37 -216 138 117 -91 -20 -75 8 133 -68 46 90 34 7 65 -45 24
5472 24 62 -50 -157 -158 -230 -69 -24 12 -63 115 -85 -38 4 11 179 208 36 118 -252 -214 40 54 30 -130 8 66
5498 66 -111 36 0 22 -56 -31 -89 -112 -247 -74 -63 -149 120 -176 -83 97 -182 320 148 137 -57 142 12 -25
5522 -25 -57 -44 0 -184 -158 103 25 87 132 164 128 47 160 17 200 68 56 -77 127 13 -147 14 128 226
5546B26k24N6k92L24K89k94k06L27j04O2l03rJ40P1R1l15K35P5R9l89L79j57j31
5569e0QJ21J14j95p3j17K18j87Q6O0j9Nj60J22j9J99M1j14j42J96j59M7M6k9K75
5594B74m76J78J47N7j7p9l11L90n3j62P6J9j48J01K41k52j7K87j49k11P9j51J84
5617Gk37L56j17L1Nj43Kn4J61K2j80MK0j36M54l66J43J38n3l45M50P7l14m4R5
5642b4k44M69O5k62n6J33j58m3L28r8m7j24m1q3j2K8J65m5K11p3j56l8J09J80
5666A84j18k15P0J24J57R1j52j37k71K37r0J68J37m24J80P4j01J77K31l88Mq0
5688a42L67l06M9L5p9k8K72k14Q2m9Q2j63J67j73J48j10K00j53J89j94O7k04L44
5711A87r8K5q3r4J91j40j68J46K15k3m01L52K7l04J25o6J83J37p5j58J34pO0k51
$$ plain form
5546 226 2 58 -234 90 379 85 -121 206 102 164 -139 -148 -8 63 154 -161 74 149 248 -141 238 81 -50
5569 -50 -42 79 193 -2 -75 -192 26 -161 -75 -15 -34 -29 -189 -67 -86 113 154 40 -102 94 -65 -18 28 -1 274
5594 274 -202 -24 123 180 163 84 -227 163 110 -52 24 43 -105 -4 237 -15 -32 255 106 -105 -26 -177 7
5617 7 -230 126 9 40 45 -98 -96 -150 11 33 -147 -143 -123 -259 195 -171 -28 110 57 -288 162 239 -75 -119 -24
5642 -24 -268 201 266 4 -52 81 -77 -120 208 110 63 -61 -102 -185 -197 -169 -4 -49 162 89 -67 -105 4 184
5666 184 66 -149 -79 45 202 293 141 4 -267 -30 -120 48 185 -239 -59 15 -86 91 322 -66 -62 -142
5688 -142 225 -81 -32 3 -76 -104 168 -46 36 -13 69 -94 73 -100 48 -62 138 -15 174 -20 47 -157 187
5711 187 89 114 31 -63 128 -12 -180 -34 181 158 -243 109 136 -168 -43 -109 74 211 136 -22 112 105 165 -86
5735h6K53k52j88K75Jk25L62j14J74O2k57P6K2k2l1p8lK08k49K82j73L8m1J25
5759A59j12j33K9J17Q6j04Rr0K22q8J80m95N14l90L23k31k01J63P4j85J03o8J65
5782D7jk72L93o9l43K58m04L11P7o6L88j10j40kPJ8L7q5o7k16K62j2j37l2L27
5807A69P2k40J03k47J06J94k76O0m1P3j25J17j26J63j0q6o0K39J1j14k4J14k88
5830b16L05j3Lp7J5J66k97J01k50K81Q9Lm2o6j94P6L00r7K4k2m00K98J20j36j59
5855a88L28L6j08k25N08m10M5J87k10k5n2K30J11k79j26J81J22l02k5K12j26J50
5877C4L5j46j29R8K22J7j56l1O7P4k67M10r7j02J63m47M58L2l44K62n0j94j51
5900b42K20j49J80L9j49K90j47Q4l9q2n2k12M52l73L46j57J52r8L49n09J47n7
$$ plain form
5735 -86 167 -85 -273 2 3 -222 140 26 200 262 5 81 103 81 50 -28 -31 177 -72 210 37 75 34 159
5759 159 47 -86 -57 60 146 42 51 -39 183 95 275 -220 294 -96 227 -4 -205 -42 32 -153 -50 -118 47
5782 47 46 -226 167 98 -245 13 -391 -80 -3 -69 319 209 69 67 74 92 129 44 -23 -239 23 11 -126 -158 169
5807 169 241 1 104 -143 -37 157 -119 -59 -100 -27 -152 -35 -161 2 -8 -94 -154 85 96 -18 -42 72 -216
5830 -216 89 76 79 2 17 183 -114 -13 -263 18 107 110 68 2 -192 -116 184 87 111 89 -311 -13 107 -29 -188
5855 -188 140 176 68 -157 351 -59 -14 173 -37 -62 -114 116 227 -52 -178 3 125 -177 -202 10 -116 34
5877 34 69 -77 -206 -108 114 131 -25 -56 11 85 -182 228 131 29 192 -255 203 235 -109 153 103 -91 -242
5900 -242 -22 -171 9 48 -101 189 42 126 87 5 -47 -259 193 -180 166 9 161 63 412 -97 50 -7
5922gj1J1M5j6P3J46k89P9O7J31k33J60m06K51P7q0j12O6j13J10l3J51J61k25
5946Cl4K31l66K74j05L3o1J68k88L96L2k12k32L7J43j29K92m07J28PJ86N7m4l7
5970G2rj69K65k73k5l4J34M7K8p5j4j32J58J9L6j40j74K16M04k18j57K01n8j79
5994g7J15j92K07j91k7K14m0j55L8M5j55M69l35P7k16L09n4r2J57j2o3j20L6O
6018e6L2j1j51J62j06L5J31pp8R7P0n16M88j72L46j54r9n7K20k96JK61j36K77
6042B81l11m9o0N3J64O0j80J04k75K44k75K75q4J85o0pm28L61n8m8l0j38L39j53
6066i0Q2lM6mP6J8o9j12R2k7j29M10q1q8Oj34L62l99o6J52n4J93p1q2K2j34J10
6093B6J0n7O5Lj44J00J29j41K05m30K48R3k28K68j97J45q7K13j64j47J12j31N3
$$ plain form
5922 -7 -18 -7 38 22 95 241 -48 31 98 229 -4 156 -250 1 78 -2 -114 -48 -161 -51 -84 67 228 3
5946 3 -31 200 -166 108 3 36 -25 143 -145 251 283 71 -161 -124 19 -110 182 -225 -97 -90 96 153 109 72
5970 72 63 -106 159 -114 -139 -173 -39 8 36 -39 -53 -185 -27 -8 28 -112 -286 -70 334 116 -41 160 102 -77
5994 -77 38 -154 53 -138 -165 49 9 -146 -108 -63 -218 251 -84 -7 -223 86 32 -60 97 85 22 -98 -62 -56
6018 -56 -24 -35 -186 -24 -130 -95 36 29 -49 48 118 -398 90 -82 264 110 11 -46 174 -122 -121 140 4 281
6042 281 -30 -79 -139 -86 78 138 -42 62 -213 31 -244 31 -53 132 72 65 -363 -2 -60 -108 -138 -276 63 -90
6066 -90 -8 -11 35 31 107 125 56 -56 36 9 -120 290 209 121 127 -7 355 -44 -110 42 -12 181 110 28 50 -84 26
6093 26 36 -21 44 47 -97 3 132 -9 196 -234 14 107 -121 147 -50 95 8 221 57 -90 22 -109 -56
6116e6n9J61j4j43n3q6J50J32J76k79L23n96M00K43j41j27j85L6J61q4k6J89J13
6139B35k13m2n4j17L45l9j3J8J7j07l20K68n0J3j74J66J67k91L52j87K06jj65
6162A4K46o39J08J12L8j42J03K52k25J36K00j54J3r3M09l90M7R5k09J05K63j63
6184A26n0j93L82nq9k30J55p0q1J83j54j14K00j24J22q9j38L26j81k39K86J33
6206A56m62J08L43k57J14J98kn57L74k27M11j39k96K64n9l7M6j43L04j5K8M9k69
6229f8o9M5n3P9k98L75J38k30N6j18L63j89P7P8j46k8J42m23M88j64O8j06Ml77
6253c56L40J17q3m9j5J41j12J70j08j25J46K04k10rj40J32O4j79n5J64j62k44
6275c69K92J22n0J28nR0k09J32j35J51l33K49M9k04J39j9j2L9k15J9J53j2K01
$$ plain form
6116 -56 -115 46 32 -111 -164 -250 -100 32 208 -71 252 -344 56 299 158 31 -154 -118 43 -41 -67 122 235
6139 235 22 -20 -74 -191 154 115 102 120 137 30 -290 -22 -72 -59 -233 -67 100 -191 161 -26 180 179 14
6162 14 260 -379 -271 -159 -121 -263 -160 92 -133 3 203 49 62 -31 378 -12 35 130 -79 26 289 126
6184 126 76 -117 265 260 171 -59 96 26 -55 128 -26 -140 60 -64 58 -31 -169 157 -24 -263 23 156
6206 156 -306 -198 145 -112 2 200 198 -359 15 -212 199 60 -236 28 -31 -68 -22 -165 139 124 152 201 -68
6229 -68 -137 -92 -145 -66 -364 11 149 -81 -25 -143 220 31 108 186 40 12 154 -269 219 55 123 17 21 -356
6253 -356 -16 101 18 -31 -46 95 -17 153 45 -80 66 270 60 51 -89 43 107 -72 -127 37 -125 -369
6275 -369 -77 45 -5 123 118 208 -1 131 -4 147 -186 63 112 -92 47 28 16 55 -160 -141 12 0 201
6298B01j59k57J09J17j36J59J59q3q0k23K08L14k75j02j55L52kr6R8l71J56K11
6320A45k65R7J10j37M2j15P7O1O1l29J98J87k34J67k13K02r6n7j1K21M4m3k32
6343a20K48j09r9J20K89l31n33N45l5j66K22lk68K59j01Jo4J5R6j7K5J75j64j94
6367b09L36l05L8K6j21K81j14J28k77K97j21kp9j31M5L13J99m35Q6O8P3l0kR3
6391A57n7j93K08l17L35n9P5K31k80j07k54K21L36k41o8R0M6K8k52l5K38O9k58
6414h7J48n0K08j03j47R9j22m3J79m0k49M39j64p2k6K10m4J49n96M75k25M4n4
6437g1J85m43L12K29l43m8L09J4k11J7J55NJ9o3q0p4J34O0j74n7J47N3o3n6m1
6462h5L35k51l15K45Q9k53L64Qk80J75k7J34l31m7J41r0N4j84L78K2K19k22L6
$$ plain form
6298 201 42 -215 -106 11 -125 34 193 110 30 -193 15 329 54 -48 -203 149 147 51 149 -222 -66 145
6320 145 -120 -23 87 -50 -8 -123 -46 15 76 -253 -55 132 -102 65 -148 54 -42 -99 -110 111 155 112 -120
6343 -120 128 19 -80 40 329 -2 -535 10 -25 -191 31 28 -240 19 -82 -81 -145 -130 -34 -51 -26 149 -15 -209
6367 -209 127 -178 -140 -114 -235 46 -68 60 -217 80 -41 -43 -122 -253 -208 105 304 -131 -45 23 96 66 64 157
6391 157 100 -93 115 -202 133 74 149 380 100 -7 -261 -40 296 55 -13 77 123 151 -101 -136 102 171 -87
6414 -87 61 11 219 116 -31 68 -54 -97 82 42 -207 232 68 -4 -30 180 136 285 -311 164 -61 -17 -71
6437 -71 114 -329 -17 212 -131 -179 130 144 -67 -50 105 110 129 66 -14 -88 46 106 -68 -125 22 75 12 -44 -85
6462 -85 250 -1 -316 -71 18 -235 129 137 -143 32 5 139 -192 -239 -98 -188 -134 -318 60 82 301 79 115
6485A15j15M52m68K08k58p4J25k20L40o7k2o8J50k05K6J47O6j44m4m9P6j16QK30
6509I3l27L62l2q4K12k56n1QK83j67m76M23k49K90k66M49l55J20M3K06k88q0K10
6532F8j88L13j18k18K17j52L63m15L30k28L2L0k95N18l03K48j73P5m6j82R1L58
6554C25l99J31j96M40k76n1K1PJ04m00N78n7m24J72O2j40O8O5J2l62J51N6L48
6577B35l32R0P0j50o7J28qj8K69k46J0k7K19Ok13qj39K3J76j81NK32p4r9J9l3
6603a13O2J5K66j33M1k61J30Mk6ok39J09J47P0P2l4k61Q1J78j12l3J07K00l96
6627a32N0o1k0O7O9Q3pm7k1m1L49j62j78Q2j0J56l16M9J08j68J5K35q5n0KJ13
6653H0q7l6q4K09q2l2j6P1Kq2n4K04j69R6J49l57lJ1L19K15k75n7j88K0L68k24
$$ plain form
6485 115 0 452 -16 192 -66 -140 -15 -235 105 38 16 -52 98 -107 -81 66 132 -12 -56 -105 -29 -145 -137 93
6509 93 -234 128 96 12 224 -32 -83 -75 208 41 -435 -12 -261 29 -237 212 -143 -23 20 226 -62 -142 68
6532 68 -120 193 75 -143 74 -78 285 -130 200 -28 4 34 -261 257 -46 202 29 104 58 -124 -33 325
6554 325 -74 57 -139 301 25 -26 -5 2 106 -294 284 227 -197 -25 37 -103 -35 30 42 -320 -169 -113 235
6577 235 -97 -7 63 -87 -154 -26 -34 -52 217 -29 -19 -46 173 179 -34 -42 -181 -158 18 -163 -158 74 0 -99 -80 -113
6603 -113 -51 -36 230 97 138 -123 7 11 -15 -21 -260 -151 -4 66 138 104 -157 -76 102 -10 -43 64 264 -132
6627 -132 -82 -143 -163 -96 -27 56 49 2 -19 -60 289 127 -51 31 21 177 -139 -90 18 -150 -135 100 15 -35 -33 80
6653 80 -7 -43 -127 82 0 -32 -48 23 25 -57 -111 93 -76 20 169 -188 -191 -180 139 354 79 22 -166 -146 222 -2
6679bL0j5L7J36k53J37Kj63M00j99j26Q3j64J71j6O1j1K22j77k00k9R0m6J26j29
6704c5Q4l10K99j21J64j29J20M8o7n7M3N2j95L15j48j6Q3k07J45o7J0O6r8K00
6728A79O6m95L00l20Q0K68L2k43J6P5J72l9q1j49Q6J51l28P2J88J34k96J65K4
6751E7M7J42j54m1l48K98MP0k51J96N4j35J60j08K05j71j38K01l3j39N3J13j47
6774f5J98p4p7K5O0j70K53j84j63L28j10m1j65q5K32R1j93K60k37L41r2j01q9
6797e8K22l96K85k05K57K7k25J68K6k28M8P1J13k8k30K30r0J13r8k6J76r1l87
6820c26O15m20L43j56j36J40o3N7p1M1k05L71l47K80j43K9K97k63J21j56q4L51
6842B75k40P5j79j90L37lk34J92O4O6j40m2N5q0J69j21j44J18K62m34K98j43R3
$$ plain form
6679 -2 28 13 50 186 -67 70 72 -91 309 110 -16 67 -97 74 58 119 108 330 153 -47 -76 14 -32 94 -35
6704 -35 49 -261 38 -83 81 -48 72 120 53 -4 39 91 -104 211 63 47 130 -77 68 1 11 77 -21 179
6728 179 245 -250 50 -270 -190 78 110 -133 -117 -42 130 91 10 -139 -53 98 -230 -158 30 164 -132 33 57
6751 57 104 246 92 51 -297 1 5 75 -176 20 74 -61 99 -9 196 25 -113 88 55 -84 -31 82 -65
6774 -65 133 59 -18 7 67 -103 150 -34 -197 131 21 -20 -185 -270 -38 53 -140 120 -117 224 132 31 -58
6797 -58 164 -232 53 -152 105 132 -93 75 101 -127 -79 -8 105 77 -153 77 -13 100 2 -24 152 61 -326
6820 -326 289 -131 212 56 -80 60 -3 54 -17 24 -181 190 -157 123 -20 9 306 43 164 8 -76 275
6842 275 35 110 -69 -259 78 75 -159 33 97 163 23 -19 36 -44 125 4 -140 -22 240 -194 104 -39 54
6865E4p6M0mk85J03J19Qq2O9m5J67P2j24J73l56K92j15M9K4o3m7J28J81l51J95
6890A26k14K89j12J39j61r3k83M04j73J83k95J5J13m0P5r9J47q9K91l23K42n06
6912c64J61J93k68M4K0K17j9L77l90J30j63L91k76l13L32p6j51l0J94k87K33O
6934c9n7L34j46j01J69r7R9j33j58l67P37k98J43P7j83j54M71l59L43l64r6M46
6956B67m90M61l23P8J12j99J72r6J20l4k74J02K3J1l9L4p7L07q0j44j27J04k4
6979a16j62pL10N1j27ROJ04o6k2J12k17K89k38q2J79q7j10Q6Q6j27M08j79j74
7003g4O1K73k26j9J92k46j32J61j94J32j4j24J06J52L9O5m0j7j03l6Ll4O2Q0j39
7028g2K89j83LM7o2j86O5j00K67m06J78M30l40r6K15jn2P0k04m9K65l2j42K97
$$ plain form
6865 54 -22 18 14 -271 -168 -49 -41 -123 -54 -99 68 140 16 189 -167 125 10 59 83 20 -27 101 282 -69 126
6890 126 -88 201 89 228 67 -26 -309 95 -78 105 -190 -175 -62 -102 -27 -126 21 -68 223 -100 142 -364
6912 -364 -203 -10 -278 -234 -214 3 -16 361 -29 101 -62 329 53 -260 72 -4 -155 -185 9 -278 -45 -39
6934 -39 -96 238 92 -9 160 63 162 29 -129 -496 241 -57 86 163 -20 -174 297 -62 281 -83 -179 267
6956 267 -223 238 -85 -7 105 -94 78 -18 102 68 -206 -104 -81 -70 -109 -75 -152 155 75 -69 -196 -92 -116
6979 -116 -278 -285 25 76 -51 -42 -36 68 2 -20 92 -125 164 -74 -156 23 -64 -174 -88 -2 -129 279 100 -74
7003 -74 -13 260 34 15 207 -39 -171 -10 -204 -72 -86 -210 -104 48 87 152 112 95 -8 -44 -41 -75 -13 67 -72
7028 -72 217 34 37 84 22 -164 -99 -199 68 -338 -160 270 -70 -166 49 48 -4 66 -138 -187 78 46 -96 201
7052B01m21L17j47J2j73J70J95j91l3J15r2J4J4k41J33N0j6J27%M2j75l2L66j20
7076A15J66n13J01J03j3P9L9m7j7j07l2J05o6j68M22j07k73K03J31k7j18J03O6
7099A45q9k81L58j62J1J65k9j28P4LK8l05O5K08j46K09k85L02l23K17j66K20q6
7122Eom4Qj03L03l15q3M25n2o0j29J94l52O2J99J85k16l9r8J11M1j12J03J15j23
7147A9M1q8JJ82m0l11J78j10r4M10k11qP3o1j67Q3J84J1k92K05j23J23j61P6N4
7172b6n5K37N5l35K82k16J05oK37k89J45J1l92K73K39l95o6L98Q5n7k40QP8LK05
7197B84k01L8n8k25r1K87p9J16n3K6J87k85k09K28K19j69j02K19l14L9J48j44
7219a39L73j28j18L0M8k77L19pj19j49K63J10j78l7P9j10r6K10q0m28M18Kl3O4
$$ plain form
7052 201 -220 97 -50 -38 -211 -41 154 -37 -70 45 -47 -33 -19 -260 -127 -77 -93 34 34 76 -99 -131 235 115
7076 115 281 -232 -131 -28 -41 38 77 30 13 -94 -126 -21 -87 -255 167 60 -213 -10 121 94 -24 79 145
7099 145 56 -225 133 -29 -18 147 118 -10 64 67 95 -210 -145 63 -83 126 -159 143 -180 37 -129 91 5
7122 5 -1 -45 -37 -140 163 -152 -235 190 138 78 -51 143 -209 -147 52 237 21 -18 -116 -5 36 -76 27 142 19
7147 19 60 -28 -27 155 115 -196 -18 -128 -222 188 -23 -31 42 -19 -186 -103 81 92 -200 5 -118 5 -156 -80 -26
7172 -26 -81 156 211 -124 158 -58 47 41 278 -11 134 145 -247 26 265 -130 -196 202 287 230 -10 -2 76 79 284
7197 284 83 121 63 -162 -253 34 -45 71 18 44 231 -54 -263 -35 184 15 -87 132 -182 -143 5 -139
7219 -139 234 106 -12 18 66 -211 108 101 -18 -167 96 206 28 -9 70 -40 -136 74 -6 -434 -16 -14 -47 17
7243A7O7J81k55j03L50p54L40J96j95k21L11K25l20J59k36L02j92L78m1k67j09
7264a67O0J58J3n9J04k2Pk7J35l21Q5L9j57K18J87j12k66K63k25j25M13p0n26
7287c95L86L02k96O6j72Q6n5j52J32J35m3J8P7J10k98J42p7O9j29J40Q3o1kJ19
7311A85j68k32J75QK08q4J16k67k36L85o4m2J42l12K61l5j97j6K54j69L98m28
7333a18O5n6K4j38L54k54j80L31K54k41k51J65L4jk43J38lo4J00L92k94K3m3J31
7357A25j57J0Q4j33KK14j25k60L32J20m64L99q5Q6k06P5j89J56K10j08j15k97
7379c26M47n7pm7%k8J68o1j49l3J40M8n4o9j33J11K04k62j9K42o0k11J2L35k3
7404A68R6m30K49j44R2j48M45k89j26L2R5l9k6n4J26q6j50J97q6o2j55K39L62
$$ plain form
7243 17 84 265 10 -93 257 -497 -157 39 -156 -377 -66 159 -161 -2 -238 64 -128 250 209 -58 -167
7264 -167 -107 51 64 5 109 87 94 67 202 -119 -34 5 -152 66 253 141 -125 138 -87 -212 201 131 -395
7287 -395 -9 293 -3 63 -109 -23 -78 -230 -98 37 -6 12 89 199 -99 43 -34 35 -94 46 129 68 66 185
7311 185 17 -215 -40 -32 176 92 208 -59 -295 90 26 -16 126 -186 75 40 -157 -173 81 -88 310 -118
7333 -118 -53 -109 -85 -223 131 -123 -303 28 282 41 -210 -45 -11 -12 -255 -117 -120 -184 -84 308 14 37 -6 125
7357 125 -32 -22 62 -71 -69 145 20 -240 92 212 -252 147 62 148 -58 17 -172 -16 194 86 -29 -326
7379 -326 121 64 57 10 10 -18 150 89 -60 -93 47 95 41 -28 -161 -50 154 -108 -127 115 55 -156 -144 191 168
7404 168 264 -166 83 -61 31 -117 328 39 -87 -55 40 1 -25 -79 47 -39 -189 8 -78 -140 -295 -56 306
7427C06j06j16r4j41P9O0p0K35k13L5J62k68N0L3O1j11J79j53K9l2L04j02M4n04
7451c33K96K59k23q0n8K03o2P0Lk72M36k53l9Q7n18L74M2J63k69K56j6j15M7o7
7475f9l09M70Lj18l9L99j27l29N1O8K36j51j46K9Ro1K10k56L0K27l10J65o5M6
7499c7J81k92J75k72n7J91M87k81l81J69J68p6k2K50k39M09l39j97L78k86q6Q3
7521g4J11j93K22l01K65m8j24O3Q0J76m4q7l1n4k09K54P2j31j86M09k26k65J18
7544b03O9J87Q6J2j78j60K54J30k72l2L94j67j72Q2om2m4j37P7K20q4K20k93M8
7568a1K47m06J29L9O7l7K3l00N24l91L36j53j7q7N2J43k01L4j02OJ06m6J67k31
7592a09j8P1J32j60K87j93N2j87O7K26j29K81k86p5j51J01k5J53j6k4J54j53J8
$$ plain form
7427 306 200 84 -10 -151 -72 -12 -82 153 -60 -25 137 -131 -81 -48 13 -98 81 -72 -43 -75 229 127 171 -333
7451 -333 -37 222 -1 -81 -139 64 2 72 75 -197 239 -14 -53 34 -484 -110 -68 95 -174 82 66 -49 -2 -69
7475 -69 -378 92 95 -23 -62 337 210 -119 -68 0 236 85 -61 -32 -23 -84 126 -130 -100 127 -183 -18 -83 -37
7499 -37 144 -148 27 -245 -302 -111 376 95 -286 -117 51 -25 -47 203 -36 373 34 -163 215 -71 -157 -74
7521 -74 37 -156 66 -235 30 -18 -142 -79 1 177 133 46 15 -39 -248 6 78 -53 -239 170 -56 -321 -203
7544 -203 -134 53 139 151 -27 -187 67 197 -75 -107 287 120 -52 30 24 -18 -62 -199 -122 98 14 234 -59 -11
7568 -11 236 -170 -41 -2 65 28 51 -249 275 -116 220 67 50 -37 15 158 -43 -9 -111 -105 1 -45 122 -109
7592 -109 -127 -56 76 -84 203 10 62 -125 -58 168 39 320 34 -41 -192 -91 -116 37 21 -3 151 -2 16
7615A6j26M08j91l1j47MJ23J00%j46L5j54K82l2k38J45j00JJ66k30K08j8m4o8
7639c7K6j9j01K75k92J9J82P0o9l65J64K82L6j71l31M16J47k64r9N6J24L4p6j30
7663a23J8L31j47k95L40l32K33P3j07K13m07K74j86N43n06l3J16J1Q1l60K91j7
7685A1j83J98J81l75K95j15nJ21r4j85J49j05k1l7J40o8m1J19k1J42r4k39J98
7708b9J27rj00J60j28j96J64o5K8R7k46L99j69J14o2l5J16l89K26j17L36n8j04
7731F0r4j81N08k98pj8j90L87j26k1mj2J40n3k18m2n0Q9J08K6K29r1j37n2m3K42
7757A52m61O5N3P8mM6L5q0J56M2o5R8L8jj4J07l35J98q5j04j38K86M9k3j51N4
7783dj48J42K8J1r6J57o0n9j09K12j0J17K8j42K3l64K08m3M1o5J18N5J46j13J6
$$ plain form
7615 16 -110 298 107 76 -71 -67 56 156 156 10 45 -109 173 141 -97 48 -52 -51 115 -115 93 75 31 -37
7639 -37 -11 -30 -131 144 -148 -129 53 123 54 -311 -147 135 171 0 -331 85 232 -32 -131 -75 49 83 7 -123
7663 -123 -105 226 79 -216 124 -208 25 98 -9 204 -203 71 -115 428 -78 -111 5 16 97 -263 28 11
7685 11 -172 26 207 -168 127 12 7 128 34 -151 -2 -107 -128 -165 -25 -93 -134 -15 -36 106 12 -227 -29
7708 -29 98 89 -11 149 21 -175 -11 -76 -48 49 -197 202 33 147 85 50 166 -223 3 -114 222 164 60
7731 60 -34 -215 293 -5 -12 -30 -220 167 41 20 16 4 144 91 -127 -169 -219 -130 -22 4 233 142 5 -47 -90 152
7757 152 -309 -244 -191 -113 -117 -71 -36 -116 40 82 17 115 153 152 138 245 -90 108 23 -81 -219 67 116 93 -58 -4
7783 -4 -152 -10 18 29 -67 90 30 -29 -138 74 64 181 209 67 90 -274 -66 -109 -68 -133 -15 40 186 73 89
7808H9M8j19J48l23R3J00J01k1rl7J0L4j78kn1J91k26L5K04Kj35J50p2l55K75
7833d8J79k63L10l64K78j28k48J97k11O72j95l84M05%J23m10J35K19m36M33n16
7854b52L58J17k27K66Q0k97N2J6j15N0k87M86k07J84j44j51J51m7K03k63k32K26
7876c3kJ67J4k87L09j38o5K02l20K68N8j59n4P3k6n2J66j81K79m35QR1%K99m95
7901c13J96L45l73m4K10j46k39L23J04k7o2jQ9j46J52k02J82nq0J2J04r5L58l75
7925c3j05P9L1o6L23j66j63K34k42K65r7L7Rk31J9L51k57J18j18J8J89k69q4m4
7949b02M11k58K5Q3L2j54j02K23n8n2Jo5K12o6n7m0K23m0r9j65J96k7jN0K9l8
7975F1j33k45K89J24j61K28k70J41j69j44K88J32R2m17K47L0l8N5j22k64M64m27
$$ plain form
7808 89 137 18 166 -157 -64 36 137 116 107 70 80 114 -64 -66 -117 74 -152 -117 87 89 -46 104 32 -323 -48
7833 -48 131 -132 178 -186 92 -36 -284 -87 -298 374 179 -205 200 200 323 -87 48 267 -169 264 -252
7854 -252 106 223 -4 262 342 45 97 113 -2 48 -239 247 40 224 80 -71 80 33 236 -27 -259 -33
7876 -33 -35 132 146 -141 168 30 -35 167 -153 115 173 14 -40 33 7 -45 121 -60 219 -216 -208 -117 -117 182 -313
7901 -313 -117 228 -145 -189 21 -125 -364 -41 63 36 -26 -27 62 -84 68 -134 48 43 -37 -25 79 -16 342 -33
7925 -33 -138 -59 -28 -94 229 63 -100 134 -108 157 60 97 106 -125 -106 245 -12 106 -12 6 195 -74 -158 -202
7949 -202 209 -49 -24 59 91 -63 -165 58 0 -52 -51 -116 96 30 -27 -67 156 116 17 -148 48 21 20 70 99 61
7975 61 -72 -317 -28 96 -65 163 -107 34 -135 -279 9 141 233 -184 63 93 55 110 -12 -276 188 -239
7997b39J1J15k3Q8o0K39j89j23L32o1j21L25m28P0K06k53OPP0o3K35k88%k3mL10
8023A39k65O1q3K59j3m06K51P7k55J10J6j58M02k02kJ10k2nk0j10O7L72m44r3
8047b14N36l35Kp3K50j63j55K99k19k0Q6p1J23M5P9j82J12q1k17M65j89J2K8k2
8071I6k74K05N1p6Ml9k1j85K81k3k35J75j22K64L4j21J10j63N8n1l80K56L71l35
8095a20J55p3J14J30j94j08J1J74j67N00m43j1j37J85j80K76k0j54n9J54j1l08
8117b86J53K40j82J71j80K78m11K06l18L09J97k19J25J11k19j3K4m8J90P6l72
8138a68K40Q7m53K48Q8L8J2J6k74L41k32k3j44K67oJ12j41l4l2P9j93M64l71J07
8162B8K70j53J66k55l50L88l1j89Q0j0K7j27L58J01l79m1J31J08n0J45l66K66
$$ plain form
7997 -239 -228 -113 -136 -48 -108 131 -58 -181 151 90 -31 294 -134 -64 142 -111 -105 -98 -28 -91 144 -144 -144 -167 -171 139
8023 139 -126 -65 -148 111 98 -308 -57 20 -235 -125 -109 -267 135 -67 -69 41 19 14 -6 -116 -49 323 -121 -214
8047 -214 322 -13 -11 -84 166 3 -152 147 -72 -92 -6 -77 46 91 170 -12 100 19 -198 267 78 90 118 96
8071 96 -178 27 78 2 6 -33 -54 -239 42 19 -216 -41 -163 101 135 14 124 -39 19 -32 -412 -156 215 -120
8095 -120 35 -38 76 206 12 -96 -85 89 -78 422 -21 -32 -169 16 -164 112 92 -62 -121 33 22 -286
8117 -286 -133 107 -75 96 -84 194 -217 -11 -329 -20 177 -42 83 194 -25 -38 -14 -62 128 204 -168
8138 -168 72 159 -294 -46 42 80 92 108 -166 175 -57 -80 -224 43 37 149 8 -26 -58 21 -172 292 -79 28
8162 28 298 145 311 56 -294 94 63 -126 -46 -56 -29 -156 202 303 -76 -117 14 122 72 217 -149 117
8184A17p3k02R1J3J24n7p5
$$ plain form
8184 117 44 -158 -67 -54 70 13 -62
8191f2
$$ Imaginary data points
##PAGE= N=2
##DATA TABLE= (X++(I..I)), XYDATA
0@%%%%%%%%%%%%Qj6J6j6J6k4L2l2M0m8N6p2Q3r1J06j26J45j65J89k16K45k77L12
35A65l49L91m39M90n45O07o77P48q24R13j009J112j228J353j488J640j807J992
53A045k198K430k695K996l342L747m227M807n529O449p661R340j1823J5861k3476
68a4276M2482j71877k65506N01821J14069l24874L5735J72104j30263M2205J60524
79A62144j63779j28905K17136K6729k09034K6340J33247m8242k7670P014o3786
90f8806N8081J27861j14252j35147J21698Q1082j01084q38M6534o7585K0258J06403
102G4205o0083o8290R4911J5165q6545N1860N5875r5589j7714Q7817m3799o8378
114f0565O6751K0096o8417J2897L3777k2871K1458K3011n2410P7O0378k1465k8008
$$ plain form
0 0 0 0 0 0 0 0 0 0 0 0 0 0 8 -8 8 -8 8 -16 16 -16 24 -24 32 -40 43 -48 58 -68 77 -88 101 -115 130 -147 165
35 165 -184 207 -232 258 -287 320 -357 391 -433 480 -529 583 -645 708 -780 860 -947 1045
53 1045 -1153 1277 -1418 1578 -1764 1983 -2244 2563 -2966 3483 -4178 5162 -6661 9200 -14276
68 -14276 28206 -143671 -409177 92644 206713 -118161 -82426 89678 -40585 1620 162144
79 162144 -1635 -130540 86596 113325 -95709 -69369 63878 15636 -12034 -5020 -68806
90 -68806 -10725 117136 2884 -132263 -10565 70517 -30567 -31405 15129 -52456 -32198 74205
102 74205 14122 -54168 40743 55908 -30637 21223 77098 -18491 -36205 51612 7813 -60565
114 -60565 6186 26282 -42135 -29238 4539 -18332 3126 26137 -26273 -26196 34182 12717 -15291
127a5291L9992k7736m4693P9846K6279j12017J0393J12245m8420q1184P7618L7100
139E4132q3906O676N9680m5471k3522N8392k0779n4763M6262L2208m5133K392
151a3832L1464k2675j259L5519k0147k5101L3037k809l6112K6040K0287m4534
163b0122l152L7634j5719j5809K8830q509k6338L1891J4956l9911P701L4430l0100
176d218k0883L9442N07l4582J5741J7829k3861N248K5681k0153j5108K6190L6
189A1869k0518J2821L849k2515R208J6289k0617m164K2254j1184j4077K4833M745
202A2793k6436J0480K1108j9830p431K2340o798j7283J4182M804j5416Q082J0551
215A1146j7147k513K0259o130j3658J0498J697j1817P179M847j4131K584J2112
$$ plain form
127 -15291 24701 -3035 -47728 32118 58397 -53620 -43227 69018 20598 -60586 17032 54132
139 54132 -29774 -23098 36582 -8889 -32411 25981 5202 -49561 -3299 28909 -16224 -13832
151 -13832 17632 -5043 -6302 29217 9070 -16031 17006 14197 -21915 4125 24412 -20122
163 -20122 -23274 14360 -1359 -17168 11662 3153 -23185 8706 23662 -16249 -8548 25882 -4218
176 -4218 -25101 14341 14848 -19734 -3993 13836 -10025 -4777 20904 751 -14357 11833 11869
189 11869 -8649 4172 8021 -14494 -5286 11003 -9614 -13778 8476 -2708 -16785 8048 12793
202 12793 -13643 -3163 17945 -1885 -9316 13024 6226 -11057 3125 7929 -7487 595 11146
215 11146 -6001 -8514 11745 5615 -8043 2455 4152 -7665 -486 4361 -9770 -7186 4926
228D926r747n773J5444j303j2285J0969P446j1796L783Q598j1703j684J4872p824
242C923j3999J2195O476j5258L78J2596p489n055R689m827o632J2198Q88j4646
256i563M748J1536p904m637Q101k300l862R420j834j0449R492P716j2623k025
270d184J1176m237o963O970q76q068O620M819j1156O47J0906n114o941Q066R03
285B568o933M898K962p121J624O583o088l002P825j443o263O103K073o840K838
300b16N183o354r47O975l529n232O542J471q016K723N820o261j846O675k669m744
316d425N815M52n748L210M007n476q03N858k744l512N209m7m886L973K587n422
332a952J127M728l570k853N398o47m819L625K044n539R75M477l840k202M513r49
$$ plain form
228 4926 -4821 -10594 4850 3547 -8738 2231 9677 -2119 1664 10262 -1441 -3125 11747 3923
242 3923 -10076 2119 8595 -6663 -6285 6311 -1178 -6233 3456 -1371 -8003 4195 5083 -9563
256 -9563 -4815 6721 -1183 -5820 2281 -19 -3881 5539 3705 -6744 2748 10464 -2159 -4184
270 -4184 6992 2755 -4208 2762 1886 -6182 438 5257 -5899 -5252 5654 540 -6401 1665 2568
285 2568 -4365 533 3495 -3626 -2002 4581 -1507 -4509 3316 1873 -4390 1713 3786 -3054 -216
300 -216 4967 -1387 -2334 4641 1112 -4120 2422 3893 -4123 -1400 4420 -1841 -3687 2988 319 -4425
316 -4425 1390 1842 -3906 -696 3311 -2165 -2968 2890 146 -3366 1843 1796 -3090 883 3470 -1952
332 -1952 -825 3903 333 -2520 2878 2231 -2588 1037 3081 -2458 -1483 2994 -846 -3048 1465 516
348E16l760L076K341m858R37M117k988j743M006r59k582L233O60l951K004L047
364C096l474q62L634j429k628K948N68l756K016K433m080l90L261j781k252L139
380D43ml070J799K384k737l39L159j577j405K715l10k498K594J069l114q8K670
397A691j651j180K651j217j979K802Q15l672P08K958j743j377J448n70r81K249
413I52m89k990J776K641j790j534K145j72q11J486q55j997J852K070k635j366
429a717K219J18j436R69k29n61J803P5k320N90K313j257j593J145m5j053R24L06
447B51j974O99J778q07j003J515j30o16N11J32j286R57Q37j510M08J504j105j044
465h83J931L43j611nJ439n42j054L49k86M9k1J56q82L77L96n70O47O1n93N76J162
$$ plain form
348 516 -3244 -168 2173 -2685 -1748 2369 -619 -2362 1644 685 -1897 1336 1996 -1955 49 3096
364 3096 -378 -1240 2394 965 -1663 1285 1853 -1903 113 2546 -1534 -1924 1337 -444 -2696 443
380 443 439 -2631 -832 1552 -1185 -1524 1635 58 -1347 1368 1058 -1440 1154 2223 -891 -979 1691
397 1691 40 -1140 1511 294 -1685 1117 1932 -1740 -1032 1926 183 -1194 254 -316 -1297 952
413 952 463 -2527 -751 1890 100 -1434 711 539 -272 1214 359 -1638 214 2284 -351 -1717
429 -1717 502 620 -816 153 -76 -637 1166 1241 -1079 -489 1824 567 -1026 119 74 -979 -55 251
447 251 -1723 -1024 754 -53 -1056 459 329 -287 224 356 -930 27 864 -646 -238 1266 161 -883
465 -883 1048 1391 -220 -225 1214 672 -382 -33 -319 -270 -291 -135 -1017 -640 -244 -814 -167 -106 -699 -123 1039
486A039j000j083J537R91j428o97R83J91J4R4o74k65O08L82m10n1l85l21M96P68
506G89j109j391J338P24r88j41M05K95l77L58R1l2N14N07j028k05K52P50N28j453
526a73r79J034J832r19k264K03K601l12j637k04O69J67o4j31r39K54J096K04j402
545i64L45J090N27j032q92Q66J173L45k322m08K082L68j148p62O48K24L5K25o36
564b36m97R10L8m99N2L14l52N00j46n43P9Q86n86j092J478P88j005o31R03p7k63
585B1K76j17n98L60J95k7J36J44j027M24N84l99l32O08K49j133M00J025j157n62
605i30J237K8q90j5R84q18M64M52o29j91Q53m32l88N55J28p94N90K45n63J66M07
626D59o55j64N21J46o66N10k47r2M32P6p89n9J132n98o92Q45K87r76N14N57m49
$$ plain form
486 1039 39 -1044 493 1484 56 -641 342 533 547 641 -33 -298 310 692 282 231 -154 -475 21 789
506 789 -320 -1711 -373 351 -637 -778 -373 -78 -455 -97 -6 -38 476 983 -45 -250 2 752 1280 -173
526 -173 -1152 -118 1714 795 -1469 -1266 1335 1023 -614 -818 -149 18 -46 -177 -1116 -862 234 438 -964
545 -964 -619 471 998 -34 -926 -60 1113 1458 -864 -1272 810 1178 30 -732 -84 140 175 400 -236
564 -236 -733 177 215 -284 -232 82 -270 230 84 -459 -380 506 -80 -1172 306 1094 89 -542 361 284 21
585 21 297 180 -418 -58 137 110 246 390 -637 -213 371 -28 -360 248 497 -636 -236 789 -368 -930
605 -930 307 335 -555 -570 414 -404 60 512 -117 -308 545 113 -275 280 408 -386 204 449 -114 52 459
626 459 -196 -360 161 307 -359 151 -96 -188 244 320 -469 -528 604 6 -686 159 446 -530 -16 541 92
647I2n99Q93j15m14J73O8l23K36N30o34P4K88l78l04R92n30m09L20J77n51j92
668f06R44m36j69K44L9j07J82K7m36K42K94N5n16N38j22k57K97J52k56j27M84
689D66o23n4M00j5k24o7L83l69J15R6m06J6J98K4j97K95P8K1l37N30l01j82J22
712c1K49j67j9R7k73K21K66m53P9K78l79J83k31K53OL21k67j94k25J91K77l19
734a37J68J7n5j15r1K98j90L00k37j26L44O6k03r8M16m94M22R1j48K3q0P6l48
757a01J11p3j44J37j68R3R1J10p7j51K1K29o2k3j49Q7R5j67N1j00L24O8q1nL6
782A52p5J20k6k73J15J28j02j70J39m6nJ47j65j94L12k64J83o0M03k61j76q5M55
805B52k97L5N6N9j89L74k24K8r0j76K18L5o4R6M5R6r2n1j8j49O2p7J7j21J20K09
$$ plain form
647 92 -507 386 271 -143 30 98 -225 11 541 -93 -19 269 -109 -413 579 49 -360 -40 137 -414 -606
668 -606 338 -98 -267 -23 16 -91 91 118 -318 -76 218 273 -243 295 173 -84 213 365 109 -18 466
689 466 -157 -211 189 174 -50 -117 266 -103 12 108 -298 -282 -84 -60 -257 38 116 137 -200 330 29 -153 -31
712 -31 218 51 32 129 -144 77 343 -110 -31 247 -132 51 -180 73 79 400 133 -61 -286 -95 182 -137
734 -137 31 48 -7 -122 -213 85 -105 195 -42 -168 176 242 39 -59 357 -137 285 376 228 251 171 247 -101
757 -101 10 -63 -207 -70 -238 -145 -54 56 -21 -172 -151 78 16 -7 -156 -69 26 -141 -90 -190 134 202 121 116 152
782 152 77 197 171 -102 13 141 39 -131 8 -38 -43 104 -61 -255 57 -207 -24 -84 319 58 -118 -203 252
805 252 -45 -10 46 105 -84 290 66 94 4 -172 46 81 17 113 158 254 162 111 93 -56 6 -71 -54 -175 -55 154
831A54k29J13J83k26j99L52n8O3J49n8R6l33K51l14j55Q4J79m7n1o8o8J69L5l14
855b92M09j90j19L53k57j9K60j80j97J57o2R2J97j38l45O17l18k7KRm4k5J47m2
879a2m5J26mn8k8P5q9M5L84m36M8j97K49k1j3j41J28K26m77j6M23l24P7K2J10
904E2Q1J15m00j84J23J35J45k01J09J05j43j80M42Qk85M4L47n40k0R9j09J15k27
927c69L94j20j61L26k02j9K23p9J65N3k41j83L56oj40M2k03M19o9J25l97M8J33
950I5k72J62p2J16k84M00m12J34k8J1K14J17l61J81j37m4J97j76K97l8M2k60J8
973a00K53k83Q1Q0k47J38k6M15j81j44J01k0n3K38k63j94N5J32k21M10k43K43
995A71l97J8J07j39K39OK00m25J84K26mj02Q3np9o3p9J34J60k73J93M2j48j64
$$ plain form
831 154 -75 38 221 -5 -204 148 90 153 302 244 340 7 258 -56 -211 -127 52 5 -46 -114 -182 -13 22 -292
855 -292 117 -73 -192 161 -96 -115 145 -35 -232 -75 -137 -45 152 14 -331 286 -32 -59 -57 -48 -92 -117 30 -12
879 -12 -57 69 65 7 -21 54 -35 10 394 -42 6 -191 58 37 24 -117 11 237 -240 -256 167 -157 -80 -58 52
904 52 133 248 -152 -336 -213 -78 67 -134 -25 80 -63 -243 199 207 -78 -34 313 -227 -247 -148 -257 -142 -369
927 -369 25 -95 -256 70 -132 -151 72 -7 158 211 -30 -213 143 137 -3 39 -164 255 186 311 -86 -38 95
950 95 -177 -15 -87 29 -255 145 -267 -133 -161 -150 64 181 -180 1 -136 -180 17 -159 138 100 142 -118 -100
973 -100 153 -130 -49 31 -216 -78 -104 311 130 -14 87 67 14 252 -11 -205 -150 -18 -239 171 -72 171
995 171 -226 -208 -101 -240 -1 5 205 -220 -36 190 186 84 167 162 83 20 -59 75 235 -38 155 197 49 -115
1019a15J31J1j79J32M0l65K10K06J34o2l15J38K01k82K37J47k74J85m78L14k2
1040fL1L3k33M03l20L16q2l3m2j62J7K1KJ5K7J48l96L06P2n27M31j99J36L4r2
1065a00o0J11lN9J9q4J43P7K0l40j0lJ84R6R2k91J76j02M4l7k0j66m7J95J80M5
1091A78k42j36K8J65k10K46j62M00m09J13p2Q1J51j58L05k79k40J94J16q8M8J70
1113A99k28L5L1K26j01k00L9p8K99k64MJ61l35J55q0K02p8j8k43M50l03O7j79
1136b39L74j86K5J02k72J89N6j05L0O5m6J14k28L7R0N4L1r0k2J57k30k6J93j72
1160i9L5O7qL76k15m8j86M5K66k22K4k06K58j09j30K06l8L8j11P5J3j77J87l0
1184A1p7O6j21k0K1J7q2Q6K9K90l29K8nJ0k6K31L0k66L08j11K6j52j04M0n4J55
$$ plain form
1019 -115 16 27 -152 -20 20 -345 -135 71 205 143 -172 -34 167 -115 122 269 -5 180 -298 16 -6
1040 -6 25 58 -175 228 -92 224 142 109 67 -95 -78 -57 -55 -40 -13 135 -261 45 117 -410 21 -178 -42 -8 -100
1065 -100 -160 -49 -52 7 26 -58 85 162 182 -158 -168 -171 13 109 201 -90 86 -16 28 -9 -29 -195 -242 -47 133 178
1091 178 -64 -200 -172 -7 -217 29 -133 267 -142 -29 -101 -20 131 -27 278 -1 -241 -47 69 -19 29 199
1113 199 -29 6 37 263 162 -38 1 -77 222 -42 -38 123 -212 -57 -137 65 -13 -31 -274 176 -127 -60 -239
1136 -239 135 -51 -26 76 -196 -7 49 -56 -26 39 -7 107 -121 -84 6 60 91 1 -21 136 -94 -120 73 -99
1160 -99 -64 3 -5 371 156 108 -78 -33 233 11 35 -171 87 -22 -152 54 16 54 -57 18 31 -146 41 11
1184 11 -66 0 -121 -141 -120 -103 -185 -99 -70 220 -109 -81 -86 -76 -102 129 159 -107 201 90 116 -36 -140 -100 -154 1
1210AJ4j14R5p0m2J01J9j89J48J27j48m6J69J15M0p8r3m3K05p2k09L06O2r0k43
1235c5J07k13J5O0j48J11n7Q6M4j99J38O6J83l63K51J58k95L70q4j90J09j32K4
1258FK3R9j31j16P2O2P1j3kq4q3N8K15k53J66l13J83k26K78M2n2N3J02k02J62
1283A17M1j13n6k37J72J73k21O3r5K66p2j9R9k43lJ06J14j85N5J54k80K13k17
1306a68J17J1J34k17J91L2j72k2Q0J81j16Q0l34J97K2Q4k97K81j27K36k56RJ42
1329H8M1l05K66k8k00J24k70L29j26p1K52kN7l3j18L8J01O6j48J31l75P3J41m2
1353a1j04mK59M0k02k30L37k24K06l4k45K89J88l63J62k37O8L19j90j08Q0P3k3
1376D6j05j5L20k36M7j09N5n2K83l40K87q7o7J85m0p2k22L93j05j95k62K26N7
$$ plain form
1210 1 15 -99 -4 -74 -116 -15 4 -185 -37 90 -58 -104 65 180 220 142 49 6 211 139 -70 236 298 208 -35
1235 -35 72 -141 -126 -66 -214 -103 -160 -74 -30 -229 -91 -25 158 -205 46 204 -91 279 195 5 114 -18 6
1258 6 29 128 -3 -119 -47 15 86 73 71 -13 -96 -38 177 -76 90 -223 -40 -266 12 54 2 55 157 -45 117
1283 117 158 45 -11 -248 -76 97 -124 -61 -156 110 38 19 118 -125 -128 -22 92 -93 -38 116 -164 49 -168
1306 -168 -51 -40 94 -123 68 100 -72 -94 -14 167 51 131 -203 -6 16 100 -197 84 -43 193 -63 -54 88
1329 88 129 -176 90 62 -138 -14 -284 45 -81 -152 100 98 155 122 4 42 143 209 61 192 -183 -110 31 -11
1353 -11 -115 -119 140 180 -22 -252 85 -139 67 33 -212 77 265 -98 64 -173 -105 214 24 -84 -4 69 46
1376 46 -59 -74 246 10 57 -52 3 -49 234 -106 181 94 27 212 172 100 -122 271 166 -29 -291 -65 -8
1399hJ43j86q1j7L05k4k34J04P2n96L79R4J26j07J7J25o6J48l2k14j20J96K9R
1423F2p4M2O3R6m07K74%m17L58n6R4N2j35O1O6j50J92p8p9j01L14n0l1k71R2K08
1449A25k9k17q0J55J32N7l79K52k3Q8o3J06k52j45L24m1l1O2J4j07j33L09l17
1472a93J63R2j42J91k30L09l11j7K55%j58J14j42K7J02j18P4N0M4k58j39K77K4
1495A4j25K43Po3o3J06o6K25m47L44j85k00L95j02k1J8j25K50j41oK81o14L79
1518A04j58J96l62J38q4K80j86l3M05l66K19k34K68k30j45J56jk20K31K08q9j75
1540g8R1j82K08J80k12lj29J89R5j53J15j10j88Q6k8N5K5o4R6J62k24J23j82O2
1564f6O8l8J8n3l8K1J1n2k5K88k47K71K2k83J40J01k36J58l7M8J52k40K73l62
$$ plain form
1399 -8 135 -51 -132 -149 156 132 -102 2 74 -522 -143 -49 77 -30 -13 112 46 194 162 -52 -172 24 53 62
1423 62 -12 30 93 189 -218 56 56 -361 -3 -59 35 87 -48 13 79 -71 121 43 -36 -137 177 127 96 -175 -83 125
1449 125 96 -121 -201 -46 86 143 -236 16 -7 81 18 124 -128 -273 51 10 -21 41 55 -52 -185 124 -193
1472 -193 -30 62 -80 111 -119 190 -121 -138 117 117 -41 73 -69 -42 60 -58 16 66 110 -148 -287 -10 14
1495 14 -111 132 139 76 13 119 53 278 -169 175 -10 -210 185 83 62 80 -45 205 64 58 339 -275 104
1518 104 -54 142 -220 -82 -166 114 -72 -105 300 -66 153 -81 187 -43 -188 -32 -33 -253 -22 186 97 -78
1540 -78 13 -169 39 219 7 4 -125 64 159 6 121 11 -177 -91 -119 -64 -39 -103 -7 155 -69 54 -128 -66
1564 -66 2 -36 -18 -71 -109 -88 -77 -129 -154 134 -113 158 180 -103 37 138 -98 60 23 71 223 -17 256 -106
1588a06J70k27K19P3l12J34J54j15K66l53l4O6N6J2j01K39j46j52j18L06p5N6
1610A2p4N9J04L8q1K82j73j86l8j0K76l46L45k37k01J28K7l1J0K27j62K60n31
1633c02L04M4k03J90J88k39j49J65J01j67K79k42L7J19k19J89p1J08l48L27J87
1654B98j76o0r7J75j60Mj43M9K65k34L2k8j31Q8J96l6j03N1P0J24k38J49k16K87
1678A66l39J98O7l11O7Q4J41J29J1j99r8K51l19J45k60L59k85J57N1r8p4J55K64
1701B62l3k03kJ42k04o6j09O5J42J7K4m0J9j17J80M10l69q9K15k13k44P8L60j54
1725G1Q7j39p1k7J56k54K7L70k50N5J77l11J49O9j93l1L9N05m18J02K5j71Q3K06
1749B56k18k8k88m2j9L19J29q3k52j9K36J07j63rO6J28j15j04J15m2j2o6N5o9
$$ plain form
1588 -106 64 -163 56 129 -183 -49 105 -10 256 -97 -131 -65 -9 3 -98 141 -5 -157 -275 31 -44 12
1610 12 -62 -3 101 139 58 340 167 -19 -57 -67 209 -137 208 -29 -230 -102 -75 -106 -96 131 -31 229 -302
1633 -302 2 46 -157 33 221 -18 -167 -2 99 -68 211 -31 6 125 -94 95 24 132 -216 111 298
1654 298 122 62 -35 140 -20 -16 -159 -110 155 -79 -47 -75 -206 -118 78 42 -61 -10 60 184 -54 95 -121 166
1678 166 -173 25 92 -219 -152 -68 73 202 213 14 -84 167 -152 -7 -267 92 -193 -36 15 -83 -157 -2 262
1701 262 229 26 24 166 -38 -104 -213 -148 -6 11 35 -5 14 -103 77 487 118 29 244 31 -213 -135 225 71
1725 71 158 19 -52 -79 77 -177 -150 220 -30 25 202 -109 40 109 -84 -115 -76 429 11 113 138 -33 50 256
1749 256 38 10 -278 -320 -339 -20 109 26 -226 -245 -9 98 -65 -74 -8 120 5 -99 16 -26 -38 -104 -49 -118
1773a18J1Q8K7M0J06r1l8Qk69J9O1M59m3m96J35K41l6j25j29L96m43J53M5o9j84
1798b52K88M6j33j63K61J27k75RJ01J65j25n0j89J01L64m87N08l84J10J75j17
1819H0k0j14j15K68r0O6j40k2j83M8O7K51o3J10o2J8j57L50l39m3Q6M4j64j0J58
1844B4l4J49J44l39LK53l30J61j89R7j39J60J4R2L9M4r4j94j03L82J12m40J84
1867dO0r5L1J76k32N6J95r5K0N8p2r7K4n5Q7K79k70j75k6P3K80j62rM6k57K05
1893D1Jp1J03l0K49k41M6j19J47o9O6l5j17j10L21j98l1O6L70m12J03K44k78r4
1917d8n2j57J00J88j47M8j72K38j31Q6j5nJ16p9Q1J88j20k18Q6J43k45K34Q8j49
1941E8q9J51n4j08K64p7j42K6J02j35l80L45j40J02K96l99L31Jk29J1L91k61l1
$$ plain form
1773 -118 -107 -19 8 48 154 63 25 33 -236 -217 -156 303 260 -236 -101 140 104 -21 -150 246 -197 -44 1 -68 -252
1798 -252 36 82 -51 -214 47 174 -101 -92 9 174 49 -1 -190 -89 275 -212 296 -88 22 197 80
1819 80 60 -54 -169 99 9 75 -65 -87 -270 -222 -155 96 33 143 81 99 -58 292 -47 -90 -4 40 -124 -134 24
1844 24 -10 139 283 -56 -53 200 -130 31 -158 -61 -200 -40 -26 66 105 149 55 -139 -242 140 252 -188 -4
1867 -4 56 -39 -8 168 -64 -8 187 92 112 170 98 1 25 -30 57 336 66 -109 -135 -62 218 56 47 93 -164 41
1893 41 42 -29 74 44 293 52 98 -21 126 57 123 88 -29 -139 182 -16 -47 19 389 -23 80 324 46 -48
1917 -48 -100 -257 -157 31 -116 -68 -240 -2 -133 -47 -62 -67 49 -30 51 239 119 -99 -13 130 -115 119 207 58
1941 58 -31 120 66 -42 222 145 3 29 131 -4 -384 -39 -179 -77 219 -180 151 152 -77 -66 325 64 33
1964C3o6J67k76J45J9J28r2k59K16J42j55M3j28l5K10K05%m70J78j30O4l31N40
1987A48j83R3j34J09n9j27J77l0R8r7n6J67q6j43J15L1j35K92k56J79k47K49N7
2010A62k21L9k72M81k77j83L54rl69M48k62J88q8P3J8j4j33M5N0P6l30K44K4k56
2034b12L94j55l82M32N1p8Q2k40n7L6J67J34j99qR9P4l1j66oj2l3q4P0K1j03J56
2060e0J10J74j75R4j45o9J32n3j23K22R5k87q1J82j33J07J34j34k3J20j06m2K34
2083A83k45m3k7Q3j30q6L73O2l83L35oj93K62jj07R7p4j52m5Q3j03J90k72L77
2107A78P9k9j47o6Oj27L70l06O3rj96L67j32l6R8l95J88J09j15M2J82J07l75P3
2131g1L05j18L0j20J0Lk50L01j37J42mP2k08J79o8j00j31Q9J51l37K57j23q6Q1
$$ plain form
1964 33 -33 134 -142 3 22 150 58 -201 15 157 2 45 -83 -118 92 297 297 -173 5 -125 -61 -392 148
1987 148 -35 58 -76 33 -26 -153 24 -6 92 -5 -61 106 20 -123 -8 23 -112 180 -76 103 -144 105 162
2010 162 -59 -20 -292 189 -88 -271 83 74 -295 153 -109 79 -9 64 82 68 -65 -20 30 106 -224 20 44 -212
2034 -212 182 27 -355 77 128 50 132 -108 -165 -129 38 172 -27 -35 64 138 107 -59 -65 -77 -110 -194 -124 -103 -206 -50
2060 -50 60 234 59 153 8 -61 71 18 -105 117 212 -75 -156 26 -107 0 134 0 -23 97 -9 -51 183
2083 183 -62 -105 -132 -49 -179 -265 108 170 -213 122 116 -77 185 184 77 174 100 -52 -97 -14 -117 73 -199 178
2107 178 257 228 81 15 21 -106 264 -42 21 12 -184 183 51 15 113 -282 -94 15 -100 -58 124 231 -144 -71
2131 -71 234 116 146 26 36 39 -211 90 -47 95 91 163 -45 134 66 -34 -165 -76 75 -262 -5 -128 -214 -133
2155a33o0L82j69p2n8K76j49KK12m16L35k19J12R5j39j21L84k97J28J77l14L2
2177a2P5J58k17j42J49j4J1J41K1o8j39J21k75L12J04m11L14j52J0k6j89L40j80
2200f9l8J72K0l14L16r8j62K8J50L8k6J16j46N%J62j36K28j58j4j61L30p4k37
2224f8K23k40K60P5k19O0p1q7K47k03j06J31K07l06L4j48O2M0o3k6J73R8R6k08
2248c9K33j53j24J21N4k78J91J00k02K16O4k59J24p2J56q8k53K43P4l8k77o1M46
2271A78j42J07j63k19N5K92m11L0M45j50RP2j59j73L08m07L93m7n4K27k50J76
2293A17K85l89K18j97o4L6r6N6P9j49r4J88n0L35k44q5J36j23k5j05L83l24M76
2316C64m6m03OJp9M5R5J27l6q1J19K1j09r3J15l3J78k2J43m36N75o48J83J29j0
$$ plain form
2155 -133 -193 189 20 -52 -110 166 17 19 231 -185 150 -69 43 138 -1 -122 262 -35 93 270 -44 -12
2177 -12 63 221 4 -138 11 -3 8 149 170 102 -37 84 -191 121 225 -186 128 -24 -14 -40 -229 111 -69
2200 -69 -107 65 85 -229 87 -11 -173 -145 5 43 17 133 -13 -8 -8 154 18 246 88 74 -87 243 169 -68
2224 -68 155 -85 175 250 31 91 20 -67 180 -23 -129 2 209 -97 -63 -211 -149 -109 -172 -198 -25 73 169 -39
2248 -39 194 41 -83 38 92 -186 5 105 -97 119 183 -76 48 -24 132 44 -209 34 108 70 -207 -268 178
2271 178 36 143 -20 -239 -184 108 -303 -273 172 22 31 103 -56 -229 79 -328 65 18 -36 191 -59 117
2293 117 402 13 231 34 -30 6 -90 -34 45 -104 -198 -10 -60 275 31 -54 82 -41 -66 -171 212 -112 364
2316 364 318 -85 -79 -78 -157 -112 -17 110 74 -7 112 133 24 -69 46 13 191 169 312 -124 451 -197 -14 115 105
2341A05j37N7j6J29M1k30M8p4J92l40J23R7q0J88j21j57LJ74K2J55k87K56j26
2364B2j27j62L14j75Q5k7J97q7k87K33j39J82J90k26Q4k10L1N4r4L0N5Q6j19P4
2388a6k45L08L7j17j52jJ37nM5r5j4Q4o7N8K06j38M7j96p9J64p4QN5j7K57l07
2414a17O0L7J42k00j18K36j46J27j39K52j29p4J86k07Q4N2J96r1j16j73J75K02
2436B39k74N0j50r5J51K95m32J98ml13J94K88k79n2N8j37L76K33n95O3K90Oj59
2459d9K85n1r7r7k09J87J40KL7k87L53l18r8J51K56j30J24j77j49L29j10m37L6
2482c09L04q7K08n5L02k57j42K4o8p7M33n14L23j61jq0J24r5K38j79K37k79J36
2505B5l02M25j34j93K71J6j0k00N2K32r3M8k59N6PrJ66j45K76m05K67r4m8n2K9
$$ plain form
2341 105 -32 25 9 138 179 -51 -3 -77 115 -225 -102 -5 -85 103 -18 -175 -172 2 24 179 -108 148 22
2364 22 -105 -267 47 -128 -43 -70 127 40 -247 -14 -153 29 219 -7 77 -133 -102 -48 -142 -112 -57 29 -90 -16
2388 -16 -261 47 84 -33 -185 -186 -49 -54 -9 -104 -118 -34 -101 -43 163 25 72 -124 -203 -39 -113 -105 -50 -67 190 -117
2414 -117 -57 -20 122 -78 -196 40 -106 21 -118 134 5 -69 117 -90 -6 46 242 151 35 -138 37 239
2436 239 -35 15 -135 -230 -79 216 -216 -18 -22 -335 -141 147 -132 -184 -126 -263 113 346 -249 -186 104 110 -49
2459 -49 236 185 88 -9 -218 -31 109 111 148 -139 214 -104 -202 -51 205 75 199 22 -127 202 92 -345 -309
2482 -309 -5 -92 116 61 363 106 -36 -12 -80 -157 276 -238 85 -76 -77 -157 -33 -128 110 -69 168 -111 25
2505 25 -277 148 14 -179 92 108 98 -102 -50 182 89 137 -122 -66 -59 -68 98 -47 229 -176 91 -3 -51 -103 -74
2530g4J0J65k65K45L3k60K77kk8J25k23k41J22J03O2r1j14J22k54K40J68M7l47
2553a80L73k47J57L3K3q3P0k25qm5J55J02j82J4J11r4J75j92m7J87p8K03j87k22
2577a87J72n6J15J5j20J87j5j29K01k50K05l55N7K97k23J5J4j34L44r4j11J38
2599H6j49J15o6K10k77k7j84K35K29j79l38M08j47K11j25N8k47m4M28k17M3J17
2621A40j44j35o1J71jO9J48k70k64L60o5k2J66k09K42l03L43k9k30K95ol3q1P0
2645A51k97K90P5k03j08J58J52k48J9k9L0j17LJ55j95oM02k77j95K67P1k77M5
2668a34J7K20j9k74L60k38j41N5K96j32J17MP9j22J54k05J13k71mL90p5j72J83
2691B01mk74K31j21J07L9k55L17M3j66k42K28m9k77R9K69n6k52L06j91j4j37J05
$$ plain form
2530 -74 -64 101 -164 81 114 -146 131 129 101 226 3 -238 -116 -13 49 -42 -156 -34 -288 -48 120 167 -180
2553 -180 193 -54 103 136 159 76 146 -79 -87 -132 23 125 -57 -43 68 -26 149 -43 -90 97 19 222 35 -187
2577 -187 -15 -71 44 59 -61 126 111 -18 183 -67 138 -217 -160 137 -86 -71 -57 -191 153 59 -52 86
2599 86 -63 52 -14 196 -81 -108 -292 -57 172 -7 -345 63 -84 127 2 60 -187 -231 197 -20 23 140
2621 140 -4 -139 -200 -29 -30 39 187 -83 -347 13 -52 -74 92 -117 125 -178 165 136 -94 201 195 162 81 151
2645 151 -146 144 219 16 -92 66 218 -30 -11 -40 -10 -127 -124 31 -164 -170 232 -45 -240 27 98 -179 -134
2668 -134 -117 103 84 -190 170 -68 -209 -154 142 10 127 131 210 88 242 37 150 -121 -125 265 190 18 201
2691 201 197 -77 154 33 140 179 -76 241 284 118 -124 104 55 -222 -123 146 90 -162 144 -47 -61 -198 -93
2714i3J65PK5k30J09j32R0J71qq3K09l29J38n6J21j30l6K22M7j59j79o2J37Rj1
2739e8J88j42K61j24qj04Oj20K27O8l54K0M5K5J21j83n3K14k88J07L15k86R5O2
2763C4K3p4r2O7l5R6M2j26L9K40l83K80K0j76K22l35J37J92Kj18O6R2k67L0q4
2788a08K21n4j76J79k11l7K00P3j64N8j10K25M8j80p8K24l10m4K19k5Ln8J33R7
2812A25k07j54L04k0%r0J33j00K0j09J42J29j84pk8K38k05o3r6J54j15K70l63
2835b26J14J44k31K10j0j14k7K30J30k46m8K2O5k09M2L01k73J74o0q8Q2N1k2L04
2859C15l55J12J20k88L7J01J3l41L67j94L70j59k43L68j84K76k19k72J48O3k24
2880a89J46K11j30n1O2j92m1J49m4J80p5J93k98K27k21K78mj02j52k35L46n1l
$$ plain form
2714 -93 72 79 104 -126 -17 -149 -59 112 104 21 230 -99 39 -17 104 -26 -62 160 207 48 -131 -193 -56 -47 -58
2739 -58 130 -12 249 125 117 13 19 -101 126 194 -160 -140 -95 -70 51 -132 -185 29 -259 -152 163 -123 -28 34
2763 34 57 -17 -109 -42 -77 19 61 -65 -26 214 -169 111 131 -45 177 -158 -21 171 173 55 121 213 -54 -24 -108
2788 -108 113 59 -117 62 -149 -186 14 87 -77 -19 -129 96 144 -36 -114 110 -200 -244 -25 -50 -47 -105 28 125
2812 125 -82 -236 68 48 48 -42 91 -9 11 -98 44 173 -11 -18 -46 192 -13 -76 -172 -18 -133 137 -226
2835 -226 -112 32 -199 11 1 -113 -140 90 220 -26 -74 -52 13 -196 -154 147 -126 48 -12 -100 -18 33 11 315
2859 315 -40 72 192 -96 -59 42 55 -286 81 -113 257 98 -145 223 39 315 96 -176 -28 35 -189
2880 -189 -43 168 38 -13 49 -143 -184 -35 -79 101 26 219 -79 148 -73 205 201 99 -53 -288 58 7 4
2903DR9k59L1K10j19J07M8J7j43J58O5m3r0q1j03%K28j28K43l94L35l3j43J98
2927B07j51j58R4K54j99j38pJ68j03K53k37J85p3j84N02l53K33l31j09K39Mk43
2949a47K07jR0k04P0L3Qj42l4L32j18j30nk98m4M88l09M3J15P6J01j91J72j53
2973d1L61l44L9o3P9j38L1J41k93J08K37j73P1N4l6j42J71L6j89J62n8r7J6J16
2997D8k63O2K25m5j9nJ20QJ36Mm42J94j89J59R7l22J17N4k43J9L96J2n9k38K29
3022E5J32j95J10Q4m5k17L4n2J83o3k01K8J61J63j5n3o2j12j33K59K6n0Q8j65
3046d0J01k35M02j93M0j85k3j07J92j95L00k5k60L92p8PP6k51K43l0J00m24L44
3069A51k02J7J04JO9k01p0J65M6j22N4n8J01Lj25l8j43K41l8K83p4k32J11J3O6
$$ plain form
2903 4 103 -156 -125 85 -34 73 121 138 -5 153 218 175 85 4 -99 -99 129 1 244 -150 185 152 9 207
2927 207 56 -102 -8 246 47 -91 -98 70 -33 220 -17 168 95 -89 413 60 293 -38 -147 92 96 -147
2949 -147 60 59 149 -55 15 48 56 -86 -120 212 94 -36 -41 -339 -383 105 -204 -161 -46 30 131 -60 112 -41
2973 -41 320 -24 15 -48 31 -107 -76 65 -228 -120 117 -56 15 69 33 -109 62 98 -91 71 13 -84 -68 48
2997 48 -215 -153 72 27 8 3 123 131 267 271 -171 23 -166 -7 90 -232 -115 -61 -304 -285 111 123 64 -174 55
3022 55 187 -8 102 186 141 -76 -42 -94 89 26 -175 -147 14 177 162 109 47 -65 -198 61 87 37 125 -40
3046 -40 61 -174 228 35 75 -110 -133 -240 -48 -243 57 32 -228 164 86 93 169 -82 161 131 231 -193 151
3069 151 -51 -34 70 71 140 -61 -131 34 80 -42 12 -46 55 58 -67 -105 -248 -7 -45 238 164 -68 43 56 122
3094A22j06J22j17k00J55j14J61J02j78M8rJ59l94K96k70J70J2j42J09J93j90
3115g1q3J49K54k63K7j99M52l36K48l2j53j82K89k03P5L1Jj25O3K01k36K08L53
3138D68m68j60K48l0k9q0Q2q2K23p0l0k95M15m30K41O5j7j98J45P3mj08Nj00o6
3163b02K35p7Q6j91J81J40J34l67J56k44N4J09j59M35l10O0j59o5L86k65J51j
3185H7k78K34k76j45K22L28j94J64Q4j90k16J53J2m3K51q9k34K7j3K20j18q7J03
3208Bp4N9j83K12j84N25m73%r2L32j12K0m2J70p2k08%J32k2L00k22k8MN4j29K82
3234B51r8Nj97n0J38j1M2j9o7M3j88j8J90jJ04k24R7J82M3k17J24J17k57Q8j75
3259i8P6j34Q0m4l8K58k18L08j57K8l34J96J97k63j3K03J44k56L08q8o5M1J48
$$ plain form
3094 122 16 138 21 -179 -24 -138 23 125 -53 -5 -14 145 -249 47 -223 -53 -41 -183 -74 119 -71
3115 -71 -154 -5 249 -14 13 -186 266 -70 178 146 -7 -189 100 -103 -28 3 4 -121 -58 143 -93 115 468
3138 468 0 -160 88 58 29 -51 31 -51 172 102 72 -223 192 -238 3 68 51 -147 -2 71 67 -41 -36 -136 -202
3163 -202 33 -44 42 -149 32 172 306 -61 95 -149 -95 14 -145 290 -20 40 -119 -184 202 -63 88 87
3185 87 -191 43 -233 -378 -156 172 -22 142 226 36 -180 -27 -15 -58 193 104 -130 -103 -116 104 -14 -101 2
3208 2 -72 -13 -196 16 -168 357 -116 -116 -208 124 12 32 -10 160 88 -120 -120 12 -10 290 68 40 44 98 -31 251
3234 251 153 158 -39 -89 49 38 80 61 -6 37 -151 -169 21 20 124 -100 -3 179 222 5 129 246 -11 77 -98
3259 -98 -22 -156 -76 -120 -158 100 -118 190 33 61 -273 -77 120 -143 -156 47 191 -65 243 155 90 131 279
3282B79k55j62K04J28J04m44L33Q0k67L3K23k86J5j72j51M15pK1r4j00L02j38
3304F1j62L46r6J8m8q6J77k74k9L90j85l5R9j67Oj91Q3J1P0J12j27n9k4J23oN1
3330E8p0r2J74J2n1ok01L02l01J70%k67K05J45K0l9j83K46k30KJ84K3k59R6j43
3355b05J85j19N4K73k13l1n6K33j59J0L52j79k85K17j29L1J07R5l21L47k93K1
3377f5J52P7q8l7k2Q5j07O5k5o6j41L59l66J58Qr5K07j76L15j65j9l59L54r0j0
3402e1J3j80L75k31J43J7o6N5j74Q4r4J93n0J52j05J19k02J14j04j16K17r2Q5
3425A02M6Q3k72k10M62k88K20Q0l55L22j49j92P0J86j33q3j36J58K37j85j75J16
3447i6J05J03j44O0l4L4j66j46N03k34J88j85j8pO7J51m7M8r8j93J64l08J55K48
$$ plain form
3282 279 24 -138 66 194 298 -146 187 267 0 33 256 -30 -15 -187 -338 77 70 91 -3 -103 199 61
3304 61 -101 245 149 167 119 33 210 -64 -93 297 112 77 176 9 15 -176 -93 -82 -12 100 -27 -86 -110 13 7 58
3330 58 -12 -104 70 82 31 25 -176 126 -175 -5 -5 -272 -67 78 98 59 -124 122 -108 -106 78 101 -158 -62 -205
3355 -205 -20 -139 -85 188 -25 -56 -112 121 -38 -28 324 145 -140 77 -52 -21 86 181 -140 207 -86 -65
3377 -65 87 164 76 39 17 102 -5 60 35 -31 -172 187 -179 -21 -13 -108 99 -77 238 73 54 -305 49 -41 -51
3402 -51 -38 -218 157 -74 69 86 20 75 -99 -15 -109 84 34 186 81 200 -2 112 8 -108 109 17 102
3425 102 148 231 -41 -251 211 -77 143 223 -132 190 41 -151 -81 105 -28 -111 -247 -89 148 -37 -212 -96
3447 -96 9 112 -32 28 -6 28 -138 -284 219 -15 173 -12 -30 -37 30 181 134 182 84 -109 55 -253 -98 150
3471A50j85K87n5j39K07k95K3KJ08R2j20r9R2q0j37J35Pj12K41q1j39K18L7k28
3495g1J51O9j1q9m7j8J03k76K75j28J50j5k13K56r4k23MJ42J53p7n3l2O5r1n1
3520a21N5L98l23M7J30k48N3q9J65j44K00n4p6k64N18N5k61j16L32k31qk0J56
3543A54L8Q9m35R3K24R5k14L00m28J30l3Q1k03N9R3m91O40k20j30KP7M4m1lJ21
3568D2j82K69j47j02K60p8O0j27J30L9k09K9j54K46j0r1J81j9k09J3J40k13L01
3591A69j67K5P8k38K07k8r3J22k12R1K31j44J88j40J24j72O0k53P6K11k96K31
3613G0n7l1N6j41J58j42P0lK1J7k8R5q0R8j00o2j07J85l33L74j42K88k94O3K97
3638B72k68M4k4r4j6J56m5K3K7k40J21RO0Q3K60l43q3q7O2l03L42j1K48j29p4
$$ plain form
3471 150 -35 252 197 58 265 -30 -7 -5 103 195 75 -24 68 -12 -149 -14 -7 -119 122 41 -98 120 157 -71
3495 -71 80 149 138 49 2 -16 87 -189 86 -42 108 93 -120 136 42 -181 -177 -35 118 41 -12 -44 21 -70 -121
3520 -121 -66 332 9 56 186 -62 -9 -98 67 -77 123 69 -7 -271 247 302 41 -75 257 26 18 -2 154
3543 154 192 281 -154 -61 163 258 44 344 -84 46 13 94 -109 -50 43 -448 192 -28 -158 -156 -79 -35 -76 -79 42
3568 42 -140 129 -18 -120 140 62 122 -5 125 164 -45 -16 -170 76 66 -25 156 137 -72 -59 81 -132 169
3591 169 2 27 105 -133 74 46 -47 75 -137 -46 185 41 229 89 213 41 101 -152 -76 135 -161 70
3613 70 13 -18 38 -103 55 -87 -17 -20 1 18 -10 85 5 103 3 -59 -166 19 -314 60 -82 206 -88 -25 272
3638 272 4 48 24 -70 -86 70 25 48 75 -165 -44 -35 25 108 368 25 -58 -145 -83 -386 -44 -55 193 64 -10
3663a0R0q3K53j99K3k56J44J24J78j98n6p8J70qM9p3j85j18L85j95j2l2J99Ml98
3688b82L2K70k8J01L84o21J65j21q9L44k50r4L49k92K86r6j72J20j44K44j62R3
3710C7K39j78j54Nj30L35M1n7m01K45L3K69r1k51J00k23P4Q7Jk5L69j09j85j08
3734g7J10l3m8n1m0K24L4M5l9k96K26l8j07J30J22L06m09Lj15l9K32p8K63l83
3758e8P6n7l5J76K21k84P3k02M4J7K1J35j01r2J68j56J79m13J66L76P1j96J95
3781C24j37k17J51j77O8nJ9J83j76K2r3P9J85l63J86l6J00k37L91j93m28M22j02
3804c4J41l7k4P6kj99K06Nr1r3NK38o7j35j85K52q8p2J58k02J11n6j24N1L34l93
3830b25K62J46j74M4J46l22m8L22j29P8r1l0M6r7J31j7j9R1j65J6J95j16k83L00
$$ plain form
3663 -10 80 -3 250 51 74 -182 -38 86 264 66 10 -68 102 94 143 70 -115 -233 152 -43 -55 -87 112 116 -282
3688 -282 -250 20 -8 93 477 -144 21 -100 -189 155 -95 -189 160 -132 154 58 -114 6 -138 106 -56 37
3710 37 276 98 -56 -51 -181 154 195 138 -263 -18 15 284 193 -58 42 -181 -107 -20 -19 -44 325 216 31 -77
3734 -77 33 0 -48 -99 -139 85 119 164 125 -171 55 17 -90 40 162 468 59 62 -53 -92 140 62 325 -58
3758 -58 18 -39 -74 102 323 39 112 -90 -46 -29 -8 127 26 -66 102 -54 125 -288 -122 254 325 129 324
3781 324 187 -30 121 -56 12 7 26 209 33 55 -38 41 226 -137 49 13 113 -124 267 74 -354 68 -34
3804 -34 107 70 46 122 120 -79 127 132 41 -52 -47 191 124 -11 -196 56 -32 -104 54 -148 -37 -93 -217 -166 168 -225
3830 -225 37 183 9 53 199 -123 -171 151 22 100 9 -21 25 -72 59 42 23 114 -51 -35 160 44 -239 61
3854F1k46L7J49n8l6J11n8R5kj80L20o1r8J4%J39l40L01j98J18ln7nj70K55m7
3880D1K7j48R2K36m02K2J57j6k2J21j17p3R4k21K33L19m69L76k82N1O5j24m4n3
3904a37L16k54J18q8n8n1J48J82j92j23J08J67r3mj90J46j64K81j89K36m02K80
3926C7k34k2M70k06j40K48m4J4k76K79j65O3J27j62R9j00pK0j2j05J45P7j48M2
3950@q1O7j65P2L6N9P4K44l11J28k17K22k17p6J20m7J05q0P0Qk00J08O5K1J31
3975A36J2L9k78p6R5p8L4J25J36j36J40k09J72o6p1K17k84k8P9l0R6J9J40j29
3999E5p9j0o6J3K34k27K70n9Rj54K14j70j33J09j53j6J65j67J95q7K78m39L43
4022A25m1J01k58k53L94k06Q8J8J46jk49jL33k57p5J51k3L1P0r7q9J26J29l2o3
$$ plain form
3854 61 -185 -148 1 -57 -93 18 -40 55 53 -127 193 132 34 48 48 187 -153 148 -50 68 65 8 3 -167 88 41
3880 41 68 -80 12 248 -154 -132 25 9 -13 108 -9 -82 12 -209 24 343 -126 250 -32 19 84 -40 -84 -137
3904 -137 179 -75 43 -45 -103 -154 -6 176 -16 -139 -31 136 43 39 -151 -5 -169 112 -77 159 -243 37
3926 37 -197 -219 251 45 -95 153 109 123 -153 126 -39 24 151 -11 88 -12 -19 1 -11 -116 29 106 -42 0
3950 0 -81 -14 -179 -107 -71 -12 62 306 -5 123 -94 128 -89 -165 -45 -92 13 -67 3 11 -189 -81 -16 5 136
3975 136 148 187 -91 -167 -72 -150 -116 9 145 9 149 -60 112 46 -25 192 -92 -120 -41 -71 25 44 184 55
3999 55 -24 -34 -100 -87 147 -80 190 131 140 -14 200 30 -103 6 -147 -163 2 -165 30 -57 221 -218 125
4022 125 84 185 -73 -326 68 -138 -50 -32 114 113 -136 -137 196 -61 -136 15 -8 23 93 -4 -93 33 162 130 67
4047F7k88K07K20j44j33r9m0K75p6r0L6J8o2M8J15j52J89l43J61P6J09N5o1J44
4071B32j11l01j62N38l75L18j35j49J08J11J16j18q3j21K81j68O0M8Jj92K40J13
4093B51k79j19L82l43j74L00j79J89k67J78K61l33P0O4R5O9j55J12j23R9L7j59
4115b4K61j31j99r2L20l5k17%J18K05N8j05j29j88L39k22O0R2L0j51K27l59ML19
4139A81j69L3j96L94j39R4k52o9pQ4J29k10J57M0k38L3m9R8K22j46Q3o0j59J91
4163D5j26O0o0J3N8Q0J69m74K41K68k02J05j93K08j85N2k10L00k5k31N1Q1O6j81
4187i0M2N6j5J03q1j6j85K35N6l81L53L1N7l54K62j64Q1J0J6p7j54L99m25J48
4211i3L6j5P6p3j58J10l1j7L6J9K10K46n15J67P7k33K16j24O9k61M89l21K07M6
$$ plain form
4047 67 -221 -14 206 62 -71 -170 -210 65 -11 -101 -65 -47 -109 -61 54 -98 91 -252 -91 -15 94 149 88 232
4071 232 121 -180 -342 196 -179 139 4 -145 -37 74 190 72 -11 -132 149 -19 41 89 90 -102 138 251
4093 251 -28 -147 235 -108 -282 18 -161 28 -239 -61 200 -133 -63 1 96 165 10 122 -1 98 135 -24
4115 -24 237 106 -93 -185 135 100 -117 -117 1 206 264 159 30 -158 181 -41 19 111 141 -10 217 -142 -138 181
4139 181 12 45 -151 243 104 198 -54 -123 -130 -46 83 -127 30 70 -168 -135 -184 -86 136 -10 73 13 -146 45
4163 45 -81 -21 -81 -68 -10 70 239 -235 6 274 72 177 -16 192 7 59 -151 149 124 -107 -56 25 91 -90
4187 -90 -48 8 -7 96 15 -1 -186 49 105 -276 77 108 165 -189 73 -91 -10 0 16 -61 -215 184 -241 -93
4211 -93 -57 -72 4 -69 -227 -117 -148 -165 -129 -110 100 346 -169 -2 75 -158 58 -66 3 -258 231 -90 117 163
4235A63k25R2NJ50k08J47k18K46j92K02j42L23k77P2j09q4k0J27j79J88k76K00
4257a5o8K12j46K46J9k19R8o3O7l9p7J34j46m6J89l9k83K81k29N3j0M79j85l43
4281a30q3L01p8N1jq2J14J45n7j89J26m50K17L57k67K4O1Jm9j30J88R8r3l53K47
4306c2K31j17J01j44O1l2J0J74l48R8j42K14P2j98L05k19J17j35R5L1k9K9j82
4329d0K05j19Pj12k78M51j44k53L84j66L35k25j46K29r3j9J29k44O6K42l03K38
4351A44j79n6k47J43J31m3K84J24k53j17L40k48K9m6L29m18O2K40k81J4l4J29
4373D7N8j1j31j45M07k45N6j79l2J29r3K90j22K2j15J2J89j16j37K36k77Q1j38
4396b14L99l10j59L00J44k3k25M55m62r4M59m15L20Rk91j31J94Q9L6j34j92J65
$$ plain form
4235 163 -62 30 35 185 -23 124 -94 152 -40 162 20 343 66 138 29 -55 -75 52 -127 61 -215 -15
4257 -15 -83 129 -17 229 248 29 127 64 131 92 15 149 3 -43 146 107 -176 105 -124 -71 -81 398 213 -130
4281 -130 -213 88 10 61 60 -22 92 237 180 -9 117 -333 -116 241 -26 -2 59 60 11 -119 69 167 74 -279 -32
4306 -32 199 82 183 39 100 68 78 252 -96 2 -140 74 146 -52 253 34 151 16 111 142 113 142 -40
4329 -40 165 46 53 -59 -337 114 -30 -283 101 -65 270 45 -101 128 35 16 145 -99 -33 209 -94 144
4351 144 -35 -91 -338 -195 -64 -107 177 301 48 -69 271 23 52 6 335 -83 -21 219 -62 -48 -82 47
4373 47 105 94 -37 -182 225 -20 36 -143 -175 -46 -139 151 29 51 -64 -52 137 21 -116 120 -157 -76 -214
4396 -214 185 -125 -284 16 160 137 -88 367 -95 -189 270 -145 175 184 -107 -238 -44 45 81 -53 -245 -80
4418h0k86L35K32j44j46k5J05p3k8J93N8l98J34K32M7j56k29J24Q9Q9Q5k49P8
4441a3J18qm3O3l09J81j12M8jj5r9K53j70l6j6J09m8k4N02m99K64k53K58k59J79
4466G0j71K15j08M1r5L7P1j07P0Q8j90%K29j54J42l01J03J36j75J60r8k9J97k06
4490g5k8L1q2K62r5k46K70J32j24q6j32L75j88N8o0p2k04P5M0K07j36R9J05k49
4514a23K55m43K62K06j78n7J85l10L6K02J61p3l67Q1qK13M4L15m03n1K02j11j1
4537B7m6j40J35j09L77k33J61l14K42r2l0J15k51K31L6j25J6rj44L2L29m52K83
4560C9J0K5j46L7P2J92j09k10J04j80J52j9J3K6j1k61R0J57J32p7m2J18l07M7
4584a48o9L60m2m6k54K54r4J41p3M2j42k05K04R8j79K18L3P1l45M56k65j44J57
$$ plain form
4418 -80 -366 -31 201 57 -89 -114 -9 -82 -110 83 141 -257 -123 109 156 0 -229 -105 -16 73 158 -91 -13
4441 -13 105 97 54 117 -192 -11 -123 -75 -76 -91 -190 63 -107 -143 -159 -50 -98 -122 380 -119 145 -108 150 -109 70
4466 70 -101 114 6 47 -48 -11 60 -47 23 111 -79 -79 150 -4 138 -163 -60 76 -99 61 -37 -66 131 -75
4490 -75 -103 -72 -154 108 13 -233 37 169 45 -41 -173 202 14 72 12 -60 -264 -189 -149 58 -78 21 126 -123
4514 -123 132 -311 -49 157 -21 -78 107 -203 -167 35 196 123 -244 -163 -171 42 86 401 -2 -53 149 38 27
4537 27 -19 -159 -24 -133 244 11 172 -142 100 8 -22 93 -158 73 109 -16 0 -9 -153 -121 208 -244 39
4560 39 49 74 -72 -35 37 229 120 -90 14 -166 -14 -33 -20 6 -5 -266 -176 -19 113 36 -6 112 -195 -148
4584 -148 -217 143 101 55 -199 55 -39 102 29 71 -71 -276 -72 26 -153 65 98 169 -176 280 15 -129 28
4607B8p4P6j73m5K27k60J44K33l7O4j83NJ70M0k01k0k18L30J54j82j2j56r3R7
4631h6K69k35l1J86j62m1R5j24L20l09j33J21K51K30n43K61p6r1K65p9J09r7o7
4654C3m0j47L78j43P3K0k51J51k27R4K2K10j47n9J68l25K90O2k30J19m5r2P4M09
4678C97l78J61j63q7j97M11j29k91L11q5k24K92j9l39J71N1K21j47L33m84K15
4699B0M6n3L33m73J41R2j17q1J56K12l92K78o6j08M4K06n1j8r2j9l12L8L79j54
4723IJ6M7p0J24j92P2J10p0J2J96k77K0J71q8k39J8J17R3j20j76K58r3q2J95j65
4748a14J89J54k07p4J9k6j6P8k17K93j02K50j49J20j85r0R1Kj33K07j01J66l74
4771b19j3kJ45k54J51O8J85M2p0k64M77n1j90J67l3l00L3K72j49P6j9P6k59M5
$$ plain form
4607 28 -46 30 -143 -188 39 -221 -77 156 119 183 0 5 175 215 14 -6 -224 106 260 78 66 -90 -183 -86
4631 -86 183 -52 -83 103 -59 -100 -5 -129 191 -118 -251 -130 121 351 -192 69 -7 -98 167 88 197 100 33
4654 33 -7 -154 224 81 154 174 -77 74 -153 -59 -37 173 26 -33 135 -190 100 162 -68 51 6 -86 -12 397
4678 397 19 180 17 -70 -267 144 15 -276 35 -50 -274 18 -1 -340 -169 -118 103 -44 289 -195 20
4699 20 66 13 346 -127 14 106 -11 -92 64 276 -116 162 96 -12 32 238 187 169 77 58 -254 -216 163 9
4723 9 25 72 2 126 -66 6 116 46 58 254 -23 -3 168 80 -159 -141 -24 69 -51 -227 31 -62 -144 51 -114
4748 -114 75 229 22 -52 -33 -59 -75 3 -214 79 -23 227 78 198 13 -77 14 16 -117 90 -11 155 -219
4771 -219 -232 -234 -89 -343 -192 -124 61 103 33 -231 246 195 5 172 139 -161 -128 144 -5 71 52 128 -131 -86
4795h6J62j19K38j46l3j38K94p4l81K80j0j69K67k64K10R2J69l58J01K5j97Nj4
4818a46L81n8l06J90r2K40j0J08l09K04j51J08l49L50m44N35r4k17OJ54%k86J51
4841c5l0M9R0k49K0K28r6n7k4K71j53P9j88j91J40J22J84K38n04J7j0J50Nl23
4865b67K51L4j54L73j51Q1j83l1p7J63O3k36j03K50k17K62k64j35L14NJ35j32
4887a9j95K24k11K60K05m06J53p5q5O3k9PO4Q0j30k5p3K26q4mk1K78k5j03k83
4912b08N2N4J92R3j48J36q2k26K60l1l35Q6K06R5r2J89l96J55L9K8N2k64q9J17
4936a17oJK12l8k2j8j36J39n6j04jJ76k9Mj42J01M9l9k07J61L1j75J44rK20o3
4962G6k06L59l47J99o1j03K5N0o6m3k2j6K49J20nk41P2j68J24m8K83j80K6J45
$$ plain form
4795 -86 76 -43 195 49 16 -122 172 98 -283 -3 -13 -182 85 -179 31 123 292 -66 35 60 -137 -132 -146
4818 -146 235 177 -129 61 -31 209 199 307 -2 202 51 159 -190 160 -284 251 157 -60 -54 100 100 -186 -35
4841 -35 -65 -16 74 -175 -155 73 -23 -80 -104 167 14 93 -95 -286 -146 -24 160 398 -106 -89 -99 51 56 -267
4865 -267 -16 18 -136 237 86 167 -16 -47 -124 39 102 -134 -237 13 -204 58 -206 -341 -27 -22 113 -19
4887 -19 -214 10 -201 59 264 -142 11 -64 -149 -86 -115 -108 -44 36 -94 -119 -192 34 -50 -54 -75 203 178 75 -208
4912 -208 -156 -102 90 183 35 171 89 -137 123 92 -243 -157 49 144 52 241 -155 0 39 67 119 -145 -234 -117
4936 -117 -123 -122 90 52 30 12 -124 15 -41 -145 -146 30 1 5 -137 -36 13 -26 -233 -72 -41 -216 -72 -81 139 76
4962 76 -130 229 -118 81 20 -83 -58 -8 -74 -117 -139 -155 94 214 209 -32 40 -128 -4 -52 231 51 77 222
4986B22l56J47k66J77K05j02l34L25J93l2k09j13R2J86j77J14q8J09k72n1L17
5007H7o8M2K15k99j11j17K69j37N0j23O7N10k27j99K2M9l26O9J04J50o9J32j79
5030h9J83J05j46j34K1K02r5K09l19K38k65J62k5j06N4q8m5RQ0L9k2l6n6O7Q1
5055B4j26O0J1R3J09J9l79J53N1p9K17p6J68l53J1L75k22p3J51j92M4j03J11p3
5079g9k26P11l55k35J70N4R1k57J43p4N6j60O9J1J70j59R3K78l56P9m9n2j28J44
5103f1k20J34J55j11K1J22J84j80o0q7L04k87j30J08K52j42R5j78R3np0J01j20
5126h2Q8p5L3J51k5O7l02qJ24J22J2j26Q4L7q0J55k40P1j66K50J0J29k28Mm0N2
5152A7j22J33j18O9n3j64K50r9J33m2J5j29J65rM9r9K73l88K63k4j72p1R0j56
$$ plain form
4986 222 -134 13 -253 -76 129 27 -307 18 211 179 -30 -143 -51 135 -42 72 -16 93 -179 -230 87
5007 87 19 61 276 -23 -134 -251 18 -119 -69 -192 -125 385 158 -41 -19 30 -296 -227 -123 27 -42 90 -89
5030 -89 94 199 53 -81 -60 142 47 256 -63 175 -90 72 47 -59 -5 -93 -138 -129 -49 -10 -32 -68 -124 -57 24
5055 24 -102 -42 -31 62 171 190 -189 -36 15 -64 153 77 245 -108 -97 278 56 -17 134 -58 -14 -117 -6 -79
5079 -79 -305 406 51 -184 -14 40 131 -126 17 -57 -1 -161 -92 -81 89 -70 23 301 -55 24 -25 -77 -205 -61
5103 -61 -281 -147 8 -103 -82 40 224 44 -16 -103 201 -86 -216 -108 144 2 97 -81 12 7 -63 38 -82
5126 -82 6 -69 -36 115 90 157 -145 -153 -29 93 105 -21 63 100 20 175 -65 6 -160 90 100 229 1 5 -35 17
5152 17 -105 28 -90 -21 -74 -238 12 -87 46 4 19 -110 55 46 95 -4 269 -119 144 120 -52 -123 -33 -189
5176a89L92j58p3K01j32j81Q8K49k95j59J90J39k18L67r1k91K30J48qj40Rr1O6
5199E3j88N03l81j29L30l32K34j42J06J%J70J4l60J03o8K58p7p7R5l5k51L34k00
5223c9O4K70l30N8j29N9j22J44k04L16j63k49L25Q0j27j0k11L29j10o3L76j73
5245I1l0j35R3O3o7m3J94j6k16J22r7J31K11q4l64L55k88m3j49L05k36M04k87
5268h6o7NP0J22j22M8j0R8j0k8J88k68l7R1O0q2L1j67nL09k78Q6j32JL19j39j35
5295a38m9M52m49M50j68p3l9K9J1o6J15k9mk38K42L12l54qj05L15j70j52K88L
5319A75j50j61jk8K06Q5j90O0j81K48J5J84k22j68J16J5L4J44l87k0L4J23J13
5342D4K9j44K9K5K12j63j65q2K19K18k66j34K81j9r5m2K30o6nj17L8K71k39k66
$$ plain form
5176 -189 203 45 -28 173 41 -140 -52 197 -98 -257 -67 72 -146 221 130 -161 69 217 209 69 78 -13 53
5199 53 -135 368 -13 -142 188 -144 90 -52 54 55 55 225 239 -121 -18 -86 172 95 18 113 78 -173 161 -39
5223 -39 25 295 -35 23 -106 -47 -169 -25 -229 87 -76 -325 0 80 -47 -57 -268 61 -49 -112 264 91
5245 91 61 -74 19 82 15 -28 166 150 -66 56 -41 90 301 217 -147 208 -80 -123 -272 33 -203 201 -86
5268 -86 -153 -148 -78 44 -78 -30 -40 58 48 20 208 -60 -97 -6 54 -28 3 -164 -169 140 -138 -52 -184 -183 136 -3 -138
5295 -138 -187 265 -184 266 98 25 -14 15 26 -40 75 46 42 -196 46 358 4 -4 -109 206 36 -116 172 175
5319 175 25 -136 -137 -165 41 126 -64 -4 -185 63 78 262 40 -128 -12 3 37 181 -206 -226 -192 -69 44
5342 44 73 -71 -42 -17 195 32 -133 -215 4 222 -44 -178 103 84 -11 -53 177 111 106 -11 27 298 59 -207
5366b07J25K1NJ39j5j29J73j65P5J43k69M7j45K09pnj00R6L8k21J22P6j39r9L1
5391b01M60l08Mj96J18J91j7l3J1J41p1k78K85j03j22K93k34L1j22K31r2K31m30
5414b11K28o4r0J86n9J69o2k4k21R5j7J20j10J0Q6l5q1K42k36K8K9p2k8J12K7
5439B2j41K71j52m0j14J69j1k07K94n4j74M58l95J41P0k16Q6N9l35K01K02j02
5461C2q7j2p8Q7J90Op5k90J71K52j1k14K61k57j53J16L9M8l6J91k90N4q8J73j35
5486a06J33L1q0l5j47M09l74M16pj35m33K24K9K67k81Q6m2j4J20j46O2K14M9k57
5510a7q6L17k89l11K74m0K92j65K15l92J49P7l5J38n0J7K38k29k93J36J27R3l9
5533A27m66K07rK59k13M0k64L38j74K24J19j19p8M1K0m3l4j76L40k13j42M79o8
$$ plain form
5366 -207 -82 -61 -56 83 68 -61 112 -53 22 165 -104 -57 -202 7 0 -5 -105 -9 29 -192 -70 6 -133 -232 -201
5391 -201 259 -49 -45 -241 -123 68 51 18 29 170 99 -179 106 3 -119 174 -60 -29 -151 80 -12 219 -211
5414 -211 17 -47 -137 49 -10 159 97 73 -148 -53 -70 50 -60 -50 36 1 -80 162 -74 -46 -17 -89 -117 -5 22
5439 22 -119 152 0 -40 -154 15 4 -203 91 37 -137 321 -74 67 137 -79 7 66 -269 -68 134 32
5461 32 -55 -67 -145 -58 132 138 63 -227 -56 196 185 -29 232 -25 -178 -62 -23 25 -11 180 -110 -56 -144 29 -106
5486 -106 27 58 -22 -57 -204 205 -169 247 240 105 -328 -104 -75 192 -89 -3 -45 -59 61 -85 -23 191 240 -17
5510 -17 -103 214 -75 -386 -112 -152 140 -25 190 -202 -53 24 -11 127 77 94 332 103 -190 -54 73 166 127
5533 127 -339 -132 -141 118 -95 -55 -319 19 -155 69 188 69 -9 32 52 9 -25 -201 139 -74 -216 263 195
5556A95k11L20m07R6O9KJ15j41j22J3J83l63K57n8qj21j9M3L52k31k43pN70k90
5580fn5PJ39j47l0J43q4L4j63J94J8k04L0J77K32n07r4K00K98m90K48m8O9Q9L16
5605C66l88p4R9J5J64j64k20L89J8l74Q5K16m2j71J24r8O9L28l83J10l12N6J30
5628e7J27j11k7J46q7k9K56k55OL3J8q4m4pJ88K9q2o0J60k04p1J71j03m6j18K49
5654bl66M23k11K41r1Pk1l1J04l9L9p4p6P8m9j48K21o7m6O1M3l13R9K92K8p8j63
5681a39r5L01N9j61J13l01J67J14o9l4j42L36n70M25m3j52L85j85J01p2L9m6q2
5704e1k33K01J1J17p0j30N3J74r2k14K96j85L5m9L34k21J04j75J61r0P4j15%J30
5728F5P8l22K04j10K2o7J17Q6p4K36k50j01Q6J94k14K17l31J94mj00m9L1J4Q1
$$ plain form
5556 195 -16 304 -103 -7 62 64 179 38 -84 -71 112 -251 6 -52 -60 -181 -200 -157 195 -36 -279 -286 284 -6
5580 -6 -61 -54 85 -62 -92 51 -33 1 -162 32 50 -154 -124 53 285 -222 -316 -116 182 -308 -60 -108 -39 50 366
5605 366 -22 -96 3 18 182 18 -202 187 205 -169 -84 132 90 -81 43 -55 14 342 -41 69 -243 -187 -57
5628 -57 70 -41 -68 78 -9 -38 218 -37 -31 2 20 -64 -108 -115 73 102 20 -40 120 -84 -155 16 -87 -133 -251 -2
5654 -2 -368 55 -156 85 -6 1 -20 -51 53 14 53 -21 -97 -19 -68 -216 5 -62 -108 -47 -4 -317 -218 74 102 24 -139
5681 -139 -234 67 126 -35 78 -223 -56 58 -11 -45 -187 149 -421 4 -39 -191 194 9 110 38 77 31 -51
5704 -51 -284 -83 -72 45 -25 -155 -102 72 -20 -234 62 -123 -88 -137 197 -24 80 -95 66 -24 50 -65 -65 65
5728 65 143 -179 25 -85 -63 -130 -13 73 -1 235 -15 -116 -30 164 -50 167 -164 30 26 -74 -123 -92 -78 3
5752CM1J8j93J59j82L87j5l46m6J04j24L01j67J06j25o7n6J55N1N3j5J31k14J53
5776A12J07k83m5MQ1p1O5j19L63k6k41j58l4K94j70K48K3J1k94J46k56M5M37j14
5800A25n9r4Q7K12l32R6l38M85j55N5j0k43K55J61m22J11K72j68R2Kj05l00M52
5823A79l12K80k08pj21L94k19j5P9j20N2K59l72K01k80J91j2O2k90J71J92j00
5845Dj39K8N9K59l34K15R1k62R8K09k85R0J08m46M28j0j18L1j90L7MJ73l13L01
5869C8j07k2K00j21LJ94j72j40n8M5J97r3j66K17m7K33j75k5M3R2j68r4j13L94
5893A55j23j80J73k6k82L37n2K03j8k30k01J56mO8j17k25N08j29R7j23o2q7L46
5916A84m93L27j96J69O1P0j91J42j46p5K76q9j93J2O5m7K5j0j69M96p7k39J49
$$ plain form
5752 3 44 62 -131 28 -154 233 218 -128 -174 -70 -194 107 -60 46 -79 -146 -202 -47 4 57 42 173 -41 112
5776 112 219 -64 -109 -105 -24 -95 -30 -149 214 188 -53 -211 -245 49 -121 127 150 161 -133 13 -243 -198 239 125
5800 125 66 -28 59 271 -61 35 -303 182 27 82 72 -171 84 245 -177 -66 206 38 130 132 27 -273 179
5823 179 -133 147 -61 -68 -189 205 -14 -29 50 -70 -18 241 -131 70 -210 -19 -31 31 -259 -88 104 4
5845 4 -135 -107 -48 211 -123 92 183 -79 19 228 -57 33 141 -305 123 113 -5 26 -164 -127 -123 50 -263 38
5869 38 -69 -91 109 -12 -9 185 13 -127 -185 -140 57 -36 -202 15 -32 201 26 1 44 136 -32 -126 -239 155
5893 155 32 -148 25 -1 -283 54 2 205 187 -43 -244 -88 -92 -24 -141 -366 142 13 110 -13 -75 -162 184
5916 184 -309 18 -178 -9 52 122 -69 73 -73 -148 128 39 -154 -142 -77 -124 -99 -109 -278 218 141 -98 51
5939E1j67R2j92J60l2J39Q6k40lR6L2r4Qj63J74K24M1k55P8j49J26K43k51O5Q5
5964A54k79K84j11j25M3L88j21j31j02p8M3J20o3k63K35K7O9j99j5J94J42j27
5986H5P4j01j02Q2j20J18M3l06K75r1j04K17Lj72O0k7N7J55o5p6l3n4J94p4R1
6011A29j49rN7M3l32J60K04l34L37J18k40k24l2J35J64%m6J5K58j55j88p9j34
6034c02L28N2r5M2l5O0j7j21q7L07j41J79j56N0M8R4k78J6J95j92r7M5J39l6J03
6059A01j23m0j3J63JO1qj92j35K52k73j6J12J83o7K37l86J70q8Q3%j8r4L9j14
6084a65q9J05l4M17k42j6j55K25k08Q7K70k91Q8j32l9K25l44M12l84J61K11J12
6106B14qk28P0mR6p8j30K76o8j45J55kK3Nk94L8O4J2K98l22J65l41K49J55k72
$$ plain form
5939 51 -116 -24 -216 -56 -88 51 137 -103 -106 -10 22 -72 -64 -227 -53 171 212 -43 35 -114 12 255 4 69 154
5964 154 -125 159 48 -77 -34 354 233 102 0 -78 -35 85 22 -241 -6 21 90 -109 -124 70 212 85
5986 85 159 58 -44 38 -82 36 79 -227 48 -43 -147 70 73 -99 -39 -66 -9 146 81 5 -28 -82 112 38 129
6011 129 -20 -29 28 71 -261 -101 103 -231 106 224 -16 -240 -272 -137 27 27 -19 -4 254 99 -89 -168 -302
6034 -302 26 78 -17 25 -10 50 33 -88 -175 132 -9 170 14 64 112 206 -72 -56 139 -53 -150 -105 34 -2 101
6059 101 -22 -62 -75 88 89 150 142 -50 -185 67 -206 -222 -110 73 6 243 -143 27 -61 22 22 4 -90 -51 -165
6084 -165 -254 -149 -183 234 -8 -24 -179 46 -162 -75 195 -96 -8 -140 -179 46 -298 114 -270 -109 102 214
6106 214 206 -22 48 44 140 62 -68 208 140 -5 150 148 171 176 -118 -80 -16 -4 294 -28 137 -204 45 200 -72
6131g2K21k54k7J75L01n35J0R3rJ66j57P0j6j16k8L93j65j38qM3mJ87R4j48j74
6156i8J83P9k14k06J18N1J02O2K9kj54J94j87J3R0j08J13J26j08Q5ll08O2J3J25
6181E7L4J83m35p6K83k08P0Q9o1O8k75M3N38m09K43k03J36k1l3M1j15n5L68k70
6205hNM6j94N2m9K97K6k26J39k53J46Q5J42k35J55l04J89o9mM9M4K9k24K59q9
6230HN7p8j86J36j15K0L03j5Lj16Q4k29M08k25o2QJ26R4j04n3Qj65J96J42k78
6255c3R8j07J36K4l31J48J68j7N6Jo5j91J57j17j42K14k5j20L8K40k39lN0j24
6279a84K30L05l04j04K79k98J06O9j04M9n1j51J20J07j20RPJ37P0l05O2K55O0
6302B44l26K98k94j05P4J2K11n6J58n59K49l16L38l5J25J04m17K60p6j41J31J04
$$ plain form
6131 -72 149 -105 -132 43 344 -191 -181 -88 -97 69 -88 -18 -34 -150 -178 215 50 -88 -96 -53 -57 130 224 76 -98
6156 -98 85 164 -50 -256 -138 -87 15 77 106 104 -50 144 -43 -30 60 -48 65 191 83 168 165 -143 -81 -68 57
6181 57 91 274 -161 -237 46 -162 -92 -3 -64 4 -271 -228 310 -99 144 -59 77 56 23 64 -51 -106 262 -8
6205 -8 -3 43 -151 -99 -148 149 175 -51 88 -165 -19 66 208 -27 128 -176 13 -56 -60 -11 33 62 -162 97 8
6230 8 65 -13 -199 -63 -178 -158 145 130 133 17 101 -128 280 55 -7 1 127 221 117 64 72 -93 103 245 -33
6255 -33 65 -42 94 118 -213 -65 103 86 142 143 78 -113 44 -73 -215 -1 -26 -146 -108 132 -107 -110 -60 -184
6279 -184 46 351 47 -57 222 -76 30 99 -5 44 -7 -158 -38 69 -51 -42 -35 102 172 -133 -71 184 244
6302 244 -82 216 -78 -183 -109 -97 114 58 216 -343 -94 -410 -72 -107 18 122 -295 -35 -111 -252 -121 -17
6324a7j37O4J73J9j16j32Q6K22m73K67K90j73L5j27p3k44J54J29J46p2j78k39
6346c96L34J2M2P4lj61J15j4k15j23L77q1l7L8L4j80L21j76j10J22J36N1l32L14
6370A42m9m9j3o0K03k59K18qj45J65l8k48J53r5R0P5m40N51k61m5P8k35K89J83
6394B02L5k77J14Q9l29L54j51N1oj79O3j11J90k04K1K34N3J0k35J63l5j83J32
6417AJ85j41p3L5n8k00r2J59J7Q6J63k03P1R8lj51pJ02o4N7j00J52n5j1N4J54
6443A76o1J16j18j93l2J78j06L42n38K69J7L7j40j40M40k17K03k92j00K7K22r5
$$ plain form
6324 -17 -154 -90 83 102 -14 -146 -60 162 -311 -44 246 73 108 -19 -92 -336 -182 -53 93 21 -157 -396
6346 -396 -62 -50 -8 66 63 -98 17 3 -212 -335 42 -39 -76 -38 -4 -184 137 -39 -149 -27 109 160 -172 142
6370 142 93 44 31 -29 174 -85 133 125 -20 145 107 -141 12 -83 7 82 -358 193 -68 -113 -35 -270 19 202
6394 202 237 -40 74 163 -166 188 37 88 82 -97 -34 -145 45 -159 -138 96 149 159 -76 87 52 -131 1
6417 1 186 45 -28 7 -51 -251 -343 -184 -167 -81 82 -121 -50 48 45 -106 -113 -11 -75 -18 -118 34 -21 -32 22 176
6443 176 115 231 113 -80 -112 66 -40 302 -236 33 50 87 -53 -193 247 30 233 -59 -159 -132 90 -5
$$ [...]
8191A6
##END NTUPLES=NMR FID
##END=
