##TITLE=1H_Pr 5154-2Om-Br
 CDCl3
 8 sc, 
 18.11.2022
##JCAMPDX= 6.0         $$ Bruker NMR JCAMP-DX V2.0
##DATA TYPE= NMR FID
##DATA CLASS= NTUPLES
##ORIGIN= UXNMR, Bruker Analytische Messtechnik GmbH
##OWNER= root
$$ XWIN-NMR		Version 3.5
$$ Fri Nov 18 16:58:14 2022 Russian Standard Time (UT+4h)  she@DPX200
##.OBSERVE FREQUENCY= 200.1313499994
##.OBSERVE NUCLEUS= ^1H
##.DELAY= (6, 6)
##.ACQUISITION MODE= SIMULTANEOUS
##.ACQUISITION SCHEME= undefined
##.AVERAGES= 8
##.DIGITISER RES= 18
##SPECTROMETER/DATA SYSTEM= spect
##.PULSE SEQUENCE= zg30
##.SOLVENT NAME= CDCl3
##.SHIFT REFERENCE= (INTERNAL, CDCl3, 0, 15.7039)
##AUDIT TRAIL= $$ (NUMBER, WHEN, WHO, WHERE, WHAT)
$$ ##TITLE= Audit trail, XWIN-NMR		Version 3.5
$$ ##JCAMPDX= 5.01
$$ ##ORIGIN= Bruker BioSpin GmbH
$$ ##OWNER= she
$$ F:/spectra/data/she/nmr/H-F/1/audita.txt
$$ ##AUDIT TRAIL=  $$ (NUMBER, WHEN, WHO, WHERE, WHAT)
(   1,<2022-11-18 16:56:17.64 +0400>,<she>,<DPX200>,
      <created by zg, POWCHK disabled, PULCHK disabled
       configuration hash MD5:
       00 E9 B6 7A A2 85 ED C7 34 08 36 98 17 FE 4E 26
       data hash MD5: 16K
       86 95 24 4F F5 91 B7 EB E3 9A 37 28 19 18 AF C6>)
$$ ##END=
$$ 
$$ hash MD5
$$ 1F E0 14 0A B7 98 DA C5 8A 3B 1B 50 A4 91 D3 73
##$RELAX= 
##$RELAX= 
##$RELAX= 
##$RELAX= 
##$RELAX= 
##$RELAX= 
$$ Bruker specific parameters
$$ --------------------------
##$DU= <F:/spectra>
##$EXPNO= 1
##$NAME= <H-F>
##$PROCNO= 1
##$TYPE= <nmr>
##$USER= <she>
##$AMP= (0..31)
100 100 100 100 100 100 100 100 100 100 100 100 100 100 100 100 100 100 
100 100 100 100 100 100 100 100 100 100 100 100 100 100 
##$AQSEQ= 0
##$AQ_mod= 1
##$AUNM= <au_zg>
##$AUTOPOS= <>
##$BF1= 200.13
##$BF2= 200.13
##$BF3= 200.13
##$BF4= 200.13
##$BF5= 200.13
##$BF6= 200.13
##$BF7= 200.13
##$BF8= 200.13
##$BYTORDA= 1
##$CFDGTYP= 0
##$CFRGTYP= 5
##$CHEMSTR= <none>
##$CNST= (0..31)
1 1 145 1 1 1 1 1 1 1 1 1 1 1 1 1 1 1 1 1 1 1 1 1 1 1 1 1 1 1 1 1 
##$CPDPRG= <>
##$CPDPRG1= <>
##$CPDPRG2= <>
##$CPDPRG3= <>
##$CPDPRG4= <mlev>
##$CPDPRG5= <mlev>
##$CPDPRG6= <mlev>
##$CPDPRG7= <mlev>
##$CPDPRG8= <mlev>
##$CPDPRGB= <>
##$CPDPRGT= <>
##$D= (0..31)
0 1.2 0 0 0 0 0 0 0 0.06 0 0.03 0 0 0 0 0.0002 0 0 0 0 0 0 0 0 0 0 0 0 
0 0 0 
##$DATE= 1668776177
##$DBL= (0..7)
120 120 120 120 120 120 120 120 
##$DBP= (0..7)
150 150 150 150 150 150 150 150 
##$DBP07= 0
##$DBPNAM0= <>
##$DBPNAM1= <>
##$DBPNAM2= <>
##$DBPNAM3= <>
##$DBPNAM4= <>
##$DBPNAM5= <>
##$DBPNAM6= <>
##$DBPNAM7= <>
##$DBPOAL= (0..7)
0.5 0.5 0.5 0.5 0.5 0.5 0.5 0.5 
##$DBPOFFS= (0..7)
0 0 0 0 0 0 0 0 
##$DE= 6
##$DECBNUC= <off>
##$DECIM= 32
##$DECNUC= <off>
##$DECSTAT= 4
##$DIGMOD= 1
##$DIGTYP= 9
##$DL= (0..7)
0 120 120 120 120 120 120 120 
##$DP= (0..7)
150 150 150 150 150 150 150 150 
##$DP07= 0
##$DPNAME0= <>
##$DPNAME1= <>
##$DPNAME2= <>
##$DPNAME3= <>
##$DPNAME4= <>
##$DPNAME5= <>
##$DPNAME6= <>
##$DPNAME7= <>
##$DPOAL= (0..7)
0.5 0.5 0.5 0.5 0.5 0.5 0.5 0.5 
##$DPOFFS= (0..7)
0 0 0 0 0 0 0 0 
##$DQDMODE= 0
##$DR= 18
##$DS= 0
$$ [...]
##$SUBNAM2= <"">
##$SUBNAM3= <"">
##$SUBNAM4= <"">
##$SUBNAM5= <"">
##$SUBNAM6= <"">
##$SUBNAM7= <"">
##$SUBNAM8= <"">
##$SUBNAM9= <"">
##$SW= 18.0517283424941
##$SWIBOX= (0..15)
0 0 2 0 0 0 0 0 0 0 0 0 0 0 0 0 
##$SW_h= 3612.71676300578
##$TD= 16384
##$TD0= 1
##$TE= 0
##$TE2= 300
##$TE3= 300
##$TEG= 300
##$TL= (0..7)
0 120 120 120 120 120 120 120 
##$TP= (0..7)
150 150 150 150 150 150 150 150 
##$TP07= 0
##$TPNAME0= <>
##$TPNAME1= <>
##$TPNAME2= <>
##$TPNAME3= <>
##$TPNAME4= <>
##$TPNAME5= <>
##$TPNAME6= <>
##$TPNAME7= <>
##$TPOAL= (0..7)
0.5 0.5 0.5 0.5 0.5 0.5 0.5 0.5 
##$TPOFFS= (0..7)
0 0 0 0 0 0 0 0 
##$TUNHIN= 0
##$TUNHOUT= 0
##$TUNXOUT= 0
##$USERA1= <user>
##$USERA2= <user>
##$USERA3= <user>
##$USERA4= <user>
##$USERA5= <user>
##$V9= 5
##$VALIST= <valist>
##$VCLIST= <CCCCCCCCCCCCCCC>
##$VD= 0
##$VDLIST= <DDDDDDDDDDDDDDD>
##$VPLIST= <PPPPPPPPPPPPPPP>
##$VTLIST= <TTTTTTTTTTTTTTT>
##$WBST= 1024
##$WBSW= 4
##$XGAIN= (0..3)
0 0 0 0 
##$XL= 0
##$YL= 0
##$YMAX_a= 153390
##$YMIN_a= -247701
##$ZGOPTNS= <>
##$ZL1= 120
##$ZL2= 120
##$ZL3= 120
##$ZL4= 120
##$ABSF1= 10
##$ABSF2= 0
##$ABSG= 5
##$ABSL= 3
##$ALPHA= 0
##$AQORDER= 0
##$ASSFAC= 0
##$ASSFACI= 0
##$ASSFACX= 0
##$ASSWID= 0
##$AUNMP= <proc_1d>
##$AZFE= 0.1
##$AZFW= 0.1
##$BCFW= 1
##$BC_mod= 2
##$BYTORDP= 1
##$COROFFS= 0
##$CY= 11.3945322036743
##$DATMOD= 1
##$DC= 2
##$DFILT= <>
##$DTYPP= 0
##$F1P= 2.36226072786647
##$F2P= -0.459571619588291
##$FCOR= 0.5
##$FTSIZE= 0
##$FT_mod= 4
##$GAMMA= 1
##$GB= 0.15
##$INTBC= 1
##$INTSCL= 1
##$ISEN= 128
##$LB= 0.24
##$LEV0= 0
##$LPBIN= 0
##$MAXI= 10000
##$MC2= 0
##$MEAN= 0
##$ME_mod= 0
##$MI= 1.114404
##$NCOEF= 0
##$NC_proc= 0
##$NLEV= 6
##$NOISF1= 3.799351
##$NOISF2= 2.8
##$NSP= 1
##$NTH_PI= 0
##$NZP= 0
##$OFFSET= 15.70392
##$PC= 1
##$PHC0= -18038.78
##$PHC1= 22.2007
##$PH_mod= 1
##$PKNL= yes
##$PPARMOD= 0
##$PSCAL= 0
##$PSIGN= 0
##$REVERSE= no
##$SF= 200.130013532006
##$SI= 16384
##$SIGF1= 3
##$SIGF2= 2
##$SINO= 400
##$SIOLD= 16384
##$SREGLST= <1H.CDCl3>
##$SSB= 0
##$STSI= 0
##$STSR= 0
##$SW_p= 3612.71676300578
##$SYMM= 0
##$S_DEV= 0
##$TDeff= 0
##$TDoff= 0
##$TI= <>
##$TILT= no
##$TM1= 0
##$TM2= 0
##$TOPLEV= 0
##$USERP1= <user>
##$USERP2= <user>
##$USERP3= <user>
##$USERP4= <user>
##$USERP5= <user>
##$WDW= 1
##$XDIM= 8192
##$YMAX_p= 0
##$YMIN_p= 0
$$ End of Bruker specific parameters
$$ ---------------------------------
##NTUPLES= NMR FID
##VAR_NAME=  TIME,          FID/REAL,        FID/IMAG
##SYMBOL=    X,             R,               I
##VAR_TYPE=  INDEPENDENT,   DEPENDENT,       DEPENDENT
##VAR_FORM=  AFFN,          ASDF,            ASDF
##VAR_DIM=   8192,          8192,            8192
##UNITS=     SECONDS,       ARBITRARY UNITS, ARBITRARY UNITS
##FACTOR=    0.0002768,     1,               1
##FIRST=     0,             0,               0
##LAST=      2.2672688,     0,               0
##MIN=       0,             -247701,         0
##MAX=       2.2672688,     153390,          0
$$ Real data points
##PAGE= N=1
##DATA TABLE= (X++(R..R)), XYDATA
0@%%%%%%%%%%%Qj6J6j6K1k9L2m0M8n6P2q8J04j20J38j62J92k22K54k88L28l76
$$ 0 0 0 0 0 0 0 0 0 0 0 0 8 -8 8 -8 13 -16 16 -24 24 -32 40 -48 56 -64 74 -88 104 -118 136 -152 176 -200
33b00M27m82N42o11O88p70Q59r57J064j182J311j451J603j769J952k154K373k612
$$ -200 227 -255 287 -324 364 -406 453 -504 560 -622 689 -762 841 -928 1024 -1130 1243 -1369
51a369K878l171L497l862M271m733N259n870O583p429Q454r725J1352j3519J6561
$$ -1369 1509 -1662 1835 -2027 2244 -2489 2770 -3100 3483 -3946 4508 -5217 6135 -7384 9177
66I177k1182K9125m6463J53124j03795j82939K57246p131r9755M7103L586j29671
$$ 9177 -12005 17120 -29343 123781 19986 -162953 94293 87162 -12593 34510 38096 -91575
78i1575O2787N3462j08723m121J42253k8407p6199K0657J3822P468O7103j8123
$$ -91575 -28788 24674 -84049 -88170 54083 25676 -50523 -29866 -16044 -8576 58527 40404
90D0404o5746K4053K9114n0880J5221M8439l6911j5668L4303m6622j7876Q2450
$$ 40404 -25342 -1289 27825 -23055 -7834 40605 3694 -11974 22329 -24293 -42169 40281
102D0281M476p0753K0344K5054n1858J5726O8994m2516n1561M6542Q981m2590
$$ 40281 44757 -25996 -5652 19402 -32456 -16730 52264 9748 -41813 4729 13710 -28880
114b8880J9307K8114j8891j1320J429n223J5333J3496j8364M162K1832k4924j1959
$$ -28880 -9573 18541 -350 -11670 -10241 -15464 -131 13365 -4999 -837 20995 -3929 -15888
127a5888L7549k388k8504J9446Q692l7664J59L8756q263k8823J3337P872j7208
$$ -15888 21661 19273 -9231 10215 18907 -18757 -18598 20158 11895 -16928 -3591 4281 -12927
140a2927P540J3750r247n834O421j497p146M071Q884J661m196n877K333Q608n91
$$ -12927 -5387 8363 -884 -6718 -297 -1794 -8940 -4869 4015 5676 1480 -4397 -2064 6544 5953
155E953N31L657j1312n709J4200J260j7913k8J6725m834j5567N731P901l596L667
$$ 5953 6484 10141 -1171 -6880 7320 8580 -9333 -9361 7364 2530 -13037 -7306 595 -3001 666
170F66M370r194n968J2983J1215j1709q583J1757M335j0293j473Q053j767p918
$$ 666 5036 -4158 -10126 2857 14072 2363 -6220 5537 9872 -421 -1894 6159 4392 -3526
184c526K453N48q494L151P415n259m604N137L435k174L342N780l789l266M849
$$ -3526 -1073 -525 -9019 -5868 1547 -3712 -8316 -3179 256 -1918 1424 7204 3415 149 4998
199D998N05k716k132k312K688O26n634k222M351M054j693r62J30k061N340M251
$$ 4998 5503 2787 655 -1657 1031 1657 -3977 -6199 -1848 2206 513 -449 -319 -2380 2960 7211
215G211q316k888O483j726n538K060L669l731j626M635j357j597N421n74k461
$$ 7211 -1105 -3993 2490 764 -4774 -2714 955 -2776 -4402 233 -1124 -2721 2700 2126 -335
230c35K587J125j273n73J132j13j176N65k161j366L208k178k840K235j330j545
$$ -335 2252 3377 2104 1531 2663 2550 1374 1939 -222 -1588 1620 -558 -3398 -1163 -2493 -4038
246d038K621M42k664N70N006r66l843M674J768l431K125Q88l465O06K123j269
$$ -4038 -1417 -975 -3639 -3069 1937 971 -2872 1802 3570 139 2264 3152 -313 293 2416 1147
262A147k720J181J579l013R82K513k116N8P79m33J022o08o59m94N18Q14k030m97
$$ 1147 -1573 -392 1187 -1826 -844 1669 -447 -389 390 -43 979 371 -288 -782 -264 550 -1480 -1977
280a977J765j314Q58R08k119J622J659o42p96N78J603j253j341K173j095j156
$$ -1977 -212 -1526 -668 240 -1879 -257 1402 760 -36 542 2145 892 -449 1724 629 -527
296e27R66p05k47K83k33%j64J313L32j932J141J303p02q6j005M8K27o63M57j325
$$ -527 439 -266 -513 -230 -463 -463 -627 686 1018 -914 227 1530 828 742 -263 -215 12 -651 -194 -1519
316a519m45R55o04K47P04o21J136O35L11L51j4R95l68J38N66j736n27J654j455
$$ -1519 -1964 -1009 -1613 -1366 -662 -1283 -147 488 799 1150 1136 2131 1763 1901 2467 731 204 1858 403
335D03j440O9j36l03J68P88p21m43J857k41j129J251J43j007K57L01l85l09R15
$$ 403 -1037 -968 -1104 -1407 -1239 -451 -1172 -1615 242 1 -1128 123 266 -741 -484 -183 -568 -877 38
354C8L46p13J508jn25J695L36j335N4n4n53n33k65q01j751J252K60j621J273Q14
$$ 38 384 -329 1179 1178 653 2348 2684 1349 1403 1349 796 263 -2 -803 -2554 -1302 -1042 -2663 -1390 -576
374e76p90R08O80m38k56J017J59j346P59M32j223J008Q95r32K58N23K74K36m9
$$ -576 -1366 -458 222 -216 -472 545 704 -642 117 549 -674 334 1229 297 555 1078 1352 1588 1539
393A539m32j507K42Q60j808kL95j157P92O95n65m58R20P56m82k8Q76j104N02P86
$$ 1539 1107 -400 -158 702 -1106 -1108 -713 -1870 -1078 -383 -948 -1406 -486 270 -212 -240 636 -468 34 820
413H20j225K82J055o11K43P01k8n61J92M79j181j81N9j404J71O36j465K51P94
$$ 820 -405 -123 932 321 564 1265 1237 676 868 1347 166 -15 44 -1360 -1189 -553 -2018 -1767 -973
432i73p2L87Q89N27k53O59J505j604j48J163j541m73k53r91q4M87o24q76K99J526
$$ -973 -1045 -658 231 758 505 1164 2669 1065 917 2080 539 66 -187 -1178 -1262 -775 -1399 -2275 -1976 -450
452d50j9J07J021o59J237J479j558m57P87j37l63r32p05l53Q60J18j372j59J639
$$ -450 -469 -362 659 0 1237 2716 1158 701 1488 1351 988 56 -649 -1002 -142 -24 -1396 -1555 84
471H4n11M06O06j115Q08Q10q95q52J35M80r45k96P56j013Q72J259j374O61J620
$$ 84 -427 -21 585 -530 278 1088 193 -659 -524 -44 -989 -1285 -529 -1542 -670 589 -785 -124 1496
490A496l83P9M69on79J52N6j873L07J211j999p21O34m34O58K60o84K51J015j11
$$ 1496 1113 1192 1661 1655 1076 1228 1284 -589 -282 929 -1070 -1791 -1157 -1591 -933 -673 -1357 -1106 -91 -202
510b02k21R80M13j568N65J473j250K47M38j318M28J223k75r44j97P11J53O95l45
$$ -202 -423 557 970 -598 -33 1440 190 437 875 -443 -15 1208 933 -11 -208 503 656 1351 1006
529A006k341Q70K309j763j363J06j81K0K19l43n84M05J508P7P37O36p69J457J145
$$ 1006 -1335 -465 1844 81 -1282 -1176 -1357 -1337 -1118 -1461 -2045 -1640 -132 -55 682 1318 549 2006 3151
548C151j573j39Q51j267j482K28R4j461k88K01k75J261P79j233J176J431p85j09
$$ 3151 1578 1439 2290 1023 -459 -231 -137 -1598 -1886 -1685 -1960 -699 80 -1153 23 1454 669 560
566E60P45n25j063L69L34j521j39J030r59N47R33k34K45L07l6L92L49n87j680
$$ 560 1305 780 -283 86 420 -1101 -1240 -210 -1169 -622 311 77 322 629 593 985 1334 747 -933
585i33P99J336j408p92L80J57R14J8j000J40N98M60l62m05k07K0M48l5j062N30
$$ -933 -134 1202 -206 -998 -618 -461 453 471 -529 -389 209 669 307 -98 -305 -285 163 128 -934 -404
605d04N86n74J68J39k14M52k3o1J34L11j97n97O96N41o16J28l96k78P73j82n10
$$ -404 182 -392 -224 -85 -299 153 130 69 203 514 317 -280 416 957 341 469 73 -205 568 386 -124
626a24l78m3J52m7L12o54k00J107p5k21O65j42m21O42J48n97r1p5n4j16J91k25
$$ -124 -502 -545 -393 -440 -128 -782 -982 125 50 -171 494 352 -69 573 721 124 33 -42 -96 -212 -21 -246
648b46o67R21N5q7N92m20l86P70L05m5m85j59j14k22P18o92q19M82j60j96O62
$$ -246 -913 8 63 -24 568 148 -238 532 837 792 307 148 34 -188 530 -162 -981 -499 -659 -855 -193
669a93n59k69N53O20J40l12L78J54J8O40n10n37O35l95m70L91n29J30j6J26l33
$$ -193 -752 -1021 -468 152 292 -20 358 512 530 1170 660 123 758 363 -107 284 -245 -115 -131 -5 -338
690c38P0O35m51m57P20j08m07K55l55q6L17j81O1k25N27K02m00O60k45m1O27m73
$$ -338 -268 367 -84 -541 179 71 -336 -81 -436 -522 -205 -386 -325 -550 -23 179 -221 439 194 153 780 307
712C07J47J39n13J44K6n2j20l08J31o8k56M17l08j40N44k18j55K31j61L53j08
$$ 307 454 593 80 224 250 198 78 -230 -99 -167 -423 -6 -314 -454 90 -128 -283 -52 -213 140 32
733C2k19P6l6N17k46q5K61l69J14L93l01p1L53k99j6M8m9j53p1M90n25j03K93
$$ 32 -187 -111 -147 370 124 39 300 -69 45 438 137 66 419 120 104 152 103 -50 -121 369 -156 -259 34
756C4L3k75L44l91J44j73J2j47J00K97l08rN02rk30K80k79J53J49N4j16n7P0j3
$$ 34 67 -208 136 -255 -111 -284 -272 -419 -319 -22 -330 -339 163 154 -76 204 -75 78 227 281 165 108 178 165
780A65k27L76k64j00L53j48R9r7j74j83J3%o8j65K55j01K1K96n9p1K38k07J3K29
$$ 165 -62 314 50 -50 303 155 254 157 -17 -200 -187 -187 -255 -420 -165 -266 -245 51 -8 -79 159 -48 -35 194
804A94k16K04j41J74P4j55L27j66J12J01k28j04j04j02p8k62j85O5o0Q2qj2L70
$$ 194 -22 182 41 215 289 134 461 295 407 508 280 176 72 -30 -108 -370 -555 -490 -550 -468 -476 -488 -118
827a18j19Q8M67m6m0J8K09j9l77L45j73k05L53l79mK09m02K42K6k98J05Q8p7K89
$$ -118 -237 -149 318 272 232 250 459 440 63 408 235 30 383 4 0 209 -193 49 75 -223 -118 -30 -107 182
851A82j12k4o1j8L26k84q4P1m63J87j22k69M23P6J51l6K57K30J20j91L39k85j08
$$ 182 70 46 -15 -33 293 9 -75 -4 -467 -280 -402 -671 -248 -172 -21 -57 200 430 550 359 698 413 305
874C05M4l51M0j44p9K1j85K36j77J72K20k43J50j1k20j9K13l59J70OJ18K98j34
$$ 305 349 -2 38 -106 -185 -164 -349 -113 -290 -118 102 -141 9 -2 -222 -241 -28 -387 -217 -211 -93 205 71
897G1M49j65j66M46m02k4kk99k9l13j20J52j05K11Q7P7P09j25J08P7l48R9j64
$$ 71 520 355 189 635 233 209 207 -92 -121 -434 -554 -402 -507 -296 -209 -132 577 452 560 637 289 388 224
920B24j94j70j23l34J56j39K40k50J59K95q4K06M37j74L29j16J0j01j99K77k47
$$ 224 30 -140 -263 -597 -441 -580 -340 -590 -431 -136 -220 -14 423 249 578 462 472 371 172 449 202
941B02k20M1Mk20K66m18J35K24l19J15l3J60N7n3J15j56p9K36k96PO8k24K45J62
$$ 202 -18 23 27 -193 73 -345 -210 14 -305 -190 -223 -63 -6 -59 56 -100 -179 57 -239 -232 -164 -388 -143 19
965A9j54J59J71J96j45J3J13j07O3J39m83J33N2m39K70r7r7j42l2K30j45qJ55
$$ 19 -135 24 195 391 246 259 372 265 328 467 -16 117 169 -270 0 -97 -194 -336 -368 -138 -283 -291 -136
988a36l51K21J6k6J49J67N0K53n2p3J49J66J7k67J17p9m18J29O5k96J07j15l0
$$ -136 -487 -266 -250 -276 -127 40 90 343 291 218 367 533 550 283 400 321 -97 32 97 -199 -92 -207 -237
1011b37J04J86j32j65r9L01o8J78k83j76N31M3k55K82j59m7L76j96j87l9J38J8
$$ -237 -133 53 -79 -244 -343 -42 -110 68 -215 -391 140 183 -72 210 51 4 380 184 -3 -42 96 114
1033A14l21J63R8l45N87r3j70K09j37k67K81J17k29l11L22l7k61L81k42l85N78
$$ 114 -207 -44 54 -291 296 203 33 242 105 -162 119 236 7 -304 18 -19 -280 101 -141 -526 52
1054E2m4l1K3M2J43P8L63l29m46K07K41k77K42k96j70L27L6k38k9J66m0LK12k30
$$ 52 8 -23 0 42 185 263 626 297 -149 58 299 22 264 -32 -202 125 161 -77 -106 60 20 23 235 5
1078Em51N41j03j70L41j38l49L09Q0M9l4L3k87n7M58j92k21L58r7k57N20j80k85
$$ 5 -446 95 -8 -178 163 25 -324 -15 65 114 80 113 -174 -231 227 35 -186 172 75 -182 338 158 -127
1101a27K35P1Q1k04q1j25J71L05k26m40K89l36R4M09j87k91J03N9Q7r1K97l46
$$ -127 108 179 260 56 -25 -150 21 326 100 -340 -51 -387 -293 116 -71 -362 -259 -200 -113 -204 93 -253
1123b53O6N71l86j01M31k84j45M08j51j71m8J48R1k06J59l50k32P19k18k89J47
$$ -253 -187 384 -2 -103 328 44 -101 307 156 -15 -63 85 176 -30 129 -221 -453 266 48 -241 -94
1144i4j78r7M45J62n54O7J68j1m6K94k74j73N66k24M5J38k10l5K06P6k26j92M10
$$ -94 -272 -369 76 238 -316 -249 -81 -92 -138 156 -118 -291 275 51 96 234 24 -11 195 271 45 -147 263
1167B63l49j07L96m17j7K55j73J05J20k63J62m8J63j99p5J02j51j1L08l08m9L33
$$ 263 -86 -193 203 -214 -231 24 -149 -44 76 -187 -25 -73 90 -109 -184 -82 -233 -244 64 -244 -293 40
1189D0J7j06K86q9p4K31J0k34k03L06j48j2J96l92L4R4l0J9O2q0o3o3R1k60N4
$$ 40 57 -49 237 148 74 305 315 81 -122 184 36 24 220 -172 -138 -44 -74 -55 7 -73 -136 -199 -108 -368 -314
1214c14L29k91J44K21J07j18J89j3Mj38R5l40j1L02j60k49J98m3J88J04j44J8
$$ -314 15 -276 -132 89 196 78 267 254 258 120 215 -125 -136 166 6 -243 -45 -88 100 204 60 78
1236G8R5%j73R4j16j05n6M5j98j43L67j60P0J50J8J67LK69j48L0J98k73j7J41
$$ 78 173 173 0 94 -22 -127 -183 -138 -336 -479 -112 -272 -202 -52 -34 133 136 405 257 287 485 212 195 336
1260C36k40M1q8j53J40j07K5o4N9J02k41J4J52j60P9K22k87N9m5n7L3j8J78J9
$$ 336 96 137 49 -104 36 -71 -46 -110 -51 51 -190 -176 -24 -184 -105 117 -170 -111 -156 -213 -180 -198 -20 -1
1284ao1K42n8P0J91l1r6J40k37K6k25k5p4l6J87m05Q2K3K54l56L67J48k25p3K94
$$ -1 -62 180 122 192 383 352 256 396 159 185 -40 -65 -139 -175 12 -393 -311 -288 -34 -390 -23 125 -100 -173 121
1309A21P4j60J45J0k34R0J3j35L3kj1K67j30J57m2k00L08j26k1j62j1j40J16j65
$$ 121 195 35 180 190 -44 46 59 -76 -43 -45 -56 211 81 238 196 -4 304 178 157 -5 -16 -156 -40 -205
1333b05L4k37K06r3r9J84O1jL25j8J6RL2J05k19J25n1j76J05j9k10K9l05K37M2
$$ -205 -171 -408 -202 -295 -394 -210 -149 -150 175 157 173 182 214 319 100 225 174 -2 103 84 -126 -97 -402 -165 -123
1358a23N2M0l4J5K09jq7J95k09j4j86k2m0L7LJ80p3l8J64NM4q8J80p1j29J79k17
$$ -123 -71 -31 -65 -50 159 158 71 266 57 43 -143 -165 -205 -168 -165 15 -58 -96 68 73 117 29 209 138 9 188 -29
1385b9q9O7jK1j96J15J36O2J5K6n5J83j77j41K06k81N6j58J4R7Q4N8q1k0J49N2
$$ -29 -118 -51 -52 -31 -227 -112 24 86 101 127 72 255 78 -63 143 -138 -82 -240 -226 -129 -45 13 -68 -88 61 113
1411A13j42j60J16K21jj00Lr9OK38k5j58k05L35Lj50m6J34l8j14O7J10j67q1K11
$$ 113 -29 -189 -73 148 147 47 50 -49 -43 195 170 12 -193 142 145 -5 -51 83 45 -69 -2 108 -59 -140 71
1436G1k43J14Rr2K97p0j10J07o7J79j19j43K63k60q2L65r8k9N0r5J03j1N1j02
$$ 71 -172 -58 -49 -141 156 86 -24 83 16 195 76 -67 196 -64 -146 219 121 92 142 47 150 139 190 88
1460H8m7m8M0K8j41q6pQ1L2k56K98j68M1R0J00N3R6j23k0j9R5J96l90J17r6KJ98
$$ 88 41 -7 33 61 -80 -166 -173 -92 -60 -316 -18 -186 -145 -55 45 98 194 71 51 32 127 323 -67 50 -46 -44 154
1487A54k32O6J9J87j68k18K85j51q9Q3MM2j9j46m0J96k03J36N5K42j64qQ2j4k22
$$ 154 -78 -12 7 194 26 -192 93 -58 -147 -64 -60 -18 -37 -183 -223 -27 -230 -94 -39 203 39 31 113 99 -123
1512a23K41k6j12K13j30j9J84k04l4o9J44n8k79L90k16p4J88L6m6q0N1j54L87
$$ -123 118 92 -20 193 63 44 228 24 -10 -79 65 7 -272 118 -98 -172 16 52 6 -74 -23 -177 210
1535B10j08j58k91L47L2M0N8k14N7K41M9k09j7R2o2j4L6o2j03K06k36l05M63k26
$$ 210 102 -56 -347 0 32 72 130 -84 -27 214 263 54 37 129 67 53 89 27 -76 130 -106 -411 52 -174
1559a74R3k8P3M7k8j60L18j06o7k99K16K39j01ML7j08o9L48q6pNM7j21P9R2k34
$$ -174 -81 -109 -36 11 -17 -177 141 35 -32 -331 -115 124 23 27 64 -44 -113 235 149 142 147 194 73 152 244 10
1585A0k1J12j07m3j85M6J2K1n1J64j31J11q2K55O1j93J23M0NJ22k2j70J04K4o6
$$ 10 -11 101 -6 -49 -234 -188 -176 -155 -206 -42 -173 -62 -144 111 172 -21 102 142 147 269 247 77 181 205 139
1610A39o9j48qq6J79L58m36j96L64m1lJ05J8k32J56l3k86P6j20P4k1L86k32J43
$$ 139 70 -78 -86 -172 7 365 -71 -267 97 56 53 158 176 -56 100 67 -219 -143 -263 -189 -210 176 -56 87
1634H7j2lJ47j94J19M0o4p2O0M1j54k25N2K02o8kL3R2j02J10J01j96J56j4M5j79
$$ 87 75 72 219 25 144 184 120 48 108 149 -5 -230 -178 24 -44 -46 -13 79 -23 87 188 -8 148 134 179 0
1660@P1k16K0M0J19j70J8J6J66oj9j07Q7m7Q6J9r7N5J2R3N5l4m8j45n4P6J56j81
$$ 0 71 -145 -125 -85 34 -136 -118 -102 64 58 39 -68 19 -28 58 77 -20 35 47 140 195 161 113 -32 -86 -10 146 -35
1688c5j05J54j3n5O6k36J40K11J3j0o1P9m8K6P0p1q4n4j65J43j37R3L3k9K70q3
$$ -35 -140 14 1 -54 12 -224 -84 127 140 130 69 148 100 126 196 125 41 -13 -178 -35 -172 -79 -46 -75 195 112
1714A12k8J34k6q8o8m2j11o4O3k00J89j6j16P1J63J6O0J18o1Q2j73J08j13J64
$$ 112 84 218 192 104 36 -6 -117 -181 -118 -318 -129 -145 -261 -190 -27 -11 49 167 106 188 15 123 10 174
1738A74j58j21n7J37Q3j31K67j27R6k7k0m0J7k14K8jr5Qj23J18J11l3J1J26k4
$$ 174 16 -105 -162 -25 58 -73 194 67 163 136 116 76 93 -121 -93 -94 -189 -181 -304 -186 -75 -108 -97 29 5
1763EJ95j77J43Om5K30l45J12P9k73P2p4p0J05k51L37m1j48J21l2J53J05k08R2
$$ 5 200 23 166 172 127 357 12 124 203 -70 2 -72 -142 -37 -288 49 8 -140 -19 -51 102 207 -1 91
1787I1q6On4nP2k01P5N8J04L6Lj51K38q8Q5l2Kp5l6n3L5k6Ml5j68J30p1o5k9J07
$$ 91 5 11 -43 -48 24 -177 -102 -44 60 96 99 -52 186 98 183 151 153 78 42 -11 24 -2 2 -33 -201 -71 -142 -207 -236 -129
1817a29MJ40q6K3N1M6R2j53J98r6j67o6J65J0r7m6M2oM9M2j2O4r2J72j32m3l8
$$ -129 -125 15 -71 -48 3 49 141 -12 186 90 -77 -143 22 32 -65 -111 -69 -75 -26 16 4 68 -24 148 16 -27 -65
1844f5J01N5k23J81j24J24k03J41L7r3M7J7n8mj5O7j16J00J08Nq3O9n5J66o8j9
$$ -65 36 91 -132 49 -75 49 -154 -13 24 -69 -22 -5 -63 -67 -82 -15 -131 -31 77 82 -1 68 13 179 111 92
1870I2j37R7m3P3r1J74k44O7l3Jj6n7Q4p4J46j77K07j23kN2kj03j8m3J72J72o2
$$ 92 -45 52 9 82 -9 165 -79 -12 -45 -44 -60 -117 -33 -107 39 -138 69 -54 -56 -4 -6 -109 -127 -170 2 174 112
1897A12R8j22L2j03J54q9k54L33j90o6J95o4r3J02n0m7J48p6j35J05j82K59j37
$$ 112 210 88 120 17 171 82 -172 161 -29 -95 100 36 -57 45 -5 -52 96 20 -115 -10 -192 67 -70
1920g0J21ok64J29J19j10J32r4R3m0j07P0J03n0K8M3n5l2jJ35n2j13j74J22J50
$$ -70 51 45 -219 -90 29 -81 51 -43 50 10 -97 -27 76 26 54 97 42 10 9 144 92 -21 -195 -73 77
1945G7j7j88j6J20n8K4NK93k72O8N1L0r9K7O9n3J46k06L3j0l3n6K95j26k64J61
$$ 77 60 -128 -144 -24 -82 -58 -53 240 -32 36 87 117 18 45 114 61 207 1 34 24 -9 -65 230 104 -160 1
1971Al2Jk14L02j29Q6j08J00j53M7J91k1j18L4j6k6J80k85J78M9j26l1J50r2M3
$$ 1 -31 -30 -244 58 -71 15 -93 7 -146 -99 92 71 -47 -13 -29 -55 125 -160 18 67 -59 -90 60 -32 11
1996A1N1J01j77O7m1J32q8K4n3r2L1J20k7R7p5j40OL9j86J99j46n4K36l0J22j11
$$ 11 62 163 -14 53 12 144 56 80 27 -65 -34 86 59 156 81 -59 -53 -14 -200 -1 -147 -201 35 5 127 16
2022A6P3R5Rj62Nm5M3k7p2J00Rj55J75q3M6mQ4N7j97k1O5o7l6J15p1m6j80K3J25
$$ 16 89 184 193 31 36 -9 34 7 -65 35 44 -111 64 -19 27 23 107 164 -33 -54 11 -56 -92 23 -48 -94 -274 -251 -126
2051a26K04n5j11K8J87j71J09J42r7j38J28k4n4j30P2j01J03j53K02n4M8j50K17
$$ -126 78 23 -88 -60 127 -44 65 207 110 -28 100 76 22 -108 -36 -137 -34 -187 15 -39 9 -141 76
2074G6j28j35K50M5l8l2k1j30J75r5J81l07J71m2J7qp0j29K95q0j2l0k43K40m3
$$ 76 -52 -187 63 108 70 38 17 -113 62 -33 148 -159 12 -30 -13 -21 -91 -220 75 -5 -17 -47 -290 -50 -93
2099i3J11N1p8q2P6R0j76L8M1o2J2m8J29k41K47n3Q2j15j6J0K14k09K66j40k36
$$ -93 18 69 -9 -91 -15 75 -101 -63 -22 -84 -72 -120 9 -232 15 -38 44 -71 -87 -77 137 -72 194 54 -182
2124a82K22p7K6Q4j4j26J13K5K5k3j12J19k50J02Q8j97K40n3J7m6J30j29J2R4
$$ -182 40 -37 -11 73 59 -67 46 71 96 73 -39 80 -170 -68 20 -177 63 10 27 -19 111 -18 -6 88
2148H8j37o4K75L1j96J04q3R5k07J54l8P6l2j80K05M6q3pL5j30RL2R1j71P8Q5
$$ 88 -49 -113 162 193 -3 101 18 113 -94 60 22 98 66 -114 91 137 54 47 82 -48 -39 -7 84 -87 -9 76
2174G6j15p7J81j95Q2l6J63j06R5j57J55o6mJ33o4O4o3j5KQ5k79K16j26p4J27
$$ 76 -39 -116 65 -130 -48 -84 79 -27 68 -89 66 0 -4 129 65 129 66 51 53 138 -141 75 -51 -125 2
2199Bm8m4J35J37k16N8J1Q6l27K86q7n3J14n3P0p7n0L7O5p6K48l12j27L15Q6j59
$$ 2 -46 -90 45 182 -34 24 35 121 -206 80 -7 -60 54 1 71 -6 -56 -19 46 -30 218 -94 -221 94 180 21
2225B1P0Q5l5j37J74j46p7l5k0%Q7q7l8J50K0J6Lp5J34o9P7j12l5R0p1J01q1P1
$$ 21 91 176 141 4 178 32 -45 -80 -100 -100 -13 -100 -138 12 32 48 51 -24 110 41 118 6 -29 61 -10 91 10 81
2253H1Q6k30n4M6k3J30k5M8p3K2j12K52j43oM1o9P5j8j95Q1J85j9L9o4n6n7k2
$$ 81 167 -63 -117 -71 -94 36 11 59 -14 8 -104 148 5 -1 40 -29 46 28 -167 -86 99 80 119 55 -1 -58 -80
2280h0J08j14K75j83k4M5rJ34j35pJ21j80q0J30Q6m1l7k8n0p5O9J29J2N5o6o6
$$ -80 28 -86 189 6 -18 27 18 152 17 10 131 -49 -129 1 87 46 9 -19 -69 -144 -75 54 66 121 55 -11
2306a1M7k01K16r3p8J37L2L7o5K30m42K09MJ08j42K2J43j38M5k71J58J94j34j5
$$ -11 36 -165 51 -42 -120 17 49 86 21 251 -191 18 22 130 -12 10 153 15 60 -211 -53 141 7 -8
2330hK1j08J44m6j52N0j25L6J97P3j5k06J39J00j39M3P2j03N9q9J07j44M9m2L96
$$ -8 13 -95 49 3 -149 -99 -224 -188 9 82 67 -139 0 100 -39 4 76 -27 32 -57 50 -94 -45 -87 309
2355C09k29j10M9j7j19o4J05N2j59K00j1j57p5K04J22j31j68J43pQ7j09R7p1J75
$$ 309 80 -30 19 2 -117 -181 -76 -24 -183 17 6 -151 -226 -22 100 -31 -199 -56 -63 24 -85 12 -59 116
2379A16k44K34p3l1K00l35J57J5M5j13N3J1p8M0O9k83J77M5m4R8m0m6J9J2l3K2
$$ 116 -128 106 33 2 202 -133 24 39 84 -29 24 35 -43 -3 66 -217 -40 5 -39 59 19 -27 -8 4 -29 -7
2405gO3OM6k74K05q5J36j9j78J84mo0K19n1j51o7O4m3J65l6p6R7m20K44m5J17
$$ -7 56 62 108 -166 39 -46 90 71 -107 77 73 13 232 181 30 -37 27 -16 149 113 37 134 -286 -42 -87 30
2431C0kr5l6J87n7J9o3j6R5j27Q3o6N3K9m0J39j26o6J23l4j21jJ07l4l3J43m6
$$ 30 28 -67 -103 84 27 46 -17 -33 62 -65 18 -48 5 34 -6 133 7 -59 64 30 -91 -92 15 -19 -52 91 45
2458D5J9K9n8N0k7j22J58j46L7k8j06J30K3n3L5j15R5P2R2j93l8l4J03J85n6l0
$$ 45 64 93 35 85 58 -64 94 -52 -15 -43 -149 -19 4 -49 -14 -129 -34 38 130 -63 -101 -135 -32 153 97 67
2484F7k20J96k28J90Ok8R2J9l1P1j83M2J38k8q3j03J30Q5j35K3R9k15M6O4J32
$$ 67 -153 43 -185 5 11 -17 75 94 63 134 -49 -7 131 103 20 -83 47 132 -3 20 119 -96 -50 14 146
2509A46j60N1J5j53J92j04K5o4nQ6j61J72jq0o3N4l7K5r2J21j1J44N7k00LP6k0
$$ 146 -14 37 52 -101 91 -13 12 -52 -57 29 -132 40 39 -41 -104 -50 -87 -62 -154 -33 -44 100 157 -43 -40 36 16
2536A6j28K30j58N3m5j26L70l14l7J82LK8R3j40j09J40j79Q7L4m8m3L6oM6j20
$$ 16 -112 118 -40 13 -32 -158 212 -102 -139 43 46 74 167 27 -82 58 -121 -34 0 -48 -91 -55 -61 -15 -135
2561a35K8J13J49k07K47k59J19r2L2p6K43q6j32J54j92J43pL9k1o4k8R5J19j59
$$ -135 -107 6 155 -52 195 -64 55 -37 -5 -81 162 76 -56 98 -94 49 42 81 60 -4 -32 63 182 23
2585B3n9J81o7m6J5Qr2J03r2R9rnk75J3Q7J87j63R2J4m7R1l2j44J73j8j00Q0K8
$$ 23 -36 145 78 32 47 55 -37 66 -26 73 64 59 -216 -203 -116 71 -92 0 14 -33 58 26 -118 55 37 -63 17 45
2613D5j00Q7q5R3j00J33o3q3m1J02jj05J5J55k12K54j62Q8k1J83j50l5k8pm2k7
$$ 45 -55 32 -53 40 -60 73 10 -73 -114 -12 -13 -118 -103 52 -160 94 -68 20 -1 182 32 -3 -31 -38 -80 -107
2639a07J65m0j63N4Q4M5q0M6P9j42J73r4p5P3L1j25JJ3J18j85J58j40J25Q9k14
$$ -107 58 18 -145 -91 -7 38 -42 4 83 -59 114 20 -55 18 49 -76 -75 -62 56 -129 29 -111 14 103 -111
2664a11J3K88j17RJ0r8J4M5N5K0m3K9l0j53J7k7P7P7o2LL4j3N8k28J95m0J24k34
$$ -111 -98 190 73 82 92 -6 8 53 108 128 85 114 84 -69 -52 -79 -2 75 13 16 50 37 95 -133 62 22 146 -88
2692h8J54j57J86l8j4L2r2OQ1j59J20j33J89m1j83J0K22j13o7K06n5n0J05j94
$$ -88 66 -91 95 57 43 75 -17 -11 70 -89 31 -102 87 46 -137 -127 95 -18 -85 121 66 16 121 -73
2716g3K0J46j53p5K84k01J15n4P1j18Q6o9M1N6j43R5r5J04Q9j49L1K8j09J6j3
$$ -73 -53 93 -60 -135 149 -52 63 9 80 -38 48 -21 20 76 -67 28 -67 37 126 -23 8 36 -73 -57 -70
2741g0K65k62m1J67K0n1N6j74R5j20R2P1Or0J21j78J70k1j24J88N0k42P6JK08
$$ -70 195 -67 -108 59 79 28 84 -90 5 -115 -23 48 54 -36 85 -93 77 56 -68 120 170 -72 4 5 213
2766B13q5r1N4k28L82k29nJ49j04j07Q3j1j19N5M0M3j20j1Oo2J44j44J36J24j26
$$ 213 128 37 91 -137 245 16 11 160 56 -51 32 21 -98 -43 -3 40 -80 -91 -85 -147 -3 -147 -11 113 -13
2791a3j4m7O9o5o9P1Q1n0M3N3q7lQ1p3R2rk13R2j20J95j38K79q8R5k45J91j03
$$ -13 -27 -74 -5 -70 -139 -68 13 -37 6 59 -28 -31 50 -23 69 60 -153 -61 -181 14 -124 155 67 162 -83 108 5
2818ERk04J29M8J6M1J39k72Q2J71k43R4o0J15o6L1j40J04O0j52N6J56J1j33O8
$$ 5 14 -190 -61 -13 3 44 183 -89 -7 164 -79 15 -45 70 4 35 -105 -1 59 -93 -37 119 130 -3 65
2843F5R4j05k3q0J9M8J9q0j40J93K1mr6J41j14p9L8L9K0j5mJ30M1k94Q8kJ04m6
$$ 65 159 54 31 -49 -30 18 37 -43 -183 10 31 27 -69 72 -42 -121 -83 -44 -24 -39 -43 87 128 -166 -78 -80 24 -22
2871b2N5Oj40M1lJ2o4Q0K4q3J60j83OO4Kk8K15j17l1q6J56P5j58lJ28j25J06l28
$$ -22 33 39 -101 -60 -63 -51 -115 -35 -11 -94 66 -117 -111 -47 -45 -73 142 25 -6 -92 64 139 -19 -22 106 -19 87 -241
2899b41J41J90k6k13N2M3J18r7r8J81o5J5Oj23Q6l5j6O0l5K25j41J22k08K8j00
$$ -241 -100 90 64 -149 -97 -54 64 -33 -131 50 -15 0 6 -117 -31 -66 -82 -22 -57 168 27 149 -59 -31 -131
2924a31R6o7R3j06J66j6J52l11J38L8r6J28r9R8n9KQ0r5j0J54j54Q7o7L5k8j9
$$ -131 -35 -102 -9 -115 51 35 187 -124 14 52 -44 84 -15 83 24 26 106 11 1 155 1 88 21 56 28 9
2950IM0j26m5K37r5M6j26J31j28J62r9p3%KO0N2J91l17N1J66k06J48k2p5j6P9
$$ 9 49 -77 -122 115 20 66 -60 71 -57 105 6 -67 -67 -65 -5 47 238 -79 -28 138 -68 80 58 -17 -33 46
2976D6M6k50J89K0j1Jp6J11j58m8J48N1k8r8Q9N1L1k01Q4o0K80j38k7j15J92j39
$$ 46 92 -158 31 51 40 41 -35 76 -82 -130 18 69 41 -57 32 83 114 -87 -3 -63 217 79 52 -63 129 -10
3002a0j13PJ07r0K8J34l9K4n9oj2n0j8K36k48LK11R7l11K33k00j3J65L6k81R1
$$ -10 -123 -116 -9 -99 -71 63 24 48 -11 -17 -29 -79 -97 139 -109 -106 105 202 -109 124 -76 -89 76 112 -169 -78
3028g8P1o7P3m8L1L3m1j09J36J0j19J58j23J11q3r9K36m6L2M9l24J54k7J80j64
$$ -78 -7 -74 -1 -49 -18 15 -26 -135 1 11 -108 50 -73 38 -45 -144 92 46 78 127 -197 -43 -70 110 -54
3053e4J74n1Q7j09j00J37j70J57j05k7l5M4p3J76Q6j86M6p2j72L24k01J28N5m5
$$ -54 120 69 156 47 -53 84 -86 71 -34 -61 -96 -52 -125 51 137 -49 -3 -75 -247 77 -124 4 59 14
3077A4OL5j19J47j49K0K6N9j43J35Q6j44K9J1K7J09j18n4j1J4J78j68q8O2L6R6
$$ 14 20 55 -64 83 -66 -46 -20 39 -104 31 117 -27 2 13 40 149 31 -23 -34 -20 158 -10 -98 -36 0 96
3103I6r9Q8K5k31J87j58l1k0K07q4Mn4R9n1J46l4r6N1j22L0J57j49Q7r9M0L0j4
$$ 96 -3 85 110 -121 66 -92 -123 -143 64 -20 -16 -70 29 -22 124 90 -6 45 -77 -47 110 -39 48 -51 -11 19 5
3130EJ04j91J12m0J1m9jk7R2Q9k42Q4QM4J35r8j04M5q0J72q0P7K3j28J01K8k42
$$ 5 109 -82 30 -10 1 -48 -49 -76 16 105 -137 -53 -45 -1 134 36 -68 -23 -103 69 -11 66 89 -39 62 90 -152
3157a52J76n7p1J86k99J74j9O0J30j62J35j04q1J85j16O4j11m4M7J88r6m4J4%
$$ -152 24 -33 -104 82 -217 -43 -62 -2 128 -34 101 -3 -84 101 -15 49 -62 -106 -59 129 33 -11 3 3
3181Cl3K7n6N7r7J89n7q4P3j11P9oJ6n2QPk66K13K1K7K6N1j7j71Q6j34J90J28
$$ 3 -30 -3 -59 -2 -99 90 33 -51 22 -89 -10 -16 0 -52 -44 -37 -303 -90 -69 -42 -16 35 18 -153 -67 -201 -11 117
3209A17j16J20j17J6j36J28RM4l6n3J11j91K12j6p0j52J35q9oO7o1J17J1j59Q3
$$ 117 1 121 4 20 -116 12 21 65 29 -24 87 -104 108 92 22 -130 5 -84 -90 -23 -84 33 44 -115 -32
3234c2L3p4O1j7R7l2N6l7O3j67J06j03Q3j20M2K03j09O8n6l12J90J74j01M0l0
$$ -32 1 -73 -12 -29 68 36 92 55 118 -49 57 -46 37 -83 -41 162 53 121 65 -247 -57 117 16 56 26
3259B6RJ2k1m3N7mj8K0l0j12J16m6J2n6jM4K08k12L3M6l6J29k75J31j65L8K94
$$ 26 35 47 26 -17 40 36 18 38 8 -104 12 -34 -22 -78 -79 -35 173 -39 -6 40 4 133 -142 -11 -176 -138 156
3286A56j67J14j27j83K49j6K1J09k63R1N8J86j27k07J90k9r0m5J61j00qj32K32
$$ 156 -11 103 -24 -207 42 26 47 156 -107 -16 42 228 101 -106 84 55 -35 -80 81 -19 -27 -159 73
3309G3o7M5o9m9p2J69r3J09l7J43k10j25K60n6o6J2J23j97J84k2Rj1l2M4m8q8
$$ 73 6 51 -18 -67 -139 30 -63 46 9 152 -58 -183 77 21 -45 -33 90 -107 77 55 64 53 21 65 17 -71
3335g1J11n0j07k5J53k3R9q4j2k5%l9J55M2k2l24J48J58k06J56m5J24j62j37J92
$$ -71 40 -10 -117 -142 11 -12 87 3 -9 -34 -34 -73 82 124 102 -222 -74 84 -122 34 -11 113 -49 -186 6
3360Fq9J28q4RN3J10l42J40J73k55J31q4P0K22j34q2Q1j46K2P3j23R5L2j3K0j5
$$ 6 -83 45 -39 -30 23 133 -209 -69 104 -151 -20 -104 -34 188 54 -28 53 -93 -71 2 -121 -26 6 -7 13 -2
3386bj12J85j13N7N6j74Q5P6q0N8j6M0j02K77j96r0N7N1j65O8P2q3PJ54n6k4P6
$$ -2 -114 71 -42 15 71 -103 -18 58 -22 36 20 60 -42 235 39 -51 6 57 -108 -40 32 -51 -44 110 54 30 106
3413A06O0l41Q9l8K27%o1j8m3p3K1qL4J07j46J06k32K48j27m4J35J7N8op5o9J53
$$ 106 166 -175 -86 -124 103 103 42 24 -19 -92 -71 -79 -45 62 -84 22 -210 38 -89 -133 2 19 77 71 -4 -73 80
3440H0ol6k01L98r3j54jQ2N8k21R2O6j69J94k02J30q3J40o7j40O0m8J51k5j8O6
$$ 80 74 38 -163 235 142 -12 -13 69 127 -94 -2 64 -105 89 -113 17 -66 74 7 -133 -73 -121 30 5 -13 53
3466E3k02J29J68l80K51L5p0K2j16J78r2Q1r6o0p5J3J53m4M8P8l0k12J78j5jn0
$$ 53 -149 -20 148 -232 19 54 -16 6 -110 68 -24 57 -39 -99 -174 -161 -8 -52 -4 74 44 -168 10 -5 -6 -56
3492e6PMN7Q2N6j4j00o6J05q9k1n3J04j21N8J92p5k49J96M6m6P7j11K01j8k30
$$ -56 -49 -45 12 94 150 136 36 -30 75 -14 -35 -88 16 -105 -47 145 70 -179 17 63 17 94 -17 184 166 -64
3518f4j17J29J30j10L2j9m1o4K5K7k8J09P1pK5n7q2J13j37K89j64j33J96O6l53
$$ -64 -181 -52 78 -32 0 -19 -60 -124 -99 -72 -100 9 80 73 98 41 -41 72 -65 224 60 -73 123 189 -164
3543a64J63j89J78M3j22J10j86J46J0j58K6J32j43K23o4L9j13R6j32LM2N7J04
$$ -164 -1 -190 -12 31 -91 19 -167 -21 -11 -169 -143 -11 -154 69 5 44 -69 27 -105 -102 -60 -3 101
3566A01l7m1J28k44K2L2O4Qj24J48k9l7l1r5Q9K9o3l3J89j27p9R2J8n5L9Oo8N6
$$ 101 64 23 151 -93 -71 -39 25 33 -91 57 28 -9 -40 -135 -46 -17 -80 -113 76 -51 -130 -38 -20 -75 -36 -30 -98 -42
3594d2J41o2pj0j7j0J38j24L1N2l1q8J03k9o9r7J2K63p5J3j08q7Q1j7l6J94k30
$$ -42 99 37 30 20 3 -7 131 7 38 90 59 -29 74 45 -24 -121 -109 154 79 92 -16 -103 -22 -39 -75 119 -111
3621a11R8P4K6l24J85K38j61n5J44j18O8q4R0k4l7o9l3J88o8k9r0J83j97l3K35
$$ -111 -13 61 87 -237 -52 186 25 -30 114 -4 64 -20 70 46 9 -60 -93 95 27 -2 -92 91 -106 -139 96
3646I6j03J42k60K00l1O7J3j01J11j61J89p9Oj88J14p8J52Qk68M06k00rj0o7N7
$$ 96 -7 135 -125 75 44 111 124 23 134 -27 162 83 89 -99 15 -63 89 97 -171 235 35 26 16 -51 6
3671Fn2J65j6k00Q7n1J9K4rr2J34m8J46j19M9l1M2N8j79J76MO4k56N8o9R9J5j32
$$ 6 -46 119 103 -97 -10 -61 -42 -18 -27 -119 15 -33 113 -6 43 12 54 112 -67 109 113 177 -79 -21 -90 9 24 -108
3699a08J27L0R9j25nJ10l47K69J33k08Q7pk9j73J59K8o9J89r7j02J85j32M9j91
$$ -108 19 49 148 23 18 128 -219 50 183 -25 62 55 26 -147 12 40 -29 160 63 -39 146 14 63 -128
3723a28J91j82p1K65o6Q0r8J19o4r6Jl8M7K5n3J61m1k1p6L3N0K1j20N5J17j13
$$ -128 63 -119 -190 75 9 89 -9 110 46 -50 -49 -87 -40 -15 -68 93 52 31 -45 -12 38 59 -61 -6 111 -2
3749bJ66j94k2r4M9K07q8l0j8p4K08k64J47j32P7J50k02K21l9q6JJ29m0j48J09
$$ -2 164 -30 -52 -146 -97 110 22 -8 -26 -100 108 -156 -9 -141 -64 86 -116 105 66 -20 -19 110 70 -78 31
3774C1j74N9J37j39J75j21J2j3j00K06m9j11K6R3j00R7j22J87j39l0J10k94K49
$$ 31 -143 -84 53 -86 89 -32 -20 -33 -133 73 24 -87 -61 32 -68 29 -93 94 -45 -75 35 -259 -10
3797a0J07j31P6n4K6J1j07j11L61p7r9j5J00P5k73K50j96R8P3j07N8r1K2J65j90
$$ -10 97 -34 42 -12 14 25 -82 -193 168 91 -8 -23 77 152 -121 129 -67 31 104 -3 55 -36 -14 151 -39
3822c9J27j09K5lJP7k47K25M5j07O8M9r3K0j24J71n8j02j68L44j34R9j69J56q9
$$ -39 88 -21 4 1 2 79 -168 57 102 -5 63 112 19 39 -85 86 28 -74 -242 102 -32 67 -102 54 -35
3847c5p1K53k9j64k5J60o7K3l2j02J81j38q0J49K7j71J44q9K87j63j13O1j44K28
$$ -35 -106 147 118 -46 -71 89 22 45 13 -89 92 -46 -126 23 50 -121 23 -66 221 58 -55 6 -138 90
3871I0p2K9pl7Q3j72J42Q9j25O8o5l4j4J6l3O6K1j7r7j38J75P3n1n1J50j48O1
$$ 90 18 47 40 3 86 -86 56 145 20 88 23 -11 -25 -9 -42 24 45 28 -69 -207 -32 41 -10 -61 89 -59 2
3898Bj50J22R9o0l3J7J38l3p0L4k2q7J37j18O4R5o9o3QQ2p2l0J35P7k04n2j2J33
$$ 2 -148 -26 73 13 -20 -3 135 102 32 66 44 -43 94 -24 40 135 66 3 11 93 21 -9 126 203 -1 -53 -65 68
3926F8m3n2N2qj2M1L9l40J90q6K33j45K11L4o6o3q8No3J44l17L27p5j8Lk3J23
$$ 68 25 -27 25 17 5 46 85 -255 -65 -151 82 -63 148 182 116 53 -35 -30 -93 51 -266 61 -14 -32 -29 -52 71
3953G1j0j44J43k07J84J2r9K9L0Q4O5j27J3j06J66j39J81r1MR2k4%j20j4j5Q7
$$ 71 61 -83 60 -147 37 49 -50 -21 9 93 158 31 44 -62 104 -35 146 55 59 151 127 127 7 -7 -22 65
3979F5n2J24q9j26J08k0qK8p8P8J41oq3r4o1J31R9Mj49mm9O7j12K09p1q5K6N1
$$ 65 13 137 48 -78 30 10 2 30 -48 30 171 165 82 -12 -73 58 157 161 12 8 -41 26 -86 123 52 -33 -7 44
4007D4n9J68k13N5K3oj5M5pj29M0K2R0j47J39j53N1J79l29K13k6O8l8l6k6K0M8
$$ 44 -15 153 -60 -5 18 12 -3 42 35 -94 -54 -32 58 -89 50 -103 -52 127 -202 11 -15 53 15 -21 -47 -27 21
4034B1pm6O0P5j55J13PJ8K4r7l2Q5L1r3j15J45j5j24O7k6J15M6o5N7m9J61j51
$$ 21 14 -32 28 103 -52 61 68 86 110 13 -19 66 97 4 -111 34 19 -105 -38 -64 51 97 32 89 40 201 50
4061E0n5n0p7P2K48j22j46m7J27j37R1pKj9M5J15n7j4j16N9j35Q3K60j42Mkk3
$$ 50 -5 -55 -132 -60 188 66 -80 -127 0 -137 -46 -53 -51 -70 -25 90 33 19 -97 -38 -173 -90 170 28 32 30 7
4088Gq6Q0O0j46J23p8M2k8Nr3P8qK1L8P8n2oJ35k38P7qj89K14o2j07J32l9J05
$$ 7 -79 1 61 -85 38 -40 2 -26 -21 -114 -36 -44 -23 15 93 41 35 170 -68 9 1 -188 26 -36 -143 -11 -50 55
4116E5j80o2J97m7R5L7q9q1J90j58P3o7j0K08k27O9p5m8Q7j2j22J68j24K5N9R4
$$ 55 -125 -187 10 -37 58 95 6 -75 115 -43 30 -37 -47 161 -66 3 -72 -120 -33 -45 -167 1 -123 -98 -39 55
4142E5oM6j58P4M8L8j79Q1N3j75K44k02nK00k30M5J00M4L9k88K49m7mK7PM4j98
$$ 55 49 95 -63 11 59 97 -82 -1 52 -123 121 -81 -86 114 -116 -71 29 73 112 -176 73 26 22 49 56 100 -98
4169i8K8J87k20J3J25K5om8l5J09j39n1J02m5j6O9q3J63k47K87k94K11j04K5n4
$$ -98 -70 117 -103 -90 35 60 54 6 -29 80 -59 -110 -8 -53 -69 0 -83 80 -167 120 -174 37 -67 -42 -96
4194i6l6J07Pl4Q4n8j12J56j36P5R0j19r5J16K00r9L3j93J13j07L0J08q6J13n7
$$ -96 -132 -25 -18 -52 32 -26 -138 18 -118 -43 47 -72 -167 -51 149 50 83 -110 3 -104 -74 34 -52 61 4
4219Dj3l6j24K36r6k3J74k71J89j66O8j01J22R4l1J2j57J85k20J02J22K6r7j6
$$ 4 -9 -45 -169 67 -29 -52 122 -149 40 -126 -58 -159 -37 57 26 38 -119 66 -154 -52 70 96 -1 -17
4243a7q1J57J2j08K0J03k04J79j72j6K78k36J24J6K8O0l02Q0j72L05K07k87J3
$$ -17 -98 59 71 -37 -17 86 -118 61 -111 -127 151 -85 39 55 83 143 -159 -79 -251 54 261 -26 -13
4266a3l1L7n9L5Q0L7k54M4R0N8Q6r2L9j4m3O6j16P9j4j24n1K29O3k52Q0J93k04
$$ -13 -44 -7 -66 -31 49 86 -168 -124 -34 24 110 18 57 43 0 66 -50 29 15 -109 -160 69 132 -120 -40 153 -51
4293e1K2P1j61J13j09J3R7j79L31k26K47j50K7r2n0P1J0L9j7K2p8J37j43j15J71
$$ -51 -29 42 -119 -6 -115 -102 -5 -184 147 -79 168 18 45 -47 -97 -26 -16 23 6 28 -50 87 -56 -171 0
4318@Pj03K48k17J33K0o0j20J34r0o2M6n2K01k4k09Q2p7J25J35j77J62l0pJ38
$$ 0 7 -96 152 -65 68 88 28 -92 42 -48 -110 -64 -116 85 61 -148 -66 -143 -18 117 -60 102 72 65 203
4343B03k78J57Mj73P1R9j59n5K08j16N0N6j36K15j82K55k05K9J24j82j3K4jK3
$$ 203 -75 82 86 -87 -16 83 -76 -131 77 -39 11 67 -69 146 -36 219 14 43 167 -15 -28 -4 -5 18
4367A8K5n2l6K36j73K5oK3m5p6L2J22j84j43L66q7kr9j4O6N9n0mj31l4L09n8j00
$$ 18 43 -9 -45 191 18 43 37 60 15 -61 -29 93 -91 -234 132 45 43 -56 -70 -4 55 5 1 -130 -164 145 87 -13
4395a3j30K72j02O6k47K59o5L0m8J41k09K1ln3%Q6j63K01m7N7m1R4j75J26j04
$$ -13 -143 129 27 93 -154 105 40 70 22 163 -46 -25 -28 -81 -81 5 -158 43 -4 53 12 106 -69 57 -47
4420d7k6K1J34Qj13j18J82K8r3oJ22j39J23j62J30k0n5m4K36j86J3J54j77JM7
$$ -47 -73 -52 82 90 -23 -141 41 69 -24 -30 92 -47 76 -86 44 24 -31 -75 161 -25 -12 142 -35 -34 13
4445A3l2M3l4j46K77lL4q2n7n3M8J3n0K9o7K28j35j86J63j2PP6O6m3l3j60L11
$$ 13 -19 24 -10 -156 121 118 152 70 13 -40 8 21 -29 0 -67 161 26 -160 3 -9 -2 74 140 97 64 -96 215
4472B15k45NM7m7P6j37J40j01o3N0K8l7L0K0PQJ91k32k5mk0R7r3J40q5J5r2PJ27
$$ 215 -30 -25 22 -25 51 -86 54 -47 -110 -60 -32 -69 -39 -19 -12 -4 187 -45 -70 -74 -94 3 -90 50 -35 -20 -112 -105 22
4501B2L1j44J88j04MJ24L7k73pJ24l0J20j05j11K17j15P9j02k9r1J59k5R6l1j23
$$ 22 53 -91 97 -7 -3 121 158 -115 -122 2 -28 92 -13 -124 93 -22 57 -45 -74 -165 -6 -31 65 34 -89
4526h9R8r6J97j34mr8K9J71Rn9j31J14N2k3O0r0n9K01k52J59j45J56nj15J26O
$$ -89 9 -87 110 -24 -28 -126 -97 74 83 24 -107 7 59 36 96 6 -53 148 -104 55 -90 66 61 -54 72 78
4552G8k3kO7j53R2r2qRkK0m1Q3o7o3K24j81O4l1j0J91o8j80k6J55j00R9j09L2
$$ 78 55 53 120 -33 59 -33 -41 -32 -34 -14 -55 28 -39 -102 122 -59 5 -26 -36 155 87 -93 -119 36 -64 35 -74 -42
4580d2Jk7K8l1J32rj8M4j09J74j66J14Mj64o3K94j78l3P7j21J22j54K14j84q6
$$ -42 -41 -68 -40 -71 61 52 34 78 -31 143 -23 91 95 -69 -132 162 -16 -49 28 -93 29 -125 89 -95 -181
4605a81K25p4N0O1j96K32j58p2J15Q1q0j06k8J91k65J12J41j65J95j52L2J2R8
$$ -181 44 -30 20 81 -115 117 -41 -113 2 83 3 -103 -131 60 -205 -93 48 -117 78 -74 -42 -30 68
4628F8j05P0q2J46k8J7k06J55j9o4J11o0J01j47L5N2n8m2J5N8p1k7n0J34j34J58
$$ 68 -37 33 -49 97 69 86 -120 35 16 -48 63 3 104 -43 -8 44 -14 -56 -41 17 -54 -81 -131 3 -131 27
4654B7kq1J80k10jJ26K3J8N4k13J27n8l9o0J57J4j38J04M3j86J35L4Q3k02O0N
$$ 27 25 -56 124 -86 -87 39 62 80 134 -79 48 -10 -49 -109 48 62 -76 28 71 -115 20 54 137 -65 -5 0
4680@qM0p5k8J20j90J66M1j13kk9J2J29k51J13R4o7r5K11r0P9p6Q0j81K15j04
$$ 0 -8 32 -43 -71 49 -141 25 66 -47 -49 -78 -66 63 -188 -75 19 -48 -143 68 -22 57 -19 61 -120 95 -9
4706iJ10n5j82J82q0L4l6Q0k50L40q3Oj5j67M7J89j29J76l5m8j66M2nJ6M0Mk0
$$ -9 101 46 -136 46 -34 0 -36 44 -206 134 51 57 42 -125 -78 111 -18 158 123 75 -91 -49 -54 -38 2 6 -14
4733a4M3K3j35p4J25L7P0N5j96J30RK9j0k88K14P0j69o7K40p0L0Nq5j2R7k1p8
$$ -14 29 52 -83 -157 -32 5 75 130 -66 64 73 102 92 -196 18 88 -81 -148 92 22 52 57 -28 -40 57 36 -42
4760d2l4j07J06J2J07q1Pm4Q4P4j13J13j1j56J47o5P4n6O8J2k62J35n4K40j20
$$ -42 -76 -183 -77 -65 42 -39 -32 -76 8 82 -31 82 71 -85 62 -3 71 15 83 95 -167 -32 -86 154 34
4785C4n5J21j03k6O3j02K13oj67J34o0q5J03P1j55R9p9j03P5K37j91L7J29k62
$$ 34 -21 100 -3 -29 34 -68 145 139 -28 106 46 -39 64 135 -20 79 0 -103 -28 209 18 55 184 -78
4809g8J68j23R3n2r6K1M6M6p1KJ12j19K9J4L7N1J6k06K15j88J71jk10J02J33j91
$$ -78 90 -33 60 8 -88 -67 -21 25 -46 -44 68 -51 -22 -8 29 80 96 -110 105 -83 88 87 -123 -21 112 -79
4835g9KJ30k5j46J60L1q4J50j78m1NJ76o2J7L1j82J33o4q2n5P8J36K1j00Q9N6
$$ -79 -77 53 28 -118 42 73 -11 139 -39 -80 -75 101 39 56 87 -95 38 -26 -108 -163 -85 51 72 -28 61 117
4861A17j22q3N9J51j11p6K62j22l3l4j27J19N3KJ62l37J39Q6j92q2J65J8J34j71
$$ 117 -5 -88 -29 122 11 -65 197 75 42 8 -119 0 53 55 217 -120 19 105 -87 -169 -4 14 148 -23
4885b3j23J28kl9J31n5J06j07J05K9l21L38k25rJ43j73K92k59PJ2m6O8p0J21J39
$$ -23 -146 -18 -20 -59 72 17 123 16 121 150 -171 167 -58 -67 76 -97 195 -64 -57 -45 -91 -23 -93 28 167
4910A67j66q4p5M8QJ46j3n9m7J33j05M7J68r1n2K2m0o7J74k1N5J10j63k41J72
$$ 167 1 -83 -158 -110 -102 44 31 -28 -75 58 -47 0 168 77 25 47 7 -60 114 93 148 258 95 -146 26
4935B6j19R2R0j78N4J18l0o2l1K67k46J9L3k4M5J53j14j57N4p0n3L12k16J0J84
$$ 26 -93 -1 89 -89 -35 83 53 -9 -40 227 -19 0 33 9 54 207 93 -64 -10 -80 -133 179 -37 -27 157
4960A57j94l1M6P6j4p5k2P1j43J18N2k18K71R2k81K33k72O3L5N5Nk9o4m4K07j18
$$ 157 -37 -68 -22 54 40 -35 -57 14 -129 -11 41 -177 94 186 -95 138 -134 -71 -36 19 24 -5 -69 -113 94 -24
4986b4M0j7P3q5J83j47q6q8P6J77J7oj53J60k48Q5J18j26nJ89j34J01k07J83m3
$$ -24 16 -1 72 -13 170 23 -63 -151 -75 102 119 113 -40 120 -128 -43 75 -51 -56 133 -1 100 -107 76 33
5011C3o3J98q6m6%j48J85j81O3L8LJ7N5n5k0K2j78J76k8l0M3J12K5k21r9J36n2
$$ 33 -30 168 82 36 36 -112 73 -108 -45 -7 -4 13 68 13 -7 15 -163 13 -15 -45 -2 110 135 -86 -185 -49 -101
5038a01M1K2P0q8r4J36J02j30J40j69M8O5l5r4J18j43m7K16j00m1k2Q8n8J90j36
$$ -101 -60 -38 32 -56 -150 -14 88 -42 98 -71 -23 42 7 -87 31 -112 -159 57 -43 -84 -106 -18 -76 114 -22
5063b2M2q3nJ91k5q4j02k0J24k12J32J08K6p0O3l5j44K9N6J51j74J77k20J09r8
$$ -22 20 -63 -68 123 98 14 -88 -108 16 -196 -64 44 70 0 63 28 -116 -87 -31 120 -54 123 -97 12 -86
5088h6K56j85J60j41J52k74r4K88j77J63o0M5J4o3o2N1rj02J96L0k60J55Q2j06
$$ -86 170 -15 145 4 156 -118 -212 76 -101 62 2 47 61 -2 -64 -13 -22 -124 72 102 -158 -3 79 -27
5112b7J5R7r2N4k9N1o7J06j39J19j21P5J57k74P1Q6k24K34j61J09R6k57R7K7J0
$$ -27 -12 85 -7 47 18 69 2 108 -31 88 -33 42 199 -75 -4 82 -142 92 -69 40 136 -121 -24 3 13
5137A3J3J5N6J1j37J33j01K38j77j06o2J48j05J42j01j82K56k5j6J19o7j58J66
$$ 13 26 41 97 108 -29 104 3 241 64 -42 -104 44 -61 81 -20 -202 54 29 13 132 65 -93 73
5160G3j81R1P0o2m3J1P7n7m7Ro0K44j85J7j5J07L8j02l4j27J88N2k70K74j20K23
$$ 73 -108 -17 53 -9 -52 -41 36 -21 -68 -59 -119 125 -60 -43 -58 49 87 -15 -49 -176 12 64 -206 68 -52 171
5186A71j88j5J95j09k4J2l6N2k02Q8J50j8l03J78J69j39J21K2j65p7K57k23N7
$$ 171 -17 -32 163 54 30 42 6 58 -144 -56 94 76 -227 -49 120 -19 102 124 -41 -118 139 -84 -27
5209b7J3N4j49K63p7j60L9j18J61M7k5J5N0j4j72P0L0L7n0J9k8K5p8J00P2o6o2
$$ -27 -14 40 -109 154 77 -83 -44 -162 -1 46 21 36 86 72 -100 -30 0 37 -13 6 -22 3 -75 25 97 31 -31
5236c1L7l2j86K16Q4j4k24K02m6R0j91J0J16l4n4J4N4J18j04q2J60o4j71J7K24
$$ -31 6 -26 -212 4 88 74 -150 52 6 96 -95 -85 31 -3 -57 -43 11 129 25 -57 103 39 -132 -115 109
5261A09j59J50r4K01q9j41K19j99k8J35p3L5j13K06k55QJ94j75K46j07l9nm4k5
$$ 109 -50 100 6 207 118 -23 196 -3 -31 104 31 66 -47 159 -96 -88 106 -69 177 70 31 26 -18 -43
5285d3%J24j9j59J48R6m8L3n4p6j74J21L8K9M2k06J08QN4k2K3j13o6R1O0K01k87
$$ -43 -43 81 62 -97 51 147 99 132 78 2 -172 -51 -13 16 58 -148 -40 -32 22 0 23 -90 -156 -65 -5 196 -91
5312i1L1J27L7j78L6K18k56J50j52M3n8J51m8m8k0Q1j1m7P2pj53K06j30Q1L6r7
$$ -91 -60 67 104 -74 -38 180 -76 74 -78 -35 -93 58 10 -38 -58 23 12 -35 37 30 -123 83 -47 34 70 -27
5338b7P4n7n5N0J8J09p5m7J6o6J71j31l0P1k46K71P1m7k39J43M6L8j06J07k48
$$ -27 47 -10 -65 -15 3 112 37 -10 6 -60 111 -20 -50 21 -225 46 117 70 -169 -26 20 58 -48 59 -189
5363a89J98qk7M4j23J70k84K69m3j98J51R9q9Q0jk96K27Pj68K27k8k17K46N1p2
$$ -189 9 1 -26 18 -105 65 -219 50 7 -191 -40 59 -30 50 49 -247 -20 -13 -181 46 18 -199 47 98 26
5388B6j6J27m6j04q1J40k19J41M7j13J37j49J79qK8Jo9l2rJ39j50J01k5L5j7j10
$$ 26 10 137 91 -13 -94 46 -173 -32 15 -98 39 -110 69 61 89 90 21 -11 -20 119 -31 70 45 80 63 -47
5414d7L9J88j13N9j02Q7o0n0K9m3r7K22j73J62j05oJ71k52n1O2m6K14m7nj15Q3
$$ -47 -8 180 67 126 24 111 51 1 30 -13 -110 112 -61 101 -4 -10 161 -91 -142 -80 -126 88 41 36 -79 4
5440DJ95j94K9j17k8P7j6M2j0l6L5l4O3L8k2j46J81M1o9j1J14j55m1L7J70j88
$$ 4 199 5 34 -83 -111 -34 -50 -8 -18 -54 -19 -53 10 48 26 -120 61 102 33 22 136 -19 -60 -23 147 -41
5466d1K8n1J23j20P8L3J19j28j28k4K02j60J54o0J7r3O1L5j65J19jm3L2J18n2
$$ -41 -13 -64 59 -61 17 50 169 41 -87 -111 91 -69 85 25 42 -51 10 45 -120 -1 -2 -45 -13 105 53
5491E3P5j50m1N3m5j07K41k8j17J97j85J16o6j46J99p8J02k15nJ85j23N1m3L0
$$ 53 128 -22 -63 -10 -55 -162 79 51 -66 131 -54 62 -4 -150 49 -29 73 -142 -147 38 -85 -34 -77 -47
5515d7K01j85L2O4j99N5N6mqO9n6j48K40l3o0L5M2J01j46K9K5j03J02j35J02J1
$$ -47 154 -31 1 65 -134 -79 -23 -27 -35 34 -22 -170 70 37 -23 12 54 155 9 38 63 -40 62 -73 29 40
5541D0m6N8j76J42n3j03K84k49M9p6J39r3m1J55n1P1M1j94M5K10o9j21K26k31
$$ 40 -6 52 -124 18 -35 -138 146 -103 -54 -130 9 -84 -125 30 -21 50 91 -103 -58 152 83 -38 188 -43
5565d3K6j5J4M2L6q7j52K29J3o2l2oj53J07L6N8l5n1L2Ko7J02J7P5j43nN7k1O0
$$ -43 -17 -32 -18 24 60 -27 -179 50 63 1 -31 -37 -190 -83 -47 11 -24 -75 -43 -41 -108 -6 11 86 -57 -62 -5 -26 34
5594C4n7j46J25J25l2j74J19N5j35J93j49Q6%j59J76j48qN0J37j58J57m0J01j42
$$ 34 -23 -169 -44 81 49 -125 -6 49 -86 107 -42 44 44 -115 61 -87 -95 -45 92 -66 91 51 152 10
5618A0J33p1l0o0J06j09l8j06L31l61J31Q9jk15K38J8r1J04Qj0j03K1n6k0J05
$$ 10 143 72 42 -18 88 -21 -59 -165 166 -195 -64 25 24 -191 47 65 -26 78 86 76 -27 -6 -62 -82 23
5643B3n5j07J20N7p2O7n9Q7j32J45j3O9j89j7N1J36m3N7j94P4J57l12K11j43Q6
$$ 23 -32 -139 -19 38 -34 33 -26 61 -71 74 61 130 -59 -76 -25 111 68 125 -69 5 162 -150 61 -82 4
5668DQ7k33K02j6j37J12o1J44j60J87N7k42m4K03j25n4O6o5Q9L4j58n3J59j7L7
$$ 4 91 -142 60 44 -93 19 -42 102 -58 129 186 -56 -100 103 -22 -76 -10 -75 14 48 -110 -163 -4 -21 16
5693A6M3o7j19K9J15k05J01N0L8m7m4K0K68r0j96R4J30k15J37q4l4M0J94j68j48
$$ 16 59 -8 -127 -98 17 -188 -87 -37 1 -46 -90 -70 198 108 -88 6 136 -79 58 -26 -60 -20 174 6 -142
5718a42J19q0P7p0P6O4rN3j54J46j58k6J20k23J43o7R8J03j84K73j42j2p2J66
$$ -142 -23 -103 -26 -96 -20 44 35 88 -66 80 -78 -104 16 -207 -64 -131 -33 70 -114 159 17 5 -67 99
5742I9j82P2Ql9rJ24o9J1j5n3K6JJ36k43J91O4k23P7p3J67j09L8J04j66M2M2K5
$$ 99 -83 -11 -3 -42 -51 73 4 15 0 -53 -27 -26 110 -133 58 122 -101 -24 -97 70 -39 -1 103 -63 -21 21 46
5769D6Q3K8k60K13j06l3J25r0L6N1O8k51M7J53p1j09J05J6r5O3kn4n3J30l1Q4
$$ 46 129 157 -103 110 4 -29 96 6 42 93 161 -90 -43 110 39 -70 35 51 -44 19 17 -37 -90 40 9 93
5795I3j29N9m4n9M8J19j25n2J0k4L4QJ80jj86p7J53r7J03L8j76M7O7n1M9N3l8
$$ 93 -36 23 -21 -80 -32 87 -38 -90 -80 -104 -70 -62 118 117 -69 -146 7 -90 13 51 -125 -78 -11 -62 -13 40 2
5822Br9J54K3k19J61m7J5Q4j24j53L11K0j29Nj42J51O0l9l7L8P7k52J86O9j5p4
$$ 2 -97 57 80 -139 22 -25 -10 74 -50 -203 108 128 -1 4 -138 13 73 34 -3 35 112 -140 46 115 100 26
5848B6q4Q7mo7J98k57N3M4J39l63R8J22J36l9k27O9M1J55l8j40q0P4R2j20Q3J61
$$ 26 -58 29 25 -42 156 -101 -48 -4 135 -228 -130 -8 128 89 -138 -69 -28 127 89 -51 -131 -57 35 -85 -2 159
5874A59j54nQ9j85K2K02j22j36J9J88jj76R4j41RJ76l8J65k65J88l4m7lM3k3L8
$$ 159 5 0 89 -96 -74 128 6 -130 -111 77 76 -100 -6 -147 -138 38 0 165 -100 88 54 7 4 47 24 62
5900F2j60K68j60j00LR3o4k4K41r5M0j34R7m5l7O2k7n0q2J8J06L7j29J20j37J52
$$ 62 -98 170 10 -90 -87 6 -58 -82 159 64 104 -30 67 22 -15 47 20 -30 -112 -94 12 49 -80 40 -97 55
5926E5n3p2j0J43J19jk32o0J6P1J34j29k0m1J20j31Q9m7J38j80J17K1j55K19j75
$$ 55 2 -70 -80 63 182 181 -51 -111 -95 -24 110 -19 -39 -80 40 -91 -2 -49 89 -91 26 47 -108 111 -64
5951f4o4K01j4L4j7q9l9J6O3Q7k48K7J48lj40j3q3J29P9q5L3m2M3Q6j52J29p9
$$ -64 -128 73 59 93 76 -13 -52 -36 27 114 -134 -107 41 38 -102 -115 -198 -69 10 -75 -42 -84 -41 45 -107 22 -57
5978e7P1p0L9N7q1J11N7j47N6oJ02j01k2M4%OR8m8j19m1J36N3n0j22o0J08Mq2
$$ -57 14 -56 -17 40 -41 70 127 -20 36 30 132 31 9 53 53 59 157 109 -10 -51 85 138 88 -34 -94 14 18 -64
6006f4JJ25p5jP5mk6k8j4n2k3Q5j72L47k98K48j37L7n7L7M1q1O6N0o9p8Q4kj3
$$ -64 -63 62 -13 -14 61 57 31 3 -11 -63 -86 -1 -173 174 -124 124 -13 24 -33 4 45 -36 30 80 11 -67 17 15 2
6035BJ81j14j85L4l4K67k84R4K51j44JO3k27J20r0Q7j75O7J53P1j27j94K66o7
$$ 2 183 69 -116 -82 -116 151 -133 -39 212 68 69 132 -95 25 -65 22 -153 -86 67 138 11 -183 83 16
6059A6l1J42j46R7K1O0j01j59K14j27q6J74K7l1J04j99L8l7lK7J0o4N8j11L07
$$ 16 -15 127 -19 78 99 159 58 -101 113 -14 -100 74 101 70 174 -25 13 -24 -27 0 10 -54 4 -107 200
6084B00j72k0Pm4Q8j6j09J41l0n4p1M9JKQ2j14J46j65Q3q5J9R3L3k48J30j20K47
$$ 200 28 8 15 -29 59 43 -66 75 45 -9 -80 -31 -30 -28 54 -60 86 -79 4 -81 -62 31 64 -184 -54 -174 73
6111G3j87J81j35QJ38q3l3RJ30K4k24J76r7q9J35J91l24M2k3J0K3R1l9o6J95k70
$$ 73 -114 67 -68 -60 78 -5 -38 -29 101 125 -99 77 -20 -109 26 217 -107 -65 -88 -78 -55 36 -3 -69 126 -144
6137a44J56p7J99m3l9j9K1j43j5P9L4J6j70K93o2j30L8J48j32j99J77O7o6P5k4
$$ -144 12 -65 134 91 52 33 54 -89 -104 -25 9 25 -145 148 86 -44 -6 142 10 -189 -12 55 -11 64 40
6162D0k6j7J11Km2J7M6L4r9O1j71N0k9j11K01K2n0l2R7l0j28J27k20K76o3j03
$$ 40 14 -3 108 110 68 85 131 165 66 127 -44 6 -23 -134 67 89 39 7 104 74 -54 73 -147 129 66 -37
6188c7J77n2j37J75l30J87J08k9j60J66q3Q3n7J2l9N4P9p0P3m7K7j45k0Q8J38
$$ -37 140 88 -49 126 -204 -17 91 62 -98 68 -15 68 11 23 -16 38 117 47 120 73 100 -45 -65 23 161
6213A61j28L7j29K9n0J0J46j45J35r6j02N4J15j10J41r8O5n4k3P6j63J57j40M5
$$ 161 33 70 -59 -30 -80 -70 76 -69 66 -30 -132 -78 37 -73 68 -30 35 -19 -42 34 -129 28 -112 -67
6237f7%%J8R5q9m9J19J19j57J9J21k66J72ol9L6j75K99k20M5ol4m9J76q1Nn0j0
$$ -67 -67 -67 -49 46 -43 -92 27 146 -11 8 129 -137 35 29 -10 26 -149 150 -70 -25 -31 -65 -114 62 -19 -14 -64 -74
6265g4P7R8j46J19q0Q7o3k0rj52M6J69j06j4P8j34R7l7L8O5N8k66J41N8l2K44
$$ -74 3 101 -45 74 -6 81 18 -2 -11 -163 -117 52 -54 -68 10 -124 -27 -64 -26 39 97 -169 -28 30 -2 242
6291B42j34L1j95l2K95k41m5Q1nj5j06K11J03j67q9P0K4j15K57j55N4k29K04j11
$$ 242 108 139 -56 -88 207 -34 -79 2 -3 -18 -124 87 190 23 -66 4 28 -87 170 15 69 -160 44 -67
6315f7M4O3P9l3k62J39J07r3o3J27K8k4j01K12q0j56J33m3k7N3J6L3o3O6J52k85
$$ -67 -23 40 119 86 -176 -37 70 -23 -86 41 69 45 -56 156 76 -80 53 10 -17 36 52 85 22 88 240 -45
6341d5J58j88J32j14J68k78K88k1j01J9j09J39j7J93k45J00k30J34M0j55K53j57
$$ -45 113 -75 57 -57 111 -167 121 100 -1 18 -91 48 31 224 -21 79 -151 -17 23 -132 121 -36
6363c6J87p8K4l5j02LJ02n8j13P0O9j06j5P6J33j33n1N0K8jN2j24K08j00j10J04
$$ -36 151 73 97 62 -40 -37 65 7 -106 -36 33 -73 -88 -12 121 -12 -63 -13 15 14 66 -58 150 50 -60 44
6389D4n5P4j16J13j3Qo1n4P2K05l19L9K6q4o7J17J5M3J47j82n8k7K38r9rK30k46
$$ 44 -11 63 -53 60 47 55 -6 -60 12 217 -102 -63 -37 -121 -188 -71 -56 -13 134 -48 -106 -133 105 6 -3 227 -19
6416a9QJ22o9m3J29k19J74p6R3N7j11P5j59J32m7r8j32K56k85J79j89J46L3J46
$$ -19 -11 111 42 -1 128 -91 83 7 100 157 46 121 -38 94 47 -51 -183 73 -212 -33 -222 -76 -43 103
6440A03j76K15j2l70K91Q1k60L1J89m2M9k20J74L3n6j24J22k1Q4p2P0o2L4mj25
$$ 103 -73 142 130 -240 51 132 -128 -97 92 50 99 -121 53 86 30 -94 28 7 91 19 89 27 61 57 -68
6465f8K4M8P3q0j01J39m0M3O9j70N1j4PL9j14J22R3q6p3L1qj94J34j4J99j49O8
$$ -68 -44 4 77 -3 -104 35 -5 38 107 -63 -12 -26 -19 20 -94 28 121 35 -38 -7 -15 -209 -75 -89 110 -39 29
6492B9j15LJ49P4j81J6k6n5N6r5K40j26j26J59j53nL50j96J9Pq6J60r7K7l6L3
$$ 29 -86 -83 66 140 -41 -25 -51 -106 -50 -145 95 -31 -157 2 -151 -156 194 -2 17 24 -62 98 1 28 -8 25
6518B5q5J08J8j75PJ29Q8m5l7r9O8Jq0N7J86k59O8Q0J5j94RJ66j80J11n8J9J77
$$ 25 -60 48 66 -109 -102 27 115 70 33 -66 2 3 -77 -20 166 -93 -25 55 70 -124 -115 51 -129 -18 -76 -57 120
6545A20Kj44m5J42P9o7o1j13J03k5j23P5q1K26r4m1J78k90R2P9J74j23j61M0K50
$$ 120 122 -22 -67 75 154 87 26 -87 16 -9 -132 -57 -138 88 -6 -47 131 -159 -67 12 186 63 -98 -58 192
6570A92l41J10M7n4P2j44J68j57J68j13Q4j61J59jM3k76J57J10n4O7K0j37K36
$$ 192 -149 -39 8 -46 26 -118 50 -107 61 -52 32 -129 30 29 72 -204 -47 63 9 76 96 -41 195
6593A95j65J21k51J34J2r3jj3J29O1j41l8Q2OM7k4j3M6p0j82K33K3j20O9p0k8
$$ 195 30 151 -100 34 46 -47 -48 -61 68 129 -12 -50 32 38 85 61 48 94 24 -158 75 98 -22 47 -23 -51
6619e1M9J37j38M1J10k15J05O1j16J06K4n0J8j00R6J4p4j8p7j0J56j37J46m1M
$$ -51 -2 135 -3 38 148 -67 38 99 -17 89 113 63 81 -19 77 91 17 -1 -78 -88 68 -69 77 36 40
6644D0J6J4j72J96q5m5l1K23j23j68K42j81N9JQ0J0Nj28k4J69j59L3j1J04l8M6
$$ 40 56 70 -102 94 9 -36 -67 156 33 -135 107 -74 -15 -14 66 76 81 -47 -71 98 -61 -28 -39 65 27 73
6670G3p0j2j39J49P5j46J21j43N6j72K78n8M6K8j40Q0Lk08J62O4mk11K07o3J04
$$ 73 3 -9 -148 1 76 -70 51 -92 -36 -208 70 12 58 86 -54 26 29 -179 -17 47 43 -168 39 -24 80
6695H0r2J17j77q1K03P2l45L59l07Q1J49j01J14J46q5k49J23k2j66J68R8K34n37
$$ 80 -12 105 -72 -153 50 122 -223 136 -171 -90 59 -42 72 218 133 -116 7 -15 -181 -13 85 319 -218
6718b18K55J44k18P2lj28J39N4j00j18J42Jl7j36rK45k03K9K6N4j1P8J10k02N2
$$ -218 37 181 -37 35 32 -96 43 97 -3 -121 21 22 -15 -151 -160 85 -118 -89 -63 -9 -20 58 168 -34 18
6743A8o2k5NJ47k11J65k20J92J55j37j46J7J20N1j59J00J62k23R3On8j01J05P4
$$ 18 -44 -69 -64 83 -128 37 -183 9 164 27 -119 -102 18 69 -90 10 172 -51 42 48 -10 -111 -6 68
6767F8q7j05N9R0q2J54j05J9P3N0j71K2L6k4k4J1J02j01n3L4j25J75J43k05O4
$$ 68 -19 -124 -65 25 -57 97 -8 11 84 134 -37 -15 21 -3 -27 -16 86 -15 -68 -34 -159 16 159 -46 18
6792A8RQ3o5p6P9J19j85O4J5j52J63m1MR0J4j40j04L2K24j37p0P6N1j73R3r9J13
$$ 18 27 110 45 -31 48 167 -18 46 61 -91 72 31 35 125 139 -1 -105 -73 151 14 -56 20 71 -102 -9 -108 5
6819Ek9Om9l8L1K6K4j43J73lJ26k75J42p0J9Q8L5N6k82J86q0j60M14r5N4r8Q3
$$ 5 -24 -18 -67 -105 -74 -48 -24 -167 6 3 129 -146 -4 -74 -55 33 68 124 -158 28 -52 -212 202 107 161 63 146
6846A46ol8j78J3J25j19M1RR9k03K24k03p2O5L2J91j56J02j43J94k70J44J80q2
$$ 146 140 102 -76 -63 62 -57 -16 -7 92 -111 113 -90 -162 -97 -65 126 -30 72 -71 123 -147 -3 177 95
6870I5j50o5J61k3L1M7j16J71k50J94m6k4j43J50J58k64J10j04j00K25l0M0q6
$$ 95 -55 -120 41 18 49 96 -20 151 -99 95 49 25 -118 32 190 -74 36 -68 -168 57 27 67 -19
6893a9P9k8Q3L9k44J39j3j34J46qj39J61Ko6o3N0J16M2j01k25K31q3N3k34J94
$$ -19 60 32 115 154 -90 49 36 -98 48 40 -99 62 64 -2 -65 -15 101 143 42 -183 48 -35 18 -216 -22
6918b2j44qN8J86K2q8J80j03j86J49r8j5J01O9j12jn1Q7J53j14m2j45J47O1k8
$$ -22 -166 -174 -116 70 92 4 184 81 -105 44 -54 -69 32 101 -11 -12 -63 24 177 63 21 -124 23 84 56
6943E6p0P1j67P1J46N1j37j50K56n1j79L4O3Q0O7q4O4j74J48J0j33P3j7j01J36
$$ 56 -14 57 -110 -39 107 158 21 -129 127 76 -103 -69 -6 74 141 57 121 -53 95 105 -28 45 28 -73 63
6968F3o2Q3MO0k28J43j66J92k7j46J00j9O7j9rm7K17j39j16J93j14k1Q7Pl04K31
$$ 63 1 84 88 148 -80 63 -103 89 62 -84 16 -3 64 45 36 -11 206 67 -49 144 30 9 96 103 -201 30
6994C0m6J83k76L9P4r4L02j18k3j01J7Q4k07R5O8J42j90q3J56R6j40N4r4j27J63
$$ 30 -16 167 -109 -70 4 -90 212 94 71 -30 -13 71 -136 -41 27 169 -21 -104 52 148 8 62 -32 -159 4
7019Dmj5O5j06J17j32J45m2L9K9j84J90o5O1q7Rj02j7J05P8pj52l8L1N4P0k04
$$ 4 0 -15 50 -56 61 -71 74 32 71 100 -84 106 41 102 15 24 -78 -95 10 88 81 -71 -109 -78 -24 46 -158
7046a58L21k37j19J39R1k9p8K8N9j20J96q8j01N7J55j74o3J84l6r0K04p7O5k57
$$ -158 163 -74 -193 -54 37 8 -70 -42 17 -103 93 5 -96 -39 116 -58 -121 63 27 -63 141 64 129 -128
7070a28K23j16k29K07q9K60p5k8p8J75k05L2j08J74j14J71j28k0J06r7L36k62
$$ -128 95 -21 -250 -43 -132 128 53 25 -53 122 -83 -51 -159 15 -99 72 -56 -76 30 -67 269 7
7092Gj03M0j22J82k9J23q2o2J50o8k6K6lO5L7Nk48K14O4j50j39R2J28j83r7R1
$$ 7 -96 -56 -178 4 -25 98 16 -46 104 36 10 36 33 98 135 140 -108 106 170 20 -119 -27 101 -82 -179 -88
7118h8J02j1n9m1L3J39j29J88j79o1J84j12J91j7k26q0J90P2j37j4J44m0l7o5
$$ -88 14 3 -56 -97 -64 75 -54 134 -45 -106 78 -34 157 140 -86 -166 24 96 -41 -55 89 49 12 -53
7142e3K1J84J2q8k79K64r4K32j98Pj19M4L9o9J34K7m1r1J92j99j4Q8P8j9%j89
$$ -53 -32 152 164 76 -203 61 -33 199 1 8 -111 -67 -28 -97 37 64 23 -68 124 -75 -89 -1 77 58 58 -131
7168a31N8n7K72r1L2Q6j26KQ9j46l9R6j06J08L9j12j25K10n4%R8j61K4K2%K6l9
$$ -131 -73 -130 142 51 83 169 43 45 134 -12 -51 45 -61 47 86 -26 -151 59 5 5 103 -58 -34 -12 -12 14 -25
7195b5K4m4J45j36J42k24J16l0J60j13K7j28J13oj4J28k10N2r8J14r6K33j9n3
$$ -25 -1 -45 100 -36 106 -118 -2 -32 128 15 42 -86 27 21 7 135 -75 -23 -121 -7 -103 130 111 58
7219E8l4N8K6j5j09Q8l4O7J0k0r5N2p6n8j09K44l0r0Q3p1K16k09R6J4j06n0O3
$$ 58 24 82 108 93 -16 72 38 105 115 95 0 52 -24 -82 -191 53 23 -67 16 -55 161 -48 48 62 -44 -94 -31
7246c1k8K3J95k18M0J16q1P0K4q6N5m5j23R9L1MJ9l4lN9k54k1J11MN8J82j77l3
$$ -31 -59 -36 159 -59 -19 97 16 86 110 24 79 34 -89 10 41 45 64 30 27 86 -168 -189 -78 -74 -16 166 -11 -44
7274d4R7jm3K4j68J88k18K50q6j26K17k73K79j16j13r1K49k00J07O5Oj48J81R3
$$ -44 53 52 9 33 -135 53 -165 85 -1 -127 90 -183 96 -20 -133 -224 25 -175 -68 -3 3 -145 36 129
7298A29j60J52k03J02j73K47m7%m3o3m9J57m4M9nn4K1J4j19J24n6J13k8n6P8J9
$$ 129 -31 121 -82 20 -153 94 47 47 4 -59 -108 49 5 54 49 -5 16 30 -89 35 -21 92 64 8 86 105
7324A05k5m2K0p8l0m9l1J89R9j77Q2p4N9M3o4k3M0q2J4J12j40K8n1r1l5K56j41
$$ 105 80 38 58 -20 -50 -99 -130 59 158 -19 63 -11 48 91 27 4 44 -38 -24 88 -52 -24 -75 -166 -201 55 -86
7351h6L8P6n4k6J22O4j45L9k9r8Q2l4M6Q7lP6j13J02j87P2M0j99J26K5p1J24k1
$$ -86 -48 28 -26 -52 70 134 -11 28 -1 -99 -17 -51 -5 82 79 155 42 144 -43 29 69 -130 -4 21 -50 74 53
7378E3n2N2N7j84j24K50J5j91j8J3J04j26K02j64M5J74q1N0R0r5K5j6n3k6j23
$$ 53 1 53 110 -74 -198 52 67 -124 -142 -129 -25 -151 51 -113 -68 106 25 75 165 70 95 79 26 0 -123
7403a23J13J03q4n9J53j10n5n4J88k03J28mJ05o9q7O0l7J50k18J67j08M2l9J5
$$ -123 -10 93 9 -50 103 -7 -62 -116 72 -131 -3 -7 98 29 -58 2 -35 115 -103 64 -44 -2 -41 -26
7427b6P2q3J45n1lj7N1j01N9L1r3oj10K25R8k61l3N7K6M8q7J38j30R4q1l3M3L5
$$ -26 46 -37 108 57 54 37 88 -13 46 77 -16 -22 -132 93 191 -70 -103 -46 -20 28 -59 79 -51 43 -38 -71 -28 7
7455Go0R2r1J06J02j54p4R8j08k1J40k9o5J14r4K46l60J31J80k0j58pm7J29j32
$$ 7 -53 39 -52 54 156 2 -72 26 -82 -103 37 8 -57 57 -37 209 -151 -20 160 140 -18 -25 -72 57 -75
7480g5J3qp8J60k32J80K8J39k8p0m0P5j25J18l2K3K4o6nM3k1r0P4j15P2l4J77
$$ -75 -62 -70 -148 12 -220 -40 -12 127 99 29 -11 64 -61 57 25 48 72 6 1 44 23 -67 7 -108 -36 -70 107
7507A07j93Q5M6J24j80R8N7k67K11j30M2RJ28j65J15M6k76J40j3K8q5o6J25n4
$$ 107 -86 -1 45 169 -11 87 144 -123 88 -42 0 9 137 -28 87 133 -143 -3 -16 12 -73 -139 -14 -68
7531f8J71P6j83j08K32j09P8k39J70o2J92k67M2qPK52k21R4j53K41J57l25N6n0
$$ -68 103 179 -4 -112 120 11 89 -150 20 -42 150 -117 -75 -83 -76 176 -45 49 -104 137 294 -31 25 -25
7555b5m1J27O8m6nj62J04p8J06k06J51O4p4R2l5k3n5nm7K25k73O7J7J15j04l0
$$ -25 -66 61 129 83 78 -84 20 -58 48 -158 -7 57 -17 75 40 17 -38 -43 -90 135 -138 -71 -54 61 -43 -73
7581g3O5J73k16J17j94J93o2l6j0J06k16J69k7J3k2l5j32J22N5L7N6qk3j25P4
$$ -73 -8 165 -51 66 -128 65 3 -33 -43 63 -153 16 -11 2 -20 -55 -187 -65 -10 27 83 75 52 -73 1
7606Ak7P8L5q2Q6j67P7mm6l2J94J6j24P3j44K34j24j30q4J19jk2L0p2M1J00j9
$$ 1 -26 52 87 5 91 -76 1 -3 -49 -81 113 129 5 78 -66 168 44 -86 -170 -51 -52 -74 -44 -116 -75 25 6
7633Fj95K99r9k3M9J2r7J14N0k34K66q0p8q7rM8J03n5K10k41j15J07J2oJ29l7
$$ 6 -189 110 11 -12 37 49 -48 66 116 -118 148 68 -10 -97 -106 -58 45 -10 200 -41 -156 -49 -37 -43 86 49
7659D9M3n5p3r5rL31j10j49J19j2J01p0n1R5j40J55J13l01J27j09M7N3q4L5R6
$$ 49 92 37 -36 -131 -140 191 81 -68 51 39 140 70 19 114 -26 129 242 -59 68 -41 6 59 -25 10 106
7684A06k03O7M4j91J79j0M4o1j3Q6n4L3M8k66L10n1n3J07j97J02O5j90%k8J74
$$ 106 -97 -30 14 -177 2 -8 36 -25 -38 48 -6 27 75 -191 119 68 15 122 -75 27 92 -98 -98 -126 48
7709D8q7m4K21j2j23Pj41K25p9J9Jr5J71j8p8j61J72J88m11K88k7j19K7m1J8r5
$$ 48 -39 -83 138 126 3 10 -131 94 15 34 35 -60 111 93 15 -146 26 214 -197 91 64 -55 -28 -69 -51 -146
7735a46P6J88M6j5k04K01L8j79l1m3Q6M4j23R2O9j69J91r7J3J62j21r4L3L7p1
$$ -146 -70 118 164 149 -55 146 184 5 -26 -69 17 61 -62 30 99 -70 121 24 37 199 78 -16 17 54 -17
7760a7K4J22o3k7N5o9K9p6PJ64j08%j43J50m5l8n9L3P9l3l9p9Q0K5jj28J81k71
$$ -17 7 129 66 39 94 25 54 -22 -15 149 41 41 -102 48 3 -35 -94 -61 18 -15 -54 -133 -53 -28 -29 -157 24 -247
7788b47K91J07j91J1m9J27q6M1r1K53j91rn4J17K8j43J59LM5n5j27N4L6kL3L7
$$ -247 44 151 -40 -29 -78 49 -37 4 -87 166 -25 -34 -88 29 57 -86 73 76 121 66 -61 -7 29 27 60 97
7814I7j4P3o3o9m3m1O5M9j20n5J72k39J77m5K7k00K43M2p1J5M6Rj00J35k9k6j22
$$ 97 83 156 93 24 -19 -60 5 54 -66 -121 51 -188 -11 -56 -29 -229 14 56 -15 0 46 55 -45 90 61 35 -87
7841h7J0J33r9k5N6nK5M0o4l3J44j29L9P8m0J24J46k39j35J61j37o9J8J81j69
$$ -87 -77 56 -43 -68 -12 -17 8 48 -16 -49 95 -34 5 83 43 167 313 74 -61 100 -37 -106 -88 93 -76
7866g6k5K47k48K1J64m2Rj45M6k5P1J0j8j0N2O7j52m2M4J99j09l3o8L8n8M9Q5
$$ -76 -101 146 -102 -81 83 41 50 -95 -49 -74 -3 7 -11 -21 31 98 -54 -96 -52 147 38 5 -63 -25 -83 -34 51
7893E1Qj37J35o2q3MQ2m6K03j04Oj30J27J10k24P7m3n1R9r7QK3PR3j18J52j17
$$ 51 59 -78 57 -5 -88 -84 -2 -48 155 51 57 -73 54 164 -60 17 -26 -77 22 -75 -67 -44 -37 56 -62 90 -27
7920b7q3K40n6O6r8j02J00j72K68j50J02q7r9O7q3J2J53j73J13M6R8j6q3J60n2
$$ -27 -110 130 74 140 42 -60 40 -132 136 -14 88 1 -98 -31 -114 -102 51 -122 -9 37 135 119 36 196 144
7945A44j55J33j2k4j18j55J60j16K71j63M8J01n0q4J14m0nl8P0k60J03J07M6m2
$$ 144 -11 122 110 86 -32 -187 -27 -143 128 -35 13 114 64 -20 94 54 49 11 81 -179 -76 31 77 35
7969C5j66J97J02k18J13n0p4O0j8j3K23k32L5J33k2m5j33J08n0O8L8n4J15o5l0
$$ 35 -131 66 168 -50 63 13 -61 -1 -19 -32 191 -41 -6 127 105 60 -73 35 -15 53 91 37 152 87 57
7994E7o4Lqp5O8n7r8K47J3j07Q0JJ13m7r7j5Q9o0L2M9k21R9Q9J19l31J14rj33
$$ 57 -7 -4 -12 -87 -19 -76 -174 73 86 -21 59 60 173 126 29 14 103 43 75 124 -97 2 91 210 -121 -7 -16 -149
8022a49J60j26M5J91j24m8k8J44q7QJ4n3k9Q4O3q6P5j5m8n5M2R3j12J39k23kO0
$$ -149 11 -115 -70 121 -3 -51 -79 65 -22 -14 0 -53 -82 2 65 -21 54 39 -9 -64 -22 71 -41 98 -125 -127 -67
8049f7K52j29q7Rn8J09rO7Q2l02J01J8l8QJ84M7L4j77r3J42k12J77j71J51j12
$$ -67 185 56 -31 -22 -80 29 20 87 169 -133 -32 -14 -52 -44 140 187 221 44 -49 93 -119 58 -113 38 -74
8074g4O9P2j83M39k02j75q4J96o4J07r8n2J62n9Q9j56r3J95k02QP2mM0M8q4P8
$$ -74 -5 67 -116 323 121 -54 -138 58 -6 101 3 -49 113 54 143 -13 -106 89 -113 -105 -33 -37 3 51 -33 45
8100D5O9j14Q5J0m8p6M4j69L0K5N2R1l4Q6o6O6o4p3K21j63q4Q7Q6r6j3N4j13O
$$ 45 114 0 85 95 47 -29 15 -154 -124 -99 -47 44 10 96 30 96 32 -41 180 17 -67 20 106 10 -3 51 -62 -56
8128e6R2k3J67j98P6L8K0j99L6N7J50j56J6M6J19k30J70j76K7O2j58R4k3J75j96
$$ -56 36 13 180 -18 58 96 116 -83 -47 10 160 4 20 66 185 -45 125 -51 -24 38 -120 -26 -49 126 -70
8153g0J63j49Q6K8o2LO5o2k26J83j00K8R7m2P7J8r5J24k4j47K05j32k6Q5L4n3
$$ -70 93 -56 30 58 -4 -1 64 2 -224 -41 -141 -113 -16 -58 19 37 -58 66 42 -105 100 -32 -58 27 61 8
8179HOj61J52J76r2j21o8J08O4L1o4k7
$$ 8 14 -147 5 181 89 -32 -100 8 72 103 39 12
8191A2
$$ Imaginary data points
##PAGE= N=2
##DATA TABLE= (X++(I..I)), XYDATA
0@%%%%%%%%%%%%%%Nj3J6j6J6j6K4l2L5m3M8n6O9p7Q8j04J20j36J52j71J94k18
$$ 0 0 0 0 0 0 0 0 0 0 0 0 0 0 0 5 -8 8 -8 8 -8 16 -16 19 -24 24 -32 37 -40 48 -56 64 -72 80 -91 103 -115
36a15K46k78L10l43L81m22M67n18N71o29O96p68Q45r31J025j130J246j376J522
$$ -115 131 -147 163 -180 201 -221 246 -272 299 -330 366 -402 443 -488 537 -593 653 -723 799
55G99j686J874k091K344k644L007l455M026m781N826p369R872j4583K6311j05334
$$ 799 -887 987 -1104 1240 -1404 1603 -1852 2174 -2607 3219 -4150 5722 -8861 17450 -87884
70h7884j59817L11194Q9897j51417L1906N5747j07968K7792Q2010r8878m4657
$$ -87884 -247701 63493 153390 1973 33879 89626 -18342 9450 91460 -7418 -52075
81e2075J21358l1104j21991K3371M8393l848L9177r023o6702K4292N5474l5608
$$ -52075 69283 38179 -83812 -60441 -12048 -15896 23281 14258 -52444 -28152 27322 -8286
93h286l319N3148k9914l9613L7029j7203k6467P0216J2531q1888P555N0304l4946
$$ -8286 -11605 41543 11629 -27984 9045 -8158 -34625 35591 48122 -33766 -26211 24093 -10853
106a0853k630O4353l1695o4985M6517L1162m6204Q313L4839k4287k1747R358N92
$$ -10853 -13483 50870 19175 -45810 707 31869 -14335 -6022 28817 4530 -17217 -7859 -7267
119g267O418R949j9023p133K1496j3247j6031L6165Q066l2907J2821J9656k8517
$$ -7267 -849 9100 -9923 -17056 4440 -8807 -24838 11327 19393 -13514 -693 18963 -9554
132i554l023L9452n034l6738R867J7574j6892P36J5985r960j0306P630J287p316
$$ -9554 -12577 26875 21841 -14897 -5030 12544 -4348 -3612 12373 2413 -7893 -263 1024 -6292
146f292K768P590k562p840m233L006Q783M71l197L728m349l575J4890M681j6255
$$ -6292 -3524 4066 1504 -6336 -10569 -7563 1220 1691 -1506 2222 -2127 -5702 9188 13869 -2386
161b386j329J6493l660j8260M213J1359n701l241L244p735m949J1583R179j1857
$$ -2386 -3715 12778 9118 -9142 -4929 6430 729 -2512 732 -7003 -11952 -369 8810 -3047
175c047r984J2816P842r992j106J0344P86p374K260M629o450Q9P009o855q126
$$ -3047 -13031 -215 7627 -2365 -3471 6873 7659 285 2545 7174 724 813 7822 967 -7159
190g159L606K426m341l34M586k524l171O782L797k392L89O66K308R98n405k819
$$ -7159 -3553 -1127 -5468 -5802 -1216 -3740 -6911 -129 3668 1276 1665 2331 4639 5637 232 -2587
206b587L951K103l930l331J118J29L000M609n809l187Q314N40o084J404L734l815
$$ -2587 1364 3467 -463 -3794 -2676 -2547 453 5062 -747 -3934 4380 4920 -1164 240 3974 159
222A59l833L393n17l819L511O06m252K564K511j489J99J754R76o15O09K03q86
$$ 159 -3674 -281 -798 -4617 -1106 -500 -4752 -2188 323 -1166 -967 787 1763 1148 1757 1960 1074
239A074L077k76l870J984M87k825J395R9l608o79L144p15m824K797L796l943J283
$$ 1074 4151 3875 5 1989 2476 -349 1046 1145 -2463 -3142 2 -713 -5537 -2740 1056 -2887 -1604
256a604K910k461P37K813m76k443P52K344k517p49K787k337j144J852l69K58M38
$$ -1604 1306 -1155 -418 2395 1919 -524 228 2572 55 -694 2093 -244 -1388 464 95 353 791
273G91r17N54Q30M68j619r09K042j035j051P63j876K35J907j211j028R98J561
$$ 791 -126 428 1258 1726 107 -802 1240 205 -846 -83 -1959 -1724 183 -1028 -2056 -1058 503
290E03p14j078K234N47j730J290j37p14N07n45j98n11L13N94k019O93K259j057
$$ 503 -211 -1289 945 1492 -238 1052 915 201 708 163 -35 -546 -233 361 -1658 -965 1294 237
308B37j69K68L12O85j92J77l61j283J078q03r36N63j494J68N89p58J89n4Q18O24
$$ 237 68 336 648 1333 1141 1318 957 -326 752 -51 -987 -424 -1918 -1750 -1161 -1919 -1730 -1784 -966 -342
328c42P0J090l01k69K451l72j528O31J40m52n08L1m86j437J218L12j610J183N69
$$ -342 -272 818 517 248 2699 2327 799 1430 1570 1118 610 641 155 -1282 -64 248 -1362 -179 390
347C90j315O91L40n41l83J67J34j373N09L68r91J521R07r09P92J120K20L20M34
$$ 390 -925 -234 106 -435 -818 -651 -517 -1890 -1381 -1013 -2004 -483 424 -485 307 1427 1647 1967 2401
366B401l75j122P42K56k153j39P67j466r9P74o83l65J013L89q53p1J183j100L4
$$ 2401 2026 904 1646 1902 -251 -390 377 -1089 -1188 -414 -1097 -1462 -449 -60 -913 -984 199 -901 -867
385h67J100j060n41R36R8N36M09K65l78Q03J216j191p13P54r49k54O17j354o68
$$ -867 233 -827 -1368 -432 -334 202 611 876 498 1301 2517 1326 613 1367 418 164 781 -573 -1241
404a241M08O26m74m00P88l72p9J361j263p42J397o32j76P61k13j10M01J201j60
$$ -1241 -833 -207 -681 -1081 -293 -665 -744 617 -646 -1388 9 -623 -799 -38 -251 -361 40 1241 1081
423A081l72J184q57r7R47j623q14N76r58m64j24J6l71L24J573m85k89K398k31
$$ 1081 709 1893 1036 939 1886 263 -551 25 -933 -1397 -1521 -1505 -1876 -1552 21 -464 -753 1645 1414
442A414m47P64l74J57J39r52j191l95P40o68j471P79n53L31J824j029l09J861
$$ 1414 967 1731 1357 1514 1653 701 -490 -885 -145 -813 -2284 -1505 -2058 -1727 97 -932 -1241 620
460F20O76k71j35p8L82K35J89j731p40J384n68o28O56j007M20J601p27n65O79
$$ 620 1296 1025 890 812 1194 1429 1618 -113 -853 531 -37 -665 -9 -1016 -596 1005 278 -287 392
479C92R49o17r80M95q01l68R89j729n22J743o11k73P79M14J15P26R03p56O0J824
$$ 392 1341 724 -256 239 -562 -930 59 -1670 -2192 -449 -1060 -1333 -554 -140 -25 701 1604 848 908 2732
499B732j391j290J317p56q7J1j494N3O43n30l82K21R81j303K7J864q27n79J145
$$ 2732 1341 51 1368 612 525 536 -958 -905 -262 -792 -1174 -953 28 -1275 -1248 616 -211 -790 355
518C55q41J46J107j91j209P2Q99L13K38l03j382P52K786j144j917R96N08Nk96
$$ 355 -486 -340 767 576 -633 -561 338 651 889 586 -796 -44 2742 1598 -319 677 1185 1190 894
537H94r34j143k47P66q79p42O00p93Q84J753r08K93K261j15n36R93M92j298q96
$$ 894 -40 -1183 -1430 -664 -1543 -2285 -1685 -2478 -1594 159 -749 -456 1805 1690 1154 2147 2639 1341 445
556D45L72r14l61O9j609L19J487o01j74J104L35l10N20R08j169l88N43r54p68
$$ 445 817 -97 -458 -389 -1998 -1679 -192 -793 -967 137 472 162 682 1590 421 33 576 -378 -1146
575a146J128q35n25O92P7M43O92k63o94R66J549j361j248O00K68J38l53o27o0
$$ -1146 -18 -853 -1378 -686 -609 -166 526 263 -431 535 2084 723 -525 75 343 481 128 -499 -559
594e59P86J47j40m93L21J21K85J19j181M28N36o47j83L21j58J9L6q7K05O0p9n66
$$ -559 227 374 234 -259 62 183 468 587 -594 -166 370 -277 -460 -139 -297 -278 -242 -329 -124 -64 -143 -709
616g09O54O55o03j61K99j01P79K62o87j38J34J73p7k42l92o45N76L85p61J38K10
$$ -709 -55 600 -3 -164 135 34 813 1075 388 250 384 557 480 238 -154 -799 -223 162 -599 -461 -251
637b51l24O45J22l07J21n4L49j20N7K3r71O19M21p06L12m24l06P51L80j36m03
$$ -251 -575 70 192 -115 6 -48 301 181 238 261 -710 -91 330 -376 -64 -488 -794 -43 337 201 -202
658b02K85M73k7M21O5j287P60K62o51J67n37o54M17P1j83m38J34K64J7P29q0m54
$$ -202 83 556 529 950 1015 -272 488 750 99 266 -271 -925 -508 -437 -620 -1058 -924 -660 -643 86 6 -448
680d48R50K32m26M90k52n07K49m3K2l37K78Rn94P65Qo14K94o1j18K30l09q2J7
$$ -448 502 734 308 798 546 39 288 245 267 -70 208 217 -377 388 396 -218 76 15 -103 127 -182 -264 -247
703b47p8K38n83K58Q5j55L39J16l96Q02r0k17L33J29n0k60J03J81l31J82j11n92
$$ -247 -325 -87 -670 -412 -327 -482 -143 -27 -423 379 289 72 405 534 484 224 327 508 177 359 248 -344
725c44M97j48l45L30j39j27K17j93ON0K04k26j25K36p8j91O02m09%L21j20M8L2
$$ -344 153 5 -340 -10 -149 -276 -59 -252 -246 -196 8 -218 -343 -107 -185 -376 226 -183 -183 138 18 66 98
748I8J2J00o6L2m1k32M58j43k86M82k88j68Q7K5j3n6J14k92j59J89p4k35K63j99
$$ 98 110 210 144 176 135 -97 361 218 -68 414 126 -42 45 70 57 1 115 -177 -336 -147 -221 -456 -193 -392
772c92O4L31O3j88J06j0J63k07J74J89m27L74j63J08M59l42n7O2R5j85j97r2J73
$$ -392 -328 3 66 -122 -16 -26 137 -70 104 293 -134 240 77 185 644 302 245 307 402 217 20 -72 101
795A01l61J63q2k73K84J4k20J71jK07k17M5Q1k40K82j34J56K30L0p4K82pJ46m4
$$ 101 -260 -97 -179 -452 -168 -154 -374 -203 -204 3 -214 -169 -88 -328 -46 -180 -24 206 236 162 444 437 583 539
819E39k1k8m16j45K8l09L5q3m1J36q5K7K09j78L04n7K63R9l42J04K44j96K98j62
$$ 539 518 490 74 -71 -43 -352 -317 -400 -441 -305 -390 -363 -154 -332 -28 -85 178 277 -65 39 283 87 385 223
843B23j30L4p8O5p0j51J23J9k32L72k50M35pj23K72k81j11Q6k53J06l52j54J85
$$ 223 93 127 49 114 44 -107 16 35 -197 175 -75 360 353 230 502 221 110 196 -57 49 -303 -457 -272
866b72k79J41N7j88M59J11j9O39l12P7O2j33J9l11j4K15j98k7Jj77K96j96K99
$$ -272 -551 -410 -353 -541 -82 29 10 649 337 414 476 343 362 51 37 252 54 27 28 -149 147 -49 250
889B50r0j50n5j30k52K26k95K60Q8l01N29o0K2M04l4j66L26l83m9j08k93o5k82
$$ 250 160 10 -45 -175 -427 -201 -496 -236 -148 -449 80 20 42 446 412 246 572 189 140 32 -261 -326 -608
912f08L32n8n0L00K64RN39k60J10J57l48j22k49Q0k24l44J08j72q3J31l8R5K48
$$ -608 -276 -334 -384 -84 180 189 728 468 578 735 387 265 16 96 -128 -472 -364 -536 -619 -488 -526 -431 -183
935a83o7O3K11K19Q8P4p1nk95M06k18m2q6l14m4L98l42J35j1j5P0O0K53l70j00
$$ -183 -250 -187 24 243 331 405 334 329 34 440 222 180 94 -220 -264 134 -208 -73 -84 -99 -29 31 284 -86 -186
960a86K46r2nJ07m77K52j29R8j76N7J22J82J94K49k96m9L88j60oJ19m20K75J7
$$ -186 60 -32 -37 70 -407 -155 -284 -186 -362 -305 -183 -1 193 442 146 97 485 325 319 438 18 293 310
983C10j69k83M0K37l90K11l7k11k02K52k06J96j20k31L69J50J89k08R7M40j39
$$ 310 141 -142 -102 135 -255 -44 -81 -292 -494 -242 -448 -252 -372 -603 -234 -84 105 -103 -6 434 295
1004B95J22K62l72lk7J51l50K4j69p9J15Q2k60J89j99j72L34K06l66O7K19j60
$$ 295 417 679 307 304 277 428 78 102 -67 -146 -31 51 -209 -20 -219 -391 -57 149 -217 -150 69 -91
1026i1J97K9j77p3K50J84m52P0K04l74L01J74l64L0J22j43L29Q5j50k11K30J72
$$ -91 106 135 -42 -115 135 319 -133 -63 141 -233 68 242 -122 -92 30 -113 216 301 151 -60 170 342
1048C42l25Oj4m88M50K93o12K15j19Q0OK84j88k36L50L59l66m9J81l18K43J13
$$ 342 17 23 9 -479 -29 264 -348 -133 -252 -172 -166 118 -70 -306 44 403 37 -12 169 -149 94 207
1070B07l45K61m5n4R3J92k7m62K33K63m20K17j39l01M72P4j47k60O7K02j83L74
$$ 207 -138 123 78 24 117 309 282 -180 53 316 -104 113 -26 -327 145 219 72 -188 -121 81 -102 272
1092B72p1n47K30K02m28M62k56j32K83r7M4lJ03r0K92P4J33n91L80K6k11L19k13
$$ 272 201 -346 -116 86 -342 120 -136 -268 15 -82 -38 -41 62 -28 264 338 471 -120 260 286 75 394 181
1115A81n21J98J72j53j43K01l05o5M60j07k52K20J81k17L66J66n47J90O5J81k71
$$ 181 -340 -142 30 -123 -266 -65 -370 -435 25 -82 -334 -114 67 -150 216 382 -165 25 90 271 0
1136@J90j29j34M61m3l83M7K25l36L71j94r3j29K36p2l50L06k08l79N25l2l21
$$ 0 190 61 -73 388 345 -38 9 234 -102 269 75 -18 -147 89 17 -333 -27 -235 -614 -89 -121 -442
1158d42L62L8o5J64N6j54o3M03O6m25L93j86l15L71km05L64j21p7P9J70j80j41
$$ -442 -80 -42 -107 57 113 -41 -104 299 365 -60 333 147 -168 203 201 -204 160 39 -38 41 211 31 -110
1181a10J32J1k19K96k69l84M07n5%J68O6k55R7K90j02k23K74j5J4K6qj01P9L3
$$ -110 22 33 -186 110 -159 -543 -136 -191 -191 -23 43 -212 -115 175 73 -150 124 109 123 149 141 40 119 152
1205A52r8o9J14k67J80J35j44j36J39k38j4J63j04M7Pm0N7J37Q0J7j52K28k09
$$ 152 54 -15 99 -168 12 147 3 -133 6 -232 -246 -83 -187 -140 -133 -173 -116 21 101 118 -34 194 -15
1228a5q8M04l19o7K59j73r6P1L5K32j37K93j28q2J32J6k58l8q6k27QM6j48M0J34
$$ -15 -103 301 -18 -85 174 1 -95 -24 11 243 106 399 271 189 321 337 79 41 -45 -272 -264 -218 -366 -326 -192
1253a92p9J52J50L9O8J95m8j84J44K1j63K30j18n8j53J39k48Q8J64j40M1k4J04
$$ -192 -271 -119 31 70 138 333 285 101 245 266 103 333 215 157 4 143 -105 -17 147 7 48 24 128
1276A28j17l1j31J0n3P5j5j43j7J40j50R6P9J8J97J26Q2o3Q0O3k47L45k1l94R9
$$ 128 11 -20 -151 -141 -194 -119 -134 -277 -294 -154 -304 -208 -129 -111 86 212 294 231 311 374 127 472 451 57 156
1301A56k88j78J60R9k16J18jj51J22K30j2j77J28R5j29J30p4k9k66L5J54j9kL08
$$ 156 -132 -310 -150 -51 -267 -149 -150 -301 -179 51 39 -138 -10 85 -44 86 12 -17 -283 -248 -94 -113 -115 193
1325A93p4k2P2K3K41j63k16J68j59j65R5l5j00k4k66K04Q4m59M59j60J34J75J63
$$ 193 119 97 169 192 433 270 54 222 63 -102 -7 -42 -142 -166 -432 -228 -144 -603 -144 -304 -170 5 168
1348A68o7J3L8N1j60J3N8J0q6j12j41J18J69q2M4K6jK2M5n3J2q4l8P0p8j64J14
$$ 168 101 114 152 203 43 56 114 124 38 -74 -215 -97 72 -10 34 60 59 81 126 73 85 1 -37 33 -45 -209 -95
1375i5k14J12K05q5P5N3j01K96j76Q5P1k97J86p9M5r6K2J5k9J9O6n1j74J93L0
$$ -95 -309 -197 8 -77 -2 51 -50 246 70 155 226 -71 115 36 81 -15 7 22 -7 12 78 27 -147 46 76
1400G6Q9n6k7L7r8j05K4j38J95o1j94J22p4K28Jj04q1O6N9L1L8j05J26p5lJ28
$$ 76 165 109 82 119 21 -84 -60 -198 -3 -64 -258 -136 -210 18 19 -85 -166 -100 -41 -10 28 -77 49 -26 -29 99
1426I9n4J6Q7j54J23l8N6j41N0j0o7n5L3q9N3R1qRq0J21r8R8l2o3J45o1k27K76
$$ 99 45 61 148 -6 117 79 135 -6 44 34 -33 -88 -55 -144 -91 0 -8 1 -79 42 -56 42 10 -53 92 31 -196 80
1454H0K9k69J65J16P5k23K06Or0l6m8l1J49j90L2R4j79j78K78p5o6l7J53o0JR3
$$ 80 109 -160 5 121 196 -27 179 185 95 59 11 -20 129 -61 -29 65 -114 -292 -14 -89 -155 -192 -39 -99 -98 -5
1480eJ31j74J06J0k2P7q2j02J10Q7K3j96M4n2J47M1o9j36N4J37j03N9k5n9k8m5
$$ -5 126 -48 58 68 46 123 41 -61 49 136 159 -37 7 -45 102 143 74 -62 -8 129 26 85 60 1 -27 -72
1506g2p5m2L1L1K0R5J90k00Q8q8J68Pm4q0m8K59j84r9LJ60m04L80n8o3jL1J59
$$ -72 -147 -189 -158 -127 -107 -12 178 -22 66 -22 146 153 109 29 -19 240 56 -43 -40 120 -284 96 38 -25 -26 5 164
1533A64k13N3O1o2M9j46OK0L7j03l0K64k49K55l6O1J1M6j37J44j4j6l51L45N2
$$ 164 -49 4 65 3 52 -94 -88 -68 -31 -134 -164 100 -149 106 70 131 142 188 51 195 181 165 -186 159 211
1558B11l52L50j18k71M0J93N9k93K70M9l18J94M3j89J44p4j65J33p6K09j84R5
$$ 211 -141 209 91 -180 -140 53 112 -181 89 138 -180 14 57 -132 12 -62 -227 -94 -170 39 -145 -50
1580e0l5J17O1o0k02M60M6k11O6Q6l02K61m0j23k32O4kk27L54k08k12K84K6K0
$$ -50 -85 32 93 33 -169 291 337 126 192 278 -24 237 197 74 -158 -94 -96 -323 31 -177 -389 -105 -79 -59
1604e9J77j7k5M8Mj01q3N3rJ03J56l77K1j2K91j57M4K3k14P6K53qj32J58k99r3
$$ -59 118 101 76 124 128 27 -56 -3 -12 91 247 -130 -109 -121 170 13 57 80 -134 -58 195 187 55 213 -86 -179
1630a79K99l74J03K65p9j31P6jj61J22J81J29j97K18k55R9J68j41k51J96l0r2
$$ -179 120 -254 -151 114 35 -96 -20 -21 -182 -60 121 250 53 271 16 115 283 142 -109 87 57 -35
1652c5O0j99J08%q4K05O3j12J5j4J2j5q0J13J4j16M2j56J32j45K80k21M3J41k31
$$ -35 25 -174 -66 -66 -150 55 118 6 21 7 19 4 -76 37 51 -65 -23 -179 -47 -192 88 -133 -90 51 -180
1677a80m6L36l28K88l2J25k2q8K37k56J99m7q3p9J20r8j39m1r3R7J19O4J0M4k4
$$ -180 -226 110 -218 70 38 163 141 53 290 34 233 186 103 24 144 46 -93 -134 -227 -130 -11 53 63 107 83
1702H3q1r4L77l40m7R2j0M0k81P7J43o4LJ35q6K99K2p7O0p6j13P7K4k67o2O2N6
$$ 83 2 -92 285 -55 -102 -10 -20 20 -261 -184 -41 -105 -102 33 -53 246 268 191 251 175 62 139 163 -104 -166 -104 -48
1729d8j92O3J14N3J09lK3q1j78J21R6r2J08qj46N7l31L47k5j4K65j60P2R4j89
$$ -48 -240 -177 -63 -10 99 96 119 38 -140 -19 77 -15 93 85 -61 -4 -335 12 -13 -27 238 78 150 244 55
1754E5m5K1O0j17o7j54L6p0n8R2NJ82j7J0J63Q3Q3l6j65J51n5k09K9Jrj22N8R
$$ 55 10 31 91 -26 -93 -247 -211 -281 -339 -247 -242 -60 -77 -67 96 179 262 226 61 212 157 -52 -23 -22 -31 -153 -95 -86
1782h6j21K50k7M4lj37J65j22J02j04J7k6ok09J41j82J59q2J95j05J08M6J41o6
$$ -86 -207 43 16 60 57 -80 85 -37 65 -39 -22 -48 -54 -263 -122 -304 -145 -227 -32 -137 -29 17 158 92
1806I2j01J82m6K23k93m6O8j09M7J9j38J00k3j72QK31n6KJ60o7j05j57J47K3l3
$$ 92 -9 173 127 350 57 11 79 -30 17 36 -102 -2 -25 -197 -189 42 -14 -12 148 81 -24 -181 -34 -11 -44
1831d4Q0n7L5mk12J94j08N1L3j36L9J41M4j09pN5Q6j0Q6j61m5J04J0j08j15L4
$$ -44 36 -21 14 10 -202 -8 -116 -65 -32 -168 -129 12 56 -53 -60 -5 81 71 157 -4 -49 55 65 -43 -158 -124
1857a24O0R0p7L6K5n2J88k45J20j42P1J08r0P4j45R9l8J29r1J16J89l31P6N5k0
$$ -124 -64 26 -51 -15 10 -42 146 -99 21 -121 -50 58 -32 42 -103 -4 -42 87 -4 112 301 -30 46 101 81
1882H1q0M8l4j61L6L3j24K36r4Q7o8P6j64O1J54j6Mq3J5J68n1N4k80J34j0o9j78
$$ 81 1 49 15 -146 -110 -77 -201 35 -59 28 -40 36 -128 -67 87 71 75 -8 7 175 124 178 -102 32 22 -47 -225
1909b25L53j81Q0n6k9J06L9Jj21m6k3K18k30P1j5L0r9J38jm5n7N4Q8Q3k71P7J35
$$ -225 128 -53 27 -29 -58 48 87 88 -33 -79 -102 116 -114 -43 -58 -28 -127 11 10 -35 -92 -38 50 133 -138 -61 74
1936G4l2o3O8L1n2j61J55J1J14j81j60L17j28O3j15J6J12o6M2R3r7O9j74lk0J66
$$ 74 42 -21 47 78 26 -135 20 31 145 -36 -196 121 -7 56 -59 -43 69 3 45 138 41 110 -64 -67 -87 79
1962G9j7j15K4m9j13L01n6j14m7J51MK18j80j89J25R4j21J49q3j07m1JJ79j72
$$ 79 62 -53 -29 -78 -191 110 54 -60 -107 44 48 266 86 -103 22 116 -5 144 61 -46 -87 -86 93 -79
1986g9J22r4L6N3mp1q0P3J11j83J22k15o6K92p5L7k7J83j90K26j54m7J23pK6k8
$$ -79 43 -51 -15 38 34 -37 -117 -44 67 -116 6 -209 -275 17 -58 -21 -48 135 -55 171 17 -30 93 86 112 84
2012H4J1Jk08J46l07M5Pk03K34QJ25k4K07j28J6J49O0j48j00NJ41j75J04j19J1
$$ 84 95 96 -112 34 -273 -228 -221 -424 -190 -182 -57 -81 126 -2 14 163 223 75 -25 -20 121 -54 50 -69 -58
2037e8j0L28k72L0M5n8J20j0j38J73j18k1K0n8n2R8j69K2J68p2J72q1P8o9L3o1
$$ -58 -68 260 -12 18 63 5 125 115 -23 150 32 11 31 -27 -79 19 -150 -128 40 -32 140 59 137 68 101 40
2063D0J64m0j63j2J28j3p4J37j23j47J21p9J12o9L8j44nj6K04q2n2N5nq1K8J56
$$ 40 204 164 1 -11 117 104 30 167 44 -103 18 -61 51 -18 20 -124 -129 -145 59 -23 -75 -20 -25 -106 -78 78
2089G8M0J10k77O2jkJ55k65J52l4J72l00j2J46o3R4O9k26M8J99o2J59l54k3O4
$$ 78 118 228 -49 13 12 10 165 -100 52 18 190 -110 -122 24 -39 55 124 -102 -54 145 83 242 -112 -135 -71
2114g1J20L7j15j04QK21j62J88j71P1J05k68Q7NN0L1N3L0j54N2L3l2J9m2n1k5
$$ -71 49 86 -29 -133 -125 96 -66 122 -49 22 127 -141 -54 -49 1 32 85 115 -39 13 46 14 33 -9 -60 -85
2140h5L9J50j18k9m4M6Q3l2r1J16K3j69J71k5k8ON5r2L8r1J47k38O4J07r8j9J11
$$ -85 -46 104 -14 -43 -87 -41 42 10 -81 35 58 -111 60 35 7 13 68 -24 14 -77 70 -168 -104 3 -95 -114 -3
2167cK3n5R9j49J47R6j78p7J67K3j49O9J49j77q0J06m3m0J38r9j03P8RO8J62n4
$$ -3 20 -35 64 -85 62 158 -20 -97 70 93 -56 13 162 -15 -95 11 -32 -72 66 -33 -136 -58 -49 19 181 127
2193A27p3M0M5m7P0j59RQ5l4j82n0L6J56j24k8J25l4j59K06r0J38p3n8J56j36
$$ 127 54 94 139 92 162 3 12 97 63 -119 -169 -133 23 -101 -129 -4 -38 -197 9 -81 57 -16 -74 82 -54
2218e4n8J27j0M1K0p0l9J11P8n9j8L7j6m3j04K13j51l0k21K04j8k3M9k04L77j51
$$ -54 -112 15 5 46 66 -4 -43 68 146 87 69 106 90 47 -57 156 5 -25 -246 -42 -60 -83 -34 -238 139 -12
2244a2j4nn5nK3J44q2o3K41ok72J18jp8J63m8j23O9l3j37J13K9R2j37J12N9j46
$$ -12 -26 -31 -86 -91 -68 76 -6 -69 172 166 -106 12 11 -67 96 48 -75 -6 -39 -176 -63 -34 58 -79 33 92 -54
2271e4J88j58J09m9j3j45K28k2j18J2N6P5k21J94M9k87R3M8J08k25J94k28K51
$$ -54 134 -24 85 36 23 -122 106 84 -34 -22 34 109 -112 82 131 -156 -63 -15 93 -132 62 -166 85
2294H5oR7j07Lj56M2jO9l1j50J11R1m5q6P9nm8J21K3p6p1J11j18J79p2l1L9j14
$$ 85 79 176 69 72 -84 -42 -43 26 -5 -155 -44 47 2 -84 -5 -10 -58 63 86 10 -61 50 -68 111 39 8 47 -67
2322f7J8J43O0o8j26N6J39r8o0q3Q2L2m6p5KJ05r1j22J11M2P1n5j32K38j88J72
$$ -67 -49 94 154 86 -40 16 155 57 -3 -86 -4 28 -18 -93 -91 14 -77 -199 -88 -46 25 -30 -162 76 -112 60
2348F0P0k21J60j31k0qk1M9J28l8qN2j8p4J9J27m7M8p3j26K26j38j04J10j59J36
$$ 60 130 -91 69 -62 -82 -90 -111 -62 66 28 20 72 54 -20 -1 126 79 127 54 -72 154 16 -88 22 -137 -1
2374aj11J56k7N2r3m5J25pK7j51M5M7%Kj05J01J73j80P6P1NO2l10J03J27j61P9
$$ -1 -112 44 17 69 -24 -69 56 49 76 -75 -30 17 17 19 -86 15 188 8 84 155 160 222 -88 15 142 -19 60
2401F0p9j58J62J0j43K13k46J63K81k37JJ89l31N6N8J29p1R1k12K05K7j91k1R2
$$ 60 -19 -177 -15 -5 -148 65 -181 -18 263 26 27 216 -115 -59 -1 128 57 148 -64 141 168 -23 -44 48
2425D8o4m3OP2L6n1j84J01K0j79K12o8J63n5K5l2j61J10J7k13K71p2K2J21j07
$$ 48 -16 -59 -53 19 55 4 -180 -79 -59 -238 -26 -94 69 14 39 7 -154 -44 -27 -240 31 -41 -19 102 -5
2450eLr1MJ39l0L4J7j25PN1M3j75M6P4l2J38j73J67j57M6mJ03Lk31L45k14r5K22
$$ -5 -2 -93 -89 50 20 54 71 -54 -47 4 47 -128 -82 -8 -40 98 -75 92 -65 -19 -23 80 83 -148 197 -17 -112 110
2478A10k38J16N0O5n1ll7p6K6J5Q2j4j8J04p0j58J17L5q1M8Q1m4j15J75j09L5
$$ 110 -128 -12 38 103 52 49 12 -64 -38 -23 59 45 27 131 61 -97 20 55 -26 22 103 59 -56 119 10 45
2504D5p9n9K26j82R2J3r0N2K0Rj04P1M1n6L6m6Q5j7k30K52k18P1K36j23J13j29
$$ 45 -34 -93 133 -49 43 56 -34 18 38 47 -57 14 55 -1 35 -11 74 57 -173 79 -139 -68 168 45 158 29
2530B9J5k36M9J77J01j14l1P0j82Q1NJJ39j88J32j79rL08r3o3l9K13k20J64j8
$$ 29 44 -192 -143 34 135 21 -10 60 -122 -41 -36 -35 104 -84 48 -131 -140 168 75 12 -27 186 -34 130 112
2555A12l7P9k7j38P0k5j3k4m0mn4J04p6N5J22j89J33o3rl6o1K87j22j30J77Qj79
$$ 112 75 154 127 -11 59 34 21 -3 -43 -47 -101 3 -73 -18 104 -85 48 -15 -24 -60 -121 166 44 -86 91 99 -80
2582h0M7N5K2J21k0o3J2K8j09PM2j19J41k22J67p1j8k9Q9K23k36l02K96r8L01
$$ -80 -33 22 44 165 145 82 94 122 13 20 62 -57 84 -138 29 -42 -60 -89 0 223 -13 -315 -19 -117 184
2607A84k99J96k1p5O9j32p0K53k04N0M2p9P8rP8L5M4k58J03p7Q8J74k62K4Q3R
$$ 184 -115 81 60 -15 54 -78 -148 105 -99 -49 -7 -86 -8 -17 61 96 140 -118 -15 -92 -4 170 -92 -68 15 24
2633B4j09Q5m5J65%j47o5J72l2rp7J07K4m6o3m0j7J06n4O0nj67J83q8o9K5R5K0
$$ 24 -85 0 -45 120 120 -27 -92 80 48 39 -38 69 93 47 -16 -56 -73 33 -21 39 34 -133 50 -38 -107 -82 13 33
2661C3j22n9J67%p7m4R7J13r9J69j50l6P0k4Q4R4m1l4j72MK1j02rN7J14r6q1L4
$$ 33 -89 -148 19 19 -58 -102 -5 108 9 178 28 -8 62 38 122 216 175 141 -31 -27 -6 -108 -117 -60 54 -42 -123 -89
2689h9O0J25k9q4L1j25J62q9J22j07P8n0P4L6k45O9J04j10R6j12J15O5k05J96
$$ -89 -29 96 67 -17 14 -111 51 -38 84 -23 55 5 79 115 -130 -61 43 -67 29 -83 32 97 -108 88
2713H8q8m1J03p1R2R6l14R2k18K77R3j50L1M5k4l8j1r4J02j69J92J13q9P2m1M9
$$ 88 0 -41 62 -9 83 179 -135 -43 -261 16 109 -41 -10 35 11 -27 -38 -132 -30 -199 -7 106 17 89 48 97
2739I7j33j09K83j81J03nj67K07j18O3R8m9p8r3N9L7jo5J3k3J40r2J30J0r1J71
$$ 97 -36 -145 138 -43 60 55 -112 95 -23 40 138 89 11 -82 -23 14 13 -52 -39 -62 78 -14 116 126 35 206
2765B06j56P4j32j41K41N7o4k88J76J05k71J65K00j31j05J32j16m8J05L8j01K1
$$ 206 50 124 -8 -149 92 149 85 -203 -27 78 -193 -28 172 41 -64 68 -48 -96 9 47 -54 -33
2787c3J7m9J37j76m9m0K02Q9j35J04j68P4J20o5J4j41MM3P1K6m1mq6p5l4K60k20
$$ -33 -16 -65 72 -104 -153 -193 9 98 -37 67 -101 -27 93 28 42 -99 -95 -52 19 45 4 0 -86 -161 -195 65 -155
2814a55K55kQp9p6O1O0N6j75L09k48J32N1k44o3N4J66j27L3j19K13j76R5j25O4
$$ -155 100 98 106 27 -49 12 72 128 -47 262 14 146 197 -47 -110 -56 110 -17 16 -103 110 -66 29 -96 -32
2839c2Q2O6o9K5r5J44j09j3j6j3R4j63J40j53J92q4q7J15p0K01Q3k43rk2R2k08
$$ -32 50 116 47 72 -23 121 12 -1 -17 -30 64 -99 41 -112 80 -4 -91 24 -46 155 238 -5 -14 -36 56 -152
2865a52J77OKj6m3m5q4K81j39j20L45l37N7P0m1J56j06r5J42J0l5k56L87j20L
$$ -152 25 31 33 17 -26 -71 -155 126 -13 -133 212 -125 -68 2 -39 117 11 -84 58 68 33 -223 164 44 47
2890D7q8J04k21K25M9q4j44J32lM6m5N3l2M8Q7k36J90o9j30J66M8j96K9q8J68
$$ 47 -41 63 -158 67 116 32 -112 20 17 63 18 71 39 87 174 -62 128 59 -71 95 143 -53 -24 -112 56
2915E6n1J30k07oK0M6J00j02J05O1k60N5O9pp2P3Q9k34J90p3K9O5q7N7j1J26j63
$$ 56 5 135 -72 -78 -58 -12 88 -14 91 152 -108 -53 16 9 -63 10 99 -135 55 -18 11 76 -11 46 35 161 -2
2942bR1j82J47j06p9N4K18j20j01J75j21R4P9k08j39K28M9k04N9J7k7J0n5K15
$$ -2 89 -93 54 -52 -131 -77 141 21 -80 95 -26 68 147 -61 -200 28 77 -127 -68 -51 -78 -68 -123 92
2966I2k6qn0L3r4KM4N3l6Q0o7j3j09j6J27r3J20q1Ol6N0N9r5O8L7j42%O7O8J76
$$ 92 66 58 8 41 -53 -51 -7 46 10 90 23 10 -99 -115 12 -81 39 -42 -36 -72 -22 37 -58 10 47 -95 -95 -28 40 216
2996B16l24J46l5m9nK38j41j85J67K0J5k0l7J0oj31J51K6j68N5Q6LJ3j29J80Q4
$$ 216 -108 38 3 -46 -51 187 46 -139 28 48 63 43 6 16 10 -121 30 56 -112 -57 29 32 45 -84 96 180
3022A80j56N1j05J2K17k13K1J57k40J58q6l2J74q6k3p4J07J9j39Q8P0j05j8L8
$$ 180 24 75 -30 -18 199 -14 7 164 -76 82 -4 -36 138 52 29 -45 62 81 -58 30 100 -5 -23 15
3046A5j21J09J8J2m1k37K44j6l5N7n0J6j8J30J14k22j00O0J11j26Q3L0K32k53
$$ 15 -106 3 21 33 -8 -245 -1 -17 -52 5 -45 -29 -47 83 197 -25 -125 -65 46 -80 3 33 265 12
3070A2m3m4J72r3K8n2m1M7k0J15j79J24r8M3lK0q3J26j56K49j37q6K48j79J31
$$ 12 -31 -75 97 4 32 -20 -61 -14 -34 81 -98 26 -72 -29 -32 -12 -95 31 -125 124 -13 -99 149 -30 101
3095A01o8J45n6l05K94j04J13l0k09N1K1qlO2J0o7n7k9K13n9K12j27kj97Q6J42
$$ 101 33 178 122 -183 111 7 120 90 -119 -68 -47 -55 -58 4 14 -53 -110 -139 74 15 227 100 98 -99 -13 129
3121A29j03lj05O8j10J03J06j16J04n9J7J00j84L8l1K9O2p8m4l9J93Pj87K02k10
$$ 129 26 23 -82 -14 -124 -21 85 -31 73 14 31 131 -53 -15 -46 -17 45 -33 -77 -116 77 84 -103 99 -111
3146a11OJ04Q%j02Q1L8o8J88j10jr0O6R8pp0P5j66J7MM7J81j50j30L7K30j87J08
$$ -111 -105 -1 7 7 -95 -14 24 -44 144 34 33 -57 9 107 100 30 105 -61 -44 -40 7 188 38 -92 -55 175 -12 96
3174I6Pj15O5N4lm2l8k7J48L1j86J38j82j0M1N6j6k1P7j79R8k7Q8P8j09J5j6Q2
$$ 96 103 -12 53 107 104 62 24 -3 145 176 -10 128 -54 -64 -23 33 17 -4 73 -106 -8 -35 53 131 22 37 21 103
3202A03j80J5l9m7P7L3j9K39m5l8j88J22R9j86J4J36k84J89L8r3J00o1j19M4Q7
$$ 103 -77 -62 -101 -148 -71 -38 -57 182 137 99 -89 33 132 -54 -40 96 -188 1 39 -54 46 -15 -134 -90 -3
3227cj55J45K9J27m4j43O5O3Mj77J37j6Q6j83J9P2p1Q3k06J40J81r7j56K03oj01
$$ -3 -158 -13 16 143 99 -44 21 84 88 -89 48 32 118 -65 -46 26 -45 38 -168 -28 153 56 -100 103 97 -4
3253dj11K73k27R7m6J38j04L5k5r4O9K2j34J05J91j62M5n6r4o1L09k41K5j30J97
$$ -4 -115 158 -69 28 -18 120 16 51 26 -68 1 23 -111 -6 185 23 68 12 -82 -143 166 -75 -50 -180 17
3278A7j68J76L8j41J41j43J50k09K51j87J97k18J93j54J17q5R5j55r8J81R0j36
$$ 17 -151 25 63 -78 63 -80 70 -139 112 -75 122 -96 97 -57 60 -25 70 -85 -183 -2 88 -48
3300d8K6J8M0q9Q4j3mJ10j68K22J2j99j35K43j63N2N4j5n3rK40l10L0j5J18K8
$$ -48 -22 -4 36 -53 31 18 14 124 -44 178 190 -9 -144 99 -64 -12 42 27 -26 -35 205 -105 -75 -90 28 56
3326E6j39J47j6L0k86J93Q9j80L0J43q7j9J52j79J56rj32P2p5R7l2J26j52J34
$$ 56 -83 64 48 78 -208 -15 74 -106 -76 67 -20 -39 113 -66 90 81 -51 21 -54 43 11 137 -15 119
3350A19j49Q5k7J2N8m1J7n9j6J61j80n2L7J7M5l1n4J65k49K21O2j10n7L4J13j48
$$ 119 -30 55 28 40 98 57 74 15 -1 160 -20 -72 -35 -18 27 -4 -58 107 -142 79 141 31 -26 8 121 -27
3376b7l9J74l0j46m9K19K8j10q9J98k50J80j7k75J15L9J27k7oJ2m5p8q5J48J07
$$ -27 -66 108 78 -68 -117 102 130 20 -69 129 -121 59 42 -233 -118 -79 48 21 15 27 -18 -96 -181 -33 74
3401G4O1j67m0j07K50j43K2R9j1j14M4R4j58P1k5oK07K4n6j62O2j37J84j6p2l1
$$ 74 135 -32 -72 -179 71 -72 -50 49 38 -76 -32 62 -96 -25 -50 -56 151 175 119 -43 19 -118 66 50 -22 -53
3427e3l9J35k7R5k92J17Q7JJ24k59oJ26J11j51M0r6P5j0K2M4J4p9rm5O4o7k7K9
$$ -53 -92 43 16 111 -181 -64 23 24 148 -111 -117 9 120 -31 9 -87 -12 -22 0 44 58 -21 -30 -75 -11 -78 -105 -76
3455g6J45m3q0M8o5J02J60n8j23m0J7l0O6J0j6Mm6J10P7M1k25K5K4pR8j38q5J26
$$ -76 69 26 -54 -6 -71 31 191 133 10 -30 -13 -43 23 33 17 21 -25 85 162 203 -22 3 27 20 118 -20 -105 21
3483B1o7N6j05J58o1J18j16j14Q3N2q8M9j64J43j22J52n3J23J2q3l9L7J29r6r7
$$ 21 -46 10 -95 63 2 120 4 -110 -27 25 -63 -14 -178 -35 -157 -5 -58 65 77 -6 -45 -8 121 25 -72
3508g2J85j0q4J3k6N2K8r1k12K27M6n6L9o0K0Q0Nq1j76K71k00N0R8R5j91l2J33
$$ -72 113 103 19 32 6 58 86 -5 -217 10 56 0 39 -21 -1 79 84 3 -173 98 -102 -52 46 141 -50 -82 51
3535E1j84J23K7q0J48k0L4l6R2j75J30Q1k87P7n4J18p3l5OJ41J1r0M9k09J34J01
$$ 51 -133 -10 17 -63 85 65 99 63 155 -20 110 191 -96 -19 -73 45 -28 -63 -57 84 95 5 54 -155 -21 80
3561H0k03J53r4J34m9JnNk9l3o4J17P4n5p2j2J32o0p7K7j06J12K2M3j23K76n8
$$ 80 -123 30 -64 70 21 22 17 22 -7 -40 -104 13 87 32 -40 -52 80 20 -57 -30 -136 -24 -2 41 -82 194 136
3588A36J3j19Q8j41p5Q4r5Q8jj9j72L09j60Q5j01J01O0R3r8k28J10lJ51j41K7
$$ 136 149 30 118 -23 -98 -14 -109 -21 -22 -41 -213 96 -64 21 -80 21 81 174 76 -152 -42 -45 106 -35 -8
3613hk2pL9O3j63R7l0qJ4Nq1P3k4l7J55j01J04N2J7O0j17j23OR7k6k58K82KM5
$$ -8 -30 -37 2 65 -98 -1 -31 -39 -25 -20 -101 -28 -52 -89 66 -35 69 121 138 198 81 -42 -36 61 35 -223 59 61 106
3642A06r2J98j30j76J53o6Lk0M2J06j29M7p3JK62k94K4l8J68k31Q7R1O3j73L6
$$ 106 14 212 82 -94 59 -7 -4 -24 18 124 -5 42 -31 -30 232 -62 -38 -76 92 -139 -52 39 102 -71 -35
3667c5O1j53j16K40j8j3J3j1K4J12Oj91O9J51q0j39J7J99k04m2J97j31j12L2L08
$$ -35 26 -127 -243 -3 -21 -34 -21 -32 -8 104 110 -81 -12 139 59 -80 -63 136 -68 -110 87 -44 -156 -124 184
3692A84k53M4R8j04j9J02j72J20OLj67L3K20jj36K7lJ08k31J40J09j61K3J87k75
$$ 184 -69 -25 73 -31 -50 52 -120 0 6 9 -158 -125 95 94 -42 -15 -18 90 -141 -1 108 -53 -30 157 -118
3717a18N9J47j03K4J00k29J07K73k10j23K36k27R4ok2J08j03J7mQ3j95J52j36
$$ -118 -59 88 -15 9 109 -120 -13 260 50 -73 163 -64 30 24 2 110 7 24 20 103 -92 60 -76
3740g6M7J16j65K3j07J24J60j79J39j19l5J37Nk10J64M0J1n0j9l9N1k06K90k09
$$ -76 -29 87 -78 -55 -162 -38 122 -57 82 -37 -72 65 70 -140 24 64 75 25 6 -33 18 -188 102 -107
3764a07J67k9j13L2q1K18q9l1rJ6j46J14j03J66M6ML2m3j07J88L8k99p1J28J13
$$ -107 60 31 -82 -50 -131 87 -2 -33 -42 -26 -172 -58 -161 5 51 55 87 44 -63 125 163 -136 -207 -79 34
3789C4m1O7o4K7N3Oq5k1O7N9k44J75j60K71k16K9J22j03M0J9K3n4Rk4J11Q7j12
$$ 34 -7 60 -4 23 76 82 -3 -24 43 102 -142 33 -127 144 -72 -43 79 -24 16 35 58 4 13 -11 100 187 75
3816G5j2j63J61JR6K6k75J81k00K43m0k8j31P7k49L32j08NJ99k61N4l5K28k07
$$ 75 63 -100 61 62 158 184 -91 90 -110 133 93 65 -66 11 -238 94 -14 -9 190 -71 -17 -52 176 -31
3840c1J06J3j58q9J13L5P1NP5q5j17J00K5j47J40n6L9n9J08j1l4L5j78K13j65
$$ -31 75 88 -70 -159 -46 -11 60 65 140 55 -62 38 63 -84 56 0 39 -20 88 77 43 78 -100 113 -52
3865e2J28l8R0j15m7O1L7k23K11K0n1j42J59Q4k93J01P0M7J06l0j66J9J37l0P4
$$ -52 76 38 128 13 -34 27 64 -159 52 72 21 -121 38 122 -171 -70 0 47 153 123 -43 -24 113 83 157
3890A57k69Q1RjQ6P8l39J42K01r6n1J1p3J8L0q8QJ1J37r7L9n4J0o8J8J80k3l0
$$ 157 -112 -31 -22 -23 63 141 -198 -56 145 49 -2 9 -64 -46 -16 -104 -96 -85 52 -45 -6 -60 -50 -118 -100 80 57 27
3918B7n9J60j98m2J45k5J19j52M5Rnk04O3J06Q9n3K6o8J40k70J26L7m0k9j9J14
$$ 27 -32 128 -70 -112 33 8 127 -25 20 29 24 -180 -117 -11 78 25 51 -17 123 -147 -21 16 -24 -53 -72 42
3944D2k16J88Q7j22Q3N5j73J02j76M2L6o3R3o4K39N5k39K33p7pk9j46K38j66J47
$$ 42 -174 14 101 -21 62 117 -56 46 -130 -88 -52 -115 -22 -86 153 208 -31 202 125 118 89 -57 181 15 162
3969A62n3m3j4j49R8J11p5j53M5N4j31J09J19k06J39m2k0j8J93k0j82n1J59j05
$$ 162 109 66 52 -97 1 112 37 -116 -71 -17 -148 -39 80 -126 13 -29 -49 -67 126 106 -76 -127 32 -73
3993g3J51l4K6j08p8PJ38R1q9R9j67rP2j73J29J3j2J4J84k01K0O3K58j47j89J04
$$ -73 78 44 70 -38 -116 -109 29 120 31 130 -37 -46 26 -147 -18 -5 -17 -3 181 -20 0 63 321 174 -15 89
4019H9k48J55L9j17Q0M3M5j10p1J76l3m1j8n7R7OM1o8n2r7J91J43k54J55k23J08
$$ 89 -159 -4 35 -82 -2 41 86 -24 -95 81 48 7 -11 -68 29 35 76 8 -44 -141 50 193 -61 94 -129 -21
4045b1pJ43k42J42Q3m8k3r8P9Ql2k71P3J93p9J42Nm3L6m6j16K07j69J58p9K4K1
$$ -21 -28 115 -127 15 98 50 27 -71 8 16 -16 -287 -214 -21 -100 42 47 4 40 -6 -122 85 -84 74 -5 19 40
4072D0o4J64n8jk00J42j9%J08r2q8J09j21K15k89R4P3j30O1J05Pj27L7J29j34
$$ 40 -24 140 82 81 -119 23 4 4 112 20 -68 41 -80 135 -154 -60 13 -117 -56 49 56 -71 -34 95 -39
4097c9k1p6J95J17k03k1J19J76l36J77j26J9k9k6QJ07NK3q8J04j17M9pm0R6j10
$$ -39 -60 -136 59 176 -27 -48 71 247 -89 88 -38 -19 -48 -74 -66 41 46 69 -19 85 -32 17 10 -30 66 -44
4123d4P3r5J46jk8k7o1%Q0j11J27j31Q4n0k15L31jj17P2k5o6n3R1J26Mj45J00
$$ -44 29 -66 80 79 51 24 -37 -37 43 -68 59 -72 12 -38 -253 78 77 -40 32 7 -59 -112 -21 105 109 -36 64
4150F4r3L2m8O3n6J41p3j7j07J44J16r5j17rQ5j02RJ6K85k68J25k53O5K35L9o7
$$ 64 -29 3 -45 18 -38 103 30 13 -94 50 166 71 -46 -55 30 -72 -63 -47 238 -30 95 -158 -93 142 181 114
4176A14j50L3O0N4j19J06p4j32k3L68j00j26k7J36Lm4j5j32J83J6o7N7j32j69
$$ 114 -36 -3 57 111 -8 98 24 -108 -131 237 137 11 -16 120 123 79 64 -68 115 131 64 121 -11 -180
4200a80P2M5J11J30j69q3J82j70J11m5M1o7J82q4J5j08R0N8r3p6Q9m4o4K01l07
$$ -180 -108 -63 48 178 9 -74 108 -62 49 4 45 -22 160 76 91 -17 73 131 38 -38 51 7 -57 144 -163
4225a63Q1J35L9k6k40K7K04k7j18J53k81J87M6O3j19K10j64%N9m3o2N8J1n6J32
$$ -163 -82 53 92 66 -174 -147 57 30 -88 65 -216 -29 17 80 -39 171 7 7 66 23 -39 19 30 -26 106
4250A06k1Q6j73J25q7J72j55L5n9p1Q3K3j79J41n2K9K9j39P9O0K4K8j44lJ07J24
$$ 106 85 171 -2 123 36 208 53 88 29 -42 41 64 -115 26 -26 3 32 -107 -28 32 56 84 -60 -63 44 168
4276A68k26P3N2j35n0J44M8L9k0j33OJ34o4j93L31l01K12j09m1J3m3J09n9K32
$$ 168 -58 15 67 -68 -118 26 74 113 93 -40 -34 100 36 -157 174 -127 85 -24 -65 -52 -95 14 -45 187
4300A87j29L1Nj21m8P9j03J25j22P0O9r3J9k3o2J55q7m4o9M9M9K1J63j64Q2M0
$$ 187 58 89 94 -27 -75 4 -99 26 -96 -26 43 -50 -31 -54 -116 39 -48 -92 -161 -112 -63 -42 121 -43 39 79
4326G9o7p9J55k08K09k3j06J15M7j06K4o1o3j1J92j78L6Q9j49J52j21m6J99j35
$$ 79 12 -67 88 -120 89 66 -40 75 122 16 40 -21 -84 -95 97 -81 -45 44 -105 47 -74 -120 79 -56
4350e6M3M1J02N8j16n2m0m2K2J53k13R2P6J7M0l02L36j14K8p1r9R0R3l24J50L6
$$ -56 -13 28 130 188 72 20 -20 -62 -40 113 -100 -8 68 85 125 -177 159 45 73 2 -97 -7 86 -238 -88 -52
4376e2O4k39L06Jj2k06J68j13Rq7K81K3k94N7J10K8j86K02k31J22%j8J78K7j67
$$ -52 12 -227 79 80 68 -138 30 -83 -74 -161 120 143 -151 -94 16 44 -142 60 -171 -49 -49 -67 111 138 -29
4401b9M4%n3j37K01n8J38j18O2j0P6l33L48r8j65J99oo0M1N8k00j3J46M7k9j84
$$ -29 15 15 -38 -175 26 -32 106 -12 50 40 116 -217 131 33 -132 67 61 1 42 100 -100 -113 33 80 51 -133
4427a33J31J50p6j36J68n1k48J09p1J68K6j45J72n2P8M5j36ln0K2R5%k22J21j30
$$ -133 -2 148 72 -64 104 53 -195 -86 -157 11 37 -108 64 12 90 135 -1 -4 -54 -32 63 63 -159 -38 -168
4452a68P7N1Q4P9k50J42j35J67j45K17J16k31m4J2K5L4j61K25k85J99JLJ13j01
$$ -168 -91 -40 44 123 -127 15 -120 47 -98 119 235 4 -40 -28 -3 31 -130 95 -190 9 10 13 126 25
4476B5m0k4N8k51J76R2L7k7k16J08J15j49Q2M6j71o7L84q0j67K80k52J34j74K3
$$ 25 -15 -39 19 -232 -56 36 73 46 -170 -62 53 -96 -14 32 -139 -206 178 98 -69 211 -41 93 -81 -58
4500e8j0L1J5j9J42m0j03K26j05j79K6J92l3m2j34l0J32j3Q3r2J38k56J21K8j22
$$ -58 -68 -37 -22 -41 101 61 -42 184 79 -100 -74 118 85 43 -91 -121 11 -2 81 -11 127 -129 -8 20 -102
4525a02Q2k4P4J34LK7k15J11j90R1Q5K7j79K6P0l2N7n8p4J57l2p9J17K3J5o2o3
$$ -102 -20 -44 30 164 167 194 -21 90 -100 -9 76 103 -76 -50 20 -12 45 -13 -87 70 38 -41 76 99 114 52 -11
4552a1K4j15P2N5l9r2J6K33j03p2j78J78J30n2r2Q5Mj86J05J12j77J91k49J60
$$ -11 13 -102 -30 25 -14 -106 -90 143 40 -32 -210 -32 98 46 -46 39 43 -143 -38 74 -103 88 -161 -1
4576aP9j44J15O6j07ml7J8M5k05K87j17k4j31O4K09n8j2j56J82l8l5o8R7n8jl3
$$ -1 78 -66 49 115 8 4 -33 -15 30 -175 112 -5 -29 -160 -96 113 55 43 -113 69 31 -4 -72 25 -33 -34 -67
4603f7r2KK36n0J39p2j45Q4r4M2J1Qj58J82q0N0j3j2J73k8Oj50N3K1M5j02K59
$$ -67 -159 -157 79 29 168 96 -49 35 -59 -17 -6 2 -156 26 -54 -4 -17 -29 144 116 122 -28 25 46 91 -11 248
4630B48j25j83J19r4RK07j27k34K48J54k45o7l5J33R9q3q4K10r2j64j5K94r2r9
$$ 248 123 -60 59 -35 -26 181 54 -180 68 222 -23 -90 -125 8 107 24 -60 150 58 -106 -121 173 81 -18
4654a8J20O0r3k72K15j18J89j2O0j59o4o2J38Q9k25K31m1M4p5j5jJ06j72N6rl3
$$ -18 102 162 69 -203 12 -106 83 71 131 -28 -92 -154 -16 73 -152 79 38 82 7 -8 -9 97 -75 -19 -28 -61
4680f1K54k67j5J6l7K06j17J71k42J0O4J1q1J29l5Q8j13J65j41o4PP7j53Q2Q0
$$ -61 193 -74 -89 -73 -110 96 -21 150 -92 -82 -18 -7 -88 41 6 94 -19 146 5 -59 -52 25 -128 -46 34
4705C4j44K86j38m3L3P1J2j73Jl0j36J24J02k4J02n6j0N5m5K5O9K4o1l4l1R0q8
$$ 34 -110 176 38 -5 28 99 111 -62 -61 -91 -227 -103 -1 -25 77 21 11 66 21 46 115 139 78 44 13 103 15
4732A5o9P9J4mj50J01j09J03j31J62K1j72m7K72m1j33OL5M9J35k7k26J58n2J61
$$ 15 -54 25 39 35 -115 -14 -123 -20 -151 11 32 -140 -187 85 44 -89 -83 -48 1 136 109 -117 41 -11 150
4757A50j98Q3J6m7P2o2J7m7mj00R7k4O1J7J31l93K26j08K33j52J58j14m5o4Q3
$$ 150 -48 35 51 4 76 14 31 -16 -20 -120 -23 -47 14 31 162 -231 -5 -113 120 -32 126 12 -33 -97 -14
4782a4n6Q7k6J11j9k9l7j30J00o2P4p6o6J01R0Q5k42M0Q5R0K3j37q3N8K9L1j26
$$ -14 -70 17 -9 102 83 54 17 -113 -13 -75 -1 -77 -143 -42 48 133 -109 -69 16 106 129 -8 -91 -33 -4 27 -99
4809i9j3R1L6k5m6J55q4j2j01QJ79j04J28j95K9K11k19j05J42j69O6J12M0P8j20
$$ -99 -112 -21 15 -10 -56 99 15 3 -98 -90 89 -15 113 -82 -53 158 -61 -166 -24 -193 -127 -15 25 103 -17
4834a7J47j12k3qL9j73K14Oj56lJ90l24K00J23r1q9J36r4J70j27j10j00K70n1
$$ -17 130 18 -5 -13 26 -147 67 73 -83 -86 104 -220 -20 103 12 -77 59 -35 135 8 -102 -202 68 17
4858A7O5P9q3J0j39P3Q9k04P6p4M8j16J51j06R1ml9N1K06r7j98J11j26J41K7r8
$$ 17 82 161 78 88 -51 22 111 -93 -17 -91 -43 -159 -8 -114 -23 -27 -66 -15 191 94 -104 7 -119 22 49 -49
4884d9J00r7j26K24p5m0k6R5p9J4J39m6m5J12j29j27J61k2j11K30K3qq9o1n0L4
$$ -49 51 -46 -172 52 -23 -63 -89 6 -73 -59 80 34 -11 101 -28 -155 6 -16 -127 103 126 118 29 -32 -82 -48
4910d8J0OJ40p6P8j22m5L0p0K21L6j78O5k5R4p4M8n1k6Q9j06O3m3j06K44q9r9
$$ -48 -38 -32 108 32 110 -12 -57 -27 -97 124 160 -18 47 22 116 42 90 39 13 102 -4 59 16 -90 154 65 -34
4937c4J09j42J37n8R4j55J16o3O0j41N4J04K4j28q4J28ok0N7l1k0Q0L1j13J12
$$ -34 75 -67 70 12 106 -49 67 4 64 -77 -23 81 105 -23 -107 21 15 -5 52 21 1 81 112 -1 111
4962A11j47R5l8J8k3RK5P6k01N0r9J28j23K8K18l0J5k09J16m4R4J28k24p4L1J72
$$ 111 -36 59 21 39 16 25 50 126 -75 -25 -124 4 -119 -91 127 97 112 -97 19 -25 69 197 -27 -101 -70 102
4988A02j37L2J06k68J89L1q5L7J1m5O8Q2j05j36K95j99L7j3j91K57o3K8j32O4
$$ 102 -35 -3 103 -165 24 55 -30 7 18 -27 41 123 18 -118 177 -22 15 2 -189 68 5 33 -99 -35
5012c5oJ13Q6j86k0KK8J18k0j27J58k4j43L4r0J02P9q5j1J71q4J2j14k2R9j90
$$ -35 -41 72 158 -28 -48 -46 -18 100 80 -47 111 87 -56 -22 -112 -10 69 -16 -27 144 60 72 -42 -64 35 -155
5038a55J31o5J66L5j54J48j48m6LK18%j09K7n6J5k7o6J53O2o7j39L9J59Lj47j25
$$ -155 -24 -89 77 112 -42 106 -42 -88 -85 133 133 24 51 -5 10 -17 -83 70 132 65 -74 -35 124 127 -20 -145
5064a45R3J18k26NJ43k0Rl1j52K70q7P3O3j09m3L8L3p1r5J83Q2r4l8j5l9j6M1
$$ -145 -52 66 -160 -155 -12 -32 -23 -54 -206 64 -23 50 113 4 -39 -1 32 -39 -134 49 131 37 -1 -16 -55 -71 -30
5091c0J50j06p7J25M0j37l3Q9J1O4n1p5p7K28j49O7j44K17j76J6J34L0N0p5l0
$$ -30 120 14 -63 62 102 -35 -68 21 32 96 45 -30 -107 121 -28 39 -105 112 -64 -48 86 116 166 91 61
5116F1j12N2o4M1n8K3LJ02J10j10Mp8j18J86J32k26J0q5KL36j51K9j31M1N5m3
$$ 61 -51 1 -63 -22 -80 -57 -54 48 158 48 52 -26 -144 42 174 -52 -42 -127 -125 211 60 89 -42 -1 54 11
5142A1LK53m19J70OO9q6p8N4K7j38J20P0j42J75j20k0J4O0j09N3J5R7o1j32J96
$$ 11 14 267 -152 18 24 93 7 -71 -17 10 -128 -8 62 -80 95 -25 -45 -31 29 -80 -27 -12 85 24 -108 88
5168H8j02J6j40j6M5J21L3K0p1j29J91m4l0J5m1o2J53j9L9n1J09l6m7j70nJ5Q6
$$ 88 -14 2 -138 -154 -109 12 45 65 -6 -135 56 12 -18 -3 -44 -106 47 28 67 16 125 89 42 -128 -133 -118 -32
5195c2R5k21K91j34O8r1r6Q3N5M0P3j60Mm8K49k45J53p9R5k27J66K3r4K4K26k39
$$ -32 63 -158 133 -1 67 -24 -120 -37 18 58 131 -29 -25 -73 176 -69 84 5 100 -127 39 62 -32 -8 218 -21
5221b1K5k8L2k1K01k77l6O9K6J04p8j22J08P4k2P9j31Q1j18Q3k3J8n0kl0Q0qk
$$ -21 4 -24 8 -13 188 -89 -125 -56 -30 74 -4 -126 -18 56 34 113 -18 63 -55 28 5 23 -27 -29 -59 21 13 11
$$ [...]
8191a42
##END NTUPLES=NMR FID
##END=
