##TITLE=1H_Pr 5148
 CDCl3
 8 sc, 
 15.12.2022
##JCAMPDX= 6.0         $$ Bruker NMR JCAMP-DX V2.0
##DATA TYPE= NMR FID
##DATA CLASS= NTUPLES
##ORIGIN= UXNMR, Bruker Analytische Messtechnik GmbH
##OWNER= root
$$ XWIN-NMR		Version 3.5
$$ Thu Dec 15 15:51:57 2022 Russian Standard Time (UT+4h)  she@DPX200
##.OBSERVE FREQUENCY= 200.13135
##.OBSERVE NUCLEUS= ^1H
##.DELAY= (6, 6)
##.ACQUISITION MODE= SIMULTANEOUS
##.ACQUISITION SCHEME= undefined
##.AVERAGES= 8
##.DIGITISER RES= 18
##SPECTROMETER/DATA SYSTEM= spect
##.PULSE SEQUENCE= zg30
##.SOLVENT NAME= CDCl3
##.SHIFT REFERENCE= (INTERNAL, CDCl3, 0, 15.7039)
##AUDIT TRAIL= $$ (NUMBER, WHEN, WHO, WHERE, WHAT)
$$ ##TITLE= Audit trail, XWIN-NMR		Version 3.5
$$ ##JCAMPDX= 5.01
$$ ##ORIGIN= Bruker BioSpin GmbH
$$ ##OWNER= she
$$ F:/spectra/data/she/nmr/H-F/1/audita.txt
$$ ##AUDIT TRAIL=  $$ (NUMBER, WHEN, WHO, WHERE, WHAT)
(   1,<2022-12-15 15:50:58.10 +0400>,<she>,<DPX200>,
      <created by zg, POWCHK disabled, PULCHK disabled
       configuration hash MD5:
       00 E9 B6 7A A2 85 ED C7 34 08 36 98 17 FE 4E 26
       data hash MD5: 16K
       20 8E 22 E7 97 A8 1B 37 53 A8 0E 06 CB FF 79 47>)
$$ ##END=
$$ 
$$ hash MD5
$$ D1 4B 3E 61 01 A5 29 F8 E4 F2 1E 20 06 94 E0 BB
##$RELAX= 
##$RELAX= 
##$RELAX= 
##$RELAX= 
##$RELAX= 
##$RELAX= 
$$ Bruker specific parameters
$$ --------------------------
##$DU= <F:/spectra>
##$EXPNO= 1
##$NAME= <H-F>
##$PROCNO= 1
##$TYPE= <nmr>
##$USER= <she>
##$AMP= (0..31)
100 100 100 100 100 100 100 100 100 100 100 100 100 100 100 100 100 100 
100 100 100 100 100 100 100 100 100 100 100 100 100 100 
##$AQSEQ= 0
##$AQ_mod= 1
##$AUNM= <au_zg>
##$AUTOPOS= <>
##$BF1= 200.13
##$BF2= 200.13
##$BF3= 200.13
##$BF4= 200.13
##$BF5= 200.13
##$BF6= 200.13
##$BF7= 200.13
##$BF8= 200.13
##$BYTORDA= 1
##$CFDGTYP= 0
##$CFRGTYP= 5
##$CHEMSTR= <none>
##$CNST= (0..31)
1 1 145 1 1 1 1 1 1 1 1 1 1 1 1 1 1 1 1 1 1 1 1 1 1 1 1 1 1 1 1 1 
##$CPDPRG= <>
##$CPDPRG1= <>
##$CPDPRG2= <>
##$CPDPRG3= <>
##$CPDPRG4= <mlev>
##$CPDPRG5= <mlev>
##$CPDPRG6= <mlev>
##$CPDPRG7= <mlev>
##$CPDPRG8= <mlev>
##$CPDPRGB= <>
##$CPDPRGT= <>
##$D= (0..31)
0 1.2 0 0 0 0 0 0 0 0.06 0 0.03 0 0 0 0 0.0002 0 0 0 0 0 0 0 0 0 0 0 0 
0 0 0 
##$DATE= 1671105057
##$DBL= (0..7)
120 120 120 120 120 120 120 120 
##$DBP= (0..7)
150 150 150 150 150 150 150 150 
##$DBP07= 0
##$DBPNAM0= <>
##$DBPNAM1= <>
##$DBPNAM2= <>
##$DBPNAM3= <>
##$DBPNAM4= <>
##$DBPNAM5= <>
##$DBPNAM6= <>
##$DBPNAM7= <>
##$DBPOAL= (0..7)
0.5 0.5 0.5 0.5 0.5 0.5 0.5 0.5 
##$DBPOFFS= (0..7)
0 0 0 0 0 0 0 0 
##$DE= 6
##$DECBNUC= <off>
##$DECIM= 32
##$DECNUC= <off>
##$DECSTAT= 4
##$DIGMOD= 1
##$DIGTYP= 9
##$DL= (0..7)
0 120 120 120 120 120 120 120 
##$DP= (0..7)
150 150 150 150 150 150 150 150 
##$DP07= 0
##$DPNAME0= <>
##$DPNAME1= <>
##$DPNAME2= <>
##$DPNAME3= <>
##$DPNAME4= <>
##$DPNAME5= <>
##$DPNAME6= <>
##$DPNAME7= <>
##$DPOAL= (0..7)
0.5 0.5 0.5 0.5 0.5 0.5 0.5 0.5 
##$DPOFFS= (0..7)
0 0 0 0 0 0 0 0 
##$DQDMODE= 0
##$DR= 18
##$DS= 0
##$DSLIST= <SSSSSSSSSSSSSSS>
$$ [...]
##$SUBNAM2= <"">
##$SUBNAM3= <"">
##$SUBNAM4= <"">
##$SUBNAM5= <"">
##$SUBNAM6= <"">
##$SUBNAM7= <"">
##$SUBNAM8= <"">
##$SUBNAM9= <"">
##$SW= 18.05172834244
##$SWIBOX= (0..15)
0 0 2 0 0 0 0 0 0 0 0 0 0 0 0 0 
##$SW_h= 3612.71676300578
##$TD= 16384
##$TD0= 1
##$TE= 0
##$TE2= 300
##$TE3= 300
##$TEG= 300
##$TL= (0..7)
0 120 120 120 120 120 120 120 
##$TP= (0..7)
150 150 150 150 150 150 150 150 
##$TP07= 0
##$TPNAME0= <>
##$TPNAME1= <>
##$TPNAME2= <>
##$TPNAME3= <>
##$TPNAME4= <>
##$TPNAME5= <>
##$TPNAME6= <>
##$TPNAME7= <>
##$TPOAL= (0..7)
0.5 0.5 0.5 0.5 0.5 0.5 0.5 0.5 
##$TPOFFS= (0..7)
0 0 0 0 0 0 0 0 
##$TUNHIN= 0
##$TUNHOUT= 0
##$TUNXOUT= 0
##$USERA1= <user>
##$USERA2= <user>
##$USERA3= <user>
##$USERA4= <user>
##$USERA5= <user>
##$V9= 5
##$VALIST= <valist>
##$VCLIST= <CCCCCCCCCCCCCCC>
##$VD= 0
##$VDLIST= <DDDDDDDDDDDDDDD>
##$VPLIST= <PPPPPPPPPPPPPPP>
##$VTLIST= <TTTTTTTTTTTTTTT>
##$WBST= 1024
##$WBSW= 4
##$XGAIN= (0..3)
0 0 0 0 
##$XL= 0
##$YL= 0
##$YMAX_a= 359816
##$YMIN_a= -433440
##$ZGOPTNS= <>
##$ZL1= 120
##$ZL2= 120
##$ZL3= 120
##$ZL4= 120
##$ABSF1= 10
##$ABSF2= 0
##$ABSG= 5
##$ABSL= 3
##$ALPHA= 0
##$AQORDER= 0
##$ASSFAC= 0
##$ASSFACI= 0
##$ASSFACX= 0
##$ASSWID= 0
##$AUNMP= <proc_1d>
##$AZFE= 0.1
##$AZFW= 0.1
##$BCFW= 1
##$BC_mod= 2
##$BYTORDP= 1
##$COROFFS= 0
##$CY= 11.3945322036743
##$DATMOD= 1
##$DC= 2
##$DFILT= <>
##$DTYPP= 0
##$F1P= 2.36226072786647
##$F2P= -0.459571619588291
##$FCOR= 0.5
##$FTSIZE= 0
##$FT_mod= 4
##$GAMMA= 1
##$GB= 0.15
##$INTBC= 1
##$INTSCL= 1
##$ISEN= 128
##$LB= 0.24
##$LEV0= 0
##$LPBIN= 0
##$MAXI= 10000
##$MC2= 0
##$MEAN= 0
##$ME_mod= 0
##$MI= 1.114404
##$NCOEF= 0
##$NC_proc= 0
##$NLEV= 6
##$NOISF1= 3.799351
##$NOISF2= 2.8
##$NSP= 1
##$NTH_PI= 0
##$NZP= 0
##$OFFSET= 15.70392
##$PC= 1
##$PHC0= -19114.33
##$PHC1= 13.80072
##$PH_mod= 1
##$PKNL= yes
##$PPARMOD= 0
##$PSCAL= 0
##$PSIGN= 0
##$REVERSE= no
##$SF= 200.130013532006
##$SI= 16384
##$SIGF1= 3
##$SIGF2= 2
##$SINO= 400
##$SIOLD= 16384
##$SREGLST= <1H.CDCl3>
##$SSB= 0
##$STSI= 0
##$STSR= 0
##$SW_p= 3612.71676300578
##$SYMM= 0
##$S_DEV= 0
##$TDeff= 0
##$TDoff= 0
##$TI= <>
##$TILT= no
##$TM1= 0
##$TM2= 0
##$TOPLEV= 0
##$USERP1= <user>
##$USERP2= <user>
##$USERP3= <user>
##$USERP4= <user>
##$USERP5= <user>
##$WDW= 1
##$XDIM= 8192
##$YMAX_p= 0
##$YMIN_p= 0
$$ End of Bruker specific parameters
$$ ---------------------------------
##NTUPLES= NMR FID
##VAR_NAME=  TIME,          FID/REAL,        FID/IMAG
##SYMBOL=    X,             R,               I
##VAR_TYPE=  INDEPENDENT,   DEPENDENT,       DEPENDENT
##VAR_FORM=  AFFN,          ASDF,            ASDF
##VAR_DIM=   8192,          8192,            8192
##UNITS=     SECONDS,       ARBITRARY UNITS, ARBITRARY UNITS
##FACTOR=    0.0002768,     1,               1
##FIRST=     0,             0,               0
##LAST=      2.2672688,     0,               0
##MIN=       0,             -433440,         0
##MAX=       2.2672688,     359816,          0
$$ Real data points
##PAGE= N=1
##DATA TABLE= (X++(R..R)), XYDATA
$$ plain form
0 0 0 0 0 0 0 0 0 0 -5 8 -8 8 -16 16 -24 24 -32 40 -48 58 -72 88 -104 120 -144 168 -192 224 -257 296 -338
31 -338 385 -439 496 -562 631 -711 795 -890 994 -1106 1227 -1362 1509 -1669 1843 -2034
47 -2034 2243 -2473 2725 -2998 3305 -3642 4017 -4435 4909 -5445 6060 -6772 7611 -8613
61 -8613 9839 -11374 13363 -16054 19924 -25995 36993 -63398 267260 154138 -192451 215924
73 215924 248647 -65257 -247092 59000 25559 -13287 1294 -1719 -178560 -114925 81890
84 81890 -61220 -198929 -45571 170685 35197 -109878 -19813 -12102 -68252 -62084 28185
95 28185 -59212 -17587 153100 173184 4517 -24383 132399 87081 -38790 -38093 39477 17397
107 17397 7381 42100 -37253 -84840 -13010 49239 -74479 -108771 31509 70942 -28838 -53443
$$ packed form
0@%%%%%%%%nJ3j6J6k4L2m0M8n6P2q8J06j30J60j92K24k64L12l60M16m81N53o34
31c38P23q24R35j058J193j342J506j685J884k100K333k589K871l178L512l877
47b034M277m716N198n723O303o947P659q452R344j0354J1505j2832J4383j6224
61h613J8452k1213K4737k9417L5978m5919O2988j00391L30658j13122l46589M08375
73B15924L2723l13904j81835L06092l3441l8846J4581l013j76841O3635J96815
84H1890j43110j37709J53358K16256j35488j45075R0065P711n6150O168R0269
95B8185q7397M1625J70687K0084j68667k8900J56782m5318j25871O97P7570k2080
107A7397j0016L4719p9353m7587P1830O2249j23718l4292J40280L9433r9780k4605
$$ plain form
119 -53443 21093 -28722 -93859 -42183 13382 -60502 -88706 53773 118945 12995 -66515 56638
131 56638 164838 65975 -61446 6607 143613 85607 -59997 -77143 11392 5457 -75139
142 -75139 -88799 -50468 1471 47985 50783 -9444 -9433 61904 34945 -103132 -134882 -26659
154 -26659 -13885 -82446 -46123 49460 52090 31315 74855 69688 6115 25844 89478 31778
166 31778 -38436 24087 69385 -7684 -60096 -12952 -8249 -52334 -33651 -4292 -34522 -20354
178 -20354 41450 849 -73095 -22893 37768 -43163 -96200 14828 75894 -13853 -24102 89707
190 89707 88681 -14742 -6132 66003 26474 -40282 1377 34267 -15690 -26447 9962 -15506
202 -15506 -50089 -10471 8972 -38120 -29930 42273 30596 -32283 -396 50964 35 -52079
$$ packed form
119e3443P4536m9815o5137N1676N5565p3884k8204J42479O5172j05950p9510J23153
131E6638J08200r8863j27421O8053J37006n8006j45604j7146Q8535n935q0596
142g5139j3660L8331N1939M6514K798o0227J1P1337k6959j38077l1750J08223
154b6659J2774o8561L6323R5583K630k0775M3540n167o3573J9729O3634n7700
166C1778p0214O2523M5298p7069n2412M7144M703m4085J8683K9359l0230J4168
178b0354O1804m0601p3944N0202O0661q0931n3037J11028O1066q9747j0249J13809
190H9707j026j03423Q610P2135l9529o6756M1659L2890m9957j0757L6409k5468
202a5506l4583L9618J9443m7092Q190P2203j1677o2879L1887N1360n0929n2114
$$ plain form
214 -52079 -9845 18998 -26780 -42539 5847 18356 -6605 8108 33037 21636 16074 31338
226 31338 21996 -7580 -5084 8211 -15588 -37217 -13307 3072 -11473 -8644 14268 14375 -2730
239 -2730 4603 15515 -9378 -26701 -1331 10808 -17290 -28628 2505 21106 -2875 -17443
251 -17443 7488 25803 12694 115 4602 13031 10449 -601 -10410 -14593 -5752 3156 -8331
264 -8331 -16406 1905 18309 5838 -7525 5351 15274 -1743 -10075 4833 3097 -12653 -5723
277 -5723 9519 -576 -16159 -1701 14462 -88 -11976 1632 8556 -655 -3714 -1721 -3860
290 -3860 -3702 4038 280 -11343 -784 16187 4142 -10321 3512 17669 5466 -7386 4616
303 4616 12685 -888 -4645 4824 -269 -9297 -4700 1147 -7040 -12316 -867 3843 -6342 -5964 2705
$$ packed form
214e2079M2234K8843m5778j5759M8386J2509k4961J4713K4929j1401n562J5264
226C1338r342k9576K496J3295k3799k1629K3910J6379j4545K829K2912J07j7105
239b730P333J0912k4893j7323K5370J2139k8098j1338L1133J8601k3981j4568
251a7443K4931J8315j3109j2579M487Q429k582j1050r809m183Q841Q908j1487
264h331q075J8311J6404j2471j3363J2876R923j7017q332J4908j736j5750O930
277e723J5242j0095j5583J4458J6163j4550j1888J3608O924r211l059J993k139
290c860J58P740l758j1623J0559J6971j2045j4463J3833J4157j2203j2852J2002
303D616Q069j3573l757R469n093r028M597N847q187n276J1449M710j0185L78Q669
$$ plain form
318 2705 742 -4346 -835 982 -2823 -1692 6925 4109 -5010 2663 11503 2681 -5051 4433 12466
333 12466 5238 -478 8390 10948 1598 -939 363 -6495 -11836 -8879 -7415 -11313 -9654 -217 978
348 978 -4091 -730 1237 -3786 -4745 -1510 -1867 -2913 4718 14120 11229 7000 13170 15062 5959 -2766
364 -2766 -3945 -1491 -2863 -5488 -3056 131 3388 3237 -3390 -7068 -6723 -8834 -12176 -12396 -8417 -1789
380 -1789 2582 6512 8613 7327 7345 5853 1149 -734 -2510 -4653 -966 3481 826 -3496 1334 10144
396 10144 4124 -4205 4344 12698 8146 3450 3481 -1269 -7514 -7818 -12189 -24409 -19475 1190 2680
411 2680 -7048 2791 18359 12085 -1858 -3179 -2166 -7140 -3107 3483 -3068 1017 20697 20876 2124
426 2124 268 11618 4703 -11613 -8915 -2957 -8427 -4460 4765 -4751 -10225 5439 8726 -11773
$$ packed form
318B705j963n088L511J817l805J131Q617k816r119P673Q840q822p732R484Q033
333A2466p228n716Q868K558r350k537J302o858n341K957J464l898J659R437J195
348I78n069L361J967n023r59L235l57j046P631R402k891m229O170J892r103q725
364b766j179K454j372k625K432L187L257j51o627l678L45k111l342k20L979O628
380a789M371L930K101j286J8j492m704j883j776k143L687M447k655m322M830Q810
396A0144o020q329Q549Q354m552m696L1m750o245l04m371j2220M934K0665J490
411B680r728R839J5568o274j3943j321J013m974M033O590o551M085J9680J79j8752
426B124j856J1350o915j6316K698N958n470L967R225r516n474J5664L287k0499
$$ plain form
440 -11773 -14436 5287 1589 -16334 -3524 12328 -2441 -7161 15959 19485 -3703 -3964 14661
453 14661 6065 -13246 -5716 3863 -1203 4704 13793 3089 -4214 9690 8886 -20601 -28766 -5388
467 -5388 -1554 -15779 -9258 4283 5756 11144 15366 -160 -7185 18940 27853 -4881 -12361 20794
481 20794 18934 -20363 -27417 -10299 -18223 -26159 -4966 4217 -4888 16776 41557 12495 -18538
494 -18538 1870 13617 -17437 -26703 7720 23369 11276 15742 19977 1197 -9967 -9435 -23574
507 -23574 -32144 -13779 -827 -6452 3445 21284 5665 -11623 7651 14412 -14219 -13169 21820
520 21820 23703 -1973 4110 18691 -3539 -18047 -87 -5897 -28718 -5467 27359 3309 -24937
533 -24937 4702 27182 -7329 -25795 4269 16988 4280 9612 13469 -3879 -5035 7974 -12437
$$ packed form
440a1773k663J9723l698j7923J2810J5852j4769m720K3120L526k3188k61J8625
453A4661q596j9311P530R579n066N907R089j0704p303J3904q04k9487q165K3378
467e388L834j4225O521J3541J473N388M222j5526p025K6125Q913l2734p480L3155
481B0794j860l9297p054J7118p924p936K1193R183r105K1664K4781k9062l1033
494a8538K0408J1747l1054r266L4423J5649j2093M466M235j8780j1164N32j4139
507b3574q570J8365J2952n625R897J7839j5619j7288J9274O761k8631J050L4989
520B1820J883k5676O083J4581k2230j4508J7960n810k2821K3251L2826k4050k8246
533b4937K9639K2480l4511j8466L0064J2719j2708N332L857j7348j156J3009k0411
$$ plain form
546 -12437 -38151 -12926 17509 975 -9930 13008 18341 3149 3782 1029 -17877 -8340 20845
559 20845 3199 -27137 1883 31326 -5371 -29686 8383 23285 -8136 -3556 29873 13854
571 13854 -16507 2007 10219 -27006 -33217 1699 5358 -12962 5045 24243 871 -13224 3434
584 3434 -7309 -33867 -14255 17249 9806 3647 26471 31587 10121 4200 4257 -14602 -14319 11165
598 11165 6138 -17189 -163 23413 -2741 -33751 -17832 -3506 -20253 -16377 8675 6068 62
611 62 22476 23665 -11944 -16250 17239 13090 -19434 -5604 28360 17821 -4947 -63 -98 -14829
625 -14829 -11388 -3264 -12695 -7420 21215 21169 -3433 1478 14396 -5755 -21433 -6185 -1289 -12833
639 -12833 -1262 16076 1208 -10981 6465 6947 -15008 -11000 8266 2292 -5764 10711 15224
$$ packed form
546a2437k5714K5225L0435j6534j0905K2938N333j5192O33k753j8906R537K9185
559B0845j7646l0336K9020K9443l6697k4315L8069J4902l1421M580L3429j6019
571A3854l0361J8514Q212l7225o211L4916L659j8320J8007J9198k3372j4095J6658
584C434j0743k6558J9612L1504p443o159K2824N116k1466n921N7j8859K83K5484
598A1165n027k3327J7026K3576k6154l1010J5919J4326j6747L876K5052k607o006
611F2K2414J189l5609m306L3489m149l2524J3830L3964j0539k2768M884l5j4731
625a4829L441Q124r431N275K8635m6k4602M911J2918k0151j5678J5248M896j1544
639a2833J1571J7338j4868j2189J7446M82k1955M008J9266n974q056J6475M513
$$ plain form
652 15224 -5006 -4642 13706 4031 -12679 2507 17563 3709 -4831 6101 3554 -12587 -8677
665 -8677 -104 -10413 -11316 8505 10225 -6299 -4515 6366 -2864 -14771 -4754 1302 -4772 3736
679 3736 14954 3493 -3880 10944 11136 -10246 -9707 11362 8987 -6215 1566 11666 209 -5989
693 -5989 1334 -3446 -11141 -1796 5856 -4838 -6526 7444 4132 -11550 -7507 2521 -3896 -8181
707 -8181 3610 8305 142 2573 10419 2407 -6645 686 4115 -4363 -3360 5599 4179 -1630 2225
722 2225 4382 -3043 -2690 4712 820 -5185 1671 5808 -2743 -6819 -346 -941 -7898 -5261 1673 -852
738 -852 -1931 3811 3816 -589 558 4347 304 -3259 1375 3223 -1423 -624 2088 -454 -2140 914
754 914 2427 -632 687 6060 4601 -949 857 2708 -1669 -4817 -3354 -2421 -2806 -1626 -264 -1618
$$ packed form
652A5224k0230L64J8348r675j6710J5186J5056j3854q540J0932k547j6141L910
665h677Q573j0309r03J9821J720j6524J784J0881r230j1907J0017O056o074Q508
679C736J1218j1461p373J4824J92k1382N39K1069k375j5202P781J0100j1457o198
693e989P323m780p695R345P652j0694j688J3970l312j5682M043J0028o417m285
707h181J1791M695q163K431P846q012r052P331L429q478J003Q959j420n809L855
722B225K157p425L53P402l892o005O856M137q551m076O473n95o957K637O934k525
738h52j079N742Nm405J147L789m043l563M634J848m646P99K712k542j686L054
754I14J513l059J319N373j459n550J806J851m377l148J463R33l85J180J362j354
$$ plain form
770 -1618 -1221 1541 -492 -3697 -1220 1060 -558 -1519 1188 2680 280 44 2026 382 -1030 1087
786 1087 3089 3354 3958 4695 5338 3619 1618 -979 -3960 -4241 -4681 -6544 -5955 -2475 -147 299 301 1463
804 1463 2082 -88 -2150 -3163 -3500 -2882 -2065 -1770 672 2999 4756 4977 4562 5413 5506 4333 3361 1737
822 1737 969 355 -1259 -2970 -4462 -4444 -3285 -4260 -4360 -1342 261 175 -806 -838 -336 -1857 -3632 -3801
840 -3801 -2967 -1055 1477 1845 3204 5560 6427 4868 2629 2478 3303 1178 -128 1736 2056 1970 1135
857 1135 -229 -2086 -3396 -4793 -5426 -6752 -5203 -2384 -1375 16 770 453 -358 -836 -2505 -4243
873 -4243 -4161 -383 1928 2066 4927 8682 9386 8658 6828 4630 2149 335 -1361 -4583 -5920 -3075
889 -3075 -2974 -4969 -4408 -2260 -1504 -1995 -2097 -1921 -2131 -143 1948 -1546 -2461 1997 2855 -947 -980 2982
$$ packed form
770a618L97K762k033l205K477K280j618r61K707J492k400k36J982j644j412K117
786A087K002K65O04P37O43j719k001k597k981k81m40j863N89L480K328M46KJ162
804A463O19k170k062j013l37O18Q17K95K442K327J757K21m15Q51R3j173r72j624
822A737p68o14j614j711j492J8J159r75j00L018J603q6r81l2N02j521j775j69
840c801Q34J912K532L68J359K356Q67j559k239j51Q25k125j306J864L20q6q35
857A135j364j857j310j397o33j326J549K819J009J391P54l17q11m78j669j738
873d243Q2L778K311J38K861L755P04p28j830k198k481j814j696l222j337K845
889c075J01j995N61K148P56m91j02J76k10J988K091l494r15M458Q58l802l3L962
$$ plain form
907 2982 3531 1872 3582 5074 1890 2047 4033 -737 -5066 -2209 749 -2445 -2914 3467 4538 1282
923 1282 3149 3233 -3761 -6237 -3194 -5011 -9423 -4824 2575 296 -1426 3242 2085 -4541 -1970 2545
939 2545 -2635 -3676 7260 12041 4198 3104 11042 7428 -3701 -3124 75 -5655 -6562 386 -452
954 -452 -6373 -1774 5052 -3633 -9936 -1019 3518 -3279 -2423 4495 2525 -1438 2005 1206 -5876 -2186
970 -2186 6352 1398 -3034 6054 8906 -734 -2552 3951 -418 -7079 950 5968 -2763 -2456 7736
985 7736 2856 -8318 -3662 3295 -4513 -7726 2784 4527 -4126 -254 7033 -293 -6680 683 3999
1000 3999 -2654 -2676 3502 443 -4157 126 -1243 -7550 -1829 7121 2925 138 9421 11258 -494
1015 -494 -3368 1143 -4328 -7918 2750 5989 -1381 2769 12439 2580 -12302 -6811 -521 -11979
$$ packed form
907B982N49j659J710J492l184J57J986m770m329K857K958l194m69O381J071l256
923A282J867Q4o994k476L043j817m412M599P399k279j722M668j157o626K571M515
939B545n180j041J0936M781p843j094P938l614j1129N77L199n730r07O948q38
954d52n921M599O826q685o303Q917M537o797Q56O918j970l963L443p99p082L690
970b186Q538m954m432R088K852r640j818O503m369o661Q029N018q731L07J0192
985G736m880j1174M656O957p808l213J0510J743q653L872P287p326o387P363L316
1000C999o653k2O178l059m600M283j369o307N721Q950m196k787R283J837j1752
1015d94k874M511n471l590J0668L239p370M150R670r859j4882N491O290j1458
$$ plain form
1029 -11979 -15170 -538 2983 -4308 247 7064 -926 -5885 4524 6690 -2488 3689 16126 9897
1043 9897 1004 6256 4909 -8238 -9094 -715 -4486 -8130 5333 9673 -2348 -1899 6579 -3551
1057 -3551 -14428 -3576 2760 -7899 -5551 10523 4703 -10273 -2424 5499 -7349 -10571 6030
1070 6030 9702 605 7259 16617 4560 -5413 3953 3301 -10997 -7002 8030 5005 -3763 4431
1084 4431 9252 -3061 -7269 94 -4154 -11327 -1961 3542 -6243 -8623 1230 -2415 -13785 -6119
1098 -6119 5945 1663 1332 14594 14865 3212 4562 8991 -2613 -10120 1779 5521 -3775 379
1112 379 11853 4756 -5382 452 2295 -8334 -8775 1061 -2467 -9485 -2855 114 -9961 -11426
1126 -11426 -2605 -3649 -6706 4079 12659 7579 7051 14443 9344 -1584 771 3395 -3244 -3650 4960
$$ packed form
1029a1979l191J4632L521p291M555O817p990m959J0409K166r178O177J2437o229
1043I897q893N252j347j3147q56Q379l771l644J3463M340j2021M49Q478j0130
1057c551j0877J0852O336j0659K348J6074n820j4976P849P923j2848l222J6601
1070F030L672r097O654R358j2057r973R366o52j4298L995J5032l025q768Q194
1084D431M821j2313m208P363m248p173R366N503r785k380R853l645j1370P666
1098f119J2064m282l31J3262K71j1653J350M429j1604p507J1899L742r296M154
1112C79J1474p097j0138N834J843j0629m41R836l528p018O630K969j0075j465
1126a1426Q821j044l057J0785Q580n080n28P392n099j0928K355K624o639m06Q610
$$ plain form
1141 4960 4506 -1997 2220 5636 -3755 -7489 416 -153 -7356 -3573 2302 -4300 -10172 -4770 -4868 -12178
1157 -12178 -7507 2964 1406 846 10545 14045 5553 4446 9376 3809 -4194 1348 5242 -1585 -1634
1172 -1634 5540 2409 -5209 -1071 2983 -3935 -5874 2707 1635 -7066 -4970 -1101 -8676 -13139 -5510
1187 -5510 -2481 -6539 -847 9643 7148 3511 10261 10703 1357 680 6815 2615 -3635 1719 5561
1202 5561 -2232 -3689 2980 619 -5133 -453 3961 -1093 -3750 860 -773 -8440 -8393 -4815 -8457
1217 -8457 -9467 -2604 1838 941 4292 9934 8228 4560 6319 6973 1339 -240 1859 490 -2618
1232 -2618 -1198 852 -1461 -1877 1145 1622 -1222 305 1877 -1247 -3748 -3074 -4094 -6964 -6453 -4002
1248 -4002 -4120 -3209 913 3188 2994 4300 6523 5617 4159 3924 3141 1060 31 80 -1316 -1943 -341
$$ packed form
1141D960m54o503M217L416r391l734P905n69p203L783N875o602n872N402r8p310
1157a2178M671J0471j558n60R699L500q492j107M930n567q003N542L894o827m9
1172a634P174l131p618M138M054o918j939Q581j072q701K096L869p575m463P629
1187e510L029m058N692J0490k495l637O750M42r346o77O135m200o250N354L842
1202E561p793j457O669k361n752M680M414n054k657M610j633p667M7L578l642
1217h457j010O863M442q97L351N642j706l668J759O54n634j579K099j369l108
1232b618J420K050k313m16L022M77k844J527J572l124k501O74j020k870N11K451
1248d002j18R11M122K275j94J306K223r06j458k35p83k081j029M9j396o27J602
$$ plain form
1265 -341 -52 -279 912 1214 677 -375 -534 -1784 -4128 -4424 -3911 -5098 -4990 -2920 -1602 -857 1168
1282 1168 3736 4299 4574 6135 5857 3756 3104 2592 -223 -2523 -2490 -2314 -3492 -2969 -561 514 420 1916
1300 1916 2379 1143 -231 -850 -2162 -3939 -3984 -2826 -3020 -2262 -131 1530 2109 3054 4032 3855 2980 2641
1318 2641 2429 519 -526 -540 -1549 -2254 -1904 -1343 -1245 -955 534 1467 952 1007 1305 -99 -1146 -1426 -1920
1337 -1920 -2605 -2634 -1558 -542 -258 1075 2873 2856 2564 2715 2519 1378 472 116 -589 -1787 -2077 -1677
1355 -1677 -1760 -1888 -1483 -543 -92 353 870 1421 1290 1189 412 -605 -649 -1138 -1845 -1222 -372 172 1103 2210
1375 2210 2705 2472 2259 1993 532 -1222 -1597 -1940 -2822 -2981 -2080 -1200 -1104 -504 648 397 486 1731 1201
1394 1201 375 730 868 309 -450 284 30 -593 602 1571 686 746 2412 1842 -223 -554 329 -1530 -2977
$$ packed form
1265c41K89k27J191L02n37j052j59j250k344k96N13j187J08K070J318P45K025
1282A168K568N63K75J561k78k101o52n12k815k300L3J76j178N23K408J075r4J496
1300A916M63j236j374o19j312j777m5J158j94P58K131J661N79R45R78j77q75l39
1318B641k12j910j045j4j009p05L50N61R8K90J489R33n15N5K98j404j047k80m94
1337a920o85k9J076J016K84J333J798j7k92J51j96j141r06l56p05j198k90M00
1355a677q3j28M05R40M51M45N17N51j31j01p77j017m4m89p07O23Q50N44R31J107
1375B210M95k33k13k66j461j754l75l43q82j59R01Q80R6O00J152k51Q9J245n30
1394A201q26L55J38n59p59P34k54o23J195R69q85O0J666n70k065l31Q83j859j447
$$ plain form
1413 -2977 -1568 -1330 -2707 -1930 58 -536 -1492 500 1564 380 -11 2146 1857 -109 789 1436 -300
1430 -300 -576 845 735 -921 573 2583 171 -958 979 427 -1781 -850 732 -804 -2133 -19
1446 -19 294 -2929 -2651 415 -1126 -2676 867 2722 493 502 2642 1612 -1641 -44 2066 -689 -579
1463 -579 3148 2650 -438 834 2277 -1081 -2939 133 -313 -3355 -669 2384 -1095 -2777 521 -412
1479 -412 -4286 -2336 1532 -361 -1456 3226 3950 -1074 -96 3175 -125 -3160 1466 3867 -218 -125
1495 -125 4439 1746 -3343 -1048 389 -3930 -3538 1435 1456 -1925 585 3339 -1605 -3788 34 -448
1511 -448 -3684 -917 3439 661 -1112 3008 2476 -2982 -1932 2662 -22 -2165 3486 5008 -768
1526 -768 -1298 2366 -1602 -6608 -1484 2307 -1661 -1155 5257 3067 -2761 -118 2174 -3419 -4667 1957
$$ packed form
1413b977J409K38j377P77J988n94r56J992J064j184l91K157k89j966Q98O47j736
1430c00k76J421j10j656J494K010k412j129J937n52k208R31J582j536j329K114
1446a9L13l223K78L066j541j550L543J855k229RK140j030l253J597K110k755J10
1463e79L727m98l088J272J443l358j858L072m46l042K686L053l479j682L298r33
1479d12l874J950L868j893j095M682P24n024R78L271l300l035M626K401m085R3
1495a25M564k693n089K295J437m319L92M973K1l381K510K754m944k183L822m82
1511d48l236K767M356k778j773M120n32n458J050M594k684k143N651J522n776
1526g68n30L664l968n006N124L791l968N06O412k190n828K643K292n593j248O624
$$ plain form
1542 1957 2018 -2326 612 4525 -768 -4042 357 369 -3837 -412 5102 1766 -602 3903 3070 -3813
1558 -3813 -3321 818 -2158 -4314 1999 4786 -127 458 4542 349 -5030 -921 1707 -2870 -2272 3804
1574 3804 2631 -2998 -552 1771 -3808 -5177 1043 1979 -1475 2151 6111 905 -2513 594 -171
1589 -171 -5537 -3069 2699 550 -1002 4512 4926 -997 -1324 2457 -959 -4179 891 3725 -1037 -1020
1605 -1020 3419 -239 -6054 -2773 525 -3416 -2870 4380 4100 -843 1458 3228 -2889 -5181 101
1620 101 323 -3401 405 5570 1820 -1150 3141 2682 -3166 -1400 3152 810 -1655 2566 3497 -2673
1636 -2673 -2839 315 -2929 -5679 -800 2077 -803 -297 4195 1652 -3019 -1029 745 -3222 -3399 1744
1652 1744 2342 -398 1577 4646 742 -2000 1655 2270 -1439 302 4220 1526 -1660 494 578 -4359
$$ packed form
1542A957O1m344K938L913n293l274M399J2m206L425N514l336k368M505q33o883
1558c813M92M139k976k156O313K787m913N85M084m193n379M109K628m577N98O076
1574C804j173n629K446K323n579j369O220R36l454L626L960n206l418L107p65
1589a71n366K468N768k149j552N514M14n923l27L781l416l220N070K834m762J7
1605a020M439l658n815L281L298l941N46P250k80m943K301J770o117k292N282
1620A01K22l724L806N165l750k970M291m59n848J766M552k342k465M221R31o170
1636b673j66L154l244k750M879K877k880N06M492k543m671J990J774l967j77N143
1652A744N98k740J975L069l904k742L655O15l709J741L918k694l186K154Q4m937
$$ plain form
1668 -4359 -4457 -479 -1360 -3326 808 2880 -605 -1266 1719 -466 -3618 -930 1527 -761 -729 3217
1684 3217 2506 -697 1238 2870 -254 -959 2507 2817 -158 1018 2600 -673 -2888 -1020 -1371 -3727
1700 -3727 -2026 912 5 -1536 808 1092 -2018 -1918 441 -938 -1923 926 2130 20 177 2412
1716 2412 1326 -694 1338 2491 410 693 2831 1760 -406 -47 525 -1835 -2886 -768 -556 -2095
1732 -2095 -786 876 -745 -1806 182 191 -1821 -1253 813 135 -807 625 1484 -291 -210 1263 838
1749 838 113 1435 2250 808 306 1885 794 -1124 -684 68 -1121 -1673 -156 -75 -1316 -776 128 -960
1767 -960 -1465 -145 -102 -1016 -623 744 229 -555 606 958 134 220 1162 1199 741 886 1129 384 -111 479
1787 479 149 -632 -276 -31 -814 -440 -357 -477 -785 -1004 -450 -410 -866 -321 74 -425 -329 83 143 -173 27
$$ packed form
1668d359r8L978q81j966M134K072l485o61K985k185l152K688K457k288L2L946
1684C217p11l203J935J632l124p05L466L10k975J176J582l273k215J868l51k356
1700c727J701K938r07j541K344K84l110J00K359j379r85K849J204k110J57K235
1716B412j086k020K032J153k081K83K138j071k166L59N72k360j051K118K12j539
1732b095J309J662j621j061J988Rk012N68K066o78r42J432Q59j775Q1J473m25
1749H38p25J322Q15j442n02J579j091j918M40P52j189n52J517Q1j241N40R04j088
1767i60n05J320M3r14L93J367n15p84J161L52q24Q6R42L7m58J45K43p45m95N90
1787D79l30p81L56K45p83L74Q3j20l08k19N54M0m56N45L95m99R6M12O0l16K00
$$ plain form
1808 27 706 361 377 432 636 714 895 408 275 592 144 262 157 48 -267 -334 -342 -646 -787 -326 -609 -876
1830 -876 -425 -234 -158 -43 -229 -75 -30 -305 -3 176 73 295 306 596 778 551 583 353 484 574 488 215
1852 215 502 239 179 -85 -254 -107 -414 -585 -376 -464 -488 -140 -338 -539 -416 -307 19 -821 -417 71 -94
1873 -94 -344 185 783 600 408 1116 1213 959 598 955 783 -21 407 205 -469 -683 -132 -382 -887 -671 -226
1894 -226 -603 -670 -177 -202 -872 -398 -65 -661 -809 89 201 -197 523 914 472 471 1312 803 139 320 929
1915 929 323 -269 402 641 -574 -169 106 24 -1043 -308 -61 -720 -554 -227 -759 -1296 -774 -439 -981 -781
1935 -781 355 454 -71 838 1425 645 435 1300 1065 258 816 1612 208 -241 503 339 -1448 -710 598
1954 598 -533 -963 278 416 -923 -1132 -35 -1366 -2364 -884 288 -772 -262 1249 707 -392 654
$$ packed form
1808B7O79l45J6N5K04P8J81m87j33L17m48J18j05j09l15o7ql04j41M61k83k67
1830h76M51J91P6J15j86J54M5k75L02J79j03K22J1K90J82k27L2k30J31R0q6k73
1852B15K87k63o0k64j69J47l07j71K09q8k4L48j98k01J23J09L26q40M04M88j65
1873i4k50N29N98j83j92P08R7k54l61L57j72q04M28k02o74k14N51k50n05K16M45
1894b26l77o7M93k5o70M74L33n96j48Q98J12l98P20L91m42jQ41n09o64J81O09
1915I29o06n92O71K39j215M05K75q2j067P35K47o59J66L27n32n37N22L35n42K00
1935g81J136R9n25R09N87p80k10Q65k35q07N58P96j404m49P44j64j787P38J308
1954E98j131m30J241J38j339k09J097j331r98J480J172j060N10J511n42j099J046
$$ plain form
1971 654 1370 270 14 1917 1565 -55 1143 1482 -531 -1065 348 106 -1511 -178 1284 -408 -1052
1988 -1052 416 319 -2499 -1778 -96 -1196 -1969 492 1433 -464 -290 1458 330 -1205 656 1696
2004 1696 300 292 2663 1516 -235 277 964 -1198 -1636 944 679 -779 682 2065 -426 -1755 -130
2021 -130 -501 -2783 -1402 950 -26 -1058 1298 1096 -1577 -1239 989 -303 -1471 1400 2777 554
2037 554 445 2294 338 -2019 -674 1097 -1071 -767 2463 1725 -873 401 873 -2319 -2809 187
2053 187 -124 -2033 -179 2096 -647 -1870 443 -168 -2492 -931 1814 880 -111 2510 2549 -931 -912
2070 -912 958 -620 -2271 672 1995 47 169 2269 701 -2247 -787 503 -1890 -1741 1441 1337
2086 1337 -936 65 1560 -1422 -3047 -237 111 -1459 109 2693 898 -874 1357 924 -1898
$$ packed form
1971F54P16j100k56J903l52j620J198L39k013n34J413k42j617J333J462j692o44
1988a052J468r7k818P21J682j100p73K461R41j897J74J748j128j535J861J040
2004A696j396qK371j147j751N12O87k162m38K580k65j458J461J383k491j329J625
2021a30l71k282J381K352r76j032K356k02k673L38K228j292j168K871J377k223
2037E54j09J849j956k357J345J771k168L04L230p38k598J274M72l192m90K996
2053A87l11j909J854K275k743j223K313o11k324J561K745r34r91K621L9l480J9
2070i12J870j578j651K943J323j948J22K100j568k948J460J290k393J49L182j04
2086A337k273J001J495k982j625K810L48j570J568K584j795j772K231m33k822
$$ plain form
2101 -1898 -1037 1630 670 -613 2324 2726 65 -200 1241 -945 -2971 -543 1115 -1054 -791 2244
2117 2244 546 -2377 -916 -50 -1812 -1945 1044 1457 -246 1146 2384 -441 -1783 116 112 -1533
2133 -1533 18 2223 840 -379 1406 1146 -1745 -1042 900 -262 -956 1633 2224 6 -335 975
2149 975 -858 -2934 -1036 523 -1549 -1101 1154 597 -1566 -428 849 -1263 -1755 1005 1440 113
2165 113 871 2517 357 -824 470 167 -1578 -350 1656 590 -438 1297 1139 -1212 -1108 537
2181 537 -901 -1829 207 843 -862 -1138 280 -619 -2251 -687 634 -684 -546 1788 1462 248 833
2198 833 1444 -90 -826 1084 764 -394 505 1788 389 -770 366 59 -1678 -1339 -247 -674 -1638
2215 -1638 -140 113 -1052 -1174 114 36 -813 549 1415 884 379 1354 733 -577 -73 470 -101 -617
$$ packed form
2101a898Q61K667r60j283K937M02k661k65J441k186k026K428J658k169K63L035
2117B244j698k923J461Q66j762j33K989M13j703J392J238k825j342J899mj645
2133a533J551K205j383j219J785k60k891P03J942j162o94K589N91k218l41J310
2149I75j833k076J898J559k072M48K255n57k163J138J277k112m92K760M35j327
2165A13P58J646k160j181J294l03j745J228K006j066j028J735j58k351J04J645
2181E37j438r28K036O36j705k76J418q99j632J564J321j318J38K334l26j214N85
2198H33O11j534p36J910l20j158Q99J283j399j159J136l07j737L39J092m27r64
2215a638J498K53j165j22J288p8q49J362Q66n31n05R75o21j310N04N43n71n16
$$ plain form
2233 -617 618 795 -138 661 1414 314 -143 458 550 -530 -565 126 -875 -1463 -927 -672 -1733 -1312 81
2252 81 -293 -263 552 1094 362 552 782 650 -56 395 781 360 630 1016 450 192 530 531 4 -273 -97
2273 -97 -294 -1011 -1000 -666 -1095 -1449 -1193 -758 -623 68 576 611 323 801 779 427 15 411 277 -305 189
2294 189 401 153 150 472 725 455 420 333 -201 -458 -566 -676 -1144 -1207 -941 -1030 -864 -322 157 173 633 692 736
2317 736 798 804 521 48 49 263 -102 -376 81 268 238 257 520 477 273 262 -143 -506 -764 -859 -1086 -1377 -1118
2340 -1118 -631 -353 -292 281 530 452 690 899 580 243 140 70 -133 -221 -83 -122 53 50 247 669 483 675
2362 675 361 513 -454 -512 -636 -1138 -949 -774 -641 -515 -277 217 533 628 862 761 645 707 392 -234 -3
2383 -3 -121 -863 -328 -409 -154 15 256 276 314 280 399 -159 -478 -193 -481 -952 -699 -423 -369 -24 263 333 316
$$ packed form
2233f17J235J77r33P99P53j100m57O01R2j080l5O91j001n88N36K55j061M21J393
2252H1l74L0Q15N42p32J90K30j32p06M51L86m21K70L86n66k58L38Jn27k77J76
2273i7j97p17J1L34m29l54K56M35J35O91N08L5k88M78k2l52m12L96j34n82M94
2294A89K12k48lL22K53k70l5q7n34k57j08j10m68o3K66q9J66N42M79J6M60N9M4
2317G36O2Ok83m73JK14l65k74M57J87l0J9K63m3k04j1m05l63k58r5k27k91K59
2340a118M87K78O1N73K49p8K38K09l19l37j03p0k03q8J38l9J75lJ97M22j86J92
2362F75l14J52r67n8j24n02J89J75J33J26K38M94L16R5K34j01j16O2l15o26K31
2383cj18p42N35q1K55J69K41K0L8l4J19n58l19K85k88m71K53K76N4L45K87P0j7
$$ plain form
2406 316 710 715 579 350 230 374 -808 -646 -448 -879 -558 -125 232 25 -52 542 447 228 -30 357 -231
2427 -231 -592 -478 -277 -687 -604 40 -33 94 521 927 651 656 829 812 -264 -47 -109 -762 -910 -375 -307 -742
2449 -742 -205 278 -99 -67 188 148 -467 -391 321 -127 -647 195 151 -501 -195 482 453 12 1175 1195 479 242
2471 242 604 267 -826 -696 -417 -763 -805 -74 -278 -785 114 216 -466 -359 353 543 -377 135 715 -328
2491 -328 -516 212 134 -364 -53 1124 831 438 1104 1147 -455 -667 -5 -411 -1474 -346 524 -443 -666
2510 -666 379 -105 -1037 -381 400 -361 -212 810 771 -668 -18 504 -726 -839 355 978 -120 735
2528 735 2162 856 100 764 462 -1182 -1111 247 -728 -1104 290 122 -760 -1155 68 -625 -1047 3
2546 3 982 107 480 1453 613 -576 -100 520 -475 -417 1030 980 -108 464 1066 -651 -1187 132 -133 -1048
$$ packed form
2406C16L94Nj36k29j20J44j182J62J98m31L21M33L57k07p7N94r5k19k58L87n88
2427b31l61J14K01m10Q3O44p3J27M27M06k76NJ73j7j076K17o2o53j48N35O8m35
2449g42N37M83l77L2K55m0o15P6P12m48n20Q42m4o52L06O77k9m41J163K0p16k37
2471B42L62l37j093J30K79l46m2P31k04n07Q99J02o82J07P12J90r20N12N80j043
2491c28j88P28p8m98L11J177k93l93O66M3j602k12O62m06j063J128Q70r67k23
2510f66J045m84r32O56P81p61J49J022l9j439O50N22j230j13J194O23j098Q55
2528G35J427j306p56O64l02j644P1J358r75l76J394j68q82l95J223o93m22J050
2546CR79q75L73R73q40j189M76O20r95N8J447n0j088N72O02j717n36J319k65r15
$$ plain form
2566 -1048 -329 1072 82 -666 315 176 -1164 -846 548 25 -587 644 1052 -399 -623 534 -155 -1194
2584 -1194 -122 1079 48 257 1487 818 -621 -133 518 -582 -1008 552 549 -507 144 639 -329 -1445
2602 -1445 -144 -334 -1238 -388 1110 364 -512 880 726 -903 -1082 422 -236 -911 541 1356 -106
2619 -106 -333 867 274 -1054 58 1119 8 -52 1288 955 -374 -296 588 -1258 -1601 -417 -52 -1161
2637 -1161 129 928 -356 -1117 -38 426 -568 -117 1348 1011 199 908 1221 -306 -757 -19 -307 -1312
2655 -1312 23 869 -328 -85 542 357 -903 -64 319 -391 -414 911 774 -220 65 753 -409 -910
2673 -910 28 -88 -868 -557 490 -189 -673 160 98 -765 -406 649 324 40 993 1340 371 -58 293 143
2693 143 -927 -373 165 -541 -552 74 29 -762 -402 -55 -525 -521 413 556 -146 11 601 -134 -719 10 352
$$ packed form
2566a048P19J401r90p48R81j39j340L18J394n23o12J231M08j451k24J157o89j039
2584a194J072J201j031K09J230o69j439M88O51j100m26J560lj056O51M95r68j116
2602a445J301j90r04Q50J498p46q76J392j54j629j79J504o58o75J452Q15j462
2619a06k27J200n93j328J112J061j111o0J340l33j329P8Q84j846l43J184L65j109
2637a161J290P99j284p61J079M64r94M51J465l37q12P09L13j527m51P38k88j005
2655a312J335Q46j197K43O27j85j260Q39L83p10k3J325j37r94K85O88j162n01
2673i10R38j16p80L11J047o79m84Q33o2q63L59J055l25k84R53L47r69m29L51j50
2693A43j070N54N38p06j1O26m5p91L60L47m70MR34J43p02J57N90p35n85P29L42
$$ plain form
2714 352 -207 -129 857 718 104 437 574 -164 -273 633 262 -34 312 325 -569 -772 -202 -322 -866 -234 233
2735 233 -120 3 523 189 -421 -158 71 -497 -544 226 840 14 187 980 345 70 413 168 43 -17 169
2756 169 85 -193 1 227 -405 -189 139 65 -313 65 163 -194 -384 -388 -232 -739 -374 -115 -326 -215 464 341
2778 341 351 583 744 630 371 505 546 188 174 365 175 -425 -356 -258 -703 -448 -273 -272 -386 -128 -126 87 -327
2801 -327 -247 -72 -233 175 255 2 40 314 367 288 664 528 604 118 254 146 -241 -288 -26 -394 65 -100
2823 -100 -122 59 -141 -167 -200 -179 -378 -240 -401 -439 -161 -288 -316 163 310 211 201 383 333 382 479 420 453 223
2847 223 54 180 240 -196 -37 -121 -78 -244 -196 -314 -123 -272 -359 -728 -380 -122 -253 -256 -42 -132 -18 342 173
2870 173 283 168 252 220 95 -45 212 103 93 127 -197 -27 -88 -45 -283 -340 -50 -121 -239 51 -25 -182 -157
$$ packed form
2714C52n59P8R86j39o14L33J37p38j09R06l71k96L46J3q94k03N70j20n44O32M67
2735B33l53J23N20l34o10K63K29n68m7P70O14q26J73P93o35k75L43k45j25o0J86
2756A69q4k78J94K26o32K16L28p4l78L78R8l57j90mJ56n07L65K59k11J11O79j23
2778C41J0K32J61j14k59J34M1l58j4J91j90o00O9R8m45K55J75Jj14K58KK13m14
2801c27Q0J75j61M08Q0k53L8K74N3p9L76j36P6m86J36j08l87m7K62l68M59j65
2823a00k2J81k00k6l3K1j99J38j61l8K78j27k8M79J47r9j0J82n0M9R7n9L3k30
2847B23j69J26O0m36J59q4M3j66M8j18J91j49q7l69L48K58j31lK14r0J14L60j69
2870A73J10j15Q4l2j25j40K57j09j0L4l24J70o1M3k38n7K90p1j18K90p6j57K5
$$ plain form
2893 -157 -253 17 -474 -83 -244 103 33 214 247 473 357 93 -54 -14 172 -34 202 -7 -27 164 -38 -171
2915 -171 -31 -42 -265 -110 -83 -232 -328 -178 -326 -546 -298 -59 -520 -239 -39 11 146 239 86 196 -26 392
2937 392 236 11 -2 244 314 -9 37 -118 -260 -59 237 -97 -37 137 51 -467 -63 37 -298 -484 78 8
2959 8 2 -119 177 -344 -43 52 -211 -244 7 188 126 -74 377 364 131 58 608 58 -74 144 502 104 -47
2982 -47 106 -124 -539 -382 -4 -390 -440 145 116 72 61 214 -138 -456 319 170 -152 137 648 415 -48 173
3004 173 152 -268 -313 183 34 -345 99 454 179 225 500 193 -247 -197 -18 -231 -412 221 -103 -498 -171
3025 -171 -160 -114 -324 591 197 -71 359 412 69 -349 402 384 -189 39 654 63 -315 326 479 -456 -447 345
3047 345 113 -433 220 715 19 -400 275 -327 -1025 -357 3 -465 -324 74 261 -650 -153 458 -118 -385
$$ packed form
2893a57r6K70m91L91j61L47p0J81L3K26j16k64j47M0J86k06K36k09k0J91k02j33
2915a71J40j1k23J55K7j49r6J50j48k20K48K39m61K81K00N0J35R3j53J10k22M18
2937C92j56k25j3K46P0l23M6j55j42K01K96l34O0J74q6n18M04J00l35j86N62p0
2959Hoj21K96n21L01R5k63l3K51J81o2k00M51j3k33p3N50n50j32K18L58l98j51
2982d7J53k30m15J57L78l86n0N85k9m4j1J53l52l18P75j49l22K89N11k33m63K21
3004A73k1m20m5M96j49l79M44L55k75M6K75l07m40N0J79k13j81O33l24l95L27
3025a71J1M6k10R15l94k68M30N3l43m18P51j8n73K28O15n91l78O41J53r35RP92
3047C45k32n46O53M95o96m19O75o02o98O68L60m68J41L98J87r11M97O11n76k67
$$ plain form
3067 -385 547 974 434 605 925 384 -453 105 249 -676 -544 556 191 -441 -108 -55 -1109 -1203 -494 -369
3087 -369 -530 86 910 285 349 719 169 -473 -229 335 -255 -448 733 666 -247 102 140 -346 -987 -69 171
3108 171 -278 246 659 302 -455 103 214 -831 -405 103 100 -396 -20 -47 -390 -411 181 -14 -524 66 686
3129 686 261 -176 573 404 -307 -1 499 -36 -572 361 500 -189 74 381 -110 -800 -9 103 -589 -321
3149 -321 384 -18 -387 -59 249 -524 -430 335 79 -239 313 707 -32 -210 528 108 -182 192 1013 198
3169 198 344 427 129 -319 -591 -110 -551 -811 -41 161 -191 56 432 129 -681 250 62 -126 -58 672 421
3190 421 99 148 58 -205 -558 99 -178 -329 -73 399 21 -138 62 98 -370 -58 439 -28 -100 298 351 -216
3212 -216 -236 140 -100 -607 -48 385 -329 19 348 100 -415 292 126 -281 -148 234 396 89 423 328 71
$$ packed form
3067c85R32M27n40J71L20n41q37N58J44r25J32J100l65o32L33N3j054r4P09J25
3087c69j61O16Q24o25O4L70n50o42K44N64n90j93J181o7r13L49L8m86o41R18K40
3108A71m49N24M13l57p57N58J11j045M26N08lm96L76k7l43k1N92j95n10N90O20
3129F86m25m37P49j69p11L06N00n35n36R33J39o89K63L07m91o90P91J12o92K68
3149c21P05m02l69L28L08p73R4P65k56l18N52L94p39j78P38m20k90L74Q21q15
3169A98J46Q3k98m48k72M81m41k60P70K02l52K47L76l03q10R31j88j88O8P30k51
3190D21l22M9r0k63l53O57k77j51K56M72l78j59K00L6m68L12M97m67p2L98N3n67
3212b16k0L76k40n07N59M33p14L48L29k48n15P07j66m07J33L82J62l07L34r5k57
$$ plain form
3233 71 66 177 -23 -364 -118 -240 -311 -431 104 -326 148 53 66 -242 1 17 30 -224 -269 82 -74 -231 101
3256 101 200 -109 -89 337 289 -323 99 -66 -67 22 276 109 28 25 163 -132 -29 -82 -287 -94 -237 -146 -233 -155
3280 -155 277 -28 -218 -123 4 99 -36 156 -27 12 -45 196 322 -26 47 159 -92 69 551 -302 202 19
3302 19 -160 106 -292 21 -34 -198 -313 130 -187 -244 5 -174 -291 -150 -58 -1 -108 190 300 140 290 225
3324 225 53 -82 189 104 14 18 232 188 166 -55 62 -19 -164 -83 -1 -83 -94 12 -208 -119 -83 200 -54 31 88
3349 88 -142 -153 90 -139 69 -44 2 176 12 271 70 176 312 314 113 79 -188 33 -6 -184 46 -274
3371 -274 -56 -46 -333 -84 -73 -180 -99 -181 115 115 62 -30 112 -183 -240 109 -134 450 173 282 146 164 288
3394 288 -85 -156 -127 36 -98 -85 -94 -143 -130 -132 93 -80 -190 133 30 175 -194 271 -7 23 -187 -233 -62 266
$$ packed form
3233G1nJ11k00l41K46j22p1j20N35m30M74r5J3l08K43J6J3k54m5L51j56j57L32
3256A01R9l09K0M26m8o12M22j65jQ9K54j67q1lJ38k95J03n3k05J93j43R1q7P8
3280a55M32l05j90R5J27R5j35J92j83L9n7K41J26l48P3J12k51J61M82q53N04j83
3302A9j79K66l98L13n5j64j15M43l17n7K49j79j17J41R2N7j07K98J10j60J50o5
3324B25j72j35K71q5r0MK14m4k2k21J17q1j45Q1Q2q2j1J06k20Q9L6K83k54Q5N7
3349H8k30j1K43k29K08j13M6J74j64K59k01J06J36Kk01l4k67K21l9j78K30l20
3371b74K18J0k87K49J1j07Q1q2K96%n3r2J42k95n7L49k43N84k77J09j36J8J24
3394B88l73p1K9J63j34J3rm9J3kK25j73j10L23j03J45l69M65k78L0k10m6J71L28
$$ plain form
3418 266 5 80 363 118 29 365 47 -130 58 -89 -202 -161 -125 -27 92 94 161 -77 97 18 121 58 19 -44
3442 -44 -4 -254 -8 137 -27 188 67 -223 316 -2 -1 46 190 212 -223 -7 125 -47 -190 -133 -250 -28
3464 -28 -130 164 206 -4 133 128 -33 -4 21 -127 -128 23 77 -170 -177 189 149 -187 279 81 -335 -381 172 -33
3488 -33 -205 -230 -77 -349 -63 330 311 -38 345 746 63 -328 267 110 -261 -325 -187 -413 -437 -244 87 -291
3510 -291 -168 226 59 -238 193 95 -243 -26 78 -74 5 425 406 316 -221 -32 -191 -376 -159 180 -68
3531 -68 78 141 259 1 -7 57 -454 -411 220 -11 -88 76 480 32 -167 -231 37 -143 -126 -16 187 -208 348
3554 348 298 -54 -70 185 205 -10 385 299 63 -23 685 -13 -367 -230 -182 -364 -363 170 96 -187 125 295 -307
3577 -307 -369 89 -81 -414 -102 259 131 154 178 350 -319 161 514 385 160 290 345 -213 -309 17 -107 -306
$$ packed form
3418B66k61P5K83k45q9L36l18j77J88j47j13M1L6R8J19KO7k38J74p9J03o3l9o3
3442d4M0k50K46J45j64K15j21k90N39l18JM7J44K2m35K16J32j72j43N7j17K22
3464b8j02K94M2k10J37nj61K9K5j48jJ51N4k47pL66m0l36M66j98m16m6N53k05
3488c3j72k5J53k72K86L93j9l49L83M01o83l91N95j57l71o4J38k26k4J93L31l78
3510b91J23L94j67k97M31r8l38K17J04j52P9M20j9r0n37J89j59j85K17L39k48
3531f8J46O3J18k58qO4n11M3O31k31p7J64M04m48j99o4K68j80J7J10K03l95N56
3554C48n0l52j6K55K0k15L95q6k36q6P08o98l54J37M8j82JN33p4k83L12J70o02
3577c07o2M58j70l33L12L61j28K3K4J72o69M80L53j29k25J30N5n58r6L26j24j99
$$ plain form
3599 -306 2 353 -211 -274 44 -304 -401 -278 -22 -152 -86 434 618 90 252 514 -31 -185 -55 320 -150
3620 -150 153 427 309 -137 -35 -23 -561 -561 125 -97 -253 -57 270 -95 -192 344 208 -425 -150 352 -107
3641 -107 -400 206 -51 -326 -633 -17 -77 -195 389 408 445 538 505 160 -156 138 181 -647 -286 212 76 -360
3663 -360 184 44 -412 -244 -383 -209 -398 -20 161 -211 -145 437 158 -523 172 262 60 41 370 318 -13
3684 -13 -12 123 13 -183 32 -10 -144 34 151 -242 -413 -184 -105 -399 -358 150 215 -88 100 172 -281 -192 142
3707 142 104 -75 177 348 -30 218 40 267 -174 -265 20 -129 -242 -18 -204 -13 -281 105 -29 -203 -72
3728 -72 48 100 -38 273 -282 -25 -201 59 -72 -140 115 125 -39 251 68 66 104 197 135 -187 297 212 11
3751 11 -78 227 -100 -36 189 104 -139 -175 204 -64 -37 64 -20 -90 -390 -2 -52 -121 34 145 -1 -389 32
$$ packed form
3599c06L08L51n64o3L18l48r7J23K56j30O6N20J84n28J62K62n45j54J30L75m70
3620a50L03K74j18m46J02J2n38%O86k22j56J96L27l65r7N36j36o33K75N02m59
3641a07k93O06k57k75l07O16o0j18N84J9L7R3l3l45l16K94M3q28L61M98j36m36
3663c60N44j40m56J68j39J74j89L78J81l72O6N82k79o81O95R0k02j9L29n2l31
3684a3JJ35j10j96K15m2j34J78J17l93j71K29P9k94M1N08O5l03J88P2m53Q9L34
3707A42l8j79K52J71l78K48j78K27m41r1K85j49j13K24j86J91k68L86j34j74J31
3728g2J20N2j38L11n55K57j76K60j31o8K55J0j64K90j83kL8R3o2l22M84q5k01
3751A1q9L05l27O4K25q5k43l6L79k68K7J01q4p0l00L88n0o9J55J11j46l88M21
$$ plain form
3774 32 170 -79 -166 292 137 -21 -31 215 -47 -40 -160 -255 -79 -45 -61 -45 -161 74 -55 -98 -117 -29 -63 247
3798 247 33 -110 40 41 186 -227 -200 -110 -82 -137 244 224 -37 199 12 38 -35 -101 -36 216 228 -157 -157 48 38
3823 38 135 -37 -191 -33 -9 5 -212 -88 15 -35 160 73 -79 -12 -24 -190 89 -78 36 206 69 227 161
3846 161 -70 -69 -94 19 -18 2 327 -281 -74 18 -114 -209 55 -75 -6 -202 -84 -32 -199 -223 -201 -20 80 -54
3870 -54 160 -58 50 286 223 47 -45 322 42 306 227 -44 -110 -51 -168 -229 24 107 -214 89 -28 -432 -229
3893 -229 -206 -142 -109 81 64 294 108 -121 111 422 225 50 213 274 277 364 179 133 189 81 107 135 160 5
3917 5 -12 82 -28 3 198 57 0 -46 -423 -92 -356 -351 41 -124 -13 42 -274 283 18 -82 78 -136 3
3940 3 231 299 183 137 -88 -148 -89 -150 -85 -111 -199 43 99 -352 -114 -243 -166 -372 -56 -52 55 -72 161 -54 441
$$ packed form
3774C2J38k49q7M58j55j58j0K46k62Pj20r5J76L4j6J6j16K35j29m3j9Q8l4L10
3798B47k14j43J50JJ45m13K7R0K8n5L81k0k61K36j87K6p3o6O5K52J2l85%K05j0
3823C8R7j72j54J58K4J4k17J24J03n0J95q7j52O7j2j66K79j67J14J70j37J58o6
3846A61k31Jk5J13l7K0L25o08K07R2j32r5K64j30O9j96J18N2j67k4K2J81J00j34
3870e4K14k18J08K36o3j76r2L67k80K64p9k71o6N9j17o1K53Q3l21L03j17m04K03
3893b29K3O4L3J90j7K30j86k29K32L11j97j75J63O1LQ7j85m6N6j08K6K8K5j55
3917Ej7R4j10L1J95j41n7m6l77L31k64NL92j65J11N5l16N57k65j00J60k14J39
3940CK28O8j16m6k25o0N9o1O5k6q8K42N6m51K38j29P7k06L16MJ07j27K33k15M95
$$ plain form
3965 441 298 156 -27 -128 123 -190 -216 22 -89 -101 -3 57 -78 -225 128 -31 -350 149 198 -6 -159 -20
3987 -20 -60 -123 -180 11 -65 -84 13 262 120 161 155 34 -145 50 240 14 -302 113 184 -134 149 203 -346 -2
4011 -2 -12 -30 -181 38 127 -121 -309 138 20 -234 -123 222 -38 -144 89 3 -89 45 176 39 -33 120 211
4034 211 12 85 173 102 -22 -25 474 152 -76 403 -13 -115 -129 -116 -536 -348 -218 -253 -22 7 196 33 -185
4057 -185 35 -157 -170 -280 43 111 -211 529 216 21 39 -48 -69 -268 96 66 -157 9 392 -96 -343 -155
4079 -155 -58 -170 -188 224 376 -45 49 48 -202 -294 -68 -187 -396 -193 287 69 -240 192 84 -361 -218 137
4101 137 -342 -464 218 234 124 187 180 -207 -205 80 113 -240 -373 240 121 19 -182 51 -96 -117 -86 8 -335
4124 -335 74 151 106 -176 6 31 -87 275 324 505 43 91 177 -141 -234 52 -37 -4 -63 118 -90 -88 86 -6
$$ packed form
3965D41j43j42j83j01K51l13k6K38j11j2R8O0j35j47L53j59l19M99M9k04j53J39
3987b0m0o3n7J91p6j9R7K49j42M1oj21j79J95J90k26l16M15P1l18K83N4n49L44
4011bj0j8j51K19Q9k48j88M47j18k54J11L45k60j06K33q6r2J34J31j37p2J53R1
4034B11j99P3Q8p1j24lM99l22k28M79m16j02j4J3m20J88J30l5K31K9J89j63k18
4057a85K20j92j3j10L23O8l22P40l13j95J8q7k1j99L64l0k23J66L83m88k47J88
4079a55R7j12j8M12J52m21R4jk50r2K26j19k09K03M80k18l09M32j08m45J43L55
4101A37m79j22O82J6j10O3pl87KK85L3l53j33O13j19j02k01K33j47k1L1R4l43
4124c35M09P7m5k82J82K5j18L62M9J81m62M8Q6l18r3K86q9L3n9J81k08KJ74r2
$$ plain form
4148 -6 -206 93 51 25 -332 155 -208 -58 63 -95 -247 46 73 372 -34 37 159 90 -199 173 167 -234 -63
4171 -63 144 -133 29 244 44 -223 -438 64 -209 -239 206 149 -33 -48 45 -118 -23 -293 123 -183 -67 226
4193 226 62 -177 -55 145 16 -239 143 195 62 -54 247 31 -291 83 -2 -438 -113 101 23 -180 -22
4214 -22 -71 -321 -56 -20 0 -263 181 240 42 -7 165 -88 38 -115 -53 -150 -89 186 124 35 30 -106 -216 -407
4238 -407 -243 110 105 -93 55 227 -136 -85 73 -95 124 8 184 344 -119 343 -91 99 -36 -53 222
4259 222 159 -86 140 -26 246 297 -184 -93 370 69 -206 -24 -170 -124 -205 14 -66 -153 -19 23 71 128 -95
4282 -95 5 -245 52 82 39 -123 189 157 32 44 52 93 -10 53 268 61 -35 -99 -300 42 49 -102 -87 -1 -16
4307 -16 4 74 -35 -141 -200 -95 -238 -200 -24 73 134 -76 -61 142 104 -16 252 -16 59 42 -14 -156 183 23
$$ packed form
4148fk00K99m2k6l57M87l63J50J21j58j52K93K7K99m06P1J22o9k89L72om01J71
4171f3K07k77J62K15k00k67k15N02k73l0M45n7j82j5R3j63R5k70M16l06J16K93
4193B26j64k39J22K00j29k55L82N2j33j16L01k16l22L74q5m36L25K14p8k03J58
4214b2m9k50K65L6K0k63M44N9j98m9J72k53J26j53O2r7O1K75o2q9nj36j10j91
4238d07J64L53nj98J48J72l63N1J58j68K19j16J76J60m63M62m34J90j35j7K75
4259B22o3k45K26j66K72N1m81R1M63l01k75J82j46M6q1K19q0q7J34M2M8N7k23
4282i5J00k50K97L0m3j62L12l2j25J2QM1j03O3K15k07r6o4k01L42Pj51J5Q6j5
4307a6K0P0j09j06n9J05j43L8J76R7O1k10J5K03l8j20K68k68P5j7n6j42L39j60
$$ plain form
4331 23 82 -22 102 -259 -120 -51 -139 149 12 -168 -190 -16 -96 -34 28 -216 -240 -34 -99 153 -13 201 -7
4354 -7 -141 15 206 85 -131 64 74 -5 0 36 76 5 219 146 -114 151 -11 -75 53 -84 -209 107 -32 130
4378 130 -8 -94 -88 -141 -136 75 115 -62 -194 -52 46 70 100 -23 96 27 112 141 175 441 166 -76 -73 -407 63
4403 63 -12 -244 -158 -53 135 67 -13 28 -127 -49 131 -17 -45 42 -114 124 -82 -16 -25 -114 112 73 13 67 280
4428 280 -64 101 -46 -113 -1 -230 43 49 78 -30 -484 -58 -60 -61 -329 -329 -135 -181 42 -59 19 -189 7 173
4452 173 26 -85 34 50 -14 29 15 -20 -8 147 20 72 53 -31 -7 -51 21 120 -180 30 -131 164 121 188 -103
4477 -103 -22 -103 17 259 -214 -73 -105 95 172 149 15 108 -145 262 55 -20 -104 156 -41 165 -102 16 -424
4500 -424 -102 64 -204 -16 90 -262 -142 143 -125 -13 -227 -244 65 -43 83 77 104 22 128 202 55 93
$$ packed form
4331B3N9j04J24l61J39O9q8K88j37j80k2J74q0O2O2k44k4K06o5K52j66K14k08
4354gj34J56J91j21k16J95J0p9NL6M0p1K14p3k60K65j62o4J28j37j25L16j39J62
4378A30j38q6On3NK11M0j77j32J42R8K4L0j23J19o9Q5K9L4K66k75k42Ll34M70
4403F3p5k32Q6J05J88o8q0M1j55P8J80j48k8Q7j56K38k06O6rq9K26l9o0N4K13
4428B80l44J65j47o7J12k29K73OK9j08m54M26kjk68%J94m6K23j01P8k08J96J66
4452A73j47j11J19J6o4M3j4l5J2J55j27N2j9q4K4m4P2R9l00K10j61K95m3O7k91
4477a03Q1q1J20K42m73J41l2K00P7k3j34R3k53M07k07p5q4K60j97K06k67J18m40
4500d24L22J66k68J88J06l52J20K85k68J12k14j7L09j08J26oK7q2J06P4j47L8
$$ plain form
4522 93 61 -27 7 184 -22 70 136 3 -5 -69 -107 32 -18 -288 -78 -121 -171 -153 -8 44 -34 117 -40 56 -180 62
4548 62 -53 -273 118 -41 -138 -151 306 -87 -43 391 -54 -41 71 103 -5 -111 94 57 -135 74 67 -29 -301
4571 -301 -205 -188 -331 -53 -10 106 -159 -114 271 -99 -327 -43 139 164 -17 91 39 -57 19 131 -136 54 303
4594 303 -57 -158 145 323 -41 -180 -67 -145 -227 249 370 -154 -27 9 -130 -329 -197 -151 -114 -198 118 187
4616 187 87 147 384 8 -236 84 345 32 75 125 -57 -217 89 261 -123 -85 183 69 -200 43 231
4637 231 79 -31 209 -21 -307 -38 -20 -146 -194 223 -54 -90 45 56 86 175 279 178 126 175 261 -150 -5
4660 -5 -202 -120 -115 -47 -119 24 -197 -127 67 -179 -261 -114 -43 -192 84 -132 -235 -12 -184 -142 -98 -35 284 201 281
4685 281 62 395 -174 95 173 -237 -206 50 -53 100 -71 55 82 -147 71 -47 -177 -71 173 -110 -88
$$ packed form
4522I3l2q8L4J77k06R2O6j33qo4l8J39n0k70K10m3n0J8J45N2p8J51j57R6k36K42
4548F2j15k20L91j59r7j3M57l93M4M34m45J3J12L2j08j06K05l7j92K09pr6k72
4571c01R6J7j43K78M3J16k65M5L85l70k28K84J82K5j81J08n2r6P6J12k67J90K49
4594C03l60j01L03J78l64j39J13p8q2M76J21n24J27L6j39j99J32M6L7q4L16O9
4616A87j00O0K37l76k44L20K61l13M3N0j82j60L06J72l84L8K68j14k69K43J88
4637B31j52j10K40k30k86K69J8j26m8M17k77l6J35J1L0Q9J04j01n2M9Q6m11J45
4660ej97Q2NO8p2J43k21P0J94k46q2J47P1j49K76k16j03K23j72M2M4O3L19q3Q0
4685B81k19L33n69K69P8m10L1K56j03J53j71J26K7k29K18j18j30J06K44k83K2
$$ plain form
4706 -88 -102 127 -46 10 -76 1 -11 7 56 -71 89 91 178 -45 -83 300 -51 -46 5 181 -368 -284 -48 -10 -246 109
4732 109 53 -328 -420 -49 31 -320 -4 -216 190 151 -121 89 -21 -14 158 115 110 98 106 36 116 239 107 207 44
4757 44 90 -184 -70 137 72 -71 -98 100 41 -74 -158 -185 -131 43 91 71 128 93 197 -85 117 60 71 170 154
4782 154 -38 -157 133 35 -244 -223 117 127 111 -126 -43 137 -48 -216 -145 -187 18 -1 86 -77 -171 -69 78
4805 78 -84 86 -62 121 263 147 -143 -18 278 -87 -292 10 -117 -39 58 -37 -39 -258 -132 -173 -151 17 70
4828 70 -92 140 -48 -249 17 -22 33 56 -30 84 219 -226 232 -75 85 -167 96 -136 -313 174 6 52
4850 52 -19 42 -12 -25 -131 95 -96 -55 -46 71 -147 153 -125 -110 -56 120 38 310 -287 147 137 35 66 221
4874 221 141 147 188 36 24 -161 16 69 333 94 44 -25 -86 23 -88 114 233 -240 163 -140 54 82 164 -72
$$ packed form
4706h8j4K29j73N6q6P7j2J8M9j27J60KQ7k23l8L83l51NN1J76n49Q4K36L8k36L55
4732A09n6l81r2L71Q0l51L16k12M06l9k72K10j10PJ72m3nj2Qp0Q0J23j32J00j63
4757D4M6k74J14K07o5j43k7J98n9j15q4k7N4J74M8k0N7l5J04k82K02n7J1R9j6
4782A54j92j19K90r8k79K1L40J0j6k37Q3J80j85j68P1m2K05j9Q7j63r4J02J47
4805G8j62J70j48J83J42j16k90J25K96l65k05L02j27P8R7r5kk19J26m1K2J68N3
4828G0j62K32j88k01K66l9N5K3q6J14J35m45M58l07J60k52K63k32j77M87j68M6
4850E2p1O1n4j3j06K26j91M1RJ17k18L00k78J5N4J76q2K72n97M34j0j02L1J55
4874B21q0OM1j52j2j85J77N3K64k39n0o9o1J09j11K02J19m73M03l03J94K8Q2k36
$$ plain form
4898 -72 284 8 5 -165 -97 229 -163 -59 427 -101 -52 62 49 -24 33 -83 200 112 -130 7 -75 153 -10
4921 -10 34 17 -67 -10 45 -199 -67 -140 -234 -36 -138 -28 -84 -133 225 76 -61 -36 -103 130 341 79 206 -4
4945 -4 -56 -96 -242 223 116 123 98 -23 240 -192 -209 107 -259 129 -175 150 -3 -125 -159 -40 50 -158 7
4968 7 45 -101 151 -110 -12 206 -14 -89 261 -114 -99 88 68 207 -41 -4 229 -200 -160 -93 -154 -190 -18 -66
4992 -66 23 -178 35 41 -52 12 436 -101 -115 -200 73 -80 166 296 35 -32 -147 80 63 137 44 32 -27 162 -158
5017 -158 -34 -29 37 -148 -54 -69 149 4 34 58 -219 -38 -101 -72 -102 91 37 20 -153 288 146 -92 52 2
5041 2 -130 97 19 297 -203 41 -226 -82 -367 138 -29 -43 -209 201 -21 22 22 145 136 -129 218 -29 137
5064 137 8 183 -63 12 237 308 -67 105 -203 -19 -21 86 72 56 70 -10 -80 -35 -41 -147 -36 16 181 116 -204
$$ packed form
4898g2L56k76lj70O8L26l92J04M86n28M9J14j3p3N7j16K83q8k42J37q2K28j63
4921a0M4j7q4N7N5k44J32p3r4J98j02J10n6m9L58j49j37K5o7K33K11k62J27k10
4945dn2m0j46M65j07Pk5j21K63m32j7L16l66L88l04L25j53j22l4J19R0k08J65
4968GL8j46K52k61R8K18k20p5L50l75J5J87k0J39k48L7K33m29M0O7o1l6J72m8
4992f6Q9k01K13Or3O4M24n37j4q5K73j53K46J30k61o7j15K27j7P4r3j2n9J89l20
5017a58J24NO6j85R4j5K18j45L0K4k77J81o3K9l0J93n4j7j73M41j42k38J44n0
5041Bj32K27p8K78n00K44k67J44k85N05j67j4j66M10k22M3%J23rk65L47k47J66
5064A37j29J75k46P5K25P1l75J72l08J84kJ07j4j6J4q0p0M5oj06J11N2J65o5l20
$$ plain form
5089 -204 180 82 -464 -245 -65 3 -77 119 -14 -59 93 93 -112 -284 184 249 108 78 249 -244 124 -127 -205
5112 -205 -3 -47 163 -62 14 -143 92 -34 132 96 -97 -17 -155 -134 160 13 256 143 -88 -409 -30 -187
5134 -187 47 133 152 148 -194 -73 -36 -243 51 -128 105 10 -50 -202 35 -137 140 4 -268 62 -68 -243
5156 -243 -60 23 198 -63 211 124 96 -12 -90 171 -26 51 46 42 5 98 26 -138 -169 228 10 -116 -172 184 -100
5181 -100 -85 228 -159 -139 290 49 296 17 269 -200 52 59 195 -50 -81 205 72 -21 87 93 -49 -111 148
5204 148 38 58 59 83 -189 42 -34 104 -123 -88 49 87 -114 -120 10 -111 -159 -223 -151 -255 388 308 148 65 99
5229 99 66 -222 103 56 -3 38 47 -74 -51 94 -68 14 -81 28 39 4 96 -73 -158 -274 -21 28 -100 -133 131
5254 131 -88 -188 -63 184 -311 -117 147 -217 136 111 -25 107 327 -117 -44 -227 12 -50 -69 -17 -57 148
$$ packed form
5089b04L84r8n46K19J80O8q0J96j33m5J52%k05j72M68O5j41l0J71m93L68k51p8
5112b05K02m4K10k25P6j57K35j26J66l6j93Q0j38K1K94j47K43j13k31l21L79j57
5134a87K34Q6J9ml42J21L7k07K94j79K33r5o0j52K37j72K77j36k72L30j30j75
5156b43J83Q3J75k61K74q7k8j08p8K61j97P7nml7R3p2j64l1L97k18j26n6L56k84
5181a00J5L13l87K0M29k41K47k79K52m69K52PJ36k45l1K86j33r3J08Oj42o2K59
5204A48j10K0JK4k72K31p6J38k27L5J37L8k01oJ30j21m8o4P2j04O43q0j60q3L4
5229I9l3k88L25m7n9M1Rj21K3J45j62Q2r5J09J1l5R2j69q5j16K53M9j28l3K64
5254A31k19j00J25K47m95J94K64l64L53k5j36J32K20m44P3j83K39o2j9N2m0K05
$$ plain form
5276 148 -67 -82 166 -209 -236 -36 89 -271 113 -210 3 43 -19 39 -27 212 -37 -83 37 148 249 -106
5298 -106 97 192 67 16 -7 121 -89 -70 -28 62 -26 -127 -169 -17 -290 -156 -178 -52 -31 -52 209 42 -60 -25
5322 -25 -47 21 184 -16 67 -89 -174 81 274 106 201 -1 103 196 -67 -147 105 -169 79 -287 -240 -51 -46 -265
5346 -265 -171 -11 -242 -47 50 142 30 273 -94 72 -48 49 173 5 -105 -2 115 -191 90 162 68 19
5368 19 70 89 -222 -14 -226 -146 -228 -70 102 -53 12 -112 -167 -109 186 159 109 126 57 64 44 -36 52 341 -101 169
5394 169 100 34 -170 44 211 279 -111 -107 278 54 -78 -182 -74 -14 -61 -19 235 13 -92 38 -119 -81 -231
5417 -231 -71 93 138 -22 -17 160 123 -123 -4 81 -155 106 -31 19 132 -39 -32 137 125 63 187 150 -148 20
5441 20 225 -317 -28 33 107 157 67 169 7 147 -64 31 140 -98 -5 192 -15 -53 -11 -119 -49 -74 205 140
$$ packed form
5276A48k15j5K48l75k7K00J25l60L84l23K13M0o2N8o6K39k49m6J20J11J01l55
5298a06K03R5j25n1k3J28k10J9M2R0q8j01m2J52k73J34k2J26K1k1K61j67j02L5
5322b5k2O8J63k00Q3j56q5K55J93j68R5k02J04R3k63q0K52k74K48l66M7J89Nk19
5346b65R4J60k31J95R7R2j12K43l67J66j20R7J24j68j10J03J17l06K81P2r4m9
5368A9N1J9l11K08k12Q0q2J58J72j55O5j24n5N8K95k7n0J7o9Pk0q0Q8K89m42K70
5394A69o9o6k04K14J67O8l90ML85k24j32j04J08O0m7M2K54k22j05J30j57L8j50
5417b31J60J64M5j60NJ77l7k46J19Q5k36K61j37N0J13j71PJ69j2o2J24l7k98J68
5441B0K05n42K89O1P4N0r0J02j62J40k11R5J09k38R3J97k07l8M2j08P0k5K79o5
$$ plain form
5465 140 121 -280 111 -20 253 16 16 -266 92 121 -167 -113 37 -194 -304 48 -88 -185 173 -74 125 -73
5487 -73 214 2 188 -103 17 -199 -139 -30 55 99 88 -113 -37 -134 -38 166 -129 140 -119 126 -136 -65 38
5510 38 -68 76 159 -404 92 -12 288 68 -204 104 -42 -256 69 150 -179 92 76 88 68 -20 289 50
5532 50 -55 97 110 50 46 -41 -182 14 -155 56 -125 -53 169 -101 -166 48 -54 -171 67 301 11 -157 88
5555 88 -50 26 279 3 31 -176 7 166 -155 -163 107 -41 99 -176 36 -50 -30 70 -110 -372 192 133 -103
5578 -103 -3 120 28 17 -83 23 -67 -61 233 165 143 20 483 -155 159 157 89 155 -97 -88 171 -6 234 84
5602 84 0 -228 8 -157 -250 99 58 -273 93 48 -74 45 -107 95 -45 -61 78 299 39 53 56 144 -112
5625 -112 126 31 -69 311 78 8 -207 129 114 -123 -88 165 -15 -28 10 35 -29 -160 -86 -9 66 247 24 106
$$ packed form
5465A40j9m01L91j31K73k37%k82L58K9k88N4J50k31j10L52j36r7L58k47J99j98
5487g3K87k12J86k91J20k16O0J09Q5M4j1k01P6r7R6K04k95K69k59K45k62P1J03
5510C8j06J44Q3n63M96j04L00k20k72L08j46k14L25Q1l29K71j6J2k0q8L09k39
5532E0j05J52J3o0mq7j41J96j69K11j81P2K22k70o5K14j02j17K38K34k90j68K45
5555H8j38P6K53k76K8k07J83J59l21qK70j48J40k75K12q6K0J00j80k62N64n9k36
5578a03J00J23r2j1j00J06r0OK94o8k2j23M63o38L14ko8O6k52RK59j77K40j50
5602H4q4k28K36j65r3L49m1l31L66m5j22J19j52K02j40j6J39K21k60J4LQ8k56
5625a12K38r5j00L80k33p0k15L36j5k37L5K53j80j3L8K5o4j31P4P7P5J81k23Q2
$$ plain form
5649 106 9 -67 221 -220 72 12 -98 -188 349 47 -273 230 10 -101 -35 134 -190 196 150 69 -173 -239 69
5672 69 -67 -321 -37 214 -152 -83 -71 154 -260 -155 -156 -156 -8 253 379 -29 192 20 14 -98 151 5 58
5695 58 -100 113 336 -312 5 122 -228 -196 -34 167 -135 -37 81 -49 -62 -79 80 -158 7 187 89 157
5717 157 205 -52 141 -70 -192 43 -307 66 48 -40 -148 149 153 -212 -55 39 79 -77 -94 -12 -39 -86 -22 70
5741 70 137 -164 54 -145 -69 123 -123 -251 19 -22 116 210 -205 211 60 250 129 -194 -178 -180 1 -45 104
5764 104 136 -67 -164 256 6 -114 40 -125 -63 69 132 195 -75 0 102 -89 -147 355 129 38 106 92 46 299
5788 299 139 46 64 4 -64 -129 -118 -60 -55 51 40 28 -58 -98 103 -94 65 -31 -29 -82 -18 49 16 148 -36 182 -50
5815 -50 -8 85 303 -45 71 48 -346 -183 44 52 -78 -62 204 47 62 93 -231 -60 -34 1 -105 175 -113 100
$$ packed form
5649A06r7p6K88m41K92o0j10r0N37l02l20N03k20j11O6J69l24L86m6q1k42o6L08
5672F9j36k54K84K51l66O9J2K25m14J05j%J48K61J26m08K21j72oj12K49j46N3
5695E8j58K13K23o48L17J17l50L2J62K01l02R8J18j30j3j7J59k38J65J80r8O8
5717A57M8k57J93k11j22K35l50L73j8q8j08K97Ml65J57R4M0j56j7Q2k7m7O4R2
5741G0O7l01K18j99P6J92k46j28K70m1J38R4m15M16j51J90j21l23J6kJ81m6J49
5764A04L2k03r7M20k50j20J54j65O2J32O3O3k70P5J02j91n8N02k26r1O8j4m6K53
5788B99j60r3J8o0o8o5J1N8NJ06j1j2q6m0K01j97J59r6Kn3O4O7l3J32j84K18k32
5815e0M2R3K18l48J16k3l94J63K27Qj30J6K66j57J5L1l24J71K6L5j06K80k88K13
$$ plain form
5839 100 -136 -201 196 138 -33 -97 146 271 -38 173 -20 -94 59 85 110 123 176 108 -85 -18 -109 -70 -129 -63 92
5864 92 184 -14 49 -25 -207 -94 85 -1 -199 123 61 38 33 -10 -47 207 55 182 -174 -177 -14 -47 -116 30 160
5889 160 -174 -76 119 -18 -14 116 25 100 -2 -69 -131 -90 57 -2 80 145 -14 140 90 -34 35 98 16 195 -125
5914 -125 99 -46 -106 -87 166 -25 36 -106 -59 20 61 76 17 -280 -101 -71 -194 136 -93 186 -71 42 122
5937 122 108 137 119 151 -37 192 29 2 131 -91 8 2 -191 -29 47 110 -310 -160 -98 -90 -158 99 177 -175 -112
5962 -112 -282 15 -277 16 -62 -212 71 -59 35 153 -108 42 180 12 106 190 -154 220 39 42 18 -241
5984 -241 168 203 -4 56 -25 -35 -7 -50 -75 -90 19 -171 -2 -36 -34 -26 -117 70 58 -35 36 -61 -189 0 42 55 -174
6011 -174 9 -79 172 -265 132 40 22 -85 78 -105 -17 209 65 -147 -201 -60 -26 -38 19 -14 116 -32 114
$$ packed form
5839A00k36o5L97n8j71o4K43J25l09K11j93p4J53K6K5J3N3o8j93O7r1L9n9O6J55
5864I2R2j98O3p4j82J13J79q6j98L22o2k3nm3l7K54j52J27l56lJ63l3o9J46J30
5889A60l34R8J95j37MJ30r1P5j02o7o2M1J47n9Q2O5j59J54n0j24O9O3q2J79l20
5914a25K24j45o0J9K53j91O1j42M7P9M1J5n9k97J79L0j23L30k29K79k57J13Q0
5937A22j4K9j8L2j88K29j63k7J29k22R9oj93J62P6O3m20J50O2Qo8K57P8l52O3
5962a12j70K97k92K93p8j50K83j30R4J18k61J50J38j68R4Q4l44L74j81Lk4k59
5984b41M09L5k07O0q1j0K8m3k5j5J09j90J69l4KQr1J87j2r3P1r7j28J89M2J3k29
6011a74J83q8K51m37L97r2j8j07J63j83Q8K26j44k12n4J41L4j2N7l3J30j48J46
$$ plain form
6034 114 52 -167 -6 42 44 121 187 334 -38 -20 169 -164 -124 -52 -21 153 161 208 79 -162 10 -117 16 -70 47
6059 47 -28 -145 -3 78 -149 -191 65 -212 28 292 -30 152 -134 116 -74 -208 226 133 -42 292 49 203
6081 203 -310 9 -12 -202 -190 87 -5 -264 -5 -7 29 -274 -174 -187 70 -6 113 -103 -68 182 -149 -134 -38 118
6105 118 -97 -149 60 134 109 -251 -142 -173 -55 8 105 236 -293 -7 35 -27 -122 58 -65 -231 98 -200 -222
6128 -222 -92 56 -50 3 -60 13 16 3 158 236 83 152 96 88 -35 107 38 -80 -98 143 -95 130 -29 16 -164
6153 -164 -5 29 189 -162 107 156 -171 -113 301 40 -138 187 -48 127 275 257 11 60 21 160 -162 -56
6175 -56 165 30 44 61 -169 138 -53 -119 17 108 -157 77 -126 -71 175 41 -79 -37 182 -20 -179 251
6197 251 275 94 122 125 35 -149 -60 127 152 3 307 57 -8 131 38 -270 22 52 -79 -66 17 170 -40 -36 -149
$$ packed form
6034A14o2k19J61M8KP7O6J47l72J8J89l33M0P2L1J74QM7j29k41J72j27J33q6J17
6059D7p5j17J42Q1k27m2K56k77K40K64l22J82k86K50j90j34M34r3j75L34k43J54
6081B03n13L19k1j90J2K77r2k59K59kL6l03J00j3K57p6J19k16L5K50l31J5R6J56
6105A18k15n2K09P4k5l60J09l1J18O3R7J31n29K86M2o2r5J80j23j66L29k98k2
6128b22J30J48j06N3o3P3Lj3J55P8j53O9n6qj23J42o9j18j8K41k38K25j59M5j80
6153a64J59L4J60l51K69M9l27N8M14k61j78L25k35J75J48j8k46M9l9J39l22J06
6175e6K21j35J4J7k30L07j91o6J36R1k65K34k03N5K46j34j20M2K19k02j59M30
6197B51K4j81K8Lr0j84Q9J87K5j49L04k50o5J39r3l08K92L0j31J3Q3J53k10Mj13
$$ plain form
6222 -149 -37 -138 -119 105 -110 11 -128 -85 119 -80 48 69 50 328 208 -332 -168 72 241 51 338
6243 338 78 62 -99 71 -108 -204 -163 -2 -175 -239 47 -155 -210 -265 86 -62 32 302 -32 -189 100 -14
6265 -14 -69 147 346 87 60 23 88 -154 -88 -69 88 210 11 -155 -150 -160 103 3 251 -222 -4 -17 -140 7
6289 7 -142 -33 -360 -144 -131 220 151 83 -65 40 -249 100 12 -31 -106 117 -155 89 154 -60 35 128 -283 -83
6313 -83 -55 164 -100 -67 85 72 24 -103 61 60 84 232 -4 -113 -97 34 101 171 55 137 -195 55 473 88
6337 88 64 -34 133 -26 34 -64 -208 2 44 -18 35 -6 -116 152 -260 -208 70 128 234 40 -53 -153 -213 -146 -96
6362 -96 -79 132 -183 89 67 172 -33 140 345 -72 104 228 -213 14 -203 -207 -102 -117 -59 54 -122 -59 -171
6385 -171 160 -16 26 -172 -81 114 -91 62 -51 13 -51 -139 53 78 -1 148 159 39 -51 138 62 -115 -88 -27
$$ packed form
6222a49J12j01J9K24k15J21j39M3K04j99J28K1j9K78j20n40J64K40J69j90K87
6243C38k60j6j61J70j79r6M1J61j73o4K86k02n5n5L51j48R4K70l34j57K89j14
6265a4n5K16J99k59k7l7O5k42O6J9J57J22j99j66Nj0K63j00K48m73K18j3j23J47
6289Gj49J09l27K16J3L51o9o8j48J05k89L49q8m3p5K23k72K44O5k14R5R3m11K00
6313h3K8K19k64L3J52j3m8j27J64jK4J48k36j09J6J31O7P0j16Q2l32K50M18l85
6337H8k4r8J67j59O0r8j44K10M2o2N3m1j10K68m12N2K78N8J06j94r3j00o0O7N0
6362i6J7K11l15K72k2J05k05J73K05m17J76J24m41K27k17mJ05j5N8J13j76O3j12
6385a71L31j76M2j98R1J95k05J53j13O4o4q8J92K5p9J49J1j20r0J89p6j77K7O1
$$ plain form
6409 -27 119 35 236 -95 33 -205 -103 -170 -196 -72 -149 -34 -293 -67 -108 22 120 72 37 -29 -83 -66 97 64
6433 64 108 -67 -17 14 -174 -206 -80 -102 98 -31 -37 64 -398 36 171 -126 -118 -128 56 163 -212 -73 -59 -53 15
6458 15 -182 -58 136 -107 131 -9 124 33 -106 22 -85 27 36 44 81 279 -34 37 -128 13 48 -43 103
6481 103 166 158 -8 -53 -174 8 -170 -66 129 -42 193 -51 86 24 -92 -192 -247 191 -98 -30 65 51 143
6504 143 149 -40 -190 -237 181 -240 71 46 -343 10 -118 48 -177 -10 139 -67 -133 68 129 40 83 -51 270
6527 270 -66 89 -21 107 -44 10 19 -93 189 -79 169 70 -16 67 -103 92 -95 -52 -117 -99 53 84 -164
6550 -164 -293 160 -33 -25 47 -70 -27 -119 -84 -14 189 -28 140 -202 41 48 127 223 -17 52 -149 74 -2 42 10
6575 10 -134 58 -25 -91 62 -45 -113 36 114 -63 229 -66 212 -21 -93 -133 0 19 127 35 16 -67 -97 -117
$$ packed form
6409b7J46q4K01l31J28k38J02o7k6J24p7J15k59K26m1J30R8m8l5o6n4J7J63l3
6433F4M4j75N0L1j88l2J26k2K00j29oJ01m62M34J35k97Qj0J84J07l75J39J4OO8
6458A5j97J24J94k43K38j40J33r1j39J28j07J12RQL7J98l13P1j65J41L5r1J46
6481A03O3qj66m5j21J82j78J04J95j71K35k44J37o2j16j00n5M38k89O8R5j4R2
6504A43Oj89j50m7M18m21L11k5l89L53j28J66k25J67J49k06o6K01O1q9M3j34L21
6527B70l36J55j10J28j51N4Rj12K82k68K48r9q6Q3j70J95j87M3o5J8J52L1k48
6550a64j29M53j93QP2j17M3r2L5P0K03k17J68l42K43PP9R6k40O9k01K23p6M4l2
6575A0j44J92q3o6J53j07o8J49P8j77K92k95K78k33p2m0J33J9J08r2j9q3l0k0
$$ plain form
6599 -117 87 83 24 279 -116 149 75 -130 6 -270 19 -63 141 -45 -280 -140 -137 254 184 -2 172 -3 85
6622 85 81 97 13 -91 -8 -285 -97 -37 217 -223 -81 128 -108 -102 -145 -114 148 15 41 -68 244 110 -116 -344
6646 -344 -144 -14 -192 -164 -19 282 30 3 -69 -61 -104 233 71 -33 72 132 130 225 -41 145 -221 -119 -215 -185
6670 -185 -92 113 -61 -26 -119 27 2 133 114 165 -64 -16 -98 61 -61 -233 344 41 11 89 -22 -24 -13 -125
6694 -125 -78 44 -246 -137 -57 267 -40 16 25 43 -100 0 47 211 116 88 33 99 35 -13 65 8 -18 -125 175
6719 175 229 12 90 281 23 -41 -155 126 29 101 85 362 225 97 -22 -181 -46 -79 87 73 -164 63 -144
6742 -144 65 -215 -48 -187 29 143 259 -45 218 -235 -276 -23 103 -38 18 85 -57 155 151 139 198 -93
6764 -93 -154 -231 129 -133 116 -17 -62 65 8 93 169 191 215 -32 -153 -92 -129 37 40 -46 15 -164 -153 6 90 31
$$ packed form
6599a17K04mn9K55l95K65p4k05J36k76K89q2K04j86k35J40LL91p0j86J74j75Q8
6622H5mJ6q4j04Q3k77J88O0K54m40J42K09k36Om3L1K62j33K6j09L12j34k26k28
6646c44K00J30j78K8J45L01k52k7p2Qm3L37j62j04J05O0kR5k66J86l66J02r6L0
6670a85R3K05j74L5r3J46k5J31j9N1k29M8q2J59j22j72N77l03l0P8j11kJ1j12
6694a25M7J22k90J09Q0L24l07N6RJ8j43J00M7J64r5k8n5O6o4m8P8n7k6j07L00
6719A75N4k17P8J91k58o4j14K81r7P2j6K77j37j28j19j59J35l3J66j4k37K27k07
6742a44K09k80J67j39K16J14J16l04K63m53m1K53J26j41N6O7j42K12mj2N9k91
6764i3o1p7L60k62K49j33m5J27n7Q5P6K2K4k47j21O1l7J66Lq6O1j79J1J59Q4n9
$$ plain form
6790 31 -179 -162 -162 -64 -4 134 56 98 -90 -40 -39 -83 -18 106 -119 -151 44 139 27 -100 96 -202 187 -170 59
6815 59 188 19 -42 -96 -26 207 -37 -180 -98 37 69 -111 -48 -18 18 242 41 203 -187 -48 48 66 -14 -86
6839 -86 151 -117 155 125 -96 117 98 88 -58 71 43 -43 128 79 21 165 149 -17 50 84 54 -24 -54 -54 64
6864 64 126 98 -32 104 104 88 -68 -45 21 -24 -180 35 22 -94 141 -149 -110 144 91 -33 -153 76 13 98 -239
6889 -239 232 -168 -408 11 12 -123 -115 118 -52 -128 200 -264 51 8 -105 -183 225 -90 -9 -21 -111 83 56 84
6913 84 -136 -134 202 -97 158 12 -58 -28 96 -36 -158 74 -67 156 -232 -72 81 -70 -40 9 -55 141 -175
6936 -175 -168 -35 -53 -15 -82 24 283 -134 197 202 26 -276 -153 183 2 74 234 -74 56 52 33 83 -183 -45
6960 -45 77 25 230 87 -44 -215 -41 100 -25 106 -154 -354 -50 203 70 92 192 -16 -8 77 -62 50
$$ packed form
6790C1k10J7%R8O0J38p8M2j88N0Jm4O5J24k25l2J95R5j12j27J96k98L89l57K29
6815E9J29j69o1n4P0K33k44j43Q2J35L2j80O3L0L6K24k01J62l90J39R6J8q0p2
6839h6K37k68K72l0k21K13j9j0j46J29k8q6J71m9n8J44j6j66O7L4l0p8l0%J18
6864F4O2k8j30J36%j6j56K3O6m5j56K15j3j16K35k90L9K54n3j24j20K29o3Q5l37
6889b39M71m00k40M19Jj35QK33j70p6L28m64L15m3j13p8M08l15Q1j2r0J94k7K8
6913H4k20KL36k99K55j46p0L0J24j32j22K32j41K23l88J60J53j51L0M9o4J96l16
6936a75PJ33j8L8o7J06K59m17L31Nj76l02J23L36j81P2J60l08J30mj9N0k66J38
6960d5J22n2K05j43j31j71J74J41j25J31k60k00L04K53j33K2J00k08QQ5j39J12
$$ plain form
6982 50 -54 -99 49 -33 -119 297 76 -9 131 62 -51 -5 -8 227 -95 55 35 -12 -62 23 114 -110 -165 76 -11
7007 -11 -51 14 122 16 23 55 -279 54 -146 -3 276 105 218 77 -57 247 13 1 24 34 300 -161 46
7030 46 174 64 18 7 66 -7 150 -22 36 -244 6 85 117 251 11 147 270 161 156 163 41 -103 -117 69
7054 69 -28 245 -148 -92 -179 -163 111 -41 116 30 -9 -31 -90 -81 91 23 42 267 -32 -163 -228 100 -83 18 88
7079 88 -95 -1 -274 -67 -22 87 -234 -86 223 48 165 36 -86 -176 65 -157 -74 -14 -39 227 -87 -160 16
7102 16 -70 -229 -147 -10 -67 -84 93 -115 -8 438 154 -77 -84 -109 24 -118 -149 248 -77 -103 31 94 -113 -183
7126 -183 -43 -129 -72 -47 -42 -138 -105 31 2 170 121 -17 -241 -122 -92 204 156 197 86 -36 -45 -247 66 -88 -120
7151 -120 -132 -301 -21 -8 166 -116 -103 82 89 -19 256 -114 -263 -2 -128 -13 -34 30 53 175 -43 109 53
$$ packed form
6982E0j04m5J48q2q6M16k21q5J40o9j13M6lK35l22J50k0m7n0Q5R1k24n5K41q7
7007a1m0O5J08j06PL2l34L33k00J43K79j71J13j41j34L04k34j2K3J0K66m61K07
7030D6J28j10m6j1N9p3J57j72N8k80K50P9L2J34k40J36J23j09nPj22j44j4J86
7054F9r7K73l93N6q7J6K74j52J57q6l9k2n9RJ72o8J9K25k99j31o5L28j83J01P0
7079H8j83R4k73K07M5J09l21J48L09j75J17j29j22r0K41k22Q3O0k5K66l14p3J76
7102A6q6j59Q2J37n7j7J77k08J07M46k84k31pk5J33j42l1L97l25k6J34O3k07p0
7126a83J40q6N7K5Nr6L3J36k9J68m9j38k24J19L0K96m8M1j11j22rk02L13j54l2
7151a20j2j69K80J3J74k82J3J85Pj08K75l70j49K61j26J15k1O4K3J22k18J52n6
$$ plain form
7174 53 -72 61 214 -205 -110 124 42 -102 -15 -61 39 -87 35 26 -20 -107 61 102 -35 -70 48 -62 -135 -189
7198 -189 107 162 144 -152 -163 96 -46 -85 305 117 270 -50 -107 1 166 -63 179 84 -164 91 68 42 -81
7221 -81 -35 -222 -95 -96 131 81 98 -59 -260 33 58 355 3 -165 148 -54 -3 -14 69 9 -91 -348 127 -10
7245 -10 -51 -125 78 22 199 -74 -57 -48 -46 -32 147 -259 58 -120 -132 -89 37 -46 -137 -111 -55 -136 259 -252 -71 166
7271 166 -146 -29 -55 140 -151 -83 13 206 133 -203 109 127 -56 -184 -154 160 -128 -208 64 183 94 -50 33
7294 33 -157 38 67 79 -24 23 83 -384 -88 -180 2 90 -118 -69 155 80 -136 124 -32 129 -65 -54 -224
7317 -224 88 47 -92 -187 51 50 -1 -58 -74 134 147 -87 17 46 67 297 -161 129 244 327 -22 37 -43 14 -89
7342 -89 -138 -89 209 98 45 88 42 23 76 -241 -331 -70 80 -146 -19 97 -1 -192 66 -26 58 -75 -103 81
$$ packed form
7174E3j25J33J53m19R5K34q2j44Q7m6J00j26J22rm6q7J68M1j37l5J18j10p3n4
7198a89K96N5j8k96j1K59j42l9L90j88J53l20n7J08J65k29K42r5k48K55k3k6j23
7221h1M6j87J27jK27n0J7j57k01K93K5K97l52j68L13k02N1j1Q3o0j00k57M75j37
7245a0m1p4K03n6J77k73J7RKJ4J79m06L17j78j2M3J26q3r1K6N6q1L95n11J81K37
7271A66l12J17k6J95k91O8R6J93p3l36L12J8j83j28L0L14k88q0K72J19q9j44Q3
7294C3j90J95K9J2j03M7O0m67K96r2J82Q8k08M9K24p5k16K60j56J61j94J1j70
7317b24L12m1j39r5K38jn1n7j6K08J3k34J04K9K1K30m58K90J15Q3l49N9q0N7j03
7342h9m9M9K98j11n3M3m6j9N3l17r0K61J50k26J27J16r8j91K58r2Q4j33k8J84
$$ plain form
7366 81 -6 243 56 43 -105 244 -114 95 -56 -66 71 54 14 4 205 -3 137 -145 -69 -234 -101 -80 216
7389 216 191 159 -145 -49 56 -57 -83 36 54 2 132 159 -9 37 -155 114 18 64 58 133 -147 -22 22 -154 217
7414 217 -211 219 -154 115 -244 -69 -168 89 -75 -172 375 -102 61 -23 131 167 -190 170 -37 118 92 115
7436 115 43 223 3 76 234 4 6 24 28 -3 -149 150 14 -85 227 -31 -129 2 163 -102 -69 -6 -64 30 -136
7461 -136 10 273 -65 175 -122 -83 42 -63 -29 78 -219 -117 -38 139 106 91 -103 -75 -197 -80 -49 -157
7483 -157 11 127 -40 -112 -142 310 34 -18 137 120 107 296 96 32 -125 61 25 -60 -10 -21 -21 31 -1 115 184
7508 184 160 177 -263 -57 -284 12 -159 132 -141 -411 -107 119 25 -312 -18 33 199 36 -194 86 -135
7529 -135 -120 244 107 -116 -120 41 -53 33 390 -52 -230 -173 120 -23 254 14 -164 -141 53 -164 -201 54 -24
$$ packed form
7366H1q7K49j87j3j48L49l58K09j51j0J37j7m0j0K01k08J40k82P6j65J33K1K96
7389B16k5l2l04R6J05j13k6J19J8n2J30K7j68M6j92K69r6M6oP5k80J25M4j76L71
7414B17m28M30l73K69l59J75r9K57j64r7N47m77J63q4J54L6l57L60k07J55k6K3
7436A15p2J80k20P3J58k30KJ8Ml1j46K99j36r9L12k58r8J31J61k65L3O3n8R4j66
7461a36J46K63l38K40k97L9J25j05L4J07k97J02P9J77l3j5j94K8j22J17L1j08
7483a57J68J16j67p2l0M52k76n2J55j7j3J89k00o4j57J86l6q5N0j1%N2l2J16O9
7508A84k4J7m40K06k27K96j71K91k73k70L04K26r4l37K94N1J66j63k30K80k21
7529a35J5L64j37k23mJ61r4Q6L57m42j78N7K93j43K77k40j78K3J94k17l7K55p8
$$ plain form
7552 -24 -31 -55 120 -64 -186 -53 102 35 24 183 64 269 273 8 80 80 -1 12 -1 74 -119 183 158 -320 -120
7577 -120 -9 8 -207 31 45 -7 56 -30 122 -148 61 -17 -197 -174 154 -2 50 -92 50 19 -164 106 -205
7600 -205 88 125 47 -21 -24 -35 177 137 -7 -6 -96 -3 -101 54 117 63 -119 -34 171 -56 204 196 89 310 94 -64
7626 -64 -172 67 -284 -76 170 81 17 2 201 -203 277 53 -35 201 194 -17 -221 96 -8 -10 -63 110 153 40
7650 40 -248 4 247 -121 64 -122 -35 -62 7 24 2 75 9 151 210 -208 60 27 59 -95 -127 33 49 81 37
7675 37 -34 -158 110 26 24 86 -66 -175 112 -11 -99 -9 167 8 -16 -2 -63 155 33 22 -46 -36 11 -206 190
7700 190 5 184 -34 72 170 -197 25 96 30 56 -297 -220 -88 -22 224 -137 105 -102 -136 -215 45 -144 -69
7723 -69 18 274 93 -121 -59 16 -155 104 172 -41 5 -91 -87 -8 79 -97 -111 62 -27 151 181 -9 -77 25 -126
$$ packed form
7552b4pk4J75j84j22J33J55o7j1J59j19K05Mk65P2%q1J3j3P5j93L02k5m78K00
7577a20J11J7k15K38J4n2O3q6J52k70K09p8j80K3L28j56N2j42J42l1j83K70l11
7600b05K93L7p8o8lj1K12m0j44Jr0R3r8J55O3n4j82Q5K05k27K60qj07K21k16j58
7626f4j08K39l51K08K46q9o4j5J99m04M80k24q8K36pk11k04L17j04kn3J73M3j13
7650D0k88K52K43l68J85j86Q7k7O9J7k2P3o6J42N9m18K68l3L2j54l2J60J6L2m4
7675C7p1j24K68q4kO2j52j09K87j23q8R0J76j59k4J4o1K18j22j1o8J0M7k17L96
7700A90j85J79k18J06R8l67K22P1o6K6l53P7J32O6K46l61K42k07l4p9K60j89P5
7723f9Q7K56j81k14O2P5j71K59O8k13M6r6MP9Q7j76j4J73q9J78L0j90o8J02j51
$$ plain form
7748 -126 -122 -25 145 231 -3 50 217 50 -64 -84 185 160 142 -35 -86 -173 -223 82 159 28 -158 -133 1 -159
7772 -159 1 -9 48 -45 -138 -143 38 -159 -41 -67 69 19 6 23 157 83 -159 -52 300 78 -65 88 -183 -251
7796 -251 -1 -14 -16 176 -103 83 99 112 83 -31 3 -57 118 91 -278 -13 -35 36 201 -94 -72 261 327 -20
7820 -20 -95 -137 -53 -107 -123 -10 14 -100 -159 -105 -15 57 -55 106 -130 180 141 -141 -267 26 188 -115 51 69
7844 69 -68 128 176 108 -48 -84 283 -14 70 225 -50 -280 28 45 -99 43 312 -110 -59 -20 -227 322 -24
7867 -24 -205 -108 -41 -71 -1 -210 -126 140 210 -77 -9 -146 221 -104 11 11 -263 291 -103 88 -49 130 110 -225
7891 -225 -97 232 110 -45 80 34 -228 -143 21 -27 20 -64 -30 -48 -231 -38 -50 59 109 77 -156 1 -84 154
7915 154 -72 -103 -137 58 -65 -66 -154 217 84 85 -50 -99 -38 -9 116 -199 -167 -304 45 90 153 -14 116 -28
$$ packed form
7748a26MR7J70Q6k34N3J67j67j14k0K69k5j8j77n1q7n0L05P7j31j86K5J34j60
7772a59J60j0N7r3r3nJ81j97J18k6J36n0j3J7J34p4k42J07L52k22j43J53k71o8
7796b51K50j3kJ92k79J86J6J3k9j14L4o0J75k7l69K65k2P1J65k95K2L33O6l47
7820b0p5m2Q4n4j6J13K4j14n9N4R0P2j12J61k36L10l9k82j26K93J62l03J66J8
7844F9j37J96M8o8j56l6L67k97Q4J55k75k30L08J7j44J42K69m22N1L9k07N49l46
7867b4j81R7O7l0P0k09Q4K66P0k87O8j37L67l25J15%k74N54l94J91j37J79k0l35
7891b25J28L29j22j55J25m6k62Q5J64m8M7q4L4j8j83J93j2J09N0l2k33J57q5K38
7915A54k26l1l4J95j23jq8L71j33Jj35m9O1K9J25l15L2j37L49M5O3j67J30j44
$$ plain form
7939 -28 54 38 -141 -22 41 165 40 24 218 36 -18 -219 82 116 109 38 15 -4 -54 159 56 205 5 -209
7963 -209 20 38 48 72 -118 -207 -135 -101 97 80 59 81 24 144 2 -177 -134 21 148 42 -111 41 200 12
7987 12 56 15 -49 -12 -123 -126 -80 212 -15 107 208 -5 142 105 -309 -60 215 -128 216 85 244 -42 -1
8010 -1 -14 -274 255 172 56 -10 8 103 -66 -191 -8 -63 -70 -90 139 -47 -208 -154 -13 37 -82 33 33 -360 -95
8035 -95 -22 -70 -3 -3 88 -59 -74 -94 -75 -42 -12 -61 -151 184 -199 108 137 195 37 -51 191 62 -51 142 79 -140
8061 -140 -100 144 -79 -53 206 67 -54 135 137 -131 118 -289 -155 125 -231 105 -102 -134 12 34 15 -123
8083 -123 128 216 -99 47 224 112 -171 45 -81 -115 -380 100 165 -162 -228 51 -8 -9 -51 -39 27 74 50 -60
8107 -60 -43 75 116 -47 -82 132 81 39 46 -99 -73 248 -23 -106 45 280 309 -63 162 -15 70 -156 112 -53
$$ packed form
7939b8Q2j6j79J19O3J24j25j6J94j82n4k01L01L4pp1k3j9n0K13j03J49k00k14
7963b09K29J8J0K4j90q9P2L4J98j7k1K2n7J20j42j79M3J55J27j06j53J52J59j88
7987A2M4m1o4L7j11lM6K92k27J22J01k13J47l7m14K49K75l43L44j31J59k86M1
8010aj3k60N29q3j16o6J8R5j69j25J83n5pk0K29j86j61N4J41N0j19J15%l93K65
8035i5P3m8O7%R1j47j5k0J9L3L0m9r0L35l83L07K9N8j58q8K42j29j13J93o3k19
8061a40M0K44k23K6K59j39j21J89Kk68K49m07J34K80l56L36k07l2J46K2j9j38
8083a23K51Q8l15J46J77j12k83K16j26l4k65M80O5l27o6K79n9jm2J2O6M7k4j10
8107f0J7J18M1j63l5K14n1m2Pj45K6L21k71q3J51K35K9l72K25j77Q5k26K68j65
$$ plain form
8131 -53 -134 28 75 156 35 141 -92 -142 79 1 -46 -21 -71 75 173 32 86 -33 -279 -114 -6 63 -14 -5 103
8156 103 77 -227 -172 8 31 261 105 -118 65 -122 291 -97 -40 -115 13 259 -13 -101 -143 45 142 -67 -14
8179 -14 1 182 -79 48 52 55 -42 117 -42 13 -275 221
$$ packed form
8131e3q1J62M7Q1j21J06k33n0K21p8m7K5n0J46R8j41N4j19k46J65J08O9p7RJ08
8156A03k6l04N5J80K3K30j56k23J83j87M13l88N7p5J28K46k72q8m2J88R7k09N3
8179a4J5J81k61J27MLr7J59j59N5k88M96
8191B21
$$ Imaginary data points
##PAGE= N=2
##DATA TABLE= (X++(I..I)), XYDATA
$$ plain form
0 0 0 0 0 0 0 0 0 0 0 0 0 -8 6 -8 8 -8 16 -16 16 -24 31 -32 40 -48 56 -64 77 -88 102 -117 133 -153 173 -198
34 -198 223 -252 285 -318 357 -397 443 -491 547 -605 669 -739 817 -900 994 -1095 1209 -1332
52 -1332 1466 -1619 1789 -1981 2200 -2452 2741 -3088 3501 -4011 4657 -5508 6688 -8439 11335
67 11335 -17002 32339 -162541 -433440 64572 359816 17575 -24938 266300 303966 98502
78 98502 15216 33063 -162635 -71110 79282 35992 -133606 35855 226097 35292 -139934
89 -139934 -89474 6289 -101551 -81826 -5023 -53983 -54665 48499 61732 -143847 -137275 27059
101 27059 57643 -53535 -5568 136003 113662 81460 66538 15653 -63025 -1599 52158 -49867
113 -49867 -71168 65572 131599 -14 -29965 37686 8288 -72299 -41013 21895 -53808 -84287
$$ packed form
0@%%%%%%%%%%%qJ4j4J6j6K4l2L2m0N5o3P2q8J04j20J41j65J90k19K50k86L26l71
34a98M21m75N37o03O75p54Q40r34J038j152J274j408J556j717J894k089K304k541
52a332K798l085L408l770M181m652N193n829O589p512Q668j0165J2196j5127J9774
67A1335k8337M9341j94880k70899M98012K95244l42241m2513K91238L7666k05464
78I8502q3286J7847j95698R1525J50392m3290j69598J69461J90242j90805j75226
89a39934N0460R5763j07840J9725P6803m8960o82J03164J3233k05579O572J64334
101B7059L0584j11178M7967J41571k2341l2202j4922n0885p8678O1426N3757j02025
113d9867k1301J36740O6027j31613k9951O7651k9398q0587L1286O2908p5703l0479
$$ plain form
125 -84287 15599 60571 -75171 -154880 -37046 55868 -32163 -132196 -6520 157286 125050
136 125050 -2112 14918 121608 93198 -23395 -67765 -28369 -8717 2464 -3228 -33943
147 -33943 -3376 82036 83669 -29235 -45972 52711 46259 -72217 -87587 -16580 -39972 -89001
159 -89001 -55142 -24174 -54051 -17808 69383 43363 -13061 50391 109943 32292 -24083 29870
171 29870 49666 -3774 -5588 28412 -1239 -9886 36549 9184 -59327 -15778 49131 -24648
183 -24648 -90300 -4669 45879 -61624 -97522 12257 27603 -65021 -43384 61728 49098
194 49098 -13848 26965 73557 19757 -10555 27439 13201 -25605 4330 28412 -19644 -30159
206 -30159 26341 13586 -53852 -26674 39395 6341 -36796 15001 54420 3114 -31816 1264
$$ packed form
125h4287R9886M4972j35742p9709J17834R2914q8031j00033J25676J63806l2236
136A25050j27162J7030J06690k8410j16593m4370L9396J9652J1181n692l0715
147c3943L0567Q5412J633j12904j6737R8683o452j18476j5370P1007k3392m9029
159h9001L3859L0968k9877L6243Q7191k6020n6424O3452N9552p7651n6375N3953
171B9870J9796n3440j814L4000k9651q647M6435k7365o8511M3549O4909p3779
183b4648o5652Q5631N0548j07503l5898J09779J5346r2624K1637J05112j2630
194D9098o2946M0813M6592n3800l0312L7994j4238l8806K9935K4082m8056j0515
206c0159N6500j2755o7438K7178O6069l3054m3137N1797L9419n1306l4930L3080
$$ plain form
218 1264 1509 -44481 -45069 -13331 -14222 -13134 18022 28715 14325 21025 38151 15412 -13828 702
232 702 11876 -11635 -19135 2442 5475 -9642 -2043 15076 1057 -12490 12131 24902 -5938
245 -5938 -21158 3657 14256 -16704 -35437 -10333 9058 -5473 -14625 574 16486 17046 8014
258 8014 2988 3211 8198 9558 -5226 -17582 -3591 9088 -4685 -16588 -1399 13894 1049
271 1049 -6915 9443 12023 -4622 -1578 11716 1573 -14635 -3770 12449 -1807 -15131 319
284 319 11134 400 -4577 1184 1202 -905 2155 -971 -12065 -5661 8655 -2407 -17474 -3383
298 -3383 12593 1032 -11404 1942 13566 2076 -2480 10139 9593 -70 4376 9674 1172 -6537
312 -6537 1323 5204 -6582 -8301 2130 911 -5449 -2302 10 -4518 -5862 92 -1780 -10278 -3621
$$ packed form
218A264K45m5990n88L1738q91J088L1156J0693j4390O700J7126k2739k9240J4530
232G02J1174k3511p500K1577L033j5117P599J7119j4019j3547K4621J2771l0840
245e938j5220K4815J0599l0960j8733K5104J9391j4531r152J5199J5912N60r032
258H014n026K23M987J360j4784j2356J3991J2679j3773j1903J5189J5293j2845
271A049p964J6358K580j6645L044J3294j0143j6208J0865J6219j4256j3324J5450
284C19J0815j0734m977N761J8k107L060l126j1094O404J4316j1062j5067J4091
298c383J5976j1561j2436J3346J1624j1490m556J2619n46r663M446N298q502p709
312f537P860L881j1786j719J0431j219o360L147K312m528j344N954j872q498O657
$$ plain form
327 -3621 6447 -1587 -9364 -530 6710 -1391 -7534 2544 9929 4648 5448 13602 11495 6868 8051
342 8051 6414 -2332 -7208 -2471 -3362 -9287 -5238 866 -1457 -3452 -2010 -5509 -11130 -10401 -5910 -8728
358 -8728 -10960 304 10246 7909 5759 9290 12009 7768 290 -1380 1019 2837 4482 2996 3901
373 3901 8579 7286 972 -4215 -6995 -7992 -10231 -11191 -8954 -6634 -2279 2375 2606 3431 4234 1781
389 1781 1958 2750 -2046 -7528 -3975 2926 -1882 -10224 -1580 9006 5035 2128 8252 11613 10686 12012
405 12012 9561 -1878 -4798 4400 -3260 -22134 -17399 -416 -2155 -10147 -2076 8365 5829 3109
419 3109 2336 -9886 -15603 -2705 -1154 -13600 -5685 17976 21244 8709 10497 14991 2578 -5193
433 -5193 -2290 -10047 -14117 4451 14700 329 -2291 14529 8334 -18099 -16187 -1999 -15263
$$ packed form
327c621J0068q034p777Q834P240q101o143J0078P385n281Q00Q154k107m627J183
342H051j637q746m876M737q91n925M049O104k323j995J442l499n621P29M491k818
358h728k232J1264R942k337k150L531K719m241p478j670K399J818J645j486R05
373C901M678j293o314n187k780r97k239r60K237K320M355M654K31Q25Q03k453
389A781J77P92m796n482L553O901m808q342Q644J0586l971k907O124L361r27J326
405A2012k451j1439k920R198p660j8874M735J6983j739p992Q071J0441k536k720
419C109p73j2222n717J2898J551j2446P915K3661L268j2535J788M494j2413p771
433e193K903p757m070J8568J0249j4371k620J6820o195k6433J912J4188j3264
$$ plain form
446 -15263 -21081 4939 15540 -2703 -2526 17387 9104 -15361 -11272 2278 -3088 -1344 10698
459 10698 7156 2676 16026 17996 -7180 -14746 8748 11758 -9913 -10208 2052 -2596 -9139 -9638
473 -9638 -20694 -24174 1835 17403 -3721 -3597 36493 41835 2176 -7106 11837 812 -21037
486 -21037 -12487 -5496 -18954 -6918 17316 -2544 -26083 1119 22166 -7444 -21705 8282
498 8282 19939 -2386 -4144 9329 3147 1109 14238 11429 1805 11794 13802 -7437 -15853 -7192
512 -7192 -18787 -32168 -7684 11347 -7556 -7609 24460 22795 -10969 -11468 9073 -2727 -13957
525 -13957 10579 17941 -2297 9546 31956 267 -37127 -13865 11802 -18168 -33349 6446
537 6446 27656 8940 5625 11945 -2453 -7341 6847 -2872 -21108 3100 31776 7629 -18425
$$ packed form
446a5263n818K6020J0601j8243J77J9913q283k4465M089J3550n366J744J2042
459A0698l542m480J3350J970k5176p566K3494L010k1671k95J2260m648o543m99
473i638j1056l480K6009J5568k1124J24M0090N342l9659r282J8943j1025k1849
486b1037Q550O991j3458J2036K4234j9860k3539K7202K1047k9610j4261K9987
498H282J1657k2325j758J3473o182k038J3129k809r624R989K008k1239q416Q661
512g192j1595j3381K4484J9031j8903n3L2069j665l3764m99K0541j1800j1230
525a3957K4536P362k0238J1843K2410l1689l7394K3262K5667k9970j5181L9795
537F446K1210j8716l315O320j4398m888J4188r719j8236K4208K8676k4147k6054
$$ plain form
550 -18425 -2711 1737 -18634 -17979 -5742 -7585 5936 35277 21546 -13805 1809 22835 -18633
563 -18633 -49814 -10683 15611 -9833 -5146 35193 28488 -5101 6851 18774 -16665 -28731
575 -28731 6830 13573 -9563 2209 24053 3301 -15635 240 -3279 -29463 -16497 12248
587 12248 -578 -17781 1099 10463 -8395 -11016 3659 73 2352 27335 25049 -867 8311
600 8311 29237 3795 -27364 -9009 11925 -6550 -13473 6497 1825 -14732 -2418 1554 -26528
613 -26528 -26319 11975 15883 -14589 -3274 31893 19117 -10686 -3967 5967 -5037 -4198 6267
626 6267 -1544 -4299 14047 10659 -16357 -12076 9523 449 -11066 8961 18907 2633 1762 11906
640 11906 -5886 -23301 -6574 2203 -13745 -8036 15348 10705 -4676 2865 5505 -16207 -19503
$$ packed form
550a8425J5714M448k0371O55J2237j843J3521K9341j3731l5351J5614K1026m1468
563a8633l1181L9131K6294k5444M687M0339o705l3589J1952J1923l5439j2066
575b8731L5561O743k3136J1772K1844k0752j8936J5875l519k6184J2966K8745
587A2248j2826j7203J8880R364j8858k621J4675l586K279K4983k286k5916R178
600H311K0926k5442l1159J8355K0934j8475o923J9970m672j6557J2314L972k8082
613b6528K09L8294L908l0472J1315L5167j2776k9803O719R934j1004Q39J0465
626F267p811k755J8346l388k7016M281K1599r074j1515K0027R946j6274q71J0144
640A1906j7792j7415J6727Q777j5948N709K3384m643j5381P541K640k1712l296
$$ plain form
653 -19503 1978 933 -12128 5285 24828 10947 -1968 7810 7453 -9101 -7289 5487 -905
666 -905 -4215 12786 13693 -6155 -7848 4209 -3235 -15839 -5959 4008 -3174 -1215 7763 -3248
680 -3248 -13071 -160 4203 -12277 -10526 13197 13619 -4004 1361 13791 2072 -6894 1639 2145
694 2145 -5098 2744 11418 1484 -3588 7974 5999 -11037 -8577 3411 -2679 -9439 186 5386
708 5386 -4557 -5155 4046 -834 -9074 -274 6778 -666 -1858 6550 4819 -3409 -1740 1689 -3901
723 -3901 -4131 4799 3625 -1764 4918 9626 1334 -3612 2473 3499 -4874 -4117 2427 -753 -4513 -497
739 -497 -208 -4680 -3387 901 -971 -3355 1496 4905 320 -813 2521 -161 -3682 -1631 -172 -3076
755 -3076 -2507 3169 3328 -957 1898 6140 3458 358 1860 2714 615 -623 111 -1118 -1636 670
$$ packed form
653a9503K1481j045j3061J7413J9543j3881j2915R778l57j6554J812J2776o392
666i05l310J7001R07j9848j693J2057p444j2604R880R967p182J959Q978j1011
680c248r823J2911M363j6480J751K3723M22j7623N365J2430j1719q966Q533N06
694B145p243P842Q674r934n072J1562j975j7036K460J1988o090o760R625N200
708E386r943n98R201m880q240Q800P052p444j192Q408j731q228J669L429n590
723c901k30Q930j174n389O682M708q292m946O085J026q373P57O544l180l760M016
739d97K89m472J293M288j872k384M851L409m585j133L334k682l521K051J459k904
755c076N69N676J59m285K855M242k682l100J502Q54k099j238P34j229n18K306
$$ plain form
771 670 -468 -3287 -1255 1107 -1471 -3408 -1415 78 -1974 -2212 506 -312 -2612 -1333 -607 -2093
787 -2093 -2011 -545 1669 3118 4489 6023 6020 6118 5328 1581 -1431 -1210 -2323 -4142 -4311 -2141 810 1026
805 1026 971 1587 543 -338 -2414 -4786 -5321 -4893 -4556 -3896 -3282 -641 1357 1875 2821 3837 4498 5840
823 5840 5513 4322 3935 3358 2911 432 -2563 -1741 -1067 -2181 -2174 -562 1381 1293 -469 -1175 -1969 -3361
841 -3361 -4473 -6221 -6026 -3317 -1528 -1020 -36 2209 3962 2539 853 2006 2620 2189 2926 3933 4852
858 4852 5235 5052 3621 912 -1038 -1862 -3601 -4246 -3267 -2143 -574 1248 982 -839 -2749 -3121 -4476
875 -4476 -8555 -8436 -4689 -2522 -778 2265 5305 7479 8571 7974 5193 3228 4510 3337 -453 -917
891 -917 878 358 -1029 -2337 -2459 -3148 -2468 -745 -2891 -3769 655 1319 -3253 -4611 -1725 -1912 -4152
$$ packed form
771F70j138k819K032K362k578j937J993J493k052k38K718q18k300J279P26j486
787b093Q2J466K214J449J371J534lR8p90l747l012K21j113j819j69K170K951K16
805A026n5O16j044q81k076k372n35M28L37O60O14K641J998N18R46J016O61J342
823E840l27j191l87n77m47k479k995Q22O74j114PJ612J943q8j762p06p94j392
841c361j112j748J95K709J789N08R84K245J753j423j686J153O14m31P37J007R19
858D852L83j83j431k709j950q24j739o45R79J124J569J822k66j821j910l72j355
875d476m079J19L747K167J744L043L040K174J092n97k781j965J282j173l790m64
891i17J795n20j387j308j22o89O80J723k146q78M424O64m572j358K886j87k240
$$ plain form
908 -4152 -2253 1341 1175 2730 6547 4540 -116 1719 3001 -2432 -4931 -395 2014 -297 2485
923 2485 6490 2921 1035 5489 2580 -3946 -2791 1758 -1715 -6232 -1985 -214 -5195 -3629 1024
938 1024 -4056 -7744 -887 2206 -5814 -6632 4490 6381 -510 3712 11021 7031 2905 6208 3484
953 3484 -5090 -3482 2958 -3240 -8714 1110 7003 -1103 -3919 2209 -226 -6401 -3591 -1161 -5218
968 -5218 -2058 6956 1881 -5012 1938 4853 -5059 -6957 2388 2735 -2384 4399 10354 401 -3105
983 -3105 5182 1413 -9480 -3921 6760 1883 -2803 6375 7663 -4203 -5430 1251 -5119 -10830
997 -10830 -922 6912 2357 2126 8324 4877 -3709 -3368 -4389 -11076 -7061 2541 153 -3096 5484
1012 5484 8884 -1784 -5323 1679 -747 -5250 3224 8006 238 2088 11138 4107 -7927 -591
$$ packed form
908d152J899L594j66J555L817k007m656J835J282n433k499M536K409k311K782
923B485M005l569j886M454k909o526J155M549l473m517M247J771m981J566M653
938A024n080l688O857L093q020q18J1122J891o891M222P309l990m126L303k724
953C484q574J608O440o198n474R824N893q106k816O128k435o175K810K430m057
968e218L160R014n075o893O950K915r912j898R345L47n119O783N955r953l506
983c105Q287l769j0893N559J0681m877m686R178J288j1866j227O681o370n711
997a0830R908P834m555k31O198l447q586L41j021o687M015R602k388l249Q580
1012E484L400j0668l539P002k426m503Q474M782p768J850R050p031j2034P336
$$ plain form
1026 -591 9871 207 -5789 5921 7582 -5738 -7408 -2289 -10009 -16020 -5363 129 -7433 -2527
1040 -2527 11072 6660 -2981 3457 7397 -2718 -2853 7961 5724 -1389 6630 10007 -4221 -6707
1054 -6707 3952 -770 -9913 1690 11390 543 -2412 9588 3497 -14481 -8817 2055 -8579
1067 -8579 -13281 2786 7128 -5481 -3173 7078 -2002 -10656 2005 8120 -2876 330 14790
1080 14790 9772 -4097 -153 5329 -5014 -8284 4135 6616 1357 9203 14410 1924 -6217 -382
1094 -382 -4724 -17658 -13022 -38 -4369 -8371 2649 4287 -6507 -4623 4311 -1123 -5805 6677
1108 6677 12921 1600 681 10129 3068 -8300 -1357 5925 -699 496 12690 11535 1412 3895
1122 3895 5474 -7263 -12750 -5796 -7222 -13003 -6494 1088 -5194 -7616 654 588 -6636 -1185 7496
$$ packed form
1026e91J0462r664n996J1710J661j3320j670N119p720o011J0657N492p562M906
1040b527J3599m412r641O438L940j0115j35J0814k237p113Q019L377j4228k486
1054f707J0659m722r143J1603R700j0847k955J2000o091j7978N664J0872j0634
1067h579m702J6067M342j2609K308J0251r080q654J2661O115j0996L206J4460
1080A4790n018j3869L944N482j0343l270J2419K481n259P846N207j2486q141N835
1094c82m342j2934M636J2984m331m002J1020J638j0794J884Q934n434m682J2482
1108F677O244j1321r19R448p061j1368O943P282o624J195J2194j155j0123K483
1122C895J579j2737n487O954j426n781O509P582o282k422Q270o6p224N451Q681
$$ plain form
1137 7496 4043 2774 10277 8783 -708 -116 4023 -2804 -5637 5122 8434 2203 5328 11470 4494
1152 4494 -4417 -1222 -1714 -10739 -10395 -2184 -5300 -10763 -3845 -312 -7784 -7540 2164 2279 -2031 5043
1168 5043 11998 5101 1597 7093 3616 -5266 -1756 4451 426 -684 8830 10614 1782 2485 6798
1183 6798 -1316 -8556 -3483 -1900 -9589 -8998 -2205 -5687 -10875 -4163 533 -4879 -2765 7520 6874
1198 6874 1260 5350 9414 1152 -3125 2904 1846 -4172 219 6814 3182 1165 6779 7498 361
1213 361 -676 2671 -2223 -7240 -4629 -3764 -9169 -9303 -5068 -4795 -6756 -1371 4097 2866 3028 7215
1229 7215 6492 2108 1912 2350 -664 -2578 694 2033 -10 1938 5036 3437 1551 3235 2793 -225
1245 -225 -1210 -467 -2659 -5553 -4809 -5002 -7262 -6397 -3610 -2366 -1305 1967 3794 3661 4042 4400 2772
$$ packed form
1137G496l453j269P503j494r491N92M139o827k833J0759L312o231L125O142o976
1152D494q911L195m92r025L44Q211l116n463O918L533p472K44R704J15m310P074
1168E043O955o897l504N496l477q882L510O207m025j110R514J784q832P03M313
1183F798q114p240N073J583p689N91O793l482n188O712M696n412K114J0285o46
1198F874n614M090M064q262m277O029j058o018M391O595l632k017N614P19p137
1213C61j037L347m894n017K611Q65n405j34M235K73j961N385N468j231J62M187
1229G215p23m384j96M38l014j914L272J339k043J948L098j599j886J684m42l018
1245b25r85P43k192k894P44j93k260Q65K787J244J061L272J827j33L81L58j628
$$ plain form
1262 2772 446 960 460 -760 290 1672 1757 1976 3391 3349 1942 1543 1863 -440 -2156 -2086 -3181 -5330
1280 -5330 -5528 -5256 -5058 -4543 -2219 -169 406 2623 5044 4832 3838 4089 3479 888 -1003 -746 -1399 -2467
1298 -2467 -1333 375 1013 1714 2970 3050 1813 921 615 -1480 -3505 -3621 -3346 -4202 -3782 -2184 -887
1315 -887 -390 1112 2562 2655 2712 3238 2669 1493 1062 693 -554 -1672 -1233 -951 -854 -602 754 1530 1290
1334 1290 1514 1506 652 -473 -1116 -1935 -3082 -3324 -2195 -2006 -1691 -117 1245 1646 1952 2488 2863 1651
1352 1651 1275 1480 787 -588 -856 -978 -1415 -1659 -1739 -980 -560 209 531 922 1186 1305 21 -630 -1130
1371 -1130 -1999 -2049 -1629 -1412 -625 409 1989 2741 2279 2919 2722 1822 610 -206 -571 -1924 -2329 -1590 -1875
1390 -1875 -1886 -351 -23 -431 31 735 102 -456 352 322 -691 -379 656 -572 -715 1032 969 -241 846
$$ packed form
1262B772k326N14n00j220J050J382Q5K19J415m2j407l99L20k303j716P0j095k149
1280e330j98K72J98N15K324K050N75K217K421k12r94K51o10k591j891K57o53j068
1298b467J134J708O38P01J256Q0j237q92l06k095k025j16K75q56M20J598J297
1315h87M97J502J450R3N7N26n69j176m31l69j247j118M39K82R7K52J356P76k40
1334A290K24qq54j125o43q19j147k42J129J89L15J574J362M01L06N36L75j212
1352A651l76K05o93j375k68j22m37k44q0P59M20P69L22L91K64J19j284o51n00
1371a130q69n0M20K17P87J034J580P52m62O40j97r00j212q16l65j353m05P39k85
1390a875j1J535L28m08M62P04o33n58Q08l0j013L12J035j228j43J747o3j210J087
$$ plain form
1409 846 2800 2460 845 1842 1888 -727 -1489 -376 -1904 -3552 -1976 -352 -1232 -1719 830 1198 -1234
1426 -1234 -624 1011 -744 -847 1319 1177 -149 715 2221 230 -1479 600 1133 -748 438 2831
1442 2831 1825 348 1879 1858 -2111 -2427 217 -1080 -3397 -842 1373 -1141 -2111 488 -154 -3133
1458 -3133 -1170 1554 -487 -963 2637 2609 -905 -30 2009 -165 -1172 2145 2832 -181 1132 3752
1474 3752 279 -2807 83 165 -3687 -2551 1619 -150 -2655 943 1453 -3622 -3348 1209 -766 -3577
1490 -3577 1253 4842 620 -655 3396 1705 -2780 -380 2701 -490 -1168 3790 3312 -1677 -762 2214
1506 2214 -1848 -4348 135 1200 -1922 310 3658 486 -3290 -432 15 -5050 -3742 2510 1321
1521 1321 -1101 3278 5327 -1021 -2491 1976 73 -4373 27 4830 407 -1440 3746 1755 -5117
$$ packed form
1409H46J954l40j615R97M6k615p62J113j528j648J576J624q80m87K549L68k432
1426a234O10J635j755j03K166j42j326Q64J506j991j709K079N33j881J186K393
1442B831j006j477J531k1l969l16K644j297k317K555K215k514r70K599o42k979
1458c133J963K724k041m76L600k8l514Q75K039k174j007L317O87l013J313K620
1474C752l473l086K890Q2l852J136M170j769k505L598N10n075K74M557j975k811
1490c577M830L589m222j275M051j691m485K400L081l191o78M958m78m989R15K976
1506B214m062k500M483J065l122K232L348l172l776K858M47n065J308O252j189
1521A321k422M379K049o348j470M467j903m446M400M803m423j847N186j991o872
$$ plain form
1536 -5117 -2702 1854 -1458 -2981 3687 4875 -764 -60 3155 -1983 -6020 -1314 722 -3309 -885
1551 -885 4720 1952 -1946 1713 2106 -3889 -3350 2624 1021 -2213 2528 4960 -1172 -3098 1450 -895
1567 -895 -5541 -696 4381 822 303 5327 3620 -3172 -2127 976 -3453 -4897 1491 3112 -1297
1582 -1297 598 4359 -83 -4113 -654 1116 -3151 -1432 4432 2036 -2249 1023 1640 -4413 -4533
1597 -4533 1065 500 -2107 3420 6765 1532 -244 3411 379 -5700 -2426 1815 -1548 -2504 3783
1612 3783 3292 -2753 -1918 1940 -2716 -4804 1561 3141 -1475 -187 4156 -433 -5368 -1259 250
1627 250 -3831 -1848 4561 3618 284 3910 4736 -1018 -2614 1847 -319 -3438 274 3506 -253 -1620
1643 -1620 1844 244 -4462 -2058 1711 -1164 -2314 2411 2709 -2118 -1976 1054 -2556 -4914 -599
$$ packed form
1536e117K415M556l312j523O668J188n639P04L215n138m037M706K036m031K424
1551h85N605k768l898L659L93n995N39N974j603l234M741K432o132j926M548k345
1567h95m646M845N077l559n19N024j707o792J045L103m429j444O388J621m409
1582a297J895L761m442m030L459J770m267J719N864k396m285L272O17o053j20
1597d533N598n65k607N527L345n233j776L655l032o079L274M241l363r56O287
1612C783m91o045Q35L858m656k088O365J580m616J288M343m589m935M109J509
1627B50m081J983O409r43l334L626Q26n754j596M461k166l119L712L232l759j367
1643a620L464j600m706K404L769k875j150M725K98m827J42L030l610k358M315
$$ plain form
1658 -599 2245 -444 1224 5673 3354 -540 1373 2689 -1559 -1873 2052 1613 -1840 602 2513 -1927
1674 -1927 -3288 138 -467 -3532 -765 2343 -540 -1848 1467 -102 -3871 -2443 149 -1662 -2331
1689 -2331 2346 3436 932 1558 3843 1089 -1010 1133 1778 -538 31 2495 910 -1559 -429 307
1705 307 -2673 -2517 410 -177 -1794 299 1195 -1206 -2227 -381 -1012 -2952 -1025 1455 -45 -54 2686
1722 2686 2097 50 1139 2294 433 -572 1894 1878 -627 -94 1242 -481 -1823 -624 -187 -1531
1738 -1531 -1132 869 -94 -1515 -249 25 -1987 -1769 -151 -478 -1307 -150 1631 325 -46 1549 1407
1755 1407 41 799 2016 1021 74 1145 1264 -513 -554 796 -753 -1369 174 482 -902 -811 94 -294
1773 -294 -1681 -976 -259 -1184 -1100 -204 61 -310 302 819 446 25 994 1092 650 590 1252 745 378 607 542
$$ packed form
1658e99K844k689J668M449k319l894J913J316m248l14L925m39l453K442J911m440
1674a927j361L426o05l065K767L108k883j308L315j569l769J428K592j811o69
1689b331M677J090k504O26K285k754k099K143O45k316N69K464j585k469J130P36
1705C07k980J56K927n87j617K093Q96k401j021J846o31j940J927K480j500rK740
1722B686n89k047J089J155j861j005K466j6k505N33J336j723j342J199M37j344
1738a531L99K001r63j421J266K74k012K18J618l27q29J157J781j306l71J595j42
1755A407j366P58J217r95r47J071J19j777m1J350j549o16J543L08j384R1R05l88
1773b94j387P05P17r25Q4Q96K65l71O12N17l73m21R69R8m42o0O62n07l67K29o5
$$ plain form
1794 542 -300 -227 16 -58 -742 -305 -267 -447 -536 -259 -436 -815 -601 -448 -698 -915 -282 5 -15 89 27 199
1816 199 288 289 691 805 689 692 768 541 615 214 59 352 279 48 -132 -294 -623 -308 -72 -340 -408 -571 -404
1839 -404 -575 -559 -325 -79 -358 -416 -128 85 -127 420 377 223 815 650 541 697 500 592 297 489 359
1860 359 151 160 -8 -81 -64 -335 -142 62 66 -391 -20 -471 -925 -819 -427 -892 -640 -288 -144 -201 -55 834
1882 834 741 637 918 1269 822 740 914 748 -224 138 435 -34 -9 77 139 -107 -37 -29 -345 -605 -141 -551 -1111
1905 -1111 -941 -264 -1013 -896 -56 88 -302 27 883 559 99 877 947 208 -159 781 514 180 669 1097
1925 1097 557 -12 571 22 -662 -40 151 -799 -1001 -333 -579 -1417 -1021 -643 -1096 -1456 19 620 -108
1944 -108 686 1626 706 336 1045 967 -341 3 1461 968 -64 1200 1493 -233 -710 718 189 -979
$$ packed form
1794E42q42P3K43p4o84M37L8j80q9K77j77l79K14J53k50k17O33K87k0J04o2J72
1816A99Q9JM02J14j16LP6k27P4m01j55K93p3k31j80j62l29L15K36k68o8j63J67
1839d04j71J6K34K46k79n8K88K13k12N47m3j54N92j65j09J56j97R2k95J92j30
1860C59k08Rj68p3J7k71J93K04Mm57L71m51m54J06L92m65K52L52J44n7J46Q89
1882H34r3j04K81L51m47q2J74j66r72L62K97m69K5Q6O2k46P0Ql16k60M64m10n60
1905a111J70O77p49J17Q40J44l90L29Q56l24m60P78P0p39l67R40k67l34M89M28
1925A097n40n69N83n49o84O22J91r50k02O68k46q38L96L78m53l60J475O01p28
1944a08P94R40r20l70P09p8j308L44J458m93j032J264K93j726m77J428n29j168
$$ plain form
1962 -979 -39 822 -872 -1337 18 -937 -2523 -1478 -329 -1099 -928 1124 1297 -25 334 1296 -270
1979 -270 -604 921 1304 -24 575 2247 808 -602 959 815 -1476 -1129 1156 196 -1022 399 751
1996 751 -1350 -2014 -319 -1270 -2380 -748 1151 -129 -520 1786 1058 -1188 -472 1156 -600 -855 1734
2013 1734 2100 -187 397 1851 -87 -1495 204 917 -943 -135 2205 793 -1230 116 136 -2636
2029 -2636 -2689 350 -341 -1859 766 2287 -676 -1246 881 98 -2457 -445 2025 502 -297 2761
2045 2761 1904 -1616 -422 1392 -769 -1384 1545 2183 -65 502 2105 -939 -2746 -937 -321 -2516
2061 -2516 -1143 1538 447 -1027 633 1016 -1764 -1959 748 282 -1020 1194 3133 521 -687 1476
2077 1476 285 -2295 -517 1451 -92 -443 2683 2254 -796 -430 1058 -1350 -2740 -23 1156 -927
$$ packed form
1962i79R40Q61j694m65J355r55j586J045J149p70J71K052J73j322L59R62j566
1979b70l34J525L83j328N99J672j439j410J561j44k291L47K285r60j218J421L52
1996G51k101o64J695r51j110J632J899j280l91K306p28k246P16J628j756k55K589
2013A734L66k287N84J454j938j408J699P13j860Q08K340j412k023J346K0k772
2029b636n3L039o91j518K625J521k963n70K127p83k555K012K470j523p99L058
2045B761q57l520J194J814k161o15K929O38k248N67J603l044j807J809O16k195
2061b516J373K681j091j474J660L83k780j95K707m66j302K214J939k612j208K163
2077A476j191k580J778J968j543l51L126m29l050L66J488k408j390K717J179k083
$$ plain form
2093 -927 3 2094 -30 -2251 -525 -148 -2399 -1495 1517 1207 -802 1402 2366 -940 -1320 1325 490
2110 490 -1189 1023 2988 865 -249 1986 468 -2501 -1361 308 -1254 -1343 1442 1664 -1087 -518
2126 -518 864 -1468 -2550 -44 749 -842 446 2599 632 -1324 -66 426 -1877 -1330 1287 746
2142 746 20 1501 1996 -105 -771 1154 263 -1612 532 2272 211 -329 1373 289 -1996 -1612 -63
2159 -63 -1491 -2031 437 1128 -621 -183 1379 -330 -1662 -52 933 -732 -78 2129 1233 -615 651
2176 651 1093 -1093 -802 1132 803 -68 1026 2294 -27 -840 476 -234 -2253 -1102 567 -848 -1285
2193 -1285 783 416 -1674 -923 371 -653 -1382 872 1247 -162 356 1383 799 -533 643 1146 18
2210 18 369 1526 936 95 67 356 -1018 -1847 -573 -898 -1673 -502 522 -386 -767 172 314 -626 -333
$$ packed form
2093i27R30K091k124k221J726L77k251R04L012l10k009K204R64l306l80K645q35
2110D90j679K212J965k123j114K235j518k969J140J669j562q9K785K22k751N69
2126e18J382k332j082K506P93j591J288K153j967j956J258M92k303N47K617n41
2142G46p26J481M95k101o66J925q91j875K144J740k061n40J702j084k285L84J549
2159f3j428n40K468O91j749M38J562j709j332J610R85j665O54K207q96j848J266
2176F51M42k186K91J934l29q71J094J268k321q13J316p10k019J151J669j415m37
2193a285K068l67k090P51J294j024p29K254L75j409N18J027n84j332J176N03j128
2210A8L51J157n90q41k8K89j374q29J274l25p75J171J024r08l81R39J42r40K93
$$ plain form
2229 -333 780 36 -533 458 797 -620 -729 184 207 -431 670 1253 675 1053 1713 1142 -104 318 273
2248 273 -1066 -894 -338 -791 -1354 -787 -306 -1042 -1026 10 -289 -504 167 178 28 -139 487 206 -62 213
2268 213 883 698 761 1254 1124 750 572 787 365 -751 -276 -381 -1166 -1048 -610 -823 -932 -580 -237 -225
2288 -225 -255 218 475 -2 93 93 -156 -9 64 60 -139 371 845 878 679 1217 975 539 353 388 -263 -855 -969
2311 -969 -853 -1351 -1151 -478 -601 -494 -271 72 213 410 352 393 -210 -288 -139 -31 -278 103 19 335 677
2332 677 1040 856 552 535 731 209 -263 -253 -930 -831 -914 -884 -659 -758 -74 202 -90 501 533 488 273 -11 -129
2355 -129 -304 -95 -198 -117 -123 145 577 872 619 758 537 503 238 -191 -194 -626 -651 -922 -969 -719 -549 -299 -174
2378 -174 125 344 430 569 662 304 60 100 -344 -165 -51 -173 -348 -40 20 547 430 577 337 -50 7 -76
$$ packed form
2229c33J113p44n69R91L39j417j09R13K3o38J101N83n78L78O60n71j246M22m5
2248B73j339J72N56m53n63N67M81p36J6J036k99k15O71J1j50j67O26k81k68K75
2268B13O70j85O3M93j30l74j78K15m22j116M75j05p85J18M38k13j09L52L43J2
2288b25l0M73K57m77R5%k49J47P3mj99N10M74L3j99N38k42m36j86L5o51n92j14
2311i69J16m98K00O73j23J07K23L43J41J97n8M1o03p8J49J08k47L81q4L16L42
2332F77L63j84l04j7J96n22m72J0o77R9q3L0K25r9O84K76k92N91L2m5k15k84j18
2355a29j75K09j03Q1oK68M32K95k53J39k21l4k65m29lm32k5k71m7K50J70K50J25
2378a74K99K19Q6J39R3l58k44M0m44J79J14j22j75L08O0N27j17J47k40l87N7q3
$$ plain form
2400 -76 -493 -825 -865 -763 -649 -506 -37 115 97 760 884 595 565 692 321 -53 -177 93 -552 -435 24
2421 24 279 -150 -67 1015 605 284 250 629 -313 -316 -259 -581 -1073 -483 -98 -357 -88 392 666 -15 640 1038
2443 1038 492 317 600 397 -356 -237 63 -549 -832 -53 290 -289 11 688 241 -344 36 -42 -894 -881
2463 -881 -61 -260 -826 -235 643 79 -19 938 810 294 534 1393 501 92 506 89 -775 -574 -120 -724
2483 -724 -831 170 360 -330 26 373 -187 -846 -48 -118 -715 -503 556 19 -357 719 650 -180 13 960
2503 960 796 -18 742 1131 -173 -598 150 -267 -1316 -753 184 -278 -402 828 728 -557 -388 226 -867
2522 -867 -1418 -155 314 -712 -44 966 177 -403 438 978 -59 724 1792 1212 145 1005 854 -793
2540 -793 -1209 -398 -644 -1487 -378 767 -360 -1023 656 45 -1462 -606 679 -130 -352 1207 1055 -126
$$ packed form
2400g6m17l32m0J02J14J43M69J52j8O63J24k89l0J27l71l74j24K70o45J17M59
2421B4K55m29Q3J082m10l21l4L79r42lN7l22m92N90L85k59K69M80K74o81O55L98
2443A038n46j75K83k03p53J19L00o12k83P79L43n79L00O77m47n85L80p8q52J3
2463h81Q20j99n66N91Q78n64r8R57j28n16K40Q59q92m09M14m17q64K01M54o04
2483g24j07J001J90o90L56L47n60o59P98p0n97K12J059n37l76J076o9q30J93R47
2503I60j64q14P60L89j304m25P48m17j049N63R37m62j24J230j00j285J69O14j093
2522h67n51J263M69j026O68J010p89n80Q41N40j037P83J068n80j067Q60j51j647
2540g93m16Q11k46q43J109J145j127o63J679o11j507Q56J285q09k22J559j52j181
$$ plain form
2558 -126 -125 617 -249 -1018 570 1133 98 146 1086 241 -932 -98 383 -696 -782 806 751 -347 408 935
2578 935 -665 -1271 -213 -344 -1396 -235 1066 -80 -449 703 219 -951 -729 734 -163 -457 972
2595 972 1687 -71 184 970 -354 -1590 -96 354 -639 -216 1405 496 -898 164 179 -1164 -1268 518
2613 518 185 -442 510 1002 -507 -685 103 -321 -1401 -164 790 -67 -97 1106 755 -442 -103 885 76
2632 76 -249 701 1236 -34 88 643 -707 -1583 -697 -411 -1284 -680 684 522 -167 391 770 -329 -771
2651 -771 743 514 -316 535 983 -40 -563 -147 114 -1115 -213 866 -20 -434 757 725 -622 -230
2669 -230 632 -241 -427 637 904 -61 231 868 36 -1208 -444 -407 -1042 -946 67 249 -489 235 471 -367
$$ packed form
2558a26JP42q66p69J588N63j035M8R40q45j173Q34M81j079q6J588n5j098P55N27
2578I35j600o06J058j31j052J161J301j146l69J152m84j170K22J463q97k94J429
2595I72P15j758K55P86j324j236J494M50r93M23J621r09j394J062J5j343j04J786
2613E18l33o27R52M92j509j78P88m24j080J237R54q57l0J203l51j197L39R88q09
2632G6l25R50N35j270J22N55j350q76Q86K86q73O04J364j62o89N58L79j099m42
2651g71J514k29q30Q51M48j023n23M16K61j229R02J079q86m14J191l2j347L92
2669b30Q62q73j86J064K67r65K92O37q32j244P64L7o35R6J013J82p38P24K36q38
$$ [...]
8191i4
##END NTUPLES=NMR FID
##END=
