##TITLE=1H_Pr 5148-EA
 CDCl3
 8 sc, 
 25.1.2023
##JCAMPDX= 6.0         $$ Bruker NMR JCAMP-DX V2.0
##DATA TYPE= NMR FID
##DATA CLASS= NTUPLES
##ORIGIN= UXNMR, Bruker Analytische Messtechnik GmbH
##OWNER= root
$$ XWIN-NMR		Version 3.5
$$ Wed Jan 25 16:27:49 2023 Russian Standard Time (UT+4h)  she@DPX200
##.OBSERVE FREQUENCY= 200.13135
##.OBSERVE NUCLEUS= ^1H
##.DELAY= (6, 6)
##.ACQUISITION MODE= SIMULTANEOUS
##.ACQUISITION SCHEME= undefined
##.AVERAGES= 8
##.DIGITISER RES= 18
##SPECTROMETER/DATA SYSTEM= spect
##.PULSE SEQUENCE= zg30
##.SOLVENT NAME= CDCl3
##.SHIFT REFERENCE= (INTERNAL, CDCl3, 0, 15.7039)
##AUDIT TRAIL= $$ (NUMBER, WHEN, WHO, WHERE, WHAT)
$$ ##TITLE= Audit trail, XWIN-NMR		Version 3.5
$$ ##JCAMPDX= 5.01
$$ ##ORIGIN= Bruker BioSpin GmbH
$$ ##OWNER= she
$$ F:/spectra/data/she/nmr/H-F/1/audita.txt
$$ ##AUDIT TRAIL=  $$ (NUMBER, WHEN, WHO, WHERE, WHAT)
(   1,<2023-01-25 16:26:32.35 +0400>,<she>,<DPX200>,
      <created by zg, POWCHK disabled, PULCHK disabled
       configuration hash MD5:
       00 E9 B6 7A A2 85 ED C7 34 08 36 98 17 FE 4E 26
       data hash MD5: 16K
       D3 42 3D 95 3C A4 02 CB D4 94 EA 69 34 5E 2D 30>)
$$ ##END=
$$ 
$$ hash MD5
$$ DE 77 D4 1B 19 4A 10 C4 C9 B2 DC 19 1C 8B 07 25
##$RELAX= 
##$RELAX= 
##$RELAX= 
##$RELAX= 
##$RELAX= 
##$RELAX= 
$$ Bruker specific parameters
$$ --------------------------
##$DU= <F:/spectra>
##$EXPNO= 1
##$NAME= <H-F>
##$PROCNO= 1
##$TYPE= <nmr>
##$USER= <she>
##$AMP= (0..31)
100 100 100 100 100 100 100 100 100 100 100 100 100 100 100 100 100 100 
100 100 100 100 100 100 100 100 100 100 100 100 100 100 
##$AQSEQ= 0
##$AQ_mod= 1
##$AUNM= <au_zg>
##$AUTOPOS= <>
##$BF1= 200.13
##$BF2= 200.13
##$BF3= 200.13
##$BF4= 200.13
##$BF5= 200.13
##$BF6= 200.13
##$BF7= 200.13
##$BF8= 200.13
##$BYTORDA= 1
##$CFDGTYP= 0
##$CFRGTYP= 5
##$CHEMSTR= <none>
##$CNST= (0..31)
1 1 145 1 1 1 1 1 1 1 1 1 1 1 1 1 1 1 1 1 1 1 1 1 1 1 1 1 1 1 1 1 
##$CPDPRG= <>
##$CPDPRG1= <>
##$CPDPRG2= <>
##$CPDPRG3= <>
##$CPDPRG4= <mlev>
##$CPDPRG5= <mlev>
##$CPDPRG6= <mlev>
##$CPDPRG7= <mlev>
##$CPDPRG8= <mlev>
##$CPDPRGB= <>
##$CPDPRGT= <>
##$D= (0..31)
0 1.2 0 0 0 0 0 0 0 0.06 0 0.03 0 0 0 0 0.0002 0 0 0 0 0 0 0 0 0 0 0 0 
0 0 0 
##$DATE= 1674649591
##$DBL= (0..7)
120 120 120 120 120 120 120 120 
##$DBP= (0..7)
150 150 150 150 150 150 150 150 
##$DBP07= 0
##$DBPNAM0= <>
##$DBPNAM1= <>
##$DBPNAM2= <>
##$DBPNAM3= <>
##$DBPNAM4= <>
##$DBPNAM5= <>
##$DBPNAM6= <>
##$DBPNAM7= <>
##$DBPOAL= (0..7)
0.5 0.5 0.5 0.5 0.5 0.5 0.5 0.5 
##$DBPOFFS= (0..7)
0 0 0 0 0 0 0 0 
##$DE= 6
##$DECBNUC= <off>
##$DECIM= 32
##$DECNUC= <off>
##$DECSTAT= 4
##$DIGMOD= 1
##$DIGTYP= 9
##$DL= (0..7)
0 120 120 120 120 120 120 120 
##$DP= (0..7)
150 150 150 150 150 150 150 150 
##$DP07= 0
##$DPNAME0= <>
##$DPNAME1= <>
##$DPNAME2= <>
##$DPNAME3= <>
##$DPNAME4= <>
##$DPNAME5= <>
##$DPNAME6= <>
##$DPNAME7= <>
##$DPOAL= (0..7)
0.5 0.5 0.5 0.5 0.5 0.5 0.5 0.5 
##$DPOFFS= (0..7)
0 0 0 0 0 0 0 0 
##$DQDMODE= 0
##$DR= 18
##$DS= 0
##$DSLIST= <SSSSSSSSSSSSSSS>
$$ [...]
##$SUBNAM2= <"">
##$SUBNAM3= <"">
##$SUBNAM4= <"">
##$SUBNAM5= <"">
##$SUBNAM6= <"">
##$SUBNAM7= <"">
##$SUBNAM8= <"">
##$SUBNAM9= <"">
##$SW= 18.05172834244
##$SWIBOX= (0..15)
0 0 2 0 0 0 0 0 0 0 0 0 0 0 0 0 
##$SW_h= 3612.71676300578
##$TD= 16384
##$TD0= 1
##$TE= 0
##$TE2= 300
##$TE3= 300
##$TEG= 300
##$TL= (0..7)
0 120 120 120 120 120 120 120 
##$TP= (0..7)
150 150 150 150 150 150 150 150 
##$TP07= 0
##$TPNAME0= <>
##$TPNAME1= <>
##$TPNAME2= <>
##$TPNAME3= <>
##$TPNAME4= <>
##$TPNAME5= <>
##$TPNAME6= <>
##$TPNAME7= <>
##$TPOAL= (0..7)
0.5 0.5 0.5 0.5 0.5 0.5 0.5 0.5 
##$TPOFFS= (0..7)
0 0 0 0 0 0 0 0 
##$TUNHIN= 0
##$TUNHOUT= 0
##$TUNXOUT= 0
##$USERA1= <user>
##$USERA2= <user>
##$USERA3= <user>
##$USERA4= <user>
##$USERA5= <user>
##$V9= 5
##$VALIST= <valist>
##$VCLIST= <CCCCCCCCCCCCCCC>
##$VD= 0
##$VDLIST= <DDDDDDDDDDDDDDD>
##$VPLIST= <PPPPPPPPPPPPPPP>
##$VTLIST= <TTTTTTTTTTTTTTT>
##$WBST= 1024
##$WBSW= 4
##$XGAIN= (0..3)
0 0 0 0 
##$XL= 0
##$YL= 0
##$YMAX_a= 284315
##$YMIN_a= -333625
##$ZGOPTNS= <>
##$ZL1= 120
##$ZL2= 120
##$ZL3= 120
##$ZL4= 120
##$ABSF1= 10
##$ABSF2= 0
##$ABSG= 5
##$ABSL= 3
##$ALPHA= 0
##$AQORDER= 0
##$ASSFAC= 0
##$ASSFACI= 0
##$ASSFACX= 0
##$ASSWID= 0
##$AUNMP= <proc_1d>
##$AZFE= 0.1
##$AZFW= 0.1
##$BCFW= 1
##$BC_mod= 2
##$BYTORDP= 1
##$COROFFS= 0
##$CY= 11.3945322036743
##$DATMOD= 1
##$DC= 2
##$DFILT= <>
##$DTYPP= 0
##$F1P= 2.36226072786647
##$F2P= -0.459571619588291
##$FCOR= 0.5
##$FTSIZE= 0
##$FT_mod= 4
##$GAMMA= 1
##$GB= 0.15
##$INTBC= 1
##$INTSCL= 1
##$ISEN= 128
##$LB= 0.24
##$LEV0= 0
##$LPBIN= 0
##$MAXI= 10000
##$MC2= 0
##$MEAN= 0
##$ME_mod= 0
##$MI= 1.114404
##$NCOEF= 0
##$NC_proc= 0
##$NLEV= 6
##$NOISF1= 3.799351
##$NOISF2= 2.8
##$NSP= 1
##$NTH_PI= 0
##$NZP= 0
##$OFFSET= 15.70392
##$PC= 1
##$PHC0= -19111.31
##$PHC1= 12.20079
##$PH_mod= 1
##$PKNL= yes
##$PPARMOD= 0
##$PSCAL= 0
##$PSIGN= 0
##$REVERSE= no
##$SF= 200.130013532006
##$SI= 16384
##$SIGF1= 3
##$SIGF2= 2
##$SINO= 400
##$SIOLD= 16384
##$SREGLST= <1H.CDCl3>
##$SSB= 0
##$STSI= 0
##$STSR= 0
##$SW_p= 3612.71676300578
##$SYMM= 0
##$S_DEV= 0
##$TDeff= 0
##$TDoff= 0
##$TI= <>
##$TILT= no
##$TM1= 0
##$TM2= 0
##$TOPLEV= 0
##$USERP1= <user>
##$USERP2= <user>
##$USERP3= <user>
##$USERP4= <user>
##$USERP5= <user>
##$WDW= 1
##$XDIM= 8192
##$YMAX_p= 0
##$YMIN_p= 0
$$ End of Bruker specific parameters
$$ ---------------------------------
##NTUPLES= NMR FID
##VAR_NAME=  TIME,          FID/REAL,        FID/IMAG
##SYMBOL=    X,             R,               I
##VAR_TYPE=  INDEPENDENT,   DEPENDENT,       DEPENDENT
##VAR_FORM=  AFFN,          ASDF,            ASDF
##VAR_DIM=   8192,          8192,            8192
##UNITS=     SECONDS,       ARBITRARY UNITS, ARBITRARY UNITS
##FACTOR=    0.0002768,     1,               1
##FIRST=     0,             0,               0
##LAST=      2.2672688,     0,               0
##MIN=       0,             -333625,         0
##MAX=       2.2672688,     284315,          0
$$ Real data points
##PAGE= N=1
##DATA TABLE= (X++(R..R)), XYDATA
$$ [...]
2070f06J219m29j055K026P11l127m71K744l47k671K587K240l811j201K949n69
2086A89n57N88M69q28o33k4L29J133K52j851K84K357k867p48L984m43l270Q06
2104h30K367j756j540K613J357k796J84O00q61M48K85j46J006m47k181O19K551
2121A473r54k256K492Q09m051M44L564n72k129J603O34j854l40J652L38l36K84
2138H01j445K53J480k074K90K623j506k382J343J721j657q41K707J36l343J202
2154f92J272j037J21N94j79K08p36o19R45J311o61j644J829P24l190J118K704
2171B068j593k041J382Q42j554m36J816N83j280NL35j04O58j180M74J549j873
2188c49j616K070R41j779l43K349n14k643J675J741j421m96M88L67p11p16O90
$$ plain form
2070 -606 613 184 -871 1155 1866 -1261 -1732 1012 665 -2006 581 2821 -990 -2191 758 189
2086 189 -368 220 689 -139 -772 -796 -467 666 918 -933 -649 1708 -1159 -1907 2077 1634 -1636 -830
2104 -830 1537 -219 -1759 854 2211 -585 -401 199 -662 -214 71 -75 931 484 -1697 -1078 1473
2121 1473 519 -1737 755 1564 -2487 -2043 1521 949 -1180 423 1057 -797 -1137 515 853 517 801
2138 801 -644 -391 1089 -985 -695 1928 422 -1960 -617 1104 -553 -1394 1313 1449 -1894 -692
2154 -692 580 -457 -336 258 79 287 -449 -1068 -123 1188 527 -1117 712 1436 -1754 -636 2068
2171 2068 475 -1566 -184 658 -896 -1332 484 1067 -213 -208 127 23 681 -499 -25 1524 -349
2188 -349 -1965 105 1046 -733 -1076 1273 759 -1884 -209 1532 111 -385 103 470 -241 -957 -267
2205b67Q55k36p37j01J620m48j393J454J632k368j209J983k60j438j32J651o36
2222c0j522P26J052m50k36L87L97Q8j066j05J410Pj262j7J854p46j642J896J249
2241A990j811j1Q52K53j127j142R11L34j586p8N82L44m08o40J564J152k017L58
2259d80J904l46j420J73J761j224j400J036R81r83k05M62R62q16j175R80O49j273
2277d14q80N77N61r34p72J840M15j752Q61J656k96n76K85J252l57j422J93M08
2295F45j76j190J49R91k25j558J184P34l35q65M21P76j022r52J087N35j179J85
2313g95P96P57o14o6J276M10j405m9J103p76j008n79J111n17j544J049Q29k47
2331b69o12N70J040m59j054J345M14j257m34M93Q62j073p6J010O25j135K27J131
$$ plain form
2205 -267 588 352 -385 -486 1134 686 -707 747 2379 11 -1198 785 525 -913 -1045 606 -30
2222 -30 -1552 -826 226 -224 -460 -73 324 412 -654 -759 651 658 -604 -621 1233 487 -1155 741 1990
2241 1990 179 168 1020 1273 146 -996 -85 249 -1337 -1415 -833 -489 -897 -1537 27 1179 -838 -480
2259 -480 1424 1078 -342 -169 1592 368 -1032 4 985 2 -203 259 1221 405 -770 210 859 -414
2277 -414 -1294 -717 -156 -1090 -1862 -22 393 -1359 -498 1158 862 286 571 1823 1466 44 237 645
2295 645 469 -721 -572 419 194 -1364 -180 554 219 -646 -225 551 -471 -1423 -336 199 -980 -795
2313 -795 1 758 144 78 1354 1764 359 310 1413 637 -371 -950 161 -356 -1900 -851 -22 -269
2331 -269 -881 -311 729 270 -784 561 975 -282 -716 -223 639 -434 -510 500 1125 -10 217 1348
2349A348l0j206n79J210o44j646J15R15l12j018L89J813m49m13J199P42l23q44
2367B67K29R03r70r35J069l1j156k22J151M92q83k84J201m56r58R1O53n60j085
2386a484j34J064k08n80J122J054j8n64M22J313p77q80P96o4q60m18KM54r72k94
2406a026J240J14r59j38Q69L02r80p45J676k71j359K59J361J16j176O65J541q51
2424F38m17J086K55p11q47R9M86r64j176Q52M18p22l29Q56J047j051m09J796R0
2443I97j671L55R53l36p91K81R49o65l06M73N17M01j062j40R49l40j386J90P88
2462A56o74j196R50J326j320j38J611j16q70N09M66J45m26k96M21l90l03p90R05
2481c0O62j342K26J458p94j397R87J006q98j088Q25M97j346P56R46k89q9k63R2
$$ plain form
2349 1348 1318 112 -467 743 99 -1547 -1432 -517 -829 -1847 -1458 355 -94 -507 692 1434 1111 267
2367 267 496 1399 429 -506 563 532 -624 -846 305 797 -86 -370 831 375 -583 -492 161 -399 -1484
2386 -1484 -1618 -554 -762 -1342 -220 834 816 252 674 1987 1210 330 1126 1062 202 -216 -214 240 -732 -1026
2406 -1026 214 328 -631 -769 100 402 -578 -1323 353 82 -1277 -1018 343 459 -717 -52 1489 638
2424 638 221 1307 1562 851 4 103 589 -375 -1551 -699 -281 -1003 -1332 -476 571 -480 -889 907 997
2443 997 -674 -319 634 298 -493 -212 737 72 -234 239 756 1157 95 -45 904 564 -822 -632 156
2462 156 -518 -1714 -764 562 -758 -896 715 599 -271 238 704 849 423 127 548 158 -145 -935 -30
2481 -30 632 -710 -484 974 180 -1217 -230 776 -122 -1210 -385 112 -1234 -478 468 179 90 -173 -81
2500h1J274n27n18R62P3j574q40J499N00j967L46J548j342n51J019P09m97p2L95
2519C56l63k48p6K57M31N51j558J17J617r66r59J781L43j338n90J205m21j311
2537a172J191K49q81l15M72N0L11O2j33L51L98j049l99J863M8j951N59J704j818
2556d60l51J737n2r24M5M09o13j29N70k0j90J34j258L91J465r96n14J521K8j864
2576a071K02J715k31j482J455N37j924J75J011l34L59j32n72O70l46m41N4J195
2594H40rj823O35J272j718M2K002n27j588M98P36k09p86J170k27m31J06n84J23
2613d78J075q50j24R79J5j546O93J496q93j276J300M78k130Q54J356o79k49L40
2631C61o08R6j76L35q7N35m46j028N00J201j439L63J541p53j362Q81R62r00l85
$$ plain form
2500 -81 1193 666 148 1110 1183 -391 -1231 268 768 -1199 -853 695 -647 -1198 -179 530 33 -39 356
2519 356 -7 -255 -331 -74 357 908 -650 -533 1084 118 -841 940 1283 -55 -645 560 139 -1172
2537 -1172 19 268 -613 -928 -456 -406 -95 -33 -166 185 583 -466 -865 998 1046 -905 -346 1358 -460
2556 -460 -811 926 874 -50 -5 404 -209 -338 232 212 22 156 -1102 -711 754 -242 -756 765 793 -1071
2576 -1071 -869 846 615 -867 588 1125 -799 -624 387 53 412 280 -292 378 32 -409 -355 840
2594 840 831 -992 -357 915 -803 -761 1241 714 -874 -376 360 151 -635 535 308 -123 -17 -601 -478
2613 -478 597 -253 -377 602 617 -929 -236 1260 367 -909 391 869 -1261 -407 949 270 21 361
2631 361 -247 -151 -327 8 -79 456 10 -1018 -518 683 -756 -393 1148 395 -967 -86 876 -24 -409
2650d09J141n41p12L27J34J66L40m13n30P85l31n54Q77O04j025j055J522j81j286
2669a141R01J149o27r01O48J89k37QJ71Oo3j69n65O71M40j195N08P69q22p10J073
2690A03O53r31k95J007p0j372Q90K96k89p7j31L09j12k58o4R13J41j362J4J151
2710E16m36j181J068M89j090m4J043k15l00m5N51K09p68N13l65O05n13j58L09
2729A88M93j016r0J012m17q87M62P20o00o17O75K04m97j83K14J73r1k21O38K43
2749D03k42NN5N80n11m39Q88k34q50K4M90l5o70JJ056p68m94P11L58l51m40p7
2771e40O68J34p31K56L62l26k78M40O35k69p56R04M10q52m26Q47m07k18l87P57
2791B23m68k89L36K62L76q07K05M41j9n66L39N26o04m77M06O61m18o61R39J86
$$ plain form
2650 -409 732 191 -521 -194 -60 106 446 33 -497 288 -43 -597 280 884 -141 -1196 326 145 -1141
2669 -1141 -240 909 282 -619 29 218 -19 -11 160 166 103 -66 -631 40 480 -715 -207 562 -260 -970 103
2690 103 756 -175 -470 537 467 -905 -15 281 -8 -85 -216 93 -19 -277 -341 572 713 -649 -635 516
2710 516 80 -1101 -33 456 -634 -678 365 150 -150 -195 356 565 -203 310 -55 550 37 -121 188
2729 188 681 -335 -425 587 170 -717 -255 465 -135 -752 -77 127 -370 -553 -339 -166 -257 -478 160 403
2749 403 161 166 221 801 290 -149 739 505 -345 -321 169 134 -536 -535 521 -247 -741 -30 328 -23 -463 -540
2771 -540 128 262 -469 -213 149 -177 -455 -15 620 351 -405 499 909 57 -369 478 71 -147 -534 223
2791 223 -245 -534 -198 64 440 -367 -162 279 260 -306 33 559 -45 -522 -116 545 127 -534 405 591
2811E91m97l90M42K95l71o21P64P1p85j33M68K55j69m10P18Qm58L81J17K2m20
2832a22j99O37k36n51K94N50l40m58K98O50k35q04M47R9l09l08O64K36n43k42
2852d72P91l45j56K97K27J85p20N4O06k44n34J13M21m03l17J18O69l84n12P79
2872A73M6o0m48K70M56n15k66M59K02m73M9L39L11o45j37Q27k45m21O7K61k30
2893B0n32L31M30j91m83N27K6j91j94N3L60Pl85J43M70k33o11M70L30l56j64L35
2915A62L39n74j51N84j80n49o7P62l37l78N10m7q2l82K37N46l83l55L64M38j24
2936C33q37O33N94r22l30Q56M8m92r2K44N62q26J13K77l7n6k33M19q8l53%L09
2958A22k47j93J27N42l40l07L32Q4l08KM54j06m7j43j6L84k89l84M74K37p23j21
$$ plain form
2811 591 94 -296 146 441 70 -551 213 284 -501 -634 -166 89 -80 -490 228 236 -222 159 276 298 -122
2832 -122 -321 316 80 -471 -177 373 33 -425 -127 523 288 -516 -69 30 -279 -587 77 313 -230 -472
2852 -472 319 -26 -182 115 342 527 -193 -139 467 223 -311 -198 223 -180 -497 -379 290 -94 -606 173
2872 173 219 159 -289 -19 437 -78 -344 115 317 -156 -107 232 543 -102 -239 588 343 -78 -11 250 20
2893 20 -512 -181 249 58 -425 102 128 -63 -257 -204 156 163 -222 -79 391 158 -453 17 347 -9 -173 162
2915 162 501 -73 -224 360 180 -369 -436 326 -11 -389 121 74 -8 -390 -153 393 10 -345 19 457 333
2936 333 -504 129 723 -199 -529 327 375 -117 -209 35 597 -229 -116 161 124 68 -165 254 166 -187 -187 122
2958 122 -125 -318 -191 351 11 -296 36 120 -188 -186 268 162 115 -28 -44 340 51 -333 141 378 -345 -466
2980d66M64R30j262n3J058l92n45K65K27k73k71K10J87k01J25j43L00%m38p9Q71
3001E14m02m02K97M00m14p29J141J7n67K8M17l65j53K48k28L02o3q0k8q2K14n35
3023d70O88M00j309K03J014l36o12Q46j16q11J37R88o33n20O66j41jj41l8J3M70
3044B97m35j34K90K46o24j98J127r9j055N65O75j176M61M60j60m73l2J92K12j66
3064b7J36K7K82m5j333N84R33o20o06J199j64q04K87O61k86m35M29j40m56K95
3084h3O8P2K12j76k37J86R2k37J17N30j85j100Q26L44j050K99Q02m70k24J48K92
3105B26r4j45L68k95J22r7l81O09L49j013J85L79P7r90O41N36o34k18P02l98l46
3126d17K18L87j60M0o36J88L07K74j41l6P20p03m79P82M38j178N78O9l25m05L81
$$ plain form
2980 -466 -2 928 -334 -387 671 279 -266 -1 226 -47 -318 -108 79 -122 3 -140 160 160 -278 -357 514
3001 514 112 -290 7 407 -7 -736 405 422 -145 -117 300 -65 -218 30 -198 104 41 -39 -67 -149 65 -470
3023 -470 218 618 -691 -488 526 190 -422 424 308 -503 -366 622 -11 -531 135 -6 -7 -148 -186 -173 297
3044 297 -138 -272 18 264 -360 -558 569 470 -585 -20 655 -521 -60 400 240 -233 -265 -73 139 -27
3064 -27 109 136 418 373 -960 -376 557 -63 -669 530 366 -438 -151 510 224 -211 218 78 -378 -83
3084 -83 -15 57 269 93 -144 42 134 -103 14 544 359 -741 85 429 -621 -322 480 10 -214 -66 226
3105 226 132 -13 355 60 182 85 -296 313 662 -351 -166 213 290 -700 -59 477 -157 -375 327 -71 -417
3126 -417 -199 188 28 68 -568 -380 -73 201 60 24 744 41 -438 344 782 -396 182 251 -74 -479 -98
3147i8K76k55j55K76l8l38K59M3j08M14n16K99J61m46q0N32L58p20r9O59j86m17
3169a79M90Oj51m81J21K3K94j62j24J80P9j76k51Q06k5q10J05P56o67m6L48Q7
3191B23k96j69O27l95k44N56k69K64j14q84Q24j25p4j05J65R2m30j25Q29k60n95
3212e05N26P2n2k73J40M13K7n25L64L8m70kn4L88J43o75N24J55n04K48J4K65k94
3235c7j44O44n56N1K41r2o3q0n5M85l78m65L90K79J02p20K51M64m04l98N46J5
3257G6J9m47M45J51l72J49K41k63J13k41K11K05m42q8L01j1k98L5M16Q9o81L06
3279h6O25p12m4L58J27l09l31K94L30l31r0M14k08k74J6L01K05m20k85Q67l91
3300E6j26M4j62L73m08J03L15l18j57J76M66n08j10K25L00j36l32M19k8k2m36
$$ plain form
3147 -98 178 -77 -232 44 6 -332 -73 -30 -138 276 -240 59 220 -226 -306 226 584 -136 -235 424 238 -179
3169 -179 311 317 166 -315 -194 -171 123 -39 -163 17 96 -80 -331 475 450 -360 -255 501 -166 -212 136 223
3191 223 -73 -242 385 -10 -254 302 33 297 183 -701 123 -2 -76 -181 -16 76 -354 -479 350 90 -505
3212 -505 21 93 41 -232 -92 321 348 -177 187 225 -245 -247 -301 87 230 -445 79 234 -270 -22 -8 257 -37
3235 -37 -181 463 -93 -42 199 107 44 -36 -91 394 16 -449 -59 220 322 -398 -147 317 -87 -485 61 76
3257 76 95 -352 93 244 -128 21 262 -1 112 -129 82 287 -155 -243 58 47 -251 -216 200 289 -392 -86
3279 -86 539 -173 -217 141 268 -41 -372 -78 252 -79 -169 245 37 -237 -221 80 285 -135 -420 447 56
3300 56 -70 -26 -188 185 -223 -120 195 -123 -280 -104 362 -146 -256 -31 269 133 -199 220 192 170 -266
3321b66J22O92o73j5O8R9Q1k56K87K0k77J40J51m37l9K76Q2K1j66K03J68l0j93
3344E8R7J24l49M6k35L23l23m1M91k00p1r9K03J92j88j50M47j00j83j47K08K22
3366C25m75l8O49l41m34M17J49l60k34K49J82k65r5J02K45k79m75R33J63m82k09
3387b73N00J28m73M9J40P4j06m3j2j10l0J07J33J38o34K82L31j90j99K53R5q0
3409H0oj54J63j21j10M9K50j57m8M91k44j39PJ18j02k39l40L89L17o83J9N10J80
3432B30m42J50K79k09j51J02L62j00l56M89j7k45l43N2L54m48P9K57Q8j66n08
3453e43L27M68n64K3N72k38l15j91Q10m14k64N53J10j55J16N6l71J91k09o0M72
3474C74k15m59J20M12k89k63L26L96p32J40J79j93o7J12K43L4l61L75J27l73L28
$$ plain form
3321 -266 -144 548 -125 -140 -72 27 108 -148 139 159 -118 22 173 -264 -303 -27 55 76 -90 113 281 251 58
3344 58 155 279 -70 -24 -259 64 -259 -300 191 -9 -80 -179 24 216 28 -122 325 225 42 -105 103 325
3366 325 -150 -188 461 120 -314 103 252 -108 -342 -93 89 -176 -271 -169 76 -203 -678 255 418 -64 -273
3387 -273 227 355 -118 -69 71 145 39 -4 -16 -126 -156 -49 84 222 -412 -130 201 11 -188 65 160 80
3409 80 74 -80 83 -38 -148 -99 151 -6 -54 437 193 54 61 179 77 -162 -502 -113 204 -479 -460 50 230
3432 230 -212 -62 217 8 -143 -41 321 221 -135 354 337 92 -251 -199 155 -293 -214 43 131 -35 -543
3453 -543 -216 252 -312 -289 283 45 -270 -461 349 -65 -329 224 334 179 295 351 -20 171 -38 -98 374
3474 374 159 -300 -180 232 -57 -320 6 402 -330 -190 -11 -204 -271 -159 84 118 -243 132 259 -114 214
3495B14k67L26K69p91J16L24l60Q9p5O6l24OK98L39m70K51J05k62K39j14J53J0
3517A42j11j78J67K71l56j60L70j03k54J87M02m84l3L25n7n02j9J94m0J77r3O3
3539i2J33J52n42K73N40l72nN5K31m83J5K29p1k55J49J63l47L71J11j61J5M8k58
3562a01L6N32m51j64K72l08j80N37J04j86j25L43k03l64K52J69l60J29Q8m18L72
3583b6Rk45K17J98k10k57N17o3k99j59N66k69k62M58K44n48M15P5l02j51J32M2
3605H2m9K45l09k15K61k84k19L55N10m93k88N46j42k63M45Jl78K19J09j25k1k07
3627b20K68J15J60l98J3N24k89m91N08j31l34k80O00l57r6M36n7j99p3M81o3n5
3649F2J95M4l24L1j39r6L20K95p18M22J98k06k59M12j31k47j28L13J03j96J22
$$ plain form
3495 214 -53 273 542 -249 -133 191 -169 -80 -155 -89 -413 -407 -109 230 -240 11 116 -146 93 -21 132 142
3517 142 31 -147 20 291 -65 -225 145 42 -212 -25 377 -107 -140 185 128 -374 -393 -199 -239 -62 -155 -92
3539 -92 41 193 -349 -76 464 92 87 142 373 -110 -95 134 63 -192 -43 120 -227 144 255 94 109 157 -101
3562 -101 -65 467 16 -148 124 -184 -364 173 277 91 -34 309 106 -258 -6 163 -197 -68 20 -398 -26
3583 -26 -17 -262 -45 153 -57 -314 203 140 -159 -318 248 -21 -283 175 419 -129 286 361 59 -92 40 82
3605 82 33 278 -31 -246 15 -269 -488 -133 377 -116 -404 142 0 -263 182 183 -195 24 133 8 -13 -220
3627 -220 48 163 323 -75 -62 462 173 -318 190 59 -275 -555 45 -312 -408 28 -29 -228 -301 180 117 62
3649 62 257 301 -23 8 -131 -227 93 388 -330 92 290 84 -175 237 106 -141 -269 44 147 -49 73
3670G3l8j75J53k24L64J40k36n61N49L60o00J4P14m50m43L34M92n04m60O03k07
3691a02q1r3N50l86M1L61n51L28q0l63L07M49m40n7K16K89n03K16J49k25r9L6
3713c8j6k49K10N8L20k94J20p9j6J01p9j12L49l03l48L97r4K00k82R1N6l63L56
3736a5J75k28J93j59K57m68K91k75L19K33j06l94K45Q4m40M97L7k73j20L55r2
3757A16p8k05K64J58k20j65J21j85M82k98nM4n7j99L55k26J18k08O53o42j41L77
3779E9K99n02j66L44O0J10l55q4K34J65m64K52j15M14m47J80J96o0l84K03J18
3800E7Pl39Q7J09M9J64m3j66j90K24K06J0j55KK4k04j04N1K04N1J1k9M16k71j42
3825B9M42m50K3k70L56M0n37L55J19j52J80l43K85K48m77K42J95j64k21J14K05
$$ plain form
3670 73 35 -140 13 -211 153 293 57 -504 45 405 -195 -181 533 83 -360 -26 466 -38 -498 105 -102
3691 -102 -183 -276 274 -112 -71 290 -261 67 -13 -376 -69 380 -60 -117 99 388 -115 101 250 25 -74 -38
3713 -38 -54 -303 -93 -35 285 -9 111 32 16 117 38 -74 275 -28 -376 21 -73 127 -155 -64 -8 -371 -15
3736 -15 160 -68 125 -34 223 -245 46 -229 90 323 217 -177 68 152 -288 209 246 -27 -147 208 116
3757 116 38 -167 97 255 35 -130 -9 -194 288 -10 -15 29 -28 -227 128 -98 20 -188 465 -177 -318 59
3779 59 358 -144 -310 34 94 204 -151 -235 -1 164 -300 -48 -163 251 -196 -16 180 120 -264 -61 57
3800 57 64 -275 -188 -79 -30 134 91 -75 -265 -41 165 175 20 22 46 -158 -262 -211 -7 44 55 26 442 171 29
3825 29 471 21 44 -226 130 170 -367 -12 107 -45 135 -208 77 325 -152 90 285 121 -100 14 219
3846B19l15J0o4L18k06J42J25o1o1r7mK04m06J81j68O8O9O8o9K01k18j77K62R1
3870A12l05J17L31Qk69K6O2J76l15J8K49j12k31K25K92l87k35O37k92j84l64L55
3892h6L93p13L07J11P7j59l5O2K86l47K29j12J20k63j4K21K5l33N0M46n61L65
3914F9J74r1l63J17J86p1j07O0P4j3m13J31M73P6p4j19N5k7l56N48m03J05j52
3937a21P3J72p2Kj69K03m8k86Q8K78k15K38m74M43jk40L63J5r1o5L2k5p5j45J81
3962F1mj36J03j19Q2k83J61J30k0%K02Nk41J04j95L56j87k57M71q8k12k03M59
3985A89k27pl7K8Q2Mo4n1K84k72k71N86j14l14j3K47r1n0K31J72l96J93O1P5q5
4010A60p4J38k91J17k97K17M24p07L45P2K04l05m15P14j08l24J17J85j52l2k41
$$ plain form
3846 219 -96 -86 -150 168 -38 104 229 168 107 10 6 210 -196 -15 -183 -115 -46 22 -47 154 -64 -241 21 112
3870 112 -193 -76 255 263 -6 20 82 258 -57 -39 210 98 -133 92 384 -3 -238 399 107 -77 -441 -86
3892 -86 307 -406 -99 12 89 -70 -105 -43 243 -104 125 13 133 -130 -144 77 102 -231 -181 265 -296 69
3914 69 243 152 -211 -94 92 21 -86 -26 48 35 -378 -247 226 302 228 109 164 137 -219 329 -74 31 -121
3937 -121 -48 124 52 54 -115 88 40 -246 -158 120 -95 143 -331 112 111 -129 234 249 158 93 125 100 25 -120 61
3962 61 57 -79 24 -95 -13 -296 -135 -5 -25 -25 177 182 -59 45 -150 206 19 -238 233 145 -67 -270 189
3985 189 -38 -45 -82 -54 28 32 -32 -83 201 -71 -342 244 130 -184 -197 50 -41 -91 140 312 -84 109 170 245 160
4010 160 86 224 -67 50 -247 -30 394 -313 32 104 308 3 -412 302 194 -130 -13 172 20 -12 -253
4031b53j7K69omQJ60P3m80K75J0k59M89j55k54K26n8J9l94N70J01l47k83K98j60
4055a72n9L53r9JO3k72j29L67j2ll6J35K02o07J43M60o16K50J84r3k2J09L8k41
4079e6J77j41J72M4j39j90K44P3q0j24O4K58m72j12M61m50K58J4l51M42M2o7m3
4102B4Q1j63J07j9M20k90k44K46m9k17K64k2o4l1rk28J28j11L23m38m9J39N9K27
4126H4n3O3p6N8r2j22J14J23K2j23o8K13m49M88M6m00K14q2k64M65l02R6j73L88
4150A70l62J80P2k4J8K61Rn68p9M12k10O1J79L4n25L25Q9j65j4J4Q2J34p2k6J34
4175A29K48k55l76L06J20m55p1M94j34n15M53R6l8J31p1NK3k46P6j15Q2K60l17
4198a70K78j6m09L83N2K47l73J15oq9k4J81j57M2j08J38l5j98j34L57r5J5N3m85
$$ plain form
4031 -253 -270 -1 -7 -11 -3 157 230 -250 25 35 -224 265 110 -144 82 24 43 -351 219 320 -27 -310 -12 -172
4055 -172 -231 122 23 24 87 -185 -314 53 41 38 2 137 339 -268 -125 335 -281 -31 153 60 38 147 185 -56
4079 -56 121 -20 152 196 57 -133 111 184 104 -20 44 302 -170 -282 179 -271 -13 1 -350 92 134 67 24
4102 24 105 -58 49 30 450 160 -84 162 113 -104 160 138 74 43 34 -194 -66 -177 146 -292 -341 -202 -143 84
4126 84 31 94 18 76 -16 -138 -24 99 121 -2 -70 143 -306 182 228 -172 42 -40 -304 161 -141 -45 -218 170
4150 170 -192 -12 60 36 54 315 324 -244 -323 89 -121 -60 119 153 -372 -47 42 -123 -137 -123 -41 93 21 -5 129
4175 129 377 122 -254 52 172 -283 -354 140 6 -509 -56 40 2 133 62 67 90 -156 -80 -195 -113 147 -170
4198 -170 108 92 -317 66 118 365 -8 107 101 12 -12 169 12 54 -54 84 49 -149 -283 74 -21 -6 47 -438
4222d38M19j59J06L23k72k48J29J81J34k11L87j80j06j19J06K05j79K13l87K88
4242A92k20J18k51K05J04m3o4J10j36j69K21j12m6J78K7j78o5l5J89M5j00k21
4264b51L44J92j82Q4p0ro2m3J17k00K9K16J6l97o1M03j48j75J61J7K06k5l5j30
4288cl0q5R1N5n7k41R0K25l71J52J49J73j11j64L55j42K9o8p6m0L08k72K12n4
4312A25k0l87M70p8j94K61j38k4n1k80K82l23K22j5L50k20r8L3K90m38k7M96k13
4335B3j34j08K42J48k35pL36l88K19k65M11l03p7K45J08O2k93k9j30K83k12k9
4357a33L52j70p6j35L50m26K76J83k48J2k2J89j72J96l39L28Qq4l64L70J11l60
4379a54j53J43K61k89l8K34j22O3J34p2K23l01jQ4K4O0M6m1k55q1K21j19o7K18
$$ plain form
4222 -438 -19 -178 -72 251 -21 -269 -140 41 175 -36 351 171 65 -54 52 257 78 291 -96 192
4242 192 -28 90 -161 44 148 105 41 151 15 -154 67 -45 -91 87 114 -64 -129 -164 25 70 -30 -251
4264 -251 93 285 103 187 117 108 46 3 120 -80 -51 165 181 -216 -277 126 -22 -197 -36 -19 187 162 127 -3
4288 -3 -33 -118 -27 28 -29 -270 -180 45 -326 -174 -25 148 37 -127 228 86 115 47 -29 -69 239 -33 179 125
4312 125 105 -282 188 110 -84 177 39 15 -36 -316 -34 -357 -135 -150 200 -20 -118 -85 205 -233 -260 236 23
4335 23 -111 -219 23 171 -64 -71 265 -123 96 -169 242 -61 -138 107 215 277 -16 -45 -175 108 -104 -133
4357 -133 219 49 -27 -162 188 -238 38 221 -27 -15 -37 152 -20 176 -163 165 173 89 -275 95 206 -154
4379 -154 -307 -164 97 -192 -230 4 -118 -55 79 7 230 -71 -72 12 36 96 142 101 -154 -235 -14 -133 -200 18
4403A8j7k2L1j29Q2j96M58j65j1j16o6J06J3j20J09q9k1p2K78j51K76j65j80J14
4427c5J80j16n0k82M13j94N1J89l10k5L08k20l9J01l73M48J70k10q1PK10k30K69
4450A81P0l07m4J26K70l10q6K14R1M0m19L20o5m31N47m84L86J31l63j3L57l59
4472a48k7M51l48q9N31m39j26J32j84J98J13k14J18L5Q3K2j07m5j02J24n4J28
4494E2J92m49L45J05k71J43P7j63l41M16l4l91J58K80k36M17n4m68L40K8k14k3
4516i1K17l69j29N55j61j58j49L49j12N3J27l71pL51l11q6M96k21k10L57n2l2
4538D6o2Q6O2k37J14J65l86J57j88L89l99K23K41k22k6j5P2j20K62k87M04l98
4560a19j50Q9J2M49r2l92L47j61k37N64l8l19k02Q7l6J9K32n3j07R0J6k19K99
$$ plain form
4403 18 1 -21 10 -119 -37 -233 225 60 49 -67 -133 -27 -14 -134 -25 -114 -135 -207 71 -80 196 31 -149 -35
4427 -35 145 29 -21 -303 110 -84 -33 156 -154 -179 129 -91 -130 -29 -402 46 216 6 -75 -68 142 -88 181
4450 181 251 -56 -100 26 296 -14 -100 114 205 245 -174 146 81 -350 197 -287 99 230 -133 -146 211 -148
4472 -148 -175 276 -72 -161 370 -69 -195 -63 -247 -49 64 -150 -32 3 86 108 1 -44 -146 -22 -76 52
4494 52 244 -205 140 245 -26 117 194 31 -310 106 72 -319 -161 119 -117 300 246 -222 118 146 -68 -91
4516 -91 126 -243 -372 183 22 -136 -285 64 -48 5 132 -239 -246 105 -206 -292 204 -17 -227 130 78 46
4538 46 -16 70 132 -105 9 174 -212 -55 -243 146 -253 -30 211 -11 -37 -52 20 -100 162 -125 279 -119
4560 -119 -269 -180 -168 281 189 -203 144 -17 -254 310 272 -47 -249 -162 -198 -179 53 0 -107 -17 -1 -220 79
4583G9J60m24J73r4q5O1N52l54k00K90P8l51l05L80n2L5j89K09N4k45J61N1M1
4606B5Q3j67l3J29j98K74k6R8l41O5P2M0k94J22J38j78K74pl27L66po5O7j87J88
4631A11k10K67R8l00q2J40j29P5L83j63l41K39K9pj33pK40m00K79l71J66K72l18
4654a62J37K13O7m01N4q5K32j18R2R0k45nN9R7J24n7m20O56O6o83K81j1J64o5
4678H0j55L67n26L25pJ8j11j04mj72L08QO6J39o7k50N9L23q7j34j53k3K09N3j81
4703a9J6l4N9J63j12l2j19r3J34k18J07K38j43r1J88Q0k49M4j8Mk6j52N57j96
4727H8j10M4j42K58j51j20L2m4m4L07j88kj49P6j6J25jK72ol52J29J24m7n45O00
4752A38p5q5j04K46o1k17R5qJ29k2j46k0l2K46j39j69M83m7l17P3J27n6o7J08
$$ plain form
4583 79 239 -185 -12 -106 -191 -130 422 68 -132 158 236 -115 -420 -40 -92 -57 -246 -37 17 -228 -67 -16 25
4606 25 108 -59 -92 37 -161 113 87 185 -156 -91 -19 21 -273 -151 -13 -191 83 76 -251 115 108 43 110 -77 111
4631 111 -99 168 266 -34 -116 24 -105 -30 353 190 -151 88 117 110 -23 -30 210 -190 89 -282 -116 156 -162
4654 -162 -25 188 255 -146 -92 -177 55 -63 29 119 -126 -131 -72 25 149 92 -328 328 394 -289 -8 -19 145 80
4678 80 -75 292 -234 91 84 102 -9 -113 -117 -289 19 27 93 232 165 -85 -26 297 210 76 -77 -100 109 162 -19
4703 -19 -3 -37 22 185 73 41 -78 -171 -37 -255 -148 90 -53 -144 44 124 -125 -81 -99 -95 -121 -273 284 88
4727 88 -22 22 -120 138 -13 -133 -101 -145 -189 118 -70 -72 -221 -145 -161 -36 -37 235 229 -123 6 130 83 -462 138
4752 138 63 -22 -126 120 59 -158 -63 -71 58 36 -110 -130 -162 84 -55 -224 259 212 -105 -32 95 39 -28 80
4776H0k67J08r4K01R9Q9j05j73J55j51K2j11L13n34K18K20j36j52Q3L07j48Lq7
4799f0J30j72J24K29k88K12l55N1oP5O4k76L82K2k58J35k40J8K45k24K22L2j80
4822a18M79j06j43p6R1L2r7j80Q4p4K48q5j21J8j72L09o5J15j51L4N2j40k37L79
4846G6p4L0J56k0j00n4k87M22l65O6L35k51Lj40J84K16k65J10l79M77l95q1L1
4869c05J49J73q5p8L89l50l1J71J0n7r2J45o3k5k25J79K34j52P9j42p6Q6J31m7
4893A8r2O7J20O6j57l9rM0k16K80j05j44K08K35j09Q2o4R2j72Q0l9j85J46q1j75
4918a53N8J31Ljl53L11j23k69O44J89l41%l23M23j1l89L58o1o7l3LO1k96J74L99
4943C34J02n11r7M08o9l01L89l6p9k02Q5q4O9k22j32N50k38pK0k0K07j51l37N18
$$ plain form
4776 80 -187 -79 -173 28 127 216 111 -62 93 -58 -36 -147 166 -368 -150 70 -66 -218 -135 172 24 27 -60
4799 -60 70 -102 22 251 -37 175 -180 -129 -135 -60 4 -272 110 132 -126 9 -231 -213 32 -192 30 62 -118
4822 -118 361 255 112 36 127 159 62 -118 -34 -108 140 55 -66 -48 -220 89 24 139 -12 22 74 -66 -303 76
4846 76 2 32 188 168 68 14 -273 149 -216 -150 185 -66 -63 -203 -19 197 -68 42 -337 140 -255 -336 -305
4869 -305 -156 17 -68 -146 243 -107 -138 33 43 -14 -106 39 -24 -49 -274 -95 139 -13 66 -76 -152 -66 65 18
4893 18 -74 -7 113 179 22 -17 -26 14 -202 78 -27 -171 37 272 163 245 181 273 101 181 142 -43 103 22 -153
4918 -153 -95 36 39 38 -315 -4 -127 -396 248 437 96 96 -227 196 185 -204 154 93 26 -7 -4 57 -239 -65 334
4943 334 436 -75 -172 236 167 -134 255 219 140 -62 23 -61 8 -214 -346 204 -34 -41 -21 -41 166 15 -322 196
4967A96j97J7K34j18l00K1L52l76J23r4pj43K47m6J22N6j94m0K06O5kM3k22J94
4991A37j67k27L92Q5j78J02o2l16L73k27J72j93n1M67k50qj43j6j5j39J13J11
5013d0j8j74K88q8L21l52J05N3j23J45j27J42J3j32J32M3k74J18k3NK0l3j87K33
5037D7k25J53J47l32j8J86Q6m32O40l86K50j52oK00k63K45k20j12L62j94m4l2
5059a00R1k47K51J15m3k56k8L95O5k21j63K43r5K1R2p7P8m6l41J14j46O34m37
5082a01N3J77J04j94J19j95%J04m5j47J37j11j68M24k12J97l8J2j76N7Q3p9n9
5105e8K60k03p2R4J68j56qR1j85m06N17j7P9kn9K0j08K67k22n3J36j17j39J11
5129f2K09j91on0J34j57K12n4L0l16K33n1L48j59j39k47K50r5O2K19l32J32j79
$$ plain form
4967 196 -1 16 250 132 -168 -147 205 -171 -48 -142 -149 -292 -45 -91 31 87 -107 -147 59 124 122 165 -57 137
4991 137 -30 -257 135 220 42 144 82 -234 139 -88 84 -109 -160 307 57 49 -94 -110 -125 -264 -151 -40
5013 -40 -58 -232 56 -32 289 -63 42 95 -28 117 -10 132 145 13 145 188 -86 32 9 14 34 1 -186 47
5037 47 -178 -25 122 -210 -228 -42 44 -388 252 -134 116 -36 -42 158 -105 140 -80 -192 170 -24 -68 -100
5059 -100 -9 -256 -5 110 67 -189 -217 178 243 22 -141 102 7 28 120 43 121 75 -266 -152 -298 336 -101
5082 -101 -48 129 233 39 158 -37 -37 67 22 -125 12 -99 -267 157 -55 142 104 116 -60 -3 80 1 -58
5105 -58 202 -1 -73 21 189 33 25 116 -69 -475 42 25 104 102 43 63 -45 222 0 -53 83 -34 -173 -62
5129 -62 147 -44 -50 -100 34 -123 89 35 65 -251 -18 -69 279 120 -19 -266 -16 -111 -49 170 -162 -30 -209
5152b09J84K28m2J23j56r8k4k27K65k4j98K2K16k97J30K31Pr8RJ66j92k61L84
5175A39n4k03r2PR2K1j23L93p1j92Q7j08J12J09m02K54L0p5j85M58l90k4N24j43
5199A64l04K52j16k64K02K78j98j0K19j81k0J91O2o15K38K09N9j68J03M0j4n6
5221G1j52J58l61K04J54l5k52J21K2L28l46J56J11q4P1j34j65L06m13J53L59k15
5243E7j65L08l74P7j58K19j3k86M29j06k22K20k12K73L04l72j00J85L9j18k59
5264b74N16k67J47p4j04o1j8K86l82R6M6N10l24K72r9l39P1k3p5J54k48k0L9K04
5288C3j06L2K13ml33J03K02J96m73L82p0p6k2j28j56N50m06q4k5J82j68J64J50
5311A56k88L2J00J05j28j88K49q2R2J21k67J16j38J16l0K4j49L6O0k6K57j83J
$$ plain form
5152 -209 -25 203 161 284 128 30 6 -221 44 20 -178 -156 60 -237 -107 124 131 33 42 208 16 -245 139
5175 139 85 -118 -210 -203 -111 -90 -213 180 109 -83 4 -104 8 117 -285 -31 -1 -76 -261 197 -193 -217 307 164
5199 164 -140 112 -4 -268 -66 212 14 4 223 42 22 213 275 -340 -102 107 166 -2 101 141 127 71
5221 71 -81 77 -284 -80 74 39 -213 -92 -70 258 -88 68 179 95 166 32 -133 173 -240 -87 272 57
5243 57 -108 200 -174 -97 -255 -36 -49 -335 94 -12 -234 -14 -226 47 351 -21 -121 64 103 -15 -274
5264 -274 242 -25 122 48 -56 -117 -135 151 -231 -135 -89 421 97 369 270 -69 2 -21 -96 58 -190 -210 -171 33
5288 33 -73 -41 172 168 -165 -62 140 336 -137 245 175 99 77 -51 -207 343 -63 -147 -172 10 -158 6 156
5311 156 -132 -100 0 105 -23 -211 38 -44 48 169 -98 18 -120 -4 -34 -10 -159 -123 -63 -89 168 -15 -14
5334a4nl8L6j90J77K5K42k96MJ11J33m89L84lJ2k4R6k50K45l46m2jJ78R0q6j17
5360a68K85K6k62K08J08k65N6N6K18m06P2n4N9n2k1J0o9L24j56k87L00m2r9K75
5384A16j82K97P4l18Lm5N1J03n6L79k61l30K80K15j87k47K60m26M27k23J70M8
5406A48q3L3k40K02n8n48O15j52p7K29J83pl5j48K2m7k13K48j84L3K35q9j8J63
5430B12k38L57l55J26k47J67l9L9J82k27K26q7p9j7j24K85l46j62J92o8K41Pk94
5453b49K66O7l23K02N7k75M09r1p9j09K32o6p0J03l8J50P3j72j23J54m6l07L27
5476I2k08J85m2l8L23j95oj45Q8K32k77r9O6J34J3j22kq9Q0PL37m34K34j5j96
5501g7r5L42p2l6P6j08n5K29J05n12K67M2K15l95J68k14m3K66j45R8l4J07j43
$$ plain form
5334 -14 -19 -57 -21 -211 -34 -9 233 -63 -59 52 185 -304 80 77 89 65 161 -89 156 -190 -232 -233 -55 35 -51 -168
5360 -168 117 143 -119 89 197 -68 -12 44 262 -144 -72 -126 -67 -119 -140 -130 -199 125 -31 -318 -18 -60 -159 116
5384 116 -66 231 305 -13 -10 -55 -4 99 43 422 161 -169 111 326 139 -108 152 -274 153 -70 100 148
5406 148 65 98 -142 60 2 -546 69 -83 -160 69 252 245 210 62 84 37 -176 72 -112 -79 156 67 49 212
5430 212 -26 331 -24 102 -145 22 -17 22 204 -23 203 116 37 20 -104 181 -165 -327 -135 -203 38 45 -249
5453 -249 17 84 -239 -37 20 -255 154 63 -16 -125 107 41 -29 74 36 186 259 87 -36 118 72 -235 92
5476 92 -116 69 27 -11 312 117 111 -34 54 286 9 -90 -24 110 123 1 -1 -90 -10 -3 334 -100 134 119 -77
5501 -77 -172 170 98 62 138 30 -25 204 309 -203 64 106 321 -74 94 -120 -163 103 -42 56 22 129 -14
5524a4n9j12J01j39L94j09j48o0RK3j31K56L7k47K92M3k31J64k5l7J5N3n0J61
5548A86j72j87J63j54J90N8N9j05L4j53j45L32K33m48L47k06k3%j15j64K39j70
5570b01M63K3r6k59l9J44l9j59j13M25p4j29l1o1K72jk50K50j86j38L28j71q2
5593a24J31J37j90k91M14k9j20r0L08j89K71j95l7J96j74K60k24l76O65k47K9
5614A25l42M94r3k20K89n21K21J06n8L7M8j75J46l92K77M3n0J16J5nJ2K09l91
5637a09J50K03m34J91j3l2J4J94j19j35M28n01q9O6K19m2k07M04k03J35K03n66
5659b43J47K24j93p7R6n4o8N2J22J13p7J00l74J45k24L13o7q7O7J02JP9p6j24
5683a03L04j73Q2m0M4j39R2m1r6J65o7j15O6k85K91J44q0j03R6j56j47K60m5M0
$$ plain form
5524 -14 -73 -185 -84 -223 171 62 -86 -146 -137 -114 -245 11 48 -199 93 136 -95 69 44 7 22 75 25 186
5548 186 14 -173 -10 -164 26 84 143 38 72 -81 -226 106 339 -109 238 32 9 9 -106 -270 -31 -201
5570 -201 262 285 189 -70 -109 35 -4 -163 -276 149 75 -54 -85 -146 126 125 -125 125 -61 -199 129 -42 -124
5593 -124 7 144 -46 -337 77 48 -72 -162 146 -43 228 33 -4 192 18 278 54 -322 343 96 125
5614 125 -217 277 184 -36 253 -268 -47 59 1 38 86 -89 57 -335 -58 -15 -65 51 66 61 73 282 -109
5637 -109 41 244 -190 1 -12 -44 -30 164 45 -90 338 -163 -252 -186 33 -9 -216 188 -15 120 323 -243
5659 -243 -96 128 -65 -142 -46 -100 -168 -116 6 119 42 142 -232 -87 -311 2 -65 -152 -85 17 18 97 21 -103
5683 -103 201 28 110 70 114 -25 67 26 -70 95 28 -87 -21 -306 -15 129 49 -54 42 -114 -261 -1 -46 -6
5707fJ48o7r1J87j3k70K8J07j41J35J20k36J8Q9j82K69j82J10j28o3L06J47l94
5730a09P8K16m59M47j09R1o80O25k76M1N30m14LO1j27q6K81j86J22l1Q6j88m8
5753a32L79m03K49J95k61j61M40j87o1K16j52L2l5l81L42N6j04K23l09J6j57J69
5775b6J41m4k0k82K91P7m4k56K97k72J23M3j68J01j06K11o4o7J20r7K48r9j42
5798c5K11j33Jm31K66L21j72J59j05p8m5M42j45l61J75K52k74K6n4l4NR7J39k10
5822A7k2k2K61j60N3l43K32P2J5j33K96j45J97N0k15j40k13J22K05J88m10J30
5844C5J5j71J32K18p41O74l7r7j7J60N6k84O1j40j77lM50%k55O3r0J37K9q2K0
5869d4j82J17J85j30k7r9N9j9j2K07q2O3l7K26k98K13M4m1k36J42k4J42j45j7
$$ plain form
5707 -6 142 75 -16 171 158 -112 -84 23 -118 17 137 -99 -81 8 -174 95 -87 23 -105 -168 138 285 -109
5730 -109 -31 185 -274 173 64 155 -525 100 -176 -135 395 -19 -16 45 -82 -168 113 -73 49 18 104 -84 -132
5753 -132 247 -156 93 288 27 -134 306 119 58 274 122 154 119 -262 80 136 32 255 -54 -38 -195 -26
5775 -26 115 71 51 -231 60 137 93 -163 134 -138 -15 28 -140 -39 -145 66 2 -65 55 -42 206 107 -35
5798 -35 176 43 44 -387 -121 200 28 187 82 4 -41 401 256 -105 70 322 48 74 20 -14 -9 88 227 17
5822 17 -5 -27 234 74 127 -216 16 88 103 -30 266 121 318 368 153 13 -200 -78 127 315 -95 35
5844 35 50 -121 11 229 -512 162 125 28 11 171 227 -57 4 -136 -313 -316 134 134 -121 -58 -148 -11 18 -64 -44
5869 -44 -226 -109 76 -54 -81 -180 -121 -140 -152 55 -27 36 -1 225 -73 140 184 143 -93 49 25 167 22 5
5893Ep6R9L07l63J62J2m19K47M01l08J4R1j18j56Nn2R0q3K0L1n2K37j69JN2j39
5919a61K94j04j30kJ00j21L31j55j54j50K64K15j63j03K38k95J8O9R5j10n0Q8
5941A4J84j51j63l8kJ8j9J16n3O5k90L12J84k25j59M20l17J8J51j08K93l23j33
5964b06K24J6rJ42n3j69J63l17J98k24K47j08J35J45n11L62p4K8J19k60L96l78
5986a34j76L20R0j69j96K13M4k29M42j44K12m14J45j03J3J84j1j01p2l7j57L21
6008D1l37K65q0J91Ok42K8P7l2J95Qj57P8n2J80j67K73l70N8j58M74j25j23M9
6032H0J54k67l5K62n19L49m0M3J03l46L11k14o1J59J71k03J80k28J6r1K20l29
6054b85K83K49k29Kk04J31J32q9k67K23P7j6K3K36l93K13k94L58k40k12K30J33
$$ plain form
5893 5 -71 28 335 -28 134 146 -273 -26 375 67 81 172 54 -102 -97 -149 -59 -142 -122 -91 -143 94 -75 -74 -22 -161
5919 -161 133 29 -101 -103 -3 -124 207 52 -102 -252 12 227 64 -39 199 -96 -78 -9 86 -24 -74 14
5941 14 198 47 -116 -154 -156 -138 -157 -41 -94 -29 -319 -7 177 -48 -207 213 -104 -86 65 -43 250 -73 -206
5964 -206 18 34 25 167 114 -55 108 -209 -11 -235 12 -96 39 184 -327 35 -39 -11 108 -152 244 -134
5986 -134 -310 10 100 -69 -265 -52 -8 -237 205 61 273 -141 4 -99 -86 98 87 -14 -86 -123 -280 41
6008 41 -296 -31 -111 80 86 -156 -128 -51 -83 112 120 -37 41 -11 169 2 275 -95 -37 -195 279 154 31 80
6032 80 234 -33 -68 194 -325 24 -16 27 130 -216 95 -119 -180 -21 150 -53 127 -101 -85 -176 44 -285
6054 -285 -2 247 18 20 -184 -53 79 -10 -277 -54 23 7 30 266 -127 86 -208 150 -90 -302 -72 61
6076F1ok09N09m46J13q7j17k37M14K29l30K88j96n9l9J01J04j98j9R1l1K64j46
6099E4m8n5L23k88J39j44k14J77j68M39l86J48J12J09O5K4j96J7Pk51K47P0k36
6122e5l1J26P7j74K1K13j26j35J94m0J16m06K41k40K14M43n36J8l8J20q1L47k54
6145A4L31l15j1jj0m1K8J99m83L98j67m6O6O7l02K25j36N9j07N56l46K5J23j36
6169a0O4J31n1j41k9r7K29l08L09L4k23k12L08J50j92j75K74K6k4k81K7K94j05
6192bk01L37K40m84J21j22K11l45J67o5L64k86J55l0n5J22Q2k05J9O7p2O4m4k43
6216b05L5L81l34R3l1K6n8r3P7k20J38J42L1qQ6J46p3R6k01k24p8K15j76K59J91
6241B15l46nK79J0j11m5L1k21J81o9K1J25k78P8K06j6k39J64j8J01J46j65r5j20
$$ plain form
6076 61 55 -154 355 -91 22 -65 -182 -419 -5 224 -106 182 -14 -73 -112 -11 93 -105 -124 -33 -64 200 54
6099 54 6 -49 274 -14 125 -19 -233 -56 -224 215 -171 -23 89 198 263 287 91 108 115 -136 111 181 -55
6122 -55 -86 40 117 -57 -36 177 51 -84 110 70 186 -220 21 -219 -5 438 -98 -80 -118 2 -79 268 14
6145 14 345 30 19 18 8 -33 -5 194 -289 109 -58 -104 -38 29 -273 -48 -184 -125 -232 324 -22 3 126 -10
6169 -10 54 185 134 -7 -36 -133 96 -212 97 131 -92 -304 4 154 -38 -213 61 87 63 -218 -191 103 -2
6192 -2 -203 134 374 -110 11 -111 100 -245 -78 -143 221 -65 90 60 5 127 209 4 23 90 18 82 38 -205
6216 -205 -170 211 -123 -30 -61 -35 -93 -186 -109 -329 -191 -49 -18 -26 60 206 133 229 28 -196 -274 -59 -235 24 215
6241 215 -131 -136 143 153 42 -3 28 -193 -12 -81 -60 65 -213 -135 71 55 -184 -20 -38 63 209 44 -51 -171
6265a71O9J59K47k37j55O7l9K15J6l83J57K18j9j24r3j03J91J11k39J33O3Rk44
6288a52k3K55k59J25mR2l93M00k29M5K67k0m50M90k86K89k36M8Q3l55K75L14l12
6311c6Q5M8k51J47k24Q6K18j0j11L6j33K26Q4l94K82L1j02p2L6J56j28P7k88J36
6335a01P3L2M5N1j43p3K04o2j05j49o2L49j63m4K63k17k0J3o0j43K59JPK17K3
6360A95j99j6r2J50J71k9k96J52k0j46K11J39k38J21q2j2Q1l10L03k03o4K47K20
6383B83k49k10O53o13L3lJ74J62l02J68l30J89ML79j66l63l9L33j93K26k87K49
6405I8n8j84O3K12l65J86N0J41m9k1j71Q4J51o74M77J04j56M22k91j75J53n9j19
6428a81R5K22j97L8K19j48K44q6k49J97p5n8L4m20M71j43q2J71j09o6k70K43L50
$$ plain form
6265 -171 -102 57 304 67 -88 -21 -60 155 171 -212 -55 163 144 20 -73 -176 15 126 -113 20 83 92 -152
6288 -152 -175 80 -179 -54 -58 34 -359 41 -188 -143 124 104 -346 144 -142 147 -89 -41 42 -313 -38 276 -36
6311 -36 49 97 -154 -7 -231 -145 73 63 -48 -12 -145 81 165 -229 53 84 -18 -90 -54 102 -26 51 -237 -101
6335 -101 -28 4 49 100 -43 -116 88 26 -79 -228 -290 59 -104 -148 115 -102 -122 -109 -169 -312 -53 -52 -45 172 195
6360 195 -4 -20 -112 38 209 180 -116 36 16 -130 81 220 -18 103 21 9 90 -220 83 -120 -184 63 283
6383 283 34 -176 477 -136 -103 -106 68 230 -72 96 -234 -45 -41 338 172 -191 -230 103 -90 136 -151 98
6405 98 40 -144 -81 131 -234 -48 2 143 94 73 -98 -14 137 -537 -60 44 -112 310 19 -156 -3 -62 -181
6428 -181 -86 136 -61 -23 196 48 292 206 -43 154 79 21 55 -365 106 -37 -119 52 -57 -123 -393 -150 200
6451B00k56p6J55o9L4J11j91J6J45O2J88l35k20L31J70l48k20Q4M63k93Q4p3L7
6474aL8M5j20J25j12l6r8K20K5k09k22J41m7K49M2k35R2J92k37K52m19P2m1K75
6498iL43l54O3J51r0N2l13K10j04J32k60K69N5j65L1Q9k14P2k32J80rJ44jj05
6522f5j50M9L7n8l3M49r7q4k32J48K09o3q2k69J30K30j83J0j55K47k30j01K01
6545i2J15L32l18k09K14n8k62L15j6k1k09L68l24L42l79K17J40l14K82l71M55
6566B07K4L9l39R8j24J87K6m7l8j63J37L19k25j92N03m66MP3j5J86Q1l23O6J12
6590A30kn8o1j78K44K44o3N6k60j26J21k23L3K29op1j19K31l01K74L5n2n0J89
6614B16m19J09l9l0J30M1R9k1j6j37L39k67K45p6l92K51k21J96J37P9m18K20k3
$$ plain form
6451 200 -56 -132 23 -46 -12 99 -92 -76 69 131 319 -16 -236 95 265 -83 -303 -219 244 -49 35 -38 -1
6474 -1 37 82 -38 87 -25 -61 -159 61 86 -123 -345 -204 -251 -2 40 -195 -103 89 -148 104 -315 -243 -284 -9
6498 -9 334 -20 43 194 104 156 -157 53 -51 81 -179 90 145 -20 11 100 -114 -42 -274 -94 -103 41 40 -65
6522 -65 -215 -166 -129 -187 -220 229 132 48 -184 -36 173 110 28 -241 -111 119 -64 -54 -209 38 -192 -293 -92
6545 -92 23 355 37 -172 42 -16 -278 37 21 0 -209 159 -165 177 -202 15 155 -159 123 -248 207
6566 207 231 270 -69 29 -95 92 118 71 33 -130 7 326 101 -91 412 -54 -50 23 8 194 275 -48 18 130
6590 130 128 70 9 -169 75 319 256 312 52 -74 47 -176 -143 86 80 9 -110 121 -180 94 129 77 27 216
6614 216 -203 -94 -133 -163 -33 8 107 86 70 -67 272 5 250 174 -218 33 -188 8 145 224 -194 26 3
6637CJ19k02R7Mo3R5K88j80n1o5p5j89J40K08l23L02j56r2L97k58L4k52J62q3
6661a40p7N38k83J55j72K22l8pj79J15j86J60qL1q6r3K33l71K37r7K42j31k02
6684a37M49l81l5J86R1r3k17J50l0L70m98j7N24j86l10J76K3L0j11J47j67K31
6706A95l28l4K07q5J0j80L68j55j28K27K31k16k92K54j81J36j04n1K06k76K40
6727D4m4j83Q1J84Q2l1l23K1J37q2J01J49k62n0J91L18l70l1K06J04l71J63r3
6750e9r0J88m3p0m9j02K15R8O2Ll56K69p6n4m4mJ47l78N0M18k84L2m6K37j71m9
6776a56M10l76L22k98j0M6J8K14m02M43m33L78k02K07k66M93n79K58M5k41O6K41
6798A78k15Q5j10K11p7k98K32r0jk14J18m0J84Q2j52J88M7L5q8j39L14l67R8o0
$$ plain form
6637 3 122 -80 17 21 -42 53 341 161 110 45 -30 -219 -79 129 -194 108 -48 -140 257 -1 33 -219 -57 -140
6661 -140 -217 321 38 193 21 243 205 198 19 134 -52 108 100 131 45 -48 185 -186 51 -46 196 65 -137
6684 -137 312 -69 -104 82 173 80 -137 13 -17 353 -145 -162 362 176 -134 42 65 95 -16 131 -36 195
6706 195 -133 -167 40 -45 -35 -215 153 -2 -130 97 328 112 -180 74 -107 29 -75 -126 80 -196 44
6727 44 0 -183 -102 82 164 133 -190 -169 -32 -114 -13 136 -126 -176 15 333 -37 -68 138 242 -129 34 -59
6750 -59 -149 39 -4 -74 -123 -225 -10 88 150 153 -203 66 -10 -64 -108 -112 35 -343 -293 125 -159 -127 -173 64 -107 -156
6776 -156 254 -122 200 -98 -108 -62 -44 170 -232 211 -222 156 -46 161 -105 388 -191 67 112 -129 -63 178
6798 178 -37 48 -62 149 72 -226 6 -84 -85 -299 -181 -221 -37 45 -107 81 128 163 75 -64 250 -117 -19 -79
6822g9K82l94P1n8J87m2P1J88l60J82K43j42p7r7J37q8L50n13k35M31Q0n8q9R3
6846H3r9M4o9J96l12L14j52%j38J32j57L01k25p8J20Q1j04N5j18K92l15K76K7
6869A54j07K3L15o09m7J54K00M1k08Kr3j6K99j69K48J55k31j94L89l48j27J34
6891c5N7L57l86R0j33J07R8j41o8P8L4M4j45j5K92k97j36O3J51L16o02M19n60
6914d12L63P8L1J31n57L98J10j60K61q3J64k73M2mm8o5J78l7k01J58k54k0K5m4
6938b19L25p5r5K60n45O45n77O11k4m33L6K2M6J14O1j98K13l72N2K88j42n6R2
6961B9j01k80K42Q7N6q1J7J55jJ7j9j47RJ02k8K31j03q6O2k29L6Jp8K5K00m8j21
6988e3j93J59J14r8J12r5J16l13J80l68L02J01M2L0r5K30k50j74K58q6m5K85j44
$$ plain form
6822 -79 203 -191 -120 -178 9 -33 38 226 -134 48 291 149 72 -25 112 24 374 -139 -374 57 137 79 -10 83
6846 83 -16 28 -41 155 -157 157 5 5 -133 -1 -158 143 -82 -160 -40 41 -63 -8 -126 166 -149 127 154
6869 154 47 70 385 -224 -271 -117 83 124 -84 -82 -175 -191 108 -61 187 342 111 -83 306 -42 -169 -35
6891 -35 22 379 -7 83 -50 57 155 14 -54 24 58 102 -43 -58 234 -63 -199 -136 15 331 -271 148 -412
6914 -412 -49 29 60 191 -366 32 142 -18 243 160 324 51 93 89 41 -24 154 117 -84 74 -180 -200 -175 -219
6938 -219 106 31 -64 196 -349 296 -281 330 306 -127 -91 -69 -23 91 152 -46 167 -205 -153 135 -7 -63 29
6961 29 -72 -352 -110 -23 33 -48 -31 124 123 140 121 -26 -17 85 57 288 185 99 161 -68 -32 -31 -109 -84 116 68 -53
6988 -53 -246 -87 27 -71 41 -54 62 -251 -71 -439 -137 -36 6 36 -59 171 -79 -253 5 -81 -126 159 15
7011A5K08Q5n58J36K46O1J56L7k48j4j8J73n24P9K45N0L8l73K71j88J56l84K67
7034h4J74j48J55r9L7o9J9Q6k37M29k33j09K61l88J52j3k61N07m83J3J69J13K10
7057B01r2n2j47J00r0K01k99j21L20J14j14k16K15K2j69L14l32K7O4j58K21l28
7079c19J62L70k62K86j51k15R3M9J33o9J22k35L72m57m4K50q3j08k2O0J22J27
7101A81j70k25L66j78P4k99L77k39K74j26n4J4l8q6k3R5J32J45m54L23l84O63
7123C68k74l30K81l64K64n2K9J07k79M58l01K66j48O6j36m8J74K9j08k3R6M4j33
7146a4O8K4j29Q6J5Q3m7j2j65J40N0l14L2K28J16l20k7K80q1j01P1Q5k84M7J95
7171B6j63O1k3J71j9j57J01j17j74J53K27k56K41M4J58k89or7j74O4J99R8r7m20
$$ plain form
7011 15 223 308 -250 -114 132 193 349 386 138 124 106 279 -245 -166 79 129 167 -206 65 -123 33 -351 -84
7034 -84 90 -58 97 -2 35 -34 -15 71 -166 263 30 -79 182 -206 -54 -67 -328 179 -304 -291 -122 -9 201
7057 201 109 57 -90 10 -80 121 -178 -299 21 135 21 -195 20 42 -127 187 -145 -118 -54 -212 9 -319
7079 -319 -157 213 -49 237 86 -129 -36 13 146 77 199 -36 336 -121 -165 85 2 -106 -128 -68 54 181
7101 181 11 -214 152 -26 48 -251 126 -113 161 35 -19 -5 -43 -129 -152 -57 75 220 -234 89 -295 368
7123 368 94 -236 45 -319 -55 -107 -78 29 -250 208 -93 173 25 91 -45 -93 81 110 2 -21 75 119 -14
7146 -14 54 78 -51 35 50 133 86 74 -91 49 99 -215 -183 45 161 -159 -186 94 13 -88 -17 68 -216 -169 26
7171 26 -137 -76 -99 72 53 -104 -3 -120 -294 -141 86 -170 71 115 273 -16 -22 -119 -293 -229 -30 68 -29 -449
7195d49K93MO0j87K16K8L0O8j2J67j03k70K3J4J00k96M8L36n8j42M20k8j11R6
7219B47j96j84J13J2L69m40j77O9J83p6L34k94r8j54K57K7J32l6j72J10M4J8o8
7242B0k53L2L24j44k2J80j9q6P7l45K17M8k00P9J75n7J17j23j8j22k6L00k4lK
7267A29m5l3j00J31o2p3J04k02J71j68J50N05p02M34l80M21k19N0l65K96R0l1
7289A01j35Q3j18L10m5m69M28k39P5P9ln7k01M74k89p9j76K76k3J2J48l31L52
7312A73q3M5k30J0M48q6k89O9m67N77l4J39k40Q6pN0j94L09k60j20L02j00j16
7335a8M9j63P4j16K13O8k53L29j00Qp2m7j30J56L32m50M92j85j52oK29j51k97
7358a90M22l04J58J38L9q8j55j09j79L35n0J22m1M3K5j53J18J47k01m38J5L17
$$ plain form
7195 -449 -156 -152 -92 -279 -63 -35 -5 63 51 218 115 -155 -132 -118 -18 -314 -266 70 12 -130 290 262 151 247
7219 247 51 -133 -20 -8 361 -79 -256 -187 -4 -80 254 -40 -138 -292 -35 -8 124 88 -84 26 70 88 20
7242 20 -233 -201 123 -21 -43 137 118 32 109 -236 -19 29 -171 -92 83 26 143 20 2 -120 -146 154 130 127 129
7267 129 84 51 -49 82 20 -53 51 -151 20 -148 2 507 -195 239 -141 280 61 111 -254 42 132 101
7289 101 -34 49 -69 241 196 -273 155 -84 -9 70 67 10 -191 283 -6 -85 -261 15 -8 4 152 -179 173
7312 173 90 135 -95 -85 363 277 -12 57 -410 167 133 272 32 118 111 161 -33 276 16 -104 198 98 -18
7335 -18 31 -132 -58 -174 39 107 -146 183 83 91 19 -28 -158 -2 330 -120 372 187 35 29 258 107 -190
7358 -190 232 -72 86 224 263 175 20 -89 -268 67 17 139 98 141 166 13 131 278 77 -361 -346 -29
7380b9J21j58K40L0j23P2j40m5j70L86j72nj33N2K06k46L09j68J5Q8j04p8p8L74
7404B44j78Q4m8q3q8k30K55K90q5J00j35o4j06J03l55l2L91N7m05J96K57m09K72
7427C1m5Qp6K42l97K42K47o7l32L23l2m8J5n4p3Nj23j30K79K04n7k76O0k08K35
7452b7j89J45J19jj42M0J19M9j53p0J1l3k3J91P9L6J23k06J1Q4k16J98n0k17L4
7477h8J41j17K72j49l87J66K78r5k32K55J47j64j7j44pJ43K66l79l6K23k44m7
7499b15M01j27P4j53jJ20l17J69m9k18M50j49j05J69q5k17m8M03P6j64J17n6k57
7522a82P2L07j46Q6J17j29l13N2l7J92j38J76k75K45p0k2J65k94M37m7l10L52
7544B38j87j96P0J09n2m6M5j11R8L8o0J18j7O4j01Qk24J56J11O8k6k09K82j96
$$ plain form
7380 -29 92 -66 174 204 81 153 13 -32 -202 184 12 7 -126 -74 132 -114 195 27 42 130 26 -52 -130 244
7404 244 66 150 102 19 -69 -299 -44 246 161 261 126 62 -44 59 -296 -328 63 120 -285 -89 168 -241 31
7427 31 -14 -6 -82 160 -237 5 252 185 -147 176 144 96 111 57 -16 -11 -134 -264 15 219 162 -114 -54 -262 -27
7452 -27 -216 -71 48 47 -95 -55 64 113 -40 -110 -99 -132 -155 36 115 151 274 68 79 163 -53 145 95 -122 -88
7477 -88 53 -64 208 59 -328 -162 116 21 -211 44 191 27 10 -134 -141 2 268 -111 -147 76 -168 -215
7499 -215 186 59 133 -20 -21 99 -218 -49 -98 -316 134 -15 -120 49 -36 -253 -301 102 178 14 131 75 -182
7522 -182 -110 197 51 137 254 125 -188 -136 -173 19 -119 57 -218 27 -43 -65 100 -194 243 196 -114 238
7544 238 51 -145 -75 34 -18 -64 -19 -130 -32 6 -54 64 47 111 10 18 -206 -50 61 129 103 -106 176 -20
7568b0O8q1n9K88m57L74MJ1p9j51K60l19K79K7l17j39J43%O9L48l36P6J0l2p2
7593a05Q8QQ4k73J92m2R9P7j93N9K9n7J47L2k18j70M36o1k67J72M5k36J04J67
7617A17l50M28j79k09j43J36J66r4N5J19k7l1J38j73j93K12l7J25Rn7j01Q3k48
7640b54K95O1J98j81J0m6k25J73p2K14j43J00J3k69Q5j07j36K51J52k74k0K84
7662A09j82j10O9J10J22k06K20r5j18K99l32j00K35O5j44Ql6J82L9O0k68N1q2
7685a04j4N4K09j23O8J26j58m2k9kJ1K25j94j64K76o8J60l39J4J1M5j89K23J85
7709A81j74O0J38k15%K20k80J64j61Q2k95K64q8J99m2j70J67j57k0o7kK78L6l67
7733b49J02J17N6L4j19p0J03j37K51j22M6O0j06R8qo1K5K58l27j75L60m5j48j16
$$ plain form
7568 -20 48 -33 -92 196 -261 113 117 128 49 -102 158 -161 118 145 -172 -311 -168 -168 -99 249 -87 -11 -1 -33 -105
7593 -105 -17 -9 75 -198 -6 -48 51 128 -65 -6 23 -34 113 145 -73 -243 193 132 -135 37 82 -154 -50 117
7617 117 -233 195 16 -193 -336 -200 -34 -128 -73 46 19 -12 126 -47 -240 -28 -65 60 69 12 -89 -6 -254
7640 -254 41 102 300 119 129 83 -142 31 -41 173 30 130 143 -126 -41 -148 -284 -33 119 -155 -175 109
7662 109 -73 -183 -114 -4 118 -88 132 37 -81 218 -114 -214 21 86 -58 -50 -86 96 135 195 -73 -22 -104
7685 -104 -118 -64 145 22 90 216 58 16 -13 -15 -4 221 27 -137 139 71 231 -108 -94 -83 -38 -227 -4 181
7709 181 7 67 205 -10 -10 210 -70 94 -67 15 -280 -16 -104 95 53 -117 50 -107 -127 -194 -196 82 118 -249
7733 -249 -147 -30 26 60 -59 -129 -26 -163 88 -34 12 72 -34 64 56 -5 20 278 -49 -224 136 91 -57 -173
7757a73L66o3r7j01J17K03k36j55k2J59Q0R2j49j7j29J1r1K79j68J16o5K81l49
7780a11J03P0j58J29O1o9O8l08L8J44K03k49N6M3J36j45%j78k26L66k8R5k1O3
7804H2P3k94K53Q5l09N9M5J13j55P1k26K87k51J85j85P7n3L00k05L94p22N58M7
7827B29k96m6Q9L54l22j06k20L48o4M3j57J59j44Q9L4Q8j38MJ32k2o5K5jJ06m2
7852G7k28K01P5ml02L81j30K5k59M83k28j88J64k16L3M1P1m9J96m49K75L7J25
7875A31j73l6P1M4m2o3OJ2K35o4j38N5O5k19R4j19K72k42R5K00j96j22M4J07l00
7900b83K89j29K16j74L52m96O0J94J23k24K87r2k08K12k41J98j08N6l21K22j47
7921b14K56j08j87L09j35J66j58J68j43j18L96j45k21J61r7J96k5lr8Q0r2k54
$$ plain form
7757 -173 193 130 33 -68 49 252 16 -139 -161 -2 78 170 21 4 -125 -114 -205 74 -94 22 -43 238 -111
7780 -111 -8 62 -96 33 94 25 93 -215 -177 -33 170 -79 -23 20 156 11 11 -167 -393 -27 -55 40 19 82
7804 82 155 -139 114 199 -110 -51 -6 107 -48 23 -203 84 -167 18 -167 -90 -143 157 -48 346 -376 182 229
7827 229 -67 -113 -24 330 8 -98 -318 30 -34 9 -148 11 -133 -44 -10 78 -60 -56 76 54 -11 14 13 119 77
7852 77 -151 50 125 121 -181 200 70 95 -164 319 91 -97 67 -149 -116 -75 -4 -53 143 -306 -31 6 131
7875 131 -42 -78 -7 37 -5 -68 -62 -50 185 121 -17 38 103 -116 -22 -141 131 -111 -16 184 -12 -134 -90 17 -283
7900 -283 6 -123 93 -81 271 -225 -165 29 152 -72 215 123 -85 127 -114 84 -24 32 -289 -67 -214
7921 -214 42 -66 -253 56 -79 87 -71 97 -46 -164 232 87 -134 27 -70 126 101 98 0 80 -12 -266
7943b66L34k44R6J46J76q8j33M4q5J37j70M2j07M9O5K3p4M3K13l19j74J92L42
7966B42J2j84k25K04J9k26L28k08J48n5j15j12P3J69k56J02J06Q2k6j79M2K5n4
7989h8R1k37J98j2m9l1J99p4L1j34k40J16L23n0lJ7j6K01l62O5j76K23L6J87j84
8014C1K51l47J09l98K13L6L99j49k6k90j10M09j31k48j14L53J2q6mo5J21K3O9
8037E8J47p5n1k08J94J65k02j56J10N8n8J61j03j65L34j24j79M2M3k88K37j09
8059a69J58l3l2J06k44J00J10J49k65J04j1K55k0k81K2j61m8L34J15j11l69L63
8081G2J71j72j8k4K3k16L73j1k23j38K26l39K00J36j05K11j44k16J63l18J55K71
8103G7P3l7k06K41l48K57n4j19R9J80j82N7o6j26J12q0L59m55R5J93k15J82k3
$$ plain form
7943 -266 68 -176 -80 66 242 154 21 65 -20 117 -53 -11 -118 -69 -4 19 -55 -12 201 -118 -292 -100 242
7966 242 254 70 -155 49 68 -158 170 -38 110 55 -60 -172 -99 70 -186 -84 22 104 78 -101 -59 -34 -88
7989 -88 3 -234 -36 -48 -97 -128 71 -3 28 -106 -346 -230 93 43 40 57 41 242 -120 -55 -231 -8 28 215 31
8014 31 282 -65 44 -354 -141 -105 294 145 119 -171 -281 128 -3 -251 -365 -12 0 -86 -90 -155 -34 -11 58
8037 58 205 130 79 -129 65 230 28 -128 -18 40 -18 143 40 -125 209 85 -94 -52 -9 -297 -60 -169
8059 -169 -11 -44 -76 30 -214 -114 -4 145 -120 -16 -27 228 208 -73 -51 -212 -260 74 189 78 -291 72
8081 72 243 71 53 29 52 -164 209 198 -25 -163 63 -276 -76 60 -45 166 22 -194 -31 -349 -194 77
8103 77 150 113 -93 148 -200 57 3 -116 -17 163 -19 38 -28 -154 -42 -122 237 -218 -123 70 -145 37 14
8126A4K4j75J51J49j26j9j81j58O07j43mM2J09j14j26q3n1p5m5K47nr8L52m96
8150b04J85P8j34M3L27j1k65j69J63P4j46j19J43j4J83j50K9p1j94O4L67j31k90
8173b42K43J20o0l85M58k5j35J67Q9k53j54Q8J13j93K30j22J8R5
$$ plain form
8126 14 38 -137 14 163 37 18 -163 -321 286 143 139 181 290 176 50 -33 -84 -159 -204 43 38 -60 292 -204
8150 -204 -19 59 -75 -32 295 284 19 -150 13 87 -59 -178 -35 -49 134 -16 13 -58 -252 -188 179 48 -242
8173 -242 1 121 61 -324 134 109 -26 141 230 -23 -177 -89 24 -169 61 -61 -43 52
8191E2
$$ Imaginary data points
##PAGE= N=2
##DATA TABLE= (X++(I..I)), XYDATA
0@%%%%%%%%%%%%Nj3J6j6J6k4L2l7M5n3O1p2Q8j03J19j36J54j77K04k33K65k98
34a57L37l80M24m77N33n92O60p35Q16r02R96j100J213j338J476j624J788j971
52a033K172k399K653k937L259l632M067m581N199n957O917q172R891j2398J6405
67I454k3813M1859j62529j98596M36172J81768j87246j09219J32764O2308q6283
78I6639q1078r316l7341K1158O5949k5782j46293l9050J92416J15848j84752j05669
90a37271J39948O0626j23894o6506O1890L3809k0086K6830j1852l1946R8580R9790
102A29918l0217l0612P196p488n206J4831l8079r4635J1747O8845q6896r1989
114a52585P5210P9890l754j9979p001J0885K0961J6728n441j4876j2444j9024
$$ plain form
0 0 0 0 0 0 0 0 0 0 0 0 0 0 5 -8 8 -8 8 -16 16 -21 24 -29 32 -40 48 -55 64 -72 82 -95 109 -124 141 -157
34 -157 180 -200 224 -253 280 -312 348 -387 429 -473 523 -577 636 -702 774 -850 938 -1033
52 -1033 1139 -1260 1393 -1544 1715 -1917 2150 -2431 2768 -3189 3728 -4444 5447 -6951 9454
67 9454 -14359 27500 -135029 -333625 102547 284315 97069 -12150 120614 182922 96639
78 96639 15561 6245 -31096 -9938 56011 30229 -116064 -155114 37302 153150 -31602 -137271
90 -137271 2677 63303 -60591 -127097 -65207 -31398 -51484 -24654 -36506 -68452 30128 129918
102 129918 99701 69089 76285 68797 63591 78422 40343 -54292 -42545 26300 -60596 -152585
114 -152585 -77375 2515 -1239 -21218 -28219 -17334 3627 20355 14914 38 -12406 -31430
126c1430L3108L3406q0405o388J50902J7195j31572j059J10847l928q7261L929
138G344J0338p5259o096M4210m6711l7987N9041O1930k2504n6659L6700R5999
150G0346J0324o4211k3082M8803R149o8446j900M7556k6255j4204L8307j4444
162A1943m1314L7257O2417m2251o7615L3777J8793n2391j2887J2517N99P697m543
175c6001J891K8463K5908Q043O846K2174o506l2120J7010J1200m2414j1794P398
188I8k0383j0971P299R761M511N322N141j1521N289R687k6229O487K8145l2687
202b0051k6591L4515K6706k0218q654M6886K2716l6434k045K6904n159k2099j6380
215I6N194o008l6238J163K9141j3556k2203K2601L4541k2199k8810N1225K9885
$$ plain form
126 -31430 1678 35084 -45321 -51709 99193 116388 -15184 -16243 94604 90676 3415 7344
138 7344 17682 -57577 -63673 -19463 -66174 -104161 -45120 16810 -5694 -62353 -25653 70346
150 70346 80670 16459 -6623 42180 51329 -17117 -19017 28539 2284 -11920 26387 11943
162 11943 -29371 7886 70303 28052 -39563 -5786 13007 -39384 -52271 -39754 -39155 -31458 -36001
175 -36001 -34110 -5647 20261 28304 35150 57324 50818 18698 35708 46908 4494 -7300 98
188 98 -20285 -31256 -23957 -14196 -9685 -4363 778 -10743 -5454 4233 -21996 -15509 12636 -20051
202 -20051 -46642 -12127 14579 -5639 -14293 32593 55309 18875 16830 43734 38575 16476 96
215 96 5290 -718 -36956 -35793 -6652 -20208 -42411 -19810 14731 -7468 -36278 14947 44832
228D4832n6095j3364M5452J597m0055l887M0484L462l1942J1215K2205n604p526
241A0774Q54R367j1380k5852J2124P992k9836r429K3967J3504k3560j3028M0484
254E981J7471k7394M22J9587N700j1768j4568R564N499j3455j626L097J829j098
268g59n010J4294K257k0112P659J4541r956j5525m32J8904k963k5785J0284K1326
282H723n533j1284L736K1919k669k5367J4215J8570k0463j5697J3182J4297j9774
295f145j9290K8275J0898k9663J439K5214K42k0693o84K8416n582l0137J5441
308b269K2100j6282j8772J0765K3476j4057k5825K2308J6669k1454r803J4355
320A211J0429j5602j1525K0808K703k0091M643J3316j92j3967k260K2846r81k2928
$$ plain form
228 44832 -11263 -24627 20825 22422 -17633 -21520 18964 22426 -9516 1699 23904 18300 10774
241 10774 11628 20995 9615 -16237 -4113 3879 -25957 -35386 -11419 2085 -21475 -34503 5981
254 5981 23452 -3942 -3520 16067 21767 9999 -4569 4995 10494 -2961 -4587 -1490 339 -759
268 -759 -5769 8525 10782 -9330 -1671 12870 2914 -12611 -13043 5861 2898 -22887 -12603 8723
282 8723 3190 -8094 -4358 17561 14892 -10475 3740 22310 1847 -13850 -668 13629 -6145
295 -6145 -25435 2840 13738 -15925 -14486 10728 10970 -9723 -10407 18009 12427 -17710 -2269
308 -2269 19831 3549 -15223 -4458 19018 4961 -20864 1444 18113 -3341 -13144 1211
320 1211 11640 -3962 -15487 5321 8024 -12067 -7424 5892 5700 -8267 -10527 12319 11338 -11590
334a1590Q021J7577l626j6341q64K0592n577k1437J0523J1415j0398q854M555
347f004J2691p845j2592J6092Q349j2455m491Q797J1600j2321j4999J9273O660
360A2755k1754k418J6112L951j8316l852K4574k170k1113Q759J4163m408j3036
373f753j053J7117n016j8644J1500J4181r399j2171J0276J8810j5713j6394K4261
386A1002O745k4104n174J4522M106j7849n879J8228j793j3052N715J1130L575
399G172r935k424K0443l254k2030P985J7712o802j9811N834J9419j3861j2454
412a2006K0068L451j3771o98O409J428j1556n753J2095M34j2977p028J1769J8424
426A0289j2952j0177K5123L314j8956O768J2608p215j1185Q652O779k1258o242
$$ plain form
334 -11590 -3569 14008 10382 -5959 -6823 13769 8192 -13245 -2722 8693 -1705 -10559 -6004
347 -6004 6687 -1158 -13750 2342 10691 -1764 -6255 2542 14142 1821 -13178 6095 12755
360 12755 -8999 -11417 4695 8646 -9670 -13522 11052 8882 -12231 -3472 10691 6283 -6753
373 -6753 -7806 9311 4295 -14349 -2849 11332 1933 -10238 38 18848 3135 -13259 11002
386 11002 17747 -6357 -11531 2991 7097 -10752 -16631 1597 -196 -13248 -7533 3597 7172
399 7172 -2763 -5187 15256 12002 -10028 -2043 15669 8867 -10944 -5110 14309 448 -12006
412 -12006 8062 11513 -2258 -2956 3453 4881 -6675 -12428 -333 101 -12876 -19904 -8135 10289
426 10289 -2663 -12840 12283 15597 -3359 3409 16017 8802 -2383 6269 13048 -8210 -14452
439a4452J8948L384p313p773P14J6297m772j7913P724J4459r212j6931P422J1462
453B044j5960K973K7724j3219k0907J8910J8710q813j2734P363J1786r934j1847
466c904l675M372J0789j0043r561J2812p500j1009K3975J1683k5063r160K7535
479A1251M254l4120K740L0028o112j3228N9j650Q437P046j471K505k038r481j358
494c138J3311l164k7608J2412L1306k9480l0899K8462K4865j2714r850R339J273
507D115q131P522N963p160J667k591k858O061j6210p315L5132J1944l8696j6685
521b7242L5656J2022l3558K795K5671j6009j4049J0290k669k739R513P985P69
534H435r580q703R033K5583j186l6407O451L2844k7045k9196K9948J6470k3197
$$ plain form
439 -14452 4496 7880 567 -7206 -6492 9805 5033 -12880 -5156 9303 91 -16840 -9418 2044
453 2044 -13916 -10943 16781 3562 -17345 1565 20275 11462 -1272 6091 17877 7943 -3904
466 -3904 -7579 -3207 7582 -2461 -12022 790 -6710 -17719 6256 17939 -7124 -16284 11251
479 11251 15505 -18615 -15875 14153 8041 -5187 -5128 -6778 1659 8705 7234 9739 7701 -1780 -3138
494 -3138 10173 7009 -20599 -8187 23119 -6361 -37260 -8798 16067 3353 -6497 2842 4115
507 4115 -4016 3506 9469 2309 3976 1385 -1473 4588 -11622 -18937 16195 28139 -10557 -27242
521 -27242 8414 20436 -13122 -10327 15344 -665 -14714 -4424 -7093 -9832 -319 7666 8435
534 8435 -1145 -9848 -815 24768 23582 -12825 -6374 26470 -575 -29771 177 16647 -6550
547f550n640J4974p650j2550K1599J4391j6689q719j165M562J1243j3214j0189
560a5597K5910Q559k9555q939L0562P708k1092J1249J1945l0149n753K5253k141
573G960j5116K059N921k375p405m184M854J9626M797k8515k484K5509j0809j0583
587a0745K3567k49k4801N614J8270j2158j2729K3271J0292j9383o407M30L438
600a590J4157o109j5081R043L304j7052n19K0261j985j5774J5758O841k8557M429
614a2874L0376o171j7342M153N362n767k033O887R42P31N57j1419L236J1383j1387
629c366J306J8438j3382k2321J3139J7761j4024r034K0265j480k0404Q487J0282
642E667p231M232L801o061k033k421j190P859P677j0906j1850J6343L931k1592
$$ plain form
547 -6550 -12190 2784 -4866 -17416 4183 18574 1885 -6834 -7999 -3437 7806 -5408 -15597
560 -15597 10313 18872 -10683 -19622 10940 18648 -2444 8805 20750 -9399 -15152 10101 7960
573 7960 -7156 -5097 824 -1551 -8956 -13140 -8286 11340 16137 -12378 -14862 10647 -162 -10745
587 -10745 12822 12573 -12228 -6614 11656 -502 -13231 10040 20332 949 -5458 -5028 -1590
600 -1590 12567 6458 -8623 420 3724 -13328 -13847 6414 4429 -11345 4413 11254 -17303 -12874
614 -12874 17502 11331 -6011 -1858 3504 -2263 -4296 2591 3533 4264 4821 -6598 -3362 8021 -3366
629 -3366 -2060 16378 2996 -19325 -6186 11575 -2449 -11483 8782 7302 -13102 -4615 5667
642 5667 -1564 2668 6469 408 -1625 -4046 -5236 2623 10300 -606 -12456 3887 7818 -13774
656a3774Q937K1442j3207j1876R444L497q231J716J1489l812j0238K492m82L532
670I29L549j0288M836J1338j4793j0753J6335J0745j5008o661J7941l280j9219
683a4329J2326J3053j0254m847M734K604l588m445N153P494k299r186j867J2569
697G118k510j5408J2288J1334j9553o360J5966K980j2923m16J5379l399j2426
710g930N712P272n47l104m532N641K219j1281J368J0592j609j0351J864J2537
724G851n878j2594J3525Q765j3559m788P654L447o593n224R084L122p838j043
738d069M925N413m355o274J0536K324j4773R00J0309k957j0922J713J1599m843
752d74j0966R592Q815n464m550L475P659l937r249P072N987q470n330N568O790
$$ plain form
656 -13774 -4837 16605 3398 -8478 966 4463 -3768 -2052 9437 5625 -4613 -2121 -2603 929
670 929 4478 -5810 -974 10364 -4429 -15182 1153 11898 -3110 -9771 8170 4890 -14329
683 -14329 -2003 11050 796 -4051 683 3287 -301 -4746 407 7901 5602 -3584 -5451 7118
697 7118 4608 -10800 1488 12822 -6731 -13091 2875 5855 -7068 -7484 7895 4496 -7930
710 -7930 -2218 5054 4507 1403 -3129 2512 4731 -6550 -5182 5410 3801 -6550 -4686 7851
724 7851 1973 -10621 2904 11669 -1890 -6678 976 4423 -2170 -7394 1690 4812 -3026 -4069
738 -4069 856 6269 1914 -4360 6176 8500 -6273 -5373 4936 1979 -8943 -7230 4369 -474
752 -474 -11440 -1848 6967 1503 -3047 428 8087 4150 -5099 1973 7960 -510 -5840 -272 6518
767F518p010o886J2304L325j2196J23Q239k01j0046k066J0357k393j1520M901
781f551Q649j883n739K649J2269l186r739P862P416p521o860L756O448p933q236
796h599J0362K545r238p50P202L398q372l319J0577p39j0555J597O707j47p776
811g107P7J1885j308q261O264P930k609o883K235Q541p105r572O769L288p946
826c802m454N025O786p494m402J0766K375q003n04O572K745r438l534J1454j118
841B974r369L165Q145q9p306K085J0681n079q740N903M245o082p435L179P659
856C936q682o787J0684M164o970j717P886N348q589k880J0554j842q703J123N547
871C072n5q053m23J0936k521p937L949O072j607p981K291Q469p976o697Q387K373
$$ plain form
767 6518 -492 -7378 4926 8251 -3945 -3822 4417 4216 -5830 -7896 2461 68 -11452 -6551
781 -6551 2098 215 -5524 -2875 9394 6208 -3531 4331 11747 4226 -2634 1122 7570 -363 -8599
796 -8599 1763 4308 -4930 -5680 1522 4920 -3452 -6771 3806 3067 -7488 -5891 816 669 -7107
811 -7107 -7030 4855 3547 -4714 1550 9480 6871 -12 2223 10764 3659 -5913 856 4144 -3802
826 -3802 -8256 -3231 3555 -3939 -8341 2425 4800 -3203 -3707 2865 5610 -3828 -7362 4092 2974
841 2974 -6395 -3230 4915 4826 -2480 -395 10286 5207 -3533 2370 6615 533 -6902 -3723 3936
856 3936 -4746 -11533 -849 3315 -3655 -5372 2514 7862 -727 -3607 6947 5105 -3598 -2475 3072
871 3072 3017 -5036 -5459 5477 2956 -4981 -1032 5040 3433 -4548 -2257 6212 -1764 -8461 -74 2299
887B299o737j868O884N574o796k119Q785O39m934l148L623M485q144n011Q717
902B249j074q066K652P549j430q794L890J0010o960o010O837K613k899m806J265
917b974P371k474n219M739L955l962n711O905P229j2159l729J3041k702j2295
931g985K116R350r21r476K358P296m144k548L776K990K5n989P17R439n458q104
947f558Q676P232r720r338J0820P747j2688o03J0758m037o833K997L644j05l818
962a826P60M052k738m768q90R205L742j3675q91J3937m823j0185Q000P982o837
977A045o992O876K301p609K889N637k265k546m545K446R712l910p933P827P163
992A0096j0650q567J2876O415j4891j1J0232r057p352Q928O255m355n230L028
$$ plain form
887 2299 -4438 -6306 578 6152 -644 -2763 6022 6661 1727 -1421 2202 6687 -1457 -6468 2249
902 2249 1175 -6891 -4239 3310 1880 -6914 -3024 6986 26 -5984 853 3466 567 -4239 -2974
917 -2974 4397 1923 -3296 1443 5398 1436 -4275 2630 9859 -2300 -6029 7012 4310 -7985
931 -7985 -5869 3481 2560 -6916 -4558 2738 -1406 -3954 -178 2812 2837 -3152 -2435 7004 1546 -6558
947 -6558 2118 9350 -370 -9708 1112 8859 -3829 -4432 6326 2289 -4544 -1547 2097 1992 -1826
962 -1826 -1066 2986 248 -4520 -5410 3795 7537 -6138 -7029 6908 2085 -8100 -100 7882 1045
977 1045 -5947 929 3230 -4379 -1490 4147 1882 -664 -5209 -2763 6949 3039 -4894 2933 10096
992 10096 -554 -9121 3755 10170 -4721 -4732 5500 -3557 -10909 -1981 4274 -81 -5311 -2283
1006b283M413j947k527P51R217J080j5558N55J4364o526q101J2196M921j4029
1020c474l678J4056r5j1656N788O360q795n378l85K806N760l050n650M444L853
1035I06m848k01J2964J503j3613N236Q060j2482k519J2116J79r450k378L597k5
1050i55N27L786k374O02K345j0789m73J1371n509o758Q065R28j1849K202J5889
1065G008M04r118P625M087r166R67L706j195O0m239n992R73J759l080J309J0352
1081E460l121j3156Q879J0607j2317r31J3398m514j3246K535Q939l408j439Q889
1095F575j236m700K158p54L381M973q405m540M902n980r875N390J1049p794q085
1110a2941J2348K386r992R111J0466n905m023J968o79k885J099J624j228J871
$$ plain form
1006 -2283 2130 183 -2344 -1593 7624 8704 -6854 -6299 8065 1539 -6562 5634 10555 -3474
1020 -3474 -7152 6904 6809 -4847 941 7301 -1494 -6872 -7257 -4451 1309 -1741 -7391 -2947 906
1035 906 -3942 -4143 8821 10324 -3289 1947 10007 -2475 -4994 7122 7301 -2149 -4527 -930 -955
1050 -955 -428 3358 984 1586 3931 -6858 -7331 4040 -1469 -8227 -162 766 -11083 -8881 7008
1065 7008 7412 -1706 5919 10006 840 1807 5513 4318 4378 139 -5853 -4880 -3121 -6201 -4892 5460
1081 5460 2339 -10817 -1938 8669 -3648 -4579 8819 4305 -8941 -6406 2533 -875 -2314 6575
1095 6575 5339 639 2797 2043 5424 10397 1992 -2548 2354 -3626 -13501 -8111 2938 -4856 -12941
1110 -12941 -593 1793 -8199 912 11378 5473 1450 3418 2739 -146 953 2577 1349 3220
1124C220l236o491Q859O385r634J634P553q526r435N300M737p272l118P143k711
1139e592l847O601L999L621M534m444l39N788l229o525M290N013j1174q860J0978
1154H14P59j0982P061Q171o679n199M004L408k831k765K205p47k096k761L40R814
1170B516K531p337O938Q423p769l763R613K626j2295m228P046o610r093N831L302
1185b269l334j315J305M196J547k145J995L990q38o907m04Q242l527o666Q427
1200B297M348p122O99P290J773m459j353K821m142n086j397j152J400k562n002
1215a1647N365M350l463K081P914K154n747P21P427m526o262M373J194m324k584
1230b974J187M855j312l221L932K920l581n034J993M462p368o230P277P55p142
$$ plain form
1124 3220 -16 -6507 2352 8737 -897 737 8290 -236 -9671 -4371 366 -6906 -10024 -2881 -5592
1139 -5592 -9439 -2838 1161 4782 9316 4872 4533 10321 7092 567 4857 9870 -1304 -10164 814
1154 814 1573 -9409 -2348 5823 -856 -6055 -2051 1357 -1474 -4239 -2034 -2781 -4877 -7638 -7298 2516
1170 2516 5047 -2290 4648 13071 5302 1539 11152 13778 1483 -2745 4301 -2309 -11402 -5571 -2269
1185 -2269 -5603 -6918 -5613 -1417 130 -2015 -20 3970 3132 -3775 -4179 4063 536 -6130 2297
1200 2297 6645 -477 222 7512 9285 4826 3473 6294 2152 -2934 -4331 -5483 -4083 -6645 -11647
1215 -11647 -6282 -1932 -5395 -3314 4600 6754 1007 1728 9155 4629 -1633 2740 3934 -390 -2974
1230 -2974 -1787 3068 1756 -1465 2467 5387 1806 -3228 -1235 3227 -4141 -10371 -3094 -2339 -9481
1245i481J932Q382J950m007K712Q498k319m555K964K003l499n810j486M603m235
1260b348n485M529L659k567l117N013M328n400l220O444q12o016n2M030J536l325
1276b803N95P034j31k101K345L318k19n272j289L487m332o518J107J714k003l607
1292h675K671N859k383j972N638K654k481k392K479L069m941k932N644N30l413
1307f45k73M940K690m704j244N846k059o238n48K405j589p151O60O177k970l167
1323g870N246M491r10k360M223M844n275k981M937O10m766k495L328K300n286
1338a964j017O366m28m549L62L890n23n895J74M499l653l633K617L112l12k946
1354c900L653N942l193k152M231J367l009l325J702K319n886j829M100j94k608
$$ plain form
1245 -9481 -7549 833 2783 -1224 1488 9986 7667 3112 6076 8079 4580 -1230 -2716 1887 -2348
1260 -2348 -7833 -3304 355 -2212 -5329 -316 4012 -1388 -4608 1836 1024 -4992 -5044 -1014 522 -2803
1276 -2803 -2208 4826 4695 2594 4939 8257 8038 2766 1477 4964 632 -5886 -4779 -3065 -5068 -8675
1292 -8675 -6004 -145 -2528 -4500 1138 3792 1311 -1081 1398 4467 -474 -3406 2238 2768 -645
1307 -645 -918 4022 6712 2008 764 6610 4551 -1687 -2235 170 -1419 -8570 -7910 -1733 -4703 -7870
1323 -7870 -2624 1867 957 -1403 2820 7664 2389 -592 4345 4955 189 -2306 1022 3322 -1964
1338 -1964 -2981 3385 2957 -1592 -1230 2660 2137 -3758 -3584 915 -2738 -6371 -3754 -642 -954 -3900
1354 -3900 -247 5695 2502 350 4581 5948 2939 -386 1316 3635 -2251 -4080 20 -174 -2782
1369b782q36L706K629m074m24M175n81l937l26L127N56n410J614N755k411k388
1385a607L285K635j593k834J877K711m261l111K209J129k769k770L309L633m955
1400c112q53O368M87m176L01M546Qn715J436M109l155k112J702K043l93l760J411
1417h65M722k715l550K097K883k924m802M234L858o101j305N509l36k783J078
1432a000M063n1l816P48K731m67k144j406L143J211o288K47O054k353m108K991
1448d45L810l821m651N401K749m993r4K961l46j578j440K860K774k670k427K298
1464C88K420k937l039O195J587q136R89N828k795l652L404K826l337k931K648
1479e42J782j202mq86J689P30n249J629O282l141m700L608K859n540k161P612
$$ plain form
1369 -2782 -3618 88 2717 -1357 -1781 2394 1813 -2124 -2450 677 1233 -4177 -2563 3192 781 -1607
1385 -1607 1678 4313 2720 -114 1763 4474 213 -2898 -689 440 -2329 -5099 -1790 1843 -3112
1400 -3112 -3965 2403 2890 -1286 -985 3561 3569 -2146 -710 3399 244 -1868 -166 1877 1484 -2276 -865
1417 -865 3857 1142 -2408 -311 2572 -352 -5154 -920 2938 -3163 -4468 1041 705 -2078 -1000
1432 -1000 3063 3012 -804 -56 2675 2208 64 -1342 1801 3012 -3276 -3029 3025 672 -3436 -445
1448 -445 3365 -456 -5107 294 3043 -1950 -2044 917 571 -1007 -2447 413 3187 517 -1910 388
1464 388 2808 -129 -3168 3027 4614 -3522 -2533 3295 500 -3152 252 3078 -259 -3190 -542
1479 -542 1240 38 34 -852 837 1567 -3682 -2053 4229 1088 -3612 -4 2855 -2685 -4846 2766
1495B766Q95o643K039K976k543l66J740J658l3k296j909J593J993k273j984N084
1511B697M0q472L074O997m629l036N257P71n947o08N303n34k314J761o29q88J540
1528C83j989K484M428l566l575L525J815n206m35P314l185p418M064K633m767
1543c495J384L973j089k069k51M74M14K039o28k014K880j191n797N085N582n277
1559B0j775N361q35o020K882N761l860l616K908j645k965K252L24O05J623k780
1575a760j780M232J582l165J039N554m783o435O251K987o011J667M139l054l387
1590b924J641L276q29j08K55k169O45p74k967M116K902o416n63N369j356l949
1606c851N202N216n561l593N456q18l897K684J145k079j184j244J22K397Q43j719
$$ plain form
1495 2766 3661 -2982 -943 2033 -510 -876 864 2522 2489 193 -1716 -123 1870 -403 -2387 2697
1511 2697 2737 -5735 -2661 4336 -293 -3329 1928 2699 -3248 -3856 1447 913 -1401 360 -269 -1157 383
1528 383 -1606 878 5306 1740 -1835 1690 3505 -1701 -2136 5178 1993 -5425 -1361 1272 -3495
1543 -3495 -2111 1862 773 -1296 -1547 -1073 -659 1380 752 -1262 1618 427 -5370 -285 5297 20
1559 20 -1755 3606 2771 -3249 -367 5394 1534 -2082 826 -819 -3784 -1532 -1208 -603 1020 -1760
1575 -1760 -3540 692 2274 -891 148 5702 919 -5516 735 3722 -2289 -622 3517 463 -2924
1590 -2924 -1283 1993 1164 1056 1311 -858 -213 -987 -3954 162 3064 -3352 -3915 1454 98 -3851
1606 -3851 1351 6567 1006 -2587 2869 2051 -1846 838 1983 -96 -1280 -2524 -2402 -5 838 -881
1622h81P95K576m250k783O891J019o413J982L768m034l025N017L116k889l59J833
1638B363j762l1Q91j465K156r8n761M36L706k001k861M184L096n678j187O517
1654B505r80l235L068J409k918j141Q92J362O01o33j126R30J470l036j053O030
1670D145j298n927K356K552m048k080M283J639m938R6L634q15o95K182M30P27
1686B243j199k479K479J755l022j144L345K24n372J147N719k515l804L860P58
1701A995l292o58J873J233k456l60Q87N8J71r83J151L278k006l001L888J030l457
1718f49j95L170k08m431N33L704k194j705K364L22l85j330K81K503p11k579J047
1735d63J420p03k605J528L637l438j886L964M76k742m5K334K54k889O2K112n82
$$ plain form
1622 -881 -86 2490 -1760 -4543 2348 3367 -3046 -1064 2704 -1330 -4355 662 3778 889 530 2363
1638 2363 601 570 1461 -4 2152 2054 -3707 -3271 435 -1566 -4427 -243 2853 -2825 -4012 2505
1654 2505 1525 -1710 1358 2767 -151 -1292 -400 962 1563 930 -196 734 2204 -832 -1885 4145
1670 4145 2847 -3080 -724 1828 -2220 -4300 -17 1622 -3316 -3220 414 -401 -1096 1086 1516 2243
1686 2243 1044 -1435 1044 2799 -223 -1367 1978 2202 -3170 -2023 3696 1181 -2623 1237 1995
1701 1995 -1297 -1955 -82 1151 -1305 -1665 -778 -720 -549 -1532 -381 2897 891 -2110 1778 2808 -649
1718 -649 -844 2326 2118 -2313 -1780 1924 -270 -1975 389 711 326 -1004 -723 1780 1069 -1510 -463
1735 -463 957 254 -2351 -823 2814 -624 -2510 1454 1930 -812 -857 1477 1731 -1158 -1096 1016 434
1752D34j516j88J492Q79k459n10L947o13k827J064K501j176k714J481L069l424
1768e60j166K163J006k052p46J556J314k258q97K429L58j773j189K309P83l013
1784a736P5L344q77k367J295J954m52k414J165K218j912j496J245J230r00k102
1800a730J211K383k802j294K639Q16j562j427K103J145k583m10K522%j727l48
1816a064K226N05k961L49K565j084j755R37J510k48k559J264K428k009j466J582
1832B20R80j215k293K220J642k537n87K526K84j760j289K771L76k682J02K555
1848A313o73j880Q9J838K67k580J115K683j677j408J263J228n91k324J637J673
1864A973k173r99J324J024j640j494K233J345k762k30K309k85j593l47J958K26
$$ plain form
1752 434 -1082 -1270 222 1101 -1358 -1868 2079 1466 -1361 -297 2204 1028 -1686 -205 2864 -560
1768 -560 -1726 437 1443 -609 -1355 201 1515 -743 -1640 789 1147 -626 -1815 494 1277 -1736
1784 -1736 -1661 1683 806 -1561 -266 1688 1236 -1178 -13 2205 293 -1203 42 1272 372 -1730
1800 -1730 -519 1864 -938 -2232 407 1223 -339 -1766 337 1482 -1101 -1511 1011 1011 -716 -1064
1816 -1064 1162 1667 -1294 -945 1620 536 -1219 -282 1228 980 -1579 -315 2113 104 -1362 220
1832 220 1200 -15 -2308 -88 1554 -983 -1570 956 1240 -520 -1809 962 1338 -1344 -1242 1313
1848 1313 640 -1240 -1151 687 954 -1626 -511 2172 495 -913 350 1578 987 -1337 300 1973
1864 1973 -200 -1199 125 1149 -491 -1985 248 1593 -1169 -1399 910 625 -968 -1315 643 869
1880H69k608Q20K217j111j108Q38J727k93j835Q40J738j429j754R10J395r82k434
1897b200K050J278k462m84K365J94j650n12K245J05k612P82J685k28j250k16J751
1914H41M79k372J144J976r91j984Q18J915j046k825K243J488k875n62J607O98
1930E54j392n00J902O73j729n68J576R03j211j674K319R35l656P64K622q34k030
1947a346Q73K427j744j748J909P81j218o21J33N22J00j594R26K171j161j785J255
1964a20K164k090j457L421J71l845N93J984q01j060O44J100q25j031O56R55L08
1981G67q29j147K013L32l348J512K836j872j954J650J768k100p82L279n40k355
1997g70P51L26o29N35r26N37P28j504j163J585J966k198o02L295r13l425K367
$$ plain form
1880 869 -1739 -919 1298 187 -921 -83 1644 1351 -484 356 2094 665 -1089 -179 1216 234 -2200
1897 -2200 -150 1128 -1334 -1818 547 741 -909 -1421 824 929 -1683 -901 784 556 -694 -910 841
1914 841 1320 -1052 92 2068 1077 -907 -89 1826 780 -2045 198 1686 -1189 -1751 -144 554
1930 554 -838 -1338 564 1237 -492 -1060 516 1419 208 -1466 853 1788 -1868 -1104 1518 684 -1346
1947 -1346 -473 1954 210 -1538 371 1152 -66 -687 -554 -32 68 -1526 -600 1571 410 -1375 -120
1964 -120 2044 -46 -1503 1918 2089 -1756 -1163 821 20 -1040 -396 704 -121 -1152 -496 459 767
1981 767 -62 -1209 804 1136 -2212 -700 2136 264 -1690 -40 1728 -372 -1154 2125 1585 -770
1997 -770 -19 307 -322 213 -713 -176 552 -952 -2115 -530 1436 -762 -1364 1931 1018 -2407 -40
2014d0K276k279o34J544k3k021M11J637k5j60l60j213J313J19k131J766J848k822
2032g94k088K687R60k764Q34L297j985k653K675O98j087J044Ol22m52p13k12J436
2050E67J191k319n27K595j875k286L701J326l513L0J879r35j773J751J730k085
2066e43k55P68p18J131M63j185J142O87k749j64K678K53l002J486K558l512j776
2083b738L590M82k002J158K19r11q33Q34N19N86k68j746k37K173j170j880L852
2100A628M79l794M22K614j117j799K005J680k999m55J599l46L8M19l46O83k76
2117D35k177J013K490p28k464J473J735l542k42M083q29k881J284R26j702l06
2133a432K049K95q16o0m95j8J243p58n73K240q16k730J444K127j562j485K077
$$ plain form
2014 -40 2236 -43 -677 867 844 -1177 -766 871 846 686 326 -887 426 545 -1586 180 2028 -794
2032 -794 -2882 -195 765 -1999 -1165 2132 147 -2506 169 867 -220 824 830 508 56 -657 -869 567
2050 567 1758 -561 -1088 1507 -368 -2654 1047 2373 -1140 -1110 769 -166 -1939 -188 1542 -543
2066 -543 -798 -30 -748 383 846 -339 803 1490 -1259 -1423 1255 1508 -1494 -8 2550 -962 -2738
2083 -2738 852 1334 -668 490 709 -202 -1035 -201 318 904 636 -1110 -1347 826 -344 -2224 1628
2100 1628 2107 -1687 -1265 1349 232 -1567 438 2118 -881 -1336 263 -83 -45 374 28 711 435
2117 435 -1742 -729 1761 1033 -1431 42 1777 -1765 -2007 2076 1247 -1634 -350 576 -1126 -1432
2133 -1432 617 912 96 36 -459 -477 766 8 -565 1675 859 -1871 -427 1700 138 -1347 730
2150G30Q31l171K88K833j127o72O16k22k90J04j047J196R88r98j229J052J524
2167A406k744M52L246j389k529J685Q87j159q25J484J7j302j38J082k75M78l93
2184a7l87J582r24j644J809J291j822j047K049J67k869Q87K756j831j065J467
2200D02L23q00m60P75M32p33r43k78J098L36j411R00K249j860j144K450L66j708
2218fj25J516m03j939O66J016q67k21p7R3O24r80k17J572l35r18k97J399k65j935
2238a699J070J769j544n57J654M60q36k7J213M38j555m68O49k95n96j055J060
2255c19O57j646m86J949M4j469O65J633j64k184J172J109j381l19O86O54k81n80
2273b60P26J177j031r46J270L19j235j087J210J51k191J47J287n7o50k3J608j
$$ plain form
2150 730 1561 -1610 -1322 1511 384 -288 328 106 -184 -80 -1127 69 1057 59 -1170 -118 1406
2167 1406 -1338 -886 2360 971 -1558 127 1014 -145 -970 514 531 -771 -909 173 -102 376 -17
2184 -17 -404 1178 254 -1390 419 1710 -112 -1159 890 1057 -1812 -925 1831 0 -1065 402
2200 402 725 -75 -535 240 672 -61 -1004 -1282 -184 152 -1259 -359 1890 30 -1114 1336 1702 -6
2218 -6 -131 1385 982 -957 -291 725 -142 -363 -440 -347 277 -703 -920 652 317 -601 -898 501 236 -1699
2238 -1699 -629 1140 -404 -961 693 1153 317 290 1503 1941 386 -82 567 272 -324 -1379 -319
2255 -319 338 -1308 -1794 155 199 -1270 -605 1028 864 -1320 -148 961 -420 -739 -53 601 320 -260
2273 -260 466 1643 612 -334 936 1255 20 -1067 143 294 -1897 -1750 -463 -520 -1170 -1193 415 414
2291D14j073J159Q78o32q06L24Q03k71j601P41R49r78n97O88J087n99j180J160
2309D66N12j605j93P46l36r04l41J106P69j000N70J092J47k72n2R23q3j811N29
2328B63N52r49r39M6J245m18j070Q86Q88n70q04R22N09q08o90O65O28j242J40
2347g46J009K66l40k19J588J36j542O33N36p51j227m31R14l60j509R02J099o90
2365g32m42R49J153l99j346J573N43j195l56O57m2o66l39J755j45j251M80R96
2383A193j24j043l31N58m61r52q6N20l38n29L56J294j59o05J143R83p99k47O81
2402A054M62j049q77P67M81q93k53L99P86j099n58J554rj562j22J205o23j158
2420a495N4J454n15j032J449P01m05k24N89J234n31j088N85J82j122o58N83O43
$$ plain form
2291 414 -659 500 1378 746 -60 264 1067 796 -805 -64 885 -93 -690 -2 1085 486 -694 466
2309 466 978 -627 -820 -74 -410 -1314 -1655 -549 220 -780 -210 882 1029 757 705 1628 1545 -266 263
2328 263 815 -134 -1073 -1027 218 -200 -1270 -384 504 -66 -870 52 561 -247 -937 -272 356 -886 -746
2347 -746 263 529 189 -30 1558 1694 152 785 1321 570 -657 -1088 -174 -534 -2043 -1141 -42 -732
2365 -732 -1174 -225 928 529 -817 756 1299 104 -252 405 363 -303 -642 1113 968 -283 197 1193
2383 1193 1069 26 -305 253 -208 -1160 -1246 -726 -1064 -1593 -1237 57 -102 -707 436 1419 620 373 1054
2402 1054 1516 467 -410 357 838 -55 -308 91 877 -222 -780 774 765 -797 -919 286 -337 -1495
2420 -1495 -1441 13 -502 -1534 -85 616 211 -13 576 1810 1279 191 776 958 -164 -822 -239 404
2438D04p84j177J772L83j655M96J121k57q23j32J250o17r58R74L68j77j86m74
2456d72J429K1j183P06J062r88j021M99L85j254l54J037j36j219Q66P75p3k30
2474a50J14L80L02o76k33M99M82j038o20J349Mj462J210J031r33q13Q35M65j118
2493c72l02J219q06m31K3k21Q34J80l53P73M78r33n06J578L66j690j05J373j381
2512b76q68J110O71j075M8K73K68n01L74J18j9Q6r09m35J467k35j330J572P39
2531A078j455n99J774L31j330M26J222j124n97O08m96J22J04p08L84J75n27j98
2549h10J287K27j398J27J620j313p81K103j99j119k61R98l84m22O15J76k70K6
2567B22m16j43J121l92j103J249K12j859J16J968n12j129P82P83j571k11J480
$$ plain form
2438 404 -380 -1557 215 598 -1057 -561 560 303 -520 -652 598 -19 -977 -3 365 188 2 -472
2456 -472 957 978 -205 501 1563 575 -446 53 438 -816 -1170 -133 -269 -1488 -622 153 80 -150
2474 -150 -36 344 646 -30 -263 236 718 -320 -940 409 413 -1049 161 1192 259 -554 281 746 -372
2493 -372 -674 545 -261 -692 -669 -890 -56 124 -229 544 1022 89 -417 1161 1527 -163 -268 1105 -276
2512 -276 -1144 -34 637 -438 -390 -117 151 -350 24 142 123 209 -700 -1135 332 97 -1233 339 1078
2531 1078 -377 -976 798 1129 -201 225 1447 323 -274 334 -162 -40 64 -644 -260 -85 -612 -810
2549 -810 477 704 -694 -567 1053 -260 -1041 1062 863 -256 -517 481 97 -325 290 466 196 222
2567 222 -194 -337 784 392 -711 538 750 -1109 -993 975 463 -666 116 899 -672 -883 597
2584E97m59k34Q6J76n03K71o9K8M98J68j441K58K047j832l74K316p63j616K45
2603f01J352o67l98P30k4q05PL48m54J068o47o73J251rj464Q19J408p52j393J092
2623A88O53j504J52J450n45o64K34K37j34P3K95k20M47n58q02O23Q15j351j31
2642g42J581p10j397Q74J109n96n53R18K18j244M64N58l33j74r6j49M56Q9m45
2661a72K18Q75r38q97J597K0j571N81J039p85j026J108r9j83n9J61M78m53R8k43
2681b51O28M67j076r9J089q57j156J328O56j021p06J362J31j297O97O57n19k59
2699b26J17R0J86k93k00O28o0n48j06J031j48q80M98R87j467l11Q80R2n57m18
2719g05Q65l81k75K7N97L8km61O15L80j018O2J037Mj056p8J014l27q80J023L32
$$ plain form
2584 597 138 -96 -10 166 -337 -66 -135 -107 391 559 -882 -624 1423 -409 -783 1533 770 -846 -601
2603 -601 751 84 -314 416 392 -413 -406 -58 -512 556 -91 -764 487 478 -986 -167 1241 489 -904 188
2623 188 841 -663 -511 939 394 -270 -36 201 67 140 435 215 662 104 -698 -75 740 -611 -742
2642 -742 839 129 -1268 -394 715 119 -434 484 702 -542 -78 480 147 -27 -123 -272 184 273 -172
2661 -172 46 921 -17 -914 683 703 -868 -287 752 -33 -1059 49 -50 -233 -292 -131 347 -106 -8 -251
2681 -251 377 844 -232 -331 758 -99 -1255 73 729 -292 -998 364 495 -802 -105 552 33 -226
2699 -226 -109 -19 167 -126 -326 302 242 -306 -412 619 471 -409 89 1076 -391 -702 178 270 -287 -705
2719 -705 160 -221 -496 -469 128 166 164 -297 318 698 -320 -258 779 783 -273 -351 663 336 -544 479 811
2740H11q39k78L90ql65n07L55O00m77l34K19R62l95l19M98O64r19l38J037n1l22
2761C84m57N56l42p19O03J71k45j87K18J70O9n78P7L44o3m42L9R01p06n94R73
2782A72K48o34K95O09Kl89j52J57m9q00K76N91n5n56j90M68Q4n90M81K18j54m61
2804d29M04K91l50n31R26j50k70l4L62J72m34j59L65N67j146J33L80n6l26k66
2824e51O10J03o70M34L00n4k84j88Q18j83n97L08L41j60m93qQ28m92m64M97L35
2845D30m68k07K84L77k42m56N14K14q28n6Q02r8p65K28N50Rn53M93L88l36k40
2866D0K3J05k78j46M8L83n22k6J1M81k51j97M71q4m41J53N24j47k90l17Q48J42
2888E30o02r4O88j5o14j54O32m5p85N62l2j77l93J33N96l44l65N34K77l28l40
$$ plain form
2740 811 -28 -306 84 76 -289 -796 -441 159 -318 -652 -433 529 134 -185 313 977 58 -280 757 706 384
2761 384 -73 483 141 -578 25 196 -49 -236 -18 152 221 -357 -280 64 1 -441 -402 499 -207 -801 172
2782 172 420 -214 81 690 692 303 151 308 259 -541 -265 326 271 -285 -475 -7 77 -513 -32 186 32 -429
2804 -429 -25 266 -84 -615 311 161 -109 -143 219 391 -43 -202 163 730 -416 -283 97 41 -285 -551
2824 -551 59 162 -508 -74 226 172 -112 -300 518 335 -262 46 387 227 -266 -274 554 62 -402 95 430
2845 430 -38 -245 39 416 174 -282 232 446 -382 -438 364 266 -499 -271 279 288 -265 228 616 280 40
2866 40 63 168 -110 -256 -208 175 -347 -373 -362 119 -132 -329 142 58 -383 -230 294 147 -143 -460 388 530
2888 530 -72 -166 522 507 -107 -261 371 326 -459 103 71 -106 -499 -366 230 -114 -479 55 332 4 -336
2909c36N56K94p59n23R80J60o94K10J54L43o86j9R71l08n29L44jJ06m65j42N61
2930B17l8n93J96N51n29k06K93P93p27l34M74K50n01N7K05J02m46J57L44j27%
2951A38Q0j04L34m41p3N20j6o20K06L19j13p88N39M08j91m09L36oj70j89K74O3
2973I7Jm51L77N2k81n3N35K89p51k09N74n5o00O57N13p11j78L8L58m78N2J24j03
2996b03M97m28j82R79n15o45N64M28n96m93J045L03j018m6O20q5l87Q9R2J42j87
3017b6k78K52J93j61j10M39J8m94k24P67k59o31P19K12q47k34R58no93L47L14
3038B57o68J71J67K2O39n58o22O30M44l78l14P19O7j072J32P08o58j62P69k32
3058F1l58j64M52j92L05J0J33pJ98r48J32R24o43n11P58l69o05N16L03L07q04
$$ plain form
2909 -336 220 514 -245 -768 212 372 -322 -112 42 385 -301 -320 651 343 -186 158 157 263 -202 -344 217
2930 217 179 -414 -218 333 -196 -402 -109 684 -43 -377 97 347 -154 -97 108 210 -236 -79 265 138 138
2951 138 218 114 448 7 -66 454 438 -182 24 343 230 -558 -19 389 198 -211 125 119 -51 -240 34 97
2973 97 98 -353 24 76 -205 -258 277 566 -185 -394 180 125 -475 182 695 -16 -194 -156 202 -276 -224 -100 -203
2996 -203 294 -134 -316 663 148 -497 67 495 -101 -594 451 754 -264 -310 310 225 -162 -73 19 161 -26
3017 -26 -304 -52 141 -20 -130 309 327 -167 -391 376 117 -514 205 417 -430 -664 294 289 -404 -57 257
3038 257 -411 -240 -73 -51 588 30 -592 38 482 104 -210 509 576 -496 -364 344 -314 -476 293 61
3058 61 -297 -461 -9 -201 104 114 247 240 438 -510 -378 546 -97 -608 150 -219 -824 -308 -5 302 -502
3079e02M71L77n26J5L86l8k74K45n05O19l01L4O7K29m08n67P42O88q64k63P95
3100D20k79l76n3L81k34K58m3Q5l38L83m02L74Q00j040j35K82L14q32K78Q78o56
3121F5q65Q53J61m66L76K67n85j29P8L9L79k59k29J78L93l80m46R54L11j181K76
3142b10P82p12j57O80J78m33j35M29m83L0J85k79M9L74m92k26P52j70o10M74P02
3163G28r50l70Q58l15r6o8Q53o43NPK58J2j02j1J4j00j02m02O97N13j074K6Q06
3186E44n71k77O95k62j49m10N42nn51N31P5k65L5N6L5L73k73m62M68L62o96l69
3208e74O83J34p39M31L33o71J01M76m4Qk59J85K2R8p1p3K20n8p07M02L26n17O3
3231b31N83j48n84k04J009k21k71J06K63k04k07J25J29Kj49K25j67J30l19NL84
$$ plain form
3079 -502 -31 346 -180 -165 221 183 -91 154 -351 268 -33 1 68 297 -111 -678 64 752 -112 -375 420
3100 420 141 -235 -288 93 -141 117 74 159 -179 204 -198 176 976 -64 -199 83 397 -435 -157 721 65
3121 65 -800 53 214 -252 124 391 -194 -323 -245 -206 173 -86 -315 -137 256 -124 -570 384 695 -486 -210
3142 -210 572 -140 -297 383 561 128 -7 422 -61 -31 154 -125 -76 298 -194 -420 332 162 -448 26 728
3163 728 -222 -592 266 -49 -145 -213 640 -3 2 9 267 279 177 166 180 80 -22 -424 273 786 -288 -262 544
3186 544 -27 -304 391 129 -20 -430 112 107 -444 87 162 -103 -68 -12 23 396 123 -339 129 491 -205 -574
3208 -574 109 243 -496 -65 268 -403 -302 174 130 138 -121 64 86 184 113 40 260 202 -505 -103 223 -294 -231
3231 -231 352 204 -380 -584 425 204 -67 39 302 98 -109 16 145 147 -2 223 56 186 -133 -128 256
3252B56j59o02O24r6m48l7M94j45PL6K51m45K51P9jL34m90j03N70j49m12J1L79
3275B05k02k48J97K23j37l75N90J02p8m38J61K73l84j39O76k86k96P2J11Prk66
3297b41L21K02n43K93M38l63j97j0K09j41o3J11K34O7o11M7N32k01jr4L54j17
3319B26l45L12Om83o3P13l32o9j27O2J03l54QO36k74k93M57L2J32k14l5K13k67
3342D4l67N29r2l42J60j78N74j36o29L79J11K9k45L6K56m52P5J70%J91k15K01
3364I9K42m09J74K72l05k95J75J78J08k64p7k6J86k16K63R7m22j27J0M18l80k56
3386e55P46j03j82J5J94L30p52M13jk50J8K0J65J23n58J04N03j10k52l0J65k9
3408b6J18j52L71k12n39N79k50j13k4K66Rk01J54K34O6n50L66j93K50k47j9M53
$$ plain form
3252 256 97 -505 119 23 -425 -462 32 -113 -106 -70 181 -264 -13 66 65 399 -91 -194 376 227 -185 -174 205
3275 205 3 -245 -48 175 38 -337 253 355 277 -161 0 273 -111 -250 426 140 -156 -84 27 34 25 -241
3297 -241 80 282 -261 32 470 107 -90 -100 109 -32 -95 16 250 317 -294 -247 285 84 83 -11 343 226
3319 226 -119 193 199 -284 -347 366 34 -35 -162 -100 3 -351 -343 293 19 -274 183 215 347 133 98 311 44
3342 44 -323 206 114 -228 -68 -246 328 192 -437 -58 53 82 -163 -127 129 -323 -248 -78 -78 113 -102 99
3364 99 341 -68 106 378 73 -222 -47 131 239 -25 -102 -128 58 -158 105 202 -220 -347 -337 81 -299 -555
3386 -555 191 88 -94 -79 115 445 -307 106 105 -145 -127 -107 58 181 -377 -273 230 120 -132 -162 3 -26
3408 -26 92 -60 311 99 -440 139 -111 -224 -248 18 27 -174 -20 214 280 -270 96 -97 153 -94 -113 340
3430C40k16n59J68K61K48l76J12M70m07l04M90l13J90K27j78K39n86Q2K56q7K6
3451H3j66J50J01k94j60M29k09k25M7J87j61p3K49m7m2J59j27M35K44m38j72M51
3473D21l83j20M2M46k72o84P03J02n37J12L43j32k85l2O63l00l07O6L59k98J09
3494A6j61j26P10m49j35P28r1n86J93K98k33o57O66j56l40J30J76k92K12J60j98
3515a35J59Jk02M5L27l88R1N10j34p37L52M27j69j50J52K76o5m87L13R6k36m4
3537Bk65J39Q6k65k4M60J14m33O9L19j61n20Q79j8q37K81M54l65k46N47j26j58
3559f8J10J43k09M76k28l66Q7K63r15N32L49n36J42K77P9k71J70L64k99j5J07
3580A92j73k04K22Mk96M22k66l09O84J71o65J12L41j89o64O77Nk51Q5K04l69J01
$$ plain form
3430 340 124 -435 -267 -6 242 -134 -22 448 41 -263 227 -86 104 331 153 392 -194 -112 144 57 83
3451 83 -83 67 168 -126 -286 143 -66 -291 -244 -57 -218 -291 -42 -89 -131 28 -99 336 580 142 -30 421
3473 421 38 -82 -40 406 134 -550 153 255 -282 -170 173 41 -244 -276 387 87 -220 -154 205 -93 16
3494 16 -145 -271 439 -10 -145 583 492 -94 99 397 164 -493 173 17 -323 -193 -17 -309 -97 63 -135
3515 -135 24 25 -177 -132 195 -193 -102 408 274 -463 -111 316 147 -3 149 425 360 -127 186 282 46 2
3537 2 -263 -124 -38 -303 -327 133 247 -186 -117 202 41 -479 400 382 -455 -174 280 -85 -331 216 90 -68
3559 -68 42 185 -24 452 224 -142 -55 208 -707 -175 174 -362 -220 57 136 -135 35 399 100 85 192
3580 192 19 -185 37 41 -255 167 -99 -408 276 447 -218 -106 235 46 -618 59 64 -187 -102 102 -267 -166
3602a66l5K53L48J90p71J49K04j26j94N25J67r38j32O33k17k49M04J0j37n6L30
3623A92k12j93J86p4M1L23l29j39O32q8k23K5K48k80n94P07m0p40M75L32n45K98
3645Bk32K56j62k0J45k8M4J12m21L69M07o81j6O41j19l41K12L83o31m96Q30n9
3667A95l32K34k7j48K0P5j56L33L8m22J08k2J34n56P63J50p69K76K30l0m21J13
3689b14K43k22J50K92p2j85L8P7J56O1m34L10K75o64Q0J01k8k03R5N34k22m15
3711b47L61J32m53K32L6J13q4p0l8J23o7j93N2K74J20m47L78j32q3k6K15O9l75
3734a10L13L8k68l68K28R8m9K63l81L21K3n12K43K31o4j71J84L01j01m66N86l30
3756IJ11m4J23M1k69r7L29j90n7k25N08J38k95m23L41m7o7r7K89j00m4k57N41
$$ plain form
3602 -166 -201 52 400 590 -181 -32 172 46 -148 377 544 -394 -526 107 -110 -359 45 55 -82 -138 192
3623 192 -20 -213 -27 -101 -60 263 -66 -205 427 339 116 141 389 109 -485 222 182 -558 -83 249 -296 2
3645 2 -230 26 -136 -156 -11 -39 5 117 -304 65 472 -209 -225 416 297 -44 168 551 -80 -576 254 195
3667 195 -137 97 70 -78 -58 17 -139 194 232 -190 -82 -104 30 -526 237 387 -382 -106 124 94 -327 -214
3689 -214 29 -193 -43 249 177 -8 30 107 263 324 -110 200 475 -189 -109 -8 -36 -239 -144 390 168 -247
3711 -247 114 246 -207 25 61 174 90 20 -18 105 38 -155 -103 171 291 -156 222 90 7 -19 196 265 -110
3734 -110 203 241 -27 -395 -167 -69 -118 145 -236 85 108 -404 -161 70 6 -165 19 320 219 -247 339 9
3756 9 120 76 199 240 -29 -126 203 13 -44 -269 239 377 82 -341 0 -47 -114 -211 78 -22 -66 -323 218
3779B18l34j94J89J04j6J0Q5J2j06k95N16l72J88J87k04K09oj98L72m05Q0j73
3801a33K48L9k64m2L76j04k75k6j3M79j95k81K56Pl71M39j78Mk7k35L43M3k21
3824a31n7M40ll83L60j1m3J59l26J59k71O8q6J7M3n2K8N1PJ51j44j7j74m8L74
3849A11l18J37J3J35k22J89K3K51k85k76L14j22J47l7j74K72m63M1M13j97j87
3870b35J22J79J43j86o3L87n52n2L16K60j67k23L8M2M1n2K7j05N64n91L0K77n56
3893c56n0M89k63n6M5J24K24k96O1L06o8j93J3J79l6l52L63J13k50n0j23K11J12
3916A47k98K14J55k43j15J29OJ74q8j41pJ37l36L12M6J68m12R7K0k7J52J49j47
3939I2m62K86K84j32j88Q1m3K80j56KJ76K70p89K16K32k93k81M24k7J36j80K9
$$ plain form
3779 218 -116 -310 -121 -17 -33 -23 62 74 -32 -327 189 -183 5 192 -12 197 191 -7 365 -40 40 -133
3801 -133 115 154 -110 -152 224 120 -155 -181 -194 285 90 -191 65 72 -299 140 -38 -34 -61 -296 47 90 -131
3824 -131 -188 252 249 -134 226 215 172 331 5 164 -107 -39 -125 -108 -65 -117 -89 -38 -31 120 -24 -41 -215 -263 111
3849 111 -207 -70 -57 78 -144 45 68 319 34 -242 72 -50 97 60 -114 158 -305 -264 149 -48 -235
3870 -235 -113 66 209 23 -40 347 -205 -257 59 319 152 -71 -33 9 50 -2 25 -80 484 -107 -77 200 -356
3893 -356 -406 83 -180 -236 -191 -67 157 -139 -78 228 160 -33 -20 159 123 -229 134 247 -3 -53 -176 35 147
3916 147 -151 63 218 -25 -140 -11 -5 169 81 -60 -67 70 -266 46 92 260 -152 -55 -35 -62 90 239 92
3939 92 -370 -84 200 68 -120 -39 -82 198 42 44 220 490 -299 -83 149 -144 -425 -1 -28 108 -72 -43
3961d3N2j1K9K69m02R1K32j38j48j60n9M98j52n54L57L34m63k0L3P22n44l16K46
3984a47m8K36k5P8j10j8J60j10R2J51l54L79Ln51j7N65l12k21J33K15k91K4K16
4007D8L0L6Q6j82k52M53j65q4J62l31ML44lm69J90K87pPk05L65l75j39J80J95
4031A75l05k3l4K32M7j4j91K52K47m92KM95k33k92L59o9k48l5L82j89Np6J30j59
4055c4L17n36r2M51r7l95L64P2Q2l52K91P9m91J95K99r7j54J09P8k02O3J84j51
4078a7k2J78j27r4L26k36PR5j39k68N90k62j55L3R6j19r5M24j08k21K63j44q3
4101g8j80J4J71K75j81k26J75J32R6l01J6M36m99l7J16M09n63N5K81j84K20J05
4123B52j74O6j59o6K77L1l50j79M22j45l05J74J92j19n8K06j6k37L56k61J14J37
$$ plain form
3961 -43 9 -2 27 296 -106 -15 217 79 -69 -229 -288 210 58 -496 -139 195 -268 -288 -255 467 -77 -393 -147
3984 -147 -195 41 16 94 -16 -34 126 16 108 259 -95 284 287 -264 -281 284 -28 -249 -116 99 -192 -168 48
4007 48 78 114 200 18 -234 219 54 -30 132 -199 -195 149 146 -323 -133 154 147 154 -51 314 -61 -200 -20 175
4031 175 -130 -153 -187 45 92 78 -113 139 386 -106 -104 391 158 -134 225 156 -92 -127 255 66 71 -5 125 -34
4055 -34 283 -253 -345 106 9 -386 -22 50 132 -220 71 150 -341 -146 153 56 -98 11 89 -113 -50 134 -17
4078 -17 -39 139 12 -82 244 8 15 110 -29 -297 293 31 -124 -91 5 -114 -209 215 107 -114 149 5 -78
4101 -78 -258 -244 -73 202 21 -205 -30 102 198 -103 -87 349 -150 -187 -71 338 -225 -170 111 -73 147 252
4123 252 78 144 -15 -81 196 227 -123 -302 120 -25 -330 -156 36 -83 -141 65 49 -188 168 -93 21 158
4145A58l21L33j11J3j22J82N7o0P3j35L15l70k87M22Q8n20K01K64l79R7M14j98
4167A14K82m54j47j2L25k10K83j1j45j99R0N29m56m5L19l74q1M59j02l20L08k35
4189h2J94j76R7j50lJ83o8j82M45l58k70L46K10o5j99J71K15l55j43K64Q2l09
4211a53J46M4RL62l82K00l62K1K10j67J88k26l90M97J69j31k00L76j36k85J36
4232g4J91k30K82J0o2j29l2L5M18m87nO7J66p7l57L77J73l69L8J43m9j71l5J7
4256a60P1J56n7Q6p8K3L0k18J60K7q1L24k79m25J17P12n23K00L5j04j95Q3J85
4279H9k17J32m0k17K72l5k86L11k23L64l08J45nl42K11K66k72l1jL70K3l63R8
4302e9J55l60K65K65o3n48L07J44L34n30r9J58J48k51J7N04m99K3O3J17j89j7
$$ plain form
4145 158 -163 170 59 72 -50 132 189 129 202 67 382 12 -275 147 235 -285 -84 180 -199 -102 312 114
4167 114 396 -58 -205 -217 108 -102 181 170 25 -174 -84 445 -11 -56 263 -111 -192 267 165 -155 153 -82
4189 -82 112 -64 33 -117 -120 63 -5 -187 258 -100 -370 -24 186 121 -78 93 308 -47 -190 74 156 -153
4211 -153 -7 37 46 408 26 226 -136 -115 95 -72 116 -110 -500 -3 166 35 -165 211 75 -210 -74
4232 -74 117 -113 169 179 117 -12 -44 -9 409 -78 -83 -16 150 73 -284 93 266 -103 -65 78 29 -142 -177 -160
4256 -160 -89 67 10 96 18 41 71 -147 13 40 -41 283 4 -421 -304 408 -115 85 120 16 -179 -96 89
4279 89 -128 4 -36 -253 19 -16 -302 9 -214 150 -158 -13 -18 -360 -149 117 -155 -186 -187 183 206 -157 -59
4302 -59 96 -264 1 266 203 -345 -38 106 440 -90 -189 -31 117 -134 -117 387 -112 -89 -26 91 -98 -115
4324a15J90l23L31r7k54K86K0n9J4J25l32K68r6J61k13K70o8O3j17k0kQ8j47P6
4348D9J13n8j2l33M04j58k26Q0J32o5p3m4J13J43k26J07J1J0o0J78Rl30L27Qk01
4373a02m9j8K45k11K11Q1l7j84J06K34k51Ol2j58L34k90M6O4J95k25l86Q29k81
4396A27j37j30q5K73j65R1M3J4j47R8k2K38j72J49Jr6j53l1K04K69l75J7M1J44
4420A96j1k60K25r6k68O3N15n42L35j58J31k34J61k81L19J31j86n7q8K61o9l06
4442b19M16l25j09M41l13R0J01j70K64j90k7J42k75L05l05L68m16k39O46j07m11
4463c33M49kj74j4N2l64N66lm88M00m8l50K61J22r8K15p6M8r8m2j43J98q9o0Q4
4488A3J19j97L0M2L05m30j67L13j55J47J82m3k46pl86L44R4m4J26o7j7L33m12
$$ plain form
4324 -115 75 -248 83 -14 -268 18 38 -21 -7 118 -214 54 -42 119 -94 176 108 171 54 34 32 120 -27 49
4348 49 162 104 92 -241 163 5 -221 -141 -9 -74 -147 -191 -78 65 -161 -54 -43 -33 -93 85 94 -236 91 99 -102
4373 -102 -151 -169 76 -135 76 157 120 -64 42 276 25 31 -1 -159 175 -115 -69 -5 190 -35 -421 408 127
4396 127 -10 -140 -225 48 -117 -26 17 31 -116 -18 -40 198 26 175 176 80 -73 -104 100 369 -6 11 52 196
4420 196 185 -75 150 54 -214 -151 364 -178 157 -1 130 -104 57 -224 95 226 40 -17 -105 156 87 -219
4442 -219 197 -128 -237 204 -109 -19 82 -88 176 -14 -41 101 -174 131 -174 194 -222 -461 185 78 -333
4463 -333 116 114 -60 -74 -22 -386 180 177 -311 89 41 -309 -48 74 -24 191 115 163 65 23 -120 78 -11 -71 13
4488 13 132 -65 -35 7 312 -118 -285 28 -127 20 202 159 -87 -94 -480 -136 -42 -86 40 -27 -44 289 -123
4511a23L23m50J7M66j84O0l15K65j68K15j44J58j99j40L74j73L03k42l14L75N3
4532A57K65l67L9K46m69P2K46n2l89M20k52j61K08j3J42k94P9K5K9j52K09O5j66
4555a13K26l16p0L50k3k80L83K9j28j97O1P0j30J18P0M8N9pk10l61K35L28k20
4578g8K9j17j54L82Q3k95kK40l22j80M37K04q8k92l8L62k17l4K5J07J69n10K73
4601a6oM3q8J28J16O7p8j84q0J04j04K24j91OJ86m6n8N2J06k69J36k28j48K25
4625a03M14l90J64o8K09l1Q9k10k75J78O9o0l4J50j6l19J65k27M54p6j46n8J69
4648D8K95m42J20L10o04K1N05q6l32K06K48j85j54L3j02J95Q6J1n5Qk89K32j10
4671d1J17kM2L37n32k5K78oq6k94L41j98j07J22K45l69P7J33l7l1N9l13N01l05
$$ plain form
4511 -123 200 -250 -233 233 49 109 -206 59 -109 106 -38 120 -79 -219 155 -18 285 43 -271 104 157
4532 157 422 55 94 340 -129 -57 189 137 -252 168 -84 -245 -37 -50 92 -202 -123 -98 -69 -221 -12 53 -113
4555 -113 113 -203 -273 77 54 -226 157 186 58 -139 -78 -8 -138 -20 50 98 157 150 -60 -421 -186 142 -78
4578 -78 -49 -166 -320 62 145 -150 -152 88 -234 -414 23 227 139 -153 -191 171 -46 -80 -55 52 221 -289 -16
4601 -16 -22 21 -67 61 177 244 166 -18 -98 6 -98 126 -65 -59 127 81 23 75 181 -88 48 -180 -328 -103
4625 -103 311 -79 85 17 226 195 284 74 -201 -23 46 -14 -48 102 86 -233 -68 -295 159 83 -63 -121 48
4648 48 343 -99 21 331 -273 -252 253 167 -165 41 289 104 -50 -17 -119 76 162 173 118 126 -163 69 -41
4671 -41 76 74 116 453 -79 -104 174 168 82 -212 129 -69 -176 -54 191 -178 -101 32 -5 -36 23 -290 211 -94
4695i4nK36q6k6O1j31J34q8n1R9K1l3j00J62j84J03j02NJ22l9k2J10k10J26k92
4720b84M37N6m71R5O79p04K58J76r7J7p7o7j6J53l46J39R4J45j11p7J77k10o1
4743i5P0R9J22jO0k64k10K20L8k31mJ08l5K3J39L6k33J99j80K40l9J53j86O9J16
4768B14k22j14J82k39J79r4J11J56k64P6Q1k56J82j83P1J91rq8K02n3k33O5l3
4791g8q8m9M62O5m70J32J10l8J39j83N1k2K17l07J19j92p6K31K33p0j59J51j43
4814C5p1J41j15Q8K61n09J68J01r7M7l42L88q5l2J68p7l9k32L23k27l2J79l2L20
4838C29l46j53P8JK9J68k93K42Nr3p5J56p3n6J18J72k03M3n3j30K70k28j8M6J27
4863F3p1L89n42M48j04j81r2R4j24J81J24l2k07Q8J97k26r7K13n32L09P9m5k08
$$ plain form
4695 -94 -99 137 51 25 86 -45 89 1 -50 49 70 37 -63 99 -85 18 -84 -79 43 4 -18 92 -118 8 -284
4720 -284 153 209 -262 -167 512 -192 66 242 145 162 85 18 2 155 -191 -52 42 187 76 -1 176 -34 -95
4743 -95 -25 74 196 195 255 -9 -219 1 39 -192 -196 -88 -123 -100 39 75 -158 41 -139 101 62 215 29 98 214
4768 214 -8 -122 60 -179 0 -94 17 173 -91 -15 66 -190 -8 -191 -120 71 62 -26 176 123 -110 -45 -78
4791 -78 -166 -215 247 312 -158 -26 84 46 185 2 53 31 248 -59 60 -132 -208 23 256 186 27 178 35
4814 35 -36 105 -10 78 339 -170 -2 99 2 49 -293 95 10 -22 146 69 30 -202 121 -106 -138 41 9 329
4838 329 -17 -170 -92 -91 -62 106 -187 55 60 -33 -108 48 -25 -81 37 209 6 49 -4 -134 136 -92 -110 -64 63
4863 63 -8 381 -161 287 183 2 -90 4 -120 61 185 153 -54 34 231 5 -92 121 -411 -102 -23 -68 -276
4886b76L77j27N2J57Rk41j38M29j76m4k89M14k53J3J39RK0nj53P5q3K7j30J33
4910f1K34l36N7k46L92J39j57mQ3j52k06L08k96K58N5j28J59k74K1K14l0O8j69
4933g1q6M97j9k19K36n02K38j45l7K91m38K16J38j64j92K18M63l57k55M31k82
4954c9l0J03j01o1J04k5Q0J20k07q2J17k4Q4l67L11j4k81K33K53l9m8l0m2l3k36
4979b54K42K56o58O22j90j39L28j22j8m7J06j03m1K11l65J4K11M3m9j48J94J5
5001A08k5NL2L1nj14k99L11o6j65Q7R2j31r3K62K2lK05j68j49o6L07l48K0jlK95
5028A41j35j61J70R4p2K3k61L02j36lQ8R5k61j0M26m80L3K35Kj31J29J11j87m6
5052c4L72j35n4j72kJ07k25L6R7L9K27l70P9j10K11k62L37k45k89O45k93m6j15
$$ plain form
4886 -276 101 -26 26 183 192 -49 -187 242 66 22 -267 147 -106 -93 46 55 75 70 -83 -8 -91 -64 -194 -61
4910 -61 173 -163 -106 -352 40 179 22 18 101 -51 -257 51 -245 13 68 -60 99 -175 -154 60 30 98 -71
4933 -71 -157 340 321 102 338 -164 74 -71 -108 183 -255 -39 99 -65 -257 -39 424 67 -188 243 -39
4954 -39 -69 34 -67 -128 -24 -49 31 151 -56 -138 -21 -45 39 -328 -17 -31 -312 -79 174 135 87 57 15 -18 -254
4979 -254 -12 244 -414 208 18 -121 207 85 67 20 126 23 -18 193 -172 -158 53 96 47 -101 93 108
5001 108 83 88 120 151 146 32 -267 44 -22 -187 -100 -8 -139 -232 30 52 49 254 86 -63 -129 178 -170 -150 -151 -154 141
5028 141 6 -155 15 109 37 60 -201 101 -35 -38 50 145 -116 -126 300 -180 -147 88 90 -41 88 199 12 -34
5052 -34 338 203 149 -23 -25 82 -143 -107 -10 29 256 -114 -35 -145 66 -196 141 -104 -393 252 -41 -87 -202
5075b02L00r5PK71j46j2l8l09J61J52j30J0K6j6J30k0o1p1K35l84J31O7R2Mk33
5100a31K09r7m23K49K29K96m05K8K32l47n9J84M1J43p2L88m85J31j11j61L03K6
5122A68p6k31J80m08J02L85J43j63O7J9j45j69m8J49j74m4J30L3J79j45pL44k14
5145G5o9P3j35J35k40J35M2J66j22J09J56l89K8O7M6j71j44k3L29p2Mo7M37k38
5169A32r6J23j73K07k74M8m9N1J64Q2o73L19L39k00J02k83J30J67j61M2L7j75
5191a41K80k50J4R7J97j56k13K5P7k66K13K85j76J72l51L01l69L86P9j14k12R0
5213c2oK08j60J17j44k02M57l49K31l12K19p3L6K28l37r6K96M2j60K37k94n1J07
5236c8pj38K05r6J25j52L18k33j4%J68m8K47l07q9n8j39K18j64J72k39L65m37
$$ plain form
5075 -202 98 3 10 281 135 123 85 -224 -63 89 -41 -31 -5 -21 109 89 28 -43 192 -192 -61 6 98 102 -131
5100 -131 78 -19 -442 -193 36 332 -73 -45 187 -160 -219 -35 6 149 77 465 -20 111 0 -161 142 168
5122 168 92 -139 41 -367 -265 120 263 100 167 186 41 -128 -176 -27 -201 -245 -115 -82 97 -48 -55 289 75
5145 75 6 79 -56 79 -161 -26 16 182 60 169 325 -64 -36 31 77 -94 -238 -261 68 -4 0 -67 370 132
5169 132 36 159 -14 193 -81 -33 -82 -31 133 215 -458 -139 200 0 102 -181 -51 116 -45 -3 34 -141
5191 -141 139 -111 -97 0 197 41 -172 -147 -70 -336 -123 162 -14 158 -193 108 -261 125 204 90 -122 -32
5213 -32 -38 170 10 127 -17 -219 238 -111 120 -192 27 -46 -10 218 -119 -215 81 123 -37 200 -94 -145 -38
5236 -38 -45 -183 22 -74 51 -101 217 -16 -30 -30 138 90 337 30 -59 -117 -256 -38 -202 -30 -269 96 -341
5259c41N39n7j24J47k31o8Qj36kPL36N5k21P0p2P9P2R1J71m26p5K07r4P1J35n01
5285c60L45k74N31k80r7L97l37pJ43mm6m3j43J54R5j17k52L99J14k35k09K65J3
5308E2m6R5n2o1PL70j65j38k37j1J56k55J53O4m9Q7J1k21K71R7Pk06J36p0j61
5333a66q4L20mK65k49k12N7J57P8l93K25k3j21L42j95k39L64k03k9K28k69J96
5355D5j21Po0L30j29j35L79k97j46L86n32P1P7q5P8j46K21J96k66J30J5K5m1j6
5379a4j59L28K8n50K77J01p0q9L45L8k82K33k00R8n4J8j8kNk7R2k2k7k24J13J03
$$ plain form
5259 -341 198 141 17 164 -67 -135 -127 -263 -265 -258 78 133 -88 -18 -90 -11 61 152 323 -103 -178 29 -65 6 141 -360
5285 -360 -15 -289 242 -38 -135 262 -75 -82 61 57 11 -32 -175 -21 74 -43 -295 104 218 -17 -226 39 52
5308 52 6 101 49 -12 -5 365 200 62 -175 -186 -30 -285 -132 -68 -117 -30 -19 -240 31 128 135 -71 65 -5 -166
5333 -166 -250 70 66 331 82 -130 -73 84 162 -231 -6 -29 -150 192 -3 -242 122 -81 -110 118 -151 45
5355 45 -76 -69 -129 201 72 -63 316 19 -127 259 -273 -202 -125 -210 -132 -278 -57 139 -127 3 18 43 2 -14
5379 -14 -173 155 183 -367 -90 11 -59 -148 197 235 -47 186 -14 84 30 48 30 28 33 6 98 76 49 -175 -62 41
$$ [...]
8191b50
##END NTUPLES=NMR FID
##END=
