##TITLE=1H_Pr 5148-5165
 CDCl3
 8 sc, 
 14.11.2022
##JCAMPDX= 6.0         $$ Bruker NMR JCAMP-DX V2.0
##DATA TYPE= NMR FID
##DATA CLASS= NTUPLES
##ORIGIN= UXNMR, Bruker Analytische Messtechnik GmbH
##OWNER= root
$$ XWIN-NMR		Version 3.5
$$ Mon Nov 14 14:03:09 2022 Russian Standard Time (UT+4h)  she@DPX200
##.OBSERVE FREQUENCY= 200.1313499994
##.OBSERVE NUCLEUS= ^1H
##.DELAY= (6, 6)
##.ACQUISITION MODE= SIMULTANEOUS
##.ACQUISITION SCHEME= undefined
##.AVERAGES= 8
##.DIGITISER RES= 18
##SPECTROMETER/DATA SYSTEM= spect
##.PULSE SEQUENCE= zg30
##.SOLVENT NAME= CDCl3
##.SHIFT REFERENCE= (INTERNAL, CDCl3, 0, 15.7039)
##AUDIT TRAIL= $$ (NUMBER, WHEN, WHO, WHERE, WHAT)
$$ ##TITLE= Audit trail, XWIN-NMR		Version 3.5
$$ ##JCAMPDX= 5.01
$$ ##ORIGIN= Bruker BioSpin GmbH
$$ ##OWNER= she
$$ F:/spectra/data/she/nmr/H-F/1/audita.txt
$$ ##AUDIT TRAIL=  $$ (NUMBER, WHEN, WHO, WHERE, WHAT)
(   1,<2022-11-14 14:02:09.35 +0400>,<she>,<DPX200>,
      <created by zg, POWCHK disabled, PULCHK disabled
       configuration hash MD5:
       00 E9 B6 7A A2 85 ED C7 34 08 36 98 17 FE 4E 26
       data hash MD5: 16K
       49 96 C8 E9 8C B7 23 23 9B 45 DB 91 05 D4 CD 7B>)
$$ ##END=
$$ 
$$ hash MD5
$$ A7 E5 83 26 15 12 21 A1 31 56 62 B2 E1 08 77 7B
##$RELAX= 
##$RELAX= 
##$RELAX= 
##$RELAX= 
##$RELAX= 
##$RELAX= 
$$ Bruker specific parameters
$$ --------------------------
##$DU= <F:/spectra>
##$EXPNO= 1
##$NAME= <H-F>
##$PROCNO= 1
##$TYPE= <nmr>
##$USER= <she>
##$AMP= (0..31)
100 100 100 100 100 100 100 100 100 100 100 100 100 100 100 100 100 100 
100 100 100 100 100 100 100 100 100 100 100 100 100 100 
##$AQSEQ= 0
##$AQ_mod= 1
##$AUNM= <au_zg>
##$AUTOPOS= <>
##$BF1= 200.13
##$BF2= 200.13
##$BF3= 200.13
##$BF4= 200.13
##$BF5= 200.13
##$BF6= 200.13
##$BF7= 200.13
##$BF8= 200.13
##$BYTORDA= 1
##$CFDGTYP= 0
##$CFRGTYP= 5
##$CHEMSTR= <none>
##$CNST= (0..31)
1 1 145 1 1 1 1 1 1 1 1 1 1 1 1 1 1 1 1 1 1 1 1 1 1 1 1 1 1 1 1 1 
##$CPDPRG= <>
##$CPDPRG1= <>
##$CPDPRG2= <>
##$CPDPRG3= <>
##$CPDPRG4= <mlev>
##$CPDPRG5= <mlev>
##$CPDPRG6= <mlev>
##$CPDPRG7= <mlev>
##$CPDPRG8= <mlev>
##$CPDPRGB= <>
##$CPDPRGT= <>
##$D= (0..31)
0 1.2 0 0 0 0 0 0 0 0.06 0 0.03 0 0 0 0 0.0002 0 0 0 0 0 0 0 0 0 0 0 0 
0 0 0 
##$DATE= 1668420129
##$DBL= (0..7)
120 120 120 120 120 120 120 120 
##$DBP= (0..7)
150 150 150 150 150 150 150 150 
##$DBP07= 0
##$DBPNAM0= <>
##$DBPNAM1= <>
##$DBPNAM2= <>
##$DBPNAM3= <>
##$DBPNAM4= <>
##$DBPNAM5= <>
##$DBPNAM6= <>
##$DBPNAM7= <>
##$DBPOAL= (0..7)
0.5 0.5 0.5 0.5 0.5 0.5 0.5 0.5 
##$DBPOFFS= (0..7)
0 0 0 0 0 0 0 0 
##$DE= 6
##$DECBNUC= <off>
##$DECIM= 32
##$DECNUC= <off>
##$DECSTAT= 4
##$DIGMOD= 1
##$DIGTYP= 9
##$DL= (0..7)
0 120 120 120 120 120 120 120 
##$DP= (0..7)
150 150 150 150 150 150 150 150 
##$DP07= 0
##$DPNAME0= <>
##$DPNAME1= <>
##$DPNAME2= <>
##$DPNAME3= <>
##$DPNAME4= <>
##$DPNAME5= <>
##$DPNAME6= <>
##$DPNAME7= <>
##$DPOAL= (0..7)
0.5 0.5 0.5 0.5 0.5 0.5 0.5 0.5 
##$DPOFFS= (0..7)
0 0 0 0 0 0 0 0 
##$DQDMODE= 0
##$DR= 18
##$DS= 0
$$ [...]
##$SUBNAM2= <"">
##$SUBNAM3= <"">
##$SUBNAM4= <"">
##$SUBNAM5= <"">
##$SUBNAM6= <"">
##$SUBNAM7= <"">
##$SUBNAM8= <"">
##$SUBNAM9= <"">
##$SW= 18.0517283424941
##$SWIBOX= (0..15)
0 0 2 0 0 0 0 0 0 0 0 0 0 0 0 0 
##$SW_h= 3612.71676300578
##$TD= 16384
##$TD0= 1
##$TE= 0
##$TE2= 300
##$TE3= 300
##$TEG= 300
##$TL= (0..7)
0 120 120 120 120 120 120 120 
##$TP= (0..7)
150 150 150 150 150 150 150 150 
##$TP07= 0
##$TPNAME0= <>
##$TPNAME1= <>
##$TPNAME2= <>
##$TPNAME3= <>
##$TPNAME4= <>
##$TPNAME5= <>
##$TPNAME6= <>
##$TPNAME7= <>
##$TPOAL= (0..7)
0.5 0.5 0.5 0.5 0.5 0.5 0.5 0.5 
##$TPOFFS= (0..7)
0 0 0 0 0 0 0 0 
##$TUNHIN= 0
##$TUNHOUT= 0
##$TUNXOUT= 0
##$USERA1= <user>
##$USERA2= <user>
##$USERA3= <user>
##$USERA4= <user>
##$USERA5= <user>
##$V9= 5
##$VALIST= <valist>
##$VCLIST= <CCCCCCCCCCCCCCC>
##$VD= 0
##$VDLIST= <DDDDDDDDDDDDDDD>
##$VPLIST= <PPPPPPPPPPPPPPP>
##$VTLIST= <TTTTTTTTTTTTTTT>
##$WBST= 1024
##$WBSW= 4
##$XGAIN= (0..3)
0 0 0 0 
##$XL= 0
##$YL= 0
##$YMAX_a= 427930
##$YMIN_a= -375706
##$ZGOPTNS= <>
##$ZL1= 120
##$ZL2= 120
##$ZL3= 120
##$ZL4= 120
##$ABSF1= 10
##$ABSF2= 0
##$ABSG= 5
##$ABSL= 3
##$ALPHA= 0
##$AQORDER= 0
##$ASSFAC= 0
##$ASSFACI= 0
##$ASSFACX= 0
##$ASSWID= 0
##$AUNMP= <proc_1d>
##$AZFE= 0.1
##$AZFW= 0.1
##$BCFW= 1
##$BC_mod= 2
##$BYTORDP= 1
##$COROFFS= 0
##$CY= 11.3945322036743
##$DATMOD= 1
##$DC= 2
##$DFILT= <>
##$DTYPP= 0
##$F1P= 2.36226072786647
##$F2P= -0.459571619588291
##$FCOR= 0.5
##$FTSIZE= 0
##$FT_mod= 4
##$GAMMA= 1
##$GB= 0.15
##$INTBC= 1
##$INTSCL= 1
##$ISEN= 128
##$LB= 0.24
##$LEV0= 0
##$LPBIN= 0
##$MAXI= 10000
##$MC2= 0
##$MEAN= 0
##$ME_mod= 0
##$MI= 1.114404
##$NCOEF= 0
##$NC_proc= 0
##$NLEV= 6
##$NOISF1= 3.799351
##$NOISF2= 2.8
##$NSP= 1
##$NTH_PI= 0
##$NZP= 0
##$OFFSET= 15.70392
##$PC= 1
##$PHC0= -18182.19
##$PHC1= 3.4007
##$PH_mod= 1
##$PKNL= yes
##$PPARMOD= 0
##$PSCAL= 0
##$PSIGN= 0
##$REVERSE= no
##$SF= 200.130013532006
##$SI= 16384
##$SIGF1= 3
##$SIGF2= 2
##$SINO= 400
##$SIOLD= 16384
##$SREGLST= <1H.CDCl3>
##$SSB= 0
##$STSI= 0
##$STSR= 0
##$SW_p= 3612.71676300578
##$SYMM= 0
##$S_DEV= 0
##$TDeff= 0
##$TDoff= 0
##$TI= <>
##$TILT= no
##$TM1= 0
##$TM2= 0
##$TOPLEV= 0
##$USERP1= <user>
##$USERP2= <user>
##$USERP3= <user>
##$USERP4= <user>
##$USERP5= <user>
##$WDW= 1
##$XDIM= 8192
##$YMAX_p= 0
##$YMIN_p= 0
$$ End of Bruker specific parameters
$$ ---------------------------------
##NTUPLES= NMR FID
##VAR_NAME=  TIME,          FID/REAL,        FID/IMAG
##SYMBOL=    X,             R,               I
##VAR_TYPE=  INDEPENDENT,   DEPENDENT,       DEPENDENT
##VAR_FORM=  AFFN,          ASDF,            ASDF
##VAR_DIM=   8192,          8192,            8192
##UNITS=     SECONDS,       ARBITRARY UNITS, ARBITRARY UNITS
##FACTOR=    0.0002768,     1,               1
##FIRST=     0,             0,               0
##LAST=      2.2672688,     0,               0
##MIN=       0,             -375706,         0
##MAX=       2.2672688,     427930,          0
$$ Real data points
##PAGE= N=1
##DATA TABLE= (X++(R..R)), XYDATA
0 0 0 0 0 0 0 0 0 0 3 -8 8 -8 16 -16 24 -24 32 -40 48 -56 72 -86 99 -120 136 -160 184 -216 248 -288 328
31 328 -374 424 -480 542 -609 685 -767 858 -957 1065 -1183 1312 -1454 1608 -1776 1960
47 1960 -2161 2381 -2623 2890 -3183 3510 -3871 4279 -4736 5259 -5856 6551 -7371 8356
61 8356 -9562 11082 -13058 15753 -19660 25850 -37171 64565 -269002 -124890 392092 -186559
73 -186559 -228838 147908 18780 -168009 200250 95621 -255209 25547 289450 -105801
83 -105801 -162659 165506 77311 -121851 32799 3606 -115693 78541 135590 -144107 -95597
94 -95597 160064 53360 -106283 5496 -8727 -99518 16411 41831 -115521 -68508 57105
105 57105 -24227 -70481 35998 19787 -49138 32524 68848 -16106 16435 86216 -1316 -66908
117 -66908 16066 44865 -45461 -65426 6441 -5729 -57977 3612 39007 -66062 -75025 61127
129 61127 40322 -91515 -14074 96458 -32319 -92202 56464 41578 -86922 -14693 44026
140 44026 -46362 8373 110528 -17062 -76850 91195 84748 -67084 -974 61001 -52945
151 -52945 -16041 72788 -67386 -102698 71212 11988 -149465 -12156 93947 -56673 -52708
162 -52708 69360 -22826 -44984 104471 12698 -134300 36195 119210 -73791 -64085 89175
173 89175 -9352 -77127 72789 37165 -100546 28906 105170 -65817 -51238 103701 5412
184 5412 -99188 29273 42730 -87421 -23183 64246 -51029 -68460 62356 23717 -66156
195 -66156 16649 54284 -30997 -8263 63698 4161 -36167 33017 25897 -38647 -1692 26065
207 26065 -34098 -26276 35473 2416 -41208 11087 31514 -28085 -19641 33870 -3548 -37369
219 -37369 15777 17092 -36938 -8863 27553 -24395 -32763 32957 12357 -38948 21272 47694
231 47694 -30225 -13708 58951 1943 -45798 26783 26806 -46301 -2679 42122 -39772 -41384 51105
244 51105 4263 -63132 22813 45474 -43744 -10263 56767 -17540 -40506 48821 15760 -63200
256 -63200 13650 52291 -42757 -28687 49957 -6167 -39404 35693 16655 -48020 15617 47401
268 47401 -39820 -26613 53229 -4992 -53091 25915 24618 -47773 -2552 40922 -26036 -26025 43450
281 43450 5671 -40763 24532 33210 -36129 -3787 43886 -18138 -30900 36325 10323 -44871
293 -44871 7727 35395 -30072 -23031 37590 -217 -36113 20207 23111 -31455 -3906 32863
305 32863 -13779 -24525 27816 10487 -33096 8755 29621 -25137 -15661 34349 -1626 -32061
317 -32061 18067 22391 -28195 -7182 29426 -12457 -24437 24893 5740 -33071 11668 25532
329 25532 -28637 -12625 34443 -5643 -30678 23619 19759 -31470 3741 34816 -19834 -17951
341 -17951 36189 1799 -33264 19826 23295 -33091 -5935 33965 -18833 -29536 31713 6656
353 6656 -41935 11522 31462 -30337 -15746 35707 -4434 -29671 23314 15946 -32468 5263
365 5263 31569 -23724 -17481 35263 -466 -32167 19997 22474 -29418 -3574 33809 -12462 -24630
378 -24630 27265 9597 -31820 6376 22022 -22694 -10803 24002 -8879 -22745 21427 11388
390 11388 -29672 4636 30912 -16181 -16778 28703 4569 -25692 12165 18150 -23702 -7532 25202
403 25202 -9431 -23941 18903 9932 -25659 4570 21096 -17973 -9231 26659 -3879 -26863
415 -26863 16410 18669 -27124 -7320 26619 -9277 -19498 21102 7016 -22332 11675 22677
427 22677 -18585 -7562 28949 -2515 -24400 15983 11788 -26509 470 21237 -19000 -16410
439 -16410 23872 1043 -25822 12200 19407 -20252 -2702 25949 -10721 -17455 23832 4227
451 4227 -29096 8024 22277 -21366 -13112 24785 -3196 -23785 15980 13574 -22475 2415 22271
464 22271 -14082 -11589 22104 -1584 -23336 12915 14559 -23725 -2796 25986 -10937 -18867 23109
477 23109 9662 -22312 7746 22513 -13834 -9523 21339 -1411 -19614 11747 8172 -21907
489 -21907 759 17566 -15782 -13657 19994 1700 -21031 9841 16798 -18024 -5869 21710
501 21710 -7379 -19507 15298 7908 -21397 1636 17404 -12802 -9707 20580 896 -18304
513 -18304 14631 16239 -19030 -2835 21042 -9139 -17696 13547 3999 -19962 4052 14422 -15343
526 -15343 -6367 20507 -3251 -13769 18495 10246 -17975 6245 21698 -12242 -12727 18873 1558
539 1558 -19917 9608 12599 -19365 -3396 19112 -9538 -16073 14383 3889 -19543 3085 10908
552 10908 -17499 -6270 17964 -10538 -20959 16649 11777 -20264 -875 18838 -5719 -5979 18773
565 18773 1383 -14699 15641 16042 -17631 -2897 21048 -4798 -14040 12023 3576 -16423 5216
578 5216 12773 -16454 -8661 19224 -566 -16570 7313 6648 -12606 2180 9556 -14160 -7547
591 -7547 18467 -584 -19638 8570 14624 -13340 -2801 16706 -5396 -11252 14742 5630 -18353
604 -18353 377 13959 -11019 -10953 11488 -2187 -12678 10154 5729 -16245 2957 18697 -8370
617 -8370 -12369 16674 7822 -14646 5639 14421 -11144 -4263 16940 -2393 -13037 11078 8254
630 8254 -14299 256 14200 -8655 -10128 12296 -1025 -15303 6791 7319 -15789 -3490 13259
643 13259 -7429 -13083 10432 3851 -14526 3667 11118 -10453 -2105 15732 -4659 -12062 13772
656 13772 9550 -14367 55 15613 -5382 -8009 12556 594 -12648 8379 9032 -13316 -2153
669 -2153 14136 -4891 -10964 10176 3218 -14364 4282 11575 -13099 -7230 15504 -629 -14712
682 -14712 5870 8668 -10064 -1636 10516 -6045 -6949 12285 1545 -12653 5808 9416 -10128
695 -10128 -2666 11610 -4462 -10052 10299 5110 -14162 912 12372 -7572 -7567 10451 653 -9043
709 -9043 6327 5644 -10091 495 11484 -6869 -9017 11448 2710 -12611 4577 9958 -9417
722 -9417 -3777 12458 -1198 -9738 8528 7033 -10620 695 10840 -7439 -7375 9922 -950
735 -950 -12020 4761 6549 -11218 -2924 11437 -4661 -10007 9664 4430 -11361 2583 9463
748 9463 -7449 -3941 9997 -2157 -9285 8141 6210 -10812 1560 12936 -5099 -6041 11723
761 11723 2488 -9581 4856 7388 -9166 -3425 8868 -5154 -10128 6492 1047 -11976 2355
774 2355 7878 -8847 -3940 11462 -608 -9795 7055 7817 -9208 -903 10596 -3935 -6372 8426
788 8426 1797 -7992 4568 7193 -6843 -1212 10287 -2840 -8106 8015 3049 -11802 317
801 317 7676 -8463 -7794 7148 -362 -9925 3219 6476 -6668 -285 9581 -2465 -3713 9750
815 9750 2603 -7515 4713 8145 -7056 -3826 9191 -1623 -9236 5691 4773 -9073 -225 7824
829 7824 -5164 -5941 6595 62 -8986 2447 4584 -8944 -2797 7883 -4520 -7367 8005 3965
843 3965 -7422 3428 9827 -3270 -2341 9852 1097 -6656 5986 4533 -8764 -490 6924 -6404
857 -6404 -6996 6493 445 -9272 2598 6616 -7039 -2867 8299 -2502 -6980 5725 2348 -7704
871 -7704 1399 6003 -5456 -2900 8712 -60 -6622 7208 6712 -7025 380 9008 -3105 -5965
885 -5965 5528 1278 -8094 548 4135 -6977 -3471 5965 -3092 -6114 5719 2352 -7027 2134
899 2134 7129 -4769 -3964 8235 1298 -7668 3674 6116 -5801 -1437 6724 -1676 -3965 5669
913 5669 2156 -5744 2609 5863 -5643 -2800 7179 -1984 -7284 4292 2757 -8023 -956 5988
927 5988 -3979 -5489 5675 1586 -6457 2631 4847 -5277 -619 6531 -2580 -4632 5905 2460
941 2460 -6907 1221 6596 -4339 -3401 6954 96 -5773 4227 3815 -5817 -240 6000 -2949 -4503
956 -4503 5251 865 -6718 2388 4526 -6241 -2035 6580 -1863 -5655 4234 2861 -5509 658 5474
971 5474 -3456 -2267 6524 -496 -5378 4768 3871 -5970 -414 6181 -2769 -5089 4818 1402 -6817
986 -6817 1138 4718 -4695 -2540 4870 -1412 -4554 3048 1309 -5503 779 4522 -4806 -3266 6504
1001 6504 -14 -5932 4038 5535 -3733 23 7124 237 -3102 4851 2801 -4511 1203 3730 -4670
1016 -4670 -2512 3763 -2729 -5382 2838 1330 -6364 -124 5405 -3691 -4441 5107 672 -5930 1731
1031 1731 3512 -4437 -1367 4674 -1445 -3557 4854 2818 -4050 2912 6138 -2713 -934 6349 -247
1046 -247 -4804 2681 2224 -5990 -2095 3265 -4092 -4981 3399 -196 -5205 2694 4132 -3552 -149 6251
1062 6251 -112 -3428 4399 2908 -4707 690 4534 -3212 -2495 4363 -43 -3405 3150 2821 -3817
1077 -3817 224 4579 -3252 -4612 3360 -851 -7373 -573 1826 -5379 -3165 3585 -623 -3146 4182
1092 4182 4265 -1647 3042 6195 -828 55 5621 22 -4018 2720 2374 -5520 -2039 4313 -2151 -4703
1108 -4703 3223 1743 -4169 893 3156 -3198 -2275 2659 -1805 -4752 1256 506 -5269 13 4226
1123 4226 -2509 -1474 6156 2525 -2166 3933 5580 -1588 -622 4320 -1237 -4470 1344 -640 -5933
1138 -5933 -895 1371 -4334 -2226 3792 -244 -3208 3773 3821 -3164 560 4920 -1929 -3016 3242
1153 3242 172 -4219 1272 2940 -2821 -545 5146 207 -2100 4484 2595 -3670 691 2944 -3965
1168 -3965 -4075 1206 -2082 -5900 -403 845 -4197 -368 4294 -867 -741 5679 2757 -1813 3062
1183 3062 4513 -2174 -1678 3508 -1050 -4550 1469 1202 -3944 -143 3025 -1454 -980 3441 346 -2681
1199 -2681 2139 1739 -4727 -1559 2709 -3473 -4677 2215 658 -3818 1155 4429 -512 42 5376
1214 5376 2051 -1218 3222 2148 -3244 -177 1502 -4101 -3685 1454 -1641 -5128 800 2711 -3131
1229 -3131 -680 4796 354 -1841 3410 2132 -2601 481 2392 -2399 -1980 2659 -501 -2887 2769
1244 2769 2638 -2353 1338 4549 -777 -1647 3046 558 -4229 -555 867 -4696 -3368 1228 -2563
1259 -2563 -3779 1958 1310 -2253 1788 4600 -30 21 4787 1671 -2171 2120 2109 -3137 -942 2183
1275 2183 -2019 -2587 2093 526 -2887 1272 2937 -2355 -1165 3294 -1089 -3753 1024 296 -4235
1290 -4235 -1557 1608 -1896 -2134 2650 1236 -1198 3240 3656 -615 1801 4372 -339 -1644 2553
1305 2553 400 -4344 -923 1437 -3664 -3284 1681 -685 -3162 1235 1604 -1862 286 2551 -985
1320 -985 -1431 2371 -39 -3032 1421 2048 -2729 -234 3816 144 -1453 3344 2891 -1472 929 3267
1336 3267 -1378 -1923 1559 -1424 -3877 -255 -438 -4051 -1461 1465 -2026 -2163 2749 1250 -2157 1944
1352 1944 3462 -1214 -87 3290 61 -1811 1809 1350 -2296 284 2682 -1331 -1247 2938 376 -2302
1368 -2302 1463 1522 -2645 -1168 1457 -1979 -3224 615 -513 -3552 98 1550 -2097 -399 3176
1383 3176 403 -1032 2962 2640 -1328 724 3247 -737 -1647 2081 161 -2421 674 1104 -2068 -592
1399 -592 1770 -1037 -1878 1840 394 -3001 449 1812 -2570 -1807 1970 -389 -2598 1011 1748 -1507
1415 -1507 -59 2772 -14 -684 2559 935 -1313 1552 1504 -1937 -429 2009 -1253 -2678 1356 718
1431 718 -3095 -284 2015 -1623 -1559 1889 193 -1865 909 1334 -1645 -223 2018 -915 -1326 2188
1447 2188 506 -1908 1323 2069 -1439 -463 2478 7 -1792 1486 1263 -2185 -51 1661 -1599 -1497
1463 -1497 1510 -381 -2342 570 1037 -2022 -685 1809 -901 -1662 1696 550 -1889 804 1657 -1216
1479 -1216 -478 2055 19 -1436 1650 1357 -1908 338 2307 -1020 -1112 1990 510 -1668 636 1375
1495 1375 -1389 -733 1499 -814 -1692 1141 -120 -2340 214 1019 -1885 -1052 1799 -273 -1979 1218
1511 1218 1709 -1545 -5 2321 -259 -869 1538 645 -1211 634 1109 -1173 -330 1697 -664 -1481
1527 -1481 1679 637 -2034 332 1688 -1406 -1473 1288 -45 -2293 107 953 -1692 -482 1550 -471
1543 -471 -631 1822 711 -806 1360 1841 -869 -202 2106 -318 -1776 1134 600 -2163 -347 1120
1559 1120 -1255 -1376 1061 12 -1688 470 969 -1552 -515 1316 -945 -1381 1119 246 -1477 548
1575 548 1565 -557 -73 2265 655 -540 1951 1387 -1049 424 1505 -1012 -1395 738 -383 -2414
1591 -2414 -352 536 -1881 -1058 1074 -557 -1122 953 442 -1076 442 1209 -904 -505 1618 -155
1607 -155 -1359 1387 1285 -1150 377 2160 40 -593 1553 976 -1087 214 836 -1378 -1006 401
1623 401 -1330 -1698 338 -361 -1802 118 1192 -959 -619 1950 575 -1154 1255 1521 -923 -156
1639 -156 1396 -262 -901 880 513 -1004 481 1138 -863 -122 1498 -423 -1167 938 256 -1838 -495
1656 -495 769 -1360 -1577 833 -79 -1560 643 1168 -717 324 1743 95 -272 1452 764 -990
1672 -990 399 1109 -1136 -705 1050 -479 -1281 732 452 -1222 25 1152 -642 -874 1127 50
1688 50 -1589 283 668 -1395 -584 958 -370 -842 870 722 -640 588 1494 -361 -21 1512 -132
1705 -132 -952 889 429 -1474 -235 964 -847 -1315 925 379 -1399 283 1050 -719 -319 901 -227
1722 -227 -798 545 158 -1155 107 858 -990 -495 1353 -100 -1059 1049 1141 -821 -29 1423 -97
1739 -97 -952 841 457 -1184 101 581 -951 -378 764 -470 -833 789 450 -1126 123 1161 -821
1756 -821 -770 1099 -121 -1302 378 666 -956 -290 945 -246 -717 962 602 -808 608 1088 -587
1773 -587 -130 1074 -186 -881 628 461 -1165 -199 850 -736 -801 921 -62 -1183 429 652 -937
1790 -937 -429 885 -259 -976 716 468 -978 250 940 -450 -140 1062 41 -481 847 718 -775
1807 -775 50 1164 -526 -830 956 4 -1349 109 591 -918 -723 573 -214 -973 423 335 -889
1824 -889 218 763 -643 -126 1147 -48 -687 858 865 -844 8 1265 -284 -823 1044 422 -938
1841 -938 155 702 -617 -464 519 -236 -894 371 95 -1166 8 592 -876 -493 934 -47 -798 602
1859 602 955 -603 -43 1271 -37 -594 894 412 -692 266 573 -660 -397 636 -204 -877 442
1876 442 351 -994 -44 751 -729 -590 690 -57 -908 264 568 -731 -363 1009 -120 -613 948 542
1894 542 -603 387 885 -234 -232 721 29 -735 398 267 -1051 -184 540 -861 -754 635 4 -953 244
1913 244 785 -586 -395 916 -73 -806 551 471 -582 117 598 -269 -120 746 180 -503 736 687 -683
1932 -683 97 986 -456 -718 602 130 -1030 -141 600 -639 -648 570 -25 -705 439 312 -585 132 541
1951 541 -497 -293 663 -79 -854 390 596 -821 -88 956 -260 -473 720 446 -538 165 732 -316
1969 -316 -381 555 -133 -780 314 65 -854 53 519 -427 -404 674 150 -702 389 591 -657 -244 757
1988 757 -313 -660 500 241 -609 51 695 -260 -343 755 120 -551 498 400 -530 11 429 -466 -550 400
2008 400 -62 -924 110 519 -753 -301 809 -100 -543 539 473 -395 -28 674 -106 -365 561 148 -482
2027 -482 469 393 -498 169 665 -287 -430 621 204 -872 38 569 -732 -659 371 -306 -824 23 232
2046 232 -486 -165 464 -129 -199 680 175 -433 592 571 -417 113 781 -135 -404 586 423 -689 41 673
2066 673 -460 -481 483 -99 -636 19 50 -659 -319 318 -414 -541 415 71 -665 356 543 -399 79 776
2086 776 108 -258 556 543 -431 49 721 -294 -333 445 51 -558 161 166 -489 -239 263 -265 -553 291 -18
2107 -18 -625 203 395 -580 -159 617 -28 -452 425 520 -409 -32 778 -73 -280 443 227 -285 215 284 -288
2128 -288 -104 372 -276 -494 353 -24 -774 18 375 -633 -358 453 -2 -532 246 533 -217 -72 621 -55
2148 -55 -146 507 141 -200 185 260 -297 -31 418 -157 -404 427 179 -561 69 408 -480 -396 209 -61 -545
2169 -545 -73 191 -450 -232 367 -95 -197 496 146 -192 422 433 -131 38 533 -56 -461 361 215 -551
2189 -551 -31 429 -304 -292 380 138 -417 78 349 -344 -265 208 -419 -536 66 -168 -586 41 159 -337 -68
2210 -68 546 114 -187 600 540 -248 145 605 -133 -283 253 81 -387 -42 226 -197 -125 304 -119 -162 367
2231 367 -3 -450 48 52 -548 -473 170 -242 -681 110 269 -348 5 615 159 71 563 396 19 328 339 -102
2253 -102 -82 254 -257 -395 237 -66 -531 74 342 -285 -202 386 60 -504 15 113 -510 -307 82 -280 -362
2274 -362 144 98 -87 317 550 189 387 759 255 46 524 181 -419 -134 128 -534 -645 -64 -262 -740
2294 -740 -198 86 -348 -138 305 -9 -133 241 39 -194 47 232 -210 -96 491 38 -39 642 558 84 460
2315 460 724 175 -106 354 83 -589 -361 -190 -769 -625 -257 -573 -531 -106 -64 -198 195 424 -25 176 657
2336 657 215 -145 464 287 -334 100 451 67 -154 372 379 -7 233 414 -49 -61 98 -363 -469 -234 -462
2357 -462 -743 -405 -179 -544 -368 358 135 -126 616 643 210 444 665 328 -4 342 175 -285 -55 103
2377 103 -356 -112 138 -201 -165 211 83 -310 -53 140 -388 -429 64 -291 -659 -127 44 -326 -46 393 253
2398 253 204 612 622 291 432 541 2 103 206 -292 -447 -50 -273 -592 -222 73 -331 -366 256 87 -313
2419 -313 139 259 -227 -124 83 -77 -259 33 49 -171 110 337 59 352 632 217 141 454 292 -232 -52
2440 -52 200 -375 -558 -48 -244 -664 -191 36 -258 -83 232 86 19 269 212 -151 138 225 -334 -120 270
2461 270 -162 -320 224 212 -116 94 451 129 -87 355 227 -230 43 49 -270 -264 -78 -281 -321 -4 -32 -246
2483 -246 115 334 -145 55 446 91 -77 261 206 -204 -198 192 -91 -296 110 154 -156 109 261 -18 61 258
2505 258 -29 -74 153 -11 -377 -79 160 -362 -310 207 -66 -342 152 210 -121 -42 325 95 -189 152 75 -247
2527 -247 32 67 -143 -26 141 -32 -46 231 203 -120 135 358 -45 -241 267 9 -355 -150 24 -288 -313
2548 -313 54 -89 -324 86 75 -228 79 156 -133 61 311 14 -111 276 192 -202 -3 350 -76 -164 228
2569 228 151 -111 38 187 -85 -175 47 -43 -309 5 -13 -285 -1 60 -245 -126 183 -44 -183 137 190 -211
2591 -211 -85 332 -8 -168 229 194 -165 41 242 16 -167 108 50 -164 69 41 -277 5 37 -233 -125
2612 -125 92 -55 -273 65 172 -207 -85 313 -11 -153 238 212 -51 62 247 -7 -16 213 81 -75 97
2633 97 20 -216 -12 60 -264 -235 43 -94 -357 -52 162 -244 -232 265 62 -142 189 201 2 50 200 27
2655 27 -82 187 95 -18 172 149 -163 62 269 -100 -113 181 91 -273 -78 95 -242 -279 24 -149 -305 -75
2677 -75 -57 -161 -22 110 -4 47 151 125 -76 175 181 -155 23 191 -92 -105 168 176 -139 -54 266 2 -93 182
2701 182 37 -175 37 6 -202 -123 -94 -205 -137 -17 -60 -210 123 186 -104 43 303 18 -136 176 195 -158
2723 -158 -95 161 -31 -188 78 79 -66 100 58 -17 99 185 -13 -17 175 -70 -283 -33 28 -311 -143 109 -25
2746 -25 -169 81 175 3 24 212 116 13 220 98 -77 59 35 -195 -41 42 -145 -100 123 69 -199 51 169
2769 169 -145 -84 173 -31 -233 -100 -10 -158 -179 20 -64 -58 137 87 79 276 176 42 221 185 23 -65 141 94
2793 94 -231 -64 120 -149 -202 71 -31 -204 -65 18 -75 -132 6 -31 -156 0 -183 -163 -17 -3 -194 64 176
2816 176 156 63 227 273 -13 147 266 6 -48 100 12 -79 -144 -55 -217 -150 -25 -93 -98 41 -23 -152 91 1 -155
2841 -155 0 140 -64 -136 31 137 -133 31 274 124 109 172 149 98 120 101 45 -1 -46 -118 -160 8 -188 -251
2865 -251 -61 6 -195 -80 92 21 -141 33 182 -47 1 172 39 -12 67 56 68 57 28 18 109 132 22 -15
2889 -15 123 -36 -217 -56 -10 -237 -215 -64 -85 -210 -47 75 -122 -37 121 69 42 130 66 78 96 117 32 147
2913 147 194 -10 -74 167 50 -93 79 116 -60 -53 14 -27 -174 -94 -22 -221 -169 -81 -137 -123 8 -130 -40 53 103
2938 103 -51 73 199 -1 -11 213 105 -22 122 189 23 -42 28 60 -94 -28 -24 -121 1 38 -127 -104 -22 -178
2962 -178 -141 -22 0 -129 -20 88 2 -119 144 98 -51 83 120 61 32 57 73 21 -39 22 -14 -2 40 -116 6
2987 6 47 -51 -159 27 -4 -123 -115 86 -33 -170 31 46 -86 -48 67 2 -6 14 86 46 27 89 18 100 128 -60 14
3014 14 68 -14 -101 9 66 -121 -201 -38 -46 -176 -80 5 -104 -54 40 17 -18 71 44 15 33 85 -13 68 130 13 63 234
3042 234 45 -101 89 119 -14 -83 52 55 -144 -72 11 -150 -120 -79 -93 -91 -83 -159 -52 -1 -27 -48 8 104 -27 3 137
3069 137 120 9 160 150 129 -48 99 79 -41 41 105 -6 -19 -21 -53 -61 -14 -144 -116 -42 -114 -236 -102 58 -73
3094 -73 -157 119 126 -90 30 217 89 10 107 128 86 25 45 35 -5 -41 -124 -65 32 -65 -62 -54 -36 -195 -138 90 -79 -165
3122 -165 -21 -22 -129 -63 -4 -12 -72 55 79 41 60 181 56 91 171 2 14 122 18 -101 83 31 -182 -181 -8
3147 -8 -129 -237 -46 -32 -135 -50 36 -47 -96 -57 -10 -59 56 82 12 134 126 39 56 159 131 43 76 146 -28 -57 69
3174 69 -61 -114 36 -60 -130 -133 1 -75 -91 3 4 -63 3 26 -117 -5 56 -53 -34 75 27 -23 24 125 4 -68 178
3201 178 103 -10 18 78 -24 -87 -12 -7 -62 -75 -81 -167 -15 -9 -172 -63 90 19 -24 4 68 -81 -16 141 66 -65 120
3228 120 83 -26 40 29 74 36 -44 15 -1 -14 7 -98 3 60 -128 -105 18 -105 -146 -67 7 -124 -116 31 68 -65
3254 -65 87 116 -1 23 28 58 73 74 23 7 65 12 -56 42 47 -101 -72 80 -102 -114 -45 27 -98 -172 -27 2 -87 -56
3282 -56 -6 -46 -7 52 -23 54 -10 9 39 65 109 -5 45 217 13 3 95 63 -43 -5 77 -33 -113 -33 -83 -169 -70 -78
3310 -78 -73 -48 -59 -110 -11 25 -67 -2 91 89 -45 8 133 -31 -3 119 111 3 -15 122 29 -83 -17 35 -57 19 -43 -70
3338 -70 -56 -23 -120 -63 26 -60 -26 -40 93 -9 -55 146 72 -24 93 79 68 -11 94 80 -58 26 58 -3 -7 39 -93
3365 -93 12 46 -67 -22 -13 -76 -140 -160 21 -119 -108 26 -19 -48 25 103 107 41 118 92 52 24 71 5 77 0 -35 40 31
3394 31 -31 -52 7 -14 -78 -45 -6 -83 -148 -12 -56 -125 -50 -101 -82 -117 -4 58 14 39 63 56 79 54 -5 64 92 7 -12 9
3424 9 -10 -81 -53 11 -50 -70 -6 68 -30 -8 17 -16 -12 -75 -29 -76 -37 -118 -39 -21 -23 -29 22 72 42 -1 51 112 41 14 120 56
3456 56 -72 -53 -64 -43 -51 -88 2 7 6 -14 -24 34 -19 -53 53 41 -117 -38 19 -66 -134 -52 30 -51 14 61 81 -6 60 61 108
3487 108 7 -33 1 35 -25 -77 -92 19 -84 -134 -90 36 -84 -27 73 -57 -14 -32 102 -78 -78 40 14 -37 -20
3512 -20 3 -46 47 -29 19 116 92 89 78 81 88 0 56 -9 -109 -89 -45 -80 -71 -101 -70 48 -90 5 -61 38 11 -7 -26 8 -81
3543 -81 -79 22 1 52 -5 144 89 16 99 128 26 11 61 39 36 -76 -74 -41 -78 -144 -76 -90 -60 -102 -64 -10 4 -66 20 62
3573 62 -4 -66 60 3 -33 -8 76 19 20 36 55 57 26 101 18 -37 18 -47 17 -22 -100 -121 12 -67 -117 -63 35 -16 -101 44
3603 44 99 -69 18 73 77 51 24 6 56 41 -34 37 30 -19 -8 10 56 -12 -38 21 19 -80 -99 -6 -96 -85 -99 -54 -68 -95 -40
3634 -40 13 37 22 35 79 24 65 134 79 55 63 -12 76 -17 -70 13 -12 -9 -25 0 -24 -13 -95 -23 -41 -81 -42 -55 -91 -11 -25
3665 -25 -30 12 -48 4 64 78 -2 5 155 54 8 22 56 20 7 77 -1 -22 -12 -27 9 -46 -70 -12 -7 -11 -150 -79 5 18 -27
3696 -27 -61 43 29 19 38 35 -4 26 63 5 26 31 69 12 57 34 42 -47 -50 -61 -46 -20 -144 -61 29 -69 -86 -87 23 21 -93
3727 -93 7 27 -34 -39 13 -25 15 7 46 66 93 20 74 56 5 -28 34 46 -54 -36 -3 -33 -94 -59 -1 -43 -99 -51 -6 -59
3757 -59 -75 5 -23 -43 -69 -15 49 40 -16 35 46 65 -22 81 73 21 -6 35 72 -18 -20 64 11 -122 -4 -6 21 -65 -37 -42 -67
3788 -67 -77 3 -16 -26 -84 -83 30 46 -33 -5 121 80 13 104 84 4 -28 69 44 -54 9 27 -16 -7 -68 -39 9 -43 -49 -16 -15
3819 -15 -50 -24 -58 12 -7 -81 0 20 -42 83 56 15 12 44 147 55 -5 16 48 60 39 -23 23 -19 -99 -74 -31 -61 -142 -39
3849 -39 3 11 -26 -45 -14 -54 -31 26 -32 -52 28 43 -28 -13 55 36 35 112 35 83 105 46 -36 1 55 -35 -46 4 -68 -109 -46
3880 -46 -48 -119 -87 -3 1 -51 -23 15 34 -17 19 95 98 38 73 46 93 77 41 90 24 13 -4 52 21 -32 -30 7 -44 -104 -48 -58
3912 -58 -119 -90 -69 -34 -24 10 -25 56 61 38 16 80 23 18 56 76 -11 -31 75 72 -16 -33 47 13 -76 22 19 -16 5 -15 -77 -31
3944 -31 -41 -26 -4 -19 -57 -63 25 51 -29 -8 112 25 -30 51 79 22 41 31 30 -28 -47 -34 -38 25 -51 -7 35 21 -75 25 33
3975 33 -41 -18 16 -2 -74 -42 -11 -6 -20 -28 59 39 14 73 109 24 59 1 30 5 -17 2 20 32 -122 -56 -13 34 -27 -65 12
4006 12 -65 -44 6 27 -49 13 0 -19 -25 -12 9 -14 -21 3 -42 33 11 -12 47 85 -9 -16 57 9 -39 24 52 39 -48 -3 53 -49
4038 -49 -13 -2 -53 -77 -41 0 10 2 -51 -27 29 -21 -19 39 49 -14 -18 46 63 -9 40 58 40 8 -20 -19 13 -13 -20 -21 2 -92 -37
4071 -37 -7 -21 29 -22 -5 -18 -52 -11 3 15 -13 13 -46 11 17 105 41 -30 35 85 33 64 3 -39 1 -77 -10 13 -35 -55 -90
4102 -90 -67 17 -63 -37 -32 -38 -24 -21 34 52 -9 -13 8 32 -18 81 18 29 35 14 76 5 -20 -17 18 20 -48 9 42 -20 -68 12 -78 -55
4136 -55 -114 -20 -25 -57 -22 42 -6 21 45 67 -33 43 67 87 65 43 29 109 46 6 -26 38 36 -31 3 -21 -20 -58 -13 -41 -40 -88
4168 -88 -9 43 0 -54 -38 -4 -50 -41 56 30 -24 7 35 105 5 90 115 50 58 4 53 37 48 -8 1 -41 -55 -101 -14 -23 -30 -46
4200 -46 14 6 -5 -46 29 16 -69 43 15 -67 -4 -18 21 -2 23 19 82 36 -27 65 11 45 16 11 0 -38 -32 -49 -69 -35 -54 15
4232 15 8 -27 -16 17 20 -2 16 -13 15 22 -2 45 24 14 19 80 15 24 2 36 -11 -13 35 41 -49 20 12 -18 -88 -25 -57 24 -17 -58
4266 -58 -16 -3 43 1 -9 53 -22 -21 46 -24 8 34 6 10 20 12 4 -7 8 10 10 -14 -39 -17 18 -12 -77 -31 -43 -95 -89 -10 36 -4
4300 -4 -84 7 30 -28 20 21 -26 -27 48 100 -15 -4 43 12 52 18 88 22 -4 -15 11 -12 -56 -90 -22 19 -71 -31 -43 -34 6 -88
4332 -88 -78 0 -21 47 52 27 -16 -28 63 40 25 -7 67 110 12 -10 -3 22 -22 -65 26 0 6 -30 13 -119 -48 -34 -17 -79 -14
4363 -14 20 -16 34 -27 50 13 -3 -23 73 104 22 8 51 13 -12 71 30 -20 -79 -11 -9 -61 -57 -31 -22 -38 -161 -54 17 -43 -20
4394 -20 -53 11 42 1 2 54 44 17 84 73 82 11 3 3 24 -27 40 95 -2 -16 39 -11 -37 11 -101 -26 -24 -18 30 -25 -57 -35 -13
4427 -13 -3 -17 -48 32 -14 -15 7 -61 38 -17 49 6 20 13 7 43 4 -21 2 57 8 -52 -17 -4 -62 -59 25 -1 -26 -7 -7 16 -19
4460 -19 -15 32 -4 21 46 54 47 8 79 70 27 44 -27 51 24 -11 -33 30 -20 -36 0 27 7 -124 -32 -14 -12 -32 -22 48 -34 17
4492 17 61 26 -39 46 10 51 26 19 121 86 30 -40 30 53 -9 56 71 -5 -21 -18 75 -2 -35 -26 19 7 -28 -47 -14 -63 -32
4523 -32 -30 35 -23 -12 31 72 0 41 97 60 56 41 53 34 31 62 36 -3 -3 -35 -58 -43 -64 15 -20 -12 -20 -71 36 -18 -25 -9 34
4556 34 -19 -43 7 29 19 -27 82 74 30 25 42 79 49 -12 45 50 28 -33 5 12 -22 -64 -83 -35 -36 -72 19 -6 -27 -25 22 -7 4
4589 4 33 54 73 7 52 70 4 24 42 -16 26 20 55 30 -27 -36 -9 21 -61 -103 -27 19 -22 -74 -33 -23 -20 -68 8 61 -10 5
4621 5 60 -6 76 66 31 55 38 -29 -19 40 -22 -9 20 -11 -5 -14 25 10 -46 22 -59 -10 -56 -20 -23 -4 -78 -29 53 -15 -17 -14 6
4654 6 20 25 81 87 -7 -12 26 72 -2 30 12 19 34 5 -3 -15 -57 -89 5 -5 37 2 -16 -30 -61 -10 3 -29 -40 24 46 51 -14 48
4688 48 49 -32 26 87 98 50 7 21 -1 18 -66 -1 -15 -6 -27 -8 31 -72 -4 10 3 8 -14 43 -15 -35 -21 55 37 -19 -31 101
4720 101 35 -2 62 7 51 38 1 24 30 6 2 47 41 -50 -46 19 -26 -21 23 -6 -17 -31 2 31 17 -30 -3 85 3 12 18 23 8 -29
4754 -29 33 54 -2 67 95 41 13 9 17 -4 -2 -18 -22 -47 -28 -6 -69 -56 -40 13 34 -22 12 8 45 67 -3 1 -23 -17 31 47 7 14
4788 14 27 43 -5 -14 1 82 36 37 -11 -14 -23 -22 -3 1 -42 -6 -102 -25 6 -38 -11 -33 39 -10 46 18 16 2 47 26 -42 -1 34 39
4822 39 -10 -5 22 -15 1 -4 64 42 -35 12 -16 13 -21 -60 19 -8 -24 -27 10 -29 37 -34 70 27 78 30 -12 -4 -7 1 -70 41
4854 41 -35 18 36 -54 -39 -37 -8 -20 -92 -2 -37 -35 -21 -38 -102 -21 -21 24 -10 3 23 11 60 -21 -27 64 57 0 68 46 -16 -34 22
4887 22 -4 14 -50 -36 -36 -92 -37 -1 -60 -22 -103 -12 -64 -32 -3 -29 -2 7 -25 25 63 4 23 46 36 29 17 -17 30 0 31 -14
4919 -14 -2 -18 -27 12 7 -38 -24 -12 -36 -23 -35 3 -49 -59 33 26 -41 -41 43 54 -19 -19 29 2 48 16 2 10 -19 2 52 15 -67
4952 -67 5 -3 -30 -26 29 -6 2 -29 -37 -32 -39 -27 -2 -50 2 -18 -20 42 -29 51 59 86 32 36 40 15 9 13 68 49 -7 -33 -67 33 -51 0
4988 0 25 -10 -17 -33 -7 -21 -47 -9 4 16 -18 11 33 18 -48 93 77 -17 50 35 -10 -24 -26 55 45 -21 -4 22 28 -42 -27 26
5020 26 7 -18 -95 12 5 -48 -35 58 28 -25 17 36 2 -45 -22 22 18 -31 29 69 51 -25 29 31 7 18 5 47 7 -37 -52
5051 -52 12 -11 -61 12 15 -18 -77 -33 45 -15 -27 -22 -32 -46 -48 111 -8 -71 16 45 19 -27 45 34 2 20 -23 3 2 17 45
5082 45 -11 0 -27 -41 21 -27 4 -13 52 7 -4 81 -25 6 -38 7 49 -17 37 12 14 76 34 13 43 6 17 26 -11 -46 -46
5113 -46 -4 -46 -84 -19 -29 -41 -71 -38 8 -63 -11 39 44 -17 -4 7 50 9 -55 41 67 19 12 31 76 24 38 21 13 74 -19 11
5145 11 19 -48 -62 46 -36 17 -51 -35 -3 -34 -22 -48 -21 -2 -45 -7 25 -31 13 84 2 23 68 37 -17 71 36 49 49 -12 17
5176 17 -2 -9 -50 46 -11 -68 -11 0 -6 -47 -20 0 29 -81 -24 25 -6 19 -13 38 -19 33 9 38 -49 47 22 -4 42 -40 40
5207 40 -3 -23 -10 -51 16 -5 -69 31 46 -43 24 -76 51 -36 0 10 15 10 -45 75 47 -8 36 58 39 26 -37 12 3 -13
5237 -13 -60 8 -26 -45 -22 22 6 -60 5 -10 -14 -46 -45 -20 14 -2 12 -7 10 7 9 -75 -22 -3 22 32 42 39 -20 35 5 33 23
5270 23 -1 -64 -54 -2 -45 -46 -1 6 -32 -42 47 -23 -49 -57 21 -44 -50 -34 -11 -53 4 -31 15 56 -30 3 11 32 13 12 -4 0 4 5 -17
5305 -17 36 -17 30 -23 -53 -13 -8 -11 14 -11 -9 28 37 -23 13 16 57 -1 15 35 -10 22 80 -25 -25 -18 -14 47 -6 -27 -10 -12 -41 -59
5339 -59 -32 -34 -36 -38 42 -1 -1 -28 1 51 11 -36 14 81 30 78 -16 33 11 -11 57 25 19 3 28 23 8 -30 18 -11 -83 -34 28
5372 28 -30 -70 -6 -19 0 20 35 -65 -32 -29 1 -4 11 3 13 1 58 6 106 27 -20 36 12 22 -32 -4 -33 -47 -39 15 -5
5403 -5 12 -53 7 -5 -44 23 -32 3 -22 -5 -9 -2 -35 -10 56 7 52 -1 24 50 -30 38 -13 -16 -29 34 9 17 -20 27 -42 -8 -19
5436 -19 -76 -38 14 -18 -20 48 17 -26 11 28 22 -26 56 17 -9 1 8 108 -3 -44 4 17 -33 -3 -2 -18 -38 -78 9 -32 8
5467 8 -56 -1 -60 -7 -45 -40 46 -5 9 22 -2 -13 34 -1 16 36 2 73 81 16 43 27 -9 46 -15 27 40 -17 7 -13 -11 -17 -32
5500 -32 -38 -34 30 -49 -78 -39 -2 36 18 -29 5 10 -32 -42 -18 21 20 -17 -53 35 26 42 5 -6 13 -11 7 -17 26 -60 45 -55
5532 -55 -63 -36 0 -17 -72 -29 -27 54 -23 30 -9 -13 9 -11 2 -27 -8 58 49 71 -1 -34 43 -3 -33 -8 1 82 -13 1 -17 -7 5
5565 5 22 -24 26 -18 -10 45 -38 37 -25 -23 29 69 11 19 23 -11 -13 26 -21 32 16 3 -30 1 44 -38 -15 4 -37 -85 -67 -6 -8 -17
5599 -17 7 1 21 4 14 -12 59 6 17 63 13 -2 -33 25 22 60 -14 4 50 -23 1 -5 -6 13 8 2 -17 -49 -23 -31 -36 -72 4 5 -48
5634 -48 -37 -9 -37 45 -20 -62 39 3 -38 13 -4 0 23 60 38 3 -14 5 12 1 -8 35 -3 -25 -57 -48 63 -45 -21 -48 20
5665 20 -26 -12 19 -20 -17 54 9 20 -24 7 56 27 25 6 35 9 44 22 -26 40 -55 3 4 -32 -71 -4 -5 41 -28 49 8 5 -1
5698 -1 -30 8 -2 -4 51 -26 -2 42 -6 29 -14 -6 -13 64 -3 20 1 71 -40 -38 -31 -8 10 -38 19 -9 0 -49 53 -52 -38 67
5730 67 52 14 -45 34 58 15 31 10 74 40 32 29 43 -9 -27 57 46 -11 9 50 22 -51 -17 14 52 -28 -33 -14 -6 21 -53 -9
5762 -9 35 -13 19 -1 4 46 25 48 0 2 1 35 17 -16 51 43 7 -42 -11 18 28 -37 20 34 -48 -10 -1 -2 -1 -28 -21 36 -34 38 -12
5797 -12 -36 -34 48 67 -19 -39 -37 -17 23 -5 71 4 -12 -80 -65 -25 -89 -37 -37 -44 -7 -26 61 -11 42 -20 -30 -14 3 9 14 2 57
5830 57 27 33 -25 -6 45 25 -10 19 -17 -38 -31 25 -25 -28 15 -30 11 18 -41 -31 -13 15 -64 -50 26 8 18 5 1 10 45 0 46
5863 46 9 25 -13 32 82 15 8 -3 36 -16 7 12 -84 -48 22 21 -34 -6 -41 -15 1 -9 3 -17 -14 -7 -7 -22 -30 21 37 62 16 -9
5897 -9 26 38 -3 48 50 42 -47 -4 68 -20 -11 4 -14 21 -38 -25 10 -19 22 -75 7 17 -23 61 -13 28 15 10 42 7 -33 25 42
5930 42 44 -4 73 8 23 29 17 -62 22 -32 53 39 -3 -7 14 19 -11 38 -39 68 -10 -83 3 24 17 -7 13 47 -17 -2 16 10 -18
5963 -18 7 33 -7 3 9 10 9 13 13 -35 17 -40 -13 36 17 -65 16 -47 -33 22 -34 34 28 11 65 2 30 -32 62 -6 -12 2 52 2
5997 2 -28 10 15 -38 0 -13 -8 4 20 42 -10 -16 34 -24 -56 -22 -70 -20 29 -14 -25 -7 -26 -54 10 2 5 42 46 32 46 -7 -35 53
6031 53 -22 -66 7 39 17 -4 6 9 -42 -12 4 -9 12 -64 -18 -24 -14 29 -14 82 59 38 26 74 -49 -6 -15 67 -33 -10 10
6062 10 -18 -27 -55 29 -1 66 -25 -33 -77 -10 -46 40 -37 -25 5 -52 -7 -34 40 -38 33 3 -23 21 -5 40 18 23 0 24 18 -19
6094 -19 -31 14 61 2 -74 -96 -36 -39 -7 -21 4 -19 -21 13 12 42 20 -12 49 3 -3 -22 20 13 26 -11 12 3 -15 25 -35 -1 30
6127 30 7 22 4 16 -43 -36 -28 -13 -13 -30 -22 -26 2 -32 12 -16 68 -10 -14 -26 -12 -19 -55 7 -24 12 -56 34 -4 17 -38 -31 -2 24
6161 24 21 -54 1 -62 38 9 -12 19 -8 13 -45 -26 -14 -9 -58 3 -6 28 -2 -21 -7 7 24 -3 10 -17 -40 -28 -4 -16 -23 -27
6193 -27 1 -2 -7 -56 -2 13 9 -1 -58 44 22 52 39 21 29 36 4 14 19 -10 -23 44 31 5 21 -28 -36 1 -2 30 -23 -84 16
6226 16 -66 -54 -77 -9 -24 -5 -13 -15 -34 -9 -62 16 -62 8 -37 28 41 -19 30 -28 66 7 11 28 -13 16 44 0 -29 4 -15 10
6258 10 26 -7 -3 43 -8 -36 14 -45 13 -45 26 17 -7 11 -18 -33 -18 -10 9 -16 -13 39 43 -50 29 -39 31 23 20 22 23 -82 -18 -19 -27
6293 -27 -6 43 -30 31 -41 -45 27 49 -7 -16 27 16 -11 20 39 -30 23 25 -23 -40 48 -22 -69 23 -4 -29 18 -18 -48 53 -3
6324 -3 1 -24 -65 -1 -14 -7 3 -4 18 50 56 -33 38 -14 -9 22 -12 23 -10 8 12 29 -7 31 -34 15 61 -46 -42 -3 -43 1 -3 -20
6358 -20 36 12 -26 -16 -31 -7 16 5 4 -28 15 -26 -13 33 -6 23 41 65 -39 32 -39 22 -37 -14 21 14 27 37 -37 21 -9
6389 -9 25 14 14 -9 -19 -31 -10 -2 -41 -11 0 12 27 -7 -17 -3 3 24 12 0 19 23 22 28 -45 7 -28 7 12 28 4 -13 -59 -7
6423 -7 -8 21 4 10 -12 2 -10 -28 19 16 68 45 -20 12 -44 -16 0 17 -21 -10 -54 1 -3 -32 0 -68 17 21 -1 31 -32 -30 -83 51
6457 51 4 42 -81 2 41 28 18 -49 17 -29 -28 5 13 5 -14 3 -25 -12 16 -19 7 -53 -84 5 -22 -43 1 -8 7 3 -3 -62 8
6490 8 22 13 45 -10 55 -10 -34 -14 -37 73 -44 36 49 82 47 54 39 -45 -13 -10 43 -9 -9 2 21 36 3 87 18 -25 34 -13
6522 -13 26 5 21 46 27 -25 -24 15 -15 50 -14 45 48 -64 -66 13 29 0 -24 55 -10 -1 62 8 28 12 7 -2 -15 -14 33 2 18
6555 18 17 17 9 13 3 51 -31 -40 -14 10 5 16 61 10 7 3 -31 -45 34 -27 -63 -41 16 -42 -23 -31 53 -11 -7 23 -44 -14 -9 32 63 37
6591 37 -4 34 24 35 26 41 39 67 51 -4 38 -1 66 -34 34 -6 8 36 2 -39 1 61 -4 -55 -41 -44 -22 -3 9 -1 13
6622 13 -20 64 27 -26 6 13 28 -12 23 54 34 -53 7 33 -5 21 12 -10 7 -1 20 -27 50 23 20 5 -50 -2 38 48 -5 48
6654 48 27 13 23 48 19 38 -35 -81 27 55 -28 -19 10 32 -8 -25 19 8 4 -27 18 11 -29 0 -24 43 -19 74 6 0 15 -16
6686 -16 7 16 7 5 22 19 -38 21 -28 60 -2 -22 -3 -4 -19 -49 24 24 -13 -19 20 -2 -22 -7 30 54 3 6 -5 3 -20 45 39 -35 -2
6721 -2 16 74 -2 22 28 43 10 59 1 -84 -28 -7 -22 10 -27 -14 -31 25 -33 2 -58 -33 25 13 47 -26 3 1 3 16 -41 40
6753 40 39 31 46 17 25 -85 -12 44 5 10 -16 -31 1 55 40 -7 -1 61 -25 19 -14 -1 26 13 -4 -64 29 57 -11 -19 24 17 -16
6786 -16 44 13 -21 14 -11 -19 -17 26 26 -22 53 -16 17 18 -49 -21 7 43 -38 19 -65 -10 1 -1 3 7 17 21 45 -13 -2 -15 25 -10
6820 -10 -15 35 -16 52 -2 20 40 -47 30 61 -28 -16 -18 -40 16 -31 12 20 -2 67 -19 50 10 42 24 -10 -24 16 43 -19 -16 41
6852 41 49 21 9 -28 6 -44 4 31 15 -39 15 -4 -37 -7 -13 -25 -53 0 49 38 -48 9 -37 32 56 40 -47 -55 -24 22 33 -2
6884 -2 15 -10 -38 -4 20 -34 -32 -8 -56 7 -26 -16 15 12 25 26 -11 -10 -2 9 -62 17 -41 -19 44 18 29 5 -51 13 43 -66 -5
6917 -5 -20 -24 17 1 -39 -30 21 -8 -15 9 -35 -8 16 -48 -39 -22 -10 30 61 26 -30 -12 -10 5 -7 8 -16 -20 -32 -14 92 -18 -74
6950 -74 -35 33 -6 -40 -14 25 -30 -28 -47 -15 -14 -48 1 -3 36 -22 -51 34 10 19 11 19 26 -10 5 52 48 63 -34 36 -19 -16 20 -11 -12
6985 -12 -5 -3 26 -58 19 -6 -9 71 0 54 -9 14 -38 3 -2 -8 16 -4 22 -27 -12 -30 9 -30 31 43 39 -21 8 -10 22 -19 -18 43
7019 43 0 -34 7 11 22 -27 2 -41 16 -34 2 -14 21 18 41 33 40 -28 -3 1 32 15 31 -16 -13 -54 32 6 -28 -17 -4 0 -11 -7
7053 -7 21 -28 31 2 -94 15 -28 3 27 9 -68 27 -14 33 -34 -26 28 -4 47 30 12 16 78 20 51 -53 -25 50 24 -23 47
7084 47 8 -39 -5 40 13 -1 -52 9 33 3 -20 22 4 24 9 -10 61 -36 -3 51 -15 -13 -41 4 -33 -42 49 24 -26 -40 -45 -16
7116 -16 3 -15 -19 40 33 -9 9 21 -46 1 38 -28 0 -7 -33 -13 40 29 29 2 19 -18 0 2 -29 -45 9 3 15 7 31 -46 14 21
7150 21 -27 46 9 8 2 -2 43 45 2 -23 75 10 -9 -9 -13 1 -1 -17 43 -4 12 12 -15 -19 21 -50 -50 -9 -25 -82 4 42 -82 10 -9
7185 -9 61 -3 18 -48 28 52 -21 40 -1 48 18 -20 29 -23 -49 -28 28 0 -10 -23 39 23 24 10 7 18 24 -30 -17 12 26 60
7217 60 -22 -6 13 19 8 5 -79 33 -24 28 32 -22 -23 1 -21 -5 -34 6 55 59 -28 -37 51 22 44 -6 14 34 -48 -39 -20 -17 15 -30
7251 -30 39 -6 6 22 -23 65 11 -45 -22 22 14 27 0 -38 -47 24 8 23 -10 19 5 36 -29 -57 30 -4 15 -8 18 28 10
7282 10 54 -16 -10 -2 -20 27 -3 38 10 19 3 -4 22 4 24 -27 -36 7 -34 -6 4 -2 -28 -40 -40 -11 -28 55 -33 -37 -8 -64 27 42
7316 42 43 17 12 -60 -22 -26 19 31 15 -28 -26 11 -7 3 46 -49 29 -50 11 28 25 -16 42 -43 46 -8 8 -22 20 -41 -2 -25 -14
7349 -14 4 -1 -14 52 3 72 56 -24 -4 -18 -21 8 12 1 -31 -38 -2 -11 38 -56 36 34 9 -33 47 -17 -12 31 -14 24 -10 14 1 -29
7383 -29 51 -14 -25 2 29 -18 -35 2 10 -10 21 -33 -13 91 23 -5 15 18 5 -16 -9 -36 -69 4 -60 21 13 14 2 56 33 -6
7415 -6 87 22 27 14 -5 6 -23 9 34 42 -42 4 15 -17 -43 56 57 -25 -3 -9 6 -23 33 -10 28 21 -11 71 -2 59 -48 -18 3
7448 3 41 16 30 26 27 -30 -58 12 11 29 35 22 24 -56 -7 76 -10 -31 -40 38 -35 -35 -3 -5 -1 -4 -7 30 15 -16 7 25 38 12 25 23 4
7485 4 -8 45 -12 -1 -13 1 27 -32 -29 -3 -1 7 -49 0 -54 26 -19 12 17 52 4 -19 -20 0 9 75 38 6 -2 27 -20 20 5 -9
7519 -9 -11 -2 17 25 -14 -18 -3 2 -4 -18 -7 -16 -23 -16 13 -47 17 -52 15 -38 35 -30 -16 28 -9 7 3 -4 -32 64 -12 13 -57 48 -45 -40
7555 -40 19 -33 8 -7 -12 -1 13 34 5 2 31 27 20 44 -17 -68 -1 -33 42 46 47 23 -18 -2 47 33 -10 -12 15 64 58 14 -7 23
7589 23 27 41 -18 24 -27 -35 -52 33 -35 3 39 -19 -3 -33 -24 14 -37 36 34 -8 -28 10 32 -3 -20 3 15 2 9 -75 15 62 -30
7622 -30 -19 22 31 0 -13 41 2 -4 53 -24 43 -11 -36 0 16 3 -24 25 8 2 13 -21 45 -13 25 -14 -44 3 25 -6 19 25
7654 25 3 -11 40 16 -21 -1 -51 25 -50 41 -5 18 -24 -23 6 75 -7 -27 -5 7 22 -22 3 10 -39 9 21 -42 30 -5 -32
7685 -32 -32 15 -12 54 -30 26 -55 -19 -14 -41 -6 51 -13 34 -10 -30 11 37 34 14 -3 24 0 -13 15 -67 -16 3 5 -26 54 58 29
7718 29 1 -4 -4 -30 -7 2 -28 3 32 1 -28 22 8 3 1 12 41 -29 16 46 -15 24 32 53 5 51 41 -19 55 -33 -51 14 -26
7751 -26 26 3 10 7 -60 61 14 -4 -25 7 -5 -14 -6 16 79 59 -17 13 -2 -38 -57 -17 -3 -34 13 30 -27 17 40 27 -58 0
7783 0 5 3 23 -49 43 -24 9 -19 45 36 -5 9 -29 30 -45 -28 -49 -27 -16 -7 47 5 12 -18 6 15 -15 -3 -1 -3 -28 5 14 -12 -1
7818 -1 45 2 -41 -3 45 78 -1 -28 34 10 16 63 -34 -25 -18 -26 11 4 20 -60 -54 19 -11 62 -30 54 3 -10 -5 -7 -33 -13 -49 -17 16
7853 16 -4 3 -39 -35 -14 39 -10 45 22 15 -8 29 -28 36 -18 11 -3 17 -11 59 46 -9 1 -5 35 -7 -19 -8 -7 -21 3 83 -3
7886 -3 29 45 18 18 -16 -15 62 32 -8 63 2 1 -13 -14 26 -13 -2 8 15 24 39 -8 -35 -12 -14 2 4 -36 -9 6 0 24 -23 -18 28 -55
7922 -55 -2 99 5 9 -49 13 12 12 -32 -30 1 -24 -3 -9 -34 -70 -1 -41 33 11 -8 0 14 -35 51 -16 0 39 26 -13 -25 -14 10
7955 10 4 8 -4 -6 41 -12 -19 20 65 -18 -25 -11 34 71 -19 66 27 -7 19 -12 61 -49 -11 -25 25 60 -22 -21 -38 -10 15 37 -37
7988 -37 -14 -53 12 10 -47 18 -41 -2 -1 11 25 8 12 44 23 7 25 22 38 -9 -22 -21 15 8 22 41 51 35 33 -14 0 46 -16 -40
8022 -40 27 -24 -3 45 7 18 28 -33 -36 -42 7 -10 32 -5 13 21 -6 -37 45 45 -78 -6 15 18 4 -7 1 5 71 -13 3 32 28 16
8056 16 -8 -28 2 45 -27 -7 -26 1 -21 38 31 -52 33 -1 -11 -29 11 35 -44 29 -31 0 11 -42 -31 -27 7 -1 41 -25 14 -30
8088 -30 -3 33 1 13 55 9 49 49 -28 -43 -43 14 9 -45 6 -1 47 -31 -29 39 -42 2 -24 84 -10 24 -23 -4 44 -32 -5 3 27
8121 27 24 -45 68 -51 -19 45 14 -1 -13 38 -23 65 19 -6 33 26 31 30 -60 44 23 -10 8 -59 -16 1 -21 34 38 2 24
8152 24 -4 29 -28 -1 28 -20 37 -20 -27 -17 6 -43 21 21 -14 -7 -11 -10 1 15 22 32 -6 -18 43 -15 -19 -14 50 -11 49 6 -20 42
8186 42 2 20 49 -43 37
8191C7
$$ Imaginary data points
##PAGE= N=2
##DATA TABLE= (X++(I..I)), XYDATA
0 0 0 0 0 0 0 0 0 0 0 0 0 0 0 0 0 0 0 0 0 0 0 0 0 0 0 0 2 -3 4 -4 4 -6 11 -11 13 -14 16 -20 24 -27 30 -35 38 -44 50 -56 61
47 61 -70 77 -84 95 -102 113 -122 132 -143 150 -159 165 -168 162 -144 106 -26 -132 455 -1182 3067
68 3067 -9682 70985 427930 -81047 -375706 113598 64355 -232244 43040 88395 -275928
79 -275928 -55723 280373 -61532 -217764 162760 136290 -142819 -13967 66844 -83105
89 -83105 36225 130396 -114887 -112374 173632 94989 -118749 -844 73817 -32488 38702
100 38702 93471 -62737 -61912 74232 -5333 -102746 -9964 2690 -85104 -24229 41511 -35306
112 -35306 -26674 62341 7178 -53506 40761 90015 822 -28863 45260 42162 -29561 -2134
124 -2134 35856 -52432 -76196 49171 48556 -84753 -33795 93286 -10529 -99511 42435 62179
136 62179 -87238 -44854 50140 -37752 -41228 60172 -31852 -111680 50075 87352 -71743
147 -71743 -25224 95048 4484 -6687 100404 2411 -72229 82932 62195 -120905 -25417
158 -25417 109201 -44910 -98914 46640 -1956 -76086 55566 24042 -128045 12950 135871
169 135871 -53581 -93570 83662 23387 -94475 34696 51389 -98609 -8664 107795 -45407
180 -45407 -73350 99269 41272 -91856 27032 86109 -51225 -28193 79438 -20993 -80542
191 -80542 43765 28142 -87786 -22223 45804 -37714 -38828 47202 7825 -46045 24310 42882
203 42882 -26581 -3883 42171 -11231 -23375 37513 13444 -42247 900 33939 -22390 -27142
215 -27142 32940 10745 -33551 14221 32023 -25210 -13657 30305 -14181 -40369 18663 12548
227 12548 -48364 -6006 37170 -31945 -34399 47492 12361 -47677 21743 47685 -28175 -7326
239 -7326 52031 -16013 -44122 44168 18975 -66073 3173 50745 -39805 -32627 50273 -4562
251 -4562 -50060 36413 32103 -55690 1225 62097 -29100 -42787 47155 8688 -49952 19574
263 19574 27311 -44743 -148 51561 -26316 -35916 51858 14466 -53090 18013 40593 -40092
275 -40092 -16302 42778 -17005 -39728 31299 11813 -47868 7267 37629 -31481 -17801 44389
287 44389 -4640 -35676 31706 24054 -39951 31 42029 -19760 -30934 34107 10294 -40120
299 -40120 9233 29374 -28058 -14299 33119 -5546 -29814 21334 18042 -31747 -1268 32521
311 32521 -17772 -23683 31059 7401 -33970 10929 28909 -23013 -14230 31080 -1700 -27691
323 -27691 19588 15711 -30846 2353 29712 -22214 -21427 30856 1522 -36036 12893 24349 -30332
336 -30332 -9787 33908 -12623 -27531 30187 11727 -34331 12105 32646 -24208 -12075 37610
348 37610 -4520 -31974 26838 18976 -39053 1472 36759 -23942 -26563 32285 3710 -35553
360 -35553 13439 23164 -29538 -5957 33247 -15627 -26347 30215 8151 -35564 10595 28270
372 28270 -25621 -13299 33218 -3892 -29144 22602 19993 -28677 694 29856 -14470 -16751
384 -16751 23990 -196 -25833 13846 15671 -28838 -6047 29378 -12482 -25645 23739 12217
396 12217 -26094 6772 25342 -16384 -11494 26632 -231 -25411 14507 17059 -24442 -4124
408 -4124 23013 -13190 -16686 22910 3143 -26860 11426 24417 -22350 -14121 26931 -2752 -26147
421 -26147 13779 11332 -24937 715 22124 -16070 -15012 26558 5649 -24109 13504 22569 -19284
434 -19284 -3935 25948 -10283 -20409 20885 7069 -28177 3338 21328 -18693 -12704 24175
446 24175 -3168 -21194 20202 13296 -25944 3128 27216 -15182 -18614 23369 4270 -26560
458 -26560 8512 17898 -21767 -6843 23177 -8455 -16739 20118 6248 -22978 7579 19336
470 19336 -19816 -10370 24404 -5844 -25167 16026 13007 -25074 -1528 23470 -9986 -14132 21513
483 21513 7667 -18134 9745 16846 -16094 -2922 21091 -8977 -17044 17281 6319 -22964
495 -22964 2657 18618 -14661 -11272 21835 474 -20416 12544 14151 -19941 -4499 18428
507 18428 -9632 -16455 15019 3590 -21777 6427 18401 -16192 -7608 23702 -611 -17705
519 -17705 13446 11783 -17829 -1227 15881 -12765 -14097 15455 -1598 -20858 9321 11700 -18582
532 -18582 -476 22938 -6849 -15057 18791 9904 -18069 6058 18729 -13617 -6882 21427 -2317
545 -2317 -17389 13494 11311 -16550 743 17110 -10101 -9518 17152 -4440 -23348 10660 13186
558 13186 -23123 -10325 16525 -5987 -15987 10237 2131 -18246 7680 17508 -15186 -7160 23091
571 23091 1670 -15518 11367 11248 -12967 2206 16123 -10723 -10936 18744 4233 -18584 4749
584 4749 12776 -9880 -1568 11949 -8499 -9471 15900 2431 -21394 2992 16217 -12838 -10069
597 -10069 15285 -1220 -13455 12234 10712 -15044 -849 18089 -5265 -13030 11290 3500 -14334
610 -14334 4507 7354 -16254 -3950 15636 -7897 -17573 11956 10120 -16245 -957 15541 -8469
623 -8469 -9177 15589 1995 -14223 8712 12714 -11327 -2349 16531 -2980 -11109 12661 6497
636 6497 -12899 5424 12727 -11343 -5570 14581 -2963 -14827 7752 7125 -14924 -2224 11275
649 11275 -9584 -9105 11875 -2856 -15534 8817 10816 -14621 -4747 16026 -2188 -11618 10208
662 10208 5257 -12453 4898 12164 -10510 -4906 15096 -574 -12234 8520 8024 -12235 900
675 900 13872 -8822 -9713 14897 3069 -16058 2995 11473 -8943 -5930 10245 -2655 -9614
688 -9614 9338 4258 -13338 2183 11610 -8251 -5969 11679 -503 -10852 7933 8046 -12721
701 -12721 -2410 13577 -4906 -10751 9190 3839 -10596 2754 7503 -8574 -2686 11394 -3503
714 -3503 -10588 9580 6119 -12750 567 11167 -7896 -7701 10800 1047 -11575 5263 9473
727 9473 -8999 -2174 12661 -2876 -8179 10404 4398 -10683 3407 9557 -8705 -5735 10736
740 10736 -1986 -12283 6540 6819 -11700 -1360 10509 -5586 -7166 8733 469 -10658 4538
753 4538 7161 -10803 -3474 11537 -3993 -9905 9321 5397 -9481 3255 10993 -4956 -3251
766 -3251 11569 907 -8789 6658 5752 -10546 -609 8601 -7843 -7921 8833 258 -12131 3163
780 3163 8654 -8726 -4601 10473 -1434 -8734 6609 4111 -8882 1222 7688 -5922 -3978
793 -3978 9836 601 -7866 7524 7844 -8458 221 11424 -3872 -7761 7652 2671 -10657 -575
807 -575 5924 -7934 -6091 6488 -2606 -7984 6096 3575 -8290 2190 9546 -4467 -4557 9946
821 9946 2487 -8583 4531 7786 -7372 -2147 9322 -2060 -6440 6874 3747 -7531 1574
834 1574 7307 -6102 -4650 7622 -2602 -10210 3955 3243 -10579 -2358 7367 -4258 -6357 7358
848 7358 3130 -6819 4762 8463 -5209 -222 10282 -1663 -6391 6815 3432 -8971 139 7386
862 7386 -5687 -5502 7777 63 -8112 4175 4643 -7282 -957 6320 -4539 -5974 5890 112
876 112 -9198 2974 6754 -6986 -2201 9877 57 -5729 6509 5544 -5395 908 7182 -3619
890 -3619 -4238 6143 -864 -7740 3249 3067 -7850 -1101 6554 -4127 -6246 6406 2555 -8330
904 -8330 1357 7203 -4995 -3966 6379 -412 -5635 3882 3413 -5410 980 6926 -3272 -3522 7769
919 7769 1547 -6555 4205 5816 -6010 -1796 6923 -2182 -6827 4115 2826 -7160 -169 5376
933 5376 -4605 -3306 5806 -1313 -5927 4457 3649 -6581 -677 6845 -3104 -5553 5715 1718 -6515
948 -6515 2519 5346 -4838 -1603 6529 -1052 -5057 4651 3311 -5897 1032 6059 -4628 -3553 6408
963 6408 -285 -6636 2944 4051 -5418 -1690 5214 -2591 -4487 5084 1036 -6020 3150 5198 -5086
978 -5086 -1537 6903 -500 -5125 4520 3862 -5764 -53 6055 -3179 -3911 4943 424 -4948 2392 2920
994 2920 -4674 -742 4695 -3542 -4996 4783 498 -7914 677 4507 -5297 -3654 5211 262 -4562
1009 -4562 3579 4648 -3051 1109 6391 -1188 -1583 5814 816 -4222 3063 3148 -5343 -1518 5508 -2372
1025 -2372 -5644 4258 2356 -6155 290 4399 -3897 -3231 3798 -1163 -5564 1899 2097 -5807 -807
1040 -807 4953 -2769 -2869 6065 2046 -3717 3728 5777 -2551 -756 5729 -757 -4739 2916 923
1055 923 -6435 -425 2919 -5061 -3460 4285 -287 -4836 2764 4044 -3863 -250 5657 -1458 -3337
1070 -3337 4007 1107 -4234 1626 3498 -3024 -408 5755 -17 -2921 5260 3460 -4502 565 4371
1085 4371 -3830 -4584 1937 -1911 -6961 -900 899 -5318 -2142 3635 -1674 -1988 5252 2223 -2563
1100 -2563 3809 5435 -2556 -1127 5729 153 -4851 2487 2992 -4075 -271 4243 -1485 -1899 3952
1115 3952 1015 -3410 1523 2157 -4701 -2190 2685 -4000 -5636 2083 76 -5543 400 4604 -1360
1130 -1360 -968 5911 2764 -1588 4029 4033 -2617 299 3272 -3157 -3723 2043 -1199 -5645 444 2588
1146 2588 -4055 -1562 4826 -464 -3144 3569 2079 -3739 282 2966 -3184 -2930 3187 -229 -4015
1161 -4015 2773 3615 -2393 1386 6149 232 -1249 4421 2021 -3635 -102 1613 -4589 -3741 1179
1176 1179 -3431 -5292 1458 708 -4071 809 4660 -763 -972 5122 2205 -2830 2069 3208 -3213
1191 -3213 -1376 2735 -1534 -2729 2316 915 -2462 2051 3762 -2098 -510 4794 -683 -4237 1788
1206 1788 884 -5408 -2327 1616 -3142 -3960 2095 998 -2579 2411 4241 -626 1650 5165 187
1221 187 -1257 3504 821 -4420 -441 2014 -4197 -3894 2359 -754 -4121 1657 2526 -2242 180 3579
1237 3579 -645 -1942 2472 312 -3779 718 1898 -3504 -1048 3790 -311 -1832 3885 3412 -1316
1252 -1316 1791 4552 -886 -1724 2710 -866 -4669 -161 -317 -5023 -2377 1355 -2423 -3158 2597 1699
1268 1699 -2297 2023 4152 -1034 -78 3860 23 -2282 1887 1147 -3065 12 2879 -1752 -1619 3819
1284 3819 1106 -2519 2212 2855 -2404 -1241 2069 -1687 -3946 43 -701 -4286 -816 1352 -2553
1299 -2553 -717 3679 578 -834 4060 3607 -1233 1236 4364 -752 -2536 2276 373 -3867 -293
1314 -293 1143 -2717 -1544 1816 -728 -2066 1966 910 -2839 567 2107 -2989 -2152 2358 -928
1329 -928 -3498 1260 2238 -1945 27 4036 744 -436 3843 2312 -1165 1824 2274 -2149 -1285 1508
1345 1508 -2028 -3821 509 -61 -4187 -863 2144 -2058 -1827 2695 558 -2073 1512 2176 -1813 -424
1361 -424 2713 -765 -1976 2505 1224 -2173 1448 2927 -988 -155 3275 549 -1881 1552 1205 -2938
1377 -2938 -920 1098 -2859 -2816 1066 -1131 -3427 570 1548 -2101 -500 3134 310 -1408 2673 1911
1393 1911 -1616 876 2203 -1150 -737 2035 -148 -1797 1624 1437 -2310 231 2723 -1443 -1948 2147
1409 2147 218 -3073 -87 1314 -2272 -1919 1482 -576 -2191 1258 948 -1631 1034 2282 -908
1424 -908 -102 2897 351 -1939 1693 1928 -2388 -680 2418 -1068 -2207 1497 539 -2229 156 1413
1440 1413 -1489 -1030 1717 -509 -1986 1354 682 -2413 302 1914 -1565 -1200 2154 549 -1848 1151
1456 1151 2146 -1345 -199 2522 -395 -1264 1907 690 -1890 499 1580 -1534 -1230 1700 -400 -2209
1472 -2209 990 796 -2318 -233 1542 -1340 -1326 1528 57 -1980 810 1485 -1734 -391 2309 -575
1488 -575 -1646 1743 1072 -1594 404 1961 -664 -662 1964 361 -1281 1345 1097 -1666 172 1598
1504 1598 -1425 -1487 1351 -180 -2592 174 1355 -1978 -1306 1765 -236 -1638 1080 966 -1222 277
1520 277 1504 -711 -585 1674 -11 -1534 1336 1223 -1704 149 2264 -573 -1284 1658 922 -1804
1536 -1804 0 1381 -1412 -1351 1012 -786 -1894 479 147 -1719 130 1433 -771 -556 2208 711
1552 711 -1242 1575 1869 -1217 -101 1902 -457 -1297 1066 532 -1644 98 1271 -1225 -851 1508
1568 1508 -388 -1629 762 349 -1941 -619 822 -1335 -1576 855 28 -1601 840 1584 -803 516
1584 516 2461 359 -363 2011 1375 -1045 345 1570 -1038 -1281 993 -433 -1836 253 276 -1495
1600 -1495 -296 936 -862 -1044 1145 -51 -1886 411 1034 -1726 -794 1525 -175 -1211 1206 1446
1616 1446 -561 560 2171 159 -57 1691 295 -953 770 316 -1721 -603 683 -1494 -1760 791
1632 791 66 -1962 176 1433 -984 -591 1519 180 -938 721 778 -1012 -10 1151 -705 -574
1648 -574 1581 231 -899 1309 1300 -888 82 1599 -354 -1331 739 185 -1924 -474 551 -1518 -1117
1665 -1117 790 -422 -1088 799 903 -751 341 1654 -241 -521 1466 283 -1130 585 835 -1048
1681 -1048 -323 1208 -271 -932 1103 673 -1226 328 1307 -960 -866 950 -322 -1451 37 338 -1332
1698 -1332 -420 923 -554 -712 1285 378 -756 1125 1244 -667 -9 1470 -122 -1203 781 691 -1475
1715 -1475 -226 1105 -696 -777 892 122 -730 516 618 -860 -76 945 -792 -1060 964 -149 -1584
1732 -1584 371 895 -1077 -536 1252 193 -904 783 1063 -712 169 1155 -491 -465 821 -129 -938
1749 -938 535 545 -990 -183 1195 -419 -948 1119 382 -1255 260 874 -895 -735 759 -195 -1193
1766 -1193 290 502 -1041 -9 1009 -554 -451 1110 235 -691 731 907 -645 -203 1119 -216
1782 -216 -860 900 349 -1129 198 868 -760 -635 792 -33 -1150 305 574 -1077 -385 751 -576
1799 -576 -699 687 24 -845 479 752 -640 -73 1286 -37 -753 1088 717 -928 270 1072 -433
1816 -433 -631 737 128 -968 66 391 -973 -376 561 -758 -674 688 -143 -980 375 702 -867 -384
1834 -384 1181 18 -915 886 753 -807 140 1105 -186 -337 790 232 -655 434 586 -826 -153
1851 -153 793 -734 -856 678 -96 -1218 -42 613 -899 -706 938 42 -857 670 752 -599 199 967
1869 967 -134 -309 782 273 -682 454 699 -750 -234 842 -425 -674 678 171 -898 103 672
1886 672 -719 -685 650 -163 -1097 355 458 -929 -130 794 -164 -356 787 529 -415 507 885 -427
1904 -427 -36 970 -281 -733 622 182 -994 -74 700 -656 -766 715 135 -1016 227 577 -745
1921 -745 -297 508 -357 -583 380 112 -691 294 741 -603 -81 1160 -67 -574 905 667 -622 -26
1939 -26 914 -313 -811 559 153 -916 149 444 -701 -127 599 -313 -446 615 215 -728 228 655
1957 655 -739 -531 775 -224 -876 384 442 -668 -56 780 -91 -349 727 372 -558 385 522 -636
1975 -636 -161 553 -377 -622 410 126 -769 47 745 -519 -370 859 -38 -727 434 396 -654 -254 532
1994 532 -207 -654 446 274 -640 248 672 -338 84 758 -15 -365 550 359 -669 -48 609 -655 -697
2013 -697 568 -60 -927 161 442 -575 -293 580 -70 -569 374 287 -602 198 489 -473 -40 707 -132
2032 -132 -367 632 538 -477 150 1033 -183 -499 664 182 -756 17 306 -567 -484 229 -273 -618 197 36
2052 36 -706 79 457 -535 -162 697 -32 -517 497 621 -481 -62 826 6 -437 652 379 -366 208
2071 208 482 -310 -201 402 -170 -584 227 46 -847 -148 278 -668 -467 423 -133 -564 263 502 -418 -94
2091 -94 751 50 -374 586 401 -356 248 558 -198 -131 480 20 -458 251 178 -638 -11 400 -540 -432 443
2112 443 -83 -730 48 363 -497 -339 556 2 -439 390 372 -292 196 461 -108 -61 476 20 -308 453 380
2133 380 -500 56 566 -388 -500 372 -28 -614 -68 373 -378 -442 397 -72 -457 255 247 -314 227 401 -216
2154 -216 -61 534 54 -375 401 403 -466 -11 627 -181 -343 423 182 -476 -40 345 -374 -407 174 -184 -583
2175 -583 79 24 -526 31 347 -214 -66 530 147 -313 356 485 -383 -51 568 -147 -362 351 246 -261
2195 -261 85 450 -32 -128 449 155 -298 307 105 -449 -98 101 -487 -472 41 -186 -671 64 342 -415 -159
2216 -159 591 46 -195 397 362 -224 4 329 -70 -188 269 33 -264 320 273 -165 294 508 -122 -132 406
2237 406 60 -625 -60 128 -694 -575 120 -325 -554 -31 140 -125 127 455 86 146 501 184 -128 380
2257 380 257 -308 95 317 -276 -316 317 200 -416 106 510 -203 -204 267 -185 -487 -158 -193 -575 -346 -130
2278 -130 -380 -314 301 105 -138 582 630 112 461 768 214 -39 429 219 -474 -170 101 -440 -344 24 -187
2299 -187 -370 66 14 -271 -45 160 -252 -305 114 -267 -599 41 54 -450 -20 500 214 119 769 717 241 395
2321 395 761 178 -75 260 -165 -471 -272 -386 -646 -443 -232 -470 -400 194 -54 -401 275 388 -277 -71
2341 -71 369 -41 -286 144 256 -189 99 535 181 251 600 316 228 468 289 -119 46 50 -524 -638 -225 -436
2363 -436 -977 -250 -58 -518 -244 363 89 -33 382 478 92 176 434 57 -31 285 7 -109 222 102 -163
2384 -163 149 431 13 -106 320 82 -467 -104 -30 -558 -548 -214 -456 -565 -224 62 -174 38 481 250 236
2405 236 743 446 185 524 400 -139 69 238 -211 -445 83 -2 -490 -42 205 -264 -169 162 16 -219 -122
2426 -122 10 -329 -300 -41 -421 -318 152 -92 -160 396 411 116 283 652 267 -48 409 290 -292 -96 27
2447 27 -367 -361 -103 -191 -369 -46 73 -135 53 298 -84 -120 298 -40 -340 121 104 -318 -219 214 2 -265
2469 -265 224 385 -23 223 467 123 58 260 11 -177 -30 -21 -349 -243 55 -346 -274 155 16 -263 205
2490 205 312 -85 -78 332 143 -245 26 121 -269 -96 115 -153 -76 176 14 -49 222 292 -25 100 330 -74
2512 -74 -260 256 -49 -439 -80 97 -212 -254 180 68 -193 93 216 -50 50 177 -125 -135 74 -80 -224
2533 -224 11 65 -212 -15 336 -6 -132 357 268 -125 132 337 -46 -148 142 87 -283 -95 28 -299 -115
2554 -115 80 -200 -158 138 -91 -217 98 165 -266 -52 317 -2 -244 283 241 -190 39 283 31 -73 199
2575 199 122 -142 56 173 -177 -30 167 -195 -143 87 -55 -222 0 145 -269 -223 250 -73 -262 118 183
2596 183 -199 -70 211 32 -37 170 155 -49 126 204 -61 17 205 -153 -154 129 -63 -317 -14 113 -304 -239
2618 -239 178 -48 -366 94 144 -196 -76 114 16 -75 130 100 -75 146 202 -38 159 327 -28 -137 257 54
2640 54 -231 -61 102 -268 -321 99 -83 -355 -62 106 -163 -109 84 -61 -112 37 5 -131 48 112 -200 5
2662 5 239 -23 -128 255 273 -95 123 362 36 -94 205 158 -168 -51 -10 -219 -188 14 -226 -211 -45 33 -177
2685 -177 56 174 -159 -46 247 -51 -181 104 77 -197 -71 186 -30 -185 202 166 -79 110 163 -10 50
2706 50 92 -4 -120 38 -72 -205 -37 114 -272 -170 93 -44 -175 133 185 -108 -58 165 97 -171 38 84
2728 84 -166 -16 85 -109 -31 111 -24 -24 225 129 -132 93 233 -148 -160 140 -105 -323 -123 8 -180 -224
2750 -224 63 -32 -116 55 129 -11 160 131 -27 47 108 -51 -89 101 35 -158 17 189 -40 -142 206 108 -84
2773 -84 60 147 -25 -185 5 -88 -282 -111 -163 -265 -9 -3 -179 -23 145 44 36 238 201 -19 65 254 40
2796 40 -76 141 97 -132 12 151 -6 -79 76 62 -48 40 -23 -127 -41 -35 -262 -176 -29 -179 -292 -41 107
2819 107 -134 -83 242 138 -12 238 183 56 113 175 48 -33 41 11 -123 10 2 -168 27 10 -172 -85 114 -86
2843 -86 -181 -17 17 -166 -169 1 -75 -144 12 77 -29 94 165 84 94 194 133 49 116 62 -103 9 85 -167 -177 -21
2869 -21 -102 -224 -112 41 -146 -125 102 9 -129 76 13 -70 -1 9 20 5 71 68 30 227 207 -51 190 279 -19
2894 -19 23 56 48 -173 -145 -5 -97 -250 -93 -108 -177 -87 -84 -63 -3 61 -67 62 97 45 -29 141 108 -49 60 224
2920 224 -3 24 162 179 -11 8 199 23 -63 51 -68 -108 -74 -146 -217 -85 -107 -219 -57 -3 -59 -81 86 117
2944 117 -108 41 190 14 -19 53 124 26 8 128 31 7 80 1 -34 16 -41 -70 4 -19 -126 -71 108 -99 -178 -27
2970 -27 20 -191 -67 16 -10 -104 -2 100 33 32 203 92 8 70 3 15 151 -21 -22 92 93 -116 -80 77 11 -126
2996 -126 -22 101 -189 -100 -35 -63 -116 -85 -19 -52 -85 40 -11 -2 102 40 12 118 104 -12 139 150 29 19 113 97
3022 97 -103 -57 70 -129 -112 -34 -96 -49 -29 -17 -84 -104 -13 -95 -57 47 -73 -86 72 11 -116 12 189 20 47
3047 47 134 129 -14 50 153 0 -61 58 -21 -21 -3 -71 -42 -95 -67 -155 -96 17 -66 -163 115 12 -151 17 104 -38
3073 -38 -64 93 150 -38 52 113 90 30 89 -5 40 87 34 51 50 47 -109 -117 61 -108 -231 -39 -50 -177 -123 -18 -105
3100 -105 -86 48 101 8 78 150 65 107 118 39 16 150 46 -52 31 95 -62 -46 126 33 -113 22 40 -97 -135 -28
3126 -28 -36 -198 -70 -102 -141 -111 -46 -13 46 119 41 -6 163 102 31 87 129 33 36 153 135 -189 30 80 -48 -81 0 5
3154 5 -70 -49 -33 -137 -87 -87 -114 -77 5 -95 -102 -40 -35 -76 41 188 34 2 144 144 -47 138 147 43 11 37 -29 -45 -16
3183 -16 10 -97 -28 -16 -101 -94 39 -69 -51 25 63 -149 -49 81 -11 -149 10 69 -39 63 153 79 56 103 91 91
3209 91 23 16 -62 -6 56 -173 -64 23 -56 -153 37 50 -95 -117 56 25 -151 12 78 -50 -38 63 8 -28 81 47
3235 47 58 139 40 52 25 127 -41 -75 156 -35 -140 16 55 -66 -84 -12 -55 -197 -116 14 -121 10 23 -53 -58
3260 -58 -20 50 -24 91 77 -6 61 86 -8 -15 188 61 -94 79 142 4 -87 27 41 -95 -38 20 -85 -84 -63 -65 -124
3287 -124 -21 -100 -109 -36 -19 -63 -26 88 -13 -55 97 95 -46 40 119 79 -22 88 66 -46 18 26 -17 -70 6 -89 -71
3314 -71 -43 -89 -82 -70 -28 -94 -28 64 -33 -118 -26 29 -99 -40 50 23 -28 18 101 46 49 81 6 55 55 -64 -20 21 -36 -147
3344 -147 -85 -17 -130 -142 62 45 -178 3 68 -12 -24 39 51 44 -3 31 67 60 61 21 93 87 30 69 50 47 7 -12 104 -69
3374 -69 -81 -13 -74 -127 -32 -32 -109 -122 -79 -55 -30 11 40 -12 49 58 -13 50 125 -15 -26 155 55 -38 -24 59 71 -6 38 53
3404 53 -30 -16 -47 37 -95 -61 -49 -143 -112 -114 -88 -1 -9 -81 17 69 7 -24 106 116 -84 7 9 53 -22 42 31 -66 -32 24
3434 24 -39 14 6 25 5 47 -24 -45 47 -23 -121 -59 -31 -45 -48 -33 24 -19 2 59 97 -12 86 49 15 22 -25 -17 14 -66 -51 -74
3466 -74 6 -46 1 65 29 -2 -70 85 22 -54 -27 -13 -84 -96 3 -23 -96 -55 28 5 18 8 65 96 78 19 57 76 39 -56
3496 -56 20 32 -114 -43 50 12 -95 -6 -4 48 -20 14 28 -66 -85 -50 -10 -47 -76 -116 -9 -13 -39 -39 20 63 10 140 203 77
3526 77 53 130 90 -51 11 36 39 -42 -45 6 -42 -78 -14 -60 60 -59 -50 -32 -20 -79 -105 -49 -32 -126 -98 73 29 15 70 112
3556 112 127 102 70 74 -6 34 15 12 -44 -38 -42 -23 -25 -136 -44 17 -48 -94 10 10 -101 -68 -24 21 -38 -2 1 -41 -17 28 30 62
3588 62 40 62 123 121 26 80 108 31 -8 -58 -13 -80 -178 -74 -31 -150 -75 -53 -50 -98 13 5 72 21 4 89 44 9 9 46 85
3619 85 9 73 93 73 47 66 67 52 -61 -4 18 -82 -103 -83 -76 -110 -132 -90 -63 -20 -47 -42 20 -25 -46 58 80 80 17 73 110
3650 110 1 22 78 66 13 11 33 53 -23 56 -34 26 -42 -47 -23 -48 -86 -141 -66 0 -79 -115 34 33 -57 15 46 0 -6 60 105
3681 105 19 -26 114 106 17 60 19 34 25 -30 39 -6 -29 -63 -33 11 -48 -103 38 12 -109 -64 33 41 7 59 26 60 39 64
3711 64 54 21 31 51 64 125 34 5 28 -55 -73 -47 24 -63 -77 -17 9 -116 -79 -70 -84 -108 -50 -55 -39 38 25 12 18 46 36
3742 36 57 58 30 -22 54 17 45 8 -10 60 -62 -8 73 -83 -69 -38 -38 -82 -96 -13 -77 -18 -56 -52 -12 -1 -85 -45 78 24
3772 24 -19 72 97 -14 49 106 98 -28 27 88 -21 9 20 7 -9 -20 6 59 -46 -52 -95 -75 -60 -73 -116 7 -87 -83 -59
3801 -59 8 -35 -20 63 98 -11 66 83 48 49 37 17 38 9 -51 64 -2 18 -66 -14 13 -57 -105 -1 -61 -120 -85 50 -50
3830 -50 -62 -7 -11 -22 2 10 100 27 62 47 56 63 23 54 35 19 -33 -53 31 -98 -100 18 -67 -5 -52 -6 -59 -85 -53 14 -30 -48
3862 -48 -41 -34 49 31 16 51 49 45 111 117 123 39 34 69 26 13 -27 61 -12 -49 -27 2 -60 -70 -70 -1 -71 -67 -47 -19 -19 -40 14 -30 36
3897 36 -23 -38 22 -4 7 67 63 -14 92 83 52 -4 4 77 -16 -7 -24 -88 -71 -38 -94 -51 -12 -48 -49 -12 -30 7 -19 8 42 -76
3929 -76 -9 15 8 1 47 63 -25 -15 53 54 7 59 50 52 39 -9 10 -13 -51 -31 -5 -16 -62 -54 -6 -5 -96 20 68 3 33 51 102
3962 102 2 22 56 55 -15 -8 -25 42 -7 -1 49 94 -10 -63 -14 22 -24 -75 -56 26 -119 -27 -27 -65 -115 -16 -47 -19 -17 35 21
3993 21 7 -16 13 32 52 2 46 88 26 0 -2 75 63 -38 -11 45 -23 6 16 -74 -35 -26 -32 -15 -62 -67 -48 -71 14 -44 -12 40
4025 40 -23 -28 72 14 -55 43 126 85 -62 20 7 41 2 -3 -3 17 -57 10 50 -60 21 11 -16 -63 -42 -57 44 -60 -112
4054 -112 45 -42 -1 -106 24 72 -28 28 77 -3 -17 17 8 24 -28 29 0 3 -20 19 1 20 -99 -3 2 -39 -72 -86 26
4083 26 -52 -62 32 -13 -39 30 11 -15 30 42 -16 58 55 -6 23 68 29 14 65 50 -17 -29 -6 1 -69 -13 -9 -18 -52 -18 -19 29 -74
4116 -74 -36 -62 -2 -9 -7 4 -12 52 7 60 91 28 77 73 55 12 18 55 -23 20 37 31 -90 -88 -11 -31 -124 -95 -29 -2 -63 -3 30
4149 30 -5 -30 -10 47 38 -24 -40 83 27 12 32 46 8 37 26 66 16 -18 -32 14 -77 -18 -9 2 -41 -32 -59 -34 -72 -33 -19
4180 -19 4 -90 24 41 54 18 -1 53 24 41 20 -16 33 -14 49 4 44 -14 -49 5 17 -42 -49 7 -27 -29 5 -48 -17 -124
4210 -124 -21 15 -18 -21 -8 9 7 32 14 25 -66 32 68 74 38 -15 -33 23 -70 -72 -24 -48 -46 -24 31 -46 -58 -30 -15 -109 -61 21
4242 21 -39 8 -39 -77 26 6 -46 29 13 -23 68 47 9 39 16 10 17 30 28 -5 -29 -111 49 17 -14 -57 -42 -5 -9 -56 2
4273 2 33 -50 -52 44 82 6 -24 -19 10 12 8 25 57 28 53 48 31 4 -9 57 15 -25 -17 -25 20 -13 -78 5 -47 -29 -94 -19 33 -35
4307 -35 -34 13 18 1 -6 85 18 -15 35 11 -23 -30 21 30 53 12 22 34 -9 -12 24 35 -3 19 -33 -57 -42 -41 -21 0 -30 -50 -22 15
4341 15 14 -2 21 1 -11 7 44 17 -14 -12 45 -29 -12 9 53 -28 -122 -11 2 -78 -48 0 -39 -25 -45 -2 -48 -75 -53 -32 45
4372 45 -11 -17 50 9 50 -6 67 59 38 48 85 38 -91 28 5 -3 12 12 6 -12 -20 -70 -12 20 6 -80 -10 -16 -55 -8 25 -30 -10
4405 -10 1 13 10 4 51 54 33 -31 69 39 49 11 5 -4 21 -9 30 5 -69 -22 -7 1 -82 -36 -27 -3 -10 8 1 39 -1 23 11 -20
4439 -20 12 -14 56 17 47 24 61 48 74 -30 8 -18 -16 -7 -23 -20 -88 23 -30 -111 -44 29 -62 -9 7 2 -43 -51 -1 7 26 26 11
4472 11 21 59 -13 41 46 7 -37 48 53 -3 -15 5 -13 -33 -64 -21 -52 -97 -30 16 -46 -12 -51 -50 33 -21 -16 11 87 -2 -29 -5
4504 -5 40 -2 -19 23 78 25 53 17 57 36 5 47 29 33 7 36 -50 -51 -74 -36 8 -28 -72 25 -50 -67 37 -2 -7 -10 37 -16
4536 -16 15 34 58 56 22 30 -55 70 -14 30 13 -34 10 -8 3 17 -7 -25 8 -24 -63 -20 26 18 -83 -20 38 -42 -18 31 -9
4567 -9 -30 15 22 19 29 13 21 59 39 3 22 36 8 -58 16 0 -40 -24 -2 -9 -57 -61 55 -70 -4 -35 -5 30 -24 12 60 68 21
4600 21 28 80 2 31 -10 56 31 -8 5 22 56 7 16 -36 -34 -65 19 -28 -124 -7 -33 -43 17 -45 77 -17 -16 21 56 56 11 -28
4632 -28 50 90 44 16 66 32 21 41 15 20 -25 16 -40 31 -38 -32 -71 -46 -68 -16 -86 -49 -12 -38 -8 21 -5 19 -49 41 41 60
4664 60 29 -3 6 40 19 -36 60 -24 -19 -29 45 36 -16 -59 -41 13 -67 -86 -40 13 -26 -73 -31 13 -20 -57 33 74 -21 -18 51 66
4696 66 -17 34 38 0 -17 -6 -13 -21 -23 -11 -23 -8 -1 -20 18 -9 -74 -9 -50 2 13 -22 -27 2 -18 -23 -17 12 16 17 8 -2 -16 16 80 18
4732 18 45 -25 20 30 2 -9 47 -71 -35 -65 -27 -6 -41 36 1 -43 -29 55 -6 -24 28 34 43 20 31 90 34 39 24 34 56
4763 56 -28 6 99 49 -1 -22 -27 -27 -40 30 -2 -22 -74 22 -42 14 -49 16 -19 -47 -34 -52 -1 -41 -4 24 -8 -17 -1 33 42 34 48
4796 48 -6 -15 -52 -8 99 15 -89 2 -9 -17 -42 -4 54 -63 -25 19 18 11 -62 35 30 -2 5 54 24 -40 -9 66 106 34 50 20
4828 20 62 39 11 27 31 -44 23 27 49 -21 -73 7 20 -50 -30 12 -15 0 -36 39 -7 -33 25 17 10 -11 18 -15 11 33 -36 31
4860 31 22 36 37 -26 46 -6 -23 -57 -16 -31 47 -27 -23 -60 31 -53 -57 -54 21 26 -86 38 3 23 36 -16 33 28 55 22 25 1 26
4893 26 65 58 11 -29 -17 33 -29 -14 -7 57 -51 -30 2 -3 -73 -32 22 -7 -43 -27 14 -29 -28 -7 32 8 -9 18 15 41 -2 40
4925 40 25 -31 -15 39 49 -1 -62 -33 50 -10 -34 -10 -5 -7 -39 -22 28 -16 -28 31 23 -22 -31 -17 29 -27 6 31 18 43 10 6 23
4958 23 12 33 43 -3 -46 -14 5 -17 -79 -47 -51 -8 -64 -14 -4 -32 -32 27 5 29 -4 63 80 -57 28 10 18 -23 26 74 20
4989 20 -39 30 48 -7 -10 3 23 34 -57 -56 -2 -60 4 -26 -28 -39 -75 31 14 19 32 38 37 -2 -17 42 62 46 5 33 32 -17 -14 9
5023 9 22 4 -26 -8 35 -2 25 29 7 -83 -37 -11 1 13 23 20 -37 -54 31 33 -21 9 16 16 11 -8 9 16 87 32 16 52 12 -14
5057 -14 -56 58 -9 -25 4 -10 -60 22 6 4 -17 -16 27 -52 -24 -1 23 32 19 21 60 -24 21 -13 43 -1 -14 -3 8 16 -20 -9
5089 -9 6 -10 -15 -37 21 -70 -52 -12 0 -39 -37 16 27 -30 -39 37 31 -33 -29 17 49 -50 82 74 31 20 29 39 8 -30 -28 -17 -4 1 -40
5124 -40 -52 -20 -8 -37 -14 32 -84 -28 43 25 -20 -40 -7 -21 23 61 10 -17 33 43 18 -21 28 10 99 2 -25 24 -15 -7
5154 -7 -22 -39 -36 -27 -92 -9 -7 -27 -47 -25 -12 -38 44 -8 -54 23 -6 -2 0 -29 38 87 -23 11 6 36 49 53 31 29 14 22 -7 -6 9
5189 9 34 -15 9 -29 -11 50 -19 -15 25 1 10 36 12 87 20 64 -17 -33 -16 33 10 -31 23 -48 59 9 -17 -3 54 -12 -44
5220 -44 -96 -1 -52 -44 -20 68 -50 -50 -24 37 52 8 -16 81 57 11 -6 109 55 31 52 74 36 25 41 49 8 -57 -7 -9 -11 -36
5252 -36 24 -77 -17 -11 -90 -9 -63 -68 -53 -22 -19 -3 -22 -25 4 6 88 35 49 -4 7 -13 -24 -23 27 33 -2 -22 9 -33 -11 -19 -9 0
5286 0 -82 -31 23 -67 -122 -31 -1 -7 -10 2 37 -44 20 -2 34 2 -7 31 23 -30 46 107 -15 -7 16 -4 -55 -21 -82 8 -7 -14 25
5319 25 -12 -54 -44 4 39 4 -47 -2 43 -19 26 32 8 48 -9 -3 77 -11 22 -19 20 -35 -48 28 44 -84 -47 -24 -15 -14 -38 18
5351 18 18 -58 -78 16 -12 -21 7 17 17 51 -9 22 5 80 35 14 -3 72 -3 61 5 -29 -12 -31 -18 -60 -44 -8 -20 8 -8 -18
5383 -18 -14 -16 18 -28 -6 -86 51 1 -30 -6 19 10 8 60 56 91 -22 39 38 -24 23 -2 16 -41 -12 -20 -6 6 19 10 10 -19 -5 59
5417 59 -37 -52 -47 3 6 -13 -33 19 35 24 30 -1 -6 9 26 -9 15 -38 -69 8 38 -82 -6 -33 -41 -22 -39 2 -40 -9 -19 29
5449 29 -46 30 -47 19 31 4 19 25 0 23 29 4 24 10 49 7 26 -26 83 -20 -13 -6 9 8 -62 -14 -35 27 -56 -31 -32 -31 -19
5482 -19 -17 -18 -28 -65 58 31 8 34 19 10 50 15 74 37 -24 39 50 8 18 2 -57 19 -33 -70 -13 -58 -5 -10 -5 5 -57 -11
5514 -11 -7 16 -11 17 9 -24 14 30 21 6 33 48 21 71 15 14 -7 35 18 -4 6 35 -6 5 -35 -10 32 -5 -4 39 2 36 47
5547 47 -15 44 2 13 -42 33 6 23 -34 22 -10 11 -55 13 31 29 -14 -47 51 -28 -50 5 -9 -42 -10 -58 -14 -21 -62 19 -2
5578 -2 -19 -4 7 13 25 54 30 38 -29 43 42 26 -9 18 -54 -1 -21 -19 -21 -26 -26 -9 -17 -44 -17 6 43 -8 33 -42 28 -31 8 -11 -17
5613 -17 -20 14 40 64 -36 65 17 -3 -2 1 41 -15 49 22 37 -30 -60 17 18 -63 -50 -29 -18 -29 -44 13 11 -9 -52 50 11
5644 11 12 -45 11 110 -11 4 -58 55 -2 26 4 -4 16 -18 -22 5 15 -26 21 -28 31 -29 13 -3 -79 -9 33 5 -4 33 30 -1
5676 -1 -29 4 51 -20 -1 5 52 38 55 10 60 -52 20 19 -13 -53 -70 15 -40 -30 -41 -28 -7 49 -8 -48 25 32 28 -9 30 -15
5708 -15 -1 38 33 24 -24 50 14 -27 23 43 11 -27 3 43 8 -1 -11 -26 -63 -38 19 -28 -9 -46 20 -32 -36 -2 2 11 -28 -10 22
5741 22 33 -13 1 73 -36 26 34 32 50 -3 39 38 -18 -44 10 -17 -8 -18 -61 24 26 -15 -32 -7 -46 -20 -17 24 -28 -48 6 -33 5
5774 5 -8 32 4 18 42 30 42 8 -14 70 -24 35 -15 -49 -13 -17 -14 -30 -1 1 -37 -3 -32 10 14 0 -1 -44 16 31 -5 11 6 -25
5808 -25 -10 13 71 24 -39 13 -24 15 -1 -37 36 34 -16 25 3 -43 -44 -45 -25 -50 -46 -35 -30 27 19 -57 2 32 9 34 51 -22 25
5841 25 13 -9 29 23 25 0 15 -15 20 -3 -16 -47 -9 -22 -61 -13 -21 -30 -23 -56 -26 1 -70 15 22 -16 33 -32 1 77 22 -1 12
5874 12 30 -9 -10 9 43 -6 10 34 13 -22 -28 7 7 28 -24 -28 -1 -24 -5 -38 12 -3 -19 6 -4 -5 -21 45 22 -20 -22 21 -24
5907 -24 -15 17 32 -8 5 -26 -39 -36 -60 -51 -38 -9 -10 -8 -56 -37 -55 -32 3 -12 25 61 -25 -20 -7 15 10 19 -5 31 69 -53 23 15
5941 15 -24 -26 -42 -32 -3 -39 -24 4 -62 -41 -50 -8 -20 -31 29 -1 -70 -42 -17 15 -23 9 -22 25 29 19 47 11 6 7 61 29 8
5974 8 34 4 -42 -37 40 -25 13 -4 -38 -3 -12 -20 -53 -25 -50 2 -33 -7 23 22 23 19 10 -17 20 5 -26 -12 4 -10 -27 22 6 11 -7
6009 -7 4 -34 -39 3 21 -23 15 -22 -38 4 -7 52 -25 9 36 -9 59 -40 -21 -85 -49 3 64 -38 -2 62 4 24 31 -2 -33
6040 -33 -2 35 -30 -73 -46 89 -11 -80 36 34 -6 -38 14 61 14 22 5 -21 -20 0 41 33 -7 14 -10 71 -13 -29 36 -50 -24
6071 -24 -23 -38 -18 50 -81 40 16 -44 -24 7 -31 -28 -57 72 4 8 -33 11 29 4 -4 -18 -9 18 30 49 -4 9 77 35 73
6102 73 -19 9 -68 -21 -26 -24 -33 14 -19 -55 -15 10 7 1 -26 43 -19 29 -7 20 8 39 -4 -44 -50 23 24 5 41 40 -52 -5 7 9 -18
6137 -18 37 -4 -2 17 -49 -9 -1 -31 -42 39 -13 -31 -22 12 9 21 9 8 -9 -8 45 27 72 12 2 66 -3 -4 4 32 24 -47 8 45 -27
6172 -27 -19 -23 -53 -40 7 1 35 61 34 2 20 -15 22 43 23 21 26 52 58 -52 5 85 3 -29 1 -37 3 -33 -27 -38 -45 12 -43 -15
6206 -15 -26 -81 -54 -4 13 -11 22 10 -29 25 -11 9 16 -30 40 50 2 -16 7 31 -15 13 7 -16 -31 37 10 -42 9 -52 -23
6237 -23 -30 -13 -9 -41 -22 -26 -4 -31 -18 -93 -54 32 48 2 45 34 3 -5 40 -48 46 -20 58 49 -2 3 -34 -12 1 1 46 16 5 -42
6271 -42 16 15 -45 -12 -45 27 -29 -3 25 3 1 30 -20 9 12 -15 28 11 16 6 -4 -22 19 -39 41 31 -52 -3 17 -22 -21 11 65
6304 65 -67 30 17 -18 -1 31 -4 12 35 21 3 41 -12 -23 7 19 17 10 69 -31 -23 -21 3 -12 -18 -9 -11 20 -50 -62 -40 -34 -18
6337 -18 -4 24 -6 -36 -37 -14 13 0 35 11 -42 -20 -34 9 38 37 105 52 17 11 -1 -46 -37 -27 -5 23 -21 -36 -3 11 -47 4
6369 4 -44 -29 -34 -56 -18 -61 1 41 43 5 26 -44 1 -10 -34 34 -7 -3 12 -19 -34 -68 -22 30 -7 -10 -11 33 31 20 -1 -6 -10 -49 29
6404 29 -14 -42 -10 0 39 -33 31 -15 -24 0 26 24 5 -45 -32 8 -23 28 -52 8 -39 -50 17 -62 22 3 19 9 -24 37 24
6435 24 39 2 -9 -6 26 33 -29 9 45 36 20 -6 10 -47 -31 -43 41 12 -2 -35 8 24 -56 -23 10 -13 0 -43 6 -6 -4 -19
6467 -19 16 13 -53 16 -30 -6 -19 12 -7 31 28 21 21 57 53 84 23 13 13 -24 13 -5 -14 37 -17 1 29 2 -15 -32 -1 -1 -36 -31 -37
6502 -37 -40 11 -4 -76 39 5 12 32 48 -18 -19 3 9 35 -29 4 -23 -55 -4 27 -43 6 -19 5 -44 -15 -43 -18 -38 -45 -36 36 23
6535 23 -11 -2 35 -45 -29 50 7 -62 67 53 -45 -45 -60 15 8 25 -42 -24 -36 4 -16 -17 -8 14 -12 -4 4 -16 40 -19 10 9 17 8 7
6570 7 13 32 60 -6 47 65 46 16 -81 13 24 0 -39 1 39 -56 13 -9 -29 13 -44 -18 -14 -13 26 28 50 -23 23 32 -4 14 -6
6603 -6 38 -38 33 23 36 41 -4 12 -1 -12 13 -47 -50 13 -23 -64 -4 -1 -50 2 -18 -14 -31 32 23 -16 -15 -13 -28 14 9 42 12 -18 33
6638 33 40 60 3 17 -18 -45 47 25 9 12 -6 -5 8 40 -17 8 -8 -19 -31 -16 35 55 6 -16 40 35 -1 54 7 29 11 6 6
6671 6 -20 -6 -10 -50 -71 -27 -66 -7 -37 12 -19 20 29 23 9 15 -51 -54 30 11 30 -2 9 -1 53 -22 25 11 20 -8 -19 9 -45 22
6705 22 18 -40 -31 36 -33 15 -61 10 -9 -21 -21 10 2 -7 -54 -23 -6 -19 30 -15 16 -15 19 -28 19 20 52 14 7 7 1 4 5 40 -2 20
6741 20 -4 4 -34 -21 -7 -19 -29 27 14 -55 -21 36 -8 23 4 -32 -18 51 9 64 -32 13 -20 -13 42 3 46 5 -58 -11 -14 7
6773 7 -28 -11 24 -46 -44 -38 -2 4 -9 -22 -37 22 -4 -28 30 7 40 -12 -18 -33 -26 38 21 -22 -44 11 22 28 1 -35 6 10 5 -6 -16
6808 -16 -72 12 26 52 -19 18 38 -1 -41 16 32 9 -32 21 60 57 8 -1 -11 -38 -67 -12 5 11 -4 4 -20 -22 -2 -13 -7 -69 6
6841 6 24 -13 8 48 13 -53 -44 10 -37 16 7 -16 -23 22 72 12 46 -18 -34 23 7 -2 -42 3 24 45 -6 -65 22 -23 23 43 12
6874 12 -44 32 -7 -32 -36 -11 3 -45 1 -28 -49 -43 8 -99 20 -24 12 4 -23 3 29 17 32 2 -5 12 -39 -9 -2 26 27 2
6906 2 -2 43 56 -21 0 24 9 22 13 41 11 36 20 64 50 38 -32 16 -38 -22 18 -6 34 -11 -7 -4 -17 10 -41 6 -1 54 -35
6939 -35 -29 -10 46 7 1 -39 54 3 27 31 -29 14 35 28 -4 42 36 -6 -21 16 -9 31 7 10 1 -2 14 -25 16 11 4 -26 -36 0 2 -31
6975 -31 19 8 -21 -24 -6 -28 10 11 15 3 -25 -32 -7 -13 86 3 -31 10 -10 35 19 -28 10 10 -40 -46 -30 -62 -33 17 -21 17 57 14
7009 14 -1 78 58 -14 -37 -76 -51 8 -2 -52 25 -8 -31 -9 40 -14 -16 -9 -16 52 4 9 -34 -24 -12 12 -43 19 5 -8 -48 58
7041 58 15 59 -33 15 25 -5 49 31 -20 -12 -24 5 0 2 -5 15 -13 -10 -8 6 -18 -42 -31 61 -49 -28 4 3 26 -20 -15 -10 -48 -34
7075 -34 6 -35 25 26 52 -3 8 -37 26 -6 28 -83 26 -37 39 72 31 -24 -9 -27 -3 -31 19 -23 -3 -44 -31 -1 20 -70
7105 -70 -43 -32 -19 -36 16 15 32 -9 -8 45 16 7 10 52 21 -2 -23 -33 -49 -20 16 31 15 -24 -62 -54 10 21 28 21 -36 -50 -6 20
7139 20 6 -24 19 28 -49 -43 -13 -5 6 -27 -37 22 -31 21 -37 11 -53 -33 48 50 8 -38 -34 -14 -18 1 43 26 -18 -3 23 4 -38
7172 -38 -49 30 44 24 24 -49 34 -20 14 -3 -8 -36 66 -3 -10 -42 -24 -52 5 -21 -22 -29 25 -35 12 8 -24 -38 3 34 -10 36 15
7205 15 2 23 0 7 18 -59 52 -24 13 41 4 -22 -15 1 -64 22 -30 -73 13 -14 -53 -51 -56 -42 0 20 4 -60 -58 0 34 -28
7237 -28 53 -11 23 -27 -12 -1 49 9 -15 32 -35 1 28 -23 -36 -59 -31 -2 -18 28 -13 -6 -10 -20 35 26 38 -53 -25 3 6 -47
7269 -47 38 8 -10 10 6 -11 -20 -5 -36 -38 -16 -22 -3 1 -18 -15 -18 43 -29 -8 -19 -37 -41 -24 -6 29 -8 -28 8 5 0 4 31 -30 5 -3
7305 -3 -25 2 -18 -3 21 20 -11 -21 -75 -1 -42 -74 21 44 47 -22 -52 -13 -17 -5 3 -5 -34 9 8 38 -23 -38 5 10 25 68 45 -6
7339 -6 49 10 42 35 -24 0 31 29 41 -54 -22 -39 -49 -8 18 23 -5 3 10 7 1 -19 27 -25 -33 -22 -5 -70 38 40 28 38 65 60 43
7374 43 -51 22 -32 14 -9 -1 -9 -20 -22 13 50 -7 -42 3 29 -1 -28 2 21 -18 18 -9 -2 34 -52 39 -6 24 21 18 -14 9 -63
7407 -63 -48 -4 -23 0 -34 34 -21 24 54 -33 21 -51 52 -1 -16 -8 -17 3 67 39 29 5 -3 10 4 20 -28 2 -23 5 -10 0
7439 0 28 22 -9 34 -15 16 -10 -29 -8 -38 2 39 -29 -15 54 -2 48 32 1 -9 -46 -36 37 7 -5 0 -13 10 -45 29 -43 -9
7471 -9 6 43 26 -33 -77 10 -23 15 -22 20 24 18 -14 -26 -30 31 5 21 -7 0 -2 47 -37 5 41 6 50 7 3 3 11 58 17 -15 -21
7506 -21 -19 -15 -6 13 -35 10 33 19 -9 11 -17 -21 23 24 -32 28 -27 3 -13 -3 -5 -4 7 25 -19 -2 11 14 3 -28 -15 -14 -23 -11 -76
7541 -76 -15 -17 -10 14 -21 12 -10 31 34 -17 -7 17 3 30 28 57 51 -51 -5 17 -13 -11 1 57 0 -9 12 9 -65 -48 -39 29 -6 -20
7575 -20 -21 -25 31 -7 -63 -15 -28 -22 15 -15 -11 -30 -34 1 0 -16 -16 21 -26 -33 32 -5 -5 91 -1 -1 10 -29 16 -28 -47 -42 -41 -29 -21 -52 3
7612 3 -3 29 41 -60 -55 48 39 -5 -56 -7 -42 -19 -20 4 -24 -18 17 17 3 3 30 10 -8 -10 -27 -34 -11 -10 37 18 51 41 -23 -34 1
7647 1 37 65 26 -7 -17 -7 -31 37 35 -3 40 -29 5 15 -4 14 -19 18 -23 40 -25 -17 21 -10 -54 33 23 13 7 26 -8 16
7679 16 -5 11 9 -22 14 -10 15 -37 19 47 -23 36 -75 11 43 12 43 -8 4 -49 27 -57 7 -5 -1 -36 -1 34 -29 10 14
7710 14 45 -10 -77 -1 57 35 -22 20 -4 27 -68 -54 -25 42 2 8 -23 13 6 47 -41 -2 -25 -44 4 -10 40 -45 25 -16 35
7741 35 -2 -25 -8 -99 -25 -38 -6 24 -5 -30 -31 -37 -26 3 -26 -34 -45 83 21 -38 -58 34 43 1 0 45 -9 18 -5 -13 -18 -40 -19
7774 -19 -24 -20 11 -42 4 -59 -4 31 -38 -31 16 -26 -36 19 11 11 -1 -32 52 -28 42 -37 -3 12 -6 25 -21 38 -2 36 -25 -35 10
7807 10 -22 -34 -5 83 40 46 -10 -29 -2 46 -39 -56 11 -36 -21 -62 34 -34 33 41 -27 -12 -71 32 11 21 -31 1 19 31 39
7838 39 -35 -15 0 3 -3 45 33 -65 23 -18 21 32 25 -15 19 14 0 12 29 14 -22 22 -35 -2 -26 -12 38 18 21 -20 18 15 15 13
7872 13 -16 -44 -25 -2 3 -20 -17 -7 28 36 -22 10 -5 30 -56 18 15 -9 29 -2 -9 -10 -53 4 52 -21 42 8 33 -22 -7 28 51
7905 51 16 -50 -39 -8 16 -18 -8 -42 20 68 -36 26 14 -7 -3 4 18 -2 52 6 25 -2 -28 -5 -29 26 -25 -8 11 5 42
7936 42 -20 -11 8 24 -19 -23 21 -10 -6 -29 -35 -69 -26 16 -10 -20 -15 8 -37 11 12 15 -27 -42 -2 34 -41 -38 -18 12 19 28 8 -9 -10 10
7972 10 -32 92 -41 18 -51 -43 -10 11 32 65 -23 -59 -1 -11 11 9 15 -38 23 -1 -32 24 18 -26 -26 40 14 -6 -16 -17 -24 -5 9
8005 9 -11 -6 17 -14 -12 -40 -48 -46 37 -31 35 -16 -42 32 24 6 -8 -9 7 -5 -19 17 36 38 -10 27 -8 -29 13 -18 -36 30 1 31
8039 31 -48 5 18 -44 -44 41 0 31 -15 -38 -11 -9 23 -7 -46 -23 -8 -56 -26 28 42 -3 20 31 9 49 9 71 15 -4 -16
8070 -16 -22 -62 2 28 -61 -40 34 33 -46 3 -51 -32 -9 0 8 27 -23 15 1 21 1 10 -28 -4 10 26 4 -35 8 -5 -33 34 -3
8103 -3 2 4 126 -39 -43 29 -19 2 17 -19 12 24 23 -24 14 33 2 35 -52 20 -49 8 -7 -56 -25 -26 36 -6 -26 14 24 -31
8135 -31 29 -4 0 -26 -1 -56 -60 -39 -14 16 0 10 17 -21 8 20 -35 -14 -10 29 14 30 9 28 -22 2 9 -28 25 9 -38 10 33
8168 33 -28 37 -41 2 6 -22 28 -11 3 -8 -25 -8 62 -33 -24 17 11 12 -4 -3 3 -13 -7
8191g
##END NTUPLES=NMR FID
##END=
