##TITLE=1H_Pr 5148-4643
 CDCl3
 8 sc, 
 18.11.2022
##JCAMPDX= 6.0         $$ Bruker NMR JCAMP-DX V2.0
##DATA TYPE= NMR FID
##DATA CLASS= NTUPLES
##ORIGIN= UXNMR, Bruker Analytische Messtechnik GmbH
##OWNER= root
$$ XWIN-NMR		Version 3.5
$$ Fri Nov 18 16:46:22 2022 Russian Standard Time (UT+4h)  she@DPX200
##.OBSERVE FREQUENCY= 200.1313499994
##.OBSERVE NUCLEUS= ^1H
##.DELAY= (6, 6)
##.ACQUISITION MODE= SIMULTANEOUS
##.ACQUISITION SCHEME= undefined
##.AVERAGES= 8
##.DIGITISER RES= 18
##SPECTROMETER/DATA SYSTEM= spect
##.PULSE SEQUENCE= zg30
##.SOLVENT NAME= CDCl3
##.SHIFT REFERENCE= (INTERNAL, CDCl3, 0, 15.7039)
##AUDIT TRAIL= $$ (NUMBER, WHEN, WHO, WHERE, WHAT)
$$ ##TITLE= Audit trail, XWIN-NMR		Version 3.5
$$ ##JCAMPDX= 5.01
$$ ##ORIGIN= Bruker BioSpin GmbH
$$ ##OWNER= she
$$ F:/spectra/data/she/nmr/H-F/1/audita.txt
$$ ##AUDIT TRAIL=  $$ (NUMBER, WHEN, WHO, WHERE, WHAT)
(   1,<2022-11-18 16:45:00.73 +0400>,<she>,<DPX200>,
      <created by zg, POWCHK disabled, PULCHK disabled
       configuration hash MD5:
       00 E9 B6 7A A2 85 ED C7 34 08 36 98 17 FE 4E 26
       data hash MD5: 16K
       9F 8A 62 CE 15 31 79 AA 11 4F 1F 89 0E 3A 11 24>)
$$ ##END=
$$ 
$$ hash MD5
$$ B7 87 87 E6 E2 03 A0 7C D4 AA DB 5D A2 85 BF 4E
##$RELAX= 
##$RELAX= 
##$RELAX= 
##$RELAX= 
##$RELAX= 
##$RELAX= 
$$ Bruker specific parameters
$$ --------------------------
##$DU= <F:/spectra>
##$EXPNO= 1
##$NAME= <H-F>
##$PROCNO= 1
##$TYPE= <nmr>
##$USER= <she>
##$AMP= (0..31)
100 100 100 100 100 100 100 100 100 100 100 100 100 100 100 100 100 100 
100 100 100 100 100 100 100 100 100 100 100 100 100 100 
##$AQSEQ= 0
##$AQ_mod= 1
##$AUNM= <au_zg>
##$AUTOPOS= <>
##$BF1= 200.13
##$BF2= 200.13
##$BF3= 200.13
##$BF4= 200.13
##$BF5= 200.13
##$BF6= 200.13
##$BF7= 200.13
##$BF8= 200.13
##$BYTORDA= 1
##$CFDGTYP= 0
##$CFRGTYP= 5
##$CHEMSTR= <none>
##$CNST= (0..31)
1 1 145 1 1 1 1 1 1 1 1 1 1 1 1 1 1 1 1 1 1 1 1 1 1 1 1 1 1 1 1 1 
##$CPDPRG= <>
##$CPDPRG1= <>
##$CPDPRG2= <>
##$CPDPRG3= <>
##$CPDPRG4= <mlev>
##$CPDPRG5= <mlev>
##$CPDPRG6= <mlev>
##$CPDPRG7= <mlev>
##$CPDPRG8= <mlev>
##$CPDPRGB= <>
##$CPDPRGT= <>
##$D= (0..31)
0 1.2 0 0 0 0 0 0 0 0.06 0 0.03 0 0 0 0 0.0002 0 0 0 0 0 0 0 0 0 0 0 0 
0 0 0 
##$DATE= 1668775500
##$DBL= (0..7)
120 120 120 120 120 120 120 120 
##$DBP= (0..7)
150 150 150 150 150 150 150 150 
##$DBP07= 0
##$DBPNAM0= <>
##$DBPNAM1= <>
##$DBPNAM2= <>
##$DBPNAM3= <>
##$DBPNAM4= <>
##$DBPNAM5= <>
##$DBPNAM6= <>
##$DBPNAM7= <>
##$DBPOAL= (0..7)
0.5 0.5 0.5 0.5 0.5 0.5 0.5 0.5 
##$DBPOFFS= (0..7)
0 0 0 0 0 0 0 0 
##$DE= 6
##$DECBNUC= <off>
##$DECIM= 32
##$DECNUC= <off>
##$DECSTAT= 4
##$DIGMOD= 1
##$DIGTYP= 9
##$DL= (0..7)
0 120 120 120 120 120 120 120 
##$DP= (0..7)
150 150 150 150 150 150 150 150 
##$DP07= 0
##$DPNAME0= <>
##$DPNAME1= <>
##$DPNAME2= <>
##$DPNAME3= <>
##$DPNAME4= <>
##$DPNAME5= <>
##$DPNAME6= <>
##$DPNAME7= <>
##$DPOAL= (0..7)
0.5 0.5 0.5 0.5 0.5 0.5 0.5 0.5 
##$DPOFFS= (0..7)
0 0 0 0 0 0 0 0 
##$DQDMODE= 0
##$DR= 18
##$DS= 0
$$ [...]
##$SUBNAM2= <"">
##$SUBNAM3= <"">
##$SUBNAM4= <"">
##$SUBNAM5= <"">
##$SUBNAM6= <"">
##$SUBNAM7= <"">
##$SUBNAM8= <"">
##$SUBNAM9= <"">
##$SW= 18.0517283424941
##$SWIBOX= (0..15)
0 0 2 0 0 0 0 0 0 0 0 0 0 0 0 0 
##$SW_h= 3612.71676300578
##$TD= 16384
##$TD0= 1
##$TE= 0
##$TE2= 300
##$TE3= 300
##$TEG= 300
##$TL= (0..7)
0 120 120 120 120 120 120 120 
##$TP= (0..7)
150 150 150 150 150 150 150 150 
##$TP07= 0
##$TPNAME0= <>
##$TPNAME1= <>
##$TPNAME2= <>
##$TPNAME3= <>
##$TPNAME4= <>
##$TPNAME5= <>
##$TPNAME6= <>
##$TPNAME7= <>
##$TPOAL= (0..7)
0.5 0.5 0.5 0.5 0.5 0.5 0.5 0.5 
##$TPOFFS= (0..7)
0 0 0 0 0 0 0 0 
##$TUNHIN= 0
##$TUNHOUT= 0
##$TUNXOUT= 0
##$USERA1= <user>
##$USERA2= <user>
##$USERA3= <user>
##$USERA4= <user>
##$USERA5= <user>
##$V9= 5
##$VALIST= <valist>
##$VCLIST= <CCCCCCCCCCCCCCC>
##$VD= 0
##$VDLIST= <DDDDDDDDDDDDDDD>
##$VPLIST= <PPPPPPPPPPPPPPP>
##$VTLIST= <TTTTTTTTTTTTTTT>
##$WBST= 1024
##$WBSW= 4
##$XGAIN= (0..3)
0 0 0 0 
##$XL= 0
##$YL= 0
##$YMAX_a= 920414
##$YMIN_a= -1048171
##$ZGOPTNS= <>
##$ZL1= 120
##$ZL2= 120
##$ZL3= 120
##$ZL4= 120
##$ABSF1= 10
##$ABSF2= 0
##$ABSG= 5
##$ABSL= 3
##$ALPHA= 0
##$AQORDER= 0
##$ASSFAC= 0
##$ASSFACI= 0
##$ASSFACX= 0
##$ASSWID= 0
##$AUNMP= <proc_1d>
##$AZFE= 0.1
##$AZFW= 0.1
##$BCFW= 1
##$BC_mod= 2
##$BYTORDP= 1
##$COROFFS= 0
##$CY= 11.3945322036743
##$DATMOD= 1
##$DC= 2
##$DFILT= <>
##$DTYPP= 0
##$F1P= 2.36226072786647
##$F2P= -0.459571619588291
##$FCOR= 0.5
##$FTSIZE= 0
##$FT_mod= 4
##$GAMMA= 1
##$GB= 0.15
##$INTBC= 1
##$INTSCL= 1
##$ISEN= 128
##$LB= 0.24
##$LEV0= 0
##$LPBIN= 0
##$MAXI= 10000
##$MC2= 0
##$MEAN= 0
##$ME_mod= 0
##$MI= 1.114404
##$NCOEF= 0
##$NC_proc= 0
##$NLEV= 6
##$NOISF1= 3.799351
##$NOISF2= 2.8
##$NSP= 1
##$NTH_PI= 0
##$NZP= 0
##$OFFSET= 15.70392
##$PC= 1
##$PHC0= -18028.03
##$PHC1= 8.600699
##$PH_mod= 1
##$PKNL= yes
##$PPARMOD= 0
##$PSCAL= 0
##$PSIGN= 0
##$REVERSE= no
##$SF= 200.130013532006
##$SI= 16384
##$SIGF1= 3
##$SIGF2= 2
##$SINO= 400
##$SIOLD= 16384
##$SREGLST= <1H.CDCl3>
##$SSB= 0
##$STSI= 0
##$STSR= 0
##$SW_p= 3612.71676300578
##$SYMM= 0
##$S_DEV= 0
##$TDeff= 0
##$TDoff= 0
##$TI= <>
##$TILT= no
##$TM1= 0
##$TM2= 0
##$TOPLEV= 0
##$USERP1= <user>
##$USERP2= <user>
##$USERP3= <user>
##$USERP4= <user>
##$USERP5= <user>
##$WDW= 1
##$XDIM= 8192
##$YMAX_p= 0
##$YMIN_p= 0
$$ End of Bruker specific parameters
$$ ---------------------------------
##NTUPLES= NMR FID
##VAR_NAME=  TIME,          FID/REAL,        FID/IMAG
##SYMBOL=    X,             R,               I
##VAR_TYPE=  INDEPENDENT,   DEPENDENT,       DEPENDENT
##VAR_FORM=  AFFN,          ASDF,            ASDF
##VAR_DIM=   8192,          8192,            8192
##UNITS=     SECONDS,       ARBITRARY UNITS, ARBITRARY UNITS
##FACTOR=    0.0002768,     1,               1
##FIRST=     0,             0,               0
##LAST=      2.2672688,     0,               0
##MIN=       0,             -1048171,        0
##MAX=       2.2672688,     920414,          0
$$ Real data points
##PAGE= N=1
##DATA TABLE= (X++(R..R)), XYDATA
0@%%%%%%qJ6j6J6k4M0m8N6p2R6j20J44j76K16k64L20l76M40n20O08p11Q23r50
29e10J094j254J434j632J850k092K360k654K976l332L722m146M610n118N672o278
45c298O940p660Q450r318J0268j1309J2457j3730J5144j6719J8490k0496K2788
58A2007k5437K8536l2221L6690m2246M9369n8878P2287r2747J28142k06063O59287
70E28726k31085j055987J145881L74449p06221l44311L30284k44139j02400L74056
80F9253L122n32862K59608O21141k94772o83055L57866O09347k83809n01371K16150
91a59382K66060j28997p5928R0801o8773M9484K46658m0932k94469J03538L32426
102C20486o9909k88430J9471J00206r6148l8750Q5554o3135q1930Q5725j4164
$$ plain form
0 0 0 0 0 0 0 0 -8 8 -8 8 -16 24 -24 32 -40 56 -64 80 -96 120 -144 176 -200 240 -280 328 -383 440 -510
29 -510 584 -670 764 -868 982 -1110 1250 -1404 1572 -1760 1962 -2184 2426 -2692 2980 -3298
45 -3298 3642 -4018 4432 -4886 5382 -5927 6530 -7200 7944 -8775 9715 -10781 12007
58 12007 -13430 15106 -17115 19575 -22671 26698 -32180 40107 -52640 75502 -130561 528726
70 528726 297641 -758346 387535 761984 55763 -288548 41736 -202403 -304803 69253
80 69253 72375 -460487 -200879 420262 125490 -557565 -199699 409648 125839 -375532 -159382
91 -159382 106678 -22319 -98247 -7446 -76219 -26735 219923 178991 -115478 -11940 320486
102 320486 250577 -37853 -18382 81824 -14324 -53074 32480 -30655 -112585 -26860 -41024
113d1024j48446J20958K38764j43450k62664J37489K48577n7623j13478M4250
123B3353k7268q1386J03211R1538j69247j06271K02696J23783j74256q0749J76671
134H2075Q5059j07609n2819J8904k9891j186M9151m9025j01503L9124J01883m4657
146a0494j07256L5909J09217J263p8149l1059M0591P2439L9160m8425o6306K8531
158a4579P4133P317l7091j4061R48N120R040j3597j8895K1414J7327m3358k9894
171c6176M8955L2492n6389m2199L7419J4459n4499k0612L8216J0532j4681K1766
183b0717K4433p198J7592M7970l45m1160R73K7068k3253m2755R028K3989k1938
196f313k6838J2827J8882O397J3604L38k6042l634K8920M384k8847j5944K656
$$ plain form
113 -41024 -189470 -68512 170252 26802 -235862 -98373 150204 92581 -20897 23353
123 23353 -3915 -85301 17910 109448 -59799 -166070 36626 160409 -13847 -94596 82075
134 82075 167134 59525 6706 25610 -4281 -5467 43684 -5341 -106844 -67720 34163 -10494
146 -10494 -117750 -81841 27376 28639 -49510 -80569 -39978 32461 71621 23196 -43110 -14579
158 -14579 59554 66871 29780 15719 16667 21787 30827 17230 -1665 19749 37076 -6282 -36176
171 -36176 12779 45271 -11118 -53317 -15898 -1439 -55938 -76550 -38334 -27802 -42483 -20717
183 -20717 3716 -3482 14110 62080 61735 20575 21548 48616 25363 -17392 -8364 15625 -6313
196 -6313 -33151 -20324 -1442 4955 18559 18897 -7145 -10779 18141 22525 -6322 -22266 -19610
209a9610j716o7Q915P21q537O990K2063P809r538n86J2441N710p418j1539o952
224a314L234O960p229j5864P87J4792J163j1290K017J5069M327r145m886K298
238I19K106R99l559j4290q900J0249J0149o183n307Q446R271K199J757L684K681
253A4221p64m940n342J307L424n498j0336m59R236J473q378j976Q973M387n419
268i1l827K906K284j892k661q53n52J98J147l36j50K421K955M33o19J072K262
285D697K558n46m642j959L709J601n150l483K347J122k519k95K005L77j119k50
301a547N54J173n06j411n52J274O14j361j98K149J037j438k20K392N01k646n11
318f96K869N42l168q13K509Q41k409q79J702j0j218l00O84J92k22n25J79R66j0
$$ plain form
209 -19610 -21326 -21393 -12478 -11757 -20294 -13304 8759 16568 7030 6444 18885 24595 17177 5638 -1314
224 -1314 1920 8880 1651 -14213 -13426 1366 2529 -8761 -6744 8325 12652 3507 -1379 919
238 919 3025 4024 465 -13825 -22725 -12476 -2327 -8510 -13817 -5371 3900 6099 7856 11540 14221
253 14221 13457 8517 3175 4482 7906 2408 -7928 -8387 849 2322 -6056 -8032 941 5328 -91
268 -91 -3918 -1012 1272 -620 -3281 -4134 -4686 -4488 -3341 -3677 -3827 -1406 1549 1982 1363 2435 4697
285 4697 7255 6709 2067 108 3817 5418 268 -3215 -868 254 -2265 -2560 -555 -178 -1297 -1547
301 -1547 -993 180 -326 -1737 -2289 -1015 -401 -1762 -1960 189 1226 -212 -432 1960 2461 -185 -696
318 -696 2173 2715 -453 -1266 1243 2084 -325 -1204 498 488 -730 -1030 -346 -154 -376 -901 -722 244 234
337B34r85N75J382p86j249J441J697j278j493J252J112j709j748K17L26j444j220
354c676Q11J799J44l97J792K768N30j620m09J092J71k718k531L55J034n65j082
371b502J384K683K93q8J060K55j537j265o81j534k355r23J014J433l47M96K664
388E0L117N64j189M24J651j160k474p39J22q04j185K82R28j46k42N77J062m57
406C81j461j43N49m71j094k19J096O00J39K9J213N56q4n6P29O61m96n75M29O15
426B398p71j264K03jp83j641o02M53R9q33r5J011Q40pJ69J152N95o83J43J252
446A635j83j549M22J641j60j603n71J513L01j499j287J013O43m68l49O32O03L74
464A108n17J90l08q10q15pk12r33k31J194P76J88J85J251J229k30q48j71J62j219
$$ plain form
337 234 -751 -176 1206 420 -829 612 2309 1031 -462 790 1902 193 -1555 -1338 -1012 -2456 -3676
354 -3676 -2865 -1066 -922 -1319 473 3241 3771 2151 1742 2834 3005 287 -2244 -1889 -855 -1420 -2502
371 -2502 -1118 1565 1858 1770 2830 3085 1548 283 -398 -1932 -4287 -5210 -4196 -2763 -3110 -2614 50
388 50 3167 3731 2542 2966 4617 3457 983 244 366 -438 -1623 -1341 -413 -559 -801 -224 838 381
406 381 -1080 -1223 -674 -1145 -2239 -2458 -1362 -762 -623 -594 619 1175 1091 1035 1764 2425 1929 1354 1783 2398
426 2398 1627 363 566 565 -218 -1859 -2461 -2008 -1909 -2742 -2837 -1826 -986 -993 -824 328 923 240 383 1635
446 1635 1452 -97 325 1966 1806 203 -368 1145 1446 -53 -1340 -327 316 -152 -501 131 734 1108
464 1108 591 781 473 -337 -1152 -1159 -1371 -2304 -2535 -1341 -565 -377 -192 1059 2288 2058 1210 1039 1201 -18
484a8j462n30N08M26r7N17J694J473k30m36P60j80j944j487J1j000j333k84J060
503b552O81m7J484J921O39l38N99P03p15j136o65m25j45p25o60P1O06O17l26m42
523h55M47N66m80l00k4k00Pl9q2j67J70O12O40Q6M57K75O05N54k00j115M14M98
545A869j125j661o5Q53r16j217O72J516l35p59J404J000n37m09O39Rj012m58J32
564d00M5o07p2O13M74l46j10L97J39k4l64oM0J62m77J81O89K17k05J76P15Q6p57
587E66o5J90l87n25r1J03m9k0M2K14P5K07m90l36K54J28m01j96K86K68M3Q1L98
610B95K51k39R6J77k57m04j21K26l40m21J64N07o9J11L7L79M67l11m51L28L54
631G79n46l16J8L38l35l55J10K72k44k96N49L36n20j75N75N1m52j27J45J22j65
$$ plain form
484 -18 -1480 -2010 -1502 -1076 -1173 -656 1038 2511 2281 1845 2605 2425 481 -1006 -995 -1995 -3328 -3612 -2552
503 -2552 -1871 -1918 -434 1487 2126 1788 2387 3090 2375 1239 574 149 4 -721 -1381 -1310 -704 -87 -413 -855
523 -855 -408 158 -322 -622 -646 -846 -839 -878 -960 -1127 -957 -345 295 381 838 1113 1718 2272 2072 957 1371 1869
545 1869 744 -917 -982 -129 -1045 -2262 -1590 -74 -409 -1168 236 1236 699 290 929 938 -74 -532 -400
564 -400 -355 -962 -1034 -421 53 -293 -403 -6 133 109 -255 -261 -221 -59 -536 -355 334 551 346 522 1237 1323 566
587 566 501 691 304 -221 -312 -209 -258 -278 -236 -22 53 260 -230 -566 -312 -184 -585 -781 -495 -227 -184 -103 295
610 295 546 307 403 580 323 -81 -202 24 -316 -737 -573 -66 -135 -24 13 392 859 548 97 425 779
631 779 233 -83 -65 273 -62 -417 -307 -35 -279 -575 -26 310 -210 -385 190 241 -211 -338 -193 -71 -236
652b36k12J60M67k64k15J12N33l8n3k03K75k5l65q7J69l5k46J50J89k19J25Q0
674F2J92j15k96K26K2J87m02k14L80r3j00P7J23J43k70j77R2L66j68l06jL76p6
697B8j00J03O8J08k32k0J50j47k29K33lJ59k52j76L63m6J10NK1M7J8j71J28J47
721C12j72k52R0J83m02j10K94l2J54k26K17J38l41k2P4J32n1j50J48j58l0j95
743c99J05L06K21j48jK29J13l68J20L01k21j33K4q7j3j83j43J01K16k52J42J17
765D7k7o9p5K60j18k45l2rK39k35jR1J83p8p8M80K23k20k7J05K30k61k87k15P6
790d3Q6k01m46K00J18j85K12K85J48j61P1l8q4J17k80M0J33k23oJ60J46r6K69
813B22J51J18k46o3N2j0k09j99j05n0j8j56M3K20O0K5J17J78J1j02j02J49J98
$$ plain form
652 -236 -448 -288 179 -85 -300 -188 345 307 254 51 326 301 -64 -151 18 -17 -263 -113 76 -143 -18 62
674 62 254 139 -157 69 91 278 -124 -338 42 -51 -151 -74 49 192 -78 -255 -163 203 35 -271 -272 104 28
697 28 -72 31 99 207 -25 -45 105 -42 -271 -38 -41 118 -134 -310 53 7 117 122 143 190 208 37 165 312
721 312 140 -112 -22 161 -241 -351 -57 -89 65 -161 56 194 -147 -169 -95 37 -14 -164 -16 -174 -204 -399
743 -399 -294 12 233 85 84 313 426 58 178 479 258 125 149 62 49 -134 -277 -176 40 -212 -70 47
765 47 20 -49 -124 136 18 -227 -259 -268 -29 -264 -265 -174 9 -69 -147 333 556 336 309 414 644 383 96 -119 -43
790 -43 43 -158 -604 -404 -286 -471 -259 26 174 13 84 46 -38 79 -201 -161 -28 -251 -257 -97 49 -47 222
813 222 373 491 245 182 234 224 15 -184 -289 -339 -357 -513 -470 -250 -190 -165 -48 130 141 39 -63 86 284
836B84m40J47k0no2o0J11K5N7m8J97J50j73J9M7p6j01k14J03j53k8q7K52m1j10
861b26J02N5R3N7j67J69J65j07j47L3k5p6Mn4K60J9k26J59Rn5R9q8J08Q1l36N5
887c9J07n8lk38K70o7j82R0k2K20k34J27O9J23j83J6M0K76k68q4p9K50k52l7j4
912a72L09r8P5K2L4K5q8J4J5M2l22N6j37J39O6j23J56j12k56L63Q2M6j00pJ47
937A76m0j84k15M60Pl61jJ6O1l0M7OJ24O3j69q1J71n6j26m5J34j44J30J69M0l
963A49k27J25J2N4l23K88J9N1l9j39jL9j15J98M8N8q3p5R7j93J7n3J58o2j01L8
989f0Pq5L5N1j60K62o0p4J54r7Rj38P4k6K81r1L3o1jJ57k08J07N2j07k6j03J38
1016F3j38j9j6R9j43J88j74K80n5p3J13j24m9J03j55R2j08j79J27j2J53O3j00
$$ plain form
836 284 -156 -9 -29 -34 -96 -156 -45 -20 37 -11 186 336 163 182 229 153 52 -162 -59 -212 -240 -327 -75 -116 -226
861 -226 -124 -69 24 81 -86 83 248 141 -6 27 2 -74 -70 -124 136 155 -71 88 97 42 141 53 161 242 -94 -39
887 -39 68 10 7 -231 39 -28 -210 -120 -142 78 -156 -29 40 163 -20 -4 36 312 44 -40 -119 131 -121 -158 -172
912 -172 137 39 114 136 170 195 107 121 136 178 -144 -88 -225 -86 -20 -143 13 -99 -355 8 90 136 36 29 176
937 176 136 -48 -263 197 204 -157 -158 -142 -81 -111 -64 -58 66 129 -40 -121 50 -6 -132 -177 -43 -187 -57 112 152 149
963 149 -78 47 59 113 -210 78 97 148 109 -30 -31 8 -107 91 139 197 114 39 136 -57 -40 -93 65 3 -98 -60
989 -60 -53 -138 -103 -52 -212 50 -10 -84 70 -27 -18 -156 -82 -108 173 82 115 54 53 210 2 109 161 54 28 -75 63
1016 63 -75 -94 -110 -11 -154 34 -140 140 85 12 125 1 -48 55 -100 -8 -116 -295 -168 -180 -27 36 -64
1039f4J86P8j03o5J29j00k11J26J66k48m6K32j26r4J29k45L71p8m5J6J66j45r2
1062f3k01J05Q9j38P0J13L2j40L25j18K9o0J50O6R8j34k16qOj30J4n8J32j61m
1087b02K29J3p2K2Q1M2q8Q7j93n8J78j13l5K28m0j64J41J00J50O0k87J26L7l25
1111h3L9J2n0n7j33J89p9q9J14P4q0Q0MJ77j47J36j52J7J08o9q6k7K17o7j63J91
1137G6L6J9K9K7j12J95j11o5m2j58N1j64N7P9j28o1K66r8J40P1k1P1j0k21J13
1162C9N0j37j29K48j97K6N1m4J21R8J01j25k9K12j79p4o0N0n0m8l0o0J9K61l47
1187b33K46o2K48No6j13M2j40K22k23m4J12n0N8j25K34j56Q9K8r6K21j59r6j26
1211a84J48M4j21L3j48J04O0k2P8RK0L1J62j90m2J06j09p8K6no5R8j65L65j44
$$ plain form
1039 -64 122 200 97 32 161 61 -150 -24 142 -106 -152 80 -46 -140 -11 -256 115 37 -8 8 174 29 -63
1062 -63 -264 -159 -70 -208 -138 -25 7 -133 192 74 103 43 193 259 357 223 7 -1 5 -125 -111 -169 -37 -198 -202
1087 -202 27 40 -32 -10 71 113 25 112 -81 -139 39 -74 -109 119 79 -85 56 156 306 366 79 205 242 -83
1111 -83 -44 -32 -82 -139 -272 -83 -162 -251 -137 -63 -143 -63 -59 118 -29 107 -45 -28 80 11 -75 -102 115 48 -115 76
1137 76 112 131 160 187 75 270 159 94 52 -106 -55 -219 -162 -83 -211 -272 -6 -104 36 107 86 157 147 -74 39
1162 39 89 -48 -177 71 -126 -100 -49 -93 28 126 227 102 73 285 106 32 -28 22 -28 -76 -106 -166 -147 114 -233
1187 -233 13 -49 199 204 138 25 67 -73 149 -74 -118 -6 -56 2 -123 111 -45 44 72 -24 197 38 -58 -184
1211 -184 -36 8 -113 -80 -228 -124 -64 -86 -8 1 21 52 214 24 -18 88 -21 -99 -73 -78 -143 -45 -210 155 11
1236A1j10J45J8O6j8N8rk51m6R0j19m4K04j20R8r4M7J92o6R7M2J17l00K41j44
1261A05Mk88K85j31l2K9O1p1J20j31k5K6J93q5r4J97r4j54j24K88k68K11j28K92
1285A86k37J12l2j20K27Rj45R0j1mr5m3J79k19J57r7j31R1K5M8l1J93j75j7N9
1310A9j02l3Q3r1M5K05j47J05p5K1m5K01j06j24K00j85J24k25p3J30R9k21K13
1333A8J5j34J10L6k43K03n6M1L6l49K92M6r8k0R6MK6qm3J38j7j08P0oO5r5j35
1360a16J14k1o5l5O9j22K23j14J9L9l1j00J16N9l0Q3M7j37L6J22j23O5j1q1l3
1385b7J2J63j86P5m9j37J0K42j45J0O5J9r8n4L3k7jJ7OJ43p0J30k46J81J76k26
1411A6M0j16j5m1Q8N2k6Q2L3j97L7m2Q4J42k26K22j66K8k6%k0K9J47n4M8k47J94
$$ plain form
1236 11 -99 46 64 130 112 170 161 -90 -136 -46 -165 -209 -5 -125 -27 -121 -74 118 52 149 191 308 8 249 105
1261 105 109 -179 106 -25 -57 -28 33 -38 82 -49 -74 -48 145 60 -34 163 69 -85 -209 79 -189 22 -106 186
1285 186 -51 61 29 -91 136 145 0 90 79 75 -20 -63 116 -103 54 -43 -174 -83 -58 -10 -41 152 -23 -40 19
1310 19 -83 -116 -33 -124 -79 126 -21 84 9 30 -15 186 80 -44 156 -29 95 -130 -203 -73 26 -195 18
1333 18 33 -101 9 45 -198 5 -51 -10 26 -323 -31 15 -83 -103 -7 -3 23 15 -28 110 93 -15 55 49 114 19 -116
1360 -116 -2 -23 -88 -123 -54 -176 47 -67 -48 -9 -40 -140 -24 35 5 88 135 -2 34 156 33 98 87 6 -27
1385 -27 -15 148 -38 37 -12 -149 -139 103 -42 -32 33 52 -46 -100 -67 -94 -95 -78 -72 71 1 131 -115 66 242 16
1411 16 56 -60 -75 -116 -28 24 -2 80 113 -84 -47 -89 -5 137 -89 133 -33 -5 -31 -31 -51 -22 125 71 119 -128 66
1438F6j83J01R1j16m5N6N8Lj8J8K19k63J33o9rj56K26j47J26k5n3q4q8J7Q2J92
1464A32j68o2J25L8j89J96j95K24j38J21O2j12m5p8j2k6J29o9J81k45J09J27N0
1487A55k9j7n7j3j22J10n3L0M4J3K6J3j16Q2K0k0j43K8N4m3M4lN3j66J23M4L0
1514H7j9pj25P8r4J58J6k63J37pJ18j55M1O1k4J3r8J49j98J16L9k7p4l7J35j09
1540h9R2j07J64j91J18n7N5J63j27p1L4J16j79Q5r1k9J28K5q9J43j54J18M8q0
1564B5j00O3J57k62o8Q8L5m5J46j01J36j57j5O0m7P0m4L2J0R3r7P9P1l9p7o4n0
1591a01M8J01o9o3RK05m7k77PJ06R2j06K1K17k7j08j19k5J35m5J11J9r7p5K53
1616A65k23k7N6k1%J25j16J08j17KK7K2J49L6L0o8k06J08N3j31k15L00j14RJ04
$$ plain form
1438 66 -117 -16 75 -41 -86 -30 28 31 13 31 250 -13 120 51 42 -114 112 -35 91 66 13 -71 -159 -142 -60 132
1464 132 -36 -98 27 65 -124 72 -123 101 -37 84 146 34 -11 -89 -101 -127 2 -67 114 -131 -22 105 155
1487 155 126 109 52 39 -83 27 -26 4 48 61 87 100 -16 66 86 66 -77 -49 5 -38 6 3 56 -110 13 57 87
1514 87 68 61 -64 14 -80 78 94 -169 -32 -39 79 -76 -35 26 2 15 -83 66 -132 -16 23 -4 -78 -115 20 -89
1540 -89 3 -104 60 -131 -13 -70 -15 148 21 -50 -16 100 -79 6 -85 -114 14 39 -50 93 -61 57 105 25
1564 25 -75 -12 145 -117 -185 -97 -62 -107 39 -62 74 -83 -98 -38 -85 -15 -59 -27 -17 76 -21 58 129 90 13 -51 -101
1591 -101 -53 48 -21 -84 -75 130 83 -194 -187 -81 11 -95 -74 143 116 8 -111 -136 -1 -46 65 84 -13 -88 165
1616 165 -58 -85 -29 -50 -50 75 -41 67 -50 -48 -21 1 150 186 216 148 -58 50 103 -28 -243 57 -57 -48 56
1641E6P1k57M5R3n6m7L3J54q2J20q9j37Q6N7o2J82j92m0P6K2j06m6J48o5NJ4M1
1668B4J97j20o5K2j18J6K01k47J74m4Nj42J93q4M5j47m6J98o0Q8j08k01M0K71
1692I2m7p6K6J19k15K8m0J8M3L7r2J34N3o3j9L1P9j72J07lJ1q2J41k11P5O7k5
1719A6j30Q1J75k80J24Ml6J17j2j29Q7Q5K4m8M5k11M8L8K73k80Q6N6k14oJ28j32
1745i1K6J23j24J1K3K7J97p5JK4J7j71nR5j36m6L4J88J2l7n7q3J5k1P8j0k6J79
1773A68j10o9j05Q1Nk3K6q8l2K10O2k91R9O4J98j60O5k53qP6r9J23J15P1q5j57
1799a17%qJ0K2K41j10K30k91km5L12k07j64R6j36J93M8j22M5O2J7l6QN5k14J0
1825a03J15r7N8Nj30J18j07N1J31q4j37K45j28k6R3j22N4N6o9J62j93lJ19lJ28
$$ plain form
1641 56 127 -130 -85 8 -48 -95 -62 92 10 130 41 -96 -10 47 -15 167 -25 -65 11 33 -73 -119 29 -36 -31 -17 24
1668 24 221 101 36 58 -60 -44 157 -90 84 40 45 -97 96 12 57 -90 -136 62 2 90 -18 -219 -179 92
1692 92 45 -31 -5 114 -101 -73 -113 -95 -52 -15 -107 27 80 17 -2 29 108 -64 43 40 51 -31 110 -101 -26 41 16
1719 16 -114 -33 142 -138 -14 -10 -46 71 59 -70 17 102 126 78 123 -88 -40 -2 271 -9 77 133 -81 -87 41 -91
1745 -91 -65 58 -66 -55 -32 -5 192 117 118 142 159 -12 -17 78 -58 -104 -70 118 130 93 36 -47 -32 -53 25 15 -11 168
1773 168 58 -11 -116 -35 -30 -53 -27 -115 -147 63 125 -166 -67 -3 195 35 100 -153 -161 -85 -184 -61 54 125 40 -117
1799 -117 -117 -125 -115 -93 148 38 268 -23 -25 -70 242 35 -129 -33 -169 24 72 -50 -5 57 74 38 46 101 -113 -103
1825 -103 12 -85 -27 -22 -152 -34 -141 -90 41 -43 -180 65 -63 -89 4 -118 -64 -8 -77 85 -108 -111 8 5 133
1850A33k00J99j56qm2R2p2J04j00K83j72k09J7J25R9j58N9r8K3Q0lk4R0J7l2o5
1876a8J35j86M3K33r8R7k65J5M7n0J12j5K0J0o5j81K04k0nj4K2K5l5J96j36j95
1902a24K28k35J37j8j37K32p0L8M1r8m3J54j8j49n7L4K13P5j38j24r6L09k49R4
1926aj16j40K72J02m8J25p5l6j10K2L1j12J06pq2J2M2Q3L0j89J3J46j70R4j16
1951a24Q9K20p4M1k73R4j77K38r5P3qJ19k51J35Q6p3K48k83P0n1J74k41J28m6
1975A9l0J5l9P3m7k35M20p0k52N1J3R8j01J19n7L3PN2j56R9k2J28k36n4J03J07
2001C8k9Q5o1k18K72j39P3m7K1J16k16J71j18J17j6o7j50J52k2j29J44oJ02l1
2025D2j2Nn7Q3O8j90NJ5J03N5j85R0l1J4l9q3K7N4R8l2m9N8j24J61J9j72k4J0
$$ plain form
1850 133 -67 132 -24 -32 -74 18 -54 50 -50 233 61 -148 -131 -6 93 -65 -6 -104 -81 -1 -4 -28 62 79 47 -18
1876 -18 117 -69 -26 207 109 206 -59 -44 3 -47 65 50 70 80 15 -166 38 18 13 -1 21 46 11 207 71 -124
1902 -124 104 -131 6 -12 -149 83 13 51 92 -6 -49 105 87 -62 -119 -85 128 203 65 -59 -155 154 -95 -1
1926 -1 -117 -257 15 117 69 194 119 83 -27 -5 26 -86 20 13 -69 -57 -15 68 98 -91 -78 68 -102 -8 -124
1951 -124 -35 185 111 152 -121 -27 -204 34 -61 12 4 123 -128 7 93 20 268 -15 55 4 178 -63 65 19
1975 19 -11 4 -35 38 -9 -244 176 106 -146 -95 -82 16 -85 34 -23 10 17 69 -87 12 -10 118 -118 -172 -69 38
2001 38 9 94 33 -185 87 -52 21 -26 -5 111 -105 66 -52 65 49 -18 -168 -16 -38 -167 -23 -29 73 42
2025 42 30 35 -22 61 129 -61 -56 -41 62 117 -68 22 -9 5 -34 -117 -90 -36 62 30 -19 39 -85 76 95 -77 -101 -91
2053i1J09M4m2j01P9J06p8J0O6p6J5J0K1j3j36Q6J5n7j3l1j35K20j7K4Ln1M0j32
2081a25n0J98kM7j59l9J44j28K2J79R2k21Rp0P8o6J00p2M2Q3q2o1J19q5J17J8
2107H8k09K61q7j4J90l48M2N9p9m1K01k50K54%j31n8J10P0k4n1J1j43K19J1j03
2132b2pl0M4k6J60j38n6Q2j00m0K24p2p7J13j8r3K42K1j42n9N1l3j88J65j25M8
2158g6j04L81p7k18K6J8j6M0R4j52J12m7L5j88j1J43j0q3J69J01j48j0q2J75j50
2183g8J33j16MLJ54j83N0N1J3j8j53K05j03J6j12J64J07M1j57j0k3J29k3Lo1L0
2209F6q5n1J67j66J83m5p6J39l08K83k73J41R6j08R9j77J07P5j64lQ5J77j66J03
2233I9N3j64n0jK24n8j89L1M3k2L9l9J5J8J17j04L9On6m6J37j11j9p3J13j74K77
$$ plain form
2053 -91 18 62 20 -81 -2 104 26 36 102 26 41 51 72 59 -77 9 24 -33 -46 -77 -212 8 -9 15 18 -33 7 -125
2081 -125 -175 23 21 68 -91 -130 14 -114 -92 87 179 -42 -33 -103 -25 -91 9 -63 -21 62 -20 -81 38 -47 70 88
2107 88 -121 140 53 39 229 -119 -77 -18 -97 -138 63 -187 67 67 -64 -122 -12 58 34 -17 -6 -149 70 81 -22
2132 -22 -29 -59 -15 -41 119 -19 -75 7 -93 -133 91 19 -58 55 37 -56 186 207 65 6 57 24 -164 1 -124 -76
2158 -76 -180 201 124 -94 -68 -50 -66 -26 68 -84 28 -19 16 -172 -183 -40 -50 -133 36 137 -11 -21 -103 72 -78
2183 -78 55 -61 -57 -54 100 -83 -33 18 31 13 -140 65 -38 -22 -134 30 137 178 21 11 -12 117 94 97 36 66
2209 66 -19 -70 97 -69 114 69 -7 132 -176 107 -166 -25 71 -37 62 -115 -8 67 -97 -100 -15 162 -4 99
2233 99 152 -12 -62 -63 161 103 -86 -55 -12 -34 5 -34 -19 -1 116 12 51 57 1 -45 92 -19 -38 -111 2 -172 105
2260A05k17J57J07k11j13K72p9m2M1n2M1k5KnM9o7o3j16J69p5J67j58J57J06j16
2285C4j79J41l8J04r1j13J35j69J56K3nj02K83l10J82Lo5kn4J96j81O7q9Q9o3
2310d8N6Q2L0j00J8J6p5j26J81k0M9j44j20K30N5j66R3j08J16n8K4M3p9l2R1n2
2336d4J49j40K3L1o2P4o7r8J4R2l7J69o9j01J79j45l1rj5R5J42k36q8J80k5n7
2362g6R4n8J40N6j36Ql9q2J68km6n4j10K39j40R7k4M6j39L9N9j52J76k01K82l9
2388A06p0mPj2%L4j29LJ3K04j40j1oNqJ82q2q2%M5l5J2k9N9k53K26Ko4j3O6J5
2419D1K26j70j40N8o5J62p8r5P3l1K88k52j52J40K7J2jr0K0Q0N0j78n3J00J60
2444A32j00l6n5J73k68J71l3Kj1J63j28Jp1R5j74O3K0M9jJ75j61r1q2K33J5j79
$$ plain form
2260 105 -112 45 152 -59 -172 100 21 -21 20 -32 9 -16 -14 -19 30 -37 -100 -216 -47 -122 45 -113 44 150 34
2285 34 -145 -4 -42 62 -29 -142 -7 -176 -20 3 -2 -104 179 -131 51 54 -11 -13 -67 129 -52 15 -74 15 -48
2310 -48 8 90 120 20 38 54 -21 -147 34 14 63 -81 -201 29 84 -82 11 -97 19 -39 -15 28 -51 -83 8 -44
2336 -44 105 -35 -12 19 -43 31 -36 -134 -120 -28 -65 104 35 -66 113 -32 -63 -72 -87 8 150 -86 -174 6 -19 -76
2362 -76 18 -40 100 156 20 28 -11 -93 75 73 27 -27 -137 102 -38 59 35 81 -58 -19 40 -112 64 -137 145 106
2388 106 36 32 39 27 27 61 -68 -65 -52 152 12 1 -5 0 -8 174 92 10 10 55 20 32 3 62 -191 35 37 -27 -40 26 41
2419 41 267 97 -43 15 -50 112 34 -61 12 -19 269 17 -135 5 32 44 43 -47 -27 53 103 -75 -128 -28 132
2444 132 32 -4 -59 114 -154 17 -16 -14 -25 138 10 11 -60 35 -139 -76 -56 -7 -8 167 6 -85 -167 66 81 -98
2470i8K30q4n1j52j12K27O7j14J80j19kJ04L0j87j1J24k8J3J62k98J07J97p6J06
2494B15k60J5j6K0R7r2Q8l6j51K87j91O2l7o0J94k02M7P4j53J30o5J21N6n4p0
2519A9l1R9r5n5J86j74J52o0q3K07j19r0K5L5q3J68o8j5K5j54J52P2k2k05J35
2544B1O3p8k7M0n8l4L5J62j20Q6j95L2M5n4pJ7K01j94P9j00L00l66K16j76K44
2569A32j18k7R7k35J76rR6r0K4r2R4j3j08K55m7l9k2l7Q9k08J06q7l4O4K33K9
2595B29l12N9p5J03k5q0Q9oM9pj70l3K41n4j83P5O7j22P3J88m2Mj02l2M9Q9j31
2622e9K12j50MnQ0K7j07Rk4J76k47N3o9J43k36K16J55j54j17J96o1n4J63n1pj04
2648a1r3J0J45r8J9R6j6j2j37R5Q2J5k35K81j87o0P0J9j0J30j38j57P0J67l9L7
$$ plain form
2470 -98 132 48 -3 -155 -267 -40 27 -87 93 -26 -28 76 106 -81 -92 32 4 17 179 -119 -12 185 109 215
2494 215 -45 -30 -46 -26 71 -21 67 31 -120 167 -24 38 1 -59 135 -67 -20 54 -99 31 -34 87 143 89 19
2519 19 -12 87 -8 -63 123 -51 101 41 -42 165 46 -44 -19 16 -67 101 33 18 43 -111 41 113 91 -114 21
2544 21 84 6 -21 19 -39 -73 -38 124 4 90 -105 -73 -28 -82 -89 -72 129 -65 14 -86 214 -152 64 -112 132
2569 132 14 -13 84 -151 25 16 112 22 46 -46 48 35 -73 182 135 96 74 37 126 -82 24 -63 -97 -33 200 229
2595 229 -83 -24 -99 4 -21 -101 -12 -18 31 24 -146 -179 62 8 -175 -100 -33 -155 -82 106 64 68 -34 -66 -17 72 -59
2622 -59 153 3 7 2 82 109 2 11 -13 163 -84 -31 -100 43 -193 23 178 24 -93 103 42 -12 151 100 93 -11
2648 -11 -104 -94 51 -47 -28 68 52 40 -97 -2 80 95 -140 141 -46 -106 -36 -17 -27 103 -35 -192 -122 45 6 43
2674D3%R3n0l4K4o5k9R1j22J3J28Q4k21j7J85q1L7j56j42J84k6O9l9j2r7J46j20
2701a14J04J05p6O6l20J85m9l1J77m2m1J53j16M3J4l6j97M8J94j35k5J75j9k53
2725a90J09M4k46K28p1M5J31P9k51R7Q2q8n9J98k7rm6j67J65nJ17j99L9qJ6N2
2751C6n0j14K38q0n1o9K8J38m5k2q2J69j46j2K5J58o8lMm9J3M4q0k3L7k3k6n9
2779a12J58j08J27k13q2J74l3J56p7N1j61lJ07Q0j55j03L05j19K7j3k7P1M5j11
2803a6j33N9Q2lP5k61J86J28j04j1q3J15J05j03n3j71K79p5R7l19J46O8OL6j64
2828a14J22J8J39k03J31j00J04l08J67p6J05Q1j85K60n9o1M2r1j05J41Lj82K52
2851H1K3q9j02J63J30m08J92k35K56n1K22k15N5r4m6L1N4J76j39K7o6R0j62J81
$$ plain form
2674 43 43 136 86 52 76 11 -18 73 -49 -36 92 176 -45 -62 123 42 79 -77 -219 -35 -61 8 -31 -43 -140 6 -114
2701 -114 -10 95 19 85 -235 -50 -99 -130 47 5 -36 117 1 44 58 22 -175 -127 67 -68 -93 82 63 -190
2725 -190 -81 -37 -283 -55 -126 -81 50 129 -122 -25 57 -31 -90 108 81 72 26 -141 24 19 136 -63 -24 -32 -16 36
2751 36 -14 -128 110 30 -21 -90 -62 76 31 9 -73 96 -50 -62 -37 121 53 50 54 5 18 62 -18 -41 -4 -27 -53 -112
2779 -112 46 -62 65 -148 -230 -56 -89 67 -10 41 -120 -123 -16 64 -91 -194 111 -8 19 6 -21 50 95 -16
2803 -16 -149 -90 -8 -11 64 -197 -11 117 13 2 -81 34 139 36 -17 -188 91 16 113 -206 -60 8 14 50 -114
2828 -114 8 26 165 -38 93 -7 97 -211 -44 -120 -15 66 -119 141 82 21 63 -28 -133 8 11 -171 81
2851 81 104 15 -87 76 206 -202 -10 -245 11 -40 182 -33 22 -72 -118 -87 -33 143 4 31 -35 55 -107 74
2875G4j40R1m3R6j57K2rK7m0J95Mn3j31J4kP3J7J6n8L0R0o8O5j09rN4J8o7j48
2904a48K10P5k79J66k8pJ03m7l6k6J91j20J11q4j44M6J56o8rJ7o3m7J55l3m7j38
2930i4J9K02k27J23m6P2j00J46Jj09K4j13J62j55pK7NJ18j48K4N9N4K5j55n8R
2956a42J86k1K9o5N4q2N4J50j30J32j63J3j25J16k7k3J22Rmj26l4O1J18j04J36
2981A34l04J03k9J32j66J58J9k77J84q3L2K76k5j97J69q3j72J47J76k12Q5k24
3003a57J38%O7j28J91k08R4j01n1J89o2l9Q1M4J15r2Rk15L5J9K11l2o0Ql7o3J79
3030A35j80O1J72q4k18J80O1j61n2J67j56K8J06j04L4n3J4J41p1j22J83j58K03
3053A26j25L8m5Lpj0Oo1JL8o5J11MN6j7o0j89P3K22r8K23k42L1L5j04J68k0j35
$$ plain form
2875 74 -66 25 -18 78 -79 -57 -66 -39 -79 116 120 67 -64 -50 -52 21 38 54 -4 26 116 48 113 4 -5 49 67 0 -148
2904 -148 62 137 -142 24 -4 -11 92 45 9 -17 174 54 165 81 -63 -17 139 71 62 79 16 -31 124 91 44 -94
2930 -94 -75 127 -100 23 -23 49 -51 95 96 -13 11 -102 60 -95 -102 -75 -70 48 -100 -76 -17 37 62 -93 -151 -142
2956 -142 44 23 52 -13 41 -41 13 163 33 165 2 15 -110 6 -21 -44 78 87 83 -43 -77 -16 102 -2 134
2981 134 -170 -67 -96 36 -130 28 47 -230 -46 -129 -97 179 154 -43 126 43 -129 18 194 -18 67 -157
3003 -157 -19 -19 48 -80 111 -97 -3 -104 -155 34 -28 -67 14 58 173 81 90 -125 -90 -71 140 108 48 56 19 -44 135
3030 135 -45 16 188 104 -114 66 127 -34 -86 81 -75 -47 59 -45 -11 -64 -50 91 20 -102 81 -77 126
3053 126 1 39 -6 -3 -10 -20 -14 -75 -74 -36 -101 10 14 70 53 -7 -196 -123 99 1 224 -18 13 48 -56 112 92 -43
3081d3J8R6p4J11q3k9O6n8P0k59K90j03J25Q2k81k8R8P3K5j18l3K6p7J49l6Q4
3107I1p5m1j25N5K3J84q5o7Rj5J43l8r1J9j85J42l7O1P7L3j28R8Nj20l7J07J2
3134A5rJ77j48o7J07j33M8O6o8r7J30L1n6J04j54N2p2p4J86o2k8LJ38j04P6pj06
3161e2J44k63L23j21J13j47q9O5R4L3J35k27J93J9k77o3Q9K0j49J40J67o1o0L9
3185F5n5j96J85N8Oq5Q6j50Q7Nn3M7J39l30K39j40P8lL6k8m1R0p2j20J42O7j19
3212f2J98r3m7J10j1k64J74j40K04r3l7O7P0M7o4p5l7J14j10Pn7K66j70n5J0J45
3238I7k31J03j81J58O3Q2j17J14j60n3NK6R6M0j30K17k50K36k1n4p8k0J9N1r9
3263h7O5J00j94J69j18O4j36J71r8J35M8k30L9J02l4J09j47Q7J4P6j70p6N2J80
$$ plain form
3081 -43 -25 71 -3 108 25 -4 62 4 74 -185 105 2 127 209 -72 -100 -2 71 96 -22 -55 -29 -106 43 7 91
3107 91 16 -25 -150 -95 -72 112 27 -40 -31 -46 97 59 -32 -13 -198 -56 -93 -32 45 78 -50 48 53 -67 -104 3 15
3134 15 6 183 35 -32 75 -58 -10 56 -12 -109 21 52 -4 100 -54 -2 -74 -148 38 -24 -52 -49 89 -15 61 54 -52
3161 -52 92 -171 152 31 144 -3 -92 -27 67 100 235 8 201 220 -57 -120 -31 -11 -160 -20 147 86 26 65
3185 65 10 -186 -1 57 63 -22 64 -86 1 6 -47 0 139 -191 48 -92 -14 -17 19 -9 -50 40 -32 -152 -10 57 -62
3212 -62 136 43 -4 106 95 -169 5 -135 69 -24 -61 6 76 123 59 -16 -53 61 -49 -42 -99 167 -3 -58 -48 97
3238 97 -134 -31 -212 -54 9 91 -26 88 -72 -125 -120 -94 2 42 -88 129 -121 115 94 40 -38 -58 -39 12 -87
3263 -87 -22 78 -116 53 -65 -1 -137 34 -64 71 119 -111 -72 30 -4 105 -42 45 59 135 -35 -111 -59 121
3287A21k89L27k07j82P3L18j75J0jM0j6j45J65M3j2nj23Q2O6p3M9j8l07L80o0
3312F1m0p1o3K04J1j49o0K19K1Q3l06N4j32K56M6j48k53L33k03J04o8Q5J25j08
3336Ao1N2n7J30L2k8k5j35k3K06k14N7O0K5r7J58LLr4Q5J28l53O2J08l1J23k9
3363H6k0r8j3J40mj9o1N7j34OM3J65p9q0jK8n0R1j14Q1R5m7o4L5J5N2j56j45J68
3392b3n6P1K8m9J0O5o7Q8o4Mq4O2k2j1q7J30K1n7J3J0k7K9K9J9q9j62J00J12j37
3421a44J19J1Q2mo5j8j44J21j41K66j2p0J3Rk3J78k50J44j23K11j60J03j50r9
3445a46K37n7o5J97j32n8m2r0K86k86K04n8q2J9K35j73K19k65j9J72j45M0J29
3468A20n0j35N4q5rR6j11J63q2RJ4k24K71r7L4OK7R3n9M8l6k07J24J6l9P6l7N9
$$ plain form
3287 121 -168 159 -48 -230 -157 161 -14 -4 -5 35 19 -126 39 82 70 65 -58 24 90 17 66 48 -259 121 61
3312 61 21 -50 -113 91 102 -47 -107 112 133 216 -90 -36 -168 88 134 -14 -267 66 -137 -33 -101 -16 109 1
3336 1 -60 -8 -65 65 97 69 44 -91 -114 92 -122 -65 -5 20 -77 81 84 87 -7 78 206 -147 -85 23 -8 115 86
3363 86 66 -32 -45 95 91 72 11 68 -66 -60 -17 148 69 -11 -12 16 -34 57 -57 24 119 72 8 43 58 110 -46 -191 -23
3392 -23 -79 -8 20 -29 -19 46 -21 67 3 7 -77 -15 -37 -48 -135 -5 16 -41 -28 -18 -45 -16 13 32 -57 -219 -119 -7 -144
3421 -144 -25 -14 68 64 -1 -19 -163 -42 -183 83 71 1 14 23 0 178 -72 72 -51 160 0 103 -47 -146
3445 -146 91 34 -31 166 34 -24 -66 -156 130 -156 48 -10 -92 -73 162 -11 208 -57 -76 96 -49 -9 120
3468 120 70 -65 -11 -96 -105 -9 -120 43 -39 -30 -16 -240 31 -66 -32 -26 1 94 35 83 47 -160 -36 -20 -59 17 -20 39
3496C9J7o8P6k5l7N8N0j32J7Rj19O1K12m2j53JJ20Q0k76K3l5J46m4J48j41J2n4
3523e7q2K21J33k48M5o6J78rm3jj37M6Qj3L3K2j06L9J76k07K6J86j63M1Q9j17
3549fj23R5J16j17L3j06K79k35M5J39r7j12OJ2mJ0q0Q8L3kn2O4K4p7J2P8q3R5
3577C5P5j92k4Q5J85N1j64k3j61P4K7R7m8o8J14p0J2j25K7M9K3l5k18J00J38N7
3603B1J6j00N3j16J73j47L4J20j62J34p1m0k3R9J07M7l24j9K30J9J8j02l5k5J6
3628g7J21NN6k44K99j04J33j76n0K35j67j08J45j45K28N5l92L95o9k01O0j18P3
3651d6m7N6j49K80Nj34J19j48K31k49J58q4k48L89Rj79m8K33n9M7k28l8lK41r5
3676A3L5p7jJ7Q2m2k3q3J91Q7k95J44r9L5Q0m0p7Mk1J36j50J0J45m0Q2j0l16R5
$$ plain form
3496 39 56 -12 64 39 2 60 110 -22 -5 4 -115 -54 158 116 -37 -36 84 164 -112 -89 -124 22 -22 126 -15 -3 -57
3523 -57 -139 82 215 -33 12 -54 124 115 72 71 -66 -20 -12 -25 8 30 -76 -37 139 -68 -42 144 -19 22 111 -6
3549 -6 -129 -34 82 -35 -2 -108 171 -64 -19 120 23 -89 -83 -71 -75 -65 -145 -57 -24 -26 -78 -14 10 -67 -55 23 -60 35
3577 35 110 -82 -106 -21 164 215 51 28 -133 -59 -32 65 17 -51 63 -7 5 -120 -93 -44 -21 -56 -274 -174 -36 21
3603 21 37 -63 -10 -126 47 -100 -66 54 -108 26 -45 -85 -108 -9 98 145 -179 -198 32 51 69 -33 -68 -93 -77
3628 -77 44 49 105 -139 160 56 189 13 -37 198 31 -77 68 -77 151 206 -186 209 140 -61 -1 -119 -46
3651 -46 -93 -37 -186 94 99 -35 84 -64 167 -82 76 -8 -256 133 142 -37 -85 148 89 136 -92 -130 -133 108 13
3676 13 48 -29 -30 -13 69 27 4 -79 112 199 -96 48 -51 -16 64 24 -53 -49 -70 66 -84 -74 71 31 113 103 -213 -118
3704a18N2L1P9j55K01j09L8L4r0P0j46RL5O6K5K5p5r7J06K7J2L9k9R0l04K25J6
3731E7K31m59L17j32J0j4n4K6Q7n0Rj25Q8j38J34%N7Q1q9r3p8K07j08o3mJ97k8
3758F6O3j0n0J9j31J02J16j76P7o7L8j6M2j42L7l8J33j36K57R3j42j51N8q0J06
3783F8j1r1j5m8J35o8o2K4Q4N8j01m8m4K55j39L5LL5k5j61Q4N5n1P1K3p0J24p5
3811D5r4K1K00k45J06R1jj93N5o1K01j78K5lJ28j16J21j14J24j53J1J70P2k89
3835g7k0J14q7j5LP8Pj1M0j19J00P5o2p2N6J63l0q0lj45J68qj10K30k32M0j07
3862a04J11k0n2L0M5O8o9k23J81K5k6m0Q7J3o5q2J37O0r8L02l26PK65k56J46j38
3888b2R5P6j81kj4J41j56J8kj3J30jl2j37nK01K1k26J87k7j48Q6j1l4J27L0k8
$$ plain form
3704 -118 -66 -35 44 -111 90 -19 19 53 -37 33 -113 -104 -69 -3 22 47 -28 -125 -19 8 20 59 30 120 -184 41 57
3731 57 288 -171 146 14 24 10 -44 -18 69 19 28 -97 -9 -147 -13 -13 44 125 36 -57 -135 72 -36 -99 -103 94 66
3758 66 129 119 69 88 -43 59 175 -1 76 9 47 31 73 -69 -32 -70 63 -73 184 277 135 -16 42 -38 68
3783 68 57 -34 -49 -97 38 -30 -92 -68 16 74 -27 -75 -119 136 -3 32 35 70 45 -116 -32 23 -28 43 66 -4 120 45
3811 45 -49 -28 172 -73 33 124 123 -70 -15 -76 125 -53 -28 -31 97 -19 102 -12 112 -41 -30 140 212 -77
3835 -77 -97 17 -70 -85 -82 -4 3 -8 32 -87 13 88 26 -46 10 173 143 63 60 -85 83 75 -35 195 -37 3 -104
3862 -104 7 -13 -65 -35 10 78 9 -214 -33 -8 -34 -74 13 26 -39 -121 16 76 -22 280 -46 -39 226 -30 116 -22
3888 -22 73 149 -32 -34 -48 93 -63 -45 -47 -60 70 69 37 -100 -105 96 117 -109 78 51 -97 -11 -22 -56 71 101 73
3915G3Op2L8j26j7J73j32Q7k4n7J34o1J30j73J46o4m0%NQ6j30N4q6L4J3N9j13
3942e7J97j11Pk6k01M62l47J71J33k32O4j67J67p3R1j12L3q5R0K6j11J50k04P9
3966e6K7J57j23o4N2J03j5j70K37j72J04l0j09j16L76l16K08j74M0o3K08K3j67
3989d0l8J36j31o2J72N6j54j26J55j14M3j17K79l1j57J31N3n9Q8j24J03M1j2Q6
4013A78k27lM1Q8j99J16n9M0J80k03K9J67j8k49kJ25P0r8M3j31J61j08P7k0K6
4038B4K6L3o8P8j25P6j54J41N8j29J12o0J21k62L3K74k71l6J67k2r9K35k58J17
4062A1M4N6j06l5j12K18p2N2N2p4o4K24j62oK7M2k08K06q6k1j42R2J10l3J35j33
4088A5QlO7q5R6m7qj01N7MR0k15r7L20j90J44q8J49p8j04qL0m1k0QJ01l0J29o8
$$ plain form
3915 73 79 7 45 -81 -98 75 -57 30 6 -51 83 22 152 -21 125 61 21 21 26 112 -18 36 -50 -16 -3 56 -57
3942 -57 140 29 36 10 -191 271 -76 95 228 -4 60 -107 60 -13 78 -34 -1 -86 4 30 -81 69 -135 -56
3966 -56 -29 128 5 -59 -7 96 81 -89 148 -24 80 50 -59 -175 201 -115 93 -81 -41 -104 104 127 -40
3989 -40 -78 58 -73 -135 37 93 -61 -187 -32 -146 -103 -220 59 28 -129 2 55 -4 84 -40 63 104 92 178
4013 178 -49 -52 -11 77 -122 -6 -65 -25 155 -48 -19 148 130 -119 -121 4 74 -24 19 -112 49 -59 18 -2 24
4038 24 50 83 15 93 -32 44 -110 31 89 -40 72 12 133 -129 -96 178 -93 -129 38 16 -83 152 -106 11
4062 11 55 111 5 -30 -142 76 4 56 108 34 -30 194 32 26 53 95 -113 93 7 -14 -156 -64 46 13 148 15
4088 15 23 20 87 2 98 51 43 -58 -1 3 93 -122 -219 101 -89 55 -33 116 38 -66 -74 -44 -85 -105 -97 4 -26 103 35
4117C5l4O8j82J3O9J54o2p4J0N1M9j99J01J00q3l0J36p0r8R1k03L05k39K65lm1
4143A29k52J19q4J58k3o5J66k39J18P5j16l4j34J76J05m3p8O0P9n0j34N6q4M2
4167e3r3MJ95n1J43m9j54P7o6p0k6K04p0R9o3j33n0K17j90R7j9k02K00pP7J05
4193A22k41J3R2J2j68J92m0k1J47j84J40q0O1L0j33L09j55q3J04k11J84q6P2L4
4217A10k20J96j33J37j22JjpO2M5k02K53k25J79K7j34J60k57J42j08J06j23K13
4240I9j26M0m2J37m0o4M9q8J98k05J40r6r7J20m8Q5k5j47J46oj25L7n4K36r2m5
4266a3o0J26r3J68j43j11J95l1j45O3M3P5k2O1j44J89j28J73j80o0Q0QJ0l4N9
4291H6j26k0M0Q6k4J9L1k01Q4k2j7N4L4j79J74pp1Q6p1q9R2O2p5J04J6m7m6P2
$$ plain form
4117 35 1 69 -113 -100 -31 123 61 -13 -3 48 97 -102 -1 99 16 -14 122 52 -46 45 -158 147 -92 173 170 129
4143 129 -123 -4 -88 70 47 -18 148 -91 27 102 -14 -48 -182 -6 99 56 -22 38 117 67 -67 -11 -95 -53
4167 -53 -146 -142 53 2 145 96 -58 19 -47 -117 -143 61 -9 90 27 -106 -156 61 -129 -32 -51 -253 -53 -60 17 122
4193 122 -119 -106 -14 -2 -170 22 -18 -39 108 -76 64 -16 45 75 -58 251 96 13 117 -94 90 4 76 110
4217 110 -110 86 -47 90 -32 -31 -32 -39 23 68 -134 119 -106 73 100 -34 126 -131 11 -97 9 -114 99
4240 99 -27 13 -29 108 68 4 53 -35 163 -42 98 2 -95 25 -23 62 37 -110 36 30 -95 -58 -112 124 32 -13
4266 -13 -73 53 -40 128 -15 -126 69 38 -107 -44 -1 74 52 113 -31 158 30 203 23 -37 43 51 61 27 86
4291 86 -40 -60 -20 66 42 61 92 -109 -25 -47 -64 -10 24 -155 19 12 -59 27 -44 -133 -41 21 -54 50 66 19 -27 45
4319D5j97J09J13M1m5j57Q8j2K4K9K4K0l0l5m5j16J54k6L2q6J01M8m0L9j8k7K8
4346F1n9q1J27l5J58k81M0J19R7j23nN3No7j2j45J23O5k5j60J96l2K2k7M8q0J19
4373A01l0j06J72j44j56P3J40l9n4o8N3J0N7j3R0jj98J74mn4J39k36J07o6J21
4398F8k08M7J80P4j59J23l24K15P1P2l3j04j32l6O2J38j14j11K5K33m7M3j15R3
4422F1j6j85K06M6k48K42j07n1J00j24J1N5J4jQ7n7K3o7r8P5J39j14o8R8j13J54
4448F2m6R2k8m6n5O1N2K5j38q5L19j79r7P3q8J04J29j25K9j20pm1K24p1o1N8Q4
4475A25P6k65R3J01n4q8nM1q8J08m2J2N7M2k01O8L6J39l4k06J69k2L0n9j27R5
4501AR9J5j09r1K0J74m1k17K56l5q7J92p2j19L5o1Q0j03OM0j8M0J7l8O0O7j82
$$ plain form
4319 45 -152 -43 70 111 66 -91 -3 -15 9 38 62 82 52 17 -28 -144 10 -16 16 -70 31 79 39 78 60 33 61
4346 61 2 -79 48 13 171 -110 -70 49 146 23 18 71 76 9 -3 -148 -25 40 15 -145 51 19 41 14 62 -18 101
4373 101 71 -35 137 -7 -163 -90 50 11 -43 -111 -58 -48 9 -4 86 85 -113 61 57 3 142 -94 13 -53 68
4398 68 -140 -93 87 161 2 125 -199 16 87 159 126 22 -110 -146 -84 54 -60 -171 -146 87 40 83 -32 61
4422 61 45 -140 66 112 -136 106 -1 -52 48 -76 -65 -10 4 3 90 33 56 -11 -109 -34 105 -9 -77 21 -92 62
4448 62 16 108 80 34 -21 40 92 117 -21 -106 213 34 -63 10 -78 26 155 30 59 -61 -68 -109 115 44 -17 41 125
4475 125 201 -64 29 130 76 -12 -17 24 -64 44 2 14 71 113 -88 -20 16 155 121 -85 84 62 92 33 -94 1
4501 1 100 115 6 -85 -65 109 68 -149 107 72 -15 177 105 -14 21 -40 40 -63 -57 -17 -35 5 22 -16 44 111 -71
4528g1L1J9P3j24m9K03j46J29q8Q4Q3j39J57m6j00r1l0J50j3j7o2m8J74j05p5
4553a01L05l04R3O3j65R6J1k6K6o5J47j97m5J91j88M0J27j8R0l0j32pO6J40k57
4578a40K00mN4j08k8l0K9n2J18L6j12P0j93J83p4m9J59n9l8J03r3m3J84j8q5n0
4604d0J85k54O0K34l17K00mK4q9K7J6l1rL8j55J68k43K65j6j20Q3n2J55m3j12
4629c0r2M5p4l3L05Mj27L6j45R6J73k24p1P5J26o1K2j4K2j01j44L01n5n5P2q1
4655c0p4J79j63K82l10K37n0k57L70m1j49N6r4o1K06q5J08Nk11J46j30j21L9K28
4679H0Qo6p2R3n9%j27J56o5j03J35P1j24JK11j44oK8Q0j00j06Oj32J23J57J4M0
4706I9j24j68Q5R7NlL0pO2j83J82p3m2J04j95O9K8J61j44L6m3o2n6J50m0l8Q2
$$ plain form
4528 -71 -40 -21 52 -72 -121 82 -64 65 -23 61 144 5 162 116 16 -75 -105 45 32 15 -47 -95 79 -26 -101
4553 -101 204 -100 -7 56 -109 -13 -2 -28 -2 -67 80 -117 -162 29 -159 -119 8 -10 80 50 -82 -89 -23 117 -140
4578 -140 60 56 110 2 -26 -56 -27 -79 39 75 -37 33 -160 23 -51 -100 59 0 -38 65 -28 -71 113 95 10 -40
4604 -40 145 -109 -49 185 -132 68 64 88 -1 26 42 11 2 40 -115 53 -190 75 59 -61 22 -30 125 82 -30
4629 -30 -122 -77 -151 -184 121 125 -2 34 -111 -15 158 -66 -137 -62 64 3 25 11 33 -68 -212 89 34 -21 51 -30
4655 -30 -104 75 -88 194 -116 121 71 -186 184 143 -6 50 -44 -105 101 16 124 129 -82 64 -66 -187 -148 80
4679 80 88 22 -50 43 -16 -16 -143 13 -52 -155 -20 51 -73 -72 139 -5 -11 17 97 -3 -109 -103 -235 -112 45 59 99
4706 99 -25 -193 -108 -11 -6 -9 21 14 76 -107 75 2 -40 64 -131 -62 -34 127 -17 19 -24 -86 -142 8 -32 -70 12
4733A2j8M0p1K1m0J33m8n2O6j1j3J43k52l5J25J05j20p6J20l2n7o5K61J4j89o6
4759a05J76r5J34j29J01j76P3L9m8J99m9mj46k0n8O1L7J75j52o6j17K33K3j71
4783h5J94p3j07n5Q6J01J20k18J5L2n4J44j49N4m6L4R5o0J00j84J16o9j36K7K24
4808A06o3j05R6j15J18J1j88J31N8j89K44J06l48J72%j54Q9LL1j01j8K56j44j51
4832a55M09l30J39j21Q6O9l1j40J7j7K23j02m9J3M2l7J7j8j29L10r3j16j27J87
4856D7j7j31J7O8j12K90j80J87k36K1J55n9Ql8L2r6N8q2J47l7o2j17J46q8Q0k6
4882b5P8k0K0J80j12o1k5M8j43J74q8j25M7K0M9m2Mj8Q9j66K08k1r2n6N8J05r2
4909fl1m9J04nj41K88k15K30j81k7J39o2j42N0R5o7J03L8m1j07J5P4l2K4j02J2
$$ plain form
4733 12 -6 34 -37 -16 -56 77 29 -23 43 32 19 162 -90 -125 0 105 -15 -91 29 -3 -60 -125 136 150 -39 -105
4759 -105 71 -24 110 -19 82 -94 -21 18 -30 169 120 116 -30 -50 -108 -47 -10 165 13 -53 -170 63 86 -85
4783 -85 109 36 -71 -126 -40 61 181 -37 -22 10 -44 100 -49 5 -41 -7 88 28 128 -56 60 -9 -145 -118 106
4808 106 43 -62 34 -81 37 48 -140 -9 49 -140 104 210 -138 34 34 -120 -31 -28 3 -98 -116 140 -4 -155
4832 -155 254 -76 63 -58 28 97 66 -74 -57 -74 149 47 -2 11 53 16 33 15 -114 196 103 -13 -140 47
4856 47 30 -101 -84 -16 -128 162 -18 169 -67 -46 109 50 58 20 52 -44 14 -68 79 42 -20 -137 9 -79 1 -25
4882 -25 53 33 53 233 121 60 35 83 -60 114 26 -99 -52 -32 17 -25 -21 -39 50 -116 92 71 -21 -77 -19 86 -6
4909 -6 -37 -86 18 13 -128 160 -55 175 -6 -33 106 44 -98 -48 47 -20 83 121 80 -27 -12 62 30 54 -48 -36
4935c6Q7L2o6r2P8n5J74j96J38j14nQ8J11k95L03j11j59J00Q5M8j6j92J10l6J38
4960A19o7m4J03K3q7j35K02l15K10J4q4J39j33J1Q6R0l47K07JJ03l4j07NJ0J14
4985H4j68P8j75J58P8j49J87j14m0j63K69Q9m1j85LJ9J07j9Ln5M9R5l8j79J58
5010E1j69J31Lo6K50o9Q1k05K1l8J19j32j7q3J52M0Q6k1r8j3PN3j17P7j44J10
5036IJ35k47J57m1k29K14J62j81M3n1P0K6r3J36j19j67J08L2m3J49j0M8j05nJ05
5061A03j05j0J29j68J60j94K7J20L5j15K22j80m3k9L3L9o4M4K4K2j97K48m1l03
5085b43M3J96J31l21K16n6m5P3m5J32k20Q7q3N5k2J25j06K6n6k4J49j17j9J00
5109b4J33j07o4J48n4P5j15J20j17n6J18N8j98k47J97J27Q5j64J4J96j29pl4M9
$$ plain form
4935 -36 51 83 17 -75 3 -52 122 -74 64 -50 -55 33 144 -151 152 41 -118 -18 67 115 99 -93 17 -19 119
4960 119 52 8 111 134 47 -88 114 -201 9 23 -61 78 -55 -44 42 132 -215 -8 -7 96 62 -45 -40 -30 84
4985 84 -84 -6 -181 -23 55 -94 93 -21 -61 -224 45 134 93 -92 -89 -70 37 18 21 -34 15 110 72 -107 51
5010 51 -118 13 16 -50 200 131 212 7 28 -10 109 -23 -40 -123 29 69 155 134 36 23 30 83 -34 43 -101 9
5036 9 144 -103 54 13 -216 -2 160 -21 22 -29 41 67 -26 110 -9 -176 -68 -36 -79 70 60 108 3 -2 103
5061 103 -2 -12 117 -51 109 -85 -58 62 97 -18 204 24 -19 -48 -15 24 -40 4 28 50 -147 101 60 -243
5085 -243 -200 -4 127 -194 22 -34 -79 -6 -51 81 -139 -52 -135 -80 -102 23 -83 -57 -113 -137 12 -105 -124 -24
5109 -24 109 2 -62 86 32 107 -8 112 -5 -61 57 115 -83 -330 -133 -6 79 -85 -71 125 -4 -11 -45 4
5133DK4L4j04J58r7J4K6j04J26M4Qk00K28j5j04o9J1O9N6j80K16j31l1j29J19
5158b7j23L10j6j87RK00r5j03J12r0J42k23J48L4j1j32Q8j1J23j92m9N0N8m7P8
5183D6j25J41l2j64J79Q1k6j29P1j8M0Q7j48J2J23J6k40P7j41J99j20J49r5j2
5207b9J73k69J99o3j37K08Nk48J42N4j9J22o8rj39K34j87Ol8K01r9O6j65N9n4
5232e5l8Q1O7j07o9Q1J18j16J00n2l0Q4k0K2l7K6K1n2N5N2n7p7J7O1r9P1l26K82
5260CO9p4l8J87q4J3K5K2lk36N8J18K3N7q9k41J81M7j19R1K9j20R7L0j83J75j4
5287B4Q6n8L0Qp1L3P8j76jJ10P6Q5j78N6k16K19o5Q1j81nk0K78l11J59j7r4k3
5314i3J0R7p3k0K77j81j2O7r7M2j7j06M7J15n3j36j00K76j55L41k14j11o2L39
$$ plain form
5133 4 28 62 -42 116 19 33 59 -45 81 125 133 -67 161 146 42 -27 -16 53 109 -71 145 14 -17 -146 -27
5158 -27 -150 160 144 -43 -34 166 71 -32 80 -10 132 -91 57 91 80 -52 36 25 148 -44 -93 -43 15 -32 46
5183 46 -79 62 30 -134 45 126 100 -29 42 24 64 151 3 15 138 154 -86 -9 -150 49 -71 78 -17 -29
5207 -29 144 -125 74 11 -126 82 87 -161 -19 35 16 138 70 61 -78 156 -31 -25 -63 138 39 105 -60 -1 -55
5232 -55 -93 -12 55 -52 -121 -40 78 -38 62 10 -20 64 44 66 29 55 76 24 79 131 74 -3 14 75 -24 47 -279 3
5260 3 72 -2 -40 147 63 76 101 123 120 -116 -58 60 83 140 51 -190 -9 38 -81 10 39 -81 16 46 -137 38 24
5287 24 110 52 82 90 19 52 130 -46 -47 63 139 224 46 102 -114 105 40 121 -60 -65 -85 193 -118 41 24 -70 -93
5314 -93 -83 14 -59 -79 198 17 5 72 -25 17 0 -106 -59 56 3 -133 -233 43 -112 229 15 -96 -158 181
5338A81l0j30j52K8J67p2J35j74p7J53p1P3J22n2o3j7p4j00J86K8R1k50Q1k2P7
5363C8M4j76K57l44K01j16J40K2j78J96r7R4r9K9M3l9k11L13j05PO4o8K0R1j82
5388e6j1j59K44pJ11j79j58K17n1m3J16o1J36k07K29k44J32Q9j21o8O5Q1j90J51
5412A6o2P9j31l5J78j10J56k02m9J92J06p0j59J79j61N2P2p4Q0m9L7q8M7j14J67
5437E7O8j53L6l2J98qj0j36q8J16j65J36m4q2J35qm2j73O9K00L7k33J1J23P2j32
5463d8J6J6O3n0J56q4j14nMM9J21q0J5j92J97r5j6OJ73J4n2j2r5o0q4K26q5n9
5491g5J04%o4RP4j75J56qq0L2n0m2L0J7j62K33n8K83k52Q2j62J37r3r6Q7q8J79
5518A8n6Q5r0J5K11j92K17j36L1o8L4r2M7N3L6p5P5j25q4Q8M2l3j12K23j34j48
$$ plain form
5338 181 151 21 -131 -103 64 -8 127 -47 -124 29 -42 31 153 101 38 21 -53 -153 33 61 152 -98 -17 -39 38
5363 38 82 -94 163 -181 20 -96 44 66 -112 84 -13 81 -18 11 54 15 -196 117 12 19 83 15 35 126 -56
5388 -56 -67 -226 18 11 122 -57 -215 2 -49 -92 24 -37 99 -108 121 -123 9 98 -23 -91 -26 55 -135 16
5412 16 -46 33 -98 -133 45 -65 91 -111 -160 32 138 68 -91 88 -73 -21 51 -23 57 8 45 -43 4 -110 57
5437 57 125 -28 8 -24 174 166 156 20 -68 48 -117 19 -25 -107 28 20 -22 -195 -126 74 111 -122 -111 12 84 -48
5463 -48 -32 -16 47 -3 153 69 -45 -50 -46 3 124 44 59 -133 64 -31 -47 -41 132 146 94 82 -13 -73 -157 69 -16 -75
5491 -75 29 29 -35 -26 48 -127 29 21 -59 -27 -77 -119 -89 -72 -234 -1 -59 224 -28 54 -108 29 -64 -160 -73 -161 18
5518 18 -38 47 -43 -28 183 -9 208 72 103 35 69 -23 24 77 113 38 113 -12 -96 -8 34 1 -111 112 -22 -170
5544a70%j5J69J10j55J07j8q8l7K05l9n9k7N4o8R5j30l1J46O4j82J25j72J09p3
5569h0J0J79k04J9J85k49J95%j1j47K5J73q7r8J6J16Mj37J7J8K1o0J69l7j6jl
5596A7k22J44Q0j08J93j37j15L7J22R3J53k71L9j18J69J1j07j8J6l6N9rJ52j40
5620Dj3m3nJ30n1J16r3J05k5j29l1L0J9l2J70j86l4m4J24l5j12R1O5L0j25L1J0
5647c3r1J22RL7R1M5j70M9j00k5qJ61r3j5j2J02j61Q0L1ko3L6RMl4L5m5K05j84
5676b0m1J95p1j51O8n7J2pr3K12o8P0Q2k54J67N9j09L0k9%O8q7R3k4l6O6k07Q2
5704e0j6R9k14K0K29J26j65m7q3m5J97P2k74Q1J15M8l4j67J51k09J97J00J4k40
5728i5J08m3M9P0m0m0o3N0oj19Q1k0J24Ql6j15nO9J3q6J25m1J5oN3j22J10j57
$$ plain form
5544 -170 -170 -185 -16 94 -61 46 28 -60 -97 108 69 10 -17 37 -31 64 -66 -97 49 113 -69 56 -116 -7 -80
5569 -80 -70 109 -95 -76 109 -140 55 55 44 -103 -78 95 8 -90 -74 42 46 -91 -74 -56 -35 -95 74 37 21 20 17
5596 17 -205 -61 19 -89 104 -33 -148 -111 11 104 257 -14 25 -93 76 87 -20 -38 -22 -58 1 -8 144 4
5620 4 -9 -52 -57 73 22 138 45 150 125 -4 -35 -5 14 -18 152 -34 -68 -112 12 -23 -135 -44 21 51 -74 -43 -33
5647 -33 -124 -2 7 44 135 180 10 59 -41 -66 -74 87 -6 -21 -33 69 -92 -12 19 17 -46 -10 -1 3 -31 4 -41 164 -20
5676 -20 -61 134 63 -88 -20 -77 -65 -72 -165 47 -21 49 131 -123 44 103 -6 24 -5 -5 63 -24 69 45 9 75 -132 -50
5704 -50 -66 33 -181 -161 68 194 29 -18 -101 -146 51 123 -151 -70 45 93 59 -108 43 -166 31 131 145 -95
5728 -95 13 -30 19 89 49 9 -54 -4 -10 -129 -48 -68 56 64 28 -87 -92 -23 -10 -96 29 -12 3 -3 50 -72 38 -119
5756a19Q5J53r3k18J43LN4j42J55QJ1P3L1k69j17K03J7O4k8M0J39k15m8l8J27
5781A9n1j9J07o1J39o0o6j10qJ68j82jJ22Q0j7m3o7P0k4k3k1l8O3J08P1j71J79
5808A64m44K20l7J32K8j56q8J77J14k09K66j72l7l4m0J47n8K2L5j9k9J10l7j78
5832a23O3k2r4K38r6k3k5K45k51J25m8Q5j12K8J0J68l29J75lO3n5J96j82o7j10
5857a44J14j37P1m2J77q3J16K5j73j32J03N2R1Q2k82L53k18J48k01O8m0l6j08
5880a96N7N9K32j08j60Q8o9J52R7j30Jp7J49k19J21k42L96q9j24M6K2l7M5j5j67
5905a68K64l0k01J08J65l7j22n7J76j60O7j83J86j13M4O9J39P4j71P9j19M3k16
5928a63K50r6l3R7j40J55j24Mm6KK22n6j0O8k53N2Kj9k3J32K9m7M9N6j19Q6j18
$$ plain form
5756 -119 -34 119 26 -192 -49 -46 8 -134 21 29 40 113 144 -125 -242 -39 -22 42 14 54 193 -22 -70 -108 19
5781 19 -32 -51 56 -5 134 74 8 -102 -110 58 -124 -125 -3 77 60 17 -50 20 -4 -27 -48 -86 -23 85 156 -15 164
5808 164 -280 -60 -97 35 63 -93 -181 -4 110 -99 167 -5 -42 -76 -116 31 -27 -5 30 11 -18 92 55 -123
5832 -123 -60 -82 -176 62 -34 -57 -82 163 -88 37 -11 74 -38 -10 0 168 -161 14 11 74 19 215 33 -34 -144
5857 -144 -30 -167 -96 -138 39 -44 72 97 -76 -208 -105 -53 38 120 -162 191 -27 121 -80 -12 -52 -88 -196
5880 -196 -139 -80 152 44 -116 -28 -97 55 152 22 23 -54 95 -124 -3 -245 151 62 -62 -16 6 -31 14 -1 -168
5905 -168 96 66 -135 -27 138 101 -21 -78 98 -62 5 -178 8 -105 -61 8 147 221 50 129 10 53 -163
5928 -163 87 -9 -42 55 -85 70 -54 -50 -96 -94 128 72 62 130 -123 -71 -69 -88 -111 21 50 3 52 108 -11 75 -43
5955d3o6L7J16k30O5J48m4R4j59J5K5M4l3K12j62p4q7J34P7J0r4p8Q5j15M0N4
5981b9l8J50m6oQ6m4JJ7r2Lj52O5J17Jj63J53j4j0lJ7l4J02j51Q7J04m4m7j04
6009g4L3J16l9j04P5q5M8p0K25j14j29J14p4J73k0j32N8L2l1J7O7j68R1r2J91
6034A08q0k4N2r6J5J5j43J82L9MM1n6Jrm6m0p4P9p7J38J29k16l1K32j17J8q9N
6062d0M1j1J34k16J80k7j13R6r6P9R2j8k06N5m6P5M2J33r9Kn2l6O7P2n9k1o8J88
6090A48m6r7mm9J31o0j16K00k22M5J78r6p9J29j19K1O1Q6j3o6kp1j38J54o0K27
6116A42r3r2J3j38J92l8L7j55Q0Q7j14R2q1J47j31M2j9J0J42m9k75K17L1j1mM8
6142H0n8n3Q8k74K54N4m7j2o4K20m1l2n2J4j5n2jj13J95l7k01Q9O2L2l9kJ9o7
$$ plain form
5955 -43 -109 -72 44 -186 -121 27 -17 77 -82 -67 -42 2 -31 181 19 -55 -142 -8 69 79 -15 -93 -8 -123 -83 -29
5981 -29 -67 83 37 31 117 73 74 91 -1 2 -150 -85 32 33 -130 23 9 -1 -4 13 -21 81 -70 17 121 77 30 -74
6009 -74 -41 75 36 -68 7 -78 -30 -100 125 11 -118 -4 -78 95 75 -57 1 33 2 19 86 -82 9 -83 108
6034 108 28 4 56 -40 -25 -10 -153 29 68 72 113 57 58 49 3 -37 -111 -32 -109 29 158 -58 -89 143 26 44 -45 -40
6062 -40 1 -10 124 -92 88 61 -52 44 -52 27 119 101 -105 -50 -96 -21 21 154 55 57 5 -31 36 108 49 28 -40 148
6090 148 102 5 1 -48 83 23 -93 107 -115 -70 108 12 -67 62 -57 -36 25 111 98 32 30 -41 -179 -25 -85 142
6116 142 49 -43 -30 -168 24 -14 23 -132 -52 35 -79 13 -68 79 -52 -10 -29 -19 123 74 -201 16 47 36 32 80
6142 80 22 -31 57 -217 37 91 44 32 -32 188 147 115 63 77 62 10 9 -104 91 54 -147 -58 4 36 -3 -5 14 -53
6170e3N3O5Oj99J65j1r7J47m7n1J8N0L6n2j84P3L8K0J1j48J33R3j43m6K00j21
6196d4j05K70q9r4N7j13J85k14K01j67J57qL6l3q5L8K80k67n6J43k5J0j12L9j16
6221a12M9k9J81j93M4P9mk11K25j61K82j26j24Q9K09k01l3J3N6j7K8j85L4O6J14
6246G3k39Q6Q9n6J53j49O0n9QJ1P5pp1m1L8J28j60J02Lq3j8K5j05J55j02J06j34
6273a12R7NO5jM4j84K77k49J4mp8N3J15j00J1M2q9J18J00j28R6k5j71J63J48j66
6299D1k03K26j25Q4M2p0q8l9J95n7m3j0J37o8j78J55q9Q9p8j3J14m1J64j76J96
6324A65k15J3J51j93J72m3J7p2lOj1j7Ll9J93j93P2R3k14J81o8M7j4M6l6L0k4
6351D7n5J29n0l5j74K38j11J13j51o3P9O3J1m1J89k98N3RJ47k5p5j4P6m7m6L3
$$ plain form
6170 -53 0 65 71 -128 37 26 -71 76 29 -22 -4 46 82 30 -154 -81 -43 -23 -12 -160 -27 66 -77 -123 77 -44
6196 -44 -149 121 32 -62 -5 -118 67 -147 54 -113 44 36 72 39 -46 -8 272 5 -51 92 67 77 -35 4 -112
6221 -112 -63 -92 89 -104 -60 19 15 -196 29 -132 150 24 -100 -11 198 -3 -36 -23 33 16 44 -141 -107 -41 73
6246 73 -166 -80 9 -47 106 -43 17 -42 -34 -23 52 45 -26 -67 -29 99 -61 41 44 -39 -57 -32 -137 18 -84 22 -112
6273 -112 -15 -10 55 54 98 -86 191 -58 -44 -48 -126 -73 42 -58 -47 -5 -94 24 124 -4 92 67 -104 59 207 41
6299 41 -162 64 -61 23 65 -5 -93 -132 63 6 -37 -47 90 22 -156 -1 -90 -1 -79 -92 22 -19 145 -31 165
6324 165 -50 -37 114 -79 93 50 67 -5 -8 -2 -13 -30 -27 -66 127 -66 6 99 -115 66 -2 45 31 77 41 71 47
6351 47 -8 121 71 36 -138 100 -11 102 -49 -112 -33 30 41 0 189 -109 -56 -47 100 75 0 -14 62 15 -31 2
6377BP4J3m4Kn1M4n1Q0l1M0j40Q1m9J3j21J37Q5j90K21k84R8P3n0J42n1K2m8N9
6405G6k28L00j93N4Pq3m8J68j25j9k0K0k6J11M8m3J18j81M0n7J92kp1O3j12JJ4
6432DJ03j40L0j58J86j08N9K6q1m4M7J39j97M5R7j48K17n3j84J61R4K6j00L0O0
6457A11o5j22J6J36m7n6J12j28k3J28r7K02k57J30k13L03q7o2l2q7K80Qj14L9
6481G5j83J74l0j17J16l9J80j54N3jl5J6j13R0j1j9j0K2j10Pr8K5K56r9O9j11
6507d7R6K6j18J11p1Mmr1J80j29L2nR5K1j87J69%k3r7J58N7k15J40j44j14N1J34
6534B9lK7j46j6j24K61K4j50J80k26P4p9J01M1L0o6n7J92l7k23M8R2J8P0r7P5
6560C8J7j57k3K42j33J23p7Q1j02PQ2l6q9Qp7k3K70o1k24K06j39j7oJ01P1j00
$$ plain form
6377 2 76 89 45 47 -4 40 -11 69 38 78 -62 19 -30 -17 -138 -1 84 -106 115 -169 -71 2 -48 94 43 65 17 76
6405 76 -152 148 -45 9 16 -67 -115 53 -72 -91 -111 -91 -117 -6 42 -1 117 -64 -24 -81 111 109 38 101 -11 -10 4
6432 4 107 -33 -3 -161 25 -83 -24 2 -79 -123 -76 63 -134 -89 8 -140 77 24 -160 1 95 121 21 51 111
6457 111 46 -76 -60 76 29 -27 85 -43 -66 62 -35 167 -90 40 -173 130 43 -19 -51 -138 142 150 36 75
6481 75 -108 66 36 -81 35 -4 176 22 75 74 39 55 -58 32 21 2 -8 14 -96 -89 -187 -162 94 -5 64 -47
6507 -47 49 75 -43 68 -3 1 -3 -94 86 -43 -11 -16 79 100 -87 82 82 59 -38 120 177 -38 102 -42 -156 -105 29
6534 29 26 53 -93 -109 -233 28 52 -98 82 -144 -70 -149 -48 -7 23 -43 -100 92 55 -168 -120 -28 -10 60 -37 38
6560 38 55 -102 -125 117 -16 107 30 111 9 16 98 62 -27 -19 -96 -119 151 90 -134 72 -67 -84 -90 11 82 -18
6586a8L1l0R8j33N6j9K2j58K69o7k3j29J02m6o5RJ79n4p9O8k5N1n7L8j45J60J32
6613A67j96J15rj32L8j08R6O2o7J12q4j46M4J8J59p7m6J25n7r7R7j7j08J42rj08
6639h6J61l18K32l1O8j29J48j13M7q6J05O2o5k09M05r0q5J59n8j2j24q0J76K9
6663A06l2M2k22J73n1j4KJ44k21R7L4j88K31p3j28K43K2k18j87J08R3Q0N0j37
6687d6J92j40r3K00j06l2q0J01N2L1k54K87m3r4P1j74J55j09Q8K9o2r2J47N5k13
6712a30R3J2r6K22j47Q2q3N2k0j96J80j1O0p3J75j63l9J97j79J13n9n9q5J79j46
6737a21N4j47M7J15J16r3n9K23m9k4o8j90K42N6M1j63K40k61r7O2%kj5n3J21j40
6763a65J15J10k8Q3j92N1J8l8M8Mj52J69q0J4j0L1o2J49p1o7K1m4J45j51K67j57
$$ plain form
6586 -18 13 -17 81 -52 4 -15 7 -151 118 51 28 -101 1 -45 -110 -101 78 24 -55 13 -12 39 -18 20 -125 35 167
6613 167 -29 86 77 -55 -17 -125 -29 33 -34 78 -6 -152 -108 -90 69 -8 -54 71 14 -83 14 -3 -111 31 22 -86
6639 -86 75 -243 -11 -42 26 -103 45 -68 -21 -107 -2 60 -5 -214 191 101 16 175 117 105 -19 -99 77 106
6663 106 74 116 -106 67 16 2 4 148 -73 24 58 -130 101 28 -100 143 165 -53 -240 -132 -39 41 91 -46
6687 -46 146 6 -87 113 7 -25 -105 -4 48 79 -175 112 69 -25 46 -128 27 -82 6 35 -27 -119 28 83 -130
6712 -130 -37 -25 -121 101 -46 36 -47 5 -15 -211 -31 -42 18 -55 120 -43 -82 115 -64 49 -10 -69 -154 25 -121
6737 -121 -67 -214 -167 -52 64 -29 -88 135 86 62 -6 -196 46 102 143 -20 220 -41 -138 -76 -76 -78 -93 -146 -25 -165
6763 -165 -50 60 32 115 -77 -26 -8 -46 2 6 -146 23 -57 -43 -53 -22 -84 65 -6 -73 -52 -96 49 -102 165 8
6789Hj0R8k30J4J10q0N1nm1K04m0k69K27J4ko1k7R3j83Q7j3R5Kp1R4p1j5L7Nj69
6819a48M8L6J3j01J29p7N9M9o5m9N7L2J4l0P8p1n3l7R3P2p0p0J46k31J65l7J20
6846G2j38L8n6k35K89L8N9r4n9j48L71j78N1J0j85J66P0p1J20j43O0Q0k41J27
6870Cq2J00j29R8J06j26M6j6J55j51m9N5P0P5l4j30JnO9l5j23J23p3n1J78j4j11
6897e0m0OJ29O6p4q1n8l2J01M4J4n7J09j78M7J13j07J02m6N4k9P1j03O9j7j02
6923d9J5MO9M8j31N5l1p5n5J28N3L7N4j57q6J24p7J44o5L9j96J3P4l2J14m1R9
6950G5qm0P3j65o4J52j09K20k00N1J8M1K0r6R2M1J8j40j25K22j33N9L1k3K9k71
6976b32L89m6q9Q9j78Q0j29m3K09Oj27P7o3J01O1k40J55j06k4J40k08J6J06J31
$$ plain form
6789 8 -2 96 -134 -120 -10 -90 -39 -44 -85 119 79 -190 37 51 49 -12 -39 54 -129 -42 -55 40 42 -29 65 -6 -21 16 21 -148
6819 -148 -100 -64 -51 -152 -23 -100 -41 8 -57 -106 -49 -17 -3 -33 45 -26 -79 -116 -23 49 -21 -91 55 -176 -11 -48 72
6846 72 -66 -28 -84 -319 -30 8 67 -27 -86 -234 137 -41 10 20 -165 1 71 0 120 -23 37 117 -124 3
6870 3 -79 21 -108 -10 96 -30 16 0 155 4 -45 10 80 155 121 -9 -8 -13 56 21 -102 21 -52 -103 75 61 -50
6897 -50 -90 -84 45 111 37 -44 -102 -134 -33 11 25 -32 77 -101 -54 59 -48 54 8 62 33 104 1 70 53 -49
6923 -49 -34 -30 39 87 -44 11 -20 -95 -150 -22 31 68 122 -35 -121 3 -74 70 5 44 -152 -139 -65 -97 17 -24 75
6950 75 67 27 100 -65 -129 23 -86 134 -66 -15 3 44 64 -32 60 101 119 -21 -146 76 -57 2 33 10 39 -232
6976 -232 157 111 22 111 -67 13 -116 -159 50 56 -71 6 -57 44 105 -135 20 -86 -110 30 -178 -162 -56 75
7000G5L4k15rN1M0J13j62O6n8PJ60j51J3M8P6pj76N6Q6j04K21q6k8K3m6M6L8j07
7028DN5K1J9m1n6J31j68k1J36kj99J30k8Kn4P5l3r8O4K23p3o3J04j86J69m2j22
7055e3ol9o2K35j28j8J51r9N0n1R9k1o3K0j04O5j39K66k26j3P2j18J69o7R2K7
7081C9J02k48N3Q3j72J68J16n4k9j00L11l01J65oj38J8lJ79k00J42r3l8k1k0Q8
7106D1J47j50n1j08m8J34J40o3p7K3m4Q3%J13m6k46K41k31K37j12r1K2J49k58
7130a95K27j25O0p9J36r5Q2q8l3MJ01J3m3J46j18J27j98J12J3j42Q0Q1q2q5K13
7155A12o9K2m9k4l9L1M3l1J3J0k3J8K09l27O1QJ46j62j9P0m5J85j39k1J37j16
7181AJ11o8o9l4n5J01l4Q7l8j1j05K57q9n2j15M2J0j1P1P3j49J56Rk09J93j38
$$ plain form
7000 75 109 -106 -115 -64 -24 89 -73 -7 -65 -58 102 -49 -36 12 88 81 -95 -39 47 -57 164 78 50 73 27 73 111 4
7028 4 59 80 99 58 2 133 -35 -56 80 78 -121 9 -19 -17 -71 4 -29 -127 -63 160 87 24 128 -58 111 69 -53
7055 -53 -59 -98 -160 75 -53 -71 80 -19 31 -20 79 58 -5 15 -89 -24 -163 103 -123 -136 -64 -182 -13 -80 12 39
7081 39 141 -107 -54 29 -143 25 141 87 58 -42 269 -32 133 127 -11 7 4 183 -17 125 32 -6 -27 -47 41
7106 41 188 38 -13 -121 -169 -35 105 42 -35 -12 -56 27 27 140 94 -152 89 -142 95 -17 -108 -86 63 -195
7130 -195 32 -93 -33 -112 24 -71 11 -77 -110 -106 -5 8 -35 111 -7 120 -78 34 47 -95 -15 66 -16 -101 112
7155 112 43 65 16 -8 -47 -16 27 -4 9 19 -4 14 223 -104 -43 -35 111 -51 -70 0 -45 140 1 -20 117 1
7181 1 112 44 -25 -59 -114 -13 -47 40 2 -9 -114 143 54 2 -113 -71 -61 -72 -1 72 -77 79 88 -121 72 -66
7207f6K49n5M3j96P8K5j71J85j80P7Q2j16O1O8j56K3K5K1J12j41K8j3J12j52J50
7232I3j21kR3o2J3l1RJ20P5j18o0q8L7l8P4PK7j01M0o4J42j9j9m1N8j75m3L25
7260A31j56k8Q7n6J46j08r9J98n5Jk04J47J13n0J9l1j6J06p5q1N4k6L9j34P6j43
7286a45R1j09J85n7J79o2k58R0J20k63K18J93j37j1pm1n5N2o9M9R3l7lj85Q1L1
7312e7O6j89J76rl2o1K31k03L0J88j61M1rj21J17j1RJ87k16N9o0o1R9j01J24j44
7338a08K6J74o9q3K15J00k29K5k6M5j01Jj6J16o5J7n2M7j30J25l6K8k9L3M1j84
7364a35M5J32j55J6J43j52N4O1JJ7M4k69J40O9j32J60Jp9K59j75O4q1M5j65K14
7389A22j56j01K99p1j84N6K05J7j80nj8J42k7k15P8n5J1rkJ07j33M1P5JR1j61
$$ plain form
7207 -66 183 128 171 -25 53 78 -93 92 -88 -11 71 -45 16 84 -72 -49 -24 -3 109 -32 -4 -17 95 -57 93
7232 93 -28 -30 63 1 14 -17 -8 112 187 69 9 -79 -42 -80 -6 1 28 -73 -33 -97 45 26 7 -34 24 -151 -194 131
7260 131 -25 -53 34 -22 124 16 -83 115 60 61 -143 4 117 67 86 55 39 145 70 -11 43 17 56 -78 -2 -145
7286 -145 -54 -163 22 -35 144 82 -176 -86 34 -229 -11 182 45 34 27 -14 -69 -17 -86 -37 56 19 16 -169 -88 -57
7312 -57 9 -180 -4 -13 -45 -106 125 -78 -48 140 -21 20 11 -110 7 -4 5 192 -24 35 -25 -86 13 -88 36 -108
7338 -108 -82 92 23 -60 155 255 26 51 25 70 -31 -30 -46 70 5 22 -30 17 -113 12 -24 4 -25 8 49 -135
7364 -135 -90 42 -113 -97 46 -106 -52 9 10 27 71 -198 -58 11 -121 39 40 -39 220 45 109 28 73 -92 122
7389 122 -34 -135 164 93 -91 -35 170 187 7 2 -16 126 99 -116 -38 -93 -82 -91 -93 14 -119 -78 -3 -2 89 -72
7415g2M4j8Nm4J19k7N9k13J57M8j41J7O7K6j27R4lqJ11j85J18L1k35K45j65J02
7441El5n0j0m4P0j68J98J06j32O4J9p0l0J31J5k8l5j35K82j52N9q1o6J13M8j46
7467g2Q5r9P0R4j64P9R0j22p2R5j1J16J00m03K32j17J70j65k4Q0j47J30k2K1M5
7492a1J23l9n8k07L61j88l2L5l7J34l0j86Q2J07j01J31k43K01r7J61j05k5J4O6
7516E6k0j69J17q2R9J02l26K30n6j13J21K4J62j40Ll3N0ll1j13K23n3j24R4J45
7541A63l61J40K9J06j58J03J6j59J54N7L6n5p3j3K8n4J88k21J45L9j13q6M7n7
7565i9m4J08j0J40j41K53k03j05J28n2M1p5j52J56Q1J76k90NJ05j49p1J40l2J40
7589E0j8j19N5o6M1K4J0J17o9k4j23J17m6J07K2j35j09J21q4J13J43j47qj2O0
$$ plain form
7415 -72 -28 -46 -41 -85 34 7 66 -147 10 58 -83 -66 1 27 -100 -6 -9 -17 94 -91 27 58 -177 68 -97 5
7441 5 -30 -80 -90 -134 -64 -232 -34 72 -60 4 23 -47 -77 54 69 41 6 -129 153 1 60 -21 -87 26 74 -72
7467 -72 13 -86 -16 78 -86 -7 83 -39 -111 -16 -27 89 189 -214 18 -99 71 -94 -118 -38 -185 -55 -77 -56 -11
7492 -11 112 73 15 -192 169 -19 -51 -16 -53 81 51 -135 -53 54 -47 84 -159 42 -55 106 1 -24 -10 56
7516 56 36 -133 -16 -98 1 103 -223 7 -49 -162 -41 -17 145 5 8 -25 25 22 -9 -122 101 48 -76 18 163
7541 163 -198 -58 -29 77 -81 22 38 -121 33 90 126 71 -2 -15 13 -41 147 -74 71 110 -3 -89 -42 -99
7565 -99 -143 -35 -45 95 -46 207 4 -101 27 -25 16 -59 -211 -55 26 202 -88 -83 22 -127 -198 -58 -90 50
7589 50 32 -87 -32 -98 -57 -33 -23 94 25 1 -122 -5 -51 56 78 -57 -166 -45 -129 -16 127 -20 -28 -40 20
7614B0j2LM4L6k55J62k1J03n7l3J76n3j99J7O6J98l04M3P8J8q5K7L6n2K7P7Q2
7641A42j05O2n7Oj04J92j05j0l7nM4O9j49J2p9J28J03k11J29j2j99M2J32p2P1
7666a3R7L8j05N7kj56k8Q8Kk9p1n6J58j01J93p4N8n7O3K1k7J8j44nJ31q7QQ6q2
7695a9k1j77K58k3j32J51j28R9J0p5P7J30j44Q5j51o1J43q0j1M4J33j16Pj34N6
7720g9K60j86n9J85o7k26J31o2J71q4oJ4j1Q9l8L3r3k9J3J95j43n7J2n6J32j3
7746B6Q0J0j53J53k47J53p9J99k1o9Rl6O9j78J49L5l3nJ6r4k08J52l6J17J75m8
7772A36k24O2J1J9n5J01l1p2N4n3k5J06KN8k23Q0J3QJ75j31j03K33j90l0K40j51
7798A0k5J28j19NQP5q5q2M0O7j01m5J70J8j56l3Q6L5Q8j08j28J49j41J10Q1j37
$$ plain form
7614 20 8 11 55 91 -164 -2 -23 80 23 -10 166 113 -86 -69 -3 195 -109 -66 12 30 -55 -28 8 -44 -17 60 142
7641 142 37 99 42 48 -56 136 31 21 -16 -21 23 92 -57 -45 -124 4 107 -104 25 13 -186 -144 -12 -84 -13
7666 -13 84 122 17 74 72 -84 -112 -24 -22 -51 -122 -178 -20 -121 72 -2 56 -1 62 83 56 74 -70 -75 56 -31 -23 63 -19
7695 -19 -40 -217 41 18 -114 37 -91 8 18 -57 20 150 6 91 -60 -121 22 -58 -69 -25 108 -8 -1 -135 -79
7720 -79 181 -5 -64 121 54 -172 -41 -103 68 -16 -22 -8 -19 70 32 65 -28 -57 -44 151 8 -49 -37 -93 39 26
7746 26 106 116 -37 116 -131 22 -57 142 121 52 61 25 94 -84 65 100 67 62 78 -16 -224 -72 -108 9 184 136
7772 136 -88 -26 -15 4 -51 50 19 -53 1 -52 -77 29 31 89 -134 -54 -41 -33 142 11 -92 141 -49 -79 161 10
7798 10 -15 113 -6 -1 7 82 -3 -85 -45 22 -79 -124 46 64 -92 -125 -39 -4 84 -24 -152 -3 -144 -34 47 -90
7824i0J3j1K40k44K7K23q7R8j24m1O1j01O0l51J96Q1L7l3N6J97l17O5N7J24q5
7849E1L8j30M5Q8j53J1K2M7o5NJ17M1k75K10j07R5L2j24M5L2j3j7Q2o0m3P7oK5
7877G0r8r5n2J1K14k8Q2j58q3J26O5m3k11J53%o5LO1M9J6j04J38J9K8j00kRlm4
7906d2J46l1j01r3k1O0Q1J39o4p5NJ9Qk05j9K56L8j77J82q1j57K10k50Q5k4K77
7932A66k31N2J02o7P8o0J6M5n2q4j9L3L4o2R8j90p0k3K03Q8j50N3J71j78j27P5
7958i9J30J33l44J64o3m7K38j73M0J54j02j54J42r8J84n9j03J27j55J50l1k5r1
7981h2K5M5n0Q7j55J73mj41O2q8M7Q8J00j61K1J84p5o5k04J70O6p8k8J96j94J06
8007D5O0r2J69l26Q2M0j38L47j02j66m6J23l8p3O5J04mqqq2k03K58j5L6nq1k3
$$ plain form
7824 -90 -77 -88 152 -92 -65 158 71 169 45 4 65 -36 24 -327 -131 -50 -13 -46 10 207 -110 -45 12 136 51
7849 51 89 -41 4 92 -61 -50 -28 19 -46 -41 76 117 -158 52 -55 40 72 -52 -7 25 12 -5 77 17 -26 51 45 70
7877 70 -28 -123 -175 -164 50 22 104 -54 -137 -11 54 11 -200 -47 -47 -112 -109 -48 1 17 -87 51 70 98 -2 -4 5 2 -42
7906 -42 104 73 -28 -121 -142 -82 -1 138 74 -1 4 23 31 -174 -193 63 101 -76 106 25 -132 78 -172 -87 -111 166
7932 166 -65 -13 89 22 100 40 56 101 49 -35 -54 -21 13 -49 49 -141 -211 -234 -31 57 -93 -40 131 -47 -174 -99
7958 -99 31 164 -180 -16 -79 -126 112 -61 -21 133 31 -123 19 -79 105 46 -57 70 -85 65 34 9 -82
7981 -82 -57 -12 -62 25 -130 43 39 -102 -40 -128 -81 7 107 -54 -33 151 76 11 -193 -23 43 -35 -63 133 -61 45
8007 45 105 13 182 -144 -62 -22 -160 187 85 -81 -127 -4 -42 -115 -50 54 50 42 34 -48 -251 7 -8 28 23 -58 -81
8034h1J01Q9p8j86R0J32n9m3k49L39p4Nk10L42j12lo1Kk1R6O2k86K20P1k24P8
8060f0N6J30k36O2j08J43J63j08J8m9j05r3K50J1j47J39m5L3R3k71K55j58O8k3
8084A8K3q2O0p3NN4L0R2p2k7j74Q0k5L7n6J48j34M0P8k8o4k8R7J33k29K13j22
8111fJ22j59q0o1J81p2m7K08p4r9J83k11R4j2N7q8J89%q7r8P3O9j2j12P6j46J56
8138D4j08J69j87P5J09m4j03P0Lj54K24p7nNj79J09L4%N8k20M24m27K70m9K10
8163B51l51K13Q7j28r1J04j86rK5K68r2o8j50M1J7k6J98k84J07J33J33j69Pm3
8187a3J0J79k20L
$$ plain form
8034 -81 20 109 31 -155 -65 67 8 -35 -284 55 -19 -14 -224 118 6 3 -58 -56 -77 19 81 -205 15 86 -138 -60
8060 -60 -4 126 -110 -48 -156 -13 150 42 60 11 -94 -187 63 74 -73 66 21 54 147 -124 131 -27 41 18
8084 18 41 -41 19 -54 -49 5 35 127 55 28 -146 -66 -91 -54 -110 38 -96 -56 22 -6 -70 -98 -1 132 -97 116 -6
8111 -6 116 -43 -123 -184 -3 -75 -122 86 12 -87 96 -115 -21 -33 24 -64 125 125 38 -60 13 82 70 -42 34 -112 44
8138 44 -64 105 -82 -7 102 58 -45 25 28 -126 98 21 16 21 -158 -49 -15 -15 43 -177 247 -180 90 41 251
8163 251 -100 113 200 72 -19 85 -101 -110 -85 183 91 23 -127 -86 -69 -95 103 -181 -74 59 192 23 30 -13
8187 -13 -3 176 -44 -41
8191d1
$$ Imaginary data points
##PAGE= N=2
##DATA TABLE= (X++(I..I)), XYDATA
0@%%%%%%Qq%qJ6j6J6k4L2m0N6o4P2r2J16j36J56j85K19k52K90l37L93m50N12n82
32c08O61p48Q44r51J067j195J333j485J652j837K038k255K493k752L035l348L691
49A935m066M477m932N438o003O637p352Q166r105J0199j1494J3055j4979J7420
63I396k0626K5043l1536M2014o1644J10488m49172o72134J254377P14208o67975
74B52439m24290M43881P358k53488J93052J8652m97827J08902N69315k59706o66525
85e08237L46839O61040l23549n82545K45383L66118j90241j92128R2739k6259
95a10840l3233J54106l9209k53654J20997L69940l9991k79876P3003K15130m7002
106A29371p3163P6800m0477j14310N4793K4250j28889N5098J77634j55603k70309
$$ plain form
0 0 0 0 0 0 0 0 8 0 0 -8 8 -8 8 -16 16 -24 32 -32 40 -52 64 -72 84 -101 118 -134 156 -181 212 -238 274 -308
32 -308 353 -395 449 -502 565 -630 703 -782 870 -967 1071 -1184 1309 -1443 1592 -1756 1935
49 1935 -2131 2346 -2586 2852 -3151 3486 -3866 4300 -4805 5394 -6100 6955 -8024 9396
63 9396 -11230 13813 -17723 24291 -37353 73135 -376037 -1048171 206206 920414 252439
74 252439 -171851 272030 279388 25900 218952 237604 -260223 -151321 417994 158288 -508237
85 -508237 -161398 499642 176093 -406452 -161069 205049 14808 -177320 -84581 -110840
95 -110840 -144073 10033 -29176 -282830 -161833 208107 168116 -111760 -38757 176373 129371
106 129371 56208 133008 92531 -21779 33014 57264 -71625 -16527 161107 5504 -264805
117b64805J42378K69279q8199j73235O4802N9698m6175P5534Q1110j57696j22343
128a59652J67387R9047k00342r9805J93708J08326j15808m4082Q4844K8174j28
139F1669M0256l4216q9877L0714Q9553n4371j14958L3404J01307k9014j06380
150g1913k3138N7738N2296p19o3254n3992M6089Q3008q42n0187o037K4353J6580
163I982J2967l579j3158J6259J6220l3384k2017N0211L5688m8035l3227N0489
175C8416K8984n1931k9693K9742m619m7755j3016O784j9418R80M0144Q082k5535
188c8835K0926N1815O4k8354J6611K7214k6390l7379P084J5878o924l651j911
201c852j5555O495L7607J1764k5344j0638J3231K583q234l540r582j7624k857
$$ plain form
117 -264805 -122427 146852 58653 -114582 -49780 9918 -36257 39277 120387 -37309 -159652
128 -159652 7735 106782 -93560 -193365 343 108669 -7139 -51221 33623 61797 61669
139 61669 101925 67709 -22168 8546 98099 43728 -71230 -37826 63481 34467 -71913
150 -71913 -95051 -37313 14983 14264 -48990 -102982 -56893 26115 25273 -24914 -30951 -6598 9982
163 9982 22949 19370 6212 22471 38691 5307 -16710 33501 69189 21154 -12073 38416
175 38416 67400 15469 -14224 15518 10899 -36856 -49872 -43088 -62506 -61526 -21382 -13300 -38835
188 -38835 -17909 33906 33970 5616 22227 49441 23051 -14328 -7244 8634 1710 -1941 -3852
201 -3852 -19407 -12912 24695 36459 11115 477 13708 16291 8057 4517 -5065 -22689 -25546
214b5546J2753O01j2862J480J7903R980k972k486M449R853P446p092j5035M24
228a104J1586l479j6047j715J2705K376r740j509R967P675K592j283q625n436
242b037Q458M662j4688j3844K892M819l419j424M874M953K975J243J868O058O033
257A3423l629q288M87P499j496j0669l249Q095L156o768l187N321M497j761k311
272A120j36O8k86p32k202k491L25O09j307j676J481K616K111M54k099Q47N640
289D342K616m280k716L355J670l433j527J468j40j654m02R81P64k52r68l50J112
306E86j12j933r53J361N92j843k81K310O72j933j04K890N76k706r40L268J066
323B516k637q17K061N43j415l10N84K12q95l43J51O48l19j095L70J031l93j318
$$ plain form
214 -25546 -12793 -12192 -25054 -23574 -5671 4309 1337 -1149 3300 13153 20599 13507 -1528 -1104
228 -1104 10482 7003 -9044 -10759 1946 4322 -5418 -6927 3040 10715 13307 12024 3399 -2037
242 -2037 6421 11083 -3605 -17449 -14557 -9738 -13157 -14581 -9707 -4754 -1779 -536 1332 7390 13423
257 13423 9794 1506 1993 9492 7996 -2673 -5922 2173 5329 -1439 -4626 695 5192 3431 1120
272 1120 984 1052 766 34 -2168 -4659 -4334 -3725 -5032 -6708 -5227 -2611 -500 -46 -2145 -1298 4342
289 4342 6958 2678 -38 3317 4987 1554 27 1495 1355 -299 -701 280 1044 792 -176 -526 586
306 586 474 -1459 -2412 -1051 -459 -2302 -2583 -273 399 -1534 -1638 1252 1828 -878 -1818 1450 2516
323 2516 -121 -938 1123 1666 251 -59 525 737 -158 -501 -350 298 -21 -1116 -746 285 -108 -1426
341a426R86J541j133r42J428J743o57j001J300Q37j147j712q2l3j479k067K89
358c555J571J69q85J187L203J486r51j095J037Q26j846k850l35R10o05p49J773
375g09J621O61Q76J556K63j455j131l35j483k690k134M43J275l11q00J909L320
392H76R27o99O66J471m96j517k16L14q88j029J71J227k21p27P96J057m33j332
410e3n29Q2m02r41n26L32L54q5j72O96R24k73MP99J046Lm54J118J130k78r84j46
432A645O51n84j524q86j70L21r85r50Q57L01o04L09J151P8j059O78J367pj405
451h16J44J839O82j535o00J032O82j294r64L52N94k96K3N54P63lJ89L96j26j119
471D97q77Kn27j260n18P32J071N7J95J009J354K58o66l65L8q61j398r77J19O80
$$ plain form
341 -1426 -440 1101 -32 -974 454 2197 1540 539 1839 2676 1529 -183 -265 -298 -1777 -3844 -3555
358 -3555 -1984 -1815 -2700 -1513 1690 3176 2225 1130 2167 2993 1147 -1703 -2038 -1128 -1733 -2482 -709
375 -709 912 1573 2449 4005 4268 2813 1682 1347 -136 -2826 -4960 -4517 -3242 -3553 -4353 -2444 876
392 876 1803 1104 1770 3241 2745 1228 1012 1326 438 -591 -420 807 586 -141 655 1712 1279 -53
410 -53 -582 -500 -902 -1843 -2369 -2037 -1683 -1768 -1940 -1244 -320 -593 -589 210 1256 1259 805 1923 3053 2775 1791 1645
432 1645 2296 1712 188 -698 -868 -547 -1532 -2482 -1625 -1324 -1928 -1619 -468 -390 -1449 -771 596 589 -816
451 -816 -672 1167 1849 314 -286 746 1428 134 -830 -478 116 -180 -157 397 1160 1157 1346 1742 1616 497
471 497 -380 -378 -905 -2165 -2683 -1951 -880 -823 -628 381 1735 1993 1327 962 1000 139 -1259 -2236 -2117 -1437
491a437l00J57J998J630r4L49J149k74j648j040k92j212j698n40O74n4m41J186
509a887J855O66Q0P80N04L07m50p12p08N37l77q91l40L72P63l40k31J20K38m1
529B45k95j33m85l12j51j14m72OQ7M43O91J8Q2J025J396l3j144M65J195j000j498
550A6J2N53j074j324M52J101m79l93J364P26l93k32Q34j72p96l08K78q8o96p3
570f92M52K94j95p2M9M76l14o19r0L53k30o26L34P16L49l83L80N68J04m39Q7K73
592G75l66l11m5J05J46L9n1k04K51L40o29k92R4j41m39q5L03j5J2P9O83J62k18
615A93J64L79k30n91J32l5l00m36k51O16K82l24k05N38Q03l22m01K85O39m17l97
636A22M2M44l69n61M77K34p17J52L31O8k08k19K05L28k62m45mL32k5n11J29M47
$$ plain form
491 -1437 -1737 -1580 418 2048 1954 2303 3452 3178 1530 490 198 -1014 -2712 -3252 -2578 -2632 -3073 -1887
509 -1887 -32 634 714 1494 1998 2305 1855 1143 435 972 595 -296 -636 -264 499 159 -72 48 286 245
529 245 -50 -183 -668 -980 -1131 -1245 -1717 -1711 -1624 -1181 -490 -472 -390 635 2031 1998 854 1319 2514 1514 16
550 16 28 581 -493 -1817 -1365 -264 -743 -1136 228 954 561 329 1163 991 195 -113 165 77 -619 -692
570 -692 -240 54 -141 -213 -164 312 -2 -621 -711 -358 -588 -1214 -880 -164 185 -198 182 750 854 415 502 775
592 775 409 98 53 158 304 343 292 88 339 679 50 -242 -148 -289 -728 -813 -510 -525 -513 -434 249 411 193
615 193 357 736 506 -85 47 12 -288 -724 -975 -359 -77 -401 -606 -68 735 413 12 297 936 519 122
636 122 164 608 239 -322 155 389 -328 -176 155 223 15 -204 1 329 67 -378 -382 -50 -75 -586 -457 -10
658a0J1l31P7L85J03j74n1K69q2k63J39J03l16j92K96J07q2J67j84L30K55n42
680A5J7J43l1j19k13O8J93o2l69J90M80k23m33K14J9J16j74J33Q2l5j03j3M47
703C42r1k99K2K02J07l33j41N7J83k94R4K4K24l98J94J76K0j13k4J96R5j28j80
726f5J11P1l21J00J51J73k51k50L29J52J2j93j92L24p7k40o2O9k3k08nL37j94
749b52R6J01J86J08k79J39K58Q6k32l09J41J54k89o6K73l2j64j08K66L3ok35L34
772B03J0k62m0qN1k58j10J40n1J62j67K38N9J96K40o6J85j00Jj38l4k32k09O0
796a30m7j41m3K63K9J03Q1j41R1M9j86J3j75J40p2j55m5L58M8j77L37L32j59L3
820D06J63j81M4k99j42J46m51j9J55L2N3o5n7K19Q5r8K3J6Q2j21j49K66k11q2
$$ plain form
658 -10 1 -330 -253 132 235 61 10 279 197 -66 73 176 -140 -332 -36 71 -11 156 -28 302 557 15
680 15 32 175 144 25 -188 -120 73 11 -358 -168 312 89 -344 -130 -111 5 -169 -36 46 11 -92 -105 342
703 342 251 -48 -26 176 283 -50 -191 -134 49 -245 -151 -127 97 -301 -107 69 89 -24 -48 148 243 115 -65
726 -65 46 117 -204 -104 47 220 -31 -281 48 200 212 19 -173 151 74 -166 -228 -159 -182 -390 -395 -58 -252
749 -252 -156 -55 131 239 -40 99 357 443 211 -98 43 197 -92 -158 115 83 -81 -189 77 110 104 -131 203
772 203 213 -49 -89 -97 -46 -304 -414 -274 -325 -163 -330 -92 -33 163 403 337 522 422 423 285 251 19 -190 -130
796 -130 -177 -318 -361 -98 -69 34 115 -26 65 114 -72 -59 -234 -94 -166 -321 -366 -8 40 -137 200 532 373 406
820 406 569 388 432 133 -9 137 -314 -333 -178 -146 -93 -158 -215 4 89 -9 14 30 112 -9 -158 108 -103 -185
844a85L7m6K10q4J33J07p7J24J05r6j8k53J10k41J34J43l83R2j2J37k29L11o9
867e0k9k6oL15j58Jj64jJ69o7M0N7j01Q7jj12Q1Mr9L23j78O7q7j67K77k82Q2J85
895A60k91p0PJ51Lj08K1N3J41j86j1J43L04l05j24L31m17J89m6o7K1K65j85j2
919c3J86mL5q1m3j3q5k00N7o9K0J93K7P3k8l62L89J70m1r0o6J43j42j80K90r4
945E2o5j10K8j4J75n6J94m8l6j13J59N8k56m0n8K03l89K29k2K29j20j63lK24o3
970ej21q5J97q4Q2j41J52k4j9j5J18O5j0p5J20j7k86K72k4Q0j94M7J1J30j42j4
996A8j34J04J15j34m3q3J21j49J46o6L0mL9Q2j2O7p6J44m8j19J5L2l00K28l7j20
1022a84K91j50M0J40q7Q2N0j65J63n5k13p4J23J9j44n1J91Q3j41J16J94k73%P6
$$ plain form
844 -185 -148 -194 16 -68 65 172 95 219 324 228 210 -43 67 -174 -40 103 -280 -188 -200 -63 -292 19 -50
867 -50 -79 -105 -111 204 46 47 -117 -118 51 -16 24 81 -20 67 66 -46 35 39 -60 263 85 152 65 -102 175 -107 -25 160
895 160 -131 -201 -194 -43 -40 -148 -127 -74 67 -119 -130 13 317 12 -112 219 -198 -9 -55 -122 -101 164 -21 -33
919 -33 153 149 184 103 60 47 -38 -238 -181 -250 -230 -37 -10 63 35 -327 62 232 191 101 35 178 36 -144 146 52
945 52 -13 -123 -95 -109 66 10 204 156 120 7 166 224 -32 -72 -130 73 -316 -87 -109 120 0 -163 -166 58 -5
970 -5 -126 -211 -14 -98 -16 -157 -5 -29 -48 -63 55 120 110 35 155 138 -148 124 100 180 -14 33 44 174 32 18
996 18 -116 -12 103 -31 -74 -157 -36 -185 -39 -105 -75 -79 -40 42 30 97 21 165 117 -2 13 45 -255 -27 -64 -184
1022 -184 107 -43 -3 137 50 132 182 17 180 125 -88 -162 -39 -20 -164 -215 -24 59 -82 34 228 -45 -45 31
1046C1L10k57j33J10j48J28K7n3m8R7k67Q8K03J45j72L3M0j10j17k8o8Q4o9l0
1070b04J91j34R6o2J36N3J06r3K25r5j62J15j87J10j85J01j41J22p6Q7j77q9K81
1093A8q5N9J3j28J75J1j29q7J02j11O9k3M1K5N8M9K07m6m3K39k61J7j81N5j24
1118h0l8O0rlj10N5j7M0J03o1J83o4l02J90j16J45q3o1J52j29j6J73J84J8m2J07
1144B79M7o2k73J68%q6j48q2J10r3P1l1p8J33jJ2mL1j23P2QK0q5j6L3R0k22K53
1172B3j00K15L2O3j71n5K16j05M6k78J07n2Qk07J23r0K52j86J69j00K12q8K46
1195B80j62j55R1J03j93O7m6J94j26o7K1j61K15L9l7Q8o2J51k44J14j91N2j37
1218a66o5J24p0N6m1J07L6J19J04rJ8p6p0M6N7j39p6O0J54k51J84j57M8P9J00
$$ plain form
1046 31 341 84 -49 61 -87 41 68 15 -33 64 -203 -115 88 233 61 94 134 24 -93 -121 -189 -105 -174 -204
1070 -204 -13 -147 -51 -113 23 76 182 89 314 219 57 172 -15 95 -90 11 -130 -8 -84 3 -174 -263 18
1093 18 -67 -8 5 -123 52 63 -66 -153 -51 -162 -93 -116 -75 -50 8 57 264 218 175 414 153 170 -11 44 -80
1118 -80 -118 -58 -67 -70 -180 -125 -142 -102 1 -60 123 59 -243 -53 -169 -24 -107 -168 -16 -145 -161 12 196 214 172 279
1144 279 326 264 -9 159 159 73 -75 -157 -47 -140 -69 -100 -178 -45 -46 -34 -38 -7 -130 -58 -50 -30 -115 -131 -98 -8 -230 23
1172 23 -77 138 170 233 62 7 223 118 164 -114 -7 -59 -51 -258 -135 -225 27 -159 10 -90 122 34 280
1195 280 118 -37 54 157 -36 31 -15 179 53 -14 7 -154 61 100 63 151 89 240 -4 110 -81 -29 -166
1218 -166 -231 -107 -177 -121 -162 -55 -19 100 204 195 213 137 67 113 170 31 -45 15 169 -82 102 -55 -7 72 172
1243A72n0n2k0N2R1l27J81l28K59j10m2N9P1J8o1J28jJ26p8lk8j7q2J10k1K6j54
1270h1J81k6q5m4K4j07J67o0J52r0m5k4oJ79j38r3L1j3M7q3Q8J01o1M1r6K29j00
1297H8P9r4N8j66R0j05N9L0O2M1k91K46km2n3j01Q7m4J20m2rj24J48q8R2L3k10
1324a38J55J23K1j26pQ6j31m2J05q1k1J67j3j68J56q4j01J54j42J54l9m6j5K7
1348fO8p7k0N5N5Q5k26Q7JkJ49j9k04R8j70J83ll2l6J02j67n8K2J49j83K26k44
1375a67J63p8J52k2p1K30m7k60J73r7p4J98j4o4m2J73lr1J9j35R3Q9j45j3N3R2
1401A12k67L00k24J25n3o2L4j7J1j12O5J25j15L6j36K26p2j1m7J18j80K24j09
1424b9m7J34n5R9lj7j92L3J3rK46k72K21j60Q1j74R7L9j28J09O3Q8k39L4J40o4
$$ plain form
1243 172 122 70 50 102 193 -134 47 -281 -22 -132 -174 -115 -44 -26 -87 41 40 166 88 85 57 40 -42 68 47 73 -81
1270 -81 100 74 -11 -55 -31 -138 29 -31 121 31 -14 -38 -44 135 -3 -96 -65 -78 -31 -114 -26 75 14 55 -41 188 88
1297 88 167 73 131 -35 55 -50 9 39 101 142 -149 97 95 53 0 -101 -14 -58 62 20 11 -113 35 -53 39 72 -138
1324 -138 17 140 161 35 28 114 -17 -59 46 -35 -56 111 98 -70 86 2 -99 55 -87 67 28 -18 -33 -6
1348 -6 62 -15 -35 20 75 160 -66 21 22 20 169 150 -54 44 -126 57 54 22 -14 88 -79 -137 -115 34 -149 77 -167
1375 -167 -4 -82 70 48 -23 207 160 -100 73 -24 -98 100 86 22 -20 153 150 59 78 -57 36 125 -20 -33 20 112
1401 112 -155 145 -79 46 -7 -69 -35 -52 -41 -153 -88 37 -78 -42 -178 48 -24 -35 -82 36 -144 80 -29
1424 -29 -76 58 3 102 99 82 -110 -77 -64 -73 173 -99 122 -38 43 -131 -34 5 -123 -14 49 137 -102 -68 72 8
1450HJ28nj54j52L55m9k52J73p6P4j4kj26p5L63k46j71J45M7o7JJ11p8P0N0j27
1476f9O7J6j23K3M6k3J6k0L11j00k57P3n7Q8l0j2R0n4Q7j18J6nJ0J06j13l0L5
1503b7q0P3J51j39o8r1O7R6pO7nj09P6j20J48n1o6J25o8K36k76l0j24K54N5N7
1529A44l5j22J13k42J30K54l16p4K9J58o3L2pM3l0o5Q4j88J27J22K2P7j98P2j13
1554d6Q4m3k7K3q2RQ5O6j83K56j04J1j30M0o6J81m0k00K06rk0j07R5L9j02J68
1580A04n2j02J51j52K29j40m0o7J02L8j18P6M1p0m9M9k7r0J47ol7K5k1o8J95k02
1606h4m7J55m2n4J78k07J78q5m0Q1m7P5N6q6j66K09l1j76J2R9K49k89j5J55p7
1631An0K6J24j69Qo0K72j33O2p7j02J66J7j8k30K13j0j36P0j8R0j49J49q4J1k03
$$ plain form
1450 8 136 131 -23 -175 180 131 -121 52 -24 50 36 34 -92 -167 196 -50 -221 -76 -29 -96 -95 16 -62 8 58 -69
1476 -69 -2 14 -109 -86 -40 -63 -47 -67 244 144 -113 -40 -97 -9 -39 -51 39 -15 72 -46 -30 -35 -25 81 -32 -62 -27
1503 -27 -107 -34 117 -22 -90 -181 -114 -18 -25 42 37 -72 4 -116 32 -19 -85 40 -28 208 -68 -98 -222 32 87 144
1529 144 109 -13 100 -142 -12 242 -74 -148 -119 39 -24 8 1 44 14 -51 33 -155 -28 94 116 193 -5 67 -46
1554 -46 38 -5 -32 -9 -91 -82 3 69 -114 142 38 49 -81 -41 -107 74 34 -166 40 31 11 -96 -1 38 -64 104
1580 104 52 -50 101 -51 178 38 -2 -69 33 71 -47 29 70 0 -49 0 -27 -117 30 24 -13 12 -9 -77 118 -84
1606 -84 -131 24 -18 -72 106 -101 77 -8 -48 33 -14 61 117 31 -135 74 43 -133 -121 -22 227 -62 -77 78 1
1631 1 -49 -23 101 -68 -60 -120 152 19 81 4 -98 68 85 67 -163 50 40 -96 -26 -44 46 -103 46 -38 -27 -230
1657b30K41p6l1J55l3M9q4O3k80K80k8j80KK06j1k17P6R6O5j16m3K0O1m4J25p
1683E9N9K1j01M1k99L79RJ3j88lj6j32J16RL7M5j38K7M5l3K6o6j9K00j31R7mo1
1711hr6M8k2Q9Oj75L18k44J67j38J29jM3J5j97J09N6j44l3mL0k0J27j48R0o4L3
1738c4J12J12j48n7K7N1r6M6j60K60k23lJ54n7l3J46m8J20q3m4l8O4n3r6R1N2
1764F2rj75k8J37Q5k84K77q8N6l8O2k62N6J07J18M5j30j27L4Q7J36j82J74Q9k18
1789a6N8j37N2N4r0q0L29k20R2n4M7k0j19N1J30o6L4m8R2j72P5M1M5k24J79Q2
1815A15q0r6J42p0k2p1J80o8p0M2k28L40k8r9j67K94p7J84j40ro0j65J34j9M7
1840Ij06J7K32r3mO5j13o0M5j79n6K72N4L8j25J0k46K85L9k28J00M2J46r2j01
$$ plain form
1657 -230 11 -65 -96 59 26 75 -9 54 -226 54 26 -154 -152 54 43 -174 -98 -2 63 -53 -96 -76 -15 -59 66 59
1683 59 118 139 38 79 -220 159 168 181 -7 -10 -26 -158 -42 -33 4 49 -89 -62 -17 -50 -24 -90 -109 91 -40 57 53 -8
1711 -8 -104 -56 -78 11 17 -158 160 -84 83 -55 74 73 116 131 -66 43 99 -45 -78 -82 -52 -72 55 -93 -3 -67 -34
1738 -34 78 190 42 -15 12 63 -33 13 -147 113 -110 -113 41 -16 -49 97 49 169 86 42 4 68 15 -81 10 62
1764 62 53 -122 -150 -13 72 -212 65 -23 33 -5 57 -205 -149 -42 76 121 -9 -136 -102 -15 121 -61 113 202 -16
1789 -16 42 -95 -43 11 -79 -159 170 -50 42 -12 35 15 -104 -53 77 11 45 -3 89 -83 -8 33 78 -146 33 115
1815 115 35 -61 81 11 -11 -82 98 30 -40 2 -226 114 86 -13 -180 114 37 221 81 72 12 -153 -19 -38 9
1840 9 -97 -80 152 59 55 120 7 -53 -8 -187 -243 29 83 121 -4 6 -240 45 84 -144 -44 -2 144 52 -49
1865d9K17j23J62k11P6j06JN6NN9k35L40k88O3N1M4q2j7J92k41J44J0j18R3J04
1890A47j2j97J32j03j59J72O7m4q4j04J75K0mj01k3o2P6Q9P5j37J80r8j02J93
1914I6r2J1l0J12q2L1q3j8j6k2l4J5J39kJ2M3j18J43r6j22J81j67N8M3r2J07m5
1941b8R5O7O3Mk15J16j76J98q3r1Q7k0L3m4J03j63k15K95j6O6p9j15L16k03r2
1966i7j01m3K38L4j82J22M4L8L7j90J97j49M7q8J19J35j41j89J64oJ29k50J28
1989do7N8L9j33J78p0M2j88Q7J46k1j16K1oNNL23m77J70QJ02j54nO0k0jJ05p7
2017A0k05J95J1j43J28o0Q7O1k11j30L75j27QJ08j29N7M1k6k91K67j10o3O0L0
2041e7J50n8l6nM5k7J03j78J75j00n3oQ5j43P8qm2M7O1Jq7N4O3J9j51R3qR6j30
$$ plain form
1865 -49 168 45 207 -4 72 -34 -33 23 28 87 -148 192 -96 -33 18 62 -20 -37 155 -86 58 68 -50 43 147
1890 147 135 -62 70 -33 -192 -20 47 3 -81 -185 -10 10 6 -95 -118 -180 -104 -15 60 -77 103 5 -97 96
1914 96 4 15 -15 97 15 46 -37 -55 -71 -93 -127 -112 27 25 37 80 -38 105 9 -113 68 -99 -41 2 -90 17 -28
1941 -28 67 134 197 201 -14 102 -74 124 41 -50 37 17 50 6 109 -54 -269 26 10 76 -3 -118 198 -5 -97
1966 -97 -198 -241 -3 31 -151 -29 15 53 90 -100 97 -52 -5 -93 26 161 20 -169 -5 -11 118 -132 -4
1989 -4 -71 -13 26 -107 71 1 43 -145 -58 88 67 -49 -28 -34 -29 -24 299 -178 -8 0 102 -52 -57 3 -17 -18 87 10
2017 10 -195 0 11 -132 -4 -64 23 84 -127 -257 118 -9 -1 107 -22 35 76 50 -241 26 -84 -147 -87 -57
2041 -57 93 35 -1 -6 39 12 115 -63 112 12 -41 -47 38 -105 -27 -35 -77 -30 31 32 -55 -1 62 81 -70 23 15 111 -19
2070a9L4o1N2L2R7k03O6K9K0oJ23k37J68j05K7ko5P3K1j23r0J01K5J7J47k07l4
2097a20J4J28J0J1M8p0j56J20R0j14J56r4km9m3J42q3o0Q4m5R1N4nj58n7R6m7
2124e9J91K3k02J7J76j03N1j42O3j01j3K17j06K0j16R3N4j08K07n2j22k0J3p3
2148i2O8r1N8P1j5j36K40j15J25k12M2q9R7J03J1m6O5j13N3j37P7P9j04J51j31
2173d1p2R6l0lKJ4Q7l8k5k24J62J52L1j37m2M0R6j4Ln3P6m9J8o0j20K12o0J47
2201A68k55Q3M6j2k45J57L0J12o9j3q8R1k5J0j11P6j2J9M6L8P4o3j50N8O4r9J44
2228G4m9km6K4n5pm1J23J30l19K18Jj60J91j26NJ06Oj31N6J38q6j61J37r9J27
2254E4j90K67l54K37r4M1Oj1j14J47N7j41J3R3m5j3l9J19o8l1J44j31O0Rj67P4
$$ plain form
2070 -19 15 -46 6 38 135 -68 -2 27 47 41 164 -73 95 -10 17 15 -50 23 44 -79 -169 -68 -43 -26 121 -86 -120
2097 -120 -106 22 32 43 91 21 -135 -15 75 -39 117 23 21 -28 -71 71 -12 -72 12 -33 58 112 107 -51 -108 -12 -59
2124 -59 132 155 -47 -30 146 43 94 -48 15 -86 -99 118 12 32 -84 9 63 -45 162 110 -12 -32 -19 -92
2148 -92 -24 -115 -57 14 -1 -137 103 -12 113 -99 -57 -146 -49 54 65 19 84 -29 24 -113 -36 43 -61 90 -41
2173 -41 -113 -17 -47 -50 -48 -34 53 15 -10 -234 -72 80 111 -26 -68 -28 68 54 57 4 80 31 49 -11 -131 81 21 168
2201 168 -87 -4 42 30 -215 -58 -28 84 15 2 -86 5 -20 -10 -121 -45 -57 -38 8 46 120 57 -93 -35 29 -70 74
2228 74 25 23 -23 1 -54 -61 -102 21 151 -168 50 51 -109 82 -44 -39 67 73 -58 -2 136 50 -111 26 -73 54
2254 54 -136 131 -223 14 -80 -39 -33 -44 -158 -11 46 -95 -82 11 -34 -47 -86 33 -35 -66 78 -53 7 16 -151 -77
2280g7J88r2l3J43o5np1o1m7J86j29n0K46k46O3q0R6N8q2O1j05J12l6m3J78j63
2306e4j7K50l39K11k58K20k1m3J9P0k3N5r4l9l1K4J25k7q1J19j02M9J3Q7m2q4
2332a3K0o3j23J83Q7k1j16qk4nJ55j84L6J37r8j17K18J36j78j5J4p1K25k09Q5
2357E1n7K4j81K31r5Jj6J62l25L93Mk93J54pJ3p7J14M9l0o0o6n2R3m3n6R7J29
2384A57M2k5j91K55k55P9J0R8k55P7p7M4M8Q7m9k4k3J62o3j52K7N0q6J20k03Q6
2410f1j6J12L2n8n5j59K19Lpk14J52NK25k44Q2k0JO1l5j3j85J11L6k5J41p1m2
2437b5J73k14l2k2K6K07j64J48j94J01j79J20L5k3r8J36qN9Qm1K5k6k19J12J47
2462E2j74J13O3J7K4n6J1o4j0O5Q7j26M2j06Q0Q2l05J06oJ55p4Q8k3P1m5q4M2
$$ plain form
2280 -77 111 19 -14 129 64 59 -12 -73 -120 66 -63 -113 133 -113 -50 -130 -34 24 -58 3 -102 10 -26 -69 109 -54
2306 -54 -71 179 -160 51 -207 13 -8 -51 -32 38 15 70 -24 -63 -94 -70 55 28 -53 66 -36 13 26 113 71 -13
2332 -13 7 -56 -179 4 91 70 -46 -54 -78 -83 72 -112 -76 61 -37 -154 64 200 22 7 21 -50 175 -34 51
2357 51 -6 18 -163 68 -27 -26 -42 120 -205 188 192 -101 53 46 59 -18 96 145 115 55 -11 -63 30 -13 -69 28 157
2384 157 199 174 -17 238 -17 62 72 170 -85 -8 -85 -41 7 94 45 21 -2 160 97 -55 -28 22 -64 56 -147 -61
2410 -61 -77 35 67 9 -46 -205 14 17 10 -204 -52 -47 178 -66 16 -4 -3 58 23 10 -175 -64 -28 -53 88 17 -25
2437 -25 148 -66 -98 -120 -94 113 -51 97 -97 4 -175 -55 -20 -43 -141 -5 -13 46 54 13 38 12 -207 -95 52
2462 52 -122 -9 54 71 95 39 50 -14 -24 41 128 2 44 -62 18 100 -205 -99 -105 50 -24 64 41 112 67 -17 25
2489B5q4K3J60k36J76j6o1o0J02J05p9k0j02R1K5J79n8k39K03K4j37l2j02P5L1
2514gN0j80R7J19J9j22q8O0J18K0k6K3j16K45k40M1j14J25J03j56J3J52j30j36
2538a30M2O6Q1q9m7R7R3p4o8J17J39k80j5R1p8r6J45LL9j04M2J63l13Q5L2p7K76
2565A40ll01J08j3J2q3J21N6r2J02o4k9p3K0K0n8J47P2K5k12l3rO9N7J7o4r9J79
2593A2j17K02j39J97j38R0J9k7m0j58Q6j53J91j7j6MP7l5K5o3l6J21j98J30J55
2618A72j03j53J67j03p9L4J35j46K48n8q5J16k57J85L6j54J13j9K5o2o8o4J24
2641Dl4R2q7R1j33L2J57l07J99n7O6j05J03o8J50q9o8OJ20j16K1J15p3q4M4r9
2667a20N2J0r7L5L43l36K21P0j73k3J1J09k83J82j71J31J51j59J13q1M4j25k3
$$ plain form
2489 25 -59 -36 124 -112 64 48 -13 -73 29 134 55 35 -67 24 49 228 170 -69 134 158 21 -11 -113 -38 -7
2514 -7 43 -137 -40 79 98 -24 -112 -52 66 86 60 83 -33 212 -28 13 -101 24 127 -29 -16 136 6 -130
2538 -130 -88 -22 59 -30 -77 20 113 39 -29 88 227 -53 -68 23 -55 -151 -6 -3 36 -68 -26 137 -176 -91 -59 -136 140
2565 140 137 -164 -56 -69 -57 -140 -19 37 -55 47 -17 -46 -119 -99 -79 -137 10 82 107 -105 -138 -147 -78 -21 -4 -68 -167 12
2593 12 -105 97 -42 155 17 107 126 99 59 -99 -13 -166 25 8 -8 -4 73 38 63 0 -36 85 -113 17 172
2618 172 69 -84 83 -20 -99 -65 70 -76 172 114 29 145 -112 73 109 -45 68 49 74 12 -56 -120 4
2641 4 -30 62 -25 66 -67 -35 122 -185 14 -43 23 -82 21 -47 103 14 -54 -48 72 -44 -23 92 19 -65 -21 -120
2667 -120 -68 -58 -155 -120 223 -113 108 178 5 -18 -7 102 -181 1 -170 -39 112 -47 66 -15 29 -96 -119
2690a19K4j4J08j04Q1j2l9M2n6P0j12Q4l5L1k7JR8O0j39P0MN0n5n7M9J06k1p6
2718A2M5p9J41q5j0n6L2J12n5j44J43P3k40J18j06J70k36J94j95M21l28J57n9
2741B5Q7j29JR4j51R2j36Q1m4J16l7n1J23L2l3j12J6P8k0J19k70J12Nj04J96o3
2767B7m2kJ5K04k28J9N4o1J24q5J2jm4m4J33m2j63K58o4KR2k66rJ18k5J28j44
2794c4l1O3j80L03k7p7P9j61OJ05j66J49K0J01k07mJ56j65K5nJ46nk6o1O0j16
2820e2k6J69j11J78k31J01j86J11k4l2O8k0J07J4j4j39P9J54o5j11j67J27O6J4
2844A0j8j98J63P3l6P4m2o0K17k01m4O3j57J81j3J00j94K75q6j62K11j70J06j24
2868c2J4m0R6M1pO4k49J22J75m8n5N4j19p5j07K28lj6j6M0m9o7K2k4J69j49K65
$$ plain form
2690 -119 -95 -109 -1 -105 -24 -36 -75 -33 -89 -19 -131 -47 -82 -51 -78 -77 21 81 -58 12 16 66 11 -46 3 109 88 12
2718 12 57 -22 119 34 24 -32 0 112 57 -87 56 129 -111 7 -99 71 -165 29 -166 255 -73 84 25
2741 25 112 -17 -16 78 -73 19 -117 -36 -80 36 -1 -52 71 103 70 -42 -26 52 32 151 -119 -7 -2 -106 90 27
2767 27 -15 -17 -2 202 -26 -7 47 -14 110 25 37 36 -8 -52 81 39 -124 134 70 72 164 -102 -111 7 -18 110 -34
2794 -34 -65 -2 -182 121 94 17 96 -65 -59 46 -120 29 49 150 -57 -61 95 -70 -45 -50 96 91 65 4 64 -52
2820 -52 -78 91 -20 158 -73 28 -158 -47 -71 -103 -35 -55 52 66 52 -87 -8 146 81 -30 -197 -70 -4 10
2844 10 -8 -206 -43 30 -6 68 26 -34 183 -18 -62 1 -156 25 12 112 -82 193 107 -55 156 -14 92 -32
2868 -32 -18 -58 38 79 72 136 -113 9 184 136 81 135 16 -59 -166 62 59 43 27 67 18 -49 -27 -51 118 -31 234
2895B34j83j1o3k9J1J7P4K6j72J15K1j05Q7Q1j22LJ34j52o2p5R4n6K70k68J40
2920IJ19r0j17J85k11k7J67K0m1J94j60Q0j2j76M8Q5n4P4K1l4q3OL7j92J80j13
2946h5L2J1J80j57P0j52L75k47l4L4J10j14JP8k53O9n1J98K2J6j89R3N3m8q7J5
2972f0Q1lj21J99m1j07Q1o4m5R5p4J34j5n6J01l1k8m7m3J09j40n1J67j70L3R0
2998fo4P6Q2J0j66J87j69J41n1l8p9P5N7K3j28J43q8R9j59J31j06O1J20k65J61
3023D7j66k8J42q1M8NK4M3m7m1O7J1O2K7j21j5J47m8j24J51j33k2J88j28ok0M4
3050B6J4MR6l8j78K12k23J31k8n1R8m5p8P8L5%q7J83p3k9n2L4j05l2O6J24j53
3077g1M1N9j3k5J03mj39p2J3Q4m1J51P5q2n1Rj87P0J79O1k59jJ81%J12k30K15
$$ plain form
2895 234 51 40 -23 -52 -41 -24 50 76 -96 19 40 -65 22 103 -19 -16 118 -34 -96 -171 -77 -133 137 -131 9
2920 9 128 38 -79 106 -105 -132 35 55 14 208 48 128 116 -60 -12 73 19 93 114 80 -3 3 40 -152 28 -85
2946 -85 -53 -42 138 -19 51 -101 274 27 -7 27 137 23 24 102 -151 -82 -133 65 87 103 -86 7 60 12 -75 -60
2972 -60 21 18 -103 96 55 -52 29 -35 -80 15 -59 75 60 4 105 74 46 -1 -44 65 -75 -126 41 -129 -96 -6
2998 -6 -70 6 88 98 -68 119 -50 91 40 2 -77 -2 55 78 -50 93 5 104 -55 76 -30 31 151 -114 47
3023 47 -119 -147 -5 -86 -38 -33 -9 34 -13 -54 13 24 86 113 -8 -23 124 76 -48 103 -30 -52 136 8 2 -18 26
3050 26 40 44 140 102 -76 136 -87 44 16 -35 63 18 -60 18 53 53 -34 149 76 47 -5 29 -76 -108 -42 82 -71
3077 -71 -30 29 16 -9 94 90 -49 -121 -108 -24 -65 86 161 79 28 37 -150 -80 99 160 -99 -100 81 81 193 -37 178
3104A78p6J40k78oR5o8J83n1k22L8J19N6o7j78J74k8J31m1k27O4J24k64J79R8
3128G3p9J18q8m8J45j63P0O4l2Ko4J41k14l9J79o3K0J27o2j58P4O0k8ln5J66j08
3155C5k61L92k46P2J06j84L2RJ02Q4k33L4m0P7j63K45j27J49l8R8j47j7L3mo3
3180e5J38K1j70l7K46j45j1K9K6Q9j28L6j60J41J7j04M1L0j41J23r2L20l65J62
3204A1L1l4j27J36L4j75J46j14J32j32J39o5L3k96K54P9Q3k53J57j65J91j43j4
3227i2K12j75k4oJ72l4j24L1J37j22mJ06p8K4J44k36n0N5O5L6j0r3qK91k76QQ9
3254C8J4k65K18j1lJ22k11j3J35J16j37k6jL2K2j30P0j8P7N0j38J29j93K72j55
3279fj68J65P4q5mL4j32J99k18K12j46P9m8o1J23JM1J8o9k2J93k73J65r8J46k29
$$ plain form
3104 178 102 242 -36 -42 53 -15 168 117 -105 -67 52 108 41 -137 37 9 140 99 -128 -64 60 -204 -25 73
3128 73 -6 112 24 -24 121 -42 28 92 60 62 -2 139 -75 -114 65 2 22 149 87 -71 3 63 35 32 -23 143 35
3155 35 -226 166 -80 -8 98 -86 -54 -45 57 141 -92 -58 -98 -21 -184 61 -66 83 45 143 -4 -21 12 8 -55
3180 -55 83 104 -66 -103 143 -2 -13 16 42 131 3 39 -121 20 37 -67 -26 4 -137 -14 -106 214 -151 11
3204 11 42 8 -119 17 51 -124 22 -92 40 -92 47 -18 15 -281 -27 52 135 -118 39 -126 65 -78 -92
3227 -92 120 -55 -79 -85 87 53 -71 -40 97 -25 -29 77 -1 23 167 -69 -119 -64 1 37 27 -66 -74 217 -59 -51 38
3254 38 52 -213 5 -6 -9 113 -98 -111 24 140 3 -23 -24 8 30 -100 -30 -48 29 79 -59 70 -123 149 -6
3279 -6 -174 -9 65 -20 -24 10 -122 77 -141 71 -75 4 -44 -105 18 19 60 78 9 -13 180 -93 72 -26 120 -109
3305a09p6K65j49K78j12j22J78q5j17K50k48P6N6p0m3L3j25J71j24J11j33K40
3327A45k52N9K5m3P6J55r6k54K79j08K1J87p0k18N8m9J33p5J12k61J45j3k41M35
3351A50j57Q4n7O9j20J81j45k22K71j4p1n7J12j92J93m4J11j32J84k31O0m5R9
3374B7n1j26L1j3J80l1L2r%LNj49R6n3J4M5M7Jm3P1o8o4p4LK39j63rL3j35J3J68
3405B0kK3q3J69nk38K0J03m7J45k40J58m8J00n9p4O3J08Pk56K25m8j21Q1J48k45
3431i6K35j16j01N3J17p2n7m1J28j42P3m7J9J13J2j46J13j27L9L6j15J09r0J62
3455E9j22J42o4qlk3m6mJ08k3J51k76P0rK6L5q9J07P8m5m6J5p3M0j0K2K4p5Nk
3485c6K8k3J20m9j16J12O1r5J56j25r4N0J09Lk30J16m1n7J68j82O7J32k59K53
$$ plain form
3305 -109 -185 80 -69 209 97 -25 153 68 -49 201 -47 29 85 15 -28 5 -120 51 -73 38 -95 145
3327 145 -107 -48 -23 -66 10 165 69 -185 94 -14 7 194 124 -94 -36 -85 48 -27 85 -176 -31 -44 -285 150
3351 150 -7 77 20 89 -31 150 5 -217 54 40 -31 -88 24 -168 25 -19 92 -40 144 -87 -27 -72 27
3374 27 -24 -150 -119 -132 48 17 49 40 40 43 48 -101 -5 -58 -44 1 48 49 6 77 9 -55 -129 -126 113 -50 -59 -26 -161 -148 20
3405 20 18 41 -42 127 122 -116 -96 7 -40 105 -135 23 -25 75 16 -58 5 113 120 -136 89 41 -80 1 149 -96
3431 -96 139 23 -78 -25 92 20 -37 -78 50 -92 -19 -66 -47 66 78 -68 45 -82 -43 -7 -122 -13 -103 59
3455 59 -63 79 15 7 4 -19 -65 -69 39 16 167 -109 -39 -48 -22 13 -76 31 109 64 18 33 -40 0 -10 12 36 -39 -34 -36
3485 -36 -8 -31 89 40 -76 36 97 2 158 33 -61 -11 98 101 -129 -13 -54 -111 57 -125 -58 74 -185 68
3509F8q5K2j09J9J57j25M4j07N9L0K7L4j02J68k28K1J17o0K3q9O2L1j1J03N6k49
3535a24P5J89j50L3n2r9J06N3J09j01n4j06J64j20j12L90k47O1R8l33J27L1K2
3558d0J38j26O6J0lj40K92k28Q0J12k19K41k00L1j4K3j39K69P3k56Q9j03J38L7
3582A31J8j47p3J8O0j80J96j59K03k13K08n2l5N3J08k52K94j29K4m0o4R0j82J88
3606F5%QO5j56j29n6J61q4j16K48rj44J2L7K82j78L2q8j07N1K12p0O9o4j42K29
3632A28k1j17m3J98j35R5k5j39m3J55N4j80R7N7J2j09J17k17K21K2k23L3J3J14
3656F4rm0J2J20j72Q3J7kK3r0o5OJ14j8M5J1l5K6M7M1j87J53j0k1j32J2P0K5j22
3685c4Q9j50R9M2j31Q4j77K71j8q0pm9J50p3J86j75O8j60P6op0J42o5q6m5K0J94
$$ plain form
3509 68 -17 5 -104 -85 72 -53 -9 -116 -57 -27 0 34 -68 100 -128 -107 10 -50 -27 -116 -54 -23 -34 69 125 -124
3535 -124 -49 140 -10 23 -29 -128 -22 31 140 39 -15 -121 43 -77 -189 201 -46 15 113 -220 -93 -62 -40
3558 -40 98 -28 38 48 45 -95 197 -31 49 161 -58 183 -17 14 0 23 -116 153 226 -30 59 -44 94 131
3582 131 149 2 -71 -53 7 -173 23 -136 67 -146 62 10 -25 28 136 -116 178 49 73 33 -31 59 -123 65
3606 65 65 73 138 -18 -147 -203 -42 -126 -242 6 -3 -147 -135 -98 184 6 38 -50 -157 -106 106 36 105 41 -101 128
3632 128 107 -10 -53 145 10 105 80 -59 -102 53 107 -73 24 81 93 -16 101 -116 105 127 -96 -63 -50 64
3656 64 55 15 27 147 -25 58 75 73 96 6 -59 -53 61 43 88 99 64 90 137 178 -9 144 134 113 -19 -7 63 88 -34
3685 -34 55 -95 4 46 -85 -1 -178 93 75 -5 -12 -61 89 16 202 27 95 -65 11 5 -65 77 12 -74 -119 -99 95
3712I5o9o4M8K0k4Q9j71N5%j8k6J27n1NJN6o5k5P3j74R2j36J19K1j02J6P4j3N5
3741Hj18P7L1L0l3j53K27n6r8P6j9j08R6o4N4P7k2j51r4J17R2j23K03l1r8L22
3767B42k90J80l68J85R5j22J11k5J04j09r4J72p4K1k7N3p2J03r8l4M4nJ9m9K1
3792a7J6R6j71L0p9K41l20K27m3k4j7J93j65J14p5k1k4n6J30J5j08n9J87K3j98
3817a05L7R4p7J21j6j42K25j71o2J76P5L8k45L0o4J06K0o8j26%Q4J18r2N0o7l3
3843i4N6j4l3K10J2k68Q3J98j55J60j89l5J22j75J04J07Q0l93L28q0J43Mj60J81
3867A92j74k0q2K3K49j74j37N5N6R4j02N0r7M3L9n9O8L3j83p5K30j11J11j1N3
3892G1k77M40l09J5O6J1o8j52K70p9m9K3o0L9O2k0J57k61R8K8J34O7k20M1P2n9
$$ plain form
3712 95 26 -38 10 30 6 95 -76 -21 -21 -39 -65 62 11 16 17 73 8 -17 56 -118 -26 -162 -43 -22 -124 -108 -34 -47 8
3741 8 -110 -33 -2 28 -5 -158 69 13 -85 -9 -28 -136 -40 -104 -50 27 5 -146 -240 -123 -31 -154 49 18 -80 242
3767 242 -48 132 -236 -51 44 -78 33 8 112 3 -91 81 7 28 1 54 -18 85 -13 -47 -3 -8 11 -38 -17
3792 -17 -1 95 -76 -46 -125 116 -204 23 -20 -44 -61 132 -33 81 6 -15 -39 -95 35 50 -58 -117 70 93 -105
3817 -105 -68 26 -51 70 54 -88 137 -34 -96 80 155 193 -52 -22 -86 20 40 -28 -154 -154 -70 48 -44 6 -61 -94
3843 -94 -38 -52 -85 125 137 -131 -48 150 -5 155 -34 -69 53 -122 -18 89 169 -224 104 24 167 171 11 192
3867 192 18 -2 -84 -61 188 14 -123 -68 -12 82 -20 30 -67 -24 15 -44 24 57 -126 -201 29 -82 29 18 71
3892 71 -206 234 -75 -60 6 17 -51 -203 67 -12 -61 -38 -98 -59 3 -17 140 -121 -23 5 139 206 -14 27 99 40
3918D0K7j11k3J3J00P6j93J55l7o4J46j08j4p7r7O8j6J62q1lj08K16j54O0j1k5
3944e9J02m8J0q1l5L10l08J80q0J29p0J3Q3k45K00l22J99Q9o3j84J93r6K18j74
3968c9O5L8o7J50l18K42P7p8j87J8M6J9O5r6J98l8j12j8QJ09k13J22L1j61J3M4
3994h2P1j3J11k15J39r9JN8O0J09j96M2J59M1j53r8O7j23N4J76j2j37K71k01K9
4019E9o1O5nJ3p7J35j07J47k80N1J13K0N9k21n1J52r1P9O7k5K6j0L3j10R9mr5
4046a9m9J01L6p7k11L04M7k94J52j9K1j30K00q0l3L4J4j20J98J14j57q7M4k9N2
4071A2Q1L4l19J68N4n9k8N1J53j14O9o5P5j46R3p6J62j68K8L0K7j07m8M8N1J7
4097B3n4r1J34K2pj6p2L3j3o4j0j62J83N9J54o2L2o9m1P1j6k23l8L40j47rm1R0
$$ plain form
3918 40 67 -44 -67 -54 46 122 -71 84 47 -17 129 21 7 -70 -167 -99 -115 47 -34 -37 -145 71 -83 -23 -34 -59
3944 -59 43 -5 5 -76 -111 199 -109 71 -9 120 50 63 146 -99 101 -221 -22 67 4 -180 13 -83 135 -39
3968 -39 26 64 -3 147 -171 71 148 70 -117 -99 -53 -34 31 -65 133 95 -17 -35 -27 82 -131 -9 22 -139 -126 -82
3994 -82 -11 -24 87 -128 11 -88 -87 -29 31 140 -56 -14 145 186 33 -65 2 -121 -67 109 97 -40 231 30 59
4019 59 -2 63 58 71 -6 129 22 169 -111 -60 53 73 132 -89 -140 12 -79 0 67 42 68 58 91 -19 80 76 -19
4046 -19 -68 33 69 -8 -219 85 132 -162 -10 -29 -8 -138 62 -18 -51 -17 -3 -123 75 189 32 -55 -11 -40 12
4071 12 93 127 -192 -24 30 -29 -57 -6 147 33 102 37 112 -34 59 -17 145 -23 5 35 62 -45 -93 -45 6 23
4097 23 -31 -122 12 34 27 11 -61 -28 -41 -105 -115 -277 -94 -35 119 57 89 20 -21 50 34 -189 -227 113 -34 -43 -84 6
4125Fj34J05K6o3J31M3J8k02J45K0j40Q3O8n4k8N6j31O4n9M5J19k26K26j90M5
4150b7q9j31K09J09o9k0J88j58R2O2j06j4j57K29J9j8J04m22J81Q5r8o5J62j02
4174c6K6n2o9K00p9J3J11k75L15j63P9N9j35p8J98n2q2R2nkj41J53j08L6l5l4
4200f4J59j28J28j26L6j03J05J9j28J08N4j9r4j1J6J81k06J39n5K2M3m8o6m6L7
4225d7J05j13J12k22J72M1j79J90r5J9j50K19j53K53k41P9J26k28K35r7q6J39
4247G9j37J3J68J1o7Ok01K87j95nJ17J6m0j16J11N2k4q0K0o6N4q9J89k15J36k3
4273AP0m0p9nJ62p7j6l8J4J9j41K01M3q8N1Qn6r5J35l2j69K04lj17N1j91R1O3
4301c4J72j68Jl4O6O4j01J37j99J54%j24J57j15L8P5j66K43j64j01Q1k5J38k9
$$ plain form
4125 6 -128 -23 3 -60 71 114 132 -70 75 95 -45 38 106 52 24 80 -51 13 -46 -1 118 -108 118 -72 -27
4150 -27 -116 -247 -38 71 2 -18 170 12 104 166 60 46 -111 118 137 119 223 -199 -18 67 -31 -96 66 -36
4174 -36 -10 -62 -131 69 -10 3 114 -161 154 -9 70 129 -6 -84 114 62 -20 72 67 65 -76 77 -31 5 -30 -64
4200 -64 95 -33 95 -31 5 -98 7 26 -102 6 60 41 -53 -64 -48 133 -73 66 11 33 76 28 -38 -84 -47
4225 -47 58 -55 57 -165 7 48 -131 59 -36 -17 -167 52 -101 152 -89 -10 116 -112 123 26 -60 79
4247 79 -58 -45 123 134 67 73 -128 159 -36 -41 76 92 52 -64 47 99 75 -5 15 -51 3 -86 103 -112 24 1
4273 1 71 31 -48 -53 109 32 16 -22 -8 11 -130 71 114 26 77 85 29 -66 69 37 -132 72 69 -48 3 -188 -97 -34
4301 -34 138 -30 -29 -63 3 67 -34 103 -96 58 58 -66 91 -24 14 89 -77 166 2 -99 -18 -43 95 66
4325F6J2r7j47J23k21J70J24O8o7nN2j22J02j7q2J70r5n8R7j61L1J24r9K22j73
4350A7k3M8l5Q3m3k4Jk0j19K0J11P4K2l9K2j03M8J13j36J02j86L8J62n9j04K7
4376cP8j95Q4J15r8l0J27k6k08K29j58J95j30r5J54J8j20O8q6J22o4J63Nj79J23
4401H9j04%N9l1J7m7n4K10j59nj7P5J6k17R3P2l0J14q6P3J1j04j4j35J09o5K31
4428A01k05M1K2J05q9n0L3n9M3Q8pj12J36j19J34j76J00nJ36K1l10J54K63k68
4452b3j2P1l3j00K39O0o0l9j13O0j04Q2q2j9J47ql7N8j09Mol2O4j3P9o1np0M2
4481b0J31n4j89P7K1m2J04l9LM1p5O1R7j19l0Q2k8J32j05j16R4P9j95J38o6kL7
4508A7r5M2J4m1k3J28P0k22J11l1l7J69j18o7N1J79j28J74j70J13j31m9O4o8q
$$ plain form
4325 66 78 -19 -166 -43 -264 -94 30 98 31 26 78 -44 58 41 -41 129 34 -24 73 -88 -57 67 -32 190 17
4350 17 -6 42 7 90 47 23 24 4 -115 -95 16 90 112 73 95 -8 40 153 17 119 -67 -29 133 74 -30 -3
4376 -3 75 -120 -36 79 -19 -49 78 52 -156 73 -85 110 -20 -115 39 57 -63 5 -81 41 -23 140 145 -34 89
4401 89 -15 -15 44 13 30 -17 -71 139 -20 -25 -42 33 49 -168 -75 -3 -33 81 -5 68 79 -25 -39 -174 -65 -130 101
4428 101 -104 -63 -41 64 -25 -75 -42 -101 -58 30 23 -89 47 -72 62 -114 -14 -19 117 138 -172 -18 245 -23
4452 -23 -35 36 3 -97 142 202 142 103 -10 50 -54 28 -54 -73 74 66 29 87 -22 -18 -24 -56 8 -5 74 13 8 -62 -20
4481 -20 111 57 -132 -55 -34 -76 28 -11 -8 33 -42 19 116 -3 -33 49 21 153 48 -68 26 105 -90 48 -18 -20 17
4508 17 -78 -36 -22 -63 -86 42 112 -110 1 -30 -67 102 -16 -83 -32 147 19 193 23 136 5 -44 20 -48 -56
4533e6J29rj56j6J65r5J55or0j67J65pJ22j19n0J7j24J16J14q4j68J63r9j1J35
4558B4R9K6j86l0m6J7K30m8l8l8r0J09J1q4r4J41J16j03P9K2r9q0L07j31J9kJ36
4585B67j63j14n5P0P4J95l49N0O6J33k57K9N8r9J64j04R7j16O0j01NJ68j85J39
4609C2k6MK19k87M9J94k41J8j9J55j09M4p2M3R4k1Q4q7m4j37K9j32J11J61o4J05
4635A03j02j7l4L3J00j11L4o3P1o9k2j87K12nR6l7J04j42j40L01j42m2P2J05k51
4660a33Q8K02J6k61J27n7N6J1j96J62J7j42J17j73J29M1J34l9r9o7K05j19n1j70
4684b02J76Rq7J08J41k31J35J1o9P9m7J73k08R8j75J43K2L1j57K2N0j02N9N1o
4709B4Qj6J5Nj7j0o0J31k20J67m2P6j12J94j39J31j82o9O1K5K44l79K94j51P5
$$ plain form
4533 -56 73 64 -92 -108 57 -38 117 111 21 -146 19 12 134 15 -35 -18 -142 -26 88 4 -164 -1 -100 -111 24
4558 24 123 149 -37 -67 -113 -96 134 86 48 10 -80 29 40 -44 -138 3 119 16 95 117 18 -62 245 114 133 131 267
4585 267 104 -10 -65 5 79 274 -75 -25 41 174 -83 -54 4 -95 69 -35 62 -54 6 -95 -90 78 -107 32
4609 32 6 10 229 -58 -9 185 -56 -38 -57 98 -11 33 -39 4 98 77 161 74 30 -107 -78 -210 -99 62 -2 103
4635 103 1 -16 -50 -17 83 -28 6 -57 14 -55 -77 -264 -52 -57 39 2 106 -36 -176 125 -17 -59 13 118 -133
4660 -133 -45 157 173 -88 39 -18 38 49 -147 15 32 -110 7 -166 -37 4 138 99 0 -67 138 19 -32 -202
4684 -202 -26 -17 -104 4 145 -86 49 60 -9 70 23 196 -12 86 -89 54 76 107 -50 -28 22 -80 -21 30 24
4709 24 32 16 31 36 19 9 -51 80 -140 27 -15 61 -51 143 4 135 -47 -116 -55 -30 214 -165 129 -22 53
4734E3j32P5M3k26M9J72r9k2J14L5j05l1oR1j5j23J08OL2j52K85K4j6j80L1J33
4760A44j93l6J92r9Q4n8k1n0p1J02o2o4N5K3O9k00K31j79j7J55p3N4j89J71L1
4785aO3m5j0j55J48N0J11j85M5p4j8J67J4r4o0J43j6j00k7J96j55J68k95J97j4
4810E3j9n0q9N3L9j86J71M1j16J80j96N5R3P6j61k3m6J35q1R3m8Q4PM9j69J95
4836A40j25o5J44j16%K60j29j15L4M0p4k4j12J33O8M8j8K1j07j16P0mJ36Q7j93
4861a7j20K43j38M1m4o7Q7r5J14k7j98K95q1J9k1LML2po0J43j97K0N4q6J61m1
4888A7m2J1K5o5M1N3N2j85J58N6k06J49l3P0j93N8R1L3n5j33P1j53J74Q4Q1k58
4914i9J72N0l05J64J23j86J07k5j11J84q1r2O4Q7j17R6j27J73j78M3O1M3j0j10
$$ plain form
4734 53 -79 -4 39 -187 -138 34 -65 -87 27 62 -43 -74 -80 11 -4 -127 -19 -13 19 -133 152 176 160 -20 11 144
4760 144 -49 -85 107 8 92 34 13 -37 -108 -6 -68 -132 -77 -54 15 -185 46 -133 -150 5 -68 -14 -203 -32 -1
4785 -1 62 17 7 -148 0 50 161 -24 21 -53 -71 96 110 16 -44 99 83 -17 -44 152 -3 165 -130 67 53
4810 53 34 -16 -105 -52 -13 -199 -28 13 -103 77 -119 -64 29 105 -56 -79 -125 10 -71 22 -26 58 65 114 -55 140
4836 140 15 -50 94 -22 -22 238 109 -6 28 68 -6 -30 -142 -9 59 107 89 110 3 -113 -43 -47 89 176 -17
4861 -17 -137 106 -32 9 -35 -102 -15 -110 4 -23 -221 74 -7 12 -9 -6 -2 30 23 -37 106 -91 -71 -17 -103 58 17
4888 17 -25 -14 11 -54 -13 40 92 -93 65 121 -85 64 31 101 -92 -34 57 90 35 -98 -27 -180 -6 78 159 -99
4914 -99 73 123 -182 -18 105 -81 26 1 -110 74 -7 -99 -35 52 -65 31 -96 77 -101 -58 3 46 36 -74
4938g4K74k13l0k4L1J80n9p3K3J9jj38J82q3k1r5J73j76R7K4k9k6K00j51K6J14
4964A50j19J56l07K08k49K56j13J61K3j49p0J41j50J00l9L3%l8O0K7k0j07RjQ7
4989D9QO6k07J35l5Q1Kj05j36K37k09J53o7N0N2j54J75l6j62J56k26J21J21o6
5013CK7j22J84j00O6r3j29J22n3N9m7O8N5q9O9n8P4R9o1Q0l29K75o8plMm5K5j71
5042a65L01L1k67J00m6n7J8P6k8n8n4K04K2j52J77o3l4J52j87K8J77j97j69K96
5066A05j0j38J13L3m9j41J76j78N1j12K26mL4j09J28j21n3J71m5o6N4p9r7o2K65
5091I2m8K2k04J61p6l6J35N7m6J5j00O5n7j9m6K5P2J33j07M9j61J33p2j02K29
5116A14n7q5j1o4K11j58N4K0Q6k43J74j15J60p6K8m8k4n9QR7N6j5Q5j90R5n3O7
$$ plain form
4938 -74 200 -13 -43 -67 -36 144 85 12 35 54 53 -85 97 14 -7 -102 71 -105 -8 16 -13 -39 161 10 36 150
4964 150 31 187 -120 88 -161 95 -18 143 166 17 -53 88 -62 38 -1 32 32 -6 54 81 61 -46 -37 -38 49
4989 49 57 123 -84 51 16 97 99 -6 -142 95 -114 39 -28 22 74 -80 95 59 -103 53 -173 -52 69 3
5013 3 30 -92 92 -8 58 -35 -164 -42 -95 -36 -83 -15 40 -49 20 -38 36 135 74 154 -175 100 32 25 22 26 -19 6 -165
5042 -165 136 167 -100 0 -46 -103 -85 -9 -37 -95 -149 55 77 -75 102 39 5 157 -30 -2 175 -22 -191 105
5066 105 95 -43 70 103 54 -87 89 -89 -38 -150 76 72 106 -3 125 4 -49 122 77 11 65 -14 -111 -173 92
5091 92 44 66 -138 23 -53 -89 46 103 57 72 -28 37 -20 -39 -85 -60 12 145 38 87 -74 59 -13 -115 114
5116 114 57 -28 -39 -103 108 -50 4 24 110 -133 41 -74 86 10 38 -10 -34 -93 -85 12 68 53 138 -52 43 -10 57
5143E7l7j20K22j33j14K74j15m1r8O8k7J43j85K04j08l56M26j07R6j32J74n9P5
5166A07q0n6O0j4L1j47L09k50J39j94P8K7q2J02m5j20J32N4j5J39j99k9J23n3
$$ plain form
5143 57 20 -100 122 -11 -125 149 34 -7 -105 -37 -64 79 -106 98 -10 -366 60 -47 49 -83 91 32 107
5166 107 27 -29 31 17 48 -99 210 -40 99 -95 -17 10 -72 30 -15 -135 -3 51 36 175 -24 -53 70 17
$$ [...]
8191A61
##END NTUPLES=NMR FID
##END=
