##TITLE=1H_Pr 5148-25
 CDCl3
 8 sc, 
 25.1.2023
##JCAMPDX= 6.0         $$ Bruker NMR JCAMP-DX V2.0
##DATA TYPE= NMR FID
##DATA CLASS= NTUPLES
##ORIGIN= UXNMR, Bruker Analytische Messtechnik GmbH
##OWNER= root
$$ XWIN-NMR		Version 3.5
$$ Wed Jan 25 16:34:09 2023 Russian Standard Time (UT+4h)  she@DPX200
##.OBSERVE FREQUENCY= 200.13135
##.OBSERVE NUCLEUS= ^1H
##.DELAY= (6, 6)
##.ACQUISITION MODE= SIMULTANEOUS
##.ACQUISITION SCHEME= undefined
##.AVERAGES= 8
##.DIGITISER RES= 18
##SPECTROMETER/DATA SYSTEM= spect
##.PULSE SEQUENCE= zg30
##.SOLVENT NAME= CDCl3
##.SHIFT REFERENCE= (INTERNAL, CDCl3, 0, 15.7039)
##AUDIT TRAIL= $$ (NUMBER, WHEN, WHO, WHERE, WHAT)
$$ ##TITLE= Audit trail, XWIN-NMR		Version 3.5
$$ ##JCAMPDX= 5.01
$$ ##ORIGIN= Bruker BioSpin GmbH
$$ ##OWNER= she
$$ F:/spectra/data/she/nmr/H-F/1/audita.txt
$$ ##AUDIT TRAIL=  $$ (NUMBER, WHEN, WHO, WHERE, WHAT)
(   1,<2023-01-25 16:33:00.09 +0400>,<she>,<DPX200>,
      <created by zg, POWCHK disabled, PULCHK disabled
       configuration hash MD5:
       00 E9 B6 7A A2 85 ED C7 34 08 36 98 17 FE 4E 26
       data hash MD5: 16K
       2A 4E 7F E8 E8 90 83 26 77 98 CA 6B 1F DC F5 C4>)
$$ ##END=
$$ 
$$ hash MD5
$$ FE 44 82 CB 67 6E A2 9B 55 0D 1D 6A FA 48 56 16
##$RELAX= 
##$RELAX= 
##$RELAX= 
##$RELAX= 
##$RELAX= 
##$RELAX= 
$$ Bruker specific parameters
$$ --------------------------
##$DU= <F:/spectra>
##$EXPNO= 1
##$NAME= <H-F>
##$PROCNO= 1
##$TYPE= <nmr>
##$USER= <she>
##$AMP= (0..31)
100 100 100 100 100 100 100 100 100 100 100 100 100 100 100 100 100 100 
100 100 100 100 100 100 100 100 100 100 100 100 100 100 
##$AQSEQ= 0
##$AQ_mod= 1
##$AUNM= <au_zg>
##$AUTOPOS= <>
##$BF1= 200.13
##$BF2= 200.13
##$BF3= 200.13
##$BF4= 200.13
##$BF5= 200.13
##$BF6= 200.13
##$BF7= 200.13
##$BF8= 200.13
##$BYTORDA= 1
##$CFDGTYP= 0
##$CFRGTYP= 5
##$CHEMSTR= <none>
##$CNST= (0..31)
1 1 145 1 1 1 1 1 1 1 1 1 1 1 1 1 1 1 1 1 1 1 1 1 1 1 1 1 1 1 1 1 
##$CPDPRG= <>
##$CPDPRG1= <>
##$CPDPRG2= <>
##$CPDPRG3= <>
##$CPDPRG4= <mlev>
##$CPDPRG5= <mlev>
##$CPDPRG6= <mlev>
##$CPDPRG7= <mlev>
##$CPDPRG8= <mlev>
##$CPDPRGB= <>
##$CPDPRGT= <>
##$D= (0..31)
0 1.2 0 0 0 0 0 0 0 0.06 0 0.03 0 0 0 0 0.0002 0 0 0 0 0 0 0 0 0 0 0 0 
0 0 0 
##$DATE= 1674649979
##$DBL= (0..7)
120 120 120 120 120 120 120 120 
##$DBP= (0..7)
150 150 150 150 150 150 150 150 
##$DBP07= 0
##$DBPNAM0= <>
##$DBPNAM1= <>
##$DBPNAM2= <>
##$DBPNAM3= <>
##$DBPNAM4= <>
##$DBPNAM5= <>
##$DBPNAM6= <>
##$DBPNAM7= <>
##$DBPOAL= (0..7)
0.5 0.5 0.5 0.5 0.5 0.5 0.5 0.5 
##$DBPOFFS= (0..7)
0 0 0 0 0 0 0 0 
##$DE= 6
##$DECBNUC= <off>
##$DECIM= 32
##$DECNUC= <off>
##$DECSTAT= 4
##$DIGMOD= 1
##$DIGTYP= 9
##$DL= (0..7)
0 120 120 120 120 120 120 120 
##$DP= (0..7)
150 150 150 150 150 150 150 150 
##$DP07= 0
##$DPNAME0= <>
##$DPNAME1= <>
##$DPNAME2= <>
##$DPNAME3= <>
##$DPNAME4= <>
##$DPNAME5= <>
##$DPNAME6= <>
##$DPNAME7= <>
##$DPOAL= (0..7)
0.5 0.5 0.5 0.5 0.5 0.5 0.5 0.5 
##$DPOFFS= (0..7)
0 0 0 0 0 0 0 0 
##$DQDMODE= 0
##$DR= 18
##$DS= 0
##$DSLIST= <SSSSSSSSSSSSSSS>
$$ [...]
##$SUBNAM2= <"">
##$SUBNAM3= <"">
##$SUBNAM4= <"">
##$SUBNAM5= <"">
##$SUBNAM6= <"">
##$SUBNAM7= <"">
##$SUBNAM8= <"">
##$SUBNAM9= <"">
##$SW= 18.05172834244
##$SWIBOX= (0..15)
0 0 2 0 0 0 0 0 0 0 0 0 0 0 0 0 
##$SW_h= 3612.71676300578
##$TD= 16384
##$TD0= 1
##$TE= 0
##$TE2= 300
##$TE3= 300
##$TEG= 300
##$TL= (0..7)
0 120 120 120 120 120 120 120 
##$TP= (0..7)
150 150 150 150 150 150 150 150 
##$TP07= 0
##$TPNAME0= <>
##$TPNAME1= <>
##$TPNAME2= <>
##$TPNAME3= <>
##$TPNAME4= <>
##$TPNAME5= <>
##$TPNAME6= <>
##$TPNAME7= <>
##$TPOAL= (0..7)
0.5 0.5 0.5 0.5 0.5 0.5 0.5 0.5 
##$TPOFFS= (0..7)
0 0 0 0 0 0 0 0 
##$TUNHIN= 0
##$TUNHOUT= 0
##$TUNXOUT= 0
##$USERA1= <user>
##$USERA2= <user>
##$USERA3= <user>
##$USERA4= <user>
##$USERA5= <user>
##$V9= 5
##$VALIST= <valist>
##$VCLIST= <CCCCCCCCCCCCCCC>
##$VD= 0
##$VDLIST= <DDDDDDDDDDDDDDD>
##$VPLIST= <PPPPPPPPPPPPPPP>
##$VTLIST= <TTTTTTTTTTTTTTT>
##$WBST= 1024
##$WBSW= 4
##$XGAIN= (0..3)
0 0 0 0 
##$XL= 0
##$YL= 0
##$YMAX_a= 182650
##$YMIN_a= -204306
##$ZGOPTNS= <>
##$ZL1= 120
##$ZL2= 120
##$ZL3= 120
##$ZL4= 120
##$ABSF1= 10
##$ABSF2= 0
##$ABSG= 5
##$ABSL= 3
##$ALPHA= 0
##$AQORDER= 0
##$ASSFAC= 0
##$ASSFACI= 0
##$ASSFACX= 0
##$ASSWID= 0
##$AUNMP= <proc_1d>
##$AZFE= 0.1
##$AZFW= 0.1
##$BCFW= 1
##$BC_mod= 2
##$BYTORDP= 1
##$COROFFS= 0
##$CY= 11.3945322036743
##$DATMOD= 1
##$DC= 2
##$DFILT= <>
##$DTYPP= 0
##$F1P= 2.36226072786647
##$F2P= -0.459571619588291
##$FCOR= 0.5
##$FTSIZE= 0
##$FT_mod= 4
##$GAMMA= 1
##$GB= 0.15
##$INTBC= 1
##$INTSCL= 1
##$ISEN= 128
##$LB= 0.24
##$LEV0= 0
##$LPBIN= 0
##$MAXI= 10000
##$MC2= 0
##$MEAN= 0
##$ME_mod= 0
##$MI= 1.114404
##$NCOEF= 0
##$NC_proc= 0
##$NLEV= 6
##$NOISF1= 3.799351
##$NOISF2= 2.8
##$NSP= 1
##$NTH_PI= 0
##$NZP= 0
##$OFFSET= 15.70392
##$PC= 1
##$PHC0= -19114.25
##$PHC1= 14.00079
##$PH_mod= 1
##$PKNL= yes
##$PPARMOD= 0
##$PSCAL= 0
##$PSIGN= 0
##$REVERSE= no
##$SF= 200.130013532006
##$SI= 16384
##$SIGF1= 3
##$SIGF2= 2
##$SINO= 400
##$SIOLD= 16384
##$SREGLST= <1H.CDCl3>
##$SSB= 0
##$STSI= 0
##$STSR= 0
##$SW_p= 3612.71676300578
##$SYMM= 0
##$S_DEV= 0
##$TDeff= 0
##$TDoff= 0
##$TI= <>
##$TILT= no
##$TM1= 0
##$TM2= 0
##$TOPLEV= 0
##$USERP1= <user>
##$USERP2= <user>
##$USERP3= <user>
##$USERP4= <user>
##$USERP5= <user>
##$WDW= 1
##$XDIM= 8192
##$YMAX_p= 0
##$YMIN_p= 0
$$ End of Bruker specific parameters
$$ ---------------------------------
##NTUPLES= NMR FID
##VAR_NAME=  TIME,          FID/REAL,        FID/IMAG
##SYMBOL=    X,             R,               I
##VAR_TYPE=  INDEPENDENT,   DEPENDENT,       DEPENDENT
##VAR_FORM=  AFFN,          ASDF,            ASDF
##VAR_DIM=   8192,          8192,            8192
##UNITS=     SECONDS,       ARBITRARY UNITS, ARBITRARY UNITS
##FACTOR=    0.0002768,     1,               1
##FIRST=     0,             0,               0
##LAST=      2.2672688,     0,               0
##MIN=       0,             -204306,         0
##MAX=       2.2672688,     182650,          0
$$ Real data points
##PAGE= N=1
##DATA TABLE= (X++(R..R)), XYDATA
$$ [...]
1855c0L42j43k63j7J40J22l94o0L27k07L9p2j80O23o84K31O24q07N04j99K7L33
1877B56m66K43L59o55L44K05l17L88j70j23K64l61K64J16o99O39m61n03P58m99
1897d18J39L16k85L09k66J36J37l42J74K65k04M02m70j0N59j72m09L20Q8L03l71
1918B01k63M09l76k42M44n56J45j29m23Q52k61k3K52j09J16J08k63L63j86m22
1938c63P75j63m51K61JK12k42K31J31l69J07M30p01K54L9p78N60j85j35K00j05
1959b91K66J39k74K69j55j15K80m08M07p3m71O20o6m04L50j86L95m9l24N15k57
1980A68l33L26k96K26J17n46M79k2j54J20l26L15J13l86M07J28m94K82k28J7N8
2001b9m20L14L31k75K17l12K10K62l01K35O7l74L39p5J04N9m83J06Ll95M82r7
$$ y = [-30, 312, 169, -94, -111, 29, 151, -243, -303, 24, -183, -144, -216, -396, 227, -457, -226, 398, -409, 95, -104, -77, 256, -210, 33, 392, -263, 81, 286, -31, 357, 187, 64, 328, -33, 231, 347, -352, 287, -174, -677, 81, -418, -279, 37, -248, 61, -205, -69, 68, -274, -100, 165, -39, 363, -107, -117, 442, 270, -139, 181, 269, 572, 201, -62, 347, -29, -271, 173, -383, -238, -367, -790, 62, -199, -222, 30, -79, 37, 145, -118, 245, 59, -363, 412, 249, -202, 59, 60, 272, 30, 261, 392, 23, 130, 560, -141, 113, 152, -626, -66, -251, -386, -186, -291, -25, 114, -160, 109, -46, -161, 119, -289, 118, 45, -426, 194, 128, -276, 74, -112, 283, 234, -90, 425, 168, -165, 161, -135, 91, 208, -338, 141, 119, -35, 85, -241, 74, 187, -199, 208, 336, -158, 124, -104, -87, -29, -449, -135, 196, -79, 138, -174, 36, 298, -3, 232, 299, -75, 264, 189, 293, 352, -131, -25, -22, -417, 65, -32]
2023c2k96N38n03K04R7j66K37j19k39J63l33K52P63p25O6J97j47P45o72j72N18
2044C76m48j76N46k77R0m16K53N37n66l5k01K59L34n71j79O43o59M18J9k89L61
2065A9o7j12N23m53K45L59l42L36n50j05M12k91L6K41n13J49L63n79N78l70m11
2086e32M33K08j25rm10O77j76p01M88J28j41M76n49O60j70n49O28n06K80j05l3
2107b8L20p4m96K46K51m10K10n0L53j42m24L75r6j90J50n89M76L45o83M40k2m7
2129h5J69k82K54j69k63O85j61l04N11k79j4J43m81N90k93k81L14r6kL0l96L63
2151d7R4k41J1K08R7l26q0M61j05m46N64k50j23K65m1K11%n87O42N7m03N04o38
2174a73K36R2k90J82q9j47L53n30N10K81n30J21r0j20K83m84L84J81m95K65J99
$$ y = [-32, -328, 210, -293, -89, 8, -158, 79, -40, -279, -116, -449, -197, 566, -159, -93, 104, -43, 702, 30, -142, 376, -72, -248, 298, 21, 111, -305, -52, 485, -81, -116, -317, -58, 276, -295, -474, 169, -490, -72, -53, -342, 19, -48, -160, 363, -90, 155, 514, 172, 508, -42, -147, 265, -26, 10, 251, -262, -113, 250, -329, 249, -121, -532, -99, 109, -16, -25, -435, 242, 66, -635, -147, -19, -160, 316, -233, 427, 257, -292, 336, -170, 110, 5, -28, 292, 218, -278, -32, 219, -191, 19, -31, 322, 180, -244, 131, 35, -155, -5, -594, -118, 227, -456, -16, -38, -85, 84, -198, 56, -113, -376, 309, 148, -156, 355, 76, 62, 205, -276, 314, 21, -260, 54, -42, -44, -14, -410, -47, 47, -194, -183, 25, 122, -204, -284, 177, 72, -374, 190, -60, -183, 82, 41, 252, 252, -335, 307, 364, -39, 465, -173, 63, 155, -135, 47, -42, -189, 164, -366, 144, 425, -105, 16, -74, -194, 89, -395, -11, 170, -325, -60, 139]
2195A39m90L22j22L27j5o06L06M28k11l4m35L75n7k00Q4N03j67p6J00r3R6j81
2217gQ5j76oM16m88r4J36j20J35J81r1j13K66K7k40rJ09RO5l01J10J62L06j68
2241A94l55M19n0p0k48K91%j66J3K6j33k22J87k53L08q4j64N36j80j3J74k89K72
2264A93p5r1K71k35q1L98j56K9k13J27K27n29P1J46k85L31m05m80Q48n55O1N0
2286c53j6M05j24j81M54j22L09K8j13Q4k82k94L96Rn2k6K6j34k4J6J21k51o1R0
2310i5k03j54nJ82O4o2J98J51q9r9K83mK93K0n56L16J37m84N1l90K22K90j76J69
2334E9q1r5P9J41q8r5k58J01n9K57j29r7n6M26m71M45O7o8J94j24l1J13n44K99
2358a5j96k74L06j54L9J99J01n9Q7J16r4L89m57L10l26J61j30k20K92J3O0r2r
$$ y = [139, -351, -29, -151, 176, 161, -445, -139, 289, 78, 44, -391, -16, -73, -273, -189, 314, 147, 71, 171, 78, 174, -7, 78, -98, -104, 312, -176, -270, -134, -254, -119, 62, -29, -142, 124, 151, -89, -98, 11, 20, 85, -216, -106, 56, 362, 194, -161, 258, 208, 138, -110, 181, 181, 15, 28, 54, -79, -301, -114, -367, -59, -143, -307, 229, 49, 36, 210, -79, 193, 118, 27, 298, 63, -18, 380, 224, 253, 40, 167, 394, -135, -64, 82, -203, 128, -277, -757, 91, -464, -403, -353, -369, 36, -88, -269, 185, 63, 372, 400, 287, 371, 89, -205, 191, 200, 148, 122, 148, 14, -10, 6, 127, -124, -185, -95, -298, -452, -457, -275, -211, -273, -75, 76, -13, -112, 171, 167, 460, 480, -76, 240, 377, -107, -56, -446, -224, 66, -110, 59, -22, -117, -38, 103, 15, -80, -338, -237, -296, -39, -168, -265, -321, 105, -366, 79, 146, 78, 272, 148, 117, 230, -314, -15, -211, -485, -179, -333, -294, -95, 6, -53, 34, 150, 56, 445, -12, 298, -28, 133, 3, -217, 75, 88, 148, 56, 47]
2381D7K90k31l03J74k55j9L10n97l2L15J20rM16k39L08O4j91L41k98L6j87j63
2403a03J53k32j13M72l44MJ0R0Q9k07J75J22k26K01j24l91L97j79p1M16k47Q4
2425b4L46j60K93J24k84Ok65o2K19k72k44jj4M11j26j64K14K9k86K57j81K78q5
2448Ij70K49j84O3K15o2K30k46p4L92qj67j29m7m5j51k55M22J4k71J28J04L29
2471C46l68q3J52N0J38P2k96j56N3p7K24O5j06J08jj49L93n10J27J21j26m1O8
2494Dk73N36n92J79J19r9k8L59j00j51J47Q7P4m17J84p4K29j99l19K63K02l75
2516b44P4j69Q36l02k85j08L28m06K53o4N3M6k98N37n6j09o7K72P7j25m22m1M48
2539B28n09K02r3j89O17m85L77j43m12L47N06m00l00L1R0L39m63R1N35m86K76
$$ y = [47, 337, 106, -197, -23, -278, -297, 13, -584, -616, -301, -181, -190, 226, -13, 295, 359, 168, 509, 211, 247, 60, -103, 50, -182, -295, 177, -167, -163, -153, -63, 26, -181, -6, 116, -110, 91, -33, -424, -27, -206, -277, 139, -108, -24, 322, 162, 455, 579, 295, 301, 36, -26, 193, -79, -323, -324, -338, 73, -53, -217, -3, 26, -260, -3, -184, 94, 9, -161, 88, -96, -33, 182, 120, 350, 104, 30, 422, 414, 247, 118, 71, 26, -125, -380, 42, 56, -215, -87, 17, 346, -22, -105, 47, 97, 235, 307, 11, -145, -92, -169, 55, 120, 14, 122, 121, -28, 365, -145, -18, 103, -23, -64, 4, -269, 267, -325, -146, -27, -126, -154, 205, 105, -46, 101, 188, 262, -155, 29, -45, 184, -15, -334, -71, 131, -244, -170, -339, 497, 195, -90, -198, 130, -276, -23, -87, -34, 12, -286, 251, 195, 86, 19, 291, 368, 243, -179, -220, 228, -281, -79, -172, -361, 256, -229, 148, 5, -407, -60, 446, 46, -254, -223, -133, 206, -257, -166, 369, -117, 159]
2560A59l19L61p1j93R1k96J90k24M21j81N8L7l5J76k57k06R5N3K18j96j68M61
2582A74j69K0k86K8K09M6l02P45o35l0M53K6q0l23L8J29K6L6j92J27N8k28j58
2605b88L68j65k76K09K04J41k63j29N28l26Q5j84J02L58k05j61j14l9K42m3k17
2626a73M47m81J79J99o4l16L47n5j51m0k30J21J00n1L25k98L9K18j97j98L19k37
2648a97L51j84J33m8r2k5K48m5j89J64k81J88j04J68P6j37J88l96K49j69j14O4
2670a52J1m8M67j70l32K74j99K46J50n75M11K0k5Q3m01N25l39k02J79k5l2J85
2692E1J23o1j71j34J03j14QJ59r4K36r7k04M15k94RK07l20L38J72m96J70N1j03
2715d6J23P3j46Q4Q9k72K69j42j4k34L15N7l07J77k8k5J38j03k74K6k82N16J75
$$ y = [159, -160, 201, 130, -63, 28, -268, -78, -302, 119, -62, -4, 33, -2, 174, -83, -289, -194, -141, 77, -119, -287, 174, 5, 25, -261, -233, -24, 22, -280, 465, -170, -200, 253, 279, 199, -124, -86, 43, 69, 105, -87, 40, 98, -130, -288, 80, -85, -361, -152, 52, 193, -70, -199, 329, 3, 88, -96, 6, 364, 159, -2, -116, -155, 87, 44, -173, 274, -207, -28, 171, 107, -209, 138, 83, -68, -108, -338, -217, -117, -168, 157, -141, -102, 116, -81, -279, 40, -197, 154, -30, 103, 55, -37, -62, 186, 141, -48, 116, -165, 23, -81, 87, 163, 26, 214, -182, 67, -102, -216, -152, -141, -189, 278, 108, -224, 50, -149, 97, 247, -328, 83, 103, 78, 161, -240, 285, -54, -256, -77, -102, -134, 51, 174, 113, -58, -192, -89, -203, -195, -36, -130, 106, 9, -195, 220, -74, -65, 142, -178, 160, 332, -164, 6, 57, -46, 77, 150, 4, 88, 177, -95, 174, 32, 18, -216, 99, 156, -151, 26, -2, -27, 111, 8, -266, -240, -522, -6, 169]
2738A69l68J8k7K65Q0j62J57j41k03J79L1J01K72l97kL05j45qL15l12qk06j1L33
2762B35K1k99K57k81J37j66j06O8O9J69N9k57K16l26J91K42k97q9L55K3l60R9
2784d0J32J69l96L87J34m08k46L3J21K39k9r2p6J8P2q9N4J93l07j45K06j64J02
2807a32L86n52L98j46J36J86m98L38J80k42J92j48K9j59k43M23k39m56P27j03
2827G7KJ88m68L22l85J59J86k49K2M90l57j55J48k08L06L3k87L41j07k49L55j86
2849b2p7k15K40j16N86l23j37K14k37J83o5Q2M0l37K39j83o9K70l35Q2P1r8L31
2872A24M4l67J13q4J93j28L01j4k23J65R6m72M69K8l58P9J86J18k20N5M3p2l39
2895b63M82j19k81O7rK0J98Mk66J44l34K52Q8j0q9k34N89Kn3r2j29j92K45O9j06
$$ y = [169, -199, -181, -208, 57, 137, -25, 132, -9, -212, -33, -2, 99, 371, -26, -28, 277, 132, 124, 439, 127, 119, -87, -98, 235, 256, -43, 214, -67, 70, -96, -202, -134, -65, 104, 163, -94, 122, -204, -13, 229, -68, -157, 198, 221, -139, -40, 92, 261, -135, 252, 386, -22, -268, -235, -114, 125, 96, 4, -72, -54, 18, -71, -17, 176, -131, -276, -70, -234, -132, 254, -298, 100, -46, 90, 276, -222, 116, 296, 54, 246, 98, 127, -32, -275, 148, -91, -547, 180, 77, 79, 267, -201, 121, -264, -105, 81, -168, -146, 344, -13, -168, -20, -228, 78, 111, -176, 165, 58, -191, 164, -22, -99, -314, -74, -190, 396, 73, -64, 150, -87, 96, 31, 113, 153, -184, 55, -128, -197, 73, -262, -180, -109, -207, 124, 168, -199, -86, -170, 23, -105, 196, 182, -41, 124, 220, -252, 217, 245, -113, -34, 152, 270, 50, 105, 148, 76, -263, 219, 100, -181, -114, -123, -103, 95, 99, -167, -23, -357, -105, -17, -27, -116, -350, 239, 241, 188, 96, -33, -225, 20, 89, -17]
2920a7P1j42J37j11P1K38k56k69L64k74R4p6j10M22j30L2R6k49J6K03P1k70j75
2943b64L82m6J05k0L5l58L24k29J40M25l89j49L0J44K9J38n81N81k92M7J16m44
2965b76M00k05j90M7K41l13K33L13l0k64J50j5N2n0o5M3K5j07J21J3k3l05J80
2988b5j20M58m22R1M8j18j18L82l45L02l14n6L98J41m94K06K04l21K21j84Q4Q6
3010A04o8J43J85j66l54J07K7K95m05K4J48j3o3k25L39J09j98l24K52J03nk5J55
3033A45l61QL42j99J18J37j38M2J97o38O40k29j48J92r6k82L61k44R0p0K77lp3
3056F8l6m2p8J65j1Pj99J44J16J73n00L46Ql59M86m92p4K60k42K99k06k19L15
3079g1lJ60L5k9k35J70o4p8J46j50J62l03K44o0p5J01Jq9j9J89n5J51j70k59L11
$$ y = [-17, 54, -88, 49, -62, 9, 247, -9, -278, 86, -188, -94, -170, -280, 142, 12, 44, 140, -109, -93, 110, 181, -89, -264, 118, 72, 177, 157, 192, -166, 158, -71, 69, 494, 105, -44, -14, 130, 159, 297, -284, 297, 5, 52, 168, -276, 124, -81, -271, -224, 17, -296, -63, 250, 220, -44, 106, 91, 143, 93, 28, 71, 96, -11, 110, 123, 100, -205, -25, -145, 313, -109, -18, 30, -88, -206, 176, -169, 133, -181, -237, 161, 302, -192, 14, 218, -103, 118, -66, 18, 104, 36, 179, 364, 198, -156, -49, -22, 273, -132, -108, 40, 27, -36, -261, 78, 187, -11, -335, -83, 20, 15, -10, 145, -216, -208, 134, -65, 53, 190, 52, 94, 291, -347, 293, 64, -84, 108, 12, -270, 91, -153, -63, -133, 144, 141, 68, 32, -10, -88, 77, 66, 73, -126, 18, 134, 307, -193, 153, 161, -198, 288, -204, -278, -18, -260, 39, -167, -386, -71, -74, 86, 121, 92, -143, 27, -37, -115, 31, -119, 43, -260, -16, -76, -151, -50, -49, -138, -157, 32, -23, 128, -42, -301, 10]
3104A0J44k30j49K66p7L1J82J33k40m1R3k56J76n4m2J99J13k58j35J05l8J68k68
3127a68J42r7J97k82J71J37r8N7J41m47N65j61k63K96Ok15M97k89l36L09L2L0
3149B24n96J16M69j43j0o3k06p7K68k82L27nl62J54J57K51l08L52j5p1j37J28
3171A71k83L32k70k78M60j99j32M5j86O0K48k51P36l61o2M3k08L75m40P4r0R8
3193a18J85l00L2K89p3j75J42P4j41L41k17N3j55p9J36l8NQ2j33R3m9k6j49K96
3217G5l69J99K41q1L79l74K1j05j72O9K06J44j52k49K30J16l30k22L84J95K9j71
3239F3m21N38k18k03K17L83l71r9Q6M9k46m8K47k00K07l9q1L01j84K3j50K2J04
3262b0j20r4L21l46L69l23M59l77R2L02j08j40j78J21K2J89m79K22M19k19l92
$$ y = [10, 154, -76, -225, 41, -36, -5, 177, 310, 70, 29, 122, -134, 42, -12, -54, 145, 258, 0, -135, -30, -68, 100, -168, -26, -123, 74, -208, -37, 100, 2, 59, 200, -247, 318, 157, -106, 190, 196, -19, 478, 189, -147, 162, 194, 224, -372, -256, 213, 70, 60, -3, -209, -286, -18, -300, 27, 22, -340, -186, -29, 222, -86, 266, 251, 180, 43, 171, -112, 220, -50, -328, 132, -67, -199, -154, -340, -280, -32, -283, 453, 92, 30, 73, -135, 240, -200, -126, -216, -118, 67, -233, -201, 88, 15, -160, -18, 56, -85, 256, 39, 92, -63, -142, -6, -44, -39, 43, -90, 3, -46, -72, -221, 75, -294, -95, 146, 65, 444, 70, 91, -14, -186, -117, 89, 233, 81, -168, 62, 178, -152, -374, 10, 205, 234, 63, -358, 180, -38, -241, -24, 359, -12, -111, -25, 24, -222, -270, -23, -223, -16, -55, -136, 165, -19, 4, -146, -124, -20, -140, -234, 87, -259, 110, -213, 246, -131, -39, 263, 155, 15, -163, -42, -20, 169, -310, -88, 331, 112, -280]
3283b80K11k97M28kl14M21j81j70L21l79K11L76n95M33j11j03L10n17N07j53j25
3304iJ10j73r2J5mj13J76K18o4j57P6K06j11k04M70n19J53Nj56L51ql69R0J57
3328D8O7k66M0J97K9l27L31j16Q3j55O4J07j8o8J47k43p5J31Q4p8j44m1J47Q6
3352C0k12Q9k1j64K62K3k40K67J16k5j02J39j48p5K16Q5p1Jj21r6K49k66P5K03
3376B14j73k19K9L21k92rQ7K9NPR4j04n6k35L57L8J20n3j40Q8k5k90L23m57K91
3401e0Q5q6J0Q9k37R6p5J01L52l42o0r0P6p1K36j42J30j40M6K78n1j92L19j40
3425A42n1p3M1m1J9l96K30j36K48k59J45k4L51j21j2o9q7N6K33j47k0k66L08j01
3449c0J45L05n34K62j20q6n6Q6O9J5k06M52k69n15J87M64j75J52j63Ol42J82M59
$$ y = [-280, -69, -366, 62, 60, -254, 167, -14, -184, 137, -242, -31, 345, -250, 183, 72, -31, 279, -238, 269, 116, -9, 101, -72, -164, -149, -153, -266, -90, 128, 64, -93, -17, 189, 78, -126, 344, -175, -22, -17, -173, 178, 170, -199, -109, 48, 115, -151, -111, 86, 115, -212, 119, 3, 86, -69, -5, 102, 84, 16, 163, -80, -155, -24, 60, -18, -162, -203, -56, 30, -182, -93, -114, -278, -16, 7, -233, 34, 150, 125, 23, 162, 14, -61, 155, 240, 169, 170, 49, -47, 202, -64, 11, 214, 41, -178, -149, 172, -120, -129, -42, -13, -8, -1, 93, -11, -67, -302, 55, 93, 213, 160, 20, 108, 83, -207, 116, -341, -50, 35, -51, -41, 48, -189, -93, -168, -67, 285, -57, -117, -207, -131, -202, 34, -108, 22, -118, -72, 206, 155, -37, 282, 142, 91, 18, 59, 18, 37, -359, -129, -265, -17, -276, -131, -155, 196, 75, 63, -6, -93, -37, 196, 49, 29, -237, 71, -30, 115, 420, -114, 148, 28, -58, -114, -28, 41, 56, -150, 302, 33, -482, -295, 169, -6, 146, -17, -11, -353, -171, 288]
3472B88jj60j33q1J44n4j62NP0R1j81J4K94l27J65J47o5j11j69o4J22J01o9K19
3496H3k23J1L54j08J1j04j60L73k17j03J72k96J65K42k46K77k18K9J69k78n4j0
3518a31k57L35J43l36K13J33j13QJ07J0q0N0N5m1k54M51k64J67l14j82J67L36
3540B03j80k9K56k85p6K33L9n3j94J33J72m37J74M5R0j88J63n4Q2L93o13J59j40
3563a07K93l42n4J87k20L69r2J21l69K31Ko0J76o9q6J81j19q3P2j65O0MJ0J41
3587H1k7k50J43L67p3l76J10o8K14k83K04j5j13O0j20J20N8j75j5J98rR0k34J59
3611D6M0k11Q8j57oO9J75R7q8k12K81N8k49Q6K18l80M10k97J17l9j06R3qq6J85
3636A24k66m6K91j23j7N5j16K07N9l54Q0K88l63Q9J48lJ7j29K58Jj22r8k2j0j42
$$ y = [288, 287, 127, -6, -87, 57, 3, -159, -154, -84, 7, -174, -160, 134, -193, -28, 119, 54, -57, -226, -290, -168, -67, -136, 83, -140, -129, 225, 117, 128, 24, -136, 237, 20, -83, 89, -207, -42, 200, -46, 231, 13, 42, 211, -67, -121, -131, -388, -53, 90, -246, -33, 100, -13, -5, 102, 112, 32, 82, 137, 96, -158, 293, 29, 196, -118, -300, -133, 203, 23, -6, 250, -35, -111, 122, 161, 108, -86, 47, 219, -218, -44, 1, 91, -97, 66, 12, 94, 487, -126, 33, -107, 186, -156, -210, -23, -243, 126, 34, 155, -214, 17, 19, -41, 135, 66, -20, 161, 42, -41, 31, -134, -74, -70, -60, 81, 54, -196, -53, 314, 241, -135, -25, -93, 121, -162, 42, 27, -86, -26, -146, -26, 32, -143, -158, 40, 31, 121, -113, 46, 86, -125, -37, -194, -200, -131, 44, 141, 53, -159, 122, 180, -69, 17, 235, -145, 265, -32, 85, 46, -60, 33, 25, -61, 124, -142, -188, 103, -20, -37, 18, -98, 109, 168, -186, -106, 182, -181, -92, 56, 53, 70, -59, 199, 200, 78, -20, -42, -52, -194]
3661a94j8J31K14l00L63m70L03J30nj97j7k05o8L32k4J0j61K10pj13N9M6M8PJ34
3686B08n9r2L4l12K60k12K95K8J29l91O0K94k98M9l7J30K4k29NL21k19Nj45L1
3710a21MJ83J09j64N9j34J04J90j27j35J20j42J08Q8K8k08JJ23J4k39M31l37n4
3733i9%K36l78J33J05K68l26J39l06L18p8j88J74J10o2j29j53L66j43l32N01j41
3755A5j67M35m05J99O7k83K12j2j1j16J08m8q7k23L04j0q6j71L73r2J15k21k2
3778a26K00m9J28m17L34N0j50j01K49o8k33M85j81p5k51L80l70K88k18n7J82M
3800Dk55J05P9r0J0K69p3p9K04j49K43r8O6k24m7jOJ83l20J07J56j83J83k8o7
3825AJ2O5l44J68R8J22p2l67J77K34k02j84L32J01j43J2pK5j20n2J7J59l4K49
$$ y = [-194, -212, -81, 133, -167, 196, -274, 29, 159, 154, -43, -60, -265, -333, -1, -25, -15, -176, 34, 27, -86, -27, 19, 67, 74, 208, 149, 57, 91, -221, 39, -173, 122, 150, 279, -112, -52, 242, -56, -7, -44, 86, 110, -119, -114, 207, -12, -7, -152, -121, -117, 66, 175, 11, 70, -64, 40, 230, 103, -32, 88, -54, 54, 142, 170, -38, -37, 86, 100, -139, 292, -45, -99, -99, 137, -241, -108, -3, 265, -61, 78, -228, 90, 12, -176, -2, 108, 46, -83, -236, 130, -13, -345, 156, 15, -152, 283, -122, 77, 144, -139, 73, 61, 50, -66, 42, -6, -93, -316, -12, -22, -108, -279, 94, 2, 117, -104, -126, 74, 25, 153, -264, 70, 120, -30, -131, 118, 50, -183, 302, 121, 46, -205, 175, -195, 93, -125, -182, 0, 4, -251, -146, -67, -157, -147, 122, 49, -30, 174, 25, 268, 170, 236, 12, -35, -36, -30, 153, -167, -60, 96, -87, 96, 68, 1, 13, 78, -266, -98, 0, 122, 50, -317, -140, 94, -108, -292, 40, 141, -2, 10, 3, 28, -92, -144, -127, 32, -2, 247]
3849B47m55J50j16L65k64L30l85J71m8Q5q1l3J59l25L40j26j37Q4J61k34J39j50
3871a23J15J11pj01j14J35r7J97j40r7M7J74j61J57m6k51l2L00k4j95J25k16J84
3894e9J04k95L53k25L91j1n21J31M2q5J65L8j34K05p3J4L07n28p0N86l65J12m53
3917c71L41K95j18J6lj99N8k8M1j52j12M9K42J4m0k03J75l9J82m0q9r4J06j09
3941g8QJ24M9j12m8m5K64j97J0J43k99J59qo0N2J51m4J9k85P1K14l06l4J21j06
3966b37L92l8pl09L73r2k24l0L37k18P7N6k00J52m0R5o4n3J44k70n9K1K50k23
3990a67M35j01j72M3Q5l17K99j60j50K97o5J56k65j18L50l9J45l2k04lj08K70
4012A79j36k61J57K74k06j66J77r3J86Q1j04k8O5k15K25l16J60P0K72m24o9L52
$$ y = [247, -208, -58, -174, 191, -73, 257, -128, 43, -5, 80, -1, -34, 125, -200, 140, 14, -123, -39, 122, -112, 27, -123, -8, 103, 96, -5, -119, 16, -81, 116, -24, -121, -74, 100, -61, 96, 50, -201, -233, 67, 43, -152, -27, -243, -59, 45, -250, 103, -122, 269, 258, -263, -132, -90, -175, -10, 28, -106, 99, 26, 40, 347, -181, -251, 335, -30, 82, -371, -30, 265, 147, 163, 160, -39, 19, -9, 32, -120, -232, -183, 59, 73, 33, -170, 5, -34, 148, 108, 19, -75, 31, -78, -70, 54, 103, -9, -57, -102, 162, -35, -25, 118, -181, -22, -30, -90, -38, 113, 69, 88, -197, -126, 88, -218, -252, -131, -237, 155, 117, 110, -199, 174, 82, -142, -172, 165, -53, 24, 80, -120, 32, -8, 87, 23, -30, 114, -156, -215, -194, 56, -167, 268, 167, -5, 38, 123, -194, 105, -55, -205, 92, 27, 183, -82, -200, 150, 111, 256, 224, 20, 17, -91, 179, 43, -218, -61, 213, 7, -159, 18, -75, 111, 192, 88, 60, 125, -90, 135, -181, -21, 49, 321, -103, -172, 180]
4034A80j22q6OJ91p4p9j92R0p8K70K22j00P3j88j76L84l10k10K20J3m4K6k3J20
4058A13j33j88K78k85J80Q2k91K25n3J14j23J87r6J90m0k53K59j86P5j30J29J44
4080A98O4l85R5p3jM1k6L8K2J07K5m82K63J43k13O26m57o7J29o8K47k09Q6m3J22
4105A82l16L21l76L81k15J86J03o6r4j82J2j41N36l56N0P7k5K2N8j28l23J00K67
4128G3J23k46K19l7l32L17j59K07r4l26K90K0N5QN0n4J64l05O1j83l6K72j83J42
4152D6j32J24j43J32L2j71K47o5j90J25j3Q1l8R8n9k07J73l13N03j47q6R9j7j81
4176a02J10K3oq5QK43j31q7J27l06K18j29K68k36o8J25K27k75j11Q8Q7K62m76
4199b26O7L47m86J53M3j59L80j62L33r2l5l09l0J58n6O9L4J22n2j15j2m0J17n3
$$ y = [180, 58, -28, -22, 169, 95, 16, -176, -86, -164, 106, 328, 228, 301, 113, -63, 321, 11, -199, 21, 34, -10, 16, -7, 113, -20, -208, 70, -215, -35, 47, -244, -19, -72, 42, -81, 106, 10, 200, 160, -93, 166, -20, 55, -75, 54, 198, 262, -123, -28, -101, -102, -61, -87, -49, -27, 80, 105, -377, -114, 29, -184, 442, -15, -82, 47, -21, 226, 17, 103, 60, 182, -134, 187, -189, 192, -23, 163, 266, 200, 106, -76, -64, -205, 331, -25, 25, 102, 77, 99, 157, 29, -294, -194, 73, 196, -50, 169, 132, -200, 117, -42, 165, 71, -255, 35, 55, 110, 118, 168, 114, 278, -27, 34, -149, -185, 87, -96, 46, -86, 38, -105, 27, 59, -112, 135, 70, -120, 5, -8, 73, 35, 133, 74, -133, 40, -273, 230, 83, -3, 96, 79, -102, 8, 31, 25, -60, -52, 191, 60, -27, 100, -206, 12, -117, 151, -85, -153, -28, 199, -76, -187, -99, -12, 250, -226, -159, 188, -298, -145, -102, -261, 119, -43, 290, 198, 163, -146, -176, -18, -74, -5, 29, 151, 99, -16, -28, -68, 49, -4]
4223dJp2j44J9M04l55R9k9o9L24o9j38p9L52k02J03j92N2J81n6M4k14L50o0m45
4248a99K81j32k68N21k72p3J29p1J83j34k87O08k12r9J92k32M7K13l76M93j92
4269A20O5R5l23%J28k81L11l13M6L05j85j41m0r3J64J39r5P4k10J48J79j80MK31
4293A48k10L3j2J05j31L3J46l0Kl7k1j93L82m11j66K66j11K72k14L90j31k05L01
4316B06k42p9J44k8j24J36j65K13k30K88Jj74N0J40k81K9J64j46P0j6J19p5J25
4339A25k57O0L17l74J18L4r1R2J22j69l19P1K66j28N1K28J9nk08j18J32K92m05
4362a47K44m11K97J40K9l82L33k7j46L1P7J26j88k3mJ75j63j65L22j62j61K5O3
4385a17J54k20K4J15Mo2pL6L91m43K33r7J41j78k84N02j41o9l7J96j75M9r4l3
$$ y = [-4, -3, -75, -219, -200, 204, -151, -52, -81, -150, 174, 105, -33, -112, 240, 38, 141, -51, 1, 182, 126, 170, -44, 306, 246, -199, 82, -50, -318, 203, -69, -142, -13, -84, 99, -35, -322, 286, 74, -25, 167, -65, -18, 195, -181, 312, 120, 185, 280, -43, -43, 85, -196, 115, -198, -152, 153, -32, -173, -213, -306, -142, -3, -98, -24, -234, -86, 93, -87, -83, 148, -62, -29, -41, 64, -67, -34, 112, 82, 84, 47, 26, -167, 215, -196, -362, -96, -207, 65, -149, 241, 110, -95, 206, -36, -115, 29, 1, -123, 13, -152, 61, -169, 119, 120, -54, -4, 136, -145, -116, 48, -98, -28, -44, 75, 0, 125, -132, -72, 245, -129, -11, 23, -68, 24, 146, -23, -342, -271, -5, -133, -82, 146, 165, 160, -48, -166, -34, 258, -147, 97, -314, -17, 123, 152, -230, 103, 76, -70, -39, 38, 164, -24, -47, -51, 124, -39, -204, 118, -44, -205, -180, -117, 37, -183, -159, -44, -40, -102, -109, -73, 318, -125, 108, 11, 152, -26, -310, 192, 51, -18, -55, 141, -34, 15, -79, -112]
4409a12k60O32l16J45J01l92q8L08k4q8N0m1P4j61M24k59j1j50K9L21p7N4j91
4432c2J89N9q0j54j73L89l40L31j04l67L77l50K92Q3k45J00l4l8J40n1p7o0J25
4455b0J37j64M9r1J73j31J66m5J93l69K06n7j8j13K61m24R9M10n24K50k35M41
4477A94j20k42L33N7j99J21j36j37J3J3oK68k8k36J10p3J06k82K44J76j98J21
4499I9O0k11Kk52J96R9j22p7q3K03L10l39K26k25K80j3l01j3M3J10M9p6K5rO5
4524D6k31J10J28l16J50K49J05J51l06l13K42j89L41l70K80k1N7j21n8K00j5k08
4546h9K1J15j80K19j49k2l2LK03J17q7j6j20r3K50k72J16J5q0Q4o2J37J93m00
4570a29K03J8j14J24j64k19M37Q9k06o4j71K71Q8l10K63q8r2L95k00p1K81l40
$$ y = [-112, -372, 260, -56, 89, 190, -202, -290, 18, -6, -94, -44, -85, -11, -172, 252, -7, -18, -168, -139, 182, 105, 159, -32, 157, 216, 136, -18, -191, 198, -142, 189, 85, -282, 95, -255, 37, 120, -125, -25, -59, -97, 43, -8, -85, -145, -20, 117, -47, 2, -89, 84, -47, 119, 74, 267, -102, 104, 47, 29, -84, 177, -247, -148, 262, -262, -12, -247, 194, 74, -168, 165, 222, 23, 144, 8, -129, -116, -103, -109, 159, 131, -105, 5, -68, 38, -244, 0, 176, -22, 99, 159, -52, -50, -302, -106, -7, -129, -206, -289, -86, 224, -115, 111, -114, 166, 153, -148, -161, -118, -8, 41, -35, -10, -19, 46, -185, -75, 53, -263, -113, 136, 241, 392, 86, -227, 15, -174, 167, -203, 77, 56, 113, -8, -66, 134, 119, -89, -68, 47, -133, 86, -63, -85, -117, -114, 89, 206, 119, 103, -17, -110, 140, -132, -16, -1, -81, 3, -59, 78, 271, -129, 74, 92, -22, 102, -62, -281, 156, 245, 39, -25, -196, 75, 163, -147, 116, 28, -64, 331, 131, 60, 341, 1]
4592Ak09L16k45L26K4j77k8J55K24n30K58n7j0P1k42j26m2N5k7J76M52j04l95
4615a34J06J2J11pm8O1j82rJ27k52K78l75L72m36K87J59q5O8J40l51p2L62mj99
4639g1k08n6L21j92J36q1q8L9K40l0K03j52mK04m20NK84j31j32M8o5j6J86oJ14
4664A28q6J59n24K97P0J02j26o4q4J03J09k30K72j61P7M9k85N4l3J10L13l26k10
4687b86O65k42k48L62k76J32j07K32l71J18J71o0j11J74l39J61K57j43l97K23
4707h5J77j71K0O8J59k80J9q5J34J87l34J98M8k40J64k93L3L73o9j62J34K0j58
4730a43K69j31O0J2k85L60J81j58k91J1L19k40k27M0K86j55K97k24l3kK30k0J8
4753A74k29K6n4O3J47l89N33k15o6K4k40R1K20l15L8J54j04O6J70j25J05l16J30
$$ y = [1, -208, 108, -137, 189, 213, 36, 8, 163, 387, -143, 115, 58, 48, 119, -123, -249, -291, -236, -263, -87, 365, 261, -134, -28, -16, 95, 88, 40, 101, -81, -90, 37, -215, 63, -312, 60, -376, -89, 70, -15, 53, 193, -158, -230, 132, 128, -71, -279, -335, -14, -206, -70, -151, -239, -200, 40, 10, 213, 61, 57, 261, -159, -154, 130, -1, -133, -85, -150, -166, 20, 14, 128, 42, 201, -323, -26, 44, 146, 20, -44, -128, -25, 84, -146, 126, -35, 42, 91, -194, -140, -173, -63, 250, -76, -286, 379, 137, -111, 251, -25, 107, 0, 232, -139, -21, 150, 90, -21, 153, -186, -25, 232, 89, -308, -85, 92, -79, -59, 9, 168, -112, -93, -178, -44, 143, -191, 7, 55, -185, -21, -314, -281, 92, 23, -139, -5, 15, -143, 126, -5, 55, 67, -218, 142, 323, 165, -126, -115, 204, -36, -263, -223, 63, -92, 205, -19, -52, -54, 176, 156, 174, -55, -29, -83, -20, 127, -262, 271, 56, -10, 14, -226, -135, 85, -230, -192, -38, -142, -76, 94, -31, 74, -242, -112]
4776a12K41k98J17q1J78J85j08l4k2R3k0k30M8j4J24k46J45K38k63N7k31J95j27
4799a65K42O0k92R1K41j72qm7J43J15k48L28n43K39j76L07J5j47lj47nk6L65J38
4823C05l47J16j82l6Q9j03M63j58k10L54m52q9K00o3K41j50M8k31J36J81L8j43
4845GJ01q7p8K11N3k57J7l4j5J00k24J99qk4N6L7pk44J48K11m25L83k36n0K88
4870A22j28p3M0K3p2R4K57o38M26j07n0K37j29n8J11k57K50p1l8J03j59n7j0n
4894a89K67J8p1J1j33R3O7l1j0J45m00J38K41K8J2l39N6J53K5K7p0M8Q1j81K00
4919A86j91J0J47j93K05K4k64M0J11k26k4J11R2k65R3N9J60o5m4J01J03j91O2
4942D1j19K28J51k79J43j43O0o4p7j28L9K78m8m7J30Rr3q1l2j25K42Q5k16O0m5
$$ y = [-112, 129, -169, -52, -133, 45, 230, 122, 88, 66, 159, 139, -91, -43, -57, 67, -179, -34, 204, -59, -2, -233, -38, -165, 77, 137, -155, -64, 177, 5, -3, -50, 93, 208, -40, 288, -255, -16, -192, 115, 130, -17, -20, -167, -172, -198, 167, 305, -42, 74, -108, -144, -55, -158, 305, 147, -63, 291, -161, -250, -50, -113, 128, -22, 26, -205, -69, 112, 150, 7, 108, 21, -57, 154, 207, -50, -33, -67, -82, 18, -206, -7, -15, -39, 17, 54, 47, -197, -49, 162, -263, 120, -116, -166, 122, -6, -79, -39, -16, -88, 6, 263, -375, 51, -56, -106, 131, 2, -56, 55, -202, 48, -23, -61, 42, -117, -174, -184, -189, 78, 96, 25, 36, -97, -4, 63, 32, 22, 167, -233, -95, 146, 174, 186, -153, -97, 56, 81, 108, 38, 86, 167, -14, 186, -5, 5, 152, -41, 164, 188, -76, -36, 75, -151, -175, -64, 28, -237, -144, -85, 75, 10, -34, 67, 170, -21, 41, -78, 150, 301, 22, 165, 22, 82, 18, -59, -187, -148, 130, 82, 35, 165, 174, 81, 0, -32, -157, 85, 170, -46, 14, -31]
4967c1q0n2M0J54q2J95L0j8K50m02J09l25O5p0L39l17M23k78rK64l15K87j42q3
4991d8J63l98J99J21q8K2m6j37L40j51J11j41r2Q6l7R1j3O8j82M08k48P2j65P0
5015EP9j79J32q1r3K14k38j5K73m72L53l8J2k05J27j21M07l13Q6K82k50N9k30
5038b06J87K11k58K44j60j74L93j42j0N3r6j89J01J62j96J39J04p9k19K43j6k19
5060a27L77J14n09J45j28p2J56j53kN70l31l33O10l52J13j6j17M10l74K53j53
5081H1k69M12k18o1R6J9j32q9k97O84m06L55j25q3J84k7m04J92L04l80J78n2J01
5104F3K31k56k53M38n9j14J35Q4m97J49J60j37k07L85j92nK7j35K67Q5l75J29
5126g7L7j1M6J31n2K4k85k7K07j58K08k9j71J06L1j36Q8M5k03L28j06p2L54l01
$$ y = [-31, -111, -163, -123, 31, -51, 144, 174, 156, 406, 4, 113, -212, -147, -217, 122, -195, 228, -50, -59, 205, -110, 177, 35, -48, 115, -283, -84, 37, -51, -29, -75, -212, 128, -23, 88, -53, -145, -59, -96, -5, -18, 50, -132, 276, 28, 100, -65, 5, 84, -95, 37, -44, -137, 77, -161, -176, 97, -375, -22, -60, -48, -253, -126, -247, 160, -153, -67, 215, -35, 24, -206, -19, 192, -66, 178, 18, -156, 237, 95, 85, 138, 42, -147, -46, 116, -80, 59, 163, 84, -135, 108, 92, -127, 250, 364, -145, 0, -128, -200, -44, -197, -199, 371, 40, -293, 317, -35, 78, 62, -55, 355, -19, 234, 81, -188, 224, 6, -55, 41, 60, -72, -161, -458, 226, -180, 175, 50, -33, 151, 124, -280, -88, 216, -164, 14, -38, 63, 294, 38, -215, 223, 164, 50, 185, 269, -228, -79, 81, -56, -263, 122, -70, -75, -48, -183, 84, 169, -206, -77, -40, -51, -5, 126, 74, 98, -187, -214, -7, -165, 43, 14, -157, -51, -20, -156, -68, -23, -226, 102, -4, -76, 278, -23]
5150b3l9P8P5o9j11k66M41qn3l3J80l29M77r2o51K70J15K40m38J15n7L51l73L05
5174A05o1N8K5j87J37m0L4kO4N6j22O1k50K37q1k23J34l01M18j44J2K95j56j96
5198a27J62r9j9M85n93M00l79J21M7K0R8k60K75ok58L99k35m0j7j91O1L45j83
5221Fl31L29m4j26J71m9J7k02J55j44L3R6L0l4K0K54j34j03M5LJ93j30j36J60
5245G9k9k6P6R9l4k66K2J28J53n32M74n18L22n3P1K10k06P6j58m5N8%nj31P5M81
5271C21m09j13J99j58L2L15k73Q6N3j39K28q0j31J96j56k6j81L19j10J54j40M6
5293C3j10J41J5k12J69k0L09l28o6J42K15k51J06K2J78K8k71k9P0k43J85J17m15
5316b15M29k86k25K08Q5j52J99r0O6J30k52N7L6J16J48l96M17k27j21j23N7K47
$$ y = [-23, -62, 16, 91, 22, -89, -355, 86, 78, 25, -8, 172, -157, 320, 228, -423, -153, -38, 202, -236, -121, -178, 173, -200, 105, 44, 102, 127, -60, 77, 37, 71, 69, 133, 189, 67, 128, -122, 115, 34, -189, -55, -356, 62, -82, -70, 225, 69, -127, 35, -64, -83, 402, -191, 209, -170, -49, -2, 18, 116, -144, 131, 125, -133, 266, 31, -9, -26, -217, -156, 189, 6, -325, 4, -40, -166, 5, -44, -27, -229, -74, -218, -185, -89, -59, -93, -73, 181, 47, -56, -11, -8, 185, 55, -81, 79, 50, 24, 100, 199, 165, -101, -79, 49, 202, -330, 144, -374, -52, -105, -34, 176, -30, 46, -112, -157, -99, -99, -104, -235, -160, 321, -88, -201, -2, -160, -128, 187, -86, 0, 53, -86, 142, 62, -69, 127, -29, -55, -236, 83, -27, 127, -13, 33, -77, 64, 79, -133, 36, 16, 325, -3, -69, 73, 288, 37, 143, 165, 343, 371, 100, 71, 141, -102, 83, 200, -215, 214, -72, -297, -89, -4, -156, 43, -47, 19, 149, -103, -46, -10, 106, 254, -142, 275, 48, -73, -196, -139, 108]
5338A08P5k84PP6L1r4%O9j39J31L6O7k67L58r0q8l5n5l0J85k13K74Q7l39L58k2
5364B06k91O3J05J76k49M2K02m24L55j57k17K21q7j13J84k3k27K83R3J16l78l2
5386a52K66k03K52l13J15J42k6k14J36J1k79K68j1rl2J97m5k38J00j9j28M2K85
5409A45j35j11N01m63R0j98J89K10j46j6J7j98RQ2m8K53k95M01l09J10N0m20J45
5432a37O7J00L16p07N54j4l14K8L14j39l15M07k89J80J12j06lj92po6K16j76M95
5455C24j85j33J6K0m20J81L18k17rK65J6L5j78j81L09m9l47L90p5m24L25L27l73
5478f5k4o7J50l56M07J16m66L10J9J27k12J32l7l25L53m1m1j54O4J45O1J78l23
5501d9o0PJ51j13J05j72J0K26k55J25r0r6K75j86R8j4p5o6J24q0L70k61K78m22
$$ y = [108, 183, -101, -94, -18, 13, -81, -81, -12, -151, -20, 16, 83, -184, 174, 84, -4, -39, -94, -124, 61, -152, 122, 209, -130, 228, 206, -85, -22, 83, 259, 10, 52, 254, -170, 185, 28, -189, 32, -55, -168, 16, -7, -234, 49, 142, 258, -120, -152, 114, -89, 163, -150, -35, 107, 81, -133, 3, 14, -265, 3, -8, -17, -49, 148, 103, -135, -35, -54, -182, -140, 145, 10, -101, 400, -63, 27, -171, 18, 228, 82, 66, 83, -115, -106, -24, -72, 181, -114, 287, -22, 88, 138, -282, -137, -70, 30, 346, -361, 193, 179, -135, -107, 207, 68, -247, 160, -129, 51, 163, 57, 54, -138, -145, -211, 5, -171, 324, 139, 6, 22, 42, -378, -197, 121, -96, -105, 160, 176, 211, 33, -148, 161, 112, -235, 155, 80, -344, -19, 308, -65, -89, -156, -6, -362, 45, 161, -305, 5, 24, 151, -61, 71, 34, -291, 62, 21, -20, -174, -110, 35, 96, 274, -49, -109, -102, 49, -64, 41, -131, -121, 105, -150, -25, -115, -211, 64, -122, -24, -38, -113, -179, -55, -135, 235, -26, 252, -170]
5525a70K72j4m8l0J9r6l6K75k35r9K22J4Ro1N4mk14K14k23L32q6j27O6N5K6J60
5551B75l59L9M32j31j31n49N48k42J33j21Q0kJ37%N2r5j53k49M10k98K28K60l39
5574g5m8K09k52J78j03k4J99l8n2J59m52P9L03k75M56m83K54j35L85r7N6n03J97
5597f2K1J9K15l44K72j2o6L33m19L01m30J36K17k26M2j2J58k3J3N4J95m20k6O9
5621EJ28l48L68k17J31o7k27K34O8om1M3j04J83r6j6J29k65R4k12K58j52L7J41
5645F8L18k60j14J29K8m11J23M8J83p8j79K30n73O27K6k52K30j84K12j48j27L05
5667B01l34K31k29J01K42K5k91j41J25L14k44j08OJ63L6j05j8Q5L5k63J33q1K22
5690A05J92k91j14K41m35J47K26j05j35P6qK4R7k04J18K77o8j46J31j54k02L97
$$ y = [-170, 102, 88, 40, 10, 29, -67, -103, 172, -63, -162, 60, 74, 83, 22, 76, 72, -142, 72, -151, 181, 95, -32, 34, 89, 115, 275, -84, -45, 387, 256, 125, -424, 124, -118, 15, -106, -26, -28, 109, 109, 161, 66, -87, -336, 74, -224, 4, 264, -75, -123, 86, -166, 12, -91, -115, 84, 46, -6, 153, -299, -220, 83, -192, 264, -219, 35, -100, 285, 188, 244, -259, -62, -41, -22, 193, -151, 121, 109, 43, 376, -43, 258, -172, -36, 181, -45, -3, -15, 143, 120, 133, 187, 382, -38, -64, 5, 133, -215, 153, -64, 67, 0, -227, 7, 75, 69, 28, 71, -33, 150, 54, 38, 167, -98, -4, -216, 42, -110, -73, 68, 386, 126, 12, 141, 169, -242, -119, -71, 112, 34, -145, 85, -488, 139, 165, -87, 143, -41, 171, 23, -104, 201, -133, 98, -131, -30, 212, 237, -54, -195, -70, 244, 0, -108, -102, 61, 97, -8, -26, 59, 94, -169, -36, -117, 105, 297, 6, -108, 133, -302, -155, 71, -34, -169, -93, -101, -77, 20, -184, -66, 211, 143, -3, 128, -26, -228, 169]
5712A69k61n6J47j30K64q2j72Q1j16j43J38J17J99r2k81M25O6n0j93j04n4J45
5734A7j18M5J32m8j76Q1K05j47m8J01k88L76o2j9k32J81n5L8M3k04J54K7m22M18
5758aK52n30K98k13J5J16p4L91m07j03P9L59n8r4j64r1J36K20j13j77J75L45l88
5781b7J85j81m2J88j19r5j24K52nK54j76j47J24j22j13M29l15J11o0j42O1p3J14
5804b3p2K14L4k26Kl2K77j89j62M46k49N3j39M5j24K55J65l56K47l45k8K15mj39
5828a35J69M1m45M91M8M1j73J08k38K24J1j79q9J43J95j98O5k1m9O1q5l7Q4j9
5852A3P5k44J54j22J18L26k41j18L35m89J20J95j88j68J35n1M12l43k4J15R6j67
5874f1j27J43J55L9K8l13j11K77k36J12o7J80J54k40J42j91J63K4Q1j74L7q2l3
$$ y = [169, -92, -148, -1, -131, 133, 51, -121, -40, -156, -299, -161, -44, 155, 63, -218, 207, 273, 223, 30, -74, -128, 17, -101, -56, 76, 28, -148, -67, 138, -9, -57, 44, -244, 132, 70, 51, -181, 0, -55, -17, 26, -178, -24, 3, -419, -1, 251, -279, 19, -194, -179, -63, -137, 254, -153, -256, -177, 182, 124, 30, -134, -225, -89, 131, 18, -159, 16, 361, -27, 158, -23, -65, 123, 4, -91, -215, 37, 32, 286, 110, -37, 87, -35, -148, 281, -34, 77, 17, -125, -64, -137, -23, -95, 119, 153, -73, -71, -103, 174, -15, -177, 269, 20, 73, -66, -21, -145, 110, 275, -81, 166, -179, -207, 8, 4, -135, 34, 75, -370, 121, 169, 210, 37, 145, -93, 131, 142, -37, -126, 17, 212, 14, 79, 58, 9, 70, -15, -52, 32, 13, 88, -156, -2, -124, -6, 320, 79, -39, 296, -193, -73, 122, -66, -234, -99, -150, 262, -81, -105, 10, 106, -61, -188, -45, 110, 149, 177, -136, -247, 30, -206, -94, -161, 19, 173, -67, 75, -116, 47, 71, 152, -22, 15, -67, -100]
5897a00J67j68N2P4j25nK6J98k71J62J55j67k61Q0JK8J35J17k04N22m55l36N13
5920A38p6o0j41L07j36j18l25L72K22k9k36J79n1r6l1J05M7J92j61l64L37Q9k96
5943a32K44k11j52K67p1J84Q8j86K45l60K43k9j17o3k2K56P5l91K26L7m77J16
5965b30K03n0K54j17J59j9k63O8N0J84l74K65j85J6Q9k9k29L56k06j42J01L03
5987B04k73K03k39J27j79j8J50k42J67J04j50J4J14J59j3j78M6j50J56L8j25R8
6009A3O4J09J8j31j7k08J48M44m24k50K65J22j64q9J10J14k64k01K92l7n1k8L02
6032A37j38Lj9K29l33J69J00j67n3l4J61L1ok12K15k82J15j05J14J70q7p4J65
6055I9p4j9K14m12K79K7k48L25k54J45q6j13j42M21o1R9j08K8m25M1K99k11J4
$$ y = [-100, 67, -101, -49, 25, -100, -105, -79, 119, -152, 10, 165, -2, -263, -183, -182, -154, -19, 98, -106, 416, -39, -375, 138, 62, 2, -139, 168, 32, -86, -411, -39, 183, 154, -82, 97, 46, -50, -81, 24, 71, 263, 102, -262, 75, 164, -132, 112, -99, -251, 16, -55, 129, 217, 31, 276, -84, 159, 130, 13, -50, -72, 184, 259, -132, 94, 131, -346, -230, -27, -77, 177, 60, 219, 200, -63, 5, 55, 239, -135, 130, -55, -39, 50, 21, -208, 148, -58, -200, -99, 204, -69, 134, -105, 22, -157, -175, -25, -267, -100, 4, -146, -132, -18, 141, 128, -50, -4, -154, 2, 40, -85, 13, 77, 186, 204, 73, 56, -152, -4, 440, 16, -234, 31, 153, -11, -100, 10, 124, -140, -341, -49, -86, -137, -165, 137, -1, 2, -17, 212, -121, 48, 148, -19, -72, -106, 55, 86, 80, -132, 83, -199, -84, -189, -75, 95, 8, -66, 99, 25, 6, 220, -192, 87, 114, -134, 191, -63, 82, -4, -117, -259, 162, 101, 200, 92, 120, -305, -264, 35, -176, -162]
6078a62j7L42m0k61k93N74j41P8j25Q6J28j68k03J08K10k58q7M5K23Q3j39j31
6100a48M77p5k58K25m7j63M0k2j99K83j02J05r5j74J44N2rJ06p1l06q6M59l46
6123b10K4K33k8P2k68M43k72k14K64j87K97k09Q3j87J35NK1l0m9J17J5j16pM8
6147b0pK73j36K59k35j39k74j19M05RK38k10j64J27L4k90K47J90j56q1L37j68
6169A20r0j30J52j07J85k46J66k06Q0J21m5J38k46L30j58n9n7K65j92l16J69Q8
6191c8k61J23K42j9m3K84l16J33q7m0J12o8OL36m78K26J48m50J10j07M19l19m2
6214a29J76j43N15l07M6l18Q8m2L56k10m63M74j00j44J56J53k80o1K98J20J2j85
6236A2k5N9l9P2j78q8J32n7L45j99j51Q4k3J04o7Jk22J3L34p9j97J27K6o7K2q
$$ y = [-162, -179, 163, 123, -138, -431, 143, 2, 80, -45, 41, 169, 1, -202, -94, 116, -142, -229, -184, 39, 122, -17, -148, 329, 254, -4, 221, 174, 11, 51, 29, -170, 113, 11, 116, 21, -153, -9, 43, 34, 140, 69, -237, -323, 136, -210, -186, 47, 19, 91, -177, 266, -6, -220, 44, -143, 154, -55, 28, -159, -24, -19, 2, -28, -77, 40, 55, -61, -68, -20, -27, 246, 110, 369, 134, -5, -279, -398, 7, 16, 254, 44, -120, 7, 41, -249, -2, 188, 32, -49, 288, 120, 30, -100, 52, -55, 130, -116, 50, -156, -76, 45, 0, 138, -108, 222, 64, 5, -52, 213, 21, -295, -126, -38, -299, -176, 66, 47, 4, 288, -28, 105, 18, -22, 90, 22, 28, 364, -114, 112, 260, -190, -80, -187, 232, -87, -129, 47, -96, 419, 112, 158, -160, -72, -114, 242, 32, -431, 43, -57, -201, -45, 108, -172, -233, 65, 185, 197, 12, -13, 46, 7, 79, -99, -187, -55, -112, 233, 34, -117, -33, -56, 48, -19, -18, -240, -227, 107, 28, -169, -42, -16, -83, -61, -69]
6262f9J45n7OJ0J32o3p0j40J92n2mM4J24m14L04j44j2J4O8l60L01j14N2k4K34
6287A03k82N9N6j55K36L38k86j25J66j61j28N96k23l03M07l13J33k4j92K08q4
6308B6L9k05K00M2j55j15j2j62M09j70j0J41r2R6L8j86J47o7J37K7k10K16p2Q3
6332A45p0r5M0r6K05n6J13j01m59K98Q2J15l68Q1J78rl5j00J36j67K03M4K06m48
6356a58K08m7L3j81K31q0J69j89mp4K10j85q4K59N7m33M80l04L34j57J95k43n2
6379a5K74k98M49m17j25L72k69k52K82j32L29j51J6o5J47R9j18l97L11n1q6J25
6401B8K9n8J93k33j78L35p9m3p1J6K34k93J86J11k83O6j87L6J73rm8K62j96K6
6425A7J26m57L58J70l12J12l2K5K15k16J44l25R4J51k46K57l77M77m95J47j07
$$ y = [-69, 76, 19, 25, 35, 167, 104, 34, -106, 86, 34, 30, 74, 198, -216, 88, -56, -68, -54, 14, -346, -45, -159, -107, -131, 103, -179, -120, -64, -219, 17, 355, 69, -56, 110, -51, -179, 417, 194, -109, 298, -15, 118, 94, -98, 110, 26, 65, -140, 60, 102, -53, -168, -180, -342, 67, -103, -113, 28, -64, 32, 70, -116, 31, -36, 101, 128, -82, 134, 62, 145, 75, -20, 20, -76, 129, 73, 186, 85, -374, -76, 6, 121, -247, -166, 12, 3, -32, -132, 4, -163, 40, 84, 290, -158, 50, 3, 36, -145, 86, 6, 175, -14, -18, -92, 118, -67, -151, 108, 165, -268, 212, -92, 242, 85, 280, 37, -15, 259, -39, 410, -7, -132, 240, -29, -281, 1, -131, 198, 47, 63, -2, 145, 244, 126, -271, 40, -11, -97, 28, 57, -1, 192, -41, -219, 116, 37, -6, -77, -61, 173, -120, 66, 177, -106, -40, -227, -191, -18, -27, -75, 187, -9, 17, 143, -314, 44, 214, -98, 14, -18, 7, 222, 6, 150, -175, -81, 70, -176, 81, -296, 181, -314, -167, -274]
6446b74J00M14m47J74J05P4j07j82K61j62p3L54l43K95l52L07l83N8J54k76L08
6467EJ54j99J96j65J02J2n7K8k06j56M39k08q2J6J51j11k2M8p4J79k86J10J13
6490a3J23M7j35N9j41j04R6J37R5j50M2j84L14m02M26k8l05J36R4j48n8k7J22
6513dq9M2l8J3Q5J7r9j26J97k1O1OK1j44Q2L9j36K20M4j91j54M0K49k94L27k2
6539A25J02l18K76j60o4Rj33K93j9J31l92J78J73o7o3k58J64N0j49J80L0K3o5
6562D6k15n3L76k24J59j03N4J52j06k35K56k3n9K10k88O2J34k32J22kk15J34r6
6585a46J38J03k96K90k1j42J01k57K43l2j85J88j61J07N8J3p4l1j00K20l5q1J14
6608A4j46J00J16Q0q7Q0k10M4k56K00K16o27K98qL38n7L2k02K57k19L59k30J40
$$ y = [-274, -174, 240, -207, -33, 72, 146, 39, -143, 118, -44, -117, 237, -106, 189, -163, 144, -239, -181, -27, -303, 5, 159, -40, 156, -9, 93, 105, 48, 76, -130, -286, 153, -55, -137, -121, 30, -81, -103, -55, -129, 50, -236, -126, -13, 110, 157, 22, 81, -60, -164, -68, 69, 164, 14, 56, -128, 186, -216, 210, 182, -123, 13, 107, -41, -99, -126, -4, -93, -51, -89, -76, 9, 26, -73, -199, -2, -23, 38, 44, 65, -79, 3, 42, -94, 126, 170, -21, -175, -135, 114, -180, 147, 125, 227, -91, 185, 25, -39, -30, -163, 130, 111, 242, -150, 28, 201, 134, 71, -187, -23, 27, -122, 58, 88, 111, 46, -169, -222, 154, -70, 89, -14, 40, 192, 86, -149, 107, 84, 25, 235, -53, 9, 143, -89, 33, 31, -184, -50, -146, -8, 95, -201, 89, 68, -74, 27, -230, 13, -19, -204, -16, -177, -70, -12, 1, -73, -104, -204, 16, -19, -100, 14, -132, -32, 84, 164, 77, 157, -53, -9, -265, -65, 151, -476, -178, -186, 152, 95, 127, -75, 182, -37, 322, 92, 232]
6631B32q7k53J92o1J40k12L85m06R0j25Qj03n5K00k0J73l33k17K85K71j29L1J22
6654A28l39K22O6m48L48Q2J33k93P6O4j88J79m0k01J65M8j15j18J27O3J99o1L6
6677A33k0r7K54j63j41j44P5K3K8J50k44J69k37J32q0K95k0N3m19K46k13M63l81
6700a38p1j6J11M77n28J48j11J60Q6l15K10l1j05J23K05o4j23r5j43K22J24l3
6722I3m9j28K39j3K1j33j91L3R5q3j6j27M04o4K0m1j48K18L7j07K86o09J37M6
6746h0j50K21J33o9k75J94M07k39p6J81m14J35j21K54j57q9J33k2p0K1J05k86
6768b64M85m35L15J50k53K3j50K17o4r0R1j11K23j61J47k13Po0L76j10l4k8p5
6791a4j74J28J80j16l00K76K5p6J1L9J57j7p2J80j92j14p9n5J24j57L62j50K40
$$ y = [232, 145, -108, 84, 23, 163, -49, 336, -70, 20, -105, -97, -200, -255, -55, -75, 98, -235, -452, -167, 104, -25, 6, 128, -211, 11, 77, -371, -23, 59, 192, -101, -25, 39, -149, 30, -10, -211, -46, 2, -113, -231, -104, -41, 158, 97, 133, 113, 16, 270, 107, -34, -178, -103, -80, -52, 98, -146, 23, -214, -82, -162, 133, 113, 166, -253, -7, -220, 243, -138, -209, -225, -114, 363, -165, -17, -128, 32, 118, -197, 13, -18, -123, 0, 205, 141, 18, -77, -220, 2, 126, 93, 44, -84, 155, 142, 163, 30, -161, -128, -33, -116, -132, -259, 145, 81, 101, 60, -88, 130, 167, 60, 346, -263, -126, -80, -230, -9, 124, 55, -220, -26, 381, 142, 66, 247, -167, -32, -153, 101, -56, -145, -12, -34, -104, -83, 22, -264, 221, -214, 101, 251, -2, 21, -129, 88, 24, -66, 25, -86, 137, -24, 123, -90, -83, -143, 233, 123, 89, 61, -14, -188, -60, 120, 4, -296, -20, 5, -71, -60, -21, 136, 119, 47, 227, 35, -79, -158, -213, -89, -246, 116, -34, 206]
6814B06k82J71J02j43j85J44q4Q8j33R9J79k50J2L17j51j13J58k39J57L1K6l11
6836b01M60j57K7j97K50j28J00Pr6j88RJ4PO0K00l18J67j39J96j73J87L54o30
6859a89K07Rl36K63L30k97n3o2P4Q9j78K54J78n6P8k42j63N0m6J66p2K5K46k82
6883gJ27j90J06J56k21k6j76L91m18K53k43L96q5J60k72j1J40L59m01l97L41N0
6905C2K6K3N5k30Q5r1M3J09N2O5k62N4J06J42k48RQ6j20m2K4K9k97L20r8M59l05
6931B6k5n0J54l07L35l4QO6m8J6k52K96k12onJ40k24J73p7J31j23M7J37j05M9
6956A10j07R1j84P3K52m17O8J32j27L2J60J09l56p3N48l66J84l27L46k5p6r8p6
6979a27Q3K54m9k06L0k4k20J95K3k70L28L4l4n4K80l0r5k96J48j49J09K7k15J50
$$ y = [206, -76, 95, 197, 54, -131, 13, -71, 17, -116, -17, 162, -88, -76, 241, 90, -23, 135, -104, 53, 84, 110, -201, 259, 102, 129, -68, 182, 54, 154, 161, 65, -123, -114, -100, -93, -33, 167, -151, 16, -123, 73, -100, 87, 441, -189, 18, 27, -309, -46, 284, -13, -66, -128, -54, 35, -143, 111, 289, 233, 311, 69, -94, -44, -90, 76, 4, 29, 275, -7, 120, -70, 36, 192, -29, -55, -231, 160, -258, -5, -248, 148, 63, 223, -49, -60, 80, 439, 38, -359, -18, 32, 58, 81, 136, -94, -9, -100, -57, 52, 104, 169, -93, -39, 67, 209, -39, -30, 56, -64, -106, -82, -53, -350, -30, -128, 331, 26, 1, -49, 105, -202, 133, 99, 107, 173, 125, 141, -111, 185, -27, -33, -38, 102, -122, 51, -26, 105, -18, 29, 166, 61, 110, 3, 94, -90, -17, 235, -182, -114, 18, -109, -77, 83, 192, -164, -237, 311, -55, 129, -198, 148, 123, 47, -51, -127, -44, 210, 161, -45, -15, -39, -259, -64, -41, -311, 17, 51, 17, -37, 243, 213, 118, -178, -30, -179, -70, -43, -258, -108]
7003a08J20k0J58l25J00P8k1L44k65n9J96k08J90k32K20k00J28L1m76O01l29K63
7025A86k26o2k4L7J26k31j8J94K7K94m00Ol6L36l92M02k4j64Q6j09P3j11q5J15
7049@j57K66JJ06l04M9J31r5K6J45k69J93r0J9J19p1J12j48R5j56J81j09j55o2
7073a73K37j57j47L89j13p4j0O7q0Q4J09l53L89qp3j9k8j26L52j50J75j94j58
7096f1K8J60k00Q0j2L49l69nR4j66J09J57j84r4J01P3K87m20J38l16K56j37J2
7119a20J20r6J29J06p8j04K42k89P2M0j35O0j64L06oq3q5K46N7j70qK9j18p4L04
7144A81k28k30J74J79K8l22K06K0Pm0j57L69q2k53J08j33J16j65M27j39M8j38
7166b4K13k85J02J81l86N1J95m4K63l95O0J57n6P3k8K1j02m5j14J83P0j01j0J99
$$ y = [-108, 12, -8, 150, -175, -75, 3, -18, 326, 61, 2, 198, -10, 180, -52, 168, -32, 96, 127, -349, 252, -77, 186, -40, -102, -126, -89, 37, -194, -212, -18, 9, 303, -97, -91, -127, 209, -183, 219, 195, 31, 117, 8, 81, -30, -115, 0, -157, 109, 110, 216, -88, -39, 92, -3, 23, 168, -101, 92, 2, 21, 140, 69, 181, 33, 128, -28, 153, 44, -111, -173, 64, -93, -240, 149, 36, -38, -48, 19, -61, 23, 132, -221, 168, 160, 87, 68, 40, -86, 266, 116, 291, 97, -61, -33, 127, -73, 7, -5, 344, -25, -30, 64, -102, 7, 164, -20, -114, -13, 60, 347, -73, 65, -251, 5, -132, -120, 0, -96, 33, 139, 61, -43, 199, -90, -18, 22, -113, -53, -217, 89, 83, 0, -85, 161, 218, 48, 40, 69, -49, -123, 181, -47, -277, -103, 76, 104, -218, -12, 8, 15, -25, -182, 187, 105, -148, -40, -173, -57, -222, 205, 66, 114, -24, 189, -96, 6, 187, -199, -148, 47, 3, 266, -129, -69, 88, 32, 105, 77, 98, -4, -49, -163, 20, 90, -11, -21, 178]
7190A78l80K94j76J24ro4J99k85J35k01J12l9K96l58Q4K56Q0m68J32L46j78n2
7212B6m12M50k93K42o6j04J30o1k6OK1J72N1k40J33R3Qrm6j22K31j04n4J46j07
7237F5k30o1J27J17l14R7J50n2N4J73O9j49k5j39K98j36o5O5K3j10j1K7J11q5
7261aj90O6Lp8J23J57k19NJ47J09n5l7l0q5p4K01r9P3k61K83O6l7m7k48J86j21
7287a63J04J78o4J84p1j44R2J28l71K9J94k92K14m03L04K98k46L22m35K42k51
7308a51L15j33k74K39O4PJ12Rk61l0J97j77J42K0KL18o66J29J79j24P3N7j4j16
7332h3N7LJ9O6QJ38l32MQ0K34m69K57j74J24J8m2p1L6Q1K9q2L6j59m3J39m9r2
7359b67K11O7K4j5r5J39l27K31o8n1J35j7MJ64j85P3l23K66J08k36M2J00J25m0
$$ y = [178, -202, 92, -84, 40, 31, -33, 166, -119, 16, -185, -73, -112, 184, -174, -90, 166, 246, -222, -90, 256, 78, 26, -386, 64, -229, 13, -53, -157, -27, -88, -114, -108, -87, 85, 136, -104, 29, 122, 130, 121, 75, -47, 184, 80, 26, 172, 65, -165, -226, -99, 18, -296, -199, -49, -101, -47, 126, 195, 46, 21, -118, 180, 44, -21, 44, 67, -43, -54, -27, 84, -1, -191, -125, -122, -200, -77, 80, -139, -134, 13, 122, 67, 30, 0, -85, -159, 42, -57, 16, -245, 38, 104, 67, 20, -228, -42, -163, -59, 119, 55, 239, 168, 24, 116, 244, -127, -98, 96, -196, 18, -385, -81, 217, -29, 293, -142, 100, -151, 164, 31, -243, -4, 60, 67, 179, 188, -73, -103, 94, -83, 59, 79, 81, 399, -267, -138, 41, -83, -10, 47, 33, -83, -26, -23, -4, 62, 70, 208, -124, -120, -40, 194, -275, -18, -192, -68, -50, -92, -163, -127, -46, -17, -99, -63, -222, -265, -126, -175, -267, -56, 11, 35, 20, -75, 64, -263, -32, -100, -151, -16, -33, -29, 135, -50, 23, -300, -34, 74, -162, -120, -20, 105, 65]
7383F5p5J61j36o0J97l25J29r7K62k6l02K95j59K1RJ22Pj24J2q6M0O5nK53j31
7408A12k5o2p0n3J05J74j51j24J89l22L31n4j47K25k18L07j4l08m6J07J47j61
7430e8k0K51r4O1lm62J35J07J03Qqn4J96k72K94q7N2j77l4R1j32j5J15J05l03
7455b01J80l0j75j6O70k91l29M6K00LJ27j49J08K86m92L92l63k5K13k23N8J46
7477A35j55M7K00m38L34k25%Pk68K65l8K78k84K25j95j07J08J88L5k71K47N7k72
7500a27K36lk27R0K87l82J33K15j13Q2j38j95J40P3K2j32j34J98J5M1j10K23k91
7523i7J53J05j80LJ35M6p3j02j41J64J45l11L56l70K65L24j50l62k12L42j43J87
7545H4j77%r7K81k79J52RL2j83L00M5k92K2jK57l94K35j89K44J26k00J31j03M6
$$ y = [65, -10, 151, 15, -45, 152, -173, -44, -141, 121, 95, -207, 88, -71, -50, -41, 81, 88, -36, -24, -110, -70, -5, -10, 243, 112, 87, 25, -45, -98, 7, 181, 30, -94, 95, -227, 104, 50, -97, 128, -90, 217, 203, -105, -151, -44, 103, -58, -78, 173, 79, 140, 137, -325, -190, -83, 20, 28, 20, -34, 162, -110, 184, 97, 149, -28, -62, 29, -103, -118, -3, 102, -201, -21, -51, -226, -242, 428, 137, -192, -146, 54, 57, 184, 35, 143, 429, -63, 329, -34, -59, 154, -69, -11, 135, -20, 27, 227, -211, 123, -102, -102, -95, -363, -98, -136, 142, -142, 83, -112, -219, -111, 77, 112, -159, 88, 145, -127, 109, 106, -121, -31, 256, -126, 7, 222, 109, 191, 53, -142, -2, 71, 93, -39, -173, 25, 40, 81, -29, 194, -97, 56, 161, -19, -16, 119, 165, 92, -10, -151, 13, 158, -153, 203, -167, 98, 422, 272, -90, -302, 40, -103, 84, -93, -93, -190, 91, -188, -36, -27, 5, -178, 122, 167, -125, -103, -104, 153, -241, -6, -195, 49, 175, -25, 106, 3, 49]
7569D9kR4n71J92L50k84J55M8q4M9L1j22J56l6J63k9Jq0L9l30K65q7J61j11J50
7594A67k30K6m6Q1k12j28K41j10K62N5k66k3K87M6q6k46J49JM9P4k5j21K92k24
7618A3L7n1K42k77J47m1k5J35j62q4k11L57l70L19R0k29R8l2o4j06P6M24l77P3
7642a8M2k53M43j14J16K3k60m1k21L29L6q6J8Q4pj49l0K35k20L8K65j62j02p9
7666a13L40p7k14K3j07n8M19r5j70P4j14j93L22l2j02k78J69M44j61O0j76O1Q7
7689A09j81k0n1M9K28j49P4J40m02K26l1oj33K65L09l65K04m43J30J35NN4l01
7712a54OJ43OL3j4j90Q6R3O2k75K81j59k5M12l46J14k03J79J49l35J41J03k61
7735a54L31n04L49J08J66l34Pp0L4J14J59n9k00K26k98J82j31L10j69Qo2lj69
$$ y = [49, 47, 141, -430, -238, 112, -172, -17, 31, -53, -4, 27, -95, 61, 25, 188, 159, 160, 80, 119, -211, 54, -33, 128, 17, 167, -63, -37, -83, -2, -214, -342, -101, -211, 51, 106, -160, -183, 104, 150, 64, -182, -33, -32, 17, 91, 66, -55, 237, 13, 50, -1, 241, -36, 111, 70, 45, 180, 18, -66, -277, 80, -290, 29, 119, -110, -12, -44, -108, -214, -138, 286, -91, -18, 24, -229, 214, 100, 216, 239, -21, -62, -283, 46, 82, -4, 14, 98, 91, -58, -88, 147, -73, -35, 230, 68, -34, -113, 227, 150, -64, -41, -148, -206, 213, 118, -52, 22, -92, -285, 37, 5, -97, -375, -206, 238, 77, 137, -39, 22, 109, -72, -92, -143, -94, 134, -15, 59, 199, -203, 23, -8, -14, -147, 118, 427, 62, 266, -177, -47, 88, 93, 147, -154, -148, -5, 1, 34, 20, -170, -84, 9, 71, -204, 77, -82, -107, 305, -41, 73, -130, 49, 198, -137, 4, 107, -154, 177, -327, 22, 130, 296, -38, -31, -101, -67, 47, 206, 147, -53, 173, -125, 57, -74, 236, 67, 75, 13, 10, -159]
7758a59J81J6j23j62JL11mpR1QN5k0l44L11J80k03j00Q6j52L67k67j65K66m87
7782c20J24O26j68l66k96L09P8O0m71M57R9k10P5l3m1m7K89j74J10j28K5O1J5
7805G4j13J05j59K80M7l80M8J58j06J66J76k72N3j46j01KJ03L15l34L4M3p8M10
7828C25n99K36j46K30l3J23j51K38m10J19l4J96j65j52J77P0J77J7k09PJ08l3
7850I1k56j1j6J43K60j36q2j02J59k34J04j45J4K61J27k49q6J42k2J37o5LQ6K
7874A25MPp0J66m02J16L7q4K86Jk75K84k40j39O4jR6qP7q9J31j65N6N5k8k55K31
7901b0K2q3K1J73j44r9L2K49j31K79j71k7j44K03k39j51K80j16K8p7o0L01o6j99
7925a39K75k52J91K92k65J25m73K78m1R5j5k64J19J93j04N2m2R8j98J60j04M1
$$ y = [-159, 22, 38, -85, -247, -246, 65, 61, 54, 145, 153, 208, 188, -156, 155, 335, 132, 32, 118, -34, 333, 66, -99, 167, -320, -196, 430, 262, -104, -400, -91, -13, 47, -424, 33, 132, -78, -3, -36, -77, -124, 165, -9, 101, -27, -2, 59, 74, -39, 66, -93, 187, 234, -146, -98, 60, -46, 120, 296, 24, 77, -69, -170, -168, -65, 250, -84, -50, -7, -85, 325, -274, -38, -184, 46, 13, 136, -15, 223, -187, -68, -102, 94, -71, -223, -46, 24, 201, 218, 9, 16, 124, 91, -165, -176, -192, -49, 211, 75, -7, -109, 50, -184, -80, -225, -211, 50, 177, -72, -158, -16, -38, 99, 34, 37, 123, 125, 129, 136, 66, 232, -170, -54, -17, -101, 185, 186, -89, 195, -45, -184, -120, -121, -25, -33, 44, -45, 86, -79, -23, 32, 4, -251, -20, 2, -81, -60, 113, -31, -130, -98, 151, 20, 299, 128, 101, -43, 160, -79, -230, 50, -66, -38, -115, -175, 126, 60, -139, 136, -116, 75, 367, 102, 227, -246, 32, -9, 86, 71, -193, -74, 119, 15, 67, 25, 123, -75, 85, -19, 22]
7947B2p3o3J69P5Mk97j38M40q6N7j6m8K1M7j58J95k53J59P4j35L8J05j50Q8l2
7972D5m65L25m3L60m42J44J78j88j73K9L52j83K25n31L1L08J36l51O3J71k79M55
7994A67j82r0Q9K3n4J4J10p6qq9R9j1Qj38J03m2oK13k14J12j7J00Q7k81J01J02
8020A20j96M9l4J49K7l4j73J73k06K05l1J23j25l26J91J59L6n4L1k0K05l27J28
8043G0M5l63L53j71J6K67M0k21q9J42Kr7J26m4k62K9L9J07n5K11R8j5k15K05m47
8068b29j2M62j6r6J39m79K96p8j07J93j2K34j64k31K01o1j81M51m26J6K50j14
8090C6J56j84L93l60j08K3L59m72jp3MK23k34K23K15j34O9k93J37J54n3J48k51
8113b3J24k62K83O1k88J02J18j21j19J16j46J22k7N3K5p0J33k50J45l34Q7K35
$$ y = [22, -51, -114, 55, 130, 134, -163, -301, 139, 53, 110, 94, 46, 67, 114, -44, 151, -102, 57, 131, -4, 34, 139, -11, 77, 45, -420, -95, -138, 222, -220, -76, 102, -86, -259, -230, 122, -61, 164, -367, -336, -28, 108, -243, -180, -9, -288, 167, -15, -105, -16, 7, -47, -33, 77, 1, -7, -96, 3, -8, 0, -138, -35, -77, -83, 130, -84, 28, 11, 111, 198, -83, 18, 120, -76, -27, -61, 88, 115, 81, -92, 81, -125, 80, 49, 172, 47, -279, -88, 71, 107, 53, 84, 64, 269, -58, 70, 115, -248, 105, -66, -50, 217, 257, 36, -53, 89, 91, -6, 120, 76, -186, -157, -118, -11, -66, 145, 243, 228, 13, 218, -229, -241, 221, 205, 109, 248, -231, 65, -13, -120, 73, 61, 295, 131, -100, 101, 40, -141, 310, -116, -100, 150, 36, 192, 8, 401, 41, -67, -44, 315, -157, -158, -231, -227, -4, -238, -15, 200, 66, 135, -158, -21, 133, 80, 228, -23, 101, -161, 122, 183, -105, -3, 115, -6, -125, -9, -155, -33, -60, -7, 18, -52, 81, -169, -24, -358, -271, -36]
8135c6pj24mL06k27J77K58m02K98l33P7q0MJ33P6P8k7j7j82j04L8Q3j5j40K74
8160A04k69J28K2P2M4l57L6Q7j14L16k26P3o5J82l0o2K8J41k50K75J11l03K40
8183A83r7j49J68l4J98l39L01j25
$$ y = [-36, -43, -167, -171, 135, -92, 85, 343, -59, 239, -94, -17, -97, -93, 40, 116, 194, 167, 150, -32, -136, -98, -15, -30, -170, 104, -165, -37, -15, 57, 101, -256, -220, -133, -247, 69, -157, -84, -149, 33, 3, -59, -31, 110, -140, 135, 246, -57, 183, 86, -63, 105, 71, 269, -70, 231, 106]
8191A06
$$ Imaginary data points
##PAGE= N=2
##DATA TABLE= (X++(I..I)), XYDATA
0@%%%%%%%%%%%%%%Qj6J6j6J6j9K7l2L3m1M9n7P1p9Q8j04J20j36J53j75J99k23
36a18K50k79L11l48L88m29M75n28N85o46P12p85Q65r53J050j155J272j405J555
55H17j722J910k129K386k687L048l493M057m796N809p287R651j4029K4722r4879
70g8622j25684K63277J18843j22976j03126P7009Q5221l0429o1959k7247m0387
81d6080L2476O6034l0792r9587l970J29739N0216j32078n2936R2447L6932n4885
93a2484m9649J363K9708K2634K4301l1783l7556P4704O3462n0702l7725L3522
105B9795L1958k5147k2819J2397l9674l2065O0376M11q2348m650P2948L1189n0655
118a8284k2304N3687J5191k5006j241p295j4272M032K7150P603n2578l31Q0552
$$ y = [0, 0, 0, 0, 0, 0, 0, 0, 0, 0, 0, 0, 0, 0, 0, 8, -8, 8, -8, 8, -11, 16, -16, 17, -24, 25, -32, 39, -40, 48, -56, 64, -72, 81, -94, 105, -118, 132, -147, 164, -184, 204, -225, 250, -278, 307, -339, 373, -412, 453, -500, 550, -605, 667, -738, 817, -905, 1005, -1124, 1262, -1425, 1623, -1870, 2187, -2609, 3200, -4087, 5564, -8465, 16257, -78622, -204306, 58971, 177814, 54838, -48288, 28721, 113942, 83513, 21554, -5693, -46080, -13604, 52430, 21638, -77949, -81919, 47820, 98036, -34042, -86978, 5469, 42401, -12484, -62133, -60770, -31062, -8428, 15873, -15910, -53466, 21238, 84700, 33998, -3727, 29795, 61753, 36606, 13787, 26184, -13490, -45555, 14821, 15232, -67116, -71766, 1182, 32371, -18284, -40588, 13099, 28290, 3284, 2043, -5252, -19524, -15492, 11658, 19261, -33317, -33648, 46904]
131D6904O964n7991q055M3188K2664m1745l2756J6340M99o300k691k0972k011
144c5962J5894J7957O299k3733N308M0792M553j8850j3660N581K0810j2294k1101
157h406j174P30J7033O032k0848l92J8542J2653j5979k8117J7047J4959k9819
170a7739q196J2168j029m480N45J8423M727j3470K0663J9610j2839o943P639J0688
184B9767j5546k5547J5535N221k9470j118J7689M214j2032o654K2279M631j7737
197h768N175n2n143O372m573n831P58J1826J5472j3748o432K6861M346j3917l768
212H578L311N271j3576r143O463j2266m942J2571n567r114L057J4724P767j9052
226a1918L956K2653j0355j1376O507M815k147r552P675J0888j2466L163J1141
$$ y = [46904, 53868, -4123, -12178, 31010, 53674, 11929, -20827, -4487, -3988, -10288, -12979, -33951, -35962, -20068, -2111, 4188, -19545, -14237, 26555, 31108, 12258, -1402, 4179, 24989, 12695, -8406, -9580, -8850, 8183, 14215, -6633, -7025, 11517, 24170, 8191, -19926, -2879, 12080, -17739, -25935, -13767, -14796, -19276, -18731, -308, 4419, -9051, 11612, 31222, 18383, 11440, 19079, 29767, 14221, -11326, 4209, 9430, -20040, -21158, -3469, 745, -11287, -17941, 4338, 8969, -8768, -3593, -3645, -8788, -2416, -6989, -12820, -12062, -236, 15236, 1488, -4944, 21917, 26263, 12346, 8578, 11889, 17160, 3584, -5559, 904, -11362, -16304, -3733, -9300, -18414, -15357, -633, 7134, -11918, -7962, 14691, 4336, -7040, -533, 4282, 2135, -7417, 258, 11146, -1320, 1843, 12984]
239A2984n731k89K76K2j723j0427N469J038j6120M077Q010m263k524k156J1748
254C91N540j1203O810M082m278N886l574o064P64K080O532j0300p696J7828J946
269H744j1797J733L909N119n745p249Q176l737n449P628l799k449J255K774P700
284F813q835n348J4733k24q439r28J707P033p652o503Q810l283j733M769m890
299c970L523K875l143L870k851J096L720o802L422K014o302M625p98j518K984
314B745o309L817L626q051K084K334p92j67n278O261K570j0256O085M569n707
329b469N18R16M637k18q035P650L480o535J774j026J920J618p511L793K609o642
345c521K636J63j504J025k577M734K01n894O452o09k922M085m227J162L235m016
$$ y = [12984, 7253, 6964, 7240, 7262, 5539, -4888, 581, 1619, -14501, -10424, -2414, -6677, -9201, -11357, 391, 5931, -5272, 1538, 5620, 1342, 7228, 3654, -2410, -1646, 434, 6966, -3334, -11030, 6798, 8744, -3053, -1320, 2589, 7708, 1963, -5286, 2890, -847, -6296, 1332, -2467, -4916, -3661, -887, 6813, -2022, -7370, 7363, 7139, -1300, -2228, -521, 6512, -1140, -7643, 1167, -2116, -3849, 920, -3970, -447, 2428, -715, 3155, 304, 1400, 5120, -1682, 1740, 3754, -2548, 2077, 1279, -239, 2745, -3564, 253, 3879, -4172, -2088, 246, -546, -713, -5991, 270, 2840, -7416, -1331, 3238, -2469, -1951, -1035, 3602, 3384, -4651, 2999, 6479, -56, 1718, 692, 2612, 4230, -3281, 512, 3121, -3521, -885, -722, -2226, -1201, -3778, 956, 1157, -4737, 1715, 1106, -1816, 2269, -1958, -796, 2439, -1577]
361a577J081j404Q75M257o222K021N631n299J793Q47j114K231n114Q78N158n521
377a479m66J209Q71K829n876J617O836o159r17M244k435L8l494R34L360o865J754
394c999L644k850L379j080j7O055l663j658L681r45J404l767j152N033m758j049
410a742L834k723K236r45j952M969l989l367L523j608n05l079p70P310m715l444
426f967P943L65n30j42M6O864l564l869M520j102r15j912k867N290k385m105M931
443A601j513j210Q79j760K878l933k969O587k662l929J795Q25M999k434m070Q179
459C263K699k168q87q17N333k605o758M632n32m856J238m98K269j764m629P700
475A620O14n283J159J461L445l002p294O537K789m599Q64P78K870r7k776O090
$$ y = [-1577, -496, -1900, -1025, 3232, -2990, -969, 4662, -637, 1156, 2003, 889, 3120, -1994, -1116, 4042, -1479, -1945, -736, 135, 2964, -2912, -1295, 5541, -618, -1535, 2709, 274, 312, -3182, -2248, 1112, -5753, -3999, -355, -3205, 174, -906, -923, 5132, 1469, -189, 3492, 2547, 3951, 184, -968, 4065, -693, -1742, 2092, -631, 1605, 660, -1292, 3677, -312, -3679, -156, -1764, -2269, -5348, -6118, 1192, -3523, -6967, 976, 1341, 811, 669, 715, 7579, 4015, 146, 4666, 3564, 2649, 737, -2130, 3160, 775, -3330, 1601, 88, -1122, -243, -2003, 875, -3058, -6027, 560, -2102, -6031, -4236, -3411, 1588, -846, -4916, 3263, 5962, 3794, 2907, 2090, 7423, 4818, -1940, 2692, 2160, -2696, -1458, -1956, 313, -1451, -6080, 1620, 2234, -3049, -1890, -429, 3016, 14, -7280, -743, 2046, -2553, -1689, -911, 1959, 1862, -914, 5176]
491E176r69o999M992L126k434n169l773Q816K95r403Q53M887L242j602n903O489
507A624L918o341J594J644k612o63j176M407j512p858N318N664k262l900l332
522e487Q813M488j1265q70N443K02j742l982L011K375m748N630L454n624n55K863
538B006N550k994j1190N325R392o385p035o77P499K875r742P89O121k613L70M62
554b47j184j69j754N129J645p912J241M814K630q79p034L926Q495m831l249P63
570A384Q90J754m123j117Q00m884K956K209l247k72j883N014N608p984k986O670
586G89L774j170p871J102P836j880k815N70j214L858R28j304o29m461L826M707
602F046n940m658L31M898L873r420k681P869J823k008l373K18N652n00j552l64
$$ y = [5176, 4207, -2792, 2200, 5326, 2892, -2277, -6050, 2766, 3061, -6342, -5489, -602, 2640, 1038, -4865, 1624, 5542, -799, 795, 2439, -173, -836, -2012, 2395, 883, -6975, -1657, 4007, 1745, -2155, -5487, 3326, 7814, -3451, -4321, 1122, 1324, -418, -4400, -1389, 986, -3762, 1868, 5322, -302, -857, 2006, 7556, 4562, -6628, -1303, 8089, 1704, -5331, -6008, 1491, 4366, -5376, -4587, 1534, -1079, -709, -247, -1431, -1600, -3354, 1775, 3420, -4492, -3251, 1563, 4193, 3314, -3720, 206, 8701, 3870, 621, 1384, 2274, 4028, -95, -1212, -412, -5296, -2340, -131, -3378, -3650, -5533, -519, 5089, -2895, -5881, 789, 4563, 3393, -4478, -3376, 4460, 2580, -235, 335, -879, 2979, 3907, 2603, 1974, -2487, 1339, 6046, 106, -4552, -4221, 677, 4550, -4870, -7551, 318, 2141, 133, -3240, -3022, 2630, 2130, 578, 214]
618B14l411M101K308l945M43j588J469N280k878l488M97K337M101m977l862L983
634E84J004J51k866k980N018J52l549K412j051p8J825n34R13l373m20O088k190
651A106l626J286J001K808j565l811L405Q52M38K62l433J749J669k216J970k278
667c83j372L519j520m74n11k038M010m23k865Q18o45K789O88n238K662K639j847
684a91L71j608J312K244k536J554k91j436L108j221r44J116k298K296N06l547
700a565J032K7Q7L64l388K362K188l105J116J07N59J587k490R55J700k441J461
717E56n34n86K045k722J263K157k917J480M28j045J481k115N94J894l493R23Q33
734B42j556K024k481J77L406k294j5J050n07J283k370L40K416l438j75K039j498
$$ y = [214, -3197, 904, 3212, -733, -290, -1878, -409, 4871, 1993, -1495, -998, 1339, 5440, 463, -3399, 584, 1588, 1739, -1127, -4107, 911, 1063, -2486, -74, -1125, -1203, 622, 88, 1001, -2372, -2792, 3296, 1106, -2520, -1234, -233, 2575, 1010, -2801, 604, 1456, 1894, 2156, -1277, 472, 2141, -75, 1895, -383, -1755, 1764, 244, -230, -741, -2779, 1231, 808, -2057, -1239, -1884, 905, 1593, -3645, -983, 1656, -191, 180, -1428, -116, 2128, -408, 1146, 855, -581, 2527, 1306, 362, 1478, -820, 1476, 1982, -1565, -533, -506, -419, -55, -3443, -1081, 1107, -1998, -882, -775, -216, 1371, -1119, -164, 1536, -905, 556, 22, -564, 1481, -1241, 22, 2179, -738, 742, 1170, 125, 1606, -509, 85, 1979, -1514, -591, 242, -1314, 710, -1771, -1594, 1812, -482, -497, 553, 46, 1329, -1041, -701, 1715, -1723, -1898, 141, -1357]
751a357R05o50L72K570k053K17K181j343J208j567p55K982l159q13K371j632K98
768b25r3l02K393k453pK012j937N18j166j633K843j395k158K651q9Q33J5l91L360
787B776j157p28K694j941o87Q56j479J151j611j895L063j253q78N04p25K717j763
804c56k253L196j356j599R22j162J522J61j170K485l62P88J595j450J903M53k450
821H67K192j218k294J326j288K67r54j556L121q94j286J647j153R39R28l065K081
838c40P12k130Q94L5P06Mj337L272L72k500K569k21k96k24j962J012K11k423P48
857h98n63N99Q07k112K392Q15k379K524L2j450N12q38Q45j20k396J663O40l28
875b55J232k302J490K463k749L0P38n55P97j950L57J122k450J891P92j494J477
$$ y = [-1357, -452, -1102, -730, 1840, -213, 4, 2185, 842, 2050, 483, -272, 2710, -449, -1262, 1109, -523, -225, -318, -620, 1773, -680, -687, 1325, -612, -94, -1260, -2893, -50, -1445, -3603, -952, -1041, -208, -193, -584, 2776, 1619, 891, 3585, 1644, 957, 1813, 334, 1485, -126, -2021, 1042, -211, -1089, -585, -1310, 1407, -356, -2609, 587, -769, -2368, -1446, -2608, -1086, -925, -2095, 390, 28, 816, 2411, 961, 2864, 3317, 867, 3059, 1841, -453, 873, -415, -148, -1102, -2658, 463, -431, -1717, -70, -1223, -284, 644, -2421, -340, 372, -1758, -864, -829, -123, -119, -1456, 1816, 2188, -312, 2257, 2036, 1740, 1516, -446, 566, 777, -1646, -898, -1461, -862, -55, -2167, 225, 1040, -1339, 1185, 1217, -233, 279, -559, 286, 166, -2230, -567, 73, -255, 977, -1325, 165, 2628, -121, -91, 647, 92, 889, -1061, -704, 418, -2032, -141, 651, -843, 634]
892F34n98J037J776k875l63K205r92n76k261J272J932l402L91K163k009R24L72
909c70M28Q58k218J098K213k463j28m6P92J882k934J15K678q03k09k16l78J722
927B021k202k54J086k092R86J3j279J594j988O4L427j521j454R12J058J582l084
944a131n77L921j520j105P32K35J165k018l35K982k223j210K065k15n7k151L87
961a055L429k719k158K836p7n03r79l18K753k107o07K014p49L62J06o32K233j937
979a08j000K374m35l90j019n29L110j501j918K397l21P4m70j091K615q42k596
996a650K091j61j060o35j95K222j714k401M100L62k038J26J061K202k096k060
1012a846L764o98k409J551N1R57j439r98L739n85k612J489m8l5j560j257K191
$$ y = [634, 36, 1073, 2849, -26, -389, 1816, 824, 248, -2013, -741, 1191, -2211, -1820, 343, -1666, -742, -370, 58, 916, -1302, -204, 2009, -454, -582, -628, 164, 2046, -888, -773, 1905, 1102, 893, 677, 299, 2021, -181, -435, 651, -1441, -455, -442, -1721, -127, -2115, -2051, 1376, -145, -1599, -687, 371, 1953, -1131, -1708, 2213, 693, -412, 320, 555, 1720, -298, -633, 2349, 126, -1084, 981, 766, 709, -1442, -1055, 2374, -345, -2503, 333, 256, -247, -1226, -1544, 1209, -898, -1505, 509, -240, 122, 228, -404, 1829, -108, -1108, 1266, 831, 441, -578, -1107, 2003, 502, -1416, 981, 660, 734, 264, -827, 1788, 946, -1650, 441, 280, -780, -1415, -1610, 612, -1102, -3503, 597, 959, -1079, -953, 108, 2310, 214, -1846, 1918, 1220, -1189, 362, 413, 1370, -69, -1067, 2672, 2087, -525, 964, 916, 881, -679, -1936, 255]
1029B55j480k113K158p49K75Q25j013K201L30p06J111k05N32r6j762J781k8k112
1047g96J138J67L48m5j504J752M63k473R26L44o86r39j568K207K98l192J779J870
1065H9o05L16J94K633j02k310K228j9k256N92m36k13n07j737J899M25j737J568
1083B2m3L27L29j497J369p18j540J431p86n78J571l66N96O80L03J130r05M3J699
1102C067k867p41J026j423m41j075L03J523j559O58K338o89Q21j62M90J079k113
1119B35N0J319k085j53J409o50M20j187J065J589k016Q72M23k291P37p57j131
1136b151Q8j095R04M77p63K684M23O7J810k53Q50O2j868J506q61k596J103m11
1154b4m71p72j12K112j346j105K413r20r63L91l62q3j000o81K009m18l92K401
$$ y = [255, -1225, -3338, -1180, -1929, -1654, -829, -1842, 359, 689, -17, 1094, 889, 1421, 1325, -437, 1344, 1316, -796, 342, 509, 857, 812, -692, 1060, 1523, -950, -24, 320, -366, -1305, -2873, -666, -368, -3560, -1781, 89, -516, -200, -6, 2627, 2525, 215, 2443, 2424, 168, 760, 324, 111, -396, -2133, -234, 191, -1546, 22, -21, 306, 635, -862, 507, -211, -1751, -320, -1106, -1684, -113, -479, 117, 797, 1100, 2230, 1325, 1368, 3067, 200, -541, 485, -938, -1379, -2454, -2151, -628, -2187, -1529, 809, 120, 941, 779, 1269, 2348, 235, 285, 1604, -481, -634, 775, 125, 545, -642, 423, 2012, -4, 868, 1291, -1000, -263, -1020, -2151, -2063, -3158, -2254, -1777, -2540, 144, 567, 634, 2444, 2191, 3041, 3103, 1235, 2741, 1880, -716, 387, -24, -495, -1267, -1379, 733, -613, -1718, 695, -225, -1188, -797, -1159, -1242, -2242, -2923, -914, -1332, -1724, 677]
1172F77O1J235O21m21K115j367j114P54j349j204n10j329M48n79m19J618j589
1189b352J263J591j792R08N74q57j33j51Q66k24j358J913J057p58Q79O95P23K55
1207C099j691P57J04l146j15j84n99m55j313K061L58j699K601R27l24L82j84J419
1225A998m71k147J171m48q51J236p70N00J083r51J009j75p08Q02j257p17N02j688
1243a882J67n6o85J424l83J057J905r60O73J056l72J57j532J38P90k353m53R79
1261c30q08J03m1P00R16j518Q01J310j564q9j60j8O79j643N04K047j414R38Q93
1280A306K89Q68q12K54N13j853j50l17j148j43r52j37Q15l44M11Q06k44J308m29
1299D1k91J304q15n18K92k48O42j38l35J415k34j4Q03n65M96j098r75J021j237
$$ y = [677, 738, 1973, 2594, 2173, 4288, 2921, 1807, 2561, 1212, 8, -502, -1831, -1383, -1962, -2381, -763, -2352, -1089, 502, -1290, -382, 192, -665, -798, -949, -83, -307, -1665, 248, 1305, 547, 1426, 2121, 2844, 3099, 1408, 2165, 2269, -877, -992, -1176, -1775, -2230, -3543, -1482, -1124, -2823, -222, 705, 381, 763, 579, 1998, 1527, -620, 551, 103, -748, 488, -282, 218, 1301, 350, 1359, 1184, 476, 1278, 21, -696, -194, -1882, -1715, -1771, -2456, -1032, -1415, -358, 1547, 587, 1260, 2316, 1944, 2101, 569, 707, 1497, -856, -1309, -330, -1138, -1035, -1076, -376, 540, -978, -177, 1133, -431, -520, -680, -698, -19, -1662, -1158, 889, -525, 413, 1306, 1595, 2463, 1651, 1905, 2418, 565, 415, 98, -1050, -1193, -2145, -2282, -1467, -1811, -1400, -594, -838, 470, 41, -250, 1054, 239, -279, 13, -235, 407, 269, -66, 1349, 1115, 1101, 1904, 1339, 1835, 737, -238, 783, -454]
1318d54j388L62l91k2n65L33J749o21J46J827p76M23O31m97N48p94q45J274p82
1337A58K55J98n83J327n59p10J222j038j93J4j159O45r45o21R36k64M45N94o75
1356i53J794J33r41J702n34o60J25k90M42n15j008R84m23n53O05n08R81K90j424
1375g53Q48L75r30L69m79K02j21q49J513j92m42R60j27L32K04r29N99J93j089
1394c16K94n33K16J05q10P86M16n18O19j72K65L48q30Q44Jj069M26k18L41K1j113
1415h97Q24P31j004K01L95ml0q92N73J62j300O85J35k13P68p71P31R40j527P53
1435B60N29l77J69o53O70N73j584K20O04o11O2k45L90K83p29jN95p16J97l33M47
1456b50Q47j612O04P32m24L64j59Q6M65j033N32Q88j021L80j48k13M42p27J44
$$ y = [-454, -1842, -1480, -1871, -1893, -2458, -2125, -376, -997, -851, 976, 200, 623, 1254, 757, 1305, 511, -334, 940, 158, 413, 611, 28, 1355, 796, 86, 1308, 270, 77, 91, -1068, -423, -1368, -1989, -1053, -1317, -872, -278, -953, 841, 974, 33, 1735, 1201, 541, 666, 376, 818, 303, -705, 279, -144, -697, -92, -600, 381, 671, -753, 95, 470, -460, -91, -570, -368, -489, -1338, 175, -17, -459, 501, 374, 706, 910, -19, 580, 773, -316, -22, -555, -339, -234, -1044, -258, 158, -360, 259, 87, 352, 700, -130, 714, 715, -354, 72, -146, 195, 216, -897, -73, 658, -346, -145, 250, 246, 216, -676, -103, 59, -1241, -556, -421, -634, 134, -637, 94, 1034, -493, 260, 789, 412, 581, -72, 598, 1171, -413, -193, 411, -200, -138, -383, 7, 290, -439, -440, 155, -561, -364, -697, -250, 597, -1015, -411, 321, -103, 261, 102, 188, 653, -380, 152, 1040, 19, 399, 251, 38, 480, -247, -103]
1475a03N19n66n1J41j18J21p07M57P16o84J17K74n63Q34n66n8O71q88K98L28m02
1496b30Q85q75P9R88o97j20Q14o20L29m88n0R75j018l11M97l99M50m64r8N71n65
1517c47k53P23m69J84j72l89R21q93K49Q56j006N11N07l52R05m68r0L42o01M17
1537E75k16q75R19o22m78P50n31p4J32l67P61k77r5N28m06q0K74o58P80j16n57
1558f33J053m1k17M73j64J06M01p83M87n89l63M03o15J9K78o41P35k45J07K63
1578C4l29K57L87n63O12k90m43N63m88J37N74o40K63L32kL68n77K6K25o76O6L08
1600A44o67K61l10K28J82n88J051J75m54M49k23j05M77q00K7N46r09Q32n82n0
1620c16L84n23N14N52q00O28j82n57O49n32r7O21n20NK56j18P12p07j21J155p69
$$ y = [-103, 416, -150, -201, -60, -178, -57, -764, -307, 409, -275, -158, 116, -447, 387, -179, -237, 434, -454, -156, 172, -230, 655, -220, -141, 847, 150, 30, 844, 224, 553, 65, 15, 990, -28, -339, 158, -241, 209, -255, -353, 218, -347, -600, 123, -346, -162, -334, -723, 198, -695, -446, 410, -596, -85, 422, 70, 975, 507, 417, 759, 158, 575, 359, -516, 403, -219, -697, 53, -478, -552, -420, -787, -26, -303, -398, 130, -276, -356, -82, -740, 40, -76, -633, 420, 379, 162, 635, 471, 577, 978, 195, 682, 93, -270, 133, -482, -463, -185, -826, -91, -336, -229, 34, -295, -38, 349, -214, 398, 108, -335, 228, -260, -123, 451, -189, 74, 406, 404, 772, 195, 221, 446, -230, -164, 144, -523, -262, -572, -344, -162, -750, 301, 476, 22, 471, 248, 143, 620, -180, -153, 393, -516, 316, -266, -316, 68, -455, 59, 611, -189, 439, 257, -300, 349, -183, -280, 341, -179, -174, 82, -36, 676, -31, -152, 1003, 234]
1641B34J50J8k64K43q37l02N58m21J26q5l0P74o74K3J236m14m06L43k0K01n58
1662a05L17K55o76J83P45m82K69m28m8N74o58p3K47o28K39m00l51M53o9J16L06
1683b14j55O22K8l92M96r5k15J15qk4K69n82Q41m88m29N49l99L03l6k74N12p09
1705b85l17M57n8j87k3j52O70k56n04J176k41j11rQ7K00k55j85O24k29n71M99
1726C30m65J74q2pM06j46m59M99m88M79l50l92M27nn30N98k99L63j79qM37J03
1748D06k80j01N4j40J26m61K98K76m11J20K78k83M21o06N55K78q56N98j77N3J54
1769C02o00Q1M21o05M82k77k0K69l07L16J46n38M05k30j64K67l55L92N20l77j00
1790B8L72j84L7m0%N55j000M06L0j51L23l99j53L77o69K99L83o46M31m20L23M15
$$ y = [234, 384, 402, 138, 381, -456, -758, -200, -621, -495, -580, -610, 164, -510, -487, 749, 335, -71, 272, 252, 453, -105, 212, 467, -209, -26, 719, 237, 506, 78, 30, 604, -54, -127, 120, -508, -269, -669, -1020, -567, -636, -520, -214, -369, 253, 281, -111, 385, 290, 75, 190, 182, 158, 427, -155, 686, 198, -231, 318, -81, 222, 186, -88, 424, -285, -602, -145, -203, -390, -413, -565, 105, -151, -655, 521, 280, 169, 160, 247, 447, 192, 7, 631, 402, -169, 330, -135, 39, -43, -50, 356, 210, -249, 250, -238, 241, -109, -501, -74, -79, -609, -11, -310, 53, -126, -134, 303, 406, 126, 25, 79, -61, 65, -396, -98, 178, -233, -113, 165, -118, 303, -303, 252, 530, -326, 272, 95, 148, 302, -298, -217, 204, -401, 81, -196, -216, 53, -254, 62, 208, -330, 75, -155, -319, -52, -407, -15, 505, 128, 28, 400, 216, 253, 213, 213, 768, -232, 174, 204, 53, 376, -23, -176, 201, -468, -169, 214, -432, -1, -421, -98, 317]
1812C17n40%M48j15J48n50K84M99o80L87N0O2l49K90k0J13m94L33k78k96M13J52
1834A74m39K23k53p8K79l50M32o6p0L30m3j56M70p61M05j39j63M35m17j14P29
1855D28j77k92M20j95M05m74j30L65m90rK59k94M85p51m3O69n48N0L22j1rk47
1877b67l1N99o22K80M29n10R4J84r8rK27k56L79r1j41K04n85Q26m60m17L14O5
1899A14n34M49m29N74j94n47P68m07K13o1m55O12n0m12M96j7O1j51j50N85j25
1920C40n03P09o02O0M12o11J87j49l81L99j36kJ90k51L16l1n16O97j08m87Q34
1941C67n04K28K67n26J39J17O4K25J9N0l10l47P20k66n17K31K13n08M79l93L36
1962H4p3n98O30k82O1L01k56J36M76q80L87j7j40M36o17M06k0l37M68j70K7N11
$$ y = [317, -223, -223, 225, 110, 258, -292, -8, 491, -189, 198, 248, 310, -39, 251, 231, 344, -150, 183, -95, -391, 22, 174, -265, -42, -295, -373, -94, -444, -12, -78, -148, 182, 139, -17, 453, -308, 97, -42, -205, 230, -187, -301, 428, 251, -41, 379, 184, 589, 115, -15, 350, -140, -149, 110, -184, 301, -450, -493, 176, -372, -322, 0, -11, -20, -267, -298, 301, -321, -41, 388, -122, -28, 156, 58, 49, 276, 20, 399, 308, 167, 371, -214, 612, 152, -265, 49, 114, -420, 29, -400, 174, -20, -567, 201, -206, 7, -54, -509, 103, 53, -359, 137, 120, 181, 30, -120, 465, 340, -163, 546, -56, 4, 416, -195, -8, -157, -538, -139, -275, -277, -87, -338, -22, -53, -569, 128, 20, -467, 367, -137, 91, 358, -168, -29, 88, 152, 377, 396, 446, 136, -211, 509, 243, -274, -43, 170, -338, 141, -252, 84, 11, -587, 43, -239, -178, 123, -133, 3, 479, -401, -14, -31, -171, 265, -352, 54, 34, -303, 165, -5, 22, 533]
1984E33l47n00N56n75M20K6k96N28k90m74Q64m99M05j46o7R4o44K73L41m21J10
2005a09l7j94K29j79J65K99l00k19R05n44N3j46m2K51m19N99k34o6L55l06k60
2026a99M30m23J77Q3l17L29j16l57M20o47K17K51j83R1K6j62P51k94k45L76l64
2047a56M25j39j42O22n42mK63k68j78K02n2J28l05k52P46n35N2J31p08Q35k66
2068a43r7M13m84N16J93m03K95R9l42J86j87J04j09p3J49o3k81M60k9l53R6L3
2090b0K20q2o45N20J91m68M83o26N43L3m27M09j45j83K00P3K7M0l48L37j8j61
2112d7J26P5r7J44m66N42j24n08N93j11k65J81k67J84J07l85K22j2J67J50n77
2133c68K47K64k00k5k9M9J66l24M50J44n67K05O3J61l1j87j43N12n08O8L48j08
$$ y = [533, 186, -314, 242, -333, 87, 113, -183, 345, 55, -419, 445, -54, 351, 205, 138, 232, -412, -139, 202, -219, -109, -146, -340, -111, -290, -125, 174, -126, -345, 560, 16, 69, -77, -119, 132, -287, 312, 78, 12, 367, 61, -199, 231, -192, -15, 68, -249, 80, -36, -393, 27, -620, -403, -152, -335, -244, -218, -380, 371, 77, -168, 208, -156, 269, 130, -12, 610, 68, 64, 327, 59, -119, 83, 31, 159, -146, -398, 348, -187, -135, -4, -712, 123, -143, -240, 173, -311, 205, 398, -5, 290, 389, 47, 233, 46, 150, 41, -32, 117, 54, -227, 233, 204, -149, -53, -20, 200, 118, -527, -7, 184, -284, 199, -427, 116, 149, -278, 131, -14, -197, 3, 76, 103, 143, -205, 132, 114, -47, 79, 154, 57, 201, -265, 277, 153, -355, 238, 127, -138, 43, -224, -40, 67, -318, -96, -108, 59, 209, -368, -121, 143, -57, -82, -111, -62, 104, -220, 230, 374, -193, 12, 75, 236, 205, 18, -125, 387, -121, -53, 295, 187]
2155A87k83K1r8L61l34K61k90k58N75q2j90J0O7J05K02m51P19m55J36q6k45J14
2177a4J18l07O82n04j03J50l10L12Q8l55L38l68j12P19n01n8K34j11P8j27J05
2198d6K77m09L30J48l68J0K43j77L55p76J43M34n24J29L11Q1j4k29k29N71k94
2219c4l4L15o10M94p8k81L04l71R1K20l22N61l17K8J56o8k96J95o5K26j05l23
2241c14K39K48m64M59M4J76k61j16N56k32l01L19j71j67k01m73P69l29k15K89
2261a45l75N70l3j70M76l17m67M83L2O4j9k39N57j8l05J73Q0q7Q5k16K91k46l93
2284b19L43l48n8O0l03N59l43l16M96L68m10Q3J09K47l11n3K96j45k45M66o21
2305c45O68Lm71M67j61j66J67j84m8mk61J08Qj61L30j75L00K62m20K31J31j81
$$ y = [187, -96, -75, -173, 188, -146, 115, -175, -433, 142, 60, -130, -120, -53, 52, 254, -197, 522, 67, 203, 117, -128, -14, 104, -203, 479, -25, -128, 22, -288, 24, 112, -243, 95, -273, -385, 334, -167, -225, 9, -102, -24, -151, -46, 231, -178, 152, 300, -68, -58, 185, 8, 363, -413, -270, 164, -360, -231, 80, 161, 147, -82, -311, 260, -34, -68, 247, -363, 131, 53, -228, 76, -295, -204, 16, -306, 255, -62, -34, 122, 54, -242, -47, -112, 114, 9, -314, -75, 173, -291, 168, 212, 388, 127, 11, 567, 335, 34, 353, 182, 15, -186, -659, 110, -219, -434, -145, -520, 50, 17, -153, 323, 6, -461, 22, 54, 118, 99, -140, 417, 399, 94, 267, 347, 260, 345, 129, 420, 174, -219, 124, -224, -282, -222, -525, 34, -309, -625, -129, 239, -171, -88, 21, 268, -43, -96, 200, 55, -190, 276, -345, 323, 326, -145, 322, 161, -5, 162, -22, -70, -74, -335, -227, -219, -380, -50, -225, 75, 337, -83, 148, 279, 98]
2327I8N7J64l10Q7l7J8o1k48K76Q9k10J26j02J12J13k61J21or7Rn79L29N47l63
2351a28J61O7o8M12n35K99J95m00o9Q2l58K31j81j78L75k06K39J09J33l8N1k27
2373c4M50k03m62K59R8j05K05k45K59k37L7K58k06K83l06k0km01J38k75J62L1
2395c16r9n0L43K09j80L21k59J85k7l0L62o17K84J0k4j4J63j68J30j75K7m1p9
2418d5k12J12j03k06J04k84L56l6Q3R0l1L45k32J53J64j61O8k5P8P2k17m8O0k62
2442a77j29K97k03M42l85J27j46K20n1j0k22Q1l5r9J49L08n2J5j91O8N31l82m3
2465A13R0n9k61R0J99q6k50J34L67m43J25J41L4n3l68J32K30j12K3k64jK88j49
2488h0K83o6j90R4R1j37j0K17l75L60l26J05j31K16l3KJ67j01O4l05M38k87qj45
$$ y = [98, 155, 319, 9, 96, 59, 77, 16, -232, 44, 133, -77, 49, -53, 59, 172, -89, 32, 26, -71, -62, -641, -312, 235, -128, 33, 100, 32, 444, -91, 208, 403, 3, -66, 16, -342, -111, -292, -470, -95, -301, -62, 47, 180, 142, 193, -34, 416, 213, -249, 10, 108, 3, 208, -37, 222, -15, 22, 280, 74, 357, 51, 31, 29, -372, -234, -509, -347, -316, -415, -465, -122, 87, -93, 228, -31, 154, 127, 97, 459, -158, 126, 136, 112, 98, 261, 93, 223, 48, 75, 34, -45, -257, -145, -248, -454, -350, -634, -278, -314, -231, -141, -172, 173, -59, 94, 258, 97, 165, 140, 218, 290, 73, 25, 85, -177, -306, -9, -212, 230, -155, -28, -174, 46, -5, -15, -237, -156, -191, -290, -141, 167, 115, 130, -61, 7, 538, 156, 113, 203, 144, -117, -27, 172, 86, -164, -30, 337, -106, 19, 160, 194, 141, -227, -95, 135, 23, 46, -218, -219, 69, -80, 203, 137, -53, 41, 132, -5, -15, 202, -173, 187, -139, -34, -165, 51, 18, 20, 187, 86, 150, -155, 283, -4, -12, -157]
2512a57J98L25m18J39j07l31O15n27K26P6k72J29Q5k68O35m89J12L72l92J52Q1
2533A84qk86L62k50J44O9K8j57j56K32nK6N1o91J79L34r1k44K70m8L4j45J76P6
2557H4l44M08o6j03L6m6q7P1k6j6k1M22r3k07p5J40ql2r1m02P07l44P4K58m52
2582b13j0J31j36K33J16p9K07m05J56J62nl79L64k80K84k98l7K18l21M23k78J77
2604C0K55l19KR9l1j29m8j66J87J5J82k59l05M30jL7R2j42J33L4J3l88J93K3K22
2629A59J5k42M4K58k27L48k16K95j74n26L01P2l24P5J9J39j84n7K91J81m77K83
2651E3k71J33L09l25J26N0j68K01k8j03L8m0k6M21j64o8q7m5Q3o8J72j68q6m8
2675a09J00j63K33j31j92L66o8q3R5n9J11J7k98K83o7n5K14l12L74n32L11J92
$$ y = [-157, 41, 366, -52, 87, -20, -351, 264, -263, -37, 39, -233, -104, -19, -287, 348, -141, -29, 343, -49, 103, 184, 176, -110, 252, 2, 146, 215, 243, 86, -70, 162, 157, 183, 234, -457, -278, 56, -35, -279, -9, -57, -23, -168, 8, 84, -260, 148, 82, -21, 15, -31, -118, -47, -73, -89, -110, 312, 219, 12, -63, 77, 69, 37, -54, -456, 251, -93, -19, 239, -213, -223, -92, -228, 5, 121, 42, 249, -156, 0, 162, 157, -222, 142, -138, 146, -152, -189, 29, -292, 131, -147, 30, 285, -34, -32, 67, 36, -93, -141, -307, -120, -105, 77, -182, -487, -57, -58, -21, 71, -71, 62, 96, 109, -279, -86, -63, 159, 174, -68, -24, 234, 7, 355, 139, 434, 260, -266, 35, 107, -217, -142, -123, 16, -168, -225, 66, 247, -230, 53, -218, -85, 224, -101, 25, 75, -93, 108, 80, -23, 15, -25, -51, 370, 206, 138, 51, 6, 89, 21, 193, 25, -61, -109, -9, -172, 61, -70, -262, 104, 36, -47, 48, -11, 100, 117, -181, 102, 35, -20, 194, -118, 256, -276, 35, 227]
2697B27k03m7J40j18j52K1J1q4QJ88J23m3j8J00j12J48l65J56oJ57m1l38K93N1
2721I6j92N5J50M7q1N4m1p9L13m00K67o3j51O7N7K4l28K77n2j78L81j07r3K87
2745C10k07m19K58l21K29q5L02J09j54j61K52j62j85K38j10L53m81J47L1Rk5m
2767g6J77r7K85l59K56k14k5q0j34N27l07j74K75k03l1M3n4k4nO6L30j13m9L26
2791C40l1k30k29J82J76l18J5J9j28K95k18p0K77k59R3J84J03l29L20l18Q1O8
2813B3k52J77n3J72p2K64Q8j99J3j32j97M50l15R1k4k32J8L23p8k23J70J23k09
2836g4K70j97MM6j42L02l11j58J15l0N3L08Q3M2k87J04L24n17O3J42O1r6l79M51
2860A77J61k64J41l51N5L34j45k30J72j26L0J79j91J41K01m87M26k38j68K95o
$$ y = [227, 24, -23, 117, -1, -153, -132, -121, -205, -197, -9, 114, 71, 53, 153, 41, 189, -176, -20, -26, 131, 90, -248, 45, 96, -96, -41, 109, 156, 75, 129, 88, 9, 322, -78, 189, 126, -25, 42, 99, 123, -205, 72, 20, -158, 223, 116, 23, 310, 103, -316, -58, -379, -150, -235, 67, 176, 22, -139, 113, -49, -234, 4, -106, 247, -234, -87, -56, -47, -72, -76, 101, 4, 289, -70, 186, -28, -53, -133, -267, 260, -47, -221, 54, -149, -180, -137, -191, -215, -220, -154, 176, 63, 14, 340, 309, 79, -150, 32, 208, -110, -95, -76, -204, 91, -127, -197, 80, -179, -86, 98, 201, -128, 192, -126, -45, 23, -229, -52, -105, 67, -5, 259, 347, 148, 161, 29, -168, 282, -33, 58, 34, -198, -180, 143, 65, -158, 12, 135, -74, 196, -1, 3, 49, -93, 209, -102, -260, -145, -175, -122, 186, 269, 311, 24, 128, 452, -65, -2, 140, 201, 105, -274, 177, 338, 74, 215, -136, -81, 253, 108, -122, 50, -76, -46, 133, -58, 83, 284, -203, 223, -15, -183, 112, 106]
2881A06K41n27K13J90j88k75L58n5L6j5k15L99r9j88K55k19K5O3k09K2K70m58
2903b70L39q4J4k82M00Qj95o5K44N0r0K1j22p5K42r9J32m28J56P9n3K59J4l26
2927a31J45N3k01k20L99N0o0m41K50J27P8N1Q7j81l6P8M08m21k14q1K36P0j90
2950a44K58J10j50j58K18j19J74j75L9p8k5M1r7J08%r1j51L72n7k08R3L1k8K88
2974B51l59R1M1k97L78k7j16JN6Q7J34n93L73J45j64nO5q5mj98J57J43k04L25
2998A95j02K7mm08J38L05r0l70K22J71k6k90M03J3o6j14k75L07j00R5l7J48n9
3021H3j17K4k51M25O1k20M26m03J03k31N8M7k48K04J34p2J08k31J62J29k36K71
3043B26j87j13J05l0p7K27J4j03K67k91rJ47l69L84k13l8J46L9m1k57K28j33j10
$$ y = [106, 347, -180, 33, 223, 35, -240, 118, 63, 99, 84, -131, 268, 169, -19, 236, 17, 42, 105, -104, -82, 188, -270, 69, -15, -1, -283, 117, 125, -70, -135, 109, 159, 69, 90, -32, -107, 135, 36, 168, -260, -104, -25, -78, 181, 195, -131, 14, 67, -134, -354, 45, 95, 35, -406, -156, -29, 49, 100, 187, 6, -30, 48, 456, 35, -179, -260, -24, 46, -144, 114, 224, 74, -84, 134, 15, 189, 14, 53, -25, -50, -9, -106, 2, 2, -89, -240, 132, 75, -133, -40, -9, -37, 251, -108, -17, 24, -273, 105, 78, -38, -37, 19, 106, 240, -353, 20, 165, 1, -4, 61, -24, -28, -226, -69, 74, -130, 195, 93, 120, 116, -292, -154, 151, 61, -309, -87, 84, 58, -232, 171, 184, 118, 4, -271, 36, -64, 31, -6, 142, 83, -34, -10, -261, 164, 225, 5, 431, 28, 131, -100, -42, 5, -243, -39, 95, 23, 131, -100, 62, 191, -45, 226, 39, -74, 31, 1, -76, 151, 165, 62, 329, 38, 29, 176, -193, 191, -22, -60, 86, 125, 84, -173, 55, -78, -188]
3066a88N7K02j08k04J59N4J2l4p3K97j48Rk09j09J42J07J00N7j42j%k8L73n48
3090b23j91O85j78j13Kq1K9N33n78P2j36K47k25J70P2oj56Q0l9j45J08q3J90j10
3114g6j9J86K08l09K4j6L68l48M3j48J7J23J7M4k64K55j46O5m9N0j34K15%j77
3138g1N1k7P6j14L99k82j25k8L28k30K90m10L27j22p2j11R1LJ71l3j47O9k07P1
3162a03K02J37l15r8J90j78J41K21n17L23M4j67N68k14l25N4J13j22K38j57M5
3183H0P2j68J07J13k92O1j37R6K28j24k70K97l3P4m53K06o3K01L14k95NO8N8K0
3207A65p0l92O62l32l60N00j36j0J58k67O0J62m8J04l97M89l11J65ll35K78k77
3229a95J14J13o2j21J53J7j94J69j49J42L38l67J5J63j65Q4k4j44J99l17K65o1
$$ y = [-188, -131, 71, -37, -241, -82, -28, -16, -50, -123, 174, 26, 35, -174, -283, -141, -34, 66, 123, -19, -20, -20, -48, 325, -223, -414, 271, 93, -20, -18, -99, -70, 463, -115, -43, -179, 68, -157, 13, 85, 79, -77, 3, -36, -181, -73, -156, 34, -76, -95, 91, 299, -10, 14, -2, 366, 18, 61, -87, -70, 53, 70, 114, -150, 105, -41, 24, -25, 25, -109, 106, 106, -71, -20, -47, 29, -85, 314, 32, -93, -121, 207, -23, 267, -143, 184, 62, -10, -121, -30, -27, 144, 111, -36, 33, -174, -103, 99, 236, -79, -177, 13, -165, -24, 197, -320, 3, 47, -120, 448, 234, -91, -37, 76, -46, 192, 35, 80, 152, -16, 91, 204, -88, -27, -164, -68, 160, 36, -234, 63, 30, 104, -349, -143, -206, -5, 309, 14, 19, 87, 145, 165, 95, -297, 365, 33, -327, 173, 37, 27, 185, -82, -22, 140, 92, 196, -201, 288, -23, 142, 139, -196, 82, -195, -81, 32, -30, -151, 2, 19, -175, -6, -155, -13, 325, -42, -27, 136, -29, 55, 31, -113, 86, -231, 34, -27]
3251b7j21K96L0n8M4k98q0M28n60J72K25K8k37P8q2J04K5j60L05l32K87p3l6L7
3275eq8K18k88j18L26j49LJ11J3K25o6k60j43K74L9o4n5n9J79j11K5p2P7pP2j65
3301h8L17l61R6k62K17K55k14P6M8j06j10J69j64K02J42k73K66M2J84n29J43J13
3323A63j60k05L19l19J07J5J54K99m38k62M19j23oJ95j70nK4j89P43m68q2K37
3345B48j45q5L8K8J2J01m98L21r7L15j54j64J13j92P1k0P1j40J45l9J39j40J33
3368F1N6j63K04J23m28J45J28j16N3l8J64Q4k55Q9P3k31j08j65J71J14K5q1L32
3391B37k74j6j8j35J62J34J5P9m8K1l48L9K91l33l6L16k21K35Q0k83J45L8n5K00
3415B25l69J73P1n3k03K03NJ3j46l7Q1L70k47o4o7j67K46J1N9j49J54K4l76L82
$$ y = [-27, -148, 148, 178, 120, 164, -134, -214, 214, -346, -174, 51, 79, -158, -80, -162, -58, -33, -193, 112, -220, 67, -6, -42, -5, -93, 125, -163, -281, 45, -104, -101, 10, 23, 248, 182, -78, -221, 53, 92, 28, -27, -86, 93, -18, 7, -65, 12, 5, 77, -88, 229, -132, -36, -298, -81, 174, -40, 36, 84, -22, -132, 37, -127, 75, 217, -56, 210, 252, 436, -93, 50, 163, 3, -202, 117, -202, -95, -80, 74, 373, -65, -327, 92, -31, -37, 158, -12, -17, 7, -182, 561, 93, 11, 248, 103, 18, 56, 84, 96, 197, -301, 20, -77, 238, 84, -80, 33, -159, -88, -108, -37, -177, -32, -71, 68, -72, 61, 117, -46, 158, 281, -147, -2, 126, 10, 63, 25, 189, 273, 18, 107, 180, -51, -159, -324, -153, -39, -14, -95, 237, -37, -53, -71, -206, -44, 90, 105, 184, 136, 157, -191, -152, 139, -194, -230, 86, -135, 100, 180, -103, 42, 80, 25, 225, -144, 29, 100, 47, -156, 47, 52, 65, -81, -118, -37, 333, 86, 22, -45, -212, 34, 45, 104, -45, 109, 133, -243, 139]
3439A39n3r7J13J65l05O0j67J73l16K36j48j37K75K7j52J26K84k21o0Q6O7r7Q
3462FR6o3k23K58k42L92n12L41N2k4k03J88j84K60j34oJ54j31k30L46j12j28J08
3485Ik08J15o0P2J39k86K05J29Q6j41k45k6J99K37l70j59M07J15%k45N1j28K80
3508A76l04K76N7l3l46L04j09Q8j41O0k68L40Q2j20M5k33N5m6P4m8K3r4N28k16
3532A50J4M9k82J11Q6l08L38m54L50m5k16J63l07K20J6%Q8J80o3k29K87q1Pl29
3556b55Q8R1R5R4j89Q8L6j23rn0M4J81n7k3K04l02j79J09L9J28j31J67n1or8J38
3582B9j25k9K20j75j66K48k87J47K63J58n49L84j27j8J88o7j67P5l4J62l4j42
3604d6K20Kkk18K3K99k17j08n6J63n7j75J75r2q8K88l4m5Pm7J10j91J53k48rM91
$$ y = [139, 86, -11, 102, 267, -38, 22, -145, 28, -288, -52, -200, -337, -62, -35, -187, -61, 223, 2, -58, 28, 95, -2, 6, 102, 39, -184, 74, -168, 224, -288, 53, 105, 81, -122, 66, -118, 142, 8, 2, 156, 25, -205, 141, 29, -99, 9, -199, -84, -144, -72, 67, -219, -14, 115, 201, 60, -185, -211, -12, 225, -145, -304, 103, 218, 218, -27, 24, -104, 176, -128, 148, 205, 172, -174, 130, 21, 109, -32, 28, -240, 100, 182, 62, 107, -126, -71, -117, -43, -91, -68, -162, 366, 150, 164, 213, -69, 42, 128, -180, 158, -296, 54, 9, -207, -44, -351, -131, -115, -115, -27, 153, 90, -139, 148, 67, 74, -255, -167, -76, 19, 113, -76, 12, 48, -75, -84, -134, -90, 91, 34, 11, 215, -87, -266, -157, -118, 10, -121, 46, -5, -11, -109, 29, -96, -125, 95, -80, -246, 2, -285, -138, 125, 283, -266, 118, -9, -27, 161, 94, -73, 2, -32, 130, 96, -46, 174, 176, 174, -44, -21, 278, 61, -47, -103, 60, 3, -172, 3, -89, -177, 111, 77, 32, 39, -8, 102, -89, 64, -184, -193, 298]
3630B98m34K26K34k82j48K27m59Q25n59J22l57o2L39P3k8k03L50l75N4K46l61
3651b74L88m18K81N5l31K63j01R3J91j24J68r0j83K34J35k05o4J07J31m60J35
3672f9L29l19r8k1J69j31K32k57M90l90J60J45j66m1q6j13J27K66k75J61k15M2
3694f0l7p1K31j16K07j30oR7j57K5J63o1l03R0p5K72j70J23j04j14R0n6J6L18
3718A72j16j22j04j64J58K62k58P4L30l80j43K09J67N3k03K28K27m97k19M61l26
3739a91K73n4j9P9l31J62J9m6p4N4L42J32j57oj01l0M7j50K0J04j5l74N71j75
3763H0n3J68m00L01r4J22j94j5R8m54L37L8l5o0K80l41K90j81j6J82k08m8J39
3786f4J24k27L41j05K88k92N9J06p3k3j96K47l39M55l97L20k38q3r5R7Q1p9l7
$$ y = [298, -136, 90, 324, 42, -106, 121, -338, 487, -72, 50, -307, -369, -30, 43, 15, -188, 162, -213, -159, 87, -274, 114, -304, -23, 32, -299, -36, -137, -44, 147, 23, 191, 101, -82, 152, 287, 82, 18, 125, 256, -204, -69, 260, -59, -157, -178, -9, -140, 92, -165, 325, -65, 95, 240, 74, 33, -53, -166, -39, 227, -48, 113, -102, -60, -97, -168, 63, -53, 154, 24, 18, 115, -42, -17, 146, 85, -218, -128, -203, 69, -101, 22, -82, -196, -106, -162, -146, 172, 56, -66, -170, -334, -176, 86, -172, -98, 232, -148, -291, -82, 85, 138, -65, 163, 390, -107, -326, 135, -191, 82, 28, 9, 88, -243, -81, -62, -108, -182, -128, 214, 346, 189, 183, 82, 52, 99, -51, -31, 73, 58, -316, 255, 80, 27, 195, -205, 96, 2, 124, -70, -85, 13, -441, -104, -66, -101, -161, 119, -222, 68, -113, -129, 53, -155, -203, -64, 60, -167, 174, 69, 357, 65, 124, 230, 157, 134, -62, 185, -154, 301, -96, 224, -14, -97, -192, -95, -14, -93, -130]
3809a30J59j26j43K27J59Q1j71J90pm06k9L49k91J71R8j27K00j04o8P3r4J4o0
3832c5L2J25j39k60J53j4J33k22L95q5k07P8R1O3j51M6r1K21n68L35J17k39K51
3855B9m0P9j87J38o6J13M0j63K59k51J57k76M57j86m45L41k63M53l84J96l82J97
3877a84r5O9P9J94o2j23K06O1K2j49Q7o0Q7j12m9J48K25n00J29P6j21P5j45J69
3901B7k0r1O5q8P8k43M19qL3o5j30J06j15N8k45L06R4k24p7L67j07k94J56q5K06
3926A23j54m4p8Q5K8j00QK56j66K58k9J1j74j03l6K34n3j59J92l93L69P6k54L27
3950B24lk48K11l07K37k70J71L9Q8n54N14m2j56O2j1J56j44j29K84R0j85p5L9
3973iP5k01J02L27j65j01l5j4Q7q9K8L08l94L43l97K78j40j03K29k83K43r0K26
$$ y = [-130, 29, -97, -240, -13, 146, 227, 56, 246, 239, -167, -196, 153, -138, 33, 131, 4, 204, 100, 32, 105, 11, 25, -35, -3, 122, -17, -277, -124, -138, -5, -227, 168, 83, -124, -46, 45, 108, -43, 3, -88, 133, -435, -100, 17, -222, 29, -11, 68, -119, 19, -47, 66, 106, -57, 202, -49, 108, -168, 289, 103, -342, -1, -264, 189, -195, 1, -381, -184, -279, -210, -131, 63, 1, -122, 84, 145, 167, 18, 105, 45, 132, 20, -29, 119, 344, -156, -27, 49, -72, 3, -142, 27, 7, -84, -19, -107, -29, -272, 147, 139, 172, 107, -23, 83, -32, 26, -219, 87, 181, -43, -120, 247, 140, -154, 2, -83, 123, -31, -75, -153, -68, -40, -140, -132, 124, -42, 216, 187, 198, 24, -79, -115, 119, 66, -93, 99, -294, 75, 151, -103, 224, 221, -27, 184, -123, 114, -156, 15, 54, 142, -412, 102, 60, -96, -34, -45, 111, -33, -162, 122, 212, 27, -48, -9, 66, -135, -33, 294, 129, 28, -7, -21, 66, -23, 5, 313, -81, 262, -135, 143, 3, -100, 129, -154, 89, -1, 225]
3996B25m05L89k13j37L4J08n2M0j44K49L6l38L35n0o9r1j99M00j72J79P9j26J01
4019A79l24K01j49J18l28L98j54j1K75m32J12L46k95Q2k5K21j27j63N8J56l16
4040a78J75J44n9L6k9lp6p0P2K57l02K02J12k54k13K36Q9k55P4K88l14K32j70
4063fj43L6L2j8M8J15o7M6k12K33P3j64L37j41K5o5p3O6K0j98QJ73l25p2L51K99
4089C78k37j44k4K43k45o9j1K69m24JK80J3J8j60J86j06J60j50oK0J31n0j66j36
4113b29J57J10J06K8k75J39J18j21l1j82L37R5Q9j75j36R0q5k83J17N6J42j1q6
4136c0J80l67L59k97K11k9l76L07L33j0l15j42L04l62J44K97k6j21j84J48o4R7
4158E7O1m03J15L41m05J29L38k40j90M17k35j38J41j44K91k76j9K23J80l04Q7
$$ y = [225, -180, 209, -4, -141, -107, 1, -51, -11, -155, 94, 130, -208, 127, 77, 8, -83, -282, 118, -54, 125, 204, 78, 179, -145, 56, -93, 25, -303, 95, -59, -70, 205, -227, -115, 231, -64, 18, -7, 214, 87, -76, -18, 138, -178, -3, 141, 82, 118, 89, 86, 10, -60, 12, 269, -33, 169, 281, 27, -186, 50, 139, -116, -42, 246, -68, 164, -6, -149, -113, -81, -99, -51, 64, -3, 43, -169, 64, 137, -27, 310, 169, 194, 129, 56, 122, 142, -56, -48, 125, -200, -272, 79, 378, 141, -3, -27, 216, -29, -98, -109, 160, -264, -263, 17, 30, 48, -112, 74, -32, 128, -22, -28, -8, 123, 73, -93, -229, -72, 38, 144, 172, -103, 36, 154, 33, 2, -180, 157, 252, 341, 166, 30, 120, 35, -248, -131, -75, 67, 56, -30, 150, -217, 142, -155, 56, 27, -349, -42, 291, 281, -34, -176, 128, -234, -90, 207, 181, 60, -124, 24, -40, 57, 118, -285, -170, 171, -234, -105, 233, -7, -197, 220, -15, -153, -12, -156, 135, -141, -160, 63, 243, -61, 26]
4179B6k6L5n0k2L4Om8j20O2m7O7r7P7J77M4k83j76N67m22N0K23J55K1K4k97P7
4205E7j83K88j06Nk15K59P7j75J09j63M5L04m39M4M3pj1R4Q5k4j89K29l53J85
4229d1q1O1K58m33K52k6nm5J61n07M75J04k33L5J82j69l32M64M9j2j93q7K99j39
4253C7Nqj35M13m70M65j63qk52J95J17l80K89j84L07l28J74L02j97J7l00O4P6
4276C6k52L25j07r2K27j85M1N3J95l91K32k42K04l5M0o4q7j05K26j66K36l6j04
4299e1K45l50K96l7j06J43r6O0n8k21K20K9o5j40J69N3K23k62j30L5K42m14L30
4322A15l57K60m96N04m1l7J75j98k52R6K16j43J9N4K01p3r6J32J0j3l4j69R3j58
4346a92R0L49j30p3J22k51L07k55j59K41j89K12j70J97j93Kj46K53q6%J18r3j08
$$ y = [26, 0, 35, -15, -37, -3, 3, -45, -165, -103, -150, -83, -180, -103, 74, 118, -165, -341, 226, -196, -146, 77, 232, 253, 277, -20, 57, -126, 162, 56, 61, -154, 105, 182, 7, 116, -47, -2, 302, -137, -93, -50, -57, -68, 26, 111, 87, -102, 127, -226, -41, -122, -61, 197, -236, 16, -10, -15, -60, 101, -406, 69, 173, -60, -25, 157, -12, -344, 120, 169, 157, -36, -123, 176, 37, 42, 34, -101, 312, -158, 307, 144, 136, -116, 79, 196, -184, 105, -79, 228, -100, 74, 376, 179, 196, -104, -40, 36, -216, 109, 2, -90, 137, -48, -7, 46, 241, -150, 82, -160, 44, 9, 49, -15, -102, -207, 19, -147, 89, 53, -51, 194, -156, 140, 103, -3, 140, 44, 104, 46, -175, 45, 74, 9, -131, 38, 91, 314, 52, -78, -43, 199, -215, 115, -242, 18, -478, 26, -15, -52, 123, -75, -327, -231, -15, -158, -139, -85, 116, 43, -53, 79, 89, 76, 42, -127, -34, -192, -102, 247, 117, 44, 166, -85, 222, -33, -192, 49, -140, 72, -98, 99, -94, -92, -238, 15, -71, -71, 47, -46, -154]
4369a54K21j8M2r4K0K00l62J79K25j71J8Q8k37Q3MN5j44N7J20j53j57L34j1j49
4393dk25N9M06l55M6o8J60j26k6J37O3l09K79o9K05K3J17j59j60J0l01L33J1N5
4417A02j88J21p5j00l01N22j24j00L20m20k0M16J71r8j69K10l13R9j99QL04m58
4439b92J93K68j64j56K3K17J02l20J85r2P3O0k41j19J93J11j47M4j09M32j27J14
4461B48k01O3j91J7L4k71K57J53N5k27K8l8o4J88j41K36q7j25K00N9MJ5j73p7
4485c8Rl27L61r0J87j75K04n9l2L1j72L59J04p8j98l7J34P6k81R4L4J28j13J23
4509B44m34L4J34J80k89J51n9Q9j21l8J81j45L7j60K93k66J36K67j52k38K24j4
4531E4J07m3R0m66K75j68R3L98k21j27k29K48K11l4l56J27r4L14M4k23k1R7p3
$$ y = [-154, 67, 49, 91, -3, 17, 217, -145, 34, 259, 88, 106, 194, -43, 40, 44, 99, -45, 12, 132, -21, -178, 156, 145, -4, -229, -170, 236, -119, -73, -141, 19, -107, -133, 4, 67, -242, 37, -32, 173, 196, 313, 154, -6, 4, -297, 36, 47, 102, -86, 35, -40, -140, -441, 81, -43, -143, 177, -243, -263, 153, 324, 226, 57, 267, -46, 53, -146, -138, 166, -292, -99, 169, 5, -151, -128, 89, 191, -129, 56, -36, 37, 97, -144, -263, -70, 41, -106, -62, -171, 261, 134, 248, 47, 110, -81, -64, -30, -301, -44, 109, 164, -63, -35, -73, -137, 51, -90, 146, 59, -66, 134, 193, 197, 212, 39, -38, -29, -356, 5, -85, 102, -73, 131, 72, 40, 71, -101, 258, 362, 284, 86, 49, 183, 259, -22, 72, 106, 234, 121, 244, -190, -156, -22, 158, -131, 20, -39, 50, -71, -109, 72, -73, -36, -196, 97, -169, -33, 234, 82, -156, 68, 54, 161, 118, 208, -258, 17, -151, -58, 340, 119, -8, -237, 11, 222, 188, -168, -41, -135, 179, 223, 0, -21, 76, 3]
4554Ck8j88J50K62l16l3K56l9Ok0rj91J1K26J63m85L13j61K36l6Qk00J64P1K1
4579A84j67j61O0K29k78M26m10nL0L59k61K30k36Q8L1k22P6j52L47r5L2N5j8K6
4603A68j79p2l8l6k8m9K11j06K84j33k93K99j25K37k95l9K26N4o8M01n16K08l29
4626b18P9M50m29K30n3K24j95q1rJ05k78K1L27l2j57J41k31L7j15P5K52q6J3Q7
4650A57j16l09J85J8J09l16M30J32j92j83rJ52k42M37k87P3M3j52j8J40j51k95
4672c94N36j03l14J97j7M3K20j53j27j98L42j24P7q3K5k2r4J89l0rJ85m49L54
4695E1J2j26Q1J13K9j28n7l2m8j44R3J77l9J09j62K00k24J09j19l7L12j75l5j2
4719e2J10o6k7J04P2j31j06J19j56J46L6K20l61K9j89M95l01P8j6r5r3J24J33
$$ y = [3, -25, -213, -63, 199, -117, -150, 106, 67, 73, 53, 44, -147, -136, 90, 253, -232, 81, -80, 156, 120, 128, -72, 92, 163, 184, 17, -144, -84, 145, -133, 293, -117, -122, -92, 267, 6, 236, 0, 88, 119, -103, -27, -179, 168, 73, 105, 160, 142, 168, -11, -83, -121, -157, -185, -234, -23, -129, 155, 22, -271, 28, -97, 140, -155, -194, 32, 86, 18, 419, -97, 111, -218, -139, 311, -118, 112, 59, 283, 88, 7, -2, 103, -175, -154, 173, 141, -16, 125, -106, -69, -184, -109, 143, 57, 70, 157, 41, -268, -83, -65, 44, -272, 158, 290, 98, -85, -94, 58, -184, 253, -34, 39, 82, -70, -88, 52, -99, -394, 142, 39, -275, -78, -95, -52, 168, 15, -112, -310, 32, -92, -15, -98, -73, -95, -189, 0, -30, -39, 146, -303, 51, 63, -63, 18, 131, 160, 32, -25, -57, -105, -249, -156, 21, -18, 91, -71, 129, -95, 14, -105, -142, 170, -5, -40, -52, 58, -8, -35, 69, 141, 10, -96, 23, -133, 13, 49, 269, -92, -63, -252, 243, -58, 20, 4, -91, -184, -60, 73]
4742G3K9m8k16J77L9o6r4n9k65N19k99K54K52m20K48j38Q5j07m3l9J34K37k05
4765D8MJ03j84j5J8o1P6k92J66L44m49M1K42q5N8Kj24K22p0j26K80l38N0L09N9
4790B78j87j93J4K8K90j56j02O8j27J17P3Jj05j63K47j60K5K55l57K4J85k30K9
4813a46L37l09J07j45J96K6K28m61L10k64J02J25r6R7k45L93q6j01K0M6j92k1
4835g9o7K4L13k08p1l68M97j3q8J17J14j31P9l67qM62O5j31o8J09j97J40l18L30
4859A36l3l5q6j39KK36q3q0O7J38k45J94J39j82l63K19J60q7Q3j23l40K03J26
4882i3K68l70Q1J30j89R1J91m84M24O8l22J61J53M5Ol08K9K58k40K55k55j18L18
4905I9l38K85J00j96R0j65j95K15J09k48J71J79M2J03j42Q8j31j32M13k53k7l9
$$ y = [73, 102, 54, -162, 15, 54, -12, -106, -165, -430, 89, -210, 44, 296, -124, 124, -14, 71, -36, -79, -118, 16, 253, 48, 52, 155, -29, -44, -26, -87, -11, -303, -137, 207, -242, -201, 41, -44, 14, 16, -108, 114, 44, -82, 198, -140, -90, 219, 278, 91, -102, -88, -60, 230, 74, -28, 40, -87, 30, 103, 104, -1, -164, 83, -77, -52, 203, -154, -130, 55, -175, -146, 191, -118, -11, -156, 40, 66, 294, -167, 143, -121, -19, 106, 10, 107, -138, 255, 169, 68, 88, 134, -58, -79, -146, -122, 191, -17, -88, -456, 41, 28, -60, 57, 171, 40, 119, -248, -256, 206, 271, 140, 72, 181, -16, 124, -194, 136, 103, 68, -18, -157, -155, 81, -2, -82, -15, 123, -122, 72, 211, 29, -334, -115, 45, -42, 41, -82, -422, -219, -93, 175, -195, -114, 16, -173, -82, 109, -375, 49, 117, -205, -44, 109, 154, 160, -148, -119, 139, -101, 154, -101, -219, 99, -239, 46, 146, -50, 40, -125, -320, -105, 4, -244, -73, 106, 148, 251, 109, 197, 66, -66, 347, 94, 67, 28]
4927B8j36K59k50j35M50n46L64K3R7k68K92j04j04K8J1j0j49nJ6J74o6k02K90
4950E7j13n7j20K88j54K19k0Q6l9n2k47M09j98J71j33J75l64J35k21q5K13K57
4972B07l88JJ94NR1K7l16L36j2l14L66K9k07J23k1j06j76N5L66j95j46L61n54
4995b74L73P5m14M37l12K02k90M4J23j64J28M66m02R4l10O8L1L24k54k0K19l1
5017A13j05j79J46p1K66j51k58L9J55j9J8m6J57k33J50Q2p6l55K01M71l75K6n0
5040i4N2J53k07r7K80l43M87m06J76j1k6P0L0R5L3j16k0J6P8j32K11l68J90n2
5064aj01J57R4l9R3j24K5Oo8j38L12mk33K55n5J0L4k85K32l92K89J14O1j04l38
5089b00L16j57P1J6k64K80j44L2J02J8k67L00k80L10j19j82J73Nmn3Lk34R5J43
$$ y = [28, -108, 151, -99, -234, 216, -330, 34, 57, 154, -114, 178, 74, -30, -2, 9, -1, -150, -155, -139, 35, -31, -233, 57, -56, -113, -233, 55, -99, 120, 100, 186, 147, 95, -152, 257, 59, 230, 97, 272, -92, 43, -178, -263, -50, 207, -181, -180, 14, 19, 110, 137, -179, 157, 145, -169, 197, 226, 19, 142, 121, 15, -161, -106, 260, 65, -81, 280, -274, 99, 174, -240, 197, -115, 87, -203, -159, -36, -200, -72, 394, -8, 86, -224, -156, -125, 199, -55, -75, 144, 113, 8, -171, -25, -96, 170, 19, -239, -200, -45, -64, -46, -92, 65, -168, -18, 64, -12, -367, -166, 305, -70, -44, -94, -42, 111, -96, -193, 87, -256, 231, -175, 1, -10, -36, 34, 64, 159, 192, 76, 56, 72, 150, 18, 229, -139, 51, -1, -102, 55, 149, 110, 203, 79, 104, 110, 42, -96, 216, 212, -21, 234, 179, 189, 223, -62, 170, -222, 67, 181, 242, 138, -200, 116, -41, 30, 46, -218, 62, -82, -50, 52, 70, -197, 103, -177, 133, 14, -168, 5, 10, 6, -47, -44, -278, -183, -40]
5113d0M1j0R5j26q6K83k28L21l75L13n22L73j9o1L07k62J86j64N9k75Q7J51m9
5136al2K20l72L24k72K11j53L1L5k51R7J2RJ65j2k19K76j93K05r5nL1o9J06j27
5161g9j25M22o4j67kL0k58L31J3k00r2J88O8j80J46r4j93K41O0j44j2J25j29P
5185a08J14j90K7N0K04j70%r2N7l1N0N8K36j99k17M18k82J44k60O0L81l87K02
5208F5r1O9kR5J1m7l1l00J37J94mm4j27mJ76j98L84j40j99J78j54O3o7N3j3j75
5234a71J77O7Q8j00p5k2J84J09k01J3J48j20l4J1q3k5J43m96L47J55nj90J5L8
5258b7Q6kk35N60O1l22j01J31j57J03m5l8J96j08k39j84L04M8j13K84o0j10o6
5281c4K19J14n6k51j07J3L3j37K36JJ9n3j82K12j88M14m31J62NQ3q8k2K48k67
$$ y = [-40, 1, -9, 86, -40, -126, 157, -71, 250, -125, 188, -334, 39, 20, -41, 266, 4, 190, 26, 85, -190, -103, 48, -1, -33, 187, -185, 139, -133, 78, -75, -44, -9, -260, -163, -151, -142, 23, 11, -208, 68, -125, 80, -15, -20, 11, -58, 48, -79, -204, 218, 154, -13, -15, 15, -243, 88, 101, -99, -191, -3, 65, -115, 31, -63, -256, -15, 45, -99, -111, 14, -115, -108, 6, -184, -157, -107, 97, -73, -73, -165, -108, -139, -89, -31, 205, 6, -211, 207, -75, 69, -191, -131, 250, -137, 65, -26, 43, 41, 136, 147, 100, 69, -231, -94, 100, 96, 52, -75, -79, 97, -101, 283, 143, -56, 122, -32, 31, -36, 17, 4, -171, 6, 73, 161, 61, -14, -36, 148, 257, 56, 69, 217, 97, 63, 74, -9, -34, 109, -387, -40, 115, 110, -80, -65, -27, 59, 57, -178, 382, 443, 121, 20, 151, -6, 97, 52, 14, 210, 102, -137, -321, -17, 31, -82, 202, 142, 32, -34, 185, 299, 243, -8, -115, -102, -69, -206, 30, 31, 50, -3, -185, 27, -161, 253, -178, -16, -11, 72, -16, -38, 210, -57]
5305e7K97o1j29j20L06k4k85j28M27l66k65L72J50K22l81J76l1m8Oj51n4Q6J7
5328d1K23l2k83K32r3O2K98m88k40N38k27o6J15Q8j9J7p0Q2R1l3q4J32J0l75k4
5353a87J31rj51M50j62j66PJ16m2J88O7j0O0k32P6K5K6m61M20j14o2J59J3j78
5377c6K46k72k08J68j0J32k5l3P5j24O6J79k35P3k43M9N5K24K1q0L0Q3k29k24
5401c18L75k28J03K87L9k57N2l5J05q2qJ10j22M3K25l39K03j54o6L37n34J08K10
5424E4r9l54M66L3K9k63M00k84J96K45n25J74n0p4L3j52J04L76l29k66M50j11
5446E3k26R5L0LP1j33J73M77o44q6J79L5K46l42k37L99j80R6j08k4R6k94L99j18
5470d0KJ39M46o56K96o0r5J95n45M49K5j95L3k16J50j58J06M26l76J82l9k85J32
$$ y = [-57, 240, 179, 50, -70, 236, 212, -73, -201, 226, -140, -405, -33, 117, 339, -42, 134, 103, 55, 61, -90, -144, -58, -41, 182, 150, -133, 99, 6, 68, 366, -122, -362, 176, -51, -117, -2, 86, 67, 84, 14, 96, 187, 154, 70, 202, 212, -163, -187, -56, -65, -216, 234, 72, -94, -87, 29, -13, 175, 242, 232, 292, 60, 136, 161, 187, -274, 146, 32, -30, 129, 142, -36, 210, -62, -270, -102, -112, 20, -5, -38, 37, -87, -21, 158, -77, -4, -247, -198, -143, 81, 102, 22, 52, 135, -94, -318, 57, -171, -68, 219, 258, 1, 53, 18, 123, 41, 33, 143, 21, 64, 289, -50, 153, -1, -67, 270, -264, -156, 54, -45, -399, 67, 100, 129, -134, 266, -18, 178, 423, -102, 72, 22, -52, -19, -171, -67, 309, -20, -286, 164, 53, -173, -78, -48, -45, 26, -107, 66, 543, -101, -187, -8, 27, 273, -69, -306, 93, -87, 9, -99, -123, -27, -321, 78, -40, -38, 101, 547, -109, 187, 127, 32, 227, -318, 131, 156, -39, -6, -222, -72, -230, -124, 302, -74, 108, 69, -216, -84]
5493h4K71l45K61j30p3K12J45n03K50j34p9Jk0J79J6K4J23P1k77R9j89P1K47j72
5517c6J11j57L80l15l4pK49k47M4m3QK36m04M7J55L6M8k52L06op2j18K31m8k33
5542a21p1K83o4R0j61N4j02L46j25j43r9J91o8O1j10j91L32N9k27OJ56j18M7j94
5566a69R3J77k8k21m8K58k2o8K09n7k45L40m33O8J08J13p3o8P2M3k22K80l38K03
5590b8kJ76j94j16J7J31R2l9j59R2J37j01K05n3k00L9O8L2o9J30k03J10q7q8K33
5615A23k87MJ91K3M1j54k56K53J45L09n45M4L84j15l36J31j76L56O2k08n8K37
5637A68k97K84m0j67p0J65r0j9p4K1m1K21J88j67j81k05K46j6k1j0j0K02L5K52
5661C74m68m1K37k69K97j42m1N8Pp4k8J37j92j67L92J55k22L3J53j78j2j0q6L0
$$ y = [-84, 187, -158, 103, -27, -100, 112, 257, -246, 4, -130, -209, -208, -228, -49, -33, -9, 114, 185, -92, 7, -182, -111, 136, -36, 75, -82, 298, -17, -51, -58, 191, -56, -12, -55, -47, 189, -215, -168, -13, 23, 71, -181, 125, 119, 47, -71, 160, 112, -121, -192, 91, 27, 117, -44, 10, -92, 254, 129, -14, -113, 78, 10, 71, -39, -230, 102, 161, -66, -60, 96, -22, 25, -169, -76, 101, 73, -148, -196, 62, 40, -28, 181, 124, -121, 219, -214, -146, -38, 75, 2, -66, 6, 49, -173, 107, -231, -28, -30, 146, -48, -164, -147, -16, 76, 37, -122, -30, 107, 6, 211, 158, -42, -3, 65, 97, 28, 158, -45, 65, -22, -110, 123, -164, -160, 31, 54, 95, -59, -315, -62, 83, 392, -153, -109, 275, 160, -176, -45, -221, 135, 197, -11, -69, 168, -129, 155, 115, -52, -122, 43, -47, -66, -140, -119, -160, 61, 249, 82, -99, -304, -58, -74, -95, -105, -115, 87, 122, 374, -94, -135, 102, -167, 130, -12, -53, 5, 12, -62, -90, 47, -145, -312, 80, 235, 13, 46, 199, 21, 9, -1, -87, -57]
5685e7K43l56P0J36J0j85K97O1l78O0K56p1n6q9J02j30j10K93o8j97L17j49o7
5708f8j53K61K99m47J74J39l26J3J08O1k8K23m84J60o0J18r9k7J36P2%L10l25
5731E7q0J35k8K04l27N7k05K34J97K0l39j20J19J61l35K28j12J68k28L06K60k32
5753A40k74O9J87P0L4l18M97m32Q1Nn9j0j42l0K01L9K2m1qJ97j36q6J18K7m85
5778c34K95J08O1O1q6k93J94j13J09J64l87K42J77m23L76p3Pk67N7K99k73j0J29
5801B0j14K91J3k91J3J5J19r6J71o6Q7j57R5j25Q8j80j07K61k34M53j82J02k43
5824f7J20k39n1N44n62l2M61k40J82qk30Q4K41j99J56k01L68j81j90J83k56P6
5846d1j62J79m7k86O67m0j91J06j31l18J93J21r9K42k60K53m17OL75n7n4k74p5
$$ y = [-57, 186, -170, -100, 36, 46, -139, 158, 219, -159, -99, 157, 86, 30, -59, 43, -87, -197, 96, 28, -169, 148, -1, -68, -221, 40, 339, -108, 66, 205, -121, -108, 0, 61, 33, 256, -228, -68, -128, -10, -109, -136, 0, 72, 72, 382, 57, -23, 112, 84, 288, -39, 18, -187, 47, 244, 264, -75, -195, -76, 85, -250, -22, -134, 34, -194, 112, 372, 140, -134, -65, 122, 192, 226, -92, 405, -27, 54, 59, 0, -10, -152, -182, 19, 58, 80, 39, 31, 228, 92, 6, 124, 151, -334, -39, 69, 130, 191, 105, -188, 6, -107, 2, 166, -221, 21, 198, -225, 151, 78, 85, -182, -125, 174, -99, -109, 20, -94, 197, 210, -81, -68, -53, 66, -30, 141, 75, 162, 5, 100, -25, 63, -117, -224, 37, -197, 256, 74, 176, -67, 53, -186, -237, 307, -255, -287, 174, -66, 116, 108, -122, -38, 203, 4, 160, -41, 327, 146, -44, 139, -117, -41, -203, -24, -71, -357, 310, 270, 79, 185, 54, -264, -71, 50, -49, 193, -67, 186, -231, -225, 150, 93, 39, -235, -310]
5869c10J96J05j03K91k10p7K89m97M36j29J2J22k07J47m9j7J21k18k87L61K04
5890A80q0n3J0K14k65j61L19Q1K15n80o4L11j95j60N9K33N3k77K8K15j42j64L28
5913A05j60J33K20k68Q8l10K03RM8r9l6L26k56R8O0m44M2L5K36J78m70L42N4k74
5937a40K49j7K1j19P0Q0r2k55qK88K2j01K17j60n7m5J3k71P7J63L05k09j26K8
5961f7P6l65M37k00J08K49m55K04j82n9N81l03L4K5j1K6j4j74N1J21k18L27k73
5984h2N5L3J79j49j65L45m41J92O2j74J55r6J64j29R4L0k75K63k3nN4R7k74Q2
$$ y = [-310, -114, -9, -112, 179, -31, -108, 181, -316, 120, -9, 3, 125, -82, 65, 16, -1, 120, -98, -385, -24, 180, 100, 47, 57, 271, 6, -155, 164, 245, 460, -120, -184, 127, -68, -228, -169, 64, 117, -160, -132, 83, -59, -223, 105, -55, 78, 298, 30, 118, -192, 11, 20, 68, -31, -67, 259, 3, 101, 161, -283, -241, -206, 30, 208, -262, 80, 134, -140, 109, 92, 113, -6, 64, 144, 52, -203, -211, 77, 99, -2, 215, 55, -2, -47, -34, -305, -228, -65, 240, 31, -95, -67, 9, -356, 81, -119, -11, 238, -217, -13, -195, -254, 327, 24, 58, 83, 72, 98, 84, -90, -39, 82, -136, 191, -82, -27, 6, 185, 36, -129, 216, -225, -33, 29, -145, 10, -86, 78, -51, 43, 73, -202, 61, 38, 33, 87, 184, -90, -8]
$$ [...]
8191a06
##END NTUPLES=NMR FID
##END=
