##TITLE=1H_Pr 5148-2
 CDCl3
 8 sc, 
 26.1.2023
##JCAMPDX= 6.0         $$ Bruker NMR JCAMP-DX V2.0
##DATA TYPE= NMR FID
##DATA CLASS= NTUPLES
##ORIGIN= UXNMR, Bruker Analytische Messtechnik GmbH
##OWNER= root
$$ XWIN-NMR		Version 3.5
$$ Thu Jan 26 14:43:32 2023 Russian Standard Time (UT+4h)  she@DPX200
##.OBSERVE FREQUENCY= 200.13135
##.OBSERVE NUCLEUS= ^1H
##.DELAY= (6, 6)
##.ACQUISITION MODE= SIMULTANEOUS
##.ACQUISITION SCHEME= undefined
##.AVERAGES= 8
##.DIGITISER RES= 18
##SPECTROMETER/DATA SYSTEM= spect
##.PULSE SEQUENCE= zg30
##.SOLVENT NAME= CDCl3
##.SHIFT REFERENCE= (INTERNAL, CDCl3, 0, 15.7039)
##AUDIT TRAIL= $$ (NUMBER, WHEN, WHO, WHERE, WHAT)
$$ ##TITLE= Audit trail, XWIN-NMR		Version 3.5
$$ ##JCAMPDX= 5.01
$$ ##ORIGIN= Bruker BioSpin GmbH
$$ ##OWNER= she
$$ F:/spectra/data/she/nmr/H-F/1/audita.txt
$$ ##AUDIT TRAIL=  $$ (NUMBER, WHEN, WHO, WHERE, WHAT)
(   1,<2023-01-26 14:42:21.53 +0400>,<she>,<DPX200>,
      <created by zg, POWCHK disabled, PULCHK disabled
       configuration hash MD5:
       00 E9 B6 7A A2 85 ED C7 34 08 36 98 17 FE 4E 26
       data hash MD5: 16K
       0A 81 85 FF A7 7B FE 15 B1 64 89 2C 71 D9 63 F6>)
$$ ##END=
$$ 
$$ hash MD5
$$ 0C 0D EF CD 16 A7 C7 9E F0 57 1E 19 BA D1 FA 14
##$RELAX= 
##$RELAX= 
##$RELAX= 
##$RELAX= 
##$RELAX= 
##$RELAX= 
$$ Bruker specific parameters
$$ --------------------------
##$DU= <F:/spectra>
##$EXPNO= 1
##$NAME= <H-F>
##$PROCNO= 1
##$TYPE= <nmr>
##$USER= <she>
##$AMP= (0..31)
100 100 100 100 100 100 100 100 100 100 100 100 100 100 100 100 100 100 
100 100 100 100 100 100 100 100 100 100 100 100 100 100 
##$AQSEQ= 0
##$AQ_mod= 1
##$AUNM= <au_zg>
##$AUTOPOS= <>
##$BF1= 200.13
##$BF2= 200.13
##$BF3= 200.13
##$BF4= 200.13
##$BF5= 200.13
##$BF6= 200.13
##$BF7= 200.13
##$BF8= 200.13
##$BYTORDA= 1
##$CFDGTYP= 0
##$CFRGTYP= 5
##$CHEMSTR= <none>
##$CNST= (0..31)
1 1 145 1 1 1 1 1 1 1 1 1 1 1 1 1 1 1 1 1 1 1 1 1 1 1 1 1 1 1 1 1 
##$CPDPRG= <>
##$CPDPRG1= <>
##$CPDPRG2= <>
##$CPDPRG3= <>
##$CPDPRG4= <mlev>
##$CPDPRG5= <mlev>
##$CPDPRG6= <mlev>
##$CPDPRG7= <mlev>
##$CPDPRG8= <mlev>
##$CPDPRGB= <>
##$CPDPRGT= <>
##$D= (0..31)
0 1.2 0 0 0 0 0 0 0 0.06 0 0.03 0 0 0 0 0.0002 0 0 0 0 0 0 0 0 0 0 0 0 
0 0 0 
##$DATE= 1674729740
##$DBL= (0..7)
120 120 120 120 120 120 120 120 
##$DBP= (0..7)
150 150 150 150 150 150 150 150 
##$DBP07= 0
##$DBPNAM0= <>
##$DBPNAM1= <>
##$DBPNAM2= <>
##$DBPNAM3= <>
##$DBPNAM4= <>
##$DBPNAM5= <>
##$DBPNAM6= <>
##$DBPNAM7= <>
##$DBPOAL= (0..7)
0.5 0.5 0.5 0.5 0.5 0.5 0.5 0.5 
##$DBPOFFS= (0..7)
0 0 0 0 0 0 0 0 
##$DE= 6
##$DECBNUC= <off>
##$DECIM= 32
##$DECNUC= <off>
##$DECSTAT= 4
##$DIGMOD= 1
##$DIGTYP= 9
##$DL= (0..7)
0 120 120 120 120 120 120 120 
##$DP= (0..7)
150 150 150 150 150 150 150 150 
##$DP07= 0
##$DPNAME0= <>
##$DPNAME1= <>
##$DPNAME2= <>
##$DPNAME3= <>
##$DPNAME4= <>
##$DPNAME5= <>
##$DPNAME6= <>
##$DPNAME7= <>
##$DPOAL= (0..7)
0.5 0.5 0.5 0.5 0.5 0.5 0.5 0.5 
##$DPOFFS= (0..7)
0 0 0 0 0 0 0 0 
##$DQDMODE= 0
##$DR= 18
##$DS= 0
##$DSLIST= <SSSSSSSSSSSSSSS>
$$ [...]
##$SUBNAM2= <"">
##$SUBNAM3= <"">
##$SUBNAM4= <"">
##$SUBNAM5= <"">
##$SUBNAM6= <"">
##$SUBNAM7= <"">
##$SUBNAM8= <"">
##$SUBNAM9= <"">
##$SW= 18.05172834244
##$SWIBOX= (0..15)
0 0 2 0 0 0 0 0 0 0 0 0 0 0 0 0 
##$SW_h= 3612.71676300578
##$TD= 16384
##$TD0= 1
##$TE= 0
##$TE2= 300
##$TE3= 300
##$TEG= 300
##$TL= (0..7)
0 120 120 120 120 120 120 120 
##$TP= (0..7)
150 150 150 150 150 150 150 150 
##$TP07= 0
##$TPNAME0= <>
##$TPNAME1= <>
##$TPNAME2= <>
##$TPNAME3= <>
##$TPNAME4= <>
##$TPNAME5= <>
##$TPNAME6= <>
##$TPNAME7= <>
##$TPOAL= (0..7)
0.5 0.5 0.5 0.5 0.5 0.5 0.5 0.5 
##$TPOFFS= (0..7)
0 0 0 0 0 0 0 0 
##$TUNHIN= 0
##$TUNHOUT= 0
##$TUNXOUT= 0
##$USERA1= <user>
##$USERA2= <user>
##$USERA3= <user>
##$USERA4= <user>
##$USERA5= <user>
##$V9= 5
##$VALIST= <valist>
##$VCLIST= <CCCCCCCCCCCCCCC>
##$VD= 0
##$VDLIST= <DDDDDDDDDDDDDDD>
##$VPLIST= <PPPPPPPPPPPPPPP>
##$VTLIST= <TTTTTTTTTTTTTTT>
##$WBST= 1024
##$WBSW= 4
##$XGAIN= (0..3)
0 0 0 0 
##$XL= 0
##$YL= 0
##$YMAX_a= 269600
##$YMIN_a= -210471
##$ZGOPTNS= <>
##$ZL1= 120
##$ZL2= 120
##$ZL3= 120
##$ZL4= 120
##$ABSF1= 10
##$ABSF2= 0
##$ABSG= 5
##$ABSL= 3
##$ALPHA= 0
##$AQORDER= 0
##$ASSFAC= 0
##$ASSFACI= 0
##$ASSFACX= 0
##$ASSWID= 0
##$AUNMP= <proc_1d>
##$AZFE= 0.1
##$AZFW= 0.1
##$BCFW= 1
##$BC_mod= 2
##$BYTORDP= 1
##$COROFFS= 0
##$CY= 11.3945322036743
##$DATMOD= 1
##$DC= 2
##$DFILT= <>
##$DTYPP= 0
##$F1P= 2.36226072786647
##$F2P= -0.459571619588291
##$FCOR= 0.5
##$FTSIZE= 0
##$FT_mod= 4
##$GAMMA= 1
##$GB= 0.15
##$INTBC= 1
##$INTSCL= 1
##$ISEN= 128
##$LB= 0.24
##$LEV0= 0
##$LPBIN= 0
##$MAXI= 10000
##$MC2= 0
##$MEAN= 0
##$ME_mod= 0
##$MI= 1.114404
##$NCOEF= 0
##$NC_proc= 0
##$NLEV= 6
##$NOISF1= 3.799351
##$NOISF2= 2.8
##$NSP= 1
##$NTH_PI= 0
##$NZP= 0
##$OFFSET= 15.70392
##$PC= 1
##$PHC0= -19111.09
##$PHC1= 11.80079
##$PH_mod= 1
##$PKNL= yes
##$PPARMOD= 0
##$PSCAL= 0
##$PSIGN= 0
##$REVERSE= no
##$SF= 200.130013532006
##$SI= 16384
##$SIGF1= 3
##$SIGF2= 2
##$SINO= 400
##$SIOLD= 16384
##$SREGLST= <1H.CDCl3>
##$SSB= 0
##$STSI= 0
##$STSR= 0
##$SW_p= 3612.71676300578
##$SYMM= 0
##$S_DEV= 0
##$TDeff= 0
##$TDoff= 0
##$TI= <>
##$TILT= no
##$TM1= 0
##$TM2= 0
##$TOPLEV= 0
##$USERP1= <user>
##$USERP2= <user>
##$USERP3= <user>
##$USERP4= <user>
##$USERP5= <user>
##$WDW= 1
##$XDIM= 8192
##$YMAX_p= 0
##$YMIN_p= 0
$$ End of Bruker specific parameters
$$ ---------------------------------
##NTUPLES= NMR FID
##VAR_NAME=  TIME,          FID/REAL,        FID/IMAG
##SYMBOL=    X,             R,               I
##VAR_TYPE=  INDEPENDENT,   DEPENDENT,       DEPENDENT
##VAR_FORM=  AFFN,          ASDF,            ASDF
##VAR_DIM=   8192,          8192,            8192
##UNITS=     SECONDS,       ARBITRARY UNITS, ARBITRARY UNITS
##FACTOR=    0.0002768,     1,               1
##FIRST=     0,             0,               0
##LAST=      2.2672688,     0,               0
##MIN=       0,             -210471,         0
##MAX=       2.2672688,     269600,          0
$$ Real data points
##PAGE= N=1
##DATA TABLE= (X++(R..R)), XYDATA
0 0 0 0 0 0 0 0 0 0 0 0 -8 8 -8 8 -16 16 -23 24 -32 40 -48 56 -64 72 -88 104 -120 136 -160 183 -208 236
32 236 -269 305 -345 386 -435 488 -545 608 -677 752 -834 924 -1021 1126 -1246 1374 -1511
49 -1511 1665 -1834 2022 -2227 2457 -2716 3006 -3335 3712 -4152 4671 -5292 6050 -7003 8242
64 8242 -9925 12350 -16170 23114 -39841 168183 106402 -99887 157963 175046 97811 -121641
76 -121641 -68221 -27167 -83326 -12884 -72513 -135369 -57549 42203 106343 -84228 -105011 36927
88 36927 71825 -16090 -128933 -39603 29481 8608 34279 798 48200 84374 132236 125012
100 125012 -7253 33293 64452 742 -44689 -105774 -71575 -100202 -86056 -10941 -83605 -75269
112 -75269 18627 84469 51801 -42033 32027 93713 40442 -17595 -22292 21957 -6075 10084
124 10084 49150 -3960 -21152 42738 118983 13968 -101831 5575 53206 -34930 -128122
135 -128122 -102133 -6559 -42272 -50749 -15667 -16124 38814 75326 78129 33817 12472 86620 76032
148 76032 -11329 -50990 -12853 25788 -23088 -51965 -28150 2604 10315 -1700 -30 -27444
160 -27444 -11984 21859 -26150 -61237 -46266 2949 -11 -44262 9900 44940 31646 46848
172 46848 55885 61059 32106 24668 42469 -6514 -42720 -27759 -17630 -42786 -64242 -27729 -4382
185 -4382 -23480 -20809 17849 22181 -14407 3238 26649 1974 -20715 -10020 24392 4910 -11372
198 -11372 28191 29163 24674 32204 28034 21679 -890 4954 2321 -41604 -45499 -25733 -23772 -39430
212 -39430 -42905 -6314 14835 2232 3613 25308 25788 18122 22336 10079 -4934 -864 14158
225 14158 6033 -27969 -6437 29873 7813 -9805 -2531 15790 10980 -18142 -12125 -11718 -23433
238 -23433 -11612 -12586 -20145 -15938 4023 25090 10264 -1199 24705 37154 13587 -590 5682
251 5682 7759 -4434 -15951 -8865 -12031 -19524 733 73 -12119 -2044 6399 9724 -4069 -8243
265 -8243 8778 -592 -8449 143 -335 2271 1179 6706 15908 4870 4443 15069 7899 -1831 -2385
280 -2385 -2837 -7115 -14746 -10670 -4312 -16505 -11707 6326 -637 -5748 2122 10405 11042 -2975 2469
295 2469 11365 -317 1319 3331 -1259 1119 362 5605 2124 -8216 3661 8907 -4021 -7774
309 -7774 -2572 3253 -2296 -12068 -2403 2745 -6189 -1095 1591 -2915 1566 2955 4691 405 -4747
324 -4747 7254 4928 -4496 375 555 2630 803 -5552 2828 1690 -2569 2844 599 631 2783 1419
340 1419 4805 499 -1770 4586 -2137 -5881 -342 -4697 -6579 -4844 -3808 -244 -4694 -2845 5457
355 5457 330 2331 5053 -537 3644 3820 2218 2651 -3680 2463 6959 131 314 1871 4579 5997
371 5997 -3290 -1990 907 -6300 -4887 -5634 -11025 -7952 -5721 -1121 -791 -5786 4565 10406 5147
386 5147 6627 4222 4966 7857 739 -574 -2331 -5099 1786 -1 -3133 -1382 -2086 4687 4476 -4846
402 -4846 -2981 -1978 -3044 -1785 -8824 -8628 -2571 735 4770 -216 376 12765 11824 7009 3937 -849
418 -849 3803 2903 -5756 -8845 -11473 -4180 1267 -6364 -6402 -1801 3604 10494 1519 -4274 2979 5095
434 5095 4090 -2499 -7275 1526 4031 3623 3249 -2309 4338 10415 4187 90 -5346 -4818 1616 -5376
450 -5376 -13191 -13929 -8724 1723 -2742 -9315 1219 7983 11165 10211 3574 6513 7581 5441 5614
465 5614 -2305 -6267 -38 2104 2237 -6080 -8720 5980 7185 -4540 -8007 -5466 403 -3856 -12151
480 -12151 -7175 -6567 -4572 3780 1621 1622 5348 10274 18332 9886 -1552 5347 9748 5305 -6409
495 -6409 -11728 80 -78 -8617 -5541 -4070 -1657 1379 -1166 113 -3285 -5282 2207 659 -5439
510 -5439 -6250 -3017 7473 4326 -4447 5304 13242 8917 3213 1081 7365 3986 -6421 -3262 -3614
525 -3614 -9473 -8926 -6244 320 -1355 -7166 3125 8745 1387 -361 2902 6558 346 -6924 2387
540 2387 3391 -5293 -1060 5392 5801 746 -2043 6327 5778 -4490 -4164 -2151 -2748 -6638 -11405 -2889
556 -2889 343 -4384 1239 5356 4409 4755 4461 9443 7295 -1833 927 2125 -940 -2819 -6831 -1557
572 -1557 1759 -5394 -3466 515 -185 -1657 -3670 1900 1098 -9089 -3993 3262 -107 -2712 -2027 5820
588 5820 9482 1662 3235 8201 6375 4634 656 -585 -1723 -5955 -1173 -1067 -10131 -7399 -157
603 -157 2576 -1877 -6952 1708 7722 754 -2250 -2535 225 4823 33 -2164 428 875 5663 4070
619 4070 -714 1597 2512 4107 1921 -5922 -3434 316 -664 -1456 -6396 -4798 3083 1366 -916 -1546
635 -1546 86 4866 1087 -1084 1170 -2240 78 2922 -1017 -2847 -3362 752 5299 -1507 -2988
650 -2988 1121 2461 3546 -944 -2916 2429 1824 1485 460 -4099 -505 3046 1318 -475 -3943 -464
666 -464 4677 -826 -2603 -2203 -1307 3187 -136 -4757 -2682 -115 3388 329 -4806 768 3399 1731
682 1731 1698 -856 1811 4162 1205 1699 -1689 -2401 2836 512 -2777 -3381 -2491 2216 -535 -3778 567
699 567 1114 758 1099 -773 625 219 -862 2078 -1468 -2675 1203 296 1209 140 -857 3144 1622
716 1622 65 996 -2002 -352 -9 -2508 -1366 -2423 -1671 2296 -188 858 2587 2050 5101 2734
732 2734 -490 1127 -106 -925 -2132 -5440 -2165 -1673 -3025 -1146 -1762 173 2507 -33 1419 885
748 885 -534 2374 -384 -1946 409 565 2693 2009 472 4840 4143 2030 2907 -40 230 -1215 -5323
765 -5323 -4005 -5581 -6544 -3481 -4541 -3254 -645 -52 3652 2726 1413 5306 3151 1487 2073 117
781 117 1528 204 -924 2510 792 878 3081 743 1557 393 -2639 -1368 -4256 -5826 -4145 -5921
797 -5921 -4304 -2949 -2777 1855 2144 3192 6336 4271 4767 4719 2118 2460 -353 -2755 -1102 -2962 -2094
814 -2094 -1028 -2277 765 1027 -645 1386 -397 -1052 -672 -3331 -2157 -2466 -3469 43 -339 1261
830 1261 4359 3702 5441 4851 2354 4020 1201 -2347 -2181 -4343 -4134 -4571 -5453 -1702 -2040 -1642 2378
847 2378 1890 2583 3361 1706 2464 309 -1015 1729 -1047 -1224 1237 637 2507 1705 892 3576 1090
864 1090 -515 -166 -3133 -4033 -4722 -5395 -3527 -4654 -2861 955 160 2373 4346 3769 5706 3991 2753
881 2753 3384 80 504 410 -2485 -973 -1050 -585 871 -1534 -308 806 -1644 -492 -1692 -3794 -2072
898 -2072 -3100 -2364 -1501 -2650 1153 2458 1810 4245 2929 3454 4503 1767 1492 156 -1179 944
914 944 -2258 -3757 -784 -916 -340 -609 -1114 1265 -332 -262 1952 -1558 -1906 49 19 26 -2661 -1304
932 -1304 3022 509 -681 1338 812 1376 485 -48 1037 -1933 -839 1926 -870 -2258 -736 1599
948 1599 3001 -1681 -1210 3254 1178 161 110 -1037 827 -433 -759 -368 -3282 -1152 460 -1045
964 -1045 -1315 -2887 -603 3177 689 -859 896 2008 3961 908 -1075 2020 1137 409 -583 -2589
980 -2589 -350 -596 -1267 1139 -1195 -2452 1254 1950 270 -3211 -1919 3414 -533 -4454 -726 1101
996 1101 1763 1002 758 3523 1508 1389 4429 1085 -2122 -2107 -408 -89 -5948 -6529 507 -172 -2358
1013 -2358 -1199 1103 3737 2982 2274 3645 368 1041 2649 -521 -1723 -1822 -884 2026 -853 -1861
1029 -1861 377 1390 2514 -574 -3999 -1474 -1928 -3715 -4078 -5473 -1558 792 -895 2788 4350
1044 4350 5040 7275 6981 6009 2416 291 3452 -317 -6213 -4683 -2828 -2933 -4722 -4772 -71 -30 -1391
1061 -1391 930 -198 -1902 -1318 -1324 -275 -2648 -3017 3028 3828 2260 4889 7078 8940 6520 3958
1077 3958 4056 -79 -3019 -3056 -7193 -9148 -7923 -6974 -5172 -4662 -1813 2291 2007 3551 4364 2086 3191
1094 3191 2420 942 66 -1472 799 3231 1198 2650 4573 4884 4009 751 872 -804 -6166 -5986
1110 -5986 -6561 -10293 -8799 -5969 -2946 -1296 100 6227 8061 6356 7992 7559 5639 3559 189
1125 189 -866 -2396 -4585 -2291 -2353 -3078 -410 282 1297 -223 -1816 -192 -2883 -5885 -4174 -5440
1141 -5440 -5546 -2280 87 2705 4229 7282 11390 8830 7839 8366 4299 918 -2420 -5313 -6527 -9508
1157 -9508 -9049 -6148 -6773 -4296 -767 516 2165 1400 2607 3551 -490 -811 937 -626 15 1616
1173 1616 4075 5395 4994 7793 8712 4662 3562 1800 -2525 -6101 -9408 -9874 -10199 -11481 -7951 -5133
1189 -5133 -3183 1231 4050 6304 7362 6297 7402 5899 2047 1611 1034 -679 -177 -784 1105 1798
1205 1798 1246 3573 1870 -729 -761 -3336 -6085 -7640 -8873 -7382 -7639 -5803 -1087 700 3892 7709
1221 7709 8817 10090 8596 7334 6565 1443 -1251 -1740 -4550 -5469 -5473 -4230 -2271 -2975 -781 2122 -562
1238 -562 -622 -86 -1915 -2821 -4226 -3055 -1589 -2354 878 4567 5310 6900 8347 8546 7082 3591 2426
1255 2426 -111 -5560 -6646 -7663 -8548 -7915 -7347 -3904 -1209 -628 3145 4058 3397 3995 3184 2372 1377
1272 1377 -405 749 542 -151 2720 2996 3437 4410 3356 3015 1013 -1988 -3212 -6106 -8092 -7236 -8392
1289 -8392 -6981 -4620 -2954 1144 2868 4652 7787 6637 6311 6190 3939 2212 428 -746 -617 -2889
1305 -2889 -1761 226 -1077 -71 364 50 -137 -2447 -2802 -2653 -5705 -5264 -3602 -3635 -1475 -213 2708
1322 2708 5295 4943 6800 7627 5155 4587 2847 723 -1281 -4241 -3790 -3883 -5020 -3454 -2005 -1342 173
1339 173 -31 1017 1408 -510 -117 -806 -2043 -1077 -1103 -221 1565 1445 3705 4270 3644 4327 2660 1367
1357 1367 539 -1955 -3022 -4069 -5124 -3920 -4388 -3302 -770 -369 1397 2696 2569 3312 2569 1663 1910
1374 1910 -8 -111 34 -1047 -226 -95 554 1683 501 435 1045 -771 -1032 -1559 -2953 -2766 -3596 -2549
1392 -2549 -1440 -1736 246 1945 2027 3227 3326 3438 3387 1357 1538 557 -1195 -782 -1479 -1819 -1096 -1914 -494
1411 -494 63 -1122 -218 173 -455 -554 -1481 -1017 -713 -1715 -20 345 145 1893 1603 2115 2566 1117 1965
1430 1965 1590 -56 -127 -1049 -1219 -972 -2421 -1297 -269 -1204 -41 -245 6 620 -330 494 205 -934
1448 -934 249 -93 -373 313 -519 -109 987 8 689 796 419 747 -602 372 487 -973 -43 77 -469
1467 -469 123 -406 -30 721 -693 72 324 -361 116 -654 -177 264 -1125 -722 92 -678 -125 -333 -132
1486 -132 578 -579 283 1156 265 1114 926 785 1270 -226 283 924 -829 -716 -563 -462 -625 -1721 -657
1505 -657 416 -525 16 453 1 484 -154 158 492 -372 18 84 -20 948 72 660 1512 147 581 778
1525 778 -562 -406 -1225 -1484 -1089 -1568 -1028 -555 -542 792 431 761 1860 1058 1079 1432 489 149 -631 -904
1545 -904 -68 -1191 -520 44 -664 215 158 -403 529 -128 -661 -304 -1091 -789 -787 -836 337 311 1031 2405 1727
1566 1727 1954 2295 1489 1284 287 -578 -768 -2125 -1770 -2030 -2479 -1400 -1020 -826 505 -2 702 768 151
1585 151 568 -64 -304 56 142 703 989 535 1799 1972 1215 2034 1125 125 -158 -1342 -1541 -2595 -3036
1604 -3036 -1996 -2219 -1865 -652 -531 850 1387 1094 2378 1811 1080 901 395 360 112 -560 534 70
1622 70 -151 1246 567 300 519 -256 -460 -1333 -2131 -1513 -1993 -1676 -966 -1208 26 970 1244 2157 1951 2027
1642 2027 1925 945 869 389 -1000 -860 -1286 -1611 -1016 -1224 -80 410 -47 469 687 -199 329 -588 -505 -319
1662 -319 -1184 234 355 168 1077 1290 1628 1531 646 1600 567 -854 -709 -1261 -1939 -1907 -2194 -1242 -776 -923
1682 -923 395 680 404 1238 799 1416 909 313 890 79 -325 236 229 720 490 69 869 181 -213 -145 -845
1703 -845 -956 -1131 -2112 -1473 -1401 -1477 -235 -164 280 1158 1062 1580 1406 807 1389 347 124 119 -441 -158 -192 -603
1725 -603 -98 21 -303 338 -342 104 -369 -1061 -364 -467 -797 -452 -531 223 401 50 1117 1151 417 964
1745 964 913 654 228 -459 35 -435 -822 -181 -473 -470 -145 -137 263 236 -206 616 151 -207 125 -363 -185 -271
1767 -271 -462 173 23 -346 606 -116 263 319 -293 317 -482 -550 -45 -271 -109 184 -274 380 436 190 733
1788 733 395 350 513 -113 180 232 -697 137 -694 -572 -190 -520 38 -131 -706 140 -92 -271 259 -13 276
1809 276 294 -125 322 4 -124 578 -379 296 159 -321 359 355 -175 367 -258 -58 -161 -642 269 -24 -345
1830 -345 -23 -342 -170 132 -374 422 23 -336 277 -93 -25 141 -144 -114 -206 -496 -19 -271 -74 376 -36
1851 -36 375 301 97 466 200 -3 40 -208 -199 87 -336 189 -115 -339 445 -58 144 291 -388 -6 -304 -672
1873 -672 -136 -570 -585 -26 -344 472 852 474 1073 436 588 726 133 294 -13 -292 3 -540 -797 77
1893 77 -430 -157 -233 -370 24 -81 -498 -33 -501 -388 -324 -247 403 242 343 653 596 646 893 481 794 111
1915 111 -402 -31 -359 -947 -305 -895 -418 -509 -356 535 93 2 415 194 233 80 -11 208 -416 -361 273 75
1937 75 322 694 276 800 154 -338 -102 -247 -470 -451 -1025 -393 -602 -695 219 98 295 668 575 1042 514
1958 514 40 759 68 -313 -216 -455 -116 -575 -651 172 144 -285 -249 76 181 -248 -592 26 -207 -457 213
1979 213 141 531 407 317 1062 688 505 862 184 -2 -274 -809 -430 -628 -1072 -601 -645 -391 -218 -432 263
2000 263 -3 -46 299 452 -74 133 -229 348 207 -65 595 380 396 578 146 306 34 -379 -171 -624 -880
2021 -880 -292 -729 -797 -297 -455 -170 201 -43 529 160 315 614 -152 155 93 -137 429 12 329 533 -52
2042 -52 605 211 -50 239 -584 -291 -147 -809 -139 -124 -510 -400 -98 266 391 44 298 487 -271 178 77
2063 77 -234 -23 -217 -137 201 -589 -34 0 134 261 4 82 249 96 118 311 -299 456 290 29 569 65
2085 65 118 9 -233 419 -159 -19 27 -468 -465 -204 -332 -167 -494 -397 384 -204 -42 294 -160 140 196 165 314
2108 314 -181 -272 282 4 185 124 -130 241 -289 -305 45 -328 -69 38 -2 -61 -204 -298 237 -170 81 167
2130 167 -501 274 -154 151 458 -12 -22 349 -90 222 210 -21 353 -208 -271 126 -436 331 238 -89 330
2151 330 42 -185 258 9 85 -282 -714 18 -67 -505 -245 -427 -258 25 -120 312 188 129 487 451 256
2172 256 294 142 198 -58 -369 398 31 -82 419 -46 315 76 105 -158 -646 -618 -261 -762 -725 -229 -247 201
2194 201 -170 477 978 821 754 361 498 664 -103 -185 25 -561 -245 -90 -374 -29 -223 -23 231 -30 132
2215 132 -242 -902 -474 -473 -441 155 -103 -46 420 475 1071 941 817 954 304 85 -68 -720 -678 -670 -1146 -594 -749
2238 -749 -629 40 228 520 586 297 454 285 18 413 -53 -284 161 -31 370 290 548 884 559 159 210
2259 210 -407 -265 -992 -1548 -1165 -1287 -952 -85 -292 432 840 1050 1335 1093 877 967 272 141 -299 -814
2279 -814 -470 -479 -222 -19 -405 172 119 -228 -135 -693 -697 -860 -1326 -1092 -676 -462 156 727 755 1573 1456 1558
2301 1558 1443 1158 988 185 -537 -592 -1055 -1248 -1077 -1051 -995 -493 -355 33 -148 -320 265 -77 -305 -388 -474
2322 -474 -324 -179 65 790 765 1013 1611 1268 924 428 391 -515 -884 -1328 -1472 -1918 -1486 -1096 -813 -162 17
2343 17 685 1361 828 864 563 312 -4 -55 -118 6 -287 357 262 174 651 83 271 280 -549 -518 -926 -1160 -1039
2366 -1039 -1239 -1115 -506 -456 390 929 1181 1588 1528 1392 1319 700 -16 -41 -1096 -944 -612 -912 -594 -381 -226
2387 -226 51 168 194 -313 -228 -199 -629 -489 -243 -342 164 680 706 1316 1251 1562 1587 1205 708 257 -475 -535 -1318
2410 -1318 -1182 -1001 -1360 -1172 -260 -451 74 290 485 643 337 127 530 -324 63 -46 101 593 268 524
2430 524 1059 867 734 666 159 -370 -592 -1041 -1346 -1383 -1378 -1053 -745 -305 50 579 1166 898 891 947 880 794 41
2453 41 106 17 -419 -538 -174 -84 13 192 59 270 -157 -288 -82 -661 -624 -971 -842 -291 -132 198 536 812
2475 812 1073 1096 1166 1077 155 -192 32 -565 -494 -564 -808 -730 -450 -275 125 -86 413 286 -171 323 -60 -59 -102
2498 -102 -148 157 233 169 511 495 212 835 222 666 133 -306 -111 -557 -1099 -833 -789 -473 -416 -247 9 245
2520 245 264 393 493 484 598 159 324 -66 -129 226 160 -6 258 265 39 -63 -211 -141 -596 -443 -219 -304 -170
2543 -170 -233 -407 -196 256 -48 368 464 219 416 69 250 49 -142 -61 -195 -146 148 -400 -73 39 -144
2564 -144 58 0 -6 -156 -301 -177 41 -524 70 27 -225 204 341 8 272 4 199 247 -1 194 -145 -29
2586 -29 162 67 165 87 -217 64 74 33 -82 21 285 116 -8 141 -111 -193 191 -105 -376 112 -419 -7
2608 -7 -106 -119 -4 -489 189 269 159 306 228 -28 271 -205 -45 79 178 -42 85 -189 193 -196 -44 54 -230
2631 -230 -120 68 100 54 83 -228 -20 62 -143 -17 -16 391 220 125 214 178 -259 39 -308 -204 -113 -395 -254
2654 -254 -403 -2 36 67 39 303 -25 285 45 -78 251 -149 -95 -56 45 383 -36 311 169 16 136 152
2676 152 -171 -245 -11 -462 -239 -313 -395 -244 -139 99 29 -39 673 435 343 692 -53 235 -100 -161 113 -403
2698 -403 -201 -282 -437 -58 213 -133 260 -47 -60 -101 -149 -349 -328 -274 48 15 173 365 317 583 322 127 632
2721 632 273 -32 -73 -221 -331 -439 -242 -428 52 -397 213 82 -13 312 142 13 -108 -45 159 -113 -163
2742 -163 309 144 230 358 325 246 76 -177 231 -221 -355 91 -460 -415 -47 -386 -56 88 279 543 456 488
2764 488 332 159 248 -195 -78 56 -273 139 -190 -41 204 71 86 270 -291 -296 76 -533 -114 -195 -117 -19
2786 -19 -85 436 41 319 214 292 201 606 66 90 97 -358 -184 -481 -527 -229 -117 127 -76 -278 170 128 120 158
2810 158 -212 -103 -83 -7 8 34 173 530 292 249 636 355 209 265 -146 57 -331 -559 -404 -811 -468 -219
2832 -219 -121 -51 173 198 49 154 134 241 -14 302 77 218 -80 241 227 395 167 262 82 206 109 -367
2854 -367 -259 -389 -400 -355 -333 -330 210 7 -67 401 118 435 481 193 130 -82 -176 -291 -280 -33 -2 -308 98 4
2878 4 91 190 143 137 61 -17 -77 -31 104 -100 -273 10 162 -33 170 113 171 332 -102 -26 -103 -408 -203 -341 -291
2903 -291 -250 -240 -68 101 -42 37 445 -126 230 285 -195 413 -88 81 91 -67 131 249 -27 75 15 86
2925 86 -9 -123 -249 -228 -235 -363 -60 -234 -39 -492 -19 226 31 294 460 153 113 -71 274 148 -167 57
2947 57 -238 55 33 93 181 -101 159 130 -209 -225 70 -380 -297 100 -275 73 248 -106 275 61 20 -138 -191
2970 -191 248 133 120 18 26 -11 83 -197 -120 -82 -318 123 25 31 287 -121 101 -4 -185 -171 -161 81 -88 -282
2994 -282 28 107 -166 74 -41 -66 364 -21 -87 27 -126 264 327 -145 -22 122 -83 -25 129 38 7 19 138
3017 138 38 -129 51 -26 34 -60 -34 -73 67 -105 160 -32 58 68 90 243 159 252 68 -133 55 -120 -78 -180
3041 -180 143 3 251 -116 340 65 -318 8 -15 -86 -174 125 6 -91 -86 222 144 106 114 11 117 317 -18
3064 -18 362 -43 -422 188 -214 -217 69 -295 278 47 -122 276 165 -126 388 -165 -175 387 -115 137 22
3085 22 110 -202 -58 147 -92 16 100 39 -197 37 -437 -336 -180 -182 26 -40 42 166 -111 112 383 281 410
3108 410 445 -271 176 40 -57 -27 -230 -31 -161 -176 146 -83 -130 312 -272 -39 -269 -216 -39 -71 -69 204 245
3131 245 36 320 -7 328 398 75 412 324 -25 -229 -388 -55 -11 -126 -319 -268 -401 100 -28 -296 147
3152 147 3 146 166 -60 106 -108 149 285 -270 334 241 -23 334 187 130 -9 -526 57 -277 -377 -119
3173 -119 40 -231 -218 -237 298 495 -112 41 200 1 12 -269 74 56 133 47 194 -73 -159 -123 -179 -2 21
3196 21 128 -50 -86 -79 3 -193 -57 151 166 51 -202 451 178 175 523 65 -84 -224 174 -54 -308 31 -292
3219 -292 -416 140 258 69 -187 6 118 149 25 199 -135 -134 10 183 112 20 156 293 166 -128 125 54
3241 54 155 140 -112 -56 248 -446 11 129 128 66 79 -106 147 -266 -71 92 194 73 195 22 63 89 243
3264 243 18 -338 236 48 161 42 -268 77 -148 -167 -174 191 84 152 26 -243 -46 73 78 57 -139 -158 -13
3287 -13 -187 126 -93 -228 -152 -221 -80 5 194 214 21 121 296 224 73 162 -253 123 -68 97 85 -135 -230
3310 -230 -74 -229 -13 -224 -214 86 -45 108 204 -181 82 -184 -139 89 -114 67 -54 -176 249 121 118 142
3332 142 -150 102 -34 -4 -94 -129 -190 -325 -180 81 -97 -259 122 249 71 467 273 -24 97 -366 222
3353 222 -229 208 -90 2 -74 -86 330 4 71 -65 310 18 160 -105 -242 -71 -42 -86 -37 -101 186 298 31
3376 31 164 367 197 31 -167 -285 -263 -471 -551 -593 -236 -39 -294 176 330 434 309 248 213 246 339 41 -3
3399 -3 49 22 173 322 445 181 123 183 318 -51 -342 -399 -278 -606 -657 -324 -183 -230 218 164 604 353 259 639
3423 639 179 291 80 118 -286 14 -70 -250 101 74 287 -259 144 -52 -417 -137 -103 -629 -389 -460 -606 -40
3445 -40 180 146 424 599 603 607 342 525 17 -19 -33 -579 45 -360 -627 -92 -201 -279 -30 -33 115 260 140 155
3469 155 -55 -260 61 -90 312 239 85 355 299 311 410 244 54 113 -162 -104 -403 -756 -699 -540 -316 -195
3491 -195 -179 192 136 36 588 174 521 253 -198 442 -121 -220 -10 36 -3 29 55 71 54 -86 47 -326 -388
3514 -388 -797 -672 -241 -442 -338 462 363 208 322 667 496 421 433 366 -306 -292 -120 -301 -260 -333 -389 -236 -454
3537 -454 12 124 -106 10 -182 -364 -377 -144 -211 -156 -64 398 100 652 702 659 229 533 115 -40 -236 -370
3559 -370 -664 -148 -467 -297 -398 -162 6 -55 75 356 476 133 406 27 170 74 32 -308 -6 466 119
3580 119 65 253 147 -75 151 -88 -215 -550 -544 -368 -435 -625 -83 -54 164 80 190 646 343 439 271 288 -146
3603 -146 -313 -76 20 -173 -270 -158 -241 401 -62 -88 170 -150 -250 -138 12 -184 -324 3 191 242 385 293
3625 293 548 414 632 254 356 120 -97 -186 -383 -401 -301 -597 -310 -60 -95 233 12 -103 192 81 -193
3646 -193 -70 -201 178 -12 -77 226 257 592 359 143 162 15 -104 121 -74 -331 -103 -435 -290 -193 -277 108
3668 108 -78 7 203 168 -97 116 154 25 16 -278 -80 -187 -28 140 201 397 105 -14 164 -100 30 -49
3690 -49 -144 -387 -82 -272 -49 -44 -65 116 86 313 443 -28 156 -67 182 -92 -198 -3 -166 -79 166 -137
3712 -137 -12 14 -73 45 -134 -11 96 90 20 28 22 350 58 -145 278 -11 -98 28 -11 -19 -228 -85 165 102 -40
3737 -40 -213 -183 39 168 63 122 180 -83 223 14 20 277 -317 -105 57 -24 90 73 184 153 -157 -59 -215
3760 -215 -21 195 17 64 301 -211 129 110 -60 -138 19 -284 -74 -153 -149 192 -126 -176 423 -39 -48 109 268
3783 268 113 -93 138 -24 64 199 -65 -197 302 143 216 108 -203 113 -151 -116 -216 -320 -227 -300 -356 -93
3805 -93 -240 89 119 -136 334 272 145 61 232 195 48 -229 -83 210 -141 222 197 -143 28 -240 -192 -140 84
3828 84 26 -144 -250 -240 -78 43 200 89 125 226 376 501 193 455 255 -64 -207 -83 -337 12 -203
3849 -203 106 49 -49 260 146 87 185 37 -21 -194 -153 -157 -121 57 71 172 83 316 102 498 444 62 169 65
3873 65 -226 -135 -568 -270 -259 -250 -140 337 -134 97 -179 -51 377 26 -238 94 -384 61 -184 -102 58 75
3895 75 309 199 98 70 63 -149 76 -228 -279 -403 -414 -171 -90 -299 188 -14 219 498 -9 304 87 -89
3917 -89 79 -143 -128 3 -263 -165 -51 313 -168 -157 -114 -66 280 -286 -346 -290 -135 -237 -199 170 130 -74 207
3940 207 357 385 190 286 334 216 168 19 -352 -345 -187 -216 -174 -340 -134 -422 85 132 -287 -187 133 7 -58
3963 -58 -159 -122 39 -89 87 294 43 219 442 -64 82 -99 93 -332 -358 -464 -293 -276 -65 -19 -124 60
3985 60 209 155 -75 54 155 -32 117 120 -41 -35 36 -173 -40 74 78 304 128 -38 1 -284 -61 -12 -155 -156
4009 -156 -26 -46 141 196 -35 520 173 460 -73 172 193 -278 -273 13 -315 -48 239 -221 -103 10 -97 -209
4031 -209 28 -159 286 -17 18 -71 -107 -116 229 -105 399 260 313 26 -88 38 -159 113 -119 -175 -363 -18
4053 -18 -330 46 -151 -515 -208 -340 24 242 -48 94 468 -148 176 -90 108 380 -169 -189 81 30 141
4074 141 103 -80 228 -211 -146 5 -239 -165 -44 -176 180 -350 -102 -173 -126 159 -116 -253 141 22 202 74
4096 74 -33 -277 23 78 128 157 144 71 67 149 141 353 257 93 37 72 80 -222 -98 15 203 -77 -49 329 -181 167
4122 167 -21 -269 182 104 68 198 -8 106 69 -164 -73 97 106 304 23 -174 108 -236 -122 2 -3 -167 -30
4145 -30 -196 -136 -89 -67 -291 -333 214 136 209 364 45 250 9 25 61 -176 -109 68 16 -149 143 133 -186 162
4169 162 -63 -59 -17 31 -189 -156 -146 -187 84 -238 -175 89 -22 -191 29 172 -50 43 131 -107 3 63 15 -121
4193 -121 134 290 179 14 -49 130 -53 140 -263 -110 -162 -97 -8 -120 52 132 103 128 22 -207 63 -296
4215 -296 -35 91 -424 -353 -101 -295 -111 1 -145 43 186 138 -85 260 226 2 -45 -31 115 283 -208 50
4237 50 238 235 -110 224 295 121 12 -252 -33 -320 -355 -235 -231 -29 126 -92 16 96 53 138 71 -1 181 123
4261 123 67 34 45 214 33 -50 175 288 256 108 48 118 79 -180 -137 -166 12 -19 -71 -37 -194 335 -54 128
4285 128 10 233 6 162 -1 -32 38 233 54 -91 27 167 211 87 57 -57 108 77 -63 92 -233 -107
4307 -107 315 -293 -296 -34 -185 2 303 -242 35 -117 -146 -63 -271 -85 -268 -406 -68 -264 -76 -106 87 278
4329 278 -68 103 272 130 155 323 161 130 -137 -162 24 153 -46 -348 -63 -72 103 -181 -73 -196 -47 -46
4351 -46 -78 -109 -105 40 -5 355 186 356 66 298 116 -105 -131 50 -206 8 -159 37 134 -152 106 -354 -2
4374 -2 34 63 -62 18 -265 58 83 72 157 122 -89 -32 344 450 118 85 -10 186 -107 196 87 -154 71 -260
4398 -260 128 -166 -126 -72 90 286 252 31 72 302 53 60 158 -158 187 -287 -67 -39 2 67 23 122 -57 -304
4422 -304 -105 270 -158 -249 74 148 258 54 -56 -223 121 242 -121 15 152 -95 108 130 -294 -13 -216
4443 -216 21 -249 -16 -171 -207 -286 -151 -27 -104 193 -55 -26 211 -109 200 205 -11 311 180 -17 -28 -109 -60
4466 -60 187 99 277 9 -10 -178 -23 -75 -253 -166 -47 7 -112 -120 -34 -21 66 203 -122 -70 116 -256 -247 -150 -94
4491 -94 177 -324 -150 138 289 5 -38 27 -319 104 154 -72 17 186 -132 337 -363 -135 103 -131 59 -102
4513 -102 217 -91 -364 -65 212 15 53 62 -9 75 61 314 -122 -58 144 -8 53 84 -128 -134 2 -228 52 -22
4537 -22 -510 -224 107 46 65 291 130 56 -224 -61 -104 -182 -26 -215 245 173 61 222 3 75 -13 -122 -121 -108
4561 -108 101 -104 -240 -193 23 -338 -135 -51 170 42 -23 108 244 194 -235 31 -55 -59 117 -168 184 56
4583 56 -224 71 -240 13 29 -248 -258 -102 202 192 164 -67 74 -27 -18 57 42 275 120 150 14 106 162 -121
4607 -121 -225 -285 -303 -350 101 157 194 -204 40 40 323 -339 -110 34 43 191 -94 281 407 32 185 98 129 303
4631 303 52 289 -74 -170 -201 -292 -403 -382 -284 -414 -74 128 141 224 101 336 210 311 204 -29 72 -125
4653 -125 -191 139 -55 322 142 22 188 9 211 103 -245 -209 66 -368 -242 -301 -108 60 -6 221 242 282
4675 282 332 -1 132 200 -56 -190 -87 -204 185 70 -64 -97 15 13 -37 -89 -213 128 -112 -265 7 -40 -92
4698 -92 -22 35 228 170 526 220 429 151 -56 74 -226 -267 -136 -76 -280 30 -135 -238 103 -93 83 165
4720 165 6 350 185 45 57 -130 27 -37 -47 1 0 114 -91 21 13 -14 -114 43 -161 -366 -401 -85 -41 -16
4744 -16 -4 164 94 7 393 31 -310 50 17 -52 -217 -222 63 -86 291 202 70 153 118 12 85 102 -361 -104
4768 -104 -266 77 -163 -76 13 -86 223 261 318 -1 296 274 187 12 111 -52 100 -217 -136 -260 -47 242 180
4791 180 58 -113 -245 -167 -43 25 233 -25 -175 -100 99 15 -36 297 105 7 111 -56 166 102 79 94 285
4814 285 -111 -39 -66 -122 103 -186 -141 -159 -18 117 -185 -69 202 -268 -105 -141 -90 77 139 -81 242 -194 -7
4837 -7 -58 -189 310 120 -2 97 126 -66 120 -40 8 67 -42 -117 -223 -37 175 46 119 -121 -228 -10 17
4860 17 97 -66 -84 79 -166 220 -205 187 214 -133 335 -212 96 0 -106 83 126 -62 17 69 73 -31 43 262
4884 262 253 364 99 319 154 -181 -164 178 19 136 134 -264 -238 114 -66 -287 -133 -331 117 16 18 -116 -18
4907 -18 234 -32 -69 116 99 -50 -40 -42 88 41 63 -202 263 198 -129 -107 -337 -10 -181 -240 -67 -37 -171 95
4931 95 101 75 258 -56 -96 162 -45 -109 92 -109 -340 58 -47 74 111 -60 218 -17 -284 -73 -7 -641 -448
4954 -448 113 -65 -280 -209 -81 -130 77 221 89 -111 -93 -173 103 153 176 171 -14 171 242 34 119 -91 -86 -67
4978 -67 122 98 -265 -268 -146 3 -156 -139 68 36 13 240 190 266 164 308 81 -99 156 -122 -90 -226 -106
5001 -106 -189 -170 290 -139 -117 242 -83 72 -35 -199 12 322 -33 151 10 168 365 82 -127 46 -106
5022 -106 -99 289 -177 -78 -232 -138 -242 25 -48 204 -140 44 219 -20 38 -63 -17 102 79 -25 -19 26 184 214
5046 214 -38 29 71 2 6 -74 -198 -119 -270 -30 -1 -126 180 -253 106 104 30 261 351 159 10 -84 105 -92
5070 -92 98 3 -167 -91 -247 51 -78 86 -109 9 -117 107 -235 -240 -104 -42 -80 104 -15 256 218 39 37
5093 37 -5 -2 -68 145 151 60 -294 -317 -167 -47 10 -80 150 93 242 96 304 86 385 346 -68 -288 0 -21 -64
5118 -64 -41 34 8 194 259 -75 218 32 -123 -144 -107 -24 -393 -25 -31 230 64 28 -31 -23 120 341 142 132 -168
5143 -168 122 120 101 29 135 -8 100 114 126 -117 -276 -61 -24 -19 -294 -249 -160 114 121 114 -16 -44 11 35 54 261
5169 261 -138 -31 -256 39 36 -517 179 -62 -42 -413 265 -87 -68 70 12 -101 270 -81 -243 -234 -3 54 13
5192 13 105 31 300 -151 175 81 147 135 -283 -50 -227 -267 30 71 -203 -18 -109 -143 -48 54 82 -56 27 56 -140
5217 -140 -359 -114 267 134 47 102 36 -210 -12 301 -18 -216 -88 -67 -15 35 -255 151 127 159 -62 -49 -262
5240 -262 -96 -6 108 -140 -3 -63 -158 16 72 -207 -121 123 -78 -98 -17 -50 -76 -134 48 43 60 92 93 52 -30 237
5266 237 -130 195 338 -14 171 -47 271 -191 -106 -57 51 -171 -2 -59 -234 495 96 12 -52 302 69 -13
5288 -13 -136 -24 64 29 -90 235 -200 89 170 68 -56 283 76 -55 67 399 34 225 -21 253 -70
5309 -70 109 -97 16 9 -41 -118 -17 -41 -19 30 -85 -55 89 -134 -181 -117 -145 -277 -176 -101 67 93 2 -60 -24 149
5335 149 144 -83 24 15 -24 -81 -92 -70 6 -135 -106 -36 -252 -129 -126 167 -393 -71 133 -70 -228 213 -114 -24 -23
5360 -23 -46 151 -190 -55 133 212 107 66 65 -36 -149 2 -101 -173 -155 12 288 99 54 -215 152 -13 95
5383 95 -100 17 45 -42 -31 85 -83 212 123 161 111 -25 -98 -152 -212 -94 -19 1 -91 -27 3 99 92 157 58 71 184
5410 184 -25 130 187 155 -183 -44 -271 360 -196 -139 278 109 -7 -116 111 -176 -119 111 188 -71 17 22 -87
5433 -87 243 296 -117 -45 117 85 152 -267 -111 -4 -41 166 -88 -35 130 -42 68 56 -94 -87 59 -103 227
5456 227 -137 71 -131 178 -192 26 187 240 -3 -166 25 253 164 28 -114 -170 -102 -207 -274 -85 178 -141
5478 -141 133 -127 -227 -13 46 80 127 124 -122 217 -14 -240 -53 -216 -32 -173 6 27 79 -32 295 96
5500 96 -243 -169 -160 74 156 -137 274 60 38 -74 -152 225 246 -32 -79 -55 -3 1 -207 -1 77 45 -33 -7 -42 96
5526 96 68 -238 -76 100 46 -66 -188 64 51 -36 -83 188 176 -232 135 99 -39 65 -259 23 -53 69 -315
5549 -315 -362 -92 -117 -69 -32 240 348 -87 221 99 54 -98 -137 30 94 209 -70 166 -566 -123 -168 52 155
5572 155 -185 -64 -112 -136 -45 -45 80 -226 -235 221 184 121 76 123 35 -33 122 -97 156 -101 -227 -77 100 248
5596 248 126 83 -146 -30 -161 -41 45 156 -39 120 118 107 -75 -144 -50 -84 -142 -90 163 25 333 -155 -1
5619 -1 -6 22 130 -47 -74 329 201 60 -32 105 -74 -46 43 -11 107 -181 -90 1 95 149 -175 -138 -96 18 43 -56
5645 -56 -156 289 80 26 -93 -124 -310 36 150 -5 -222 -20 25 -110 -81 -269 -47 218 -43 3 249 -104
5667 -104 -131 -159 -173 123 190 -154 -255 146 29 -24 150 -16 210 -82 16 189 100 -157 -17 16 -8 202 -51
5690 -51 -95 -9 -98 -306 -203 118 -20 -92 -92 -201 111 134 -154 120 -114 -25 131 211 -156 71 56 -207 -36 107
5714 107 4 107 15 23 -209 403 -114 -233 245 -33 -146 -61 127 43 331 79 100 -35 54 -297 -117 -169 -96
5737 -96 -67 39 58 113 83 296 -141 -68 -34 -5 -241 -100 137 -101 145 136 194 -34 -12 75 -27 -149 -99 -44 -104
5762 -104 114 -90 17 -46 -93 188 -192 41 12 -253 -64 14 -19 -5 10 -98 54 207 37 211 -207 -86
5784 -86 29 -337 -85 -213 -16 -403 -42 -133 -135 -135 -309 68 122 385 -29 106 160 -61 91 127 -238 99 -173
5807 -173 184 -106 63 -210 -89 6 -33 214 157 39 -206 125 224 62 63 -293 52 107 161 245 -9 190 -115
5830 -115 -35 -79 -76 -256 225 -109 -6 42 46 -38 10 57 162 93 179 -4 -201 134 170 36 143 88 52 -116 339
5855 339 25 282 58 246 -259 -122 -53 -256 -199 -156 -39 -71 -3 -255 52 46 -27 -5 19 -28 112 -199 58 -202
5879 -202 71 310 80 90 -22 -14 117 94 42 55 11 -280 148 -8 -85 -17 -65 76 -7 -19 85 29 -1 234 133
5904 133 213 211 26 -111 92 -118 119 -4 283 0 -294 -90 -35 -107 -112 -42 -13 -9 -91 126 -54 39 126 -48 77
5929 77 182 386 35 -155 217 -262 35 -141 10 -277 -83 20 -28 -1 69 96 -142 -105 -8 214 94 146 -60
5952 -60 41 244 422 33 73 -66 127 -139 -12 -39 -23 -137 -190 -8 -159 225 126 142 -194 -286 -25 27 -88
5975 -88 11 -118 127 89 126 216 49 18 -46 204 75 49 170 -18 -332 -44 -235 -65 98 192 25 131 -277
5998 -277 96 -98 -117 100 -30 -9 33 264 -211 179 45 -101 170 -5 9 -207 -97 -35 -109 17 187 134
6020 134 31 42 -153 -44 -49 -144 99 -100 -208 -79 19 -208 213 -263 -267 -110 72 -35 144 -150 8 111
6042 111 -84 209 -198 111 -123 129 -316 103 -123 -67 120 91 127 -197 137 -37 293 -106 -22 129 -56
6063 -56 76 113 90 257 -67 9 142 59 22 84 -29 -64 -9 233 49 -154 -33 -44 -98 395 -23 -145 175 -44
6087 -44 -297 -57 -37 60 -138 49 266 -63 57 56 8 -14 -214 87 131 6 177 11 -23 154 -330 -268 280
6110 280 -35 158 219 39 206 83 -25 -21 -197 -177 97 -134 -250 -200 100 -97 138 -171 -145 157 152 -39 -131
6133 -131 420 10 -132 121 -4 115 110 -54 170 -52 -156 -167 -123 -197 -218 -125 3 -79 143 -191 -278 -1 -23
6156 -23 332 -67 -52 -56 132 157 -98 -93 -130 147 68 29 155 -126 251 321 90 117 -4 -45 -220 -194 -24 -2 -91
6181 -91 73 134 -154 9 105 241 330 55 4 76 -208 -76 -127 -98 144 38 27 181 -195 43 61 -63 -162 -166
6205 -166 -79 -112 -40 -300 -197 -136 77 -217 -7 -20 -199 95 176 124 92 221 36 -70 -145 -135 -57 -86 34 173
6229 173 99 196 113 -7 -18 -6 204 -126 95 169 -159 57 44 -134 38 -95 171 -6 -122 -62 101 -62 -130
6252 -130 -145 -47 -140 -19 -116 30 33 134 -35 -157 367 -163 -33 211 -6 105 138 82 164 -113 138 -318 60
6275 60 65 -57 147 111 -296 -335 -11 -34 -206 13 -22 -59 89 -447 54 -89 23 -148 0 43 7 130 -75
6298 -75 -7 32 38 -105 -106 -80 -174 85 63 -113 -255 -104 -294 -187 -173 54 -22 128 186 214 137 282 -45 87 -4
6323 -4 182 78 51 -108 -127 59 201 -38 -182 147 -96 -133 121 108 -37 -114 -152 -264 -34 54 -337 119 100
6346 100 33 -192 142 68 369 -154 -34 -216 -4 -192 -172 -45 -283 166 216 -83 45 -87 85 42 63 49
6368 49 45 -15 171 -233 24 115 -93 -72 -109 342 85 45 13 -213 91 71 -25 -168 -118 61 -199 144 -137 26
6392 26 -128 -159 215 -56 44 -73 -154 -253 300 -46 -140 -211 197 264 -212 -31 206 102 124 101 -165 175 -128
6415 -128 21 12 -33 -133 6 -209 -85 143 181 109 73 83 179 -74 106 1 -238 99 73 12 -67 -237 122 -13
6439 -13 34 81 -30 -191 164 -12 66 -37 -51 77 -128 -88 -92 -277 -13 18 125 -90 235 42 60 31 -72 97
6463 97 10 -55 38 -83 -104 -9 -231 -10 -103 171 9 55 267 -171 120 -109 -90 -9 41 131 -68 -2 -74 184 152
6488 152 36 132 -82 -15 -77 19 79 -34 -25 -217 55 -138 -71 109 44 -130 145 -381 -97 446 297 14 -283
6511 -283 88 116 -15 -101 229 -65 134 140 20 -4 -2 -139 47 -195 21 -108 -55 241 -145 -163 102 138 -1
6534 -1 51 -210 -111 130 307 170 196 -73 17 12 -18 -5 -87 294 90 162 289 -10 -306 -58 108 102 70 9 126
6559 126 -12 182 108 92 -107 -34 -51 100 99 -30 -212 29 116 104 -55 56 7 2 24 247 -3 -161 -110 132
6583 132 194 -8 145 64 107 420 9 -52 -252 -98 137 -291 -196 -35 138 11 168 43 -230 60 -188 169
6605 169 62 -30 -201 -45 79 215 410 -56 214 148 -63 30 154 132 -64 68 27 -412 -65 -206 -208 -100
6627 -100 -108 -33 -103 -28 80 -10 -72 185 -59 131 -243 56 -258 17 -68 -227 -220 -10 -117 -105 22 -45 -33 -71 -22
6652 -22 24 -47 2 70 -282 57 225 -122 221 -166 168 225 45 -78 -7 179 -176 -307 -131 89 -90 98
6674 98 53 -35 -218 -201 74 268 -155 175 -20 46 128 19 139 -132 192 16 214 -32 158 258 130 -189
6696 -189 46 37 26 11 -245 -286 -125 -173 -242 -98 107 84 -25 288 -71 -59 69 -127 -37 -168 151 197 9 109
6720 109 -161 -19 -16 -144 -93 158 -84 70 -314 148 196 -94 175 -366 68 82 160 -54 84 138 -98 -6 -134
6743 -134 47 -208 -285 -273 54 109 -16 -49 110 -121 100 138 -49 201 246 -162 -32 194 -215 -13 -193 -149
6765 -149 220 -2 189 41 -247 -48 15 156 -245 -73 -88 -90 402 -336 -51 90 2 -73 99 -88 12 61
6787 61 136 -131 107 -405 238 56 236 -104 -98 257 -188 -404 223 406 -232 -135 -111 -98 -99 -43 -308 307 102
6810 102 -83 -20 53 -53 93 220 145 -60 90 -261 34 -227 67 -138 113 36 13 140 125 160 50 -58
6832 -58 63 -184 -29 20 339 253 2 144 -12 -129 -106 91 -24 26 162 -66 -175 -58 -4 212 -143 -80
6854 -80 79 136 -132 -103 -33 -81 -118 143 91 194 -12 -57 160 78 -158 -189 1 53 138 -143 179 191 -161 199
6878 199 178 9 150 52 62 58 -100 -162 179 294 159 260 -182 1 -247 74 149 -153 -73 -174 -270 136 -122
6901 -122 225 -23 210 33 309 189 72 120 -99 -328 -90 12 43 187 -294 -100 -105 202 -53 173 -83
6922 -83 -196 -9 65 -161 -212 96 -297 -296 19 105 -160 4 34 -147 85 -28 85 32 26 256 71 2 -31 4
6946 4 -134 -25 231 -151 188 50 111 89 82 -43 -128 -189 -235 47 24 50 -352 -69 205 -140 199 70 -181 -54
6970 -54 -208 -175 35 -193 -141 128 -238 71 143 -95 120 -28 -26 131 147 74 24 -159 153 -20 -114 -23 -21 -69 -172
6995 -172 -176 -325 -76 66 119 68 205 341 -110 228 119 -111 155 156 274 -176 130 59 75 -97 -80 -70 53
7018 53 -5 -31 216 196 -54 -107 -159 185 110 -71 125 198 74 176 155 -51 178 -21 -117 -251 -38 -34 -131 -149 -135
7043 -135 -150 -129 -423 -116 240 -265 29 90 -106 -241 -12 -171 -39 -137 -64 5 -177 -147 148 -41 72 -177
7065 -177 156 222 -103 -24 -4 -172 -60 -290 -10 322 -29 219 135 -58 22 385 42 243 59 -118 -14 125
7087 125 -28 40 -28 161 107 62 81 -39 -10 -130 346 -24 -79 -152 -38 -152 -31 -56 -64 -198 282 121 39 147
7111 147 -27 348 -80 270 179 25 -20 -232 42 96 112 -188 -88 -30 -163 56 43 71 -103 13 -25 14 41
7134 41 -22 -61 -41 240 -33 -18 -22 -34 47 50 -83 -41 -231 -49 21 -193 12 97 -9 83 125 -118 -235 -107 56
7159 56 14 -15 241 -159 -130 -11 263 111 -77 112 -14 25 112 -7 -97 -40 101 -131 -160 -149 -184 154 -272 128
7183 128 -87 -78 48 -153 22 -92 -11 -91 91 -170 -3 -132 -186 62 -184 -127 -169 -10 -160 -56 160 -161
7205 -161 27 -38 -62 91 208 -302 -181 108 77 52 -276 31 -141 56 287 126 27 56 122 -160 148 -220
7227 -220 -17 -51 -70 104 167 200 -84 61 83 25 -21 52 -107 -186 -113 -77 -74 34 169 67 4 -294 -28 -210 -37
7252 -37 -287 -241 50 71 1 170 -114 146 -160 49 204 -101 -14 222 85 80 32 -35 119 -126 93 -178 131
7275 131 -276 226 -85 -58 -73 -88 -37 -219 150 -223 8 -86 147 63 -23 136 98 179 -123 148 320 -80 145
7298 145 -46 94 33 -151 -314 -149 -312 -1 -161 55 102 -36 97 -39 -147 37 175 -184 123 120 74 -201
7320 -201 -26 142 -145 260 218 -12 -221 -212 -191 8 -159 -121 -139 -107 9 -22 -18 29 23 68 59 79 45 -260 -172 7
7346 7 36 -23 -79 -68 -77 114 -48 113 5 -238 -128 -19 -236 -12 -84 21 11 -56 171 126 94 67 -159 29 15
7371 15 15 77 158 -227 24 -84 -63 -104 -11 -193 46 185 113 -315 -84 -328 106 169 95 -166 80 -80 222 -52
7395 -52 -34 168 6 20 287 380 297 -125 -189 151 -79 -553 101 -6 -94 -120 23 -18 -41 -88 -127 -36 -49 110 19
7420 19 -178 -54 37 112 -190 -177 75 -60 -107 -25 190 -5 17 1 -101 -14 274 3 -132 -204 81 305 -6
7443 -6 -41 -203 57 40 -55 -206 -49 -35 147 74 90 16 -300 84 -242 74 77 191 -101 -149 240 -33 -14 -226
7467 -226 -145 -253 178 98 -11 164 6 -15 -139 -233 -340 292 -410 -118 126 -245 -92 -94 -11 58 -19 23 121 -52
7491 -52 120 -208 -9 -18 -144 -129 22 -190 118 -87 101 136 -232 80 34 -162 100 2 46 -13 -41 56 -128 279
7515 279 -97 -124 -100 92 -225 211 25 -47 199 -146 -228 136 -80 -181 260 126 -90 -97 110 219 163 -219
7537 -219 135 83 -82 -247 96 135 169 -128 -88 45 8 349 -22 -107 -209 -202 -13 -23 -124 -168 52 -125 344
7560 344 -24 90 173 198 118 -22 111 194 132 123 -217 196 -60 57 115 -110 7 -95 148 -79 -51 -259 304
7583 304 123 43 110 26 -289 -26 -42 -54 -68 -62 -72 46 -26 -162 113 -59 -61 121 -77 109 66 -120 8 -14 -6
7608 -6 -116 276 270 -136 -28 -208 -149 -244 -33 231 -9 135 327 -190 119 15 -151 -59 -270 -57 -204 -28
7630 -28 20 118 26 65 155 -13 -60 163 -167 -48 237 -135 97 -110 -119 -297 -41 59 -180 227 -123 -14 -190
7653 -190 5 -122 16 -163 25 -52 -16 243 59 10 98 -101 95 -331 25 183 -145 -54 -127 35 -215 -33
7675 -33 -334 175 -253 168 214 -28 122 115 -152 75 -166 106 109 -38 223 -89 3 53 194 179 146 188 -55 -78
7699 -78 48 16 156 -75 102 -307 -227 -198 42 -125 81 85 298 128 -11 184 -81 -46 -77 28 13 -142 -34
7722 -34 -363 -413 274 127 -4 -154 -295 -87 159 -1 -74 57 68 -82 -250 -285 269 117 77 2 69 35 50
7745 50 -135 243 34 -111 -181 8 -312 -24 31 -119 -16 -110 -113 244 31 12 -107 88 280 -143 262 -121
7767 -121 -65 -36 99 -101 36 -31 -97 -69 -120 -202 41 -318 122 103 -129 -155 -80 -134 151 16 230 -17 -207 -27
7791 -27 35 -50 -323 -197 167 51 355 246 1 -105 90 -63 276 -97 -99 -124 -56 161 190 -52 -108 186 -64
7814 -64 205 12 201 258 -220 -39 -212 55 39 8 125 -25 147 -226 -53 -50 92 168 129 -5 -108 171 10
7837 10 -23 346 -102 35 403 -19 197 -137 12 8 -104 146 -94 -317 97 -242 97 -87 51 -173 -193 79
7859 79 -57 123 -71 173 7 -24 187 118 -97 -82 57 -157 61 20 245 42 -195 -88 -230 -3 -82 1
7881 1 188 -10 284 12 56 75 83 197 152 -74 -9 144 -72 -61 -113 -5 -2 126 154 -45 35 -198 -6 366 70
7906 70 -241 134 72 -70 -86 52 215 239 109 -136 47 47 150 -277 -355 32 69 56 155 -59 -7 -289 -194 -204
7930 -204 -130 230 -173 -72 -168 -11 -139 108 90 -127 146 40 36 -50 131 -141 138 -87 -12 42 -125 189 6
7953 6 7 -110 -101 151 104 -72 15 239 208 41 20 45 -31 -144 189 -4 174 -32 -54 73 -70 -141 80 -61 -88
7978 -88 -16 137 130 114 28 -93 -127 39 243 -13 -40 -19 -51 335 177 -313 -25 -178 -109 -65 38 -167 201 152
8002 152 97 114 28 -79 101 9 176 -225 31 150 63 -84 232 -103 68 -5 -121 196 -272 -123 -337 67
8024 67 -164 -93 74 -19 -161 -79 -61 -69 210 27 167 -68 156 149 -80 265 -93 -139 100 -194 187 -73 -185
8047 -185 144 -32 -31 306 20 -48 -121 -93 275 -87 -191 -8 -56 -81 -78 32 -59 -94 -151 -214 -117 10 -170 65 84
8072 84 -26 -232 -163 10 -78 195 10 -23 -79 -66 -65 -171 200 254 -51 -47 -201 343 -11 166 30 -307 68 140
8096 140 -47 26 60 105 -117 -102 128 -14 -77 81 16 60 -385 -76 -49 86 167 -290 419 26 -224 25 -45
8119 -45 -173 175 -176 -26 -126 23 -15 -66 -124 243 30 258 97 41 -228 -133 2 -47 160 -150 122 22
8141 22 -157 68 -77 -157 -131 103 66 -188 -128 46 139 -153 -319 -298 -158 148 -122 -54 -225 131 82 8 61 -20
8165 -20 57 -88 -155 -19 -71 -26 36 80 18 -80 -193 92 119 190 -194 -298 -27 56 -334 194 259 96 39 -147 156
8190 156 -40
8191d0
$$ Imaginary data points
##PAGE= N=2
##DATA TABLE= (X++(I..I)), XYDATA
0 0 0 0 0 0 0 0 0 0 0 0 0 0 0 -8 8 -8 8 -8 10 -16 16 -24 24 -32 32 -40 48 -56 64 -72 82 -94 106 -120 136
35 136 -154 172 -194 216 -241 268 -299 331 -367 405 -447 494 -547 602 -661 730 -803 886 -978
54 -978 1081 -1196 1327 -1478 1654 -1861 2109 -2411 2799 -3301 3991 -5007 6660 -9826 18189
69 18189 -88736 -210471 45346 269600 105460 -22031 108137 120365 129865 39882 4463
80 4463 -54173 -76693 82226 20919 -105345 -94323 16618 138746 -39473 -105257 -8869
91 -8869 1087 -4016 -100876 -95808 -58850 -56892 39692 1668 -24071 49890 122895 141899 52439
104 52439 66509 82534 30528 26261 -11845 -57137 -115823 -60922 15853 -81579 -104766 -33627
116 -33627 52174 45576 -52695 4779 37718 2228 9856 -8976 -15068 -52646 7788 101883 -576
129 -576 -47563 61119 144639 64528 -51680 10372 61297 -2977 -69311 -83083 -64426 -71074
141 -71074 -37144 -31937 -69075 -23379 45322 79288 18423 -14761 69872 77068 25959 -17936
153 -17936 -16159 30182 -437 -10988 -1246 -16892 19699 38396 13087 -25198 -18333 26292 -15931
166 -15931 -70677 -51591 -23924 -39695 -51841 -11659 3451 3486 32024 57123 56804 24383 46200
179 46200 68138 14528 -8414 -2245 1394 -23750 -51954 -7842 -5524 -38514 -12471 12026 4392
192 4392 -22952 -11758 18331 -14198 -36924 -13370 -2721 -13384 -6650 15108 17207 23241 41199
205 41199 47781 28138 12218 34790 22207 -20135 -29014 -22854 -12409 -36030 -48575 -13383 -10158
218 -10158 -9580 5159 3914 6331 8702 22961 14218 -20621 -3763 24684 3656 -20419 -4344
231 -4344 23556 19253 1964 6962 19333 8627 2839 3541 -18653 -24159 -12007 -11146 -21745 -35852
245 -35852 -7099 18264 -2854 -2590 15977 26120 20600 5258 13457 9958 -5034 4234 -253
258 -253 -15521 -10820 813 1842 -8509 -8102 7301 5617 -7960 -2817 183 -7793 -7217 -6543 -1347
273 -1347 -3098 -7849 10717 11576 2459 11842 13625 12548 6302 3042 8893 -6865 -11201 2202 -7636
288 -7636 -17110 -9965 -644 -545 -10353 -4611 8627 1334 -2528 4324 752 -71 2804 2391 2211 -4864
304 -4864 2485 13449 -1109 -4195 6198 7986 4084 -7333 -1037 6847 -5660 -4481 50 -5947
318 -5947 -2824 -1023 -684 -2264 -5436 4190 5087 -5588 -1367 3534 2290 1372 -3584 566 3771 -3510
334 -3510 -664 1016 -3640 794 91 1335 2394 -1244 6687 5496 -962 6595 3949 -1205 996
349 996 -1115 -450 -5350 -7831 -367 -4753 -6178 -621 -3460 -1099 2069 -717 932 -1517 -61 5705
365 5705 -1890 -3750 2599 3660 5919 1322 1250 10456 5256 3868 6212 -1587 -1328 -861 -3936 -6179
381 -6179 -13551 -8146 -1177 -7801 -5421 -1772 774 6846 4323 2569 4675 2134 4733 3809 -3348
396 -3348 -1324 -625 2091 4737 -3625 -20 7131 4013 3381 -2288 -5517 -561 -2819 -5660 -10292 -12764
412 -12764 -186 2257 -2578 699 2835 9956 13353 4901 2620 2545 3411 5054 -5621 -10749 -4720
427 -4720 -2517 651 -4833 -9701 1692 6827 2599 -1407 -5267 2123 4811 -2736 -3480 -5788 -792
442 -792 9045 3832 1082 3844 6249 13827 8435 -2008 -1953 -7 2083 -5992 -18177 -10884 -4284
457 -4284 -6321 -6255 -7662 -1606 6466 4745 6486 4137 792 7337 7549 2447 -2971 -5619 7323 10217
473 10217 -3153 -3930 3806 8919 5525 -4666 -3061 -2056 -7071 -5339 -8996 -14017 -9326 -4864 1230
488 1230 -767 -7215 4793 15279 10787 3275 1145 10988 11199 -2597 -2520 763 -824 399 -2417
503 -2417 -2760 -793 -2266 3783 3324 -5892 -6207 -3540 724 -3018 -13762 -6367 3971 -544 -3341
518 -3341 340 8975 11057 3075 6330 10405 2201 -313 255 -221 -3414 -11270 -5126 1825 -5839 -6356
534 -6356 1248 5059 2057 -4280 2174 6180 -5001 -3797 2670 -94 -3459 -4053 4935 8791 -105
549 -105 1681 8164 6063 1825 -3767 -1086 551 -8837 -8188 -3501 -6866 -5845 -3003 2024 4974 -843
565 -843 3174 9073 5364 2845 1565 2964 5333 -2641 -3796 2172 267 -854 -1194 1542 2928 -5545
581 -5545 -3393 4254 -2308 -8068 -6927 -2481 178 -6993 -6266 3455 3508 3243 3880 4413 7295 4692 5759
598 5759 7064 -3077 -3619 3010 687 -4862 -8628 -2068 5389 -2264 -5626 -1430 718 3621 -1231
613 -1231 -5786 -1663 -577 662 577 -4160 -88 3618 4104 4022 -1032 823 7219 3348 617 -3162
629 -3162 -3503 2928 197 -4727 -3505 -1802 2307 464 -3268 1265 724 371 4015 -492 -3037 -921
645 -921 718 3874 -2215 -5783 481 2051 536 -1531 -3303 2331 3083 79 380 -2364 -76 4767
661 4767 1094 -1445 -2428 8 5766 163 -2948 352 965 3486 918 -4753 -1220 1398 1531 -1098
677 -1098 -6252 -1471 2527 -1433 -1798 -2519 -518 3214 256 386 936 -23 5089 3653 -1175 -110
693 -110 447 2596 722 -4518 -736 618 -1614 -159 -1389 -278 1577 -454 1629 260 -2693 1203
709 1203 607 -1022 -904 -2220 898 1148 -1269 1382 917 882 3299 -43 -336 -376 -2005 359 -2425
726 -2425 -4313 -1034 -1092 375 1738 -722 3331 4608 2719 3070 410 1388 2324 -2094 -2255 -2483 -3062
743 -3062 -402 -2731 -2100 203 -1316 922 736 -2581 25 -467 -1217 -1644 -3719 103 2015 -524
759 -524 2551 3891 4571 6291 3570 4137 3699 -230 559 -1853 -5121 -3516 -5698 -4500 -3324 -4979
775 -4979 -406 386 -945 1632 803 1326 1790 -1213 927 547 -1259 1996 1209 1799 4267 2746 4657
792 4657 4294 1480 2462 -74 -2394 -2664 -6199 -5474 -5460 -6805 -2791 -2272 -1925 2425 2042 3806 4869
809 4869 2322 3994 2559 -11 907 -1847 -792 439 -2183 356 1438 791 2585 954 591 744
825 744 -2792 -2217 -2946 -5443 -3047 -3059 -2042 970 313 3960 5282 3294 5443 4797 2846 1780 -1726
842 -1726 -949 -2096 -5471 -2922 -3394 -3710 -461 -1102 624 1307 -164 2386 979 -1484 351 -524 -767
859 -767 -112 -1137 2234 2753 1381 4915 3848 3000 3195 403 224 -2223 -4881 -2803 -5721 -6551 -3640
876 -3640 -3866 -1147 22 -163 3077 2564 2636 4355 1385 1508 1465 -188 995 -669 -653 2030 509 1308
894 1308 2365 174 1185 522 -2048 -1801 -4065 -3344 -2530 -4722 -2765 -1792 -1378 1982 1219 1460 3219
911 3219 2714 3994 2257 -883 1379 972 -912 -547 -1810 -105 138 -1114 1616 -15 -1517 1497
927 1497 682 -846 -1929 -1814 1789 -671 -3284 -196 168 331 600 -361 1561 123 -327 2930 -68
944 -68 -2674 -433 1057 1160 -2589 -3176 2818 1547 -891 600 159 1558 1639 584 1245 -576 -106
961 -106 1999 -799 -1588 -1704 -1627 1316 -1504 -4264 -1198 212 864 -729 -1946 2107 2769 1096 1228
978 1228 -178 1618 1894 -341 725 -432 -2695 948 1870 -387 -2337 -1157 3836 604 -4529 -944
994 -944 912 -1022 -2635 -3139 -285 -35 -790 3171 2164 -8 2764 4719 4310 -655 -2817 2532
1010 2532 755 -5370 -4622 -2836 -1632 -1756 -2491 452 222 757 4193 2037 179 1437 1095 1933 -170
1027 -170 -2942 456 1967 2002 1346 -587 3054 4102 487 -605 -2390 -2442 -2577 -6626 -6295 -4747 -4781
1044 -4781 -1925 307 1057 2582 3907 8579 7863 1857 3745 5371 2130 -1398 -3313 -528 -579 -3848
1060 -3848 -1299 -391 -1531 359 214 -246 -2523 -5747 -2458 -3121 -6832 -5123 -1801 130 1478 2186
1076 2186 6399 8108 7370 9812 7022 3055 2985 455 -2791 -5240 -6812 -5093 -6045 -5599 -2589 -2546 -362
1093 -362 2287 794 736 -448 -205 938 -1980 -2535 391 1025 2046 2952 5303 8291 5525 5996 6331
1110 6331 891 -1438 -2195 -5585 -8464 -10701 -8178 -5564 -7150 -3345 1638 2871 5191 5636 5625 6088
1126 6088 3146 3238 2332 -1509 -951 -461 -447 464 422 2853 3214 243 1093 -136 -3793 -4513 -6036 -8120
1144 -8120 -8629 -7551 -3688 -2763 -647 5688 7597 8189 10073 9525 8873 5897 2455 1368 -3105 -5795
1160 -5795 -4821 -5734 -5048 -4551 -2817 349 -1541 -1560 858 -1174 -2672 -3129 -3571 -3367 -4073 -1144 3083
1177 3083 2592 5281 10140 9859 9446 8197 6776 4792 -1081 -4124 -5622 -9689 -9896 -9383 -8477 -6023
1193 -6023 -4430 -830 2446 1590 3775 4933 2543 1766 829 337 498 -831 1816 3146 2588 5824
1209 5824 6395 4951 4827 2400 333 -2967 -6894 -7414 -9471 -10924 -8048 -6802 -4336 -833 1869 6271
1225 6271 6983 7019 8793 6827 4029 2676 769 -437 -2695 -3286 -547 -1849 -1168 1754 1203 536 -237
1242 -237 -971 -1692 -5212 -6354 -4722 -6635 -5414 -2352 -6 2937 4495 7687 10015 8319 7542 7347
1258 7347 3494 417 -2193 -4468 -5207 -7828 -6671 -4278 -4855 -2131 -17 311 1321 737 1169 780
1274 780 -1601 -879 -626 -1278 702 1823 3553 5483 5698 7029 6544 3913 3511 362 -3340 -4674 -7299
1291 -7299 -8040 -8384 -8425 -5104 -3590 -2200 1551 2680 3970 4700 4437 4593 2366 762 2044 -28 -583
1308 -583 932 1051 2020 1786 2185 3559 720 -595 -702 -3408 -5078 -6215 -6552 -5226 -5826 -3984 -41
1325 -41 468 2711 5253 5825 6532 5063 4467 4019 389 -862 -668 -2551 -2167 -2637 -1687 -58 -971 63
1343 63 823 -855 -490 -1176 -2438 -2169 -3226 -2569 -1196 -1188 1050 2540 2803 4678 4809 4488 3873 2051
1361 2051 1133 -1059 -3200 -2717 -3988 -4617 -3233 -3143 -1711 -176 283 1904 1276 1265 2206 705 148 255
1379 255 -448 155 -117 -143 2153 1434 1910 2593 1516 1242 -49 -1138 -717 -3184 -3686 -2774 -3843 -2761
1397 -2761 -1648 -732 1098 1190 2066 3173 2246 2691 2617 865 731 -101 -415 276 -1162 -441 419 -194 76
1416 76 -48 -99 397 -1398 -1457 -718 -2602 -1751 -1418 -1444 -98 -462 766 2177 1289 2159 2234 1553 1659 -3
1436 -3 -116 471 -1003 -1126 -526 -907 -448 -633 -276 600 -623 -86 527 -446 25 -614 -688 322 -736 -631
1456 -631 177 13 438 189 610 1472 -192 -117 944 -476 9 286 -53 676 -585 -570 655 -209 88
1475 88 113 -1 760 -412 -462 776 -248 -456 -159 -636 46 -1307 -966 368 -1052 -763 58 -15 1165
1494 1165 196 593 1844 737 629 959 468 385 -594 -453 425 -1158 -1056 89 -750 -111 24 -527 474
1513 474 -432 -417 79 -631 -93 -227 -539 367 -124 102 1587 1025 1157 1127 604 977 -159 -548 -495 -1519
1533 -1519 -1207 -1518 -1776 -721 -191 -288 1164 964 983 1090 722 1324 227 -437 460 -324 -721 24 -326
1552 -326 399 402 317 406 32 -331 -371 -1322 -1185 -1591 -2014 -570 -1218 -728 599 847 1657 2188 1884 2467 2153
1573 2153 1303 1256 -454 -539 -1143 -2180 -1460 -997 -1561 -673 -829 -442 98 -374 68 -344 -1095 -643 -1219 -542
1593 -542 66 -176 841 1800 1533 2436 2116 1935 1828 674 467 -348 -2000 -1802 -2096 -2283 -1838 -2051 -911
1612 -911 -59 -570 657 1301 854 743 94 468 246 -778 304 412 146 939 1134 1436 1256 1231 991
1631 991 500 -866 -689 -1879 -2388 -1516 -2542 -1326 -927 -526 684 1017 1488 2363 1350 1722 1310 102
1649 102 530 -187 -702 18 -1182 -660 264 -294 231 586 159 526 -858 -560 -352 -1474 -757 -688 -819
1668 -819 -215 81 1333 1956 1366 2289 1999 898 868 -50 -454 -946 -2035 -1557 -1200 -2106 -1196 -780 -495
1687 -495 77 -260 902 529 -45 554 364 -293 259 -375 537 967 575 1365 1322 939 1345 161 60 -271
1707 -271 -1136 -1205 -1474 -2152 -1719 -1502 -764 75 -75 258 624 547 1117 648 464 997 -154 41 408 96
1727 96 305 -247 501 800 -42 400 465 -218 -365 -783 -959 -674 -1340 -604 -233 -878 171 672 333 1029
1747 1029 587 1153 921 14 521 248 -522 -192 -643 -272 -32 -399 -18 129 52 320 -13 76 295 -256
1767 -256 200 -68 -677 -212 -151 -415 58 158 348 529 -51 325 85 -299 48 -632 -356 -470 -681 -54
1787 -54 39 -100 500 103 460 477 89 592 612 76 304 -145 -288 221 -743 -24 -74 -487 -214 -220 -69 206
1809 206 -335 -50 221 -295 107 -111 -10 158 39 239 474 -69 238 472 104 198 -39 265 310 -430 -1
1830 -1 -196 -176 -30 -432 -138 185 -267 431 316 69 375 337 27 264 -516 -113 -108 -726 -38 -221 -474 37
1852 37 -481 73 382 -144 536 201 42 623 -83 347 275 -286 356 166 -222 370 50 100 225 -418 -201
1873 -201 -158 -627 -234 -721 -679 -261 -895 -139 -11 -381 401 395 587 872 355 719 504 142 336 -78 -67 26
1895 26 -516 -110 328 -517 108 16 -271 -198 -635 -466 -511 -1039 -267 -310 -510 54 159 159 794 567 1108 832
1917 832 33 566 125 -288 -231 -676 -510 -211 -706 -270 130 -212 25 -147 110 142 -262 -173 -133 -490 63
1938 63 -218 163 356 75 633 831 373 602 160 121 181 -923 -365 -409 -850 -343 -635 -174 399 65 619
1959 619 713 74 459 452 246 401 -303 74 6 -366 -474 18 -70 227 -172 230 58 -484 -366 43 -665 -4
1981 -4 -593 -363 -161 -101 599 513 801 926 361 868 868 -361 267 -70 -375 -265 -936 -551 40 -777 -162 -140
2003 -140 -521 224 71 -294 98 -518 -289 205 -182 313 108 725 805 472 805 972 332 734 -33 -391
2023 -391 -294 -600 -484 -657 -570 -169 -376 -543 27 -63 -57 382 146 236 101 -397 63 -66 245 321 205 430
2045 430 362 192 519 106 -90 254 -163 -274 -224 -372 -237 -345 -259 121 -18 339 562 195 40 270 -138
2066 -138 -54 -202 -185 -75 -375 -134 -33 -330 180 -57 -103 295 -427 317 111 -85 -56 63 -41 338 -115
2087 -115 354 172 -71 814 194 -456 419 -192 -121 -196 -411 -258 -449 -387 -28 -278 -157 -21 -62 225 161 -446
2109 -446 201 8 -99 468 132 637 64 -22 438 -203 -201 355 -84 -61 -90 -8 222 -134 31 94 -238 17
2131 17 57 -337 -90 -242 -139 179 59 -195 417 -227 182 318 82 393 -115 19 -64 -378 214 305 -272
2152 -272 457 108 306 298 -53 324 308 -333 135 -199 -500 -352 -468 -74 -429 -349 69 6 70 250 71 638
2174 638 367 11 339 216 -281 -39 -10 -93 296 -136 460 187 420 527 27 -549 -322 -871 -642 -585 -811
2195 -811 -317 -483 -305 218 111 716 839 285 699 756 27 410 115 -60 170 -65 171 -46 12 581 150
2216 150 -6 96 -361 -259 -371 -715 -415 -670 -634 -190 -20 545 507 894 1118 1016 666 683 -152 77 -284
2237 -284 -944 -521 -846 -757 -551 -297 51 219 180 283 382 127 172 -234 -461 -219 -226 464 577 377 897 1326
2259 1326 1076 610 438 60 -193 -548 -674 -1360 -1280 -1100 -1104 -418 -274 124 711 658 737 1156 753 719 511 154
2281 154 314 -105 -139 269 171 264 792 537 136 -7 -529 -296 -1161 -1482 -1193 -1632 -1171 -679 -604 59 824
2302 824 1313 1573 1619 1642 1259 723 542 -215 -548 -627 -844 -385 -611 -536 0 -58 -58 169 -187 -195 -456 -904 -833
2325 -833 -934 -1012 -350 136 623 831 1346 1659 1517 1233 1489 459 -75 -751 -1081 -1267 -1368 -1358 -1017 -633
2345 -633 -563 296 74 594 433 524 651 326 -82 -207 -247 -169 138 639 818 1039 1047 941 593 509 -32 -762
2367 -762 -1028 -1709 -1473 -1168 -1578 -902 -651 -366 664 942 1084 1284 1413 1093 790 460 -48 -292 -683 -182
2387 -182 -279 -219 -147 127 330 103 -196 -310 -561 -1036 -910 -989 -935 -798 -405 457 718 1002 1807 1467 1389 1213
2409 1213 877 724 55 -606 -655 -1062 -1382 -989 -1123 -452 -419 -187 259 -170 -310 -51 -168 -245 -587 -252 290
2430 290 12 351 822 861 1288 1352 845 908 498 66 -397 -1023 -1276 -1025 -1387 -1115 -1021 -622 117 170 525 703
2452 703 428 1055 204 -126 217 -249 54 -251 -216 313 303 288 775 517 383 292 -369 -452 -657 -1035 -742 -1108
2474 -1108 -809 -154 -133 100 480 693 899 1101 666 332 34 168 -233 -593 -308 -456 -209 -149 39 -126
2494 -126 -99 60 47 -35 -389 -192 -354 -365 -77 -305 227 468 301 684 709 793 657 270 541 41 -545 -188
2516 -188 -720 -692 -581 -483 -485 -68 -188 -21 150 172 310 29 47 245 -214 214 -63 42 413 208 345 703
2538 703 295 120 230 89 64 -521 -235 -393 -657 -456 -88 -133 -196 -125 145 174 257 419 202 307 222 128 113
2561 113 225 -128 -301 28 -102 102 320 53 308 170 -279 96 -303 -107 -168 -79 94 -144 -93 -24 -34 23
2583 23 -127 115 406 -34 -86 21 -231 69 -63 -48 255 -254 309 161 64 75 -29 243 409 175 51 241
2605 241 -25 88 40 -103 -21 -229 -157 -55 -64 -119 -251 -79 -94 90 0 322 106 -200 280 -159 44 -13 159
2628 159 92 -250 -78 39 -56 -54 294 -58 108 -189 -78 29 -386 61 -331 -102 102 108 39 203 261 -5 250
2651 250 -93 149 -282 -589 26 -311 -305 -292 -255 203 101 -66 212 -67 219 39 12 198 50 435 242 -92
2673 -92 -187 156 -15 123 180 92 153 -27 -134 -383 -564 -389 -384 -522 -178 -1 75 403 310 266 472 318 175
2696 175 250 139 156 -47 -132 125 -209 223 -13 255 -194 -157 -128 -81 -516 -254 -148 -85 -288 -523 -136 -133 100
2719 100 284 730 -9 356 212 109 92 31 -10 -145 -371 -408 -238 -395 98 -112 -74 125 -199 -173 -236 -147 -320
2742 -320 -347 -173 15 -35 -71 111 454 437 251 534 579 147 26 -375 -381 -209 -677 -337 -197 -430 -348 -19 -204
2765 -204 196 373 203 168 74 -184 192 -249 -166 158 -256 387 -9 190 398 -111 11 27 -157 -102 -318 -402
2787 -402 -161 -472 -113 -257 -27 153 193 190 158 524 257 59 -110 287 -85 -307 -122 -452 -302 -29 -127 -68
2809 -68 -67 22 -1 -196 -85 272 -484 -20 -95 -99 -36 62 267 436 695 585 537 174 -8 -143 -150 -231 -414 -299 -311
2834 -311 -575 -282 -300 -196 184 -162 222 18 -235 -133 115 -53 25 -399 27 97 43 277 535 384 229
2855 229 62 -23 188 -503 -328 -173 -490 -134 -374 -195 3 32 152 358 -50 265 341 299 -130 90 -57
2876 -57 -10 -289 -166 -109 165 -33 -76 128 448 -17 -180 -86 -122 -26 -569 -287 -248 -3 -164 152 301 456 -31
2899 -31 -98 124 -271 -3 172 -60 -347 -219 -287 -100 -48 281 329 -374 -32 -25 146 199 -30 -46 0 -289 139
2922 139 117 10 190 -106 -7 397 215 128 -131 -44 -36 -190 -185 -16 -199 -310 8 177 54 -240 137 79 102
2945 102 356 -50 -84 254 181 -27 -25 -16 282 378 -159 -48 -170 11 -169 124 -221 -133 -62 -430 50 -296 87
2968 87 -159 135 72 -53 128 178 -167 348 -324 -173 -22 -383 -158 76 -307 109 -90 -292 72 -150 99
2989 99 61 80 74 246 80 -139 -272 -225 126 -178 -47 155 -39 60 -286 -68 -29 -113 -36 -3 -86 7 -31 198 225
3014 225 81 2 357 4 407 83 -92 80 -253 19 -137 -320 155 -51 -83 263 -72 -32 193 -48 -37
3035 -37 188 -39 91 148 -6 83 132 181 151 -139 -9 -69 22 123 -216 256 115 -15 142 198 -311 -220 -219 16
3059 16 26 -46 73 88 212 91 -116 165 278 29 173 -156 -78 135 -232 -268 -88 -354 142 -202 -100 108
3081 108 -35 166 64 69 -125 15 161 83 175 169 248 97 241 33 105 331 -46 -50 -175 -366 -163 41 -132
3104 -132 -215 -97 -63 228 126 255 179 -61 228 -8 -77 242 -205 116 355 57 12 219 -114 -107 -347 135
3126 135 -65 -116 -354 -532 -649 -276 -329 -133 178 26 218 419 207 370 180 -187 422 -98 119 168 -148
3147 -148 -248 -204 -397 187 -204 -25 103 -184 -59 11 -163 -41 -238 -232 22 -250 240 268 186 234 191 34 248
3170 248 65 -84 -96 -165 -60 -162 -241 -245 -82 -68 114 119 215 59 112 282 -44 -301 -73 -67 -275 -111 -131 118
3194 118 12 106 -63 117 -52 -61 -257 -335 -161 -28 -38 -295 -81 26 -140 92 503 166 431 55 403 30
3216 30 24 22 21 -234 -35 -337 -27 146 -5 -15 114 6 10 -51 -126 -73 -366 87 -19 -18 155 -51 99 351 102
3241 102 335 101 145 169 75 90 70 -265 -94 -131 49 35 11 -233 -52 -62 121 179 -131 -164 -50 139 120 -41
3265 -41 186 102 43 168 -204 19 -67 124 64 -65 -257 103 53 -167 27 81 -219 84 -57 118 271 -116
3287 -116 2 -159 14 -43 -212 -128 41 -38 361 44 -223 197 33 -105 -23 -7 400 114 50 37 -177 -14
3309 -14 175 96 266 -81 -301 -100 -411 -227 46 35 202 -89 -399 -54 -77 170 2 43 -179 -98 -19 221
3331 221 -63 43 263 67 459 1 -45 7 68 -118 -62 -313 -90 -57 -180 80 -103 -13 -69 -7 180 80 150
3354 150 305 -148 -12 -31 -298 -165 -51 -10 104 -192 101 189 25 -155 121 11 -131 -100 -205 -290 -38 -298
3376 -298 414 160 204 335 403 251 284 399 119 9 -174 -168 -431 -594 -314 -372 -20 173 61 201 -176 68
3398 68 -241 146 29 -173 108 431 32 114 378 246 221 402 427 156 -48 -54 -323 -698 -246 -426 -528 -411
3420 -411 -516 6 239 265 346 149 489 546 280 205 315 -123 54 127 -230 233 51 116 176 -2 47 96 -139
3443 -139 113 -400 -553 -379 -304 -159 -188 -35 337 532 344 499 267 276 244 465 101 -125 -294 -167 -383 -399
3465 -399 58 187 -90 -200 -237 179 -88 168 -8 -274 -154 -299 4 -74 200 453 527 313 532 439 335
3486 335 142 -450 -174 -377 -472 -513 -508 -433 0 -147 144 378 192 385 267 29 303 -169 -7 -78 -89 373
3508 373 395 189 568 407 222 336 59 -152 -460 -348 -394 -582 -797 -457 -200 -127 358 134 507 662 578
3529 578 559 370 171 20 -21 20 -66 -341 -276 -235 133 220 -41 188 93 -36 -190 -393 -218 -467 -760 -233 -325
3552 -325 63 407 274 446 727 759 456 615 238 -66 -307 -312 -414 -272 -313 -275 -315 93 -26 240 51 284
3574 284 127 157 -229 -95 -231 -348 137 -4 -22 308 364 403 217 275 112 121 -104 -278 -271 -504 -69 -537 -114
3597 -114 -143 203 154 289 202 535 398 121 319 -265 -9 -356 -57 -18 -60 56 55 -70 -111 16 -14 -129 -242
3620 -242 36 -270 -536 -292 17 -149 179 437 332 634 388 363 -29 244 77 -86 -92 23 18 -344 -209 -353
3642 -353 -208 -75 101 139 -452 84 136 -266 -114 -97 -370 41 167 364 367 95 489 224 374 256 -55 67
3664 67 -83 -415 -332 -214 -422 -1 -445 -276 90 -40 -62 -17 -119 157 -20 49 -71 -84 -98 116 204 267 110
3687 110 89 245 -266 30 112 -401 -448 -248 -16 -185 -416 -264 -29 -232 92 -124 212 76 150 -44 83
3708 83 55 -260 28 1 99 -257 159 338 -103 245 -88 -266 35 -134 54 161 -128 80 -13 -86 191 -279
3730 -279 128 152 -20 -83 -198 -20 118 24 10 174 -157 -22 -60 -302 -98 129 -189 110 19 98 4 192 154
3753 154 50 -192 -116 -19 163 115 -14 30 153 229 112 -140 -121 164 -7 125 173 -410 372 225 364 116
3775 116 3 -276 -268 -186 43 202 -229 298 -24 99 -106 -87 19 122 -218 72 -228 -71 49 6 145 36
3797 36 367 299 185 -70 -71 94 -83 -249 -55 -203 -355 -251 108 -169 -79 38 -18 234 -50 60 -140 213
3819 213 -20 -208 37 15 -174 57 274 8 300 225 -27 0 -270 -246 -250 -426 -285 -364 -52 -15 145 -109 152
3842 152 169 13 168 111 382 -6 41 139 -51 47 94 71 92 126 164 176 -54 -48 -218 6 -196 -38 -198 -28
3866 -28 -272 -5 167 74 157 285 354 156 79 -134 34 -311 -401 -436 -561 -261 -97 -170 140 -117 282 329 110
3889 110 535 213 168 -172 -135 -11 143 69 271 158 147 413 117 244 99 -41 -375 -95 -402 -242 -442
3910 -442 -524 -47 -343 35 100 184 147 426 383 242 131 -63 -8 -95 -28 -97 37 -105 -110 81 143 -149 -121 -3
3934 -3 -266 -181 -340 -478 -419 -314 -124 -81 -59 239 491 102 611 251 331 90 61 241 -234 -206 -173 -174 31 132
3958 132 -37 -172 -6 298 -187 -212 -78 -361 -219 -192 -150 -137 205 73 434 196 374 258 -68 107 225
3979 225 -43 -138 -269 -345 -379 -106 -18 33 126 -57 155 100 -119 -57 -414 79 -28 -274 114 -78 120 269 63
4002 63 215 51 23 146 53 -40 105 -285 -68 -308 -511 -144 64 -271 252 57 108 430 144 120 307 55
4024 55 -146 61 -141 -137 -183 -257 -4 -112 -234 25 78 95 -8 -222 -201 -202 135 -258 -386 164 211 12 120 326
4048 326 159 182 -125 141 -208 -80 -102 -360 -127 -142 -395 -159 -95 168 -142 -73 478 83 128 155 -168 -214 -143
4071 -143 12 -128 262 -72 -85 177 29 437 87 -79 165 -222 -283 -237 -141 -25 -174 -130 -191 -183 110 -265 75
4094 75 97 -209 20 -40 -13 201 -32 -52 -16 -113 85 -17 -198 108 -43 -275 7 118 -239 129 -318 -82
4116 -82 -159 104 53 161 -92 -15 -39 -58 275 -246 114 87 -311 -27 -147 -216 -83 -265 70 -191 127 143 -95
4139 -95 108 103 384 105 24 170 238 -84 -320 8 -78 -45 -94 -89 166 -156 -135 70 -228 -122 -8 -255 86 -90
4163 -90 73 160 15 63 -30 49 61 -68 104 145 9 88 -47 -235 -129 -28 -52 -134 -217 -149 -28 -145 102 282
4187 282 45 265 43 23 58 -34 -63 243 130 86 -246 -29 41 -94 -157 293 208 111 3 -63 55 34 232 -39
4211 -39 263 193 271 242 94 194 41 -55 25 -113 -194 -426 6 35 -447 -110 -165 12 -154 34 192 316 233
4234 233 278 -88 148 196 -150 36 56 -108 -89 -65 270 260 179 12 -239 -24 -276 -205 -322 -309 -89 18 67
4257 67 142 99 -58 4 90 2 -17 -275 -45 -148 -5 -130 -81 -32 56 231 215 119 -255 -97 73 -101 -153 -109 -540
4282 -540 -149 -353 -27 67 -86 136 288 49 100 178 58 277 258 48 -59 -168 -123 2 -212 509 146 52
4304 52 300 118 -116 35 52 -137 -140 109 300 -159 -41 -68 -39 340 67 193 28 87 101 -148 -180 60 -68
4327 -68 -147 -73 2 209 120 -109 75 101 -58 177 -157 -199 -91 -27 125 251 121 116 -36 -1 123 60 -214 17
4351 17 -120 -124 -346 -231 -265 -196 -32 -123 -27 134 142 187 401 -98 -25 90 -70 158 -52 -75 -158 2 81 -143 150
4376 150 58 31 225 -180 -172 238 81 -102 -81 -169 -66 209 86 -109 196 -143 207 149 249 4 93 56 -268
4399 -268 -86 -32 110 -272 198 81 -71 -56 86 35 25 160 67 -73 145 -143 90 45 46 262 -217 51 257
4422 257 184 -128 -88 226 -31 -16 -36 -179 160 34 -85 195 -160 192 -43 113 -26 35 -25 14 101 -95 0
4445 0 54 63 -35 151 79 67 57 33 -331 -2 -247 -2 40 -24 -39 240 293 55 75 -57 353 23 -4 -45 160 137
4471 137 21 166 11 -28 -170 12 -12 188 -7 75 96 -78 -80 -149 32 -102 145 -76 123 167 23 -22 -168
4494 -168 -73 179 -109 293 -2 44 158 -103 157 57 -280 437 -7 78 91 5 139 3 -172 2 113 -39
4516 -39 139 -34 -240 102 20 -290 122 -98 -3 -12 112 9 -33 161 181 117 238 -37 78 178 -300 -75 111
4539 111 -88 -285 7 148 29 -256 8 36 -185 230 -66 -148 36 -156 42 10 17 14 318 275 94 234 41
4562 41 307 -160 -263 -265 -119 -217 -151 -329 -190 126 -157 -320 -62 91 124 184 25 14 -115 77 -240 -250 9
4585 9 -119 -245 37 -36 48 -241 72 41 -243 20 -47 -55 -113 -20 27 -250 -78 159 335 385 228 -54 201 -141
4609 -141 -12 -25 57 -289 -91 85 -203 -311 314 -233 -60 132 203 -181 44 27 -149 -147 60 94 -83 153
4631 153 252 223 281 350 71 401 293 -4 -30 -166 -41 -122 -495 -210 12 -49 18 286 131 215 -81 180 128
4654 128 -122 -64 61 45 134 162 132 411 1 246 177 -119 -27 -177 -390 -305 -295 -379 -363 -328 -361 99 19 204 183
4679 183 328 357 58 -86 250 -18 -455 -118 -62 -100 148 -43 150 180 -35 176 -338 146 -187 -384 -14
4700 -14 -283 -151 -60 57 231 291 118 454 217 -43 346 -132 105 -11 -72 -378 -95 1 -159 -289 -26 169
4722 169 -324 68 -130 -34 23 15 130 167 -94 20 96 213 421 -67 387 222 -293 49 111 -41 -272 -266 -207
4745 -207 -101 4 -43 -132 0 233 253 155 185 148 233 150 23 -94 -44 -120 175 -89 89 397 120 166 -114 -202
4769 -202 -123 -373 88 -102 -424 -106 -94 -391 -1 8 68 398 33 157 -56 2 -116 -124 -92 163 96 -169 -19
4792 -19 29 -101 89 43 -48 -109 -167 -311 -171 -442 -258 -111 -139 -15 341 -20 17 134 288 166 -63 28 -67
4815 -67 -101 -136 -217 -218 -37 194 186 159 -114 -75 -36 57 -2 -11 26 142 -39 74 -150 -51 21 33 -191 -109 -27 118 -125
4842 -125 -109 73 26 -284 -40 -34 -13 -201 7 -104 36 -93 -19 123 5 -114 -28 -38 -99 -126 -166 -72 104 337
4866 337 48 -64 -229 -2 -71 -264 -79 -97 -40 64 317 132 -15 101 -71 -109 58 -4 -279 -77 90 94
4888 94 -107 -77 -74 45 -10 99 317 171 295 59 -51 15 -37 86 -52 104 154 150 108 22 161 192 -355 -26
4912 -26 45 -134 74 75 205 -140 -15 332 377 10 366 32 -173 172 90 -89 -187 -354 -40 -121 44 190 -33
4935 -33 140 197 -51 -62 315 -12 -243 -87 241 103 -24 147 -166 261 -79 175 0 71 127 -134 392 -337
4957 -337 -115 -84 -242 -261 94 22 99 -369 135 268 9 77 -281 212 22 91 192 -9 -4 325 202 -78 166
4980 166 62 -18 10 139 77 -80 220 21 -32 -211 65 -76 87 167 236 112 169 3 99 -89 115 -155 142
5003 142 108 -79 -108 -11 -158 -68 -49 -43 -70 -154 -124 -12 -91 -217 -324 -217 136 -112 17 323 -45 124 74 207
5027 207 -171 -40 -277 17 -160 -64 -259 -21 -96 -56 -53 -108 -23 78 -15 -74 109 -33 66 430 9 355 -24
5050 -24 50 246 63 476 149 -204 -169 -287 -476 -315 210 -134 -269 -387 198 255 68 486 241 -144 105
5071 105 -258 49 -174 -130 -101 -307 71 297 -62 22 159 -48 127 56 76 21 -266 -16 -89 46 -423 -325 -55
5094 -55 -4 -103 -34 241 112 -94 159 128 -118 -263 -64 -54 131 -91 127 -186 126 217 30 -34 -183 -19 -62
5117 -62 79 15 17 -114 74 -57 273 132 82 -68 226 57 5 -78 -284 -154 -152 -160 -308 -57 120 -110 291 178
5141 178 306 -2 -116 -121 62 96 132 196 73 176 357 -69 -51 -55 -195 289 117 -47 -90 -312 92 167 -409
5164 -409 -88 -243 -161 213 164 174 -53 52 99 11 -1 197 8 99 17 73 -117 -320 -16 406 2 -21 -45 -73
5188 -73 96 -328 -246 -135 136 10 -246 -43 13 -93 147 300 17 -136 164 131 118 186 -180 -72 91 42
5210 42 177 -131 -34 76 118 -9 69 -218 17 -428 -62 -155 -78 -119 356 79 44 -12 101 67 -89 -137 137 90
5234 90 157 15 -210 -100 164 -39 4 -214 109 89 2 84 171 54 66 -118 59 89 -115 -154 -259 -190 217 -105
5258 -105 11 237 -265 -172 -38 -187 117 -25 -137 236 -112 -136 -66 172 -13 50 -119 81 139 69 -18 -35 9
5281 9 -260 -15 -129 170 370 -113 128 70 -114 -26 119 -31 -232 -116 129 -3 -56 -118 -44 57 193 23
5303 23 -257 55 72 48 -79 -9 286 -112 -69 -198 -77 -39 86 -49 -178 -147 269 -185 75 -227 -7 -53 197
5326 197 -97 -256 -94 -17 -186 26 -83 104 101 176 171 -235 -267 -106 17 -20 -47 -10 33 -141 -293 155 74 65 154
5351 154 -175 41 18 -73 -284 96 -287 -52 -95 67 -240 43 103 -20 127 -77 128 -86 200 39 -190
5372 -190 -183 -214 -196 -471 38 -180 -117 89 28 -257 117 -76 -33 33 -36 89 -80 -235 -116 -126 -274 -128 196
5395 196 -131 247 73 -179 -70 -20 4 -152 131 219 -154 -145 55 166 39 58 211 263 78 -28 -2 167 -82
5418 -82 -121 0 -122 -79 -103 -104 -69 -279 -160 -160 110 -94 50 7 -37 -106 -36 126 -189 3 -31 405 72 161 108
5443 108 176 -159 3 166 -56 -5 -107 -264 -269 -177 33 -39 185 77 150 -192 50 -93 53 -219 38 96 125
5466 125 127 113 205 142 104 125 77 30 -133 -254 -116 -352 -75 18 53 -11 -133 15 327 -62 -17 103 50 226 119
5491 119 -77 328 141 111 40 60 301 236 109 -255 -281 -141 89 -43 -68 -18 -99 326 80 40 61 298 34
5514 34 154 50 -136 36 39 61 -121 108 198 -41 -253 88 3 145 229 104 143 67 37 -55 -144 112 76 114 -66
5539 -66 -100 71 48 56 291 222 14 73 -236 -69 -74 -285 92 -183 -44 -164 55 -131 -15 -52 137 -49 -20 -103
5563 -103 312 104 -153 44 85 -81 47 79 -137 -99 78 -39 201 -24 175 8 -85 138 174 13 2 19
5585 19 -50 49 42 51 209 -107 -89 112 87 -133 352 46 142 -98 54 25 -139 103 159 91 256 -5 -87 -22 -91
5610 -91 -11 -241 138 159 -105 -280 92 -112 135 58 -309 26 30 -315 -94 -119 -58 88 112 109 -1 -87 -124 187
5634 187 61 386 -86 6 171 -319 -57 -303 5 1 -27 -65 40 67 -160 -169 77 210 -59 71 -112 162 223
5657 223 92 -180 -4 -141 -25 124 -2 -3 122 233 158 -76 -109 25 54 236 -89 -141 342 -285 -252 -24
5679 -24 -290 102 -176 22 320 122 -182 24 -182 110 193 -257 233 88 -88 46 -33 -190 -117 197 96
5700 96 86 66 222 -130 13 62 23 -3 -162 95 -91 -59 72 -99 -101 99 193 115 11 6 -203 -124 286 -290 -282
5725 -282 -107 292 52 53 -134 190 5 -164 -70 271 -138 85 106 -174 -82 -257 219 -101 -10 -303 50 -204
5747 -204 -95 6 -84 -65 70 45 206 22 57 248 332 127 276 157 -28 17 66 -168 -56 245 235 -60 -47
5770 -47 80 48 -35 -13 18 -65 -219 -176 -203 -96 -108 -328 254 -153 -60 -33 199 -51 322 86 50 -5 -13 -156 -121
5795 -121 2 50 -60 -11 0 110 -30 136 -57 -302 -59 -138 28 -133 -26 -141 146 237 219 -155 191 150
5817 150 -227 -61 117 -96 -10 -360 -134 -39 -9 42 32 108 134 113 -27 80 255 188 -271 -75 -16 -36 -227 -194
5841 -194 -281 -47 118 -259 154 201 29 -59 -113 -134 -57 -180 -358 3 -119 113 129 334 142 -90 35 289
5863 289 -243 -69 -356 -139 -121 -57 161 0 -321 -204 -49 -172 160 -29 -78 45 14 24 -4 16 314 206
5885 206 267 -5 39 109 -45 59 26 30 -3 -110 -118 -102 75 -39 72 66 -163 -205 -67 15 -132 107 -62 -276 -84
5910 -84 86 63 -54 -197 152 43 -39 16 -131 -249 13 -166 -51 -50 -124 43 -286 6 100 41 227 73 -47
5933 -47 305 -94 178 -131 -185 251 186 -40 189 66 -109 41 128 -196 24 224 -164 -18 61 174 -50 9
5955 9 -96 -5 -107 50 -154 0 310 30 60 160 254 22 24 62 46 102 -140 -182 -55 -67 51 63 131 12 -95
5980 -95 -127 -65 -99 29 299 5 -338 -12 110 13 127 77 47 14 -298 148 -174 -212 109 -154 155 137 110 66
6004 66 -11 62 -5 244 115 221 -50 337 253 -209 40 -58 -236 -115 -65 -17 -179 -62 192 -100 -47 -54 -153 -36
6028 -36 -39 309 111 -151 -57 -22 -244 -169 -190 -41 -196 -58 -18 95 -211 -122 240 171 281 -30 39 -109 -178 -19
6052 -19 -21 309 251 -122 -194 50 22 -15 -103 -113 -203 -26 117 -164 -226 -77 -144 168 -3 157 116 -21 -57 220 11
6077 11 -66 50 -69 -129 -38 -73 101 138 -139 0 115 98 154 6 -193 -166 -148 -119 -137 -97 53 -29 68 294 -170
6102 -170 1 88 -134 52 36 -120 -96 -83 -162 -15 134 -181 19 -97 65 -81 76 1 -97 -195 151 -45 13
6125 13 92 29 187 127 99 -24 -20 -205 -123 -108 -148 64 -259 84 27 69 105 -246 -197 116 110 -88 -173 25 53 -33
6151 -33 -3 71 -187 121 -115 -120 -43 -238 -113 143 -268 -26 73 -20 -172 -171 -93 -60 21 4 32 2 31 143 129 -55
6177 -55 50 -193 97 -54 -78 -143 167 -27 19 -360 -33 170 -79 -237 -94 -62 -111 -151 125 -186 81 160 59
6200 59 87 194 -2 113 81 188 351 60 63 -39 73 -337 -68 -13 -251 -69 183 55 266 77 -81 -121
6222 -121 -32 -161 85 -50 -285 96 173 190 -77 -66 201 -11 142 201 227 -64 201 -55 27 -133 -2 -194
6244 -194 143 126 259 -98 293 107 1 86 -118 163 26 -246 -244 62 -128 -27 -120 136 -293 -157 -15 -84
6266 -84 29 -35 -52 -138 142 -175 308 193 177 261 25 212 60 -43 91 -176 -89 -256 -165 -64 -424 -131 21
6289 21 -29 -33 -180 175 349 172 -21 178 -135 -32 31 33 -62 132 54 -206 217 -10 179 156 -30 -23 -322 69
6313 69 90 -192 -206 95 -123 -5 -141 73 167 -160 198 -69 -91 153 -55 -20 -105 32 148 -5 -106 135
6335 135 149 81 -12 -122 114 64 133 -171 -42 -98 76 88 -191 177 -140 30 138 -97 101 184 349 -463 -113
6358 -113 -70 33 83 185 -123 139 -98 49 313 -140 -118 -89 -111 -74 273 358 1 -49 1 -240 80 295 -190
6381 -190 99 56 212 14 103 -80 -220 147 -115 -222 -210 -273 -109 191 140 -40 -124 81 -107 -22 -108 -188 106
6404 106 30 -101 181 162 -175 -31 9 -166 92 -182 23 116 -15 100 381 -19 185 115 -59 -305 130 -30
6426 -30 94 85 -80 -104 41 50 27 167 36 -70 25 6 14 103 -117 14 21 123 26 106 -12 300 -85 14 -338 -167
6452 -167 -77 54 -35 -25 -54 -4 65 -248 161 262 87 28 72 -178 -26 57 38 153 71 74 46 -159 91 239 4
6477 4 -36 -225 -57 58 -261 -251 -121 64 -112 208 -56 -121 50 -49 31 12 -89 158 78 -85 -225 301 -16
6500 -16 -28 -11 -115 191 48 193 342 -42 -129 -255 -220 33 98 -77 101 -56 20 302 -123 91 89 249 -1
6523 -1 114 -47 92 274 182 -175 332 -82 94 119 100 37 -156 56 -61 -66 -75 -185 -43 -333 -167 -57 -102 -28
6547 -28 190 77 -204 24 26 -190 -224 -29 -87 -162 -174 -134 -39 0 -53 -112 -5 -108 44 6 -220 23 -72 245 34
6572 34 -70 241 -365 -26 -173 -17 76 234 -25 -115 -57 -121 -183 -84 83 -53 143 66 -61 -167 -65 144 92
6595 92 183 15 -53 -301 34 77 -277 63 -244 -173 173 84 -80 188 37 146 -261 -234 65 165 171 76 276
6618 276 25 -108 -14 94 61 249 134 1 -21 -21 -271 -44 -227 -347 223 85 -26 106 25 233 92 21
6640 21 271 -149 58 20 -13 -40 -228 -219 -163 -81 -107 86 9 -23 -114 -409 -155 -5 11 17 43 40 317 207 311 144
6666 144 -1 119 -30 139 184 89 -144 107 24 -7 -264 70 174 -42 61 -130 115 -119 16 -101 -204
6687 -204 11 -99 20 170 -23 92 -12 223 -35 58 89 -13 -273 -38 -165 166 -230 14 -100 236 30
6708 30 -5 140 -115 132 -307 -35 -184 218 -21 197 -122 116 -105 53 -111 -17 93 36 15 57 -100 24
6730 24 19 -41 146 -53 66 -132 -240 -71 80 -235 120 -76 182 -140 26 -74 -20 118 109 0 62 116 57
6753 57 -84 128 52 135 -131 -35 3 -188 -238 -51 266 156 -187 59 67 159 -6 -164 19 80 128 2 53 -36
6777 -36 -14 109 -27 -250 50 -225 16 -12 -80 49 -170 -38 215 -26 -100 16 115 129 -215 -101 60 -9 257
6800 257 -86 1 -212 11 30 83 -124 -268 164 -138 -180 97 101 78 -82 70 -190 -290 75 -68 -147 -121 101
6823 101 -234 211 141 -231 88 8 48 -30 -110 -92 19 -91 -284 159 123 48 24 -64 190 99 -99 -171 -118 74
6847 74 58 273 -69 -188 -65 136 -127 -54 -251 68 102 41 -120 27 87 -3 262 285 -79 241 -175 -154 -46
6870 -46 -186 64 2 -25 -142 228 -106 -48 -429 -26 -247 -116 175 -110 -165 195 100 181 90 247 152 -236 -66
6893 -66 82 -85 150 22 -82 -140 136 -89 169 -3 20 202 -150 194 109 -40 -124 -86 50 -57 58 -92
6915 -92 49 -33 -166 -15 131 96 -3 192 89 -66 95 -55 -64 71 182 136 70 -99 8 -61 -117 266 37
6938 37 -63 -106 -51 182 -52 106 249 341 55 8 -5 -32 277 37 1 10 7 187 139 -338 88 -114 -111 -50 -75 129
6964 129 63 17 153 -124 64 77 -242 -84 -108 -23 35 136 -299 -3 5 77 -24 122 -117 5 67 -36 11 -92
6988 -92 5 18 107 18 -64 -126 85 -52 116 -81 -47 -446 47 -64 -94 147 -20 44 96 160 158 351 217 -97 37
7013 37 21 -148 -33 -12 -154 -72 299 66 100 -263 -273 -233 103 -53 -66 33 67 -183 45 -241 -22 167 -96
7036 -96 232 -57 3 153 -151 106 43 -17 276 189 -77 -138 -33 -157 58 -183 172 -118 269 -42 -119 -16
7058 -16 -62 72 163 -25 -222 -127 86 127 -68 -274 -69 167 74 -19 -76 -188 -98 94 -39 -376 -165 -42 -88
7081 -88 -38 219 -89 315 137 -27 81 100 -110 334 97 64 223 -79 92 112 52 -22 -101 -168 39 -153 -103
7104 -103 -202 -136 -1 -20 -144 -196 -118 -164 166 -25 347 141 17 -199 -231 17 193 185 26 110 -20 8 249 171
7128 171 -172 -226 25 -180 -264 -178 -1 3 -20 320 -65 -36 78 -151 -67 74 -85 226 185 86 -156 184 115 138
7152 138 -172 -284 -132 140 315 -104 -97 -58 203 -53 -236 -60 -46 77 351 279 326 -83 3 77 54 -86 50
7175 50 -162 -18 122 -46 9 -161 -105 -225 -84 236 1 13 285 -25 -75 81 -38 -16 -93 -77 -109 52 -184
7198 -184 212 -30 145 143 256 -355 41 -40 119 18 -155 24 63 45 -216 52 -70 -119 -49 45 -110 -141 123
7221 123 -37 38 -153 215 254 61 -105 89 19 -80 -31 -125 18 -138 297 -53 153 -250 -41 32 265 -67
7243 -67 -180 104 -117 -132 185 238 73 73 173 128 7 35 96 -151 -61 -58 -80 51 205 -263 -132 40 63 -92
7267 -92 229 324 0 66 31 130 9 -164 -66 251 -209 -319 -70 39 319 -84 -49 13 -39 -109 -143 374 -27 -162
7291 -162 -87 -12 -84 -106 130 -72 123 277 -206 -22 130 -32 113 63 268 62 -21 -23 -76 29 193 289 6
7314 6 -71 -86 54 -223 66 -22 -132 92 -58 -78 230 32 44 127 35 41 26 -243 -259 -17 -307 127 -111 -19 217
7339 217 182 29 16 170 -101 105 118 -40 87 -41 -203 156 -143 -22 209 79 -46 71 82 45 182 166
7361 166 20 -165 -204 -127 139 -83 118 -115 -65 25 113 18 59 -119 -86 175 -278 -91 -255 -41 83 -188 -35
7384 -35 78 -108 45 58 -191 -158 -66 -404 -84 84 -259 107 9 342 46 -101 -25 25 148 132 -205 -87 58
7407 58 11 -211 64 48 -70 -101 46 -42 -55 94 -367 -191 -21 18 37 73 277 116 55 141 -152 324 5 -19
7431 -19 287 -46 -161 -85 -108 -104 -5 -75 217 324 -258 202 44 137 20 -30 134 29 175 202 -61 -57 -35 -70 -124
7456 -124 -10 -254 -171 -55 -131 163 -164 141 -197 64 -156 -71 -50 -82 185 -6 -74 151 124 -32 -171 -110 -176
7479 -176 -179 -174 -176 111 -25 140 92 52 66 56 54 243 -284 255 203 -75 -154 20 129 186 108 -162 -89 265 26 -13
7505 -13 26 97 61 229 90 -23 130 120 -62 75 60 -76 -102 -289 34 159 166 -90 -163 -235 33 -32 118 265
7529 265 184 54 31 -73 -38 -120 13 3 205 92 130 -197 22 208 -69 3 267 179 73 -12 -19 284 145 -69
7553 -69 72 -80 8 -215 -42 137 143 96 56 51 6 62 98 -50 -142 107 -23 -183 196 202 181 -262 113 69 -31
7578 -31 104 43 72 273 13 -7 -84 -80 172 103 62 -221 -123 -11 214 138 8 -292 -42 -10 94 -126 36 -269
7602 -269 -136 -5 -222 29 -141 -24 -43 238 207 -126 -55 186 110 -22 -233 68 212 364 -64 40 -33 -212
7624 -212 -182 196 3 -10 14 -100 169 -25 -300 -138 5 159 -52 -415 160 -49 45 -3 -31 35 -72 238
7646 238 -134 -188 -37 -78 -45 299 -9 -105 77 140 -76 153 3 159 105 272 160 -136 -175 -169 -97 -230 -21
7669 -21 185 -42 225 -13 74 65 -163 -14 -152 88 -96 -94 -18 156 -110 -67 92 7 -376 -65 -159 -97 -182 -99
7693 -99 54 2 212 101 17 -36 105 17 -148 289 -301 -246 -16 -193 117 -12 -7 144 189 44 278 83 -25
7716 -25 -43 -84 197 35 294 -8 -52 94 249 -18 169 172 -292 -72 -217 -184 82 -214 -31 96 -184 7
7738 7 215 15 142 78 144 122 66 236 10 236 132 -168 -105 -320 99 -36 -88 22 187 58 12 86 188
7761 188 -125 -30 -103 -20 19 34 -113 -39 -73 -15 188 56 244 -67 -20 -77 153 27 -73 -67 -126 -132 -169 98 147 154
7787 154 -135 25 -111 -138 -283 93 94 -39 25 -80 113 -90 -19 -95 -48 277 -49 -13 -185 45 8 120 -161
7810 -161 -104 58 -203 272 -27 -22 -290 -129 47 -161 27 204 -2 71 256 123 -180 133 102 -75 -25 496
7832 496 19 184 125 -151 -156 56 -155 -147 -27 180 -105 428 30 212 18 -106 -197 -43 143 170 -36 -56 -173
7855 -173 -9 181 -223 -96 5 25 -134 -78 -68 127 -248 151 160 -76 -33 128 42 278 -128 168 168 -61 -21
7878 -21 16 224 74 -173 59 45 99 20 -120 -126 45 -77 -26 374 76 284 -195 59 101 155 4 -94 -71 -443
7902 -443 98 240 -202 -273 77 -45 63 -47 -298 100 55 129 129 15 -184 -162 149 78 -191 -33 24 240 -136
7925 -136 106 47 -296 116 43 -71 -29 -43 112 11 128 79 232 -129 -19 26 166 -37 -96 171 64 -50
7947 -50 -9 -237 15 -17 125 92 85 -245 -233 -138 -117 -80 -218 28 -115 153 37 160 -69 49 99 65 21 99 -11
7972 -11 -105 -135 74 -60 -74 190 -210 14 146 5 222 203 -95 -25 74 147 -28 -68 -74 -58 35 95 73 36 91 188
7998 188 51 39 -161 -103 -100 -107 14 -186 197 -43 -153 -13 214 -125 57 -75 -87 105 -85 171 40 70 -180
8021 -180 42 -120 -47 -25 88 212 171 345 -40 -98 -337 -135 -21 -72 -142 171 131 111 -332 -95 -189 -77 91
8044 91 -6 -21 -135 153 -264 -66 20 1 -125 -38 175 -63 -46 -183 59 74 -166 -8 -7 -65 55 -306 -133 158
8068 158 76 -11 -84 108 -83 -142 233 316 -175 -101 111 61 17 69 136 -113 104 -240 -277 125 -20 -66 167 77
8092 77 25 -155 -222 153 -99 46 -42 272 43 133 -108 49 -159 -147 -105 28 -16 -126 33 -66 -140 10 29 13
8116 13 -153 59 -222 -71 209 -26 -7 -185 -186 -86 -285 -202 -31 128 181 109 -116 -8 -160 82 85 81 5 -151
8140 -151 20 288 -46 -32 -58 -70 -146 -43 -78 8 46 -233 103 -175 18 -90 128 -191 -175 -145 -76 -68 234 -15
8164 -15 -18 225 16 -107 -12 -96 263 204 34 105 80 -289 -32 -111 -428 -54 -145 -85 -23 -94 -324 -2 53 48 -117
8189 -117 1 -44
8191d4
##END NTUPLES=NMR FID
##END=
