##TITLE=1H_Pr 5088
 CDCl3
 8 sc, 
 15.2.2023
##JCAMPDX= 6.0         $$ Bruker NMR JCAMP-DX V2.0
##DATA TYPE= NMR FID
##DATA CLASS= NTUPLES
##ORIGIN= UXNMR, Bruker Analytische Messtechnik GmbH
##OWNER= root
$$ XWIN-NMR		Version 3.5
$$ Wed Feb 15 14:15:44 2023 Russian Standard Time (UT+4h)  she@DPX200
##.OBSERVE FREQUENCY= 200.13135
##.OBSERVE NUCLEUS= ^1H
##.DELAY= (6, 6)
##.ACQUISITION MODE= SIMULTANEOUS
##.ACQUISITION SCHEME= undefined
##.AVERAGES= 8
##.DIGITISER RES= 18
##SPECTROMETER/DATA SYSTEM= spect
##.PULSE SEQUENCE= zg30
##.SOLVENT NAME= CDCl3
##.SHIFT REFERENCE= (INTERNAL, CDCl3, 0, 15.7039)
##AUDIT TRAIL= $$ (NUMBER, WHEN, WHO, WHERE, WHAT)
$$ ##TITLE= Audit trail, XWIN-NMR		Version 3.5
$$ ##JCAMPDX= 5.01
$$ ##ORIGIN= Bruker BioSpin GmbH
$$ ##OWNER= she
$$ F:/spectra/data/she/nmr/H-F/1/audita.txt
$$ ##AUDIT TRAIL=  $$ (NUMBER, WHEN, WHO, WHERE, WHAT)
(   1,<2023-02-15 14:14:39.90 +0400>,<she>,<DPX200>,
      <created by zg, POWCHK disabled, PULCHK disabled
       configuration hash MD5:
       00 E9 B6 7A A2 85 ED C7 34 08 36 98 17 FE 4E 26
       data hash MD5: 16K
       C0 DE 36 33 9C 80 96 6D F7 CC 35 B8 DF 6D 97 83>)
$$ ##END=
$$ 
$$ hash MD5
$$ A2 B2 43 5F 17 27 75 E2 10 23 9E AC E9 97 10 BD
##$RELAX= 
##$RELAX= 
##$RELAX= 
##$RELAX= 
##$RELAX= 
##$RELAX= 
$$ Bruker specific parameters
$$ --------------------------
##$DU= <F:/spectra>
##$EXPNO= 1
##$NAME= <H-F>
##$PROCNO= 1
##$TYPE= <nmr>
##$USER= <she>
##$AMP= (0..31)
100 100 100 100 100 100 100 100 100 100 100 100 100 100 100 100 100 100 
100 100 100 100 100 100 100 100 100 100 100 100 100 100 
##$AQSEQ= 0
##$AQ_mod= 1
##$AUNM= <au_zg>
##$AUTOPOS= <>
##$BF1= 200.13
##$BF2= 200.13
##$BF3= 200.13
##$BF4= 200.13
##$BF5= 200.13
##$BF6= 200.13
##$BF7= 200.13
##$BF8= 200.13
##$BYTORDA= 1
##$CFDGTYP= 0
##$CFRGTYP= 5
##$CHEMSTR= <none>
##$CNST= (0..31)
1 1 145 1 1 1 1 1 1 1 1 1 1 1 1 1 1 1 1 1 1 1 1 1 1 1 1 1 1 1 1 1 
##$CPDPRG= <>
##$CPDPRG1= <>
##$CPDPRG2= <>
##$CPDPRG3= <>
##$CPDPRG4= <mlev>
##$CPDPRG5= <mlev>
##$CPDPRG6= <mlev>
##$CPDPRG7= <mlev>
##$CPDPRG8= <mlev>
##$CPDPRGB= <>
##$CPDPRGT= <>
##$D= (0..31)
0 1.2 0 0 0 0 0 0 0 0.06 0 0.03 0 0 0 0 0.0002 0 0 0 0 0 0 0 0 0 0 0 0 
0 0 0 
##$DATE= 1676456079
##$DBL= (0..7)
120 120 120 120 120 120 120 120 
##$DBP= (0..7)
150 150 150 150 150 150 150 150 
##$DBP07= 0
##$DBPNAM0= <>
##$DBPNAM1= <>
##$DBPNAM2= <>
##$DBPNAM3= <>
##$DBPNAM4= <>
##$DBPNAM5= <>
##$DBPNAM6= <>
##$DBPNAM7= <>
##$DBPOAL= (0..7)
0.5 0.5 0.5 0.5 0.5 0.5 0.5 0.5 
##$DBPOFFS= (0..7)
0 0 0 0 0 0 0 0 
##$DE= 6
##$DECBNUC= <off>
##$DECIM= 32
##$DECNUC= <off>
##$DECSTAT= 4
##$DIGMOD= 1
##$DIGTYP= 9
##$DL= (0..7)
0 120 120 120 120 120 120 120 
##$DP= (0..7)
150 150 150 150 150 150 150 150 
##$DP07= 0
##$DPNAME0= <>
##$DPNAME1= <>
##$DPNAME2= <>
##$DPNAME3= <>
##$DPNAME4= <>
##$DPNAME5= <>
##$DPNAME6= <>
##$DPNAME7= <>
##$DPOAL= (0..7)
0.5 0.5 0.5 0.5 0.5 0.5 0.5 0.5 
##$DPOFFS= (0..7)
0 0 0 0 0 0 0 0 
##$DQDMODE= 0
##$DR= 18
##$DS= 0
##$DSLIST= <SSSSSSSSSSSSSSS>
$$ [...]
##$SUBNAM2= <"">
##$SUBNAM3= <"">
##$SUBNAM4= <"">
##$SUBNAM5= <"">
##$SUBNAM6= <"">
##$SUBNAM7= <"">
##$SUBNAM8= <"">
##$SUBNAM9= <"">
##$SW= 18.05172834244
##$SWIBOX= (0..15)
0 0 2 0 0 0 0 0 0 0 0 0 0 0 0 0 
##$SW_h= 3612.71676300578
##$TD= 16384
##$TD0= 1
##$TE= 0
##$TE2= 300
##$TE3= 300
##$TEG= 300
##$TL= (0..7)
0 120 120 120 120 120 120 120 
##$TP= (0..7)
150 150 150 150 150 150 150 150 
##$TP07= 0
##$TPNAME0= <>
##$TPNAME1= <>
##$TPNAME2= <>
##$TPNAME3= <>
##$TPNAME4= <>
##$TPNAME5= <>
##$TPNAME6= <>
##$TPNAME7= <>
##$TPOAL= (0..7)
0.5 0.5 0.5 0.5 0.5 0.5 0.5 0.5 
##$TPOFFS= (0..7)
0 0 0 0 0 0 0 0 
##$TUNHIN= 0
##$TUNHOUT= 0
##$TUNXOUT= 0
##$USERA1= <user>
##$USERA2= <user>
##$USERA3= <user>
##$USERA4= <user>
##$USERA5= <user>
##$V9= 5
##$VALIST= <valist>
##$VCLIST= <CCCCCCCCCCCCCCC>
##$VD= 0
##$VDLIST= <DDDDDDDDDDDDDDD>
##$VPLIST= <PPPPPPPPPPPPPPP>
##$VTLIST= <TTTTTTTTTTTTTTT>
##$WBST= 1024
##$WBSW= 4
##$XGAIN= (0..3)
0 0 0 0 
##$XL= 0
##$YL= 0
##$YMAX_a= 307444
##$YMIN_a= -178343
##$ZGOPTNS= <>
##$ZL1= 120
##$ZL2= 120
##$ZL3= 120
##$ZL4= 120
##$ABSF1= 10
##$ABSF2= 0
##$ABSG= 5
##$ABSL= 3
##$ALPHA= 0
##$AQORDER= 0
##$ASSFAC= 0
##$ASSFACI= 0
##$ASSFACX= 0
##$ASSWID= 0
##$AUNMP= <proc_1d>
##$AZFE= 0.1
##$AZFW= 0.1
##$BCFW= 1
##$BC_mod= 2
##$BYTORDP= 1
##$COROFFS= 0
##$CY= 11.3945322036743
##$DATMOD= 1
##$DC= 2
##$DFILT= <>
##$DTYPP= 0
##$F1P= 2.36226072786647
##$F2P= -0.459571619588291
##$FCOR= 0.5
##$FTSIZE= 0
##$FT_mod= 4
##$GAMMA= 1
##$GB= 0.15
##$INTBC= 1
##$INTSCL= 1
##$ISEN= 128
##$LB= 0.24
##$LEV0= 0
##$LPBIN= 0
##$MAXI= 10000
##$MC2= 0
##$MEAN= 0
##$ME_mod= 0
##$MI= 1.114404
##$NCOEF= 0
##$NC_proc= 0
##$NLEV= 6
##$NOISF1= 3.799351
##$NOISF2= 2.8
##$NSP= 1
##$NTH_PI= 0
##$NZP= 0
##$OFFSET= 15.70392
##$PC= 1
##$PHC0= -19107.11
##$PHC1= 3.60078
##$PH_mod= 1
##$PKNL= yes
##$PPARMOD= 0
##$PSCAL= 0
##$PSIGN= 0
##$REVERSE= no
##$SF= 200.130013532006
##$SI= 16384
##$SIGF1= 3
##$SIGF2= 2
##$SINO= 400
##$SIOLD= 16384
##$SREGLST= <1H.CDCl3>
##$SSB= 0
##$STSI= 0
##$STSR= 0
##$SW_p= 3612.71676300578
##$SYMM= 0
##$S_DEV= 0
##$TDeff= 0
##$TDoff= 0
##$TI= <>
##$TILT= no
##$TM1= 0
##$TM2= 0
##$TOPLEV= 0
##$USERP1= <user>
##$USERP2= <user>
##$USERP3= <user>
##$USERP4= <user>
##$USERP5= <user>
##$WDW= 1
##$XDIM= 8192
##$YMAX_p= 0
##$YMIN_p= 0
$$ End of Bruker specific parameters
$$ ---------------------------------
##NTUPLES= NMR FID
##VAR_NAME=  TIME,          FID/REAL,        FID/IMAG
##SYMBOL=    X,             R,               I
##VAR_TYPE=  INDEPENDENT,   DEPENDENT,       DEPENDENT
##VAR_FORM=  AFFN,          ASDF,            ASDF
##VAR_DIM=   8192,          8192,            8192
##UNITS=     SECONDS,       ARBITRARY UNITS, ARBITRARY UNITS
##FACTOR=    0.0002768,     1,               1
##FIRST=     0,             0,               0
##LAST=      2.2672688,     0,               0
##MIN=       0,             -178343,         0
##MAX=       2.2672688,     307444,          0
$$ Real data points
##PAGE= N=1
##DATA TABLE= (X++(R..R)), XYDATA
0 0 0 0 0 0 0 0 0 0 0 0 0 6 -8 8 -8 8 -16 16 -17 24 -26 32 -40 48 -56 64 -73 84 -97 113 -129 146 -167 188
34 188 -212 239 -267 300 -337 374 -417 463 -515 569 -629 694 -767 845 -932 1027 -1131 1245
52 1245 -1372 1516 -1674 1856 -2059 2295 -2566 2893 -3279 3758 -4361 5154 -6240 7833 -10413
67 -10413 15304 -28012 139448 307444 228935 196237 61128 -32593 -121339 -155872 -178343 -155306
79 -155306 -96573 -38524 -17480 26776 26919 3340 -14872 -28663 -30692 -12827 14794 75406 108476
92 108476 125550 137335 103425 40535 -23956 -96690 -144308 -175736 -166901 -109768 -54945 14522
104 14522 93562 127238 135966 120113 78773 28004 -31503 -59479 -62186 -69790 -37223 6588 20190
117 20190 34987 36296 13204 -20398 -54920 -65055 -71046 -66268 -19884 19036 45565 80629 86482
130 86482 69629 40576 -1158 -30968 -61817 -74930 -52767 -33944 -4581 34338 51240 57781
142 57781 45858 19697 -3375 -39244 -59064 -54486 -52558 -30395 2616 25489 46257 49745 46916
155 46916 36541 5669 -8875 -16895 -33721 -26715 -13121 -5496 6275 9277 11985 2466 -16615
168 -16615 -17905 -26266 -33022 -13903 2053 19596 43361 54473 61494 51662 30399 14042 -17405
181 -17405 -41665 -48557 -58415 -50931 -35390 -21327 1469 11362 19133 28781 20547 18285 18136 10873
195 10873 13834 13340 13488 17101 6485 2605 -2602 -21156 -25222 -27992 -32634 -23623 -15068 -774 12787
210 12787 17776 30481 30645 21564 21435 9851 -2091 -5631 -14822 -15863 -16804 -18799 -11318 -12191 -10000
225 -10000 -1182 -3476 1432 7219 5601 12303 11755 10158 14216 7281 5387 4998 -3482 -3193 -6832 -10369
241 -10369 -6143 -10645 -8234 -2730 -7093 -1535 1724 -773 4637 3713 4406 6817 1141 4270 2213
256 2213 -4375 -442 -4475 -7530 -2330 -5065 -1969 1575 116 5421 3740 2710 6676 588 914
271 914 2995 -2701 462 -20 -2664 1360 -1796 -1615 518 -4226 -1159 -2102 -5106 -88 -3117 -2566
287 -2566 1967 -1757 1632 3229 521 4594 2657 2059 4336 -1032 350 11 -5065 -1253 -2606 -3701
303 -3701 2475 999 3436 5791 2119 3848 -31 -4672 -2944 -7921 -7048 -2396 -4166 2228 4970
318 4970 3535 6856 2435 -1274 -2318 -8917 -7403 -5867 -5211 4190 6669 10085 15590 10078 7293
333 7293 2158 -7747 -9828 -13623 -13225 -5643 -2507 6206 13405 11918 13487 7434 -2683 -6660 -15325
348 -15325 -17073 -12273 -9354 2186 10124 14024 19946 13973 7071 348 -12784 -16506 -17269 -15792 -4103
363 -4103 5115 14751 24038 21697 19305 10266 -5315 -13028 -22046 -24970 -17409 -10559 2143 14681
377 14681 17804 21904 15422 3790 -4481 -17106 -21377 -18722 -14381 -40 11749 19207 27809 22555
391 22555 13581 2606 -14820 -24785 -30365 -29746 -17222 -5424 10920 27273 30321 31995 25540 9269
405 9269 -3908 -17648 -26260 -25075 -22068 -9741 3279 8735 15821 12721 2586 -5761 -18067 -23330
419 -23330 -21379 -15922 1647 17109 29136 41790 39942 30259 15376 -7546 -25202 -40630 -48249
432 -48249 -40432 -30731 -14437 7559 19731 28763 31122 23698 14955 1150 -6589 -7289 -10105 -2321
446 -2321 7900 9962 13568 9689 -1192 -13370 -28741 -35899 -37383 -34420 -15904 3784 21521
459 21521 41944 51006 50872 42009 22624 4872 -15597 -33051 -35882 -36351 -29511 -14665 -3534 7364
473 7364 11665 10002 8785 78 -5884 -3410 -3551 3703 14459 21747 27136 24525 16770 6532 -12947
488 -12947 -25257 -31886 -38272 -30850 -17361 -3236 13635 24495 32290 31216 20299 12959 716
501 716 -12140 -14514 -14825 -11665 -4118 1665 8759 9160 4653 3811 -4466 -12045 -11859 -12893 -9992 -3959
517 -3959 1798 9573 10039 10152 11288 3091 -2227 -3667 -7242 -6054 -3589 1975 8136 8086 11203 11366
533 11366 2003 -2902 -7967 -16028 -19010 -19194 -14423 -8968 -4418 7001 13282 13123 18296 17332 11730
548 11730 8249 3018 -321 -5563 -9814 -8381 -12063 -15353 -11706 -12914 -12533 -7944 -3749 3762 7764
563 7764 14610 22742 20879 20452 20246 11388 3227 -3485 -10791 -15955 -22531 -21450 -19905 -21846 -15671 -8195
579 -8195 -5110 3687 11643 18929 23269 24476 27242 22288 12188 7929 -1587 -13068 -16929 -20099 -21149
594 -21149 -19997 -16003 -8221 -5305 -1128 7673 8524 10020 14205 14318 14452 11861 10893 9462 1606 -2114
610 -2114 -4410 -12813 -16229 -16463 -17358 -14543 -10813 -2323 5080 7793 16011 19132 14713 13613 9595 2581
626 2581 -2554 -6460 -6638 -8272 -8965 -2620 -1952 -2829 394 -1522 -4111 -4624 -4812 -2296 -2129 1402 8133
643 8133 7864 8672 10603 5541 1078 -3194 -6812 -8046 -10088 -6359 -564 195 4819 8263 5482 3623
659 3623 260 -3232 -5828 -8573 -5519 -2281 -1718 4111 7080 6197 6521 3723 1403 -2377 -6219 -4331
675 -4331 -5852 -6113 -621 469 1171 3507 2920 2710 106 -1334 471 -2603 -1499 2360 1624 3514
691 3514 5191 3686 3074 -146 -1806 -3279 -6958 -6049 -4173 -4802 -1188 1204 2281 4456 3286 4010
707 4010 2797 -921 -8 -1141 -2716 -944 -1112 -24 987 288 2069 1333 -320 1954 -178 -971
723 -971 567 -1002 -410 -724 -1110 192 -1334 -912 912 -1076 -283 835 -650 56 -652 -720 806 -570
741 -570 1154 2412 986 2232 1387 -552 -680 -2896 -3277 -2682 -3412 -684 1198 2055 5348 4871 4707
758 4707 4183 364 -865 -3559 -5929 -4465 -5090 -3469 -67 713 2616 3524 1891 1853 -929 -2080 -1130
775 -1130 -2699 -527 2264 2872 5202 5139 3730 2711 -1603 -3802 -5002 -7056 -4756 -2615 -709 3912
791 3912 5232 6073 6375 2632 809 -2460 -5826 -5169 -5576 -3592 482 1209 4719 5159 3297 2946 -511
808 -511 -3485 -3845 -5488 -3268 -576 1050 5155 6106 5764 5427 1269 -1448 -3719 -7111 -6144 -5110 -3720
825 -3720 897 2408 4402 5529 3520 2063 -706 -4465 -3863 -4971 -3743 -282 539 3696 4975 3752
841 3752 3583 779 -2298 -3033 -5579 -4166 -2422 -1266 2587 3988 4416 5831 2909 1341 -800 -4169
857 -4169 -4301 -4785 -4264 -973 -302 1489 3623 1875 1888 450 -1810 -1941 -2704 -2372 -373 -275 2684 3090
875 3090 2637 3889 1838 -108 -276 -2387 -1984 -1407 -1853 696 1061 1136 2370 697 433 -322 -1963 -1225
893 -1225 -1767 -1560 610 -113 1316 2594 1379 1671 839 -220 183 -1013 -800 -90 -1232 -328 88 -1162
911 -1162 156 -202 -117 1192 897 2793 3470 2370 3425 2244 -130 -635 -2833 -3529 -3755 -4699 -2680
928 -2680 -2434 -1846 417 351 715 1795 1089 2211 2785 3611 5021 4175 3988 3781 74 -2039 -4603 -7806
946 -7806 -8196 -8643 -7130 -3409 -1828 2538 6320 6417 7816 6794 4796 2863 158 -674 -2009 -3489
962 -3489 -1950 -2462 -3664 -2620 -4077 -5070 -4905 -4882 -2256 -683 2244 7248 8231 9507 10638 7694 4381
979 4381 767 -3572 -6649 -9959 -9823 -7691 -6907 -3537 411 1660 3931 4139 3518 3221 1159 1966 2306
996 2306 1123 3369 3815 2934 2523 272 -1875 -5332 -7837 -7218 -7372 -6245 -854 2351 4806 8149
1012 8149 8250 7309 4280 923 -892 -4684 -5128 -3395 -3068 -770 1319 2290 2694 929 -447 -1076 -4264
1029 -4264 -3919 -2686 -2455 169 2476 3891 4905 4055 3726 1583 -1864 -1928 -2692 -3575 -1809 -285 1538
1046 1538 2923 2385 3167 956 -2208 -2224 -5111 -5857 -4057 -2827 -85 2498 4140 6603 5201 3950
1062 3950 3173 -920 -2696 -3407 -4713 -3914 -2723 -920 1513 838 2149 2018 -696 -619 -1221 -1117 -312
1079 -312 925 3053 4195 3136 3729 2236 -1598 -2782 -4578 -6219 -5688 -4730 -2295 -498 993 3991
1095 3991 3921 3229 4283 2635 1634 831 -6 663 -690 -844 832 -1251 -1201 -656 -1934 -2061 -1906 -1944
1113 -1944 -929 -1321 856 2393 1728 3311 3234 2008 1145 65 -1015 -2056 -3255 -1584 -1676 -2182 497
1130 497 907 883 1354 1208 1246 185 -707 428 -663 -710 1171 368 268 667 373 189 -1026 -583 42
1149 42 -1361 -866 654 -429 138 370 -124 -120 -449 -76 164 -1077 234 821 -302 595 688 288 265 -99
1169 -99 1046 308 -491 814 -31 -918 -157 -811 -530 -498 -215 742 3 -154 1141 -528 -909 -668 -1359
1188 -1359 -1108 -850 -330 860 85 1077 1583 306 1031 907 215 521 -378 -176 148 -625 572 260 -527
1207 -527 118 -258 -624 -11 -472 -125 30 -187 799 256 -180 630 -416 -598 -441 -1191 -549 -1321 -1028 241
1227 241 -276 644 1356 1082 1069 1121 695 982 20 -180 338 -894 -336 -134 -1340 -747 -1528 -1300 -709 -1194
1247 -1194 156 432 506 1498 1324 1034 1607 548 -23 40 -1002 -807 -989 -1243 -214 -854 -775 42 -383
1266 -383 595 477 598 1747 946 875 1514 364 874 59 -901 -926 -1734 -1532 -1403 -1780 -583 60 -363 701
1286 701 832 886 1177 -34 472 191 -546 813 292 178 751 -31 254 -159 -774 -462 -706 -775 238 261
1306 261 608 1474 873 1119 556 -529 -339 -1223 -1321 -946 -1554 -320 190 398 1097 977 386 694 -455
1325 -455 -316 -68 -844 230 541 1061 1673 902 1088 500 -708 -755 -1320 -1919 -882 -926 -72 674 653 1592
1345 1592 1217 445 342 -882 -1021 -778 -974 -228 366 650 1493 995 677 703 -701 -724 -820 -1424 -548 39
1365 39 417 1602 1280 1487 1196 -533 -100 -1293 -1816 -1249 -1656 -475 326 463 1153 841 160 376 -527
1384 -527 -1198 -958 -1289 -283 269 961 1769 1209 1478 1105 -188 -575 -1136 -1514 -817 -994 -13 923 391
1403 391 944 612 -224 -53 -758 -1237 -877 -979 -142 573 347 1346 1449 384 411 -603 -1131 -1226 -1594 -857
1423 -857 -253 242 1600 1012 1486 1496 380 276 -281 -690 -453 -841 -447 347 39 220 516 -455 -273 -1196
1443 -1196 -1295 -1081 -1250 -62 318 545 1556 1593 1091 1373 305 -36 -565 -1122 -523 -567 -915 501 300
1462 300 161 530 -3 299 -279 -448 -140 -311 -165 676 198 622 587 6 146 -810 -939 -776 -1536 -1045
1482 -1045 -69 -234 200 1050 1105 1198 494 700 1 -797 -228 29 -813 -13 354 312 172 -194 323 -629 -1330
1503 -1330 -492 -641 -784 215 160 269 559 306 822 -313 -503 203 -660 -502 260 190 349 362 341 684 -279
1524 -279 -109 285 -548 -215 296 141 182 7 255 394 -551 192 198 -355 81 -251 -659 -347 -575 61 -62
1545 -62 -346 613 -81 -328 479 -26 -93 396 278 856 -13 343 960 363 339 75 -492 -693 -900 -492 -377
1566 -377 -852 62 302 -350 248 160 -270 -233 -245 -109 336 -49 314 421 -153 383 1 -462 18 9 -86 -45
1588 -45 231 853 278 98 838 194 -162 138 -49 227 -287 3 405 -778 -386 -341 -422 -112 119 132 38
1609 38 -116 39 156 -372 110 369 -236 521 430 207 506 -245 348 -326 -465 -153 -409 -349 46 -153 229
1630 229 -265 10 67 -617 -417 38 -94 -4 480 257 78 -229 74 363 -263 -52 482 -179 170 288 458
1651 458 274 -10 144 -5 -154 419 223 -456 110 -162 -187 -8 -144 147 -64 -243 457 -242 -93 167
1671 167 -263 -543 -394 -420 -46 23 -114 514 -162 208 359 -104 -95 -11 156 294 -64 53 617 -308 20 1
1693 1 -432 -309 -450 -191 -77 -491 128 176 -138 192 147 -178 -69 -136 50 94 -439 139 -114 -291 333 -40
1715 -40 17 351 113 623 104 181 307 151 137 90 -454 -135 -207 -404 -318 -403 -389 -134 -482 -104 95 -325 321
1738 321 259 200 366 351 197 84 -109 45 -88 -517 62 -224 24 246 -304 168 -232 -331 642 258 228 168
1760 168 -388 146 -5 -137 -112 -308 -572 194 -218 -123 185 -168 159 158 171 289 27 241 501 149 376 164
1782 164 43 153 -261 141 343 -45 182 48 -313 38 -117 -207 150 97 180 -91 -192 -135 -395 -61 114
1803 114 -408 -181 -30 -147 119 -206 41 245 -72 137 286 -73 327 151 136 106 -258 -293 145 -303 -206
1824 -206 -276 -449 -75 -491 42 103 -103 219 154 -124 460 -154 152 347 -180 15 -348 -362 232 -171 -294
1845 -294 180 -405 92 162 282 397 419 217 439 180 136 124 -357 -274 -381 -531 -258 -517 -240 240 -420 94
1867 94 256 149 607 103 492 534 140 355 400 32 34 -444 -407 -213 -654 -302 -165 -217 169 155 273 585 256
1890 256 371 451 225 145 -73 -379 -230 -501 -27 -215 -305 -316 241 189 234 141 383 317 361 529 677 262 646
1913 646 168 -314 -222 -449 -452 -449 -878 -112 -160 -247 500 119 191 465 139 94 -69 -198 250 -197 -289 181 160 40
1937 40 -41 6 130 -272 -168 22 -127 213 232 43 141 15 168 89 -193 -84 -4 -532 126 118 171 322 130
1960 130 -13 141 -85 195 -445 4 71 -347 -150 229 -93 165 352 124 387 -7 227 422 -3 92 -116
1981 -116 -164 122 -121 -163 -66 -612 -40 -309 -614 -144 -20 235 470 -6 344 299 -77 325 -149 -372 -298 -351
2003 -351 -157 -123 -279 273 -86 -66 789 104 97 263 285 320 207 119 5 -112 -256 -87 -612 -568 -215 -360 -299
2026 -299 -453 -6 -90 97 258 -105 -282 283 218 267 211 -33 57 -135 -348 151 -420 -286 160 36 -186 -45
2048 -45 -200 27 -307 3 141 -63 -42 214 -291 68 157 -138 -93 -59 322 87 -104 135 0 -477 -300 92
2070 92 67 47 54 238 88 -140 466 85 -70 -152 -257 -124 -463 -232 168 -469 -126 70 -144 -245 139 105
2092 105 -159 121 470 304 -114 111 339 -452 -86 -228 -387 -280 -117 96 -70 -401 229 595 146 514
2112 514 474 252 138 2 -201 -272 -709 -440 -591 -731 -353 -166 -352 -192 -95 419 139 827 687 60 392
2133 392 750 35 -403 -511 -652 -687 -795 -446 -341 -392 188 396 203 622 575 585 496 124 414 -41 -186 -132
2155 -132 -469 -793 -748 -742 -452 -290 -207 78 -99 540 773 1019 691 830 364 320 179 -353 -11 -821 -944 -299
2177 -299 -470 -359 -456 -85 220 303 221 293 359 521 241 -71 126 -92 -184 -282 -176 -309 -404 -595 -89 -72 -284
2200 -284 209 92 468 373 442 493 309 109 -86 4 -328 -234 -134 -254 -190 -305 109 -252 337 142 -145 34
2222 34 40 -149 198 169 -41 163 -268 -49 79 -69 171 46 9 349 237 342 146 -263 118 -89 -602 -222
2244 -222 -395 -292 -133 -772 -117 125 276 212 372 211 274 152 111 204 -274 -89 -461 -394 -1 -316 -310 -280 -308
2267 -308 11 3 19 603 193 445 475 121 517 -115 -63 167 -255 -388 -375 -633 -401 -234 -596 102 239 163
2289 163 159 146 640 173 175 49 -28 -135 262 -254 -278 -144 -497 -200 -494 -213 227 -288 97 213 351 168
2311 168 127 158 181 99 -131 -143 -558 -289 -431 -10 57 -477 -84 66 -164 362 315 -130 217 110 553 368
2333 368 29 66 203 -429 -233 -295 -547 -178 -607 -234 13 -134 186 124 219 168 28 -2 152 185 136 34 -26
2356 -26 69 -243 -36 -210 -60 -37 -81 26 -20 250 413 592 169 616 377 29 93 -225 -219 -601 -493 -488 -222
2379 -222 -510 -208 -19 147 188 405 214 374 78 305 -28 166 110 44 98 -71 -550 -223 -287 -798 53 8
2401 8 230 277 396 543 529 166 693 161 -50 13 -506 -364 -319 -338 -179 -231 -183 -286 -63 346 202 194 163 199
2425 199 142 366 332 199 183 -17 -9 -213 -278 -278 -395 -446 -185 -151 -55 256 114 145 248 210 97 9 99 136 -337
2450 -337 27 132 48 34 -70 73 -18 36 -77 -173 -237 37 75 103 484 363 292 232 -171 -116 -306 -183 -38 -245
2474 -245 -336 -74 -373 -25 -308 -36 -163 15 -12 103 -157 150 65 122 419 83 273 -226 67 221 -545
2495 -545 -256 -114 -454 -80 108 121 338 196 327 195 -254 -33 166 -56 72 -221 -127 -235 -549 -412 155
2516 155 -194 -69 -13 -215 383 389 326 515 100 521 -168 -101 -367 -369 -504 -227 -192 -364 138 61 138 237 258 468
2540 468 473 132 551 -217 -305 -321 -221 -285 -122 -47 -320 -287 -255 -432 11 300 70 365 322 798 417 591 167
2563 167 165 -150 -800 -506 -431 -279 -406 -405 293 88 52 410 392 419 291 163 396 164 -127 -82 -408 -180 -193
2586 -193 -353 -291 -266 35 -10 -78 13 497 382 346 351 -180 -57 -306 -309 -395 -553 -287 51 -208 349 125 -58 112
2610 112 210 167 -213 -264 -208 -570 -458 -105 -151 -76 171 259 39 14 -73 489 282 136 475 339 264 92 -376
2633 -376 -468 -657 -677 -802 -1024 -289 -99 -18 328 718 1048 831 521 830 144 300 -76 6 -378 -248 -557
2654 -557 -426 -512 -612 -351 -374 109 245 139 675 886 1199 1056 892 404 -77 -420 -748 -803 -1156 -1061 -967 -931
2676 -931 -221 341 531 705 979 907 1054 360 637 464 183 168 -140 -54 -310 -711 -609 -950 -933 -619 -692 -831
2698 -831 325 535 691 1061 745 838 315 50 -41 -671 -436 -667 -853 -535 -486 -351 166 2 219 443 3
2719 3 350 -311 107 95 9 492 618 181 31 69 -262 -345 -666 -376 -186 90 -29 -13 166 391 491 238
2741 238 80 -299 -144 -433 -234 -53 -29 366 386 450 448 452 -87 -311 -564 -434 -102 -208 84 -16 175 -46
2763 -46 27 -102 -150 84 -196 34 35 -54 216 11 164 192 298 -37 -168 -424 -499 -407 82 -167 357 446 469 307
2787 307 251 -40 82 -154 -153 -39 -394 -209 -280 -12 288 265 133 -111 -169 -35 -110 -169 -285 211 351 425 545
2810 545 417 118 -284 -14 -441 -484 -332 -224 -127 287 21 204 445 247 -7 77 -102 -184 -330 -150 -29
2831 -29 88 125 -119 155 -9 -219 -273 -28 -61 -302 -30 -41 239 172 344 257 -149 155 20 -116 -208 -220 -363
2854 -363 -128 10 61 83 212 107 -203 -95 -11 -32 -68 -235 -94 16 141 153 15 -101 -225 -4 29 -62 -41
2877 -41 -66 -39 130 140 383 435 275 32 -255 17 -231 -47 -295 -60 -234 -45 -104 313 -140 -247 -153 -160 153
2900 153 -30 9 273 313 -39 562 24 118 -59 -212 -272 -292 -301 109 -114 1 -35 223 174 127 -58 293 -249
2923 -249 86 266 50 13 -245 -95 232 -76 -427 160 -230 50 -64 -245 274 17 117 270 174 214 -11
2944 -11 -89 -72 -36 -123 240 -20 33 84 182 -30 -102 116 60 -264 -188 -75 -33 121 -28 136 164 -188 170 146 -159
2969 -159 -282 -411 -4 363 -130 200 193 -49 241 43 32 62 -221 -42 -68 -107 155 184 63 102 -148 -372 -556
2992 -556 -429 -230 -388 -303 234 219 371 453 353 300 105 -233 -618 -358 -490 -371 -317 -127 178 -166 -28 -179
3014 -179 254 151 112 240 196 195 348 377 89 98 11 -660 -745 -989 -773 -611 -425 -162 127 564 980 919 824 656
3038 656 199 191 -249 -311 -352 -655 -502 -229 -432 -190 -553 -419 -301 -244 134 503 693 1026 1328 911 751 280
3060 280 -219 -779 -905 -1162 -1366 -896 -776 -515 -203 387 572 980 1017 472 552 -50 17 -40 -117 49 -37 -94
3082 -94 -423 -620 -862 -641 -658 -583 -518 -354 539 1117 820 1044 1072 709 108 -266 -291 -764 -615 -448 -433 -502 91
3105 91 378 606 462 313 25 -14 -153 38 34 -22 437 418 370 415 117 -239 -579 -500 -442 -354 -30 307 140 121
3129 121 462 133 -105 -101 -229 -675 -357 -18 198 344 615 641 683 672 265 76 -246 -420 -679 -616 -663 -934
3151 -934 -101 -4 -172 396 467 81 232 620 240 139 541 466 596 56 124 -251 -774 -756 -884 -976 -929 -629
3173 -629 -215 368 405 1052 1050 935 1120 589 328 12 -365 -414 -577 -746 -480 -693 -604 -486 -496 -128 -145 265
3195 265 606 927 867 991 653 835 314 -55 -423 -549 -541 -651 -887 -782 -700 -394 -195 -138 57 629 595 546
3217 546 650 633 324 350 -118 -32 -206 -27 -378 -445 -408 -213 -418 -121 -114 217 360 2 319 92 370 367 195
3240 195 94 -63 -95 -170 -243 -390 -112 -467 -203 -242 -156 -170 163 38 399 181 172 -1 -113 95 -72 -24 -3
3263 -3 7 8 434 183 -167 -18 -118 -220 -266 -174 0 -124 140 310 442 161 48 -293 64 -7 -263 -176 -160
3286 -160 -153 91 235 162 56 -104 130 -80 -140 -132 6 82 134 -36 407 286 77 361 -127 -175 -118 -455 -118
3309 -118 -218 -74 21 43 122 -29 86 195 -218 -380 -135 -254 -65 33 175 -156 205 228 142 -83 12 225
3331 225 -245 82 131 106 307 205 121 146 3 12 -29 -98 169 -366 -142 -252 -127 65 -27 177 79 -25 -15 124
3355 124 -33 140 -45 -65 199 2 -72 303 -64 -151 8 -29 -74 89 73 272 78 -103 173 -157 42 372
3377 372 -146 265 -47 -110 -95 -1 136 17 -333 277 -43 191 235 197 289 -203 56 111 -70 138 168 214 185
3400 185 202 -53 307 93 -6 -453 -92 -126 -101 129 16 146 296 218 174 -133 -127 -319 -350 -107 -249 -250 104 415
3424 415 534 257 384 212 -176 -50 36 -289 -108 -187 64 67 -214 -52 -150 57 -267 -33 1 97 -95 111
3446 111 385 118 475 401 164 -73 -469 -312 -664 -629 -304 227 -164 273 439 301 453 4 -83 -419 15
3467 15 -348 -269 -115 -101 3 -45 -110 -137 -345 -220 -493 -244 -415 169 -57 68 838 533 240 508 13 -284
3489 -284 -154 -262 -410 -336 45 330 243 96 540 190 47 -261 -34 -47 -53 77 114 205 297 186 -71 186 72
3512 72 8 -55 192 -140 35 -47 -69 -97 -169 -109 -287 -200 -219 -280 -357 -373 276 604 411 302 239 228 320 227 -98 -430
3538 -430 -344 -272 -556 -185 -344 -269 -424 -219 305 368 345 350 760 750 624 631 44 -154 -271 -512 -510 -1209 -691 -617
3562 -617 -789 -110 -252 103 87 584 516 687 657 565 646 466 91 136 -523 -879 -867 -999 -856 -646 -610 -149 201
3585 201 717 631 612 989 593 696 345 -157 99 -470 -422 -362 -634 -551 -449 -477 -602 -13 -65 -20 151 359 863
3608 863 514 761 363 283 166 -515 -438 -734 -586 -569 -242 -185 176 182 167 363 125 87 82 -326 -26 -95 55 256
3632 256 169 354 54 -126 -283 -446 -231 -305 -331 -476 217 275 410 176 394 63 -169 -56 -198 -324 -291 523
3654 523 353 402 525 324 144 -137 -271 -558 -614 -633 -492 -50 67 166 300 358 448 221 -169 -147 -127 -102 -81
3677 -81 147 112 116 251 -130 -8 -248 -645 -486 -817 -500 68 211 466 587 773 828 214 -137 -29 -610 -832
3699 -832 -520 -611 -311 -233 -18 5 56 275 16 395 14 -174 47 461 215 567 610 388 350 -170 -314 -576
3721 -576 -752 -373 -485 -3 -104 263 449 452 353 332 108 -169 -276 -181 -185 63 56 -8 360 93 172 -244 -316 -174
3745 -174 -243 -129 40 73 318 389 178 351 101 -220 34 80 -135 -235 -327 210 89 -195 203 145 30 29 -38
3768 -38 20 -365 -180 249 300 113 242 289 235 236 199 336 -157 -276 -169 -111 -198 112 138 4 242 66 -18 -378
3792 -378 -109 -51 83 -141 -136 -83 216 -90 81 112 -48 104 -205 74 105 -14 -207 -220 -101 -24 -9 218 443
3815 443 118 126 -139 24 31 110 -109 -76 202 -169 152 -171 168 -174 45 -252 105 -149 -231 20 244 -42
3837 -42 -97 157 -248 -19 -56 39 31 76 72 -186 243 -46 309 208 -102 205 -224 -79 -23 -305 -89 -64 -71 106
3861 106 -7 67 -150 1 -16 80 -72 -165 -232 -249 89 -59 231 120 -130 -192 -31 -159 216 -114 48 240
3883 240 30 230 192 146 206 -47 -18 -64 3 92 -39 -107 191 65 -111 16 -124 94 -222 -36 -42 -69 -153 236
3907 236 37 218 203 -295 -44 -303 -115 -261 97 310 4 131 253 413 -76 105 147 -287 -107 -271 -165
3928 -165 -155 72 288 -66 -6 -239 -148 -263 -162 271 66 104 288 471 -15 482 -69 -350 -311 -572 -90 -290
3950 -290 -398 -253 8 4 108 -105 -99 16 -117 -20 25 -4 144 543 183 304 5 -125 -278 -564 -162 -457
3972 -457 -403 12 55 524 426 696 372 475 -7 -200 -120 -213 -270 -311 -128 65 163 79 9 20 -62 -412 -302 -61
3996 -61 -76 160 566 427 334 29 -2 57 -451 -441 -348 -322 -374 -149 109 275 359 368 -248 -201 -44 -197 -168 -281 -27
4021 -27 117 200 28 444 216 127 -137 -492 -645 -555 -368 -205 -87 85 249 268 -31 249 -193 -471 190 -243
4043 -243 2 66 479 681 428 385 165 -297 -352 -439 -816 -440 -347 -86 -35 312 630 286 465 276 238 -14
4065 -14 8 -98 -27 -52 58 156 -161 -115 11 -310 -752 -420 -315 -135 -25 419 526 321 763 523 179 -184
4087 -184 -418 -393 -397 -297 -389 -230 -141 -130 -89 198 -76 190 -7 38 -108 133 355 309 421 505 134 -60 -57 -512
4111 -512 -560 -626 -427 -502 -448 190 110 291 298 103 472 340 128 -139 -130 -279 82 -198 202 -74 -24 -146 -219 -58
4135 -58 -315 -35 31 -158 339 394 -4 147 94 -2 -221 124 89 -177 -284 -307 59 19 5 -123 -42 37 148 -117
4159 -117 -223 17 101 88 313 149 206 35 191 100 6 273 -34 -212 -110 -129 72 -68 5 -50 -135 326 -160
4182 -160 -94 -29 -3 54 162 41 229 -6 99 170 -212 307 153 -129 -204 -200 -100 209 292 29 154 464 45
4205 45 202 315 -3 68 282 -209 -281 -126 -152 -315 1 5 66 -24 -18 -25 223 -214 262 -192 21 93 192 99 219
4230 219 -3 45 -117 -203 264 -200 -167 155 316 107 126 -240 35 -122 -43 -199 -242 -68 201 -131 -20 52
4252 52 12 -97 94 171 -219 -138 95 -53 -394 71 217 7 -72 -120 57 -18 18 103 72 -92 293 -13 -191
4275 -191 -318 38 -58 -135 -37 41 -135 -189 100 -139 53 57 208 -49 -50 -111 160 -127 135 36 0 551 -26 39
4299 39 46 41 -101 -164 -185 -100 -92 -222 25 117 71 169 17 -46 86 -157 -137 -212 18 -7 -259 418 121 55 113 -82
4325 -82 -114 72 -64 267 160 96 225 146 -61 -41 -19 -103 -15 -205 210 243 -54 190 -183 120 -100 -90 -246
4348 -246 -439 -20 -351 -122 -185 -286 68 153 260 114 120 -237 -102 -87 -505 -116 20 162 179 127 -30 163
4370 163 -66 -185 -126 -297 -44 -63 -55 100 42 237 200 -166 65 -171 -106 7 22 284 -11 82 135 115 171 -17
4394 -17 219 -240 -122 -17 -204 -248 -123 -28 27 107 -158 -168 -185 -132 -147 -170 65 40 29 127 437 140 187 -1 -23
4419 -23 -180 -37 -505 -215 -31 92 120 434 -212 135 172 38 -118 -146 39 -116 -169 21 9 227 -54 -146
4441 -146 96 -226 -143 -77 -309 133 2 268 119 85 201 221 48 114 165 -223 110 112 110 -89 -145 95 23 87
4465 87 -166 79 -206 22 -225 96 42 283 40 41 38 40 5 -209 -141 -134 -95 194 -131 103 -76 93 -191 184
4489 184 -122 -97 0 -184 128 -19 -19 333 110 146 -45 41 -108 -142 -428 -61 -28 -11 -155 152 -111 -134 -99 -225
4513 -225 -203 -69 59 -17 62 88 235 86 100 -2 31 -378 -22 -110 -170 -185 297 -104 172 140 184 101 228 -91
4537 -91 -141 110 396 -32 -118 49 196 -80 105 20 -172 -156 -348 -67 68 -118 72 362 185 182 191 89 93 10
4561 10 -196 45 86 119 10 97 -108 -300 -69 -76 -184 145 6 206 406 12 -15 277 148 37 -213 78
4583 78 -223 -127 -89 -179 63 -21 -5 -107 26 51 -49 -152 44 -48 191 -124 124 0 11 39 52 -72 -202 -92
4607 -92 -167 28 46 -108 203 17 8 237 138 -146 170 -73 50 25 -80 154 -96 281 -115 59 129 165 57
4630 57 -182 -157 -45 -285 36 34 -114 94 -29 -44 -72 113 136 0 10 88 160 -70 165 168 27 -182 178 22
4654 22 -144 204 -144 92 -1 25 127 -66 -38 231 47 -8 20 180 113 -19 -151 -383 -115 -184 200 81 191
4677 191 119 -160 -4 14 -67 -202 71 -373 236 269 -70 74 -135 111 -134 346 -150 32 64 -5 105 -5
4699 -5 105 -62 -272 37 -87 12 -64 -72 149 120 -96 -17 79 73 17 -116 102 -88 -187 -120 -18 -91 -130 -107 57 61
4725 61 226 114 -50 118 96 -236 -55 34 -129 53 -125 -6 -121 179 -19 -34 49 142 9 -68 165 30
4747 30 -192 72 -23 -249 37 -230 100 113 -235 293 91 323 -154 -143 -8 -143 -58 277 -264 -105 190 15
4769 15 -8 14 161 83 3 26 52 -135 -167 -85 135 71 -45 -174 -188 -140 -26 77 -177 -18 -119 -49 20 -120 195
4794 195 -146 -66 -231 -8 -225 -162 20 -365 -136 -72 -91 -156 187 48 112 366 22 -106 0 -41 22 9 -175
4817 -175 -252 -32 -96 38 24 -43 -45 118 74 225 -14 -93 31 -22 279 -56 146 117 -140 -125 56 -31 24 -85
4841 -85 33 238 -264 8 -47 -39 37 19 -138 -221 322 98 59 -131 8 60 8 -194 -147 -50 112 -100 -56 -106 -97
4866 -97 77 -94 31 -126 -38 64 230 116 238 441 -9 144 84 -192 103 -274 105 -318 -139 77 380
4887 380 231 29 296 -80 185 -289 128 -274 -118 119 -4 -186 -165 265 41 -70 -32 11 12 23 -87 -140
4909 -140 70 187 242 143 -191 -126 -389 66 -147 11 230 120 44 -89 163 75 -58 -185 -24 -199 -256 117
4931 117 22 -18 242 159 48 -59 32 -154 47 -87 -90 -247 -17 120 36 -55 175 -101 -231 -104 -137 -71 -353
4954 -353 -91 74 -12 96 213 20 -10 86 -1 -55 -371 225 154 292 79 6 -129 16 229 194 105 -150 52
4977 52 -209 228 120 223 280 85 -41 127 258 -136 -99 -157 -184 -189 -216 94 108 161 171 -230 -101 168 42 149
5001 149 -8 15 82 -90 178 105 -146 56 -81 -298 -227 -14 92 186 97 -12 17 70 44 119 167 0 116 -146
5025 -146 -153 163 -253 -106 -194 131 258 -201 -207 167 -178 -19 -171 -83 12 147 4 -193 230 132 -43 -393 -150
5048 -150 -118 97 -44 -241 -112 -15 235 322 -153 89 63 3 58 -241 -370 137 -196 59 -46 -57 132 105 29
5071 29 -103 -203 185 63 92 136 -96 88 -11 121 -196 -16 165 93 -355 -238 -222 -100 -146 95 99 132 -51
5094 -51 -77 241 -150 136 16 43 -83 -260 292 74 2 152 188 -59 14 -119 -33 -317 -113 -22 12 221 317
5117 317 -25 200 -94 227 -188 -343 -124 -194 348 113 -52 146 131 277 171 -70 39 72 -35 -58 -133 16
5139 16 128 -49 -212 91 -106 -310 -140 69 -64 29 51 27 -189 115 -189 170 99 -175 -15 -112 14 -138
5161 -138 -164 69 36 -111 262 125 63 -138 58 -310 -130 -9 -24 38 -119 -118 -140 -25 81 5 -56 -34 -120 3
5185 3 -58 -54 155 -119 -91 130 -76 -78 2 -112 66 -66 -436 -139 62 73 74 113 -101 -119 9 -166 -68 295 136
5210 136 -136 -117 196 79 81 73 100 -48 28 -137 -36 195 124 58 -142 20 240 -80 62 -32 -39 -296 -220 -87
5234 -87 18 -313 -6 -52 62 -19 -276 200 -162 -112 276 -61 -172 178 -151 -264 -135 -118 -164 -74 468 11
5256 11 101 122 68 -38 -203 -19 -156 -130 -9 -137 -127 52 92 -70 -90 40 133 -123 290 11 -61 83 92 -13
5280 -13 166 -187 138 -147 -81 -61 -103 62 -85 -61 68 90 133 39 -45 -252 -95 -100 -179 54 -179 305 5 -30
5304 -30 -261 -27 36 -45 -46 -225 97 116 54 136 168 161 14 322 -62 -53 -48 -149 -153 119 -95 -108 -51 -73 7 77 111 181
5332 181 -68 -318 -21 180 147 253 11 41 -37 9 -192 -108 155 -228 -340 -5 -46 109 191 -69 80 109 -44
5355 -44 -14 -55 -135 -135 -30 197 108 22 108 -18 65 -138 87 39 76 -46 -156 -28 107 73 193 141 -171 145 -236
5380 -236 11 -282 -248 -156 -70 -8 142 171 201 157 47 -80 -188 -202 75 48 155 198 147 153 128 -39 312 -45 -484
5405 -484 37 14 -81 57 58 184 432 30 202 122 61 -151 -228 19 -144 -148 316 -20 327 284 57 97 193 102
5429 102 -199 -134 -121 168 256 -264 201 186 -17 131 -98 -277 31 55 -160 82 -45 237 238 -121 51 -50
5451 -50 -175 78 235 -164 -120 -49 -140 -4 72 -102 10 -363 -99 -212 -38 228 -197 128 20 196 211 -112
5473 -112 -37 -82 -204 33 -70 34 -234 -6 -263 164 -75 -41 -7 138 -114 -326 61 -125 19 282 73
5494 73 284 -30 172 -127 -172 -78 -136 -38 93 7 23 153 -108 146 -47 -32 89 -68 252 -240 131 21 -177
5517 -177 248 -73 -45 -87 266 178 -22 -136 -206 149 -43 16 2 228 20 139 149 314 26 175 71 -92
5539 -92 77 -11 -201 25 49 -26 131 185 92 -18 -1 71 -30 -177 143 -71 -92 157 10 211 255 -36 -145
5562 -145 -76 270 55 -55 -67 -133 286 24 76 34 115 -109 -38 -115 -110 226 -147 -60 -183 183 -51 110 89 95 -203
5587 -203 -198 23 24 260 421 50 -159 -70 -146 -103 -230 88 12 -130 -30 -54 -81 166 89 68 -220 -121 -208 -9 194
5612 194 174 383 214 -98 102 -149 -45 304 -379 3 84 36 -48 -119 23 62 318 -5 129 127 116 141 -35
5635 -35 -35 -184 40 -311 91 -220 -255 -124 64 -43 46 182 164 290 183 -255 73 -10 -185 -52 -183 -107 -28
5658 -28 -47 247 -128 149 153 142 89 216 77 347 120 -116 144 154 11 -89 -66 -281 -36 -132 -151 -53 -91 -73
5682 -73 91 57 310 -58 17 1 -117 -223 -121 -217 121 -153 -158 66 -238 -82 -56 -88 167 -27 -49 -85 227 144
5706 144 260 -19 -103 -71 41 -99 -37 -86 -111 -91 -355 231 328 210 87 8 48 -153 -36 -111 -78 2 260 -278
5730 -278 -117 107 370 -61 -34 -379 -63 -3 115 -7 -99 -172 133 16 -82 16 -15 -104 -46 94 100 61 68 312 242
5755 242 110 235 -55 185 -141 -216 5 -192 58 237 268 52 60 80 150 54 -71 130 65 63 149 137 77 94 -54
5780 -54 -128 -216 -225 -235 -308 -60 -223 -26 54 471 130 28 -7 33 -83 108 -320 7 -244 -459 -384 -73 153 -18
5804 -18 168 62 -125 250 52 64 123 240 -178 323 -16 -198 -165 49 -215 -293 -8 -89 -140 -36 135 115 146
5827 146 -107 199 189 49 -138 62 -3 -302 -144 -159 -167 -127 187 283 -71 37 33 -35 -160 -143 98 -47 -117 100
5851 100 262 -121 8 -268 -186 -94 -22 -25 -187 -166 24 90 66 184 -178 -109 114 -5 -277 19 -220 -1 30
5874 30 -233 -3 12 -60 -113 215 -75 -319 17 -126 333 19 -57 -19 56 262 18 130 -269 108 -342 84
5896 84 150 -113 110 -64 159 -1 129 -133 -95 64 -5 74 177 17 -46 137 -182 -121 -56 -48 -195 -50 -387
5919 -387 121 -5 -121 32 38 101 34 75 40 130 -287 -210 -214 -9 -151 -47 74 -181 -153 6 198 -22 28 191
5943 191 69 149 94 82 -194 76 11 -47 113 22 -64 -6 -86 101 51 61 120 -144 187 221 28 4 -85 -17 -54 130
5969 130 95 -165 -111 -31 102 8 4 -104 22 -173 -113 355 269 142 91 66 -89 69 127 370 265 -287 -9 82
5993 82 -77 -99 -251 135 -58 284 197 1 28 -34 -8 -161 -98 -107 253 163 -37 138 -227 5 -37 43 -69 145
6017 145 -308 255 107 -13 83 -53 -10 58 -138 14 94 -81 -355 -106 72 -192 -80 87 -79 127 -87
6038 -87 -100 -75 -125 131 -26 -30 186 -18 -85 96 -79 -177 -244 -24 204 -109 25 -59 190 -287 119 -100 -101 66
6062 66 -131 15 -262 -49 -143 -64 -382 39 83 310 -118 52 13 57 181 -87 -105 24 -141 95 -88 33
6084 33 -45 86 143 82 40 -36 -77 24 -8 -15 68 13 28 -43 274 -238 107 -169 -45 -90 -191 99 163 21 25 132
6110 132 80 -12 61 87 27 -32 -32 -188 0 -316 1 256 119 400 138 20 368 -215 53 29 -64 -89 -167 125
6134 125 -51 98 -236 -121 -216 119 -163 -260 -34 125 251 5 304 265 467 -100 -218 -737 -339 -231 -145
6155 -145 20 -47 21 -181 18 325 188 103 140 -23 5 47 -93 -188 16 -167 -118 -55 -228 -231 -61 -260 -102 193
6179 193 -84 180 -1 264 161 63 -44 -186 -79 -31 -112 -321 209 69 79 -31 111 89 25 142 27 39
6201 39 -64 98 -291 -24 204 -108 -5 -255 -25 154 100 -146 -170 347 -300 22 -239 -21 57 126 164 9
6223 9 -294 -205 -92 -197 -132 -223 -18 8 -160 -106 122 138 228 15 -119 -87 62 48 252 -14 -61 56 358 -193
6247 -193 -27 -115 67 183 -129 -125 115 69 -48 99 104 -90 181 -136 14 359 -273 -20 -40 46 388 7 112
6270 112 -1 -30 11 -107 -153 -121 146 49 -37 216 -30 102 23 107 -187 -86 -83 -100 126 -71 -15 -109 125 -94
6294 -94 -118 -263 95 -2 45 4 -190 129 157 124 -174 168 -25 131 70 -145 -76 155 -272 -245 -123 -53 88 -121
6318 -121 257 -22 -79 9 -96 54 31 -146 97 83 -24 -26 105 -163 -36 -72 -54 -265 -3 -96 169 303 59
6341 59 -101 -29 326 348 -91 -45 -84 -248 238 101 -100 26 -34 154 -161 -24 149 123 182 183 81 -41 235
6364 235 -118 -92 -177 30 150 -363 -39 -82 -56 -162 -21 133 -181 -41 -3 138 -197 -213 -112 67 14 53 59
6387 59 -21 -46 116 -92 108 -143 132 -405 -417 120 -238 79 -12 -40 44 185 83 44 -24 -87 8 23 159 105
6411 105 97 -139 177 113 -239 -140 -61 363 11 -49 -155 86 21 85 184 -10 110 91 -44 147 26 128 3
6434 3 -190 -207 23 -160 10 150 -327 215 -187 -24 -20 66 -212 -82 -49 -188 -32 -234 -247 15 38 172 266
6457 266 171 -173 38 -164 -114 138 -61 -129 40 -67 -32 -7 11 -163 -164 -224 113 -85 19 65 385 -37 381
6480 381 195 -243 42 183 -260 119 -36 93 54 -147 62 -177 50 77 -61 -8 -124 -137 -50 -32 406 211
6502 211 14 -9 -125 261 145 55 -115 -252 65 -72 32 105 255 -176 158 206 -187 217 -318 207 8
6523 8 152 245 125 304 -69 95 -75 -152 10 -79 -133 -119 65 266 25 -203 180 91 -92 -69 -101 -299 96
6546 96 -106 -279 80 -116 356 146 162 7 -77 14 78 237 261 -295 341 202 163 -99 65 -173 -313 11
6568 11 -147 42 12 43 -110 4 -26 -107 -10 -222 -256 -242 5 -141 146 77 -51 269 166 -137 115 274 124
6591 124 450 -14 43 255 -32 -189 -320 -82 -50 -310 -171 -113 -180 -19 34 -114 66 110 111 44 -34 -177 137
6614 137 -178 -195 -122 -85 6 -166 98 -52 54 -65 -74 -115 175 174 75 -210 -5 -46 -144 154 99 96 69 9 55 238
6640 238 64 2 -8 11 -154 57 45 -65 22 -208 101 -171 -12 -37 -17 45 85 -209 215 238 281 67 -175 -61
6664 -61 -122 160 -308 40 10 -36 -324 71 -77 141 -64 4 117 105 49 135 151 82 108 -30 -43 -11 83 -118 -148
6689 -148 -100 -35 181 411 80 246 189 31 267 118 -191 -24 191 7 -30 26 -156 -318 -164 -207 -199 -148 54
6712 54 188 316 58 81 120 80 26 55 -24 -227 -60 84 -88 -55 -338 86 71 84 -45 77 200 -194 118
6735 118 121 214 133 -255 245 -34 -14 165 -25 -103 -287 94 -209 78 107 120 -159 260 144 86 39 365 -8
6758 -8 26 -127 7 -217 71 55 -163 -219 70 -304 -29 27 163 -201 36 254 -218 -104 223 93 8 118
6780 118 124 15 -61 -136 -131 108 -106 -46 138 -102 -165 13 -129 -49 -299 195 -54 -222 151 -98 66 -91 -20
6803 -20 19 32 -54 -115 82 -75 -145 118 183 -25 -58 -128 27 -15 -43 18 127 115 30 -31 -163 121 -361 213 -299
6828 -299 91 -64 -230 -156 94 -222 -112 127 56 78 -31 78 79 364 -171 73 -1 -43 -275 128 -8 -349
6850 -349 -128 28 -87 -107 85 -37 -148 13 -174 -168 146 155 -194 97 -65 129 53 -18 208 58 -16 20 16 -151
6874 -151 -65 -152 10 -226 -130 -36 -11 66 -28 -39 45 12 216 62 13 -124 141 -43 -131 59 -69 -7 17 -75 -149
6899 -149 -189 139 -98 -78 170 17 -26 -224 31 -177 -8 -195 39 -186 143 34 276 -36 -9 221 202 -20
6921 -20 -157 -77 51 -140 -178 305 89 -147 322 -27 253 -79 -72 -337 -159 131 -112 -41 -265 97 -10 -135
6943 -135 31 -80 -60 317 -15 224 41 -31 -40 194 -101 153 128 -150 -271 -62 -36 -150 -243 -179 83 26 -325
6966 -325 -64 -11 255 153 -268 -16 -62 -81 -242 189 -176 293 67 -36 -111 99 179 -69 284 79 -76 77
6988 77 338 -138 86 33 102 113 -54 -125 60 -133 -215 91 -100 -193 255 37 66 -108 179 133 -105 243 -32
7011 -32 123 -13 79 -256 -343 148 205 48 -145 -65 -29 -115 26 45 349 200 -119 -199 -311 -113 289 -12 -82
7034 -82 78 39 201 -41 -236 -65 -253 -144 171 54 -24 -50 123 -18 63 38 349 302 17 63 -14 135 -193
7057 -193 215 26 -70 -14 -313 63 -48 48 -47 -19 190 -42 64 -124 101 -191 250 -18 -188 19 -57 84
7079 84 -5 -294 -252 117 40 89 120 -27 -20 -227 -64 157 -53 -134 -173 17 -112 -170 -39 99 0 -48 -166 151
7103 151 151 17 51 -37 168 192 23 -118 -17 -277 85 -104 -46 -11 116 -65 -78 212 -157 -187 -172 -137 -63 -29
7127 -29 77 179 198 -77 51 135 -19 -48 -256 -192 -230 54 -32 -117 -280 23 48 76 107 -139 131 97 -62 -7
7151 -7 107 -67 -13 -91 -112 72 62 49 -120 -63 232 -156 -194 -86 53 -11 -133 229 181 79 13 209 117 66 -13
7176 -13 -23 -118 -244 -13 -155 -43 -79 -149 135 -132 -2 -80 120 -16 -300 -117 151 42 -200 -79 145 -94
7198 -94 57 -41 85 -4 75 -86 47 -30 34 -18 -76 -132 245 6 153 -103 308 101 -247 55 -2 156 167 -211
7222 -211 -130 57 -1 -226 -57 -87 138 185 190 64 -206 -7 116 -19 124 -200 338 -79 -55 -32 -108 152 -58
7245 -58 -89 95 16 37 96 -104 74 107 -73 -73 302 147 -55 -44 115 -212 92 18 -29 63 -216 -174 -21 67 227
7270 227 -19 101 -119 42 204 61 -5 212 -71 -121 59 -58 64 -77 332 -115 -92 -94 52 -34 124 95
7292 95 -188 92 -85 197 -221 157 -7 -29 234 -174 186 -67 -526 65 -77 56 -238 196 -211 -43 -141
7313 -141 -94 -154 381 -103 -293 140 -103 -106 -81 42 206 -143 -418 -99 98 10 -185 61 136 -108 -50 -52 -14 169
7337 169 126 -70 -148 -301 52 -250 -130 -86 -155 -173 70 -9 117 64 42 -93 7 -82 77 -179 72 89 -11
7360 -11 -80 -56 214 90 84 55 79 52 -59 35 -42 20 229 44 12 -231 -138 -26 158 -232 -74 -383 -21 -160
7384 -160 161 -143 -43 90 -73 128 82 105 -3 25 22 68 -98 49 -78 197 -34 -129 19 220 -124 -224
7406 -224 242 21 -82 195 51 -71 -97 134 57 -95 338 23 -80 -161 221 247 158 -154 -283 139 -29 73
7428 73 74 -50 -74 56 -37 263 -20 -144 -182 155 -31 49 -263 -132 99 -55 45 -176 58 88 58 -34 -98 -84
7452 -84 -164 -63 -25 -17 -168 -103 82 -28 181 115 -264 -18 140 -185 -48 -152 125 -343 5 -196 88 79 -45
7475 -45 -38 211 -39 -111 25 89 347 130 10 1 -31 -25 225 -290 129 59 125 99 79 220 164 170 115 385 -167 -34
7501 -34 -92 -180 157 -74 14 -33 -20 73 85 4 -72 -119 127 -94 3 -18 48 -66 -117 116 -153 152 -80 243 -50
7526 -50 76 -78 133 -138 48 -42 -308 -132 -171 -70 109 -142 214 -93 150 184 192 -45 -5 -199 -176 32 -67
7549 -67 36 44 -129 178 -37 -19 -51 126 -10 -48 -82 222 -5 -56 53 39 168 -92 20 -15 -104 39 -10 -52
7573 -52 -361 -27 275 158 -124 211 37 -167 -7 120 52 46 -52 458 -57 79 55 -45 -8 -141 -162 -134 -151
7596 -151 25 255 68 72 -79 51 -146 170 99 -196 258 102 -283 64 84 144 186 130 151 114 173 -71 212
7619 212 187 -75 -177 67 190 52 111 282 68 71 -122 -53 -252 160 -168 47 -167 17 275 189 197 -104 -101
7642 -101 264 208 97 -68 -42 20 107 -141 118 1 173 -229 -30 92 9 256 24 15 -59 -100 33 140 103
7665 103 105 -200 234 -61 -129 119 -116 -270 24 68 -219 3 -133 136 30 189 -135 126 132 -25 31 81 51
7688 51 344 -41 -111 -40 265 268 -89 -31 115 24 -100 -106 -473 -55 -238 -79 -122 -3 -49 74 38 -14 -91 -94 39
7713 39 -16 -277 -13 -127 29 -79 2 -112 54 183 -177 -10 93 -99 -196 -16 -105 -116 190 -155 -42 -68
7735 -68 -71 170 -13 14 -126 6 42 35 -137 -49 68 -41 304 0 -192 -65 189 -109 -201 14 -180 66 -91
7758 -91 -56 120 -36 199 -222 -127 150 -165 98 141 19 62 33 -90 -23 126 -29 -188 -60 57 157 -149
7780 -149 -113 95 107 90 -34 -109 -40 211 -92 32 -125 -154 -159 -118 251 90 -88 -133 -167 -165 121 232 114 -75
7804 -75 -6 204 -305 135 -245 68 87 53 -17 -58 -99 -351 165 195 -1 -94 -156 -151 88 240 173 -250 -67 75
7828 75 -65 127 151 13 39 254 -62 133 -120 -226 -128 196 -153 44 -164 370 127 79 -175 68 -256 161
7850 161 157 110 -84 112 269 -87 250 252 -87 179 -229 -258 -149 36 -160 -158 -245 3 -117 69 58 -219 -130 -87
7874 -87 214 -55 -22 84 208 174 -39 -87 -141 -51 -2 383 -91 118 -4 -65 129 301 -63 25 175 -40 188
7897 188 42 120 90 92 -1 180 84 33 -157 -288 -304 46 -25 143 -156 224 -164 -138 260 -5 -206 -28 -60 72
7921 72 89 65 167 -228 -54 76 -232 62 51 -28 46 40 287 -163 -20 115 -3 281 -118 26 -23 -46 191
7944 191 -9 38 -386 -7 -51 -101 264 -131 -176 201 67 8 132 89 -162 96 63 198 85 88 121 -153 -95 -1
7968 -1 -86 31 -100 144 -281 -42 34 25 -7 -173 364 232 -55 -97 99 -84 -124 -244 139 -97 18 5 -45 140
7992 140 -5 -270 167 79 -61 -247 40 256 -237 -48 212 -204 -16 -42 5 375 213 45 23 229 131 29
8014 29 181 152 2 62 -211 65 27 -34 55 -305 -14 82 24 -159 -178 1 127 -79 148 -20 -62 -131 -24 -95
8038 -95 -66 78 -73 -99 286 -63 -6 71 -105 65 -113 -7 -226 62 56 79 166 -7 118 -130 -152 -107 26 -207
8062 -207 -121 208 201 -189 -254 42 65 159 47 26 -56 -138 -72 -115 -133 -137 -81 -20 -195 -139 39 -217 -91 -233 -256 -383
8088 -383 -64 47 170 -8 -156 -10 158 -124 -1 -301 111 49 131 -78 174 -141 77 132 99 -145 82
8109 82 -248 107 11 254 16 -98 -133 31 -140 32 -242 62 -202 3 11 -58 -35 -88 -22 -86 -30 45 236 21
8133 21 140 -47 -377 -269 -149 -178 67 260 165 -369 -34 85 -138 -109 74 -2 372 -93 -282 -98 273 -83
8155 -83 -288 160 -265 -55 123 -169 -59 -61 -175 -174 -11 -96 -144 -54 193 308 -131 164 148 -169 -35 -117 -56 36
8179 36 91 35 42 -226 -388 47 -43 -73 -18 -8 -144 11
8191A1
$$ Imaginary data points
##PAGE= N=2
##DATA TABLE= (X++(I..I)), XYDATA
0 0 0 0 0 0 0 0 0 0 0 0 0 0 0 0 0 -5 8 -8 8 -8 8 -16 16 -16 24 -24 32 -32 40 -46 53 -61 68 -77 86 -97 109
37 109 -122 138 -154 171 -189 211 -232 257 -285 315 -348 383 -422 464 -511 563 -622 687 -761
56 -761 842 -940 1052 -1183 1343 -1537 1782 -2102 2540 -3178 4202 -6097 10794 -45511 -29740
71 -29740 129170 194280 235192 238396 199706 117398 28672 -36532 -75176 -113796 -90050 -50346
83 -50346 -31705 -4787 6302 -13992 -41671 -80437 -89814 -87434 -72004 -7806 59125 108447 157932
96 157932 167840 143909 86185 4943 -61431 -128584 -173622 -157279 -126562 -78112 -5226 53858
108 53858 93495 100452 85967 65693 12059 -25479 -28805 -43009 -31602 5739 29641 45816
120 45816 47365 39084 13048 -33775 -56381 -69656 -86792 -63711 -27647 3145 42060 65771
132 65771 77416 67636 34268 11451 -22326 -55381 -54213 -47989 -29498 3987 30327 56637 60955
145 60955 46363 34695 -187 -34933 -48181 -59776 -53824 -33798 -8765 23766 35913 43774
157 43774 50291 26661 8014 -776 -18044 -19872 -12936 -457 13559 13828 20204 15372 -11003 -21952
171 -21952 -34291 -50510 -44450 -32691 -11991 14001 32844 56933 63725 54429 49380 26110 164
184 164 -15370 -34792 -40305 -40370 -38793 -22460 -16165 -10268 2503 868 2142 5426 3630 11581 12801
199 12801 16185 27465 21426 18772 17325 769 -9215 -19444 -29422 -30032 -32731 -23203 -10061 -5986
213 -5986 10334 20995 19513 25520 21590 14520 10622 327 -1720 -6163 -13529 -8801 -12319 -14925
227 -14925 -8978 -12605 -9744 -5545 -6403 1773 3839 5267 13191 10438 10696 12079 5233 6026 1813 -3482
243 -3482 22 -5978 -6897 -2774 -7877 -5285 -3643 -4846 282 -647 1950 6860 2239 6154 6754 -572
259 -572 2146 -1204 -5414 -3203 -6683 -3901 -2037 -4091 2836 1747 753 6190 1284 1734 4314 -665
275 -665 2204 1914 -381 3875 217 920 3076 -2088 635 -653 -4582 -260 -3738 -4341 -691 -4316
291 -4316 -1601 425 -1846 3377 1819 2147 5779 929 2008 1768 -4231 -1211 -2741 -4725 627 -454
307 -454 3029 6661 4181 7323 4498 -581 629 -5740 -7012 -3699 -6059 -453 3457 3360 8424 4824
323 4824 1740 209 -8166 -8666 -9709 -11711 -2938 995 5962 14436 13016 13114 9840 45 -3811 -10944
339 -10944 -14349 -9881 -8496 236 9337 11087 16285 14159 5396 711 -10302 -15861 -15860 -16981 -7033
354 -7033 1767 7807 18203 16994 13051 8398 -5307 -13313 -18817 -22651 -14949 -7650 3634 17283
368 17283 21293 24448 20787 7782 -894 -13526 -22020 -20771 -19482 -8771 4751 11464 20300 19635
382 19635 11876 4137 -10377 -19306 -22553 -24041 -13032 -812 9900 24505 27683 24595 17486 515
396 515 -13218 -26505 -34553 -29307 -22898 -9405 10507 20854 29695 31218 22108 12570 -2606 -13779
410 -13779 -17344 -20532 -12498 -489 5743 14888 15664 8764 296 -15402 -25727 -30337 -32613 -20306
424 -20306 -3978 12536 32567 42745 45960 40511 22901 5797 -14189 -33235 -37903 -38569 -31704
437 -31704 -15065 -1633 12208 19034 18708 17435 6347 -2769 -3653 -6864 -1343 9997 18082 26257
451 26257 26057 19431 8287 -13068 -29181 -40712 -50432 -44530 -30010 -11694 12671 31234 45511
464 45511 50386 41779 31249 13862 -6372 -16604 -23642 -24528 -17341 -10696 -605 3576 1222 1375
478 1375 -6628 -14769 -14645 -14267 -7218 3586 14766 28019 31229 29511 26212 9643 -6428 -18203
492 -18203 -31105 -35408 -32706 -23275 -8713 1715 14984 24331 21024 18516 12104 186 -6236 -11268
506 -11268 -10952 -6232 -3074 6163 11515 9095 9519 3681 -5364 -11041 -15685 -14764 -12415 -8525 2767
521 2767 6501 7119 10846 6346 173 -4333 -8636 -8258 -8199 -3232 6963 9654 13784 19106 14186 7943
537 7943 1732 -6183 -12222 -18885 -18276 -14669 -15528 -7521 624 2769 8343 12041 13715 14264 11461 13014
553 13014 10279 3629 3503 -1236 -8706 -11816 -15107 -16940 -17916 -17187 -9623 -6349 -1838 9144 14210
568 14210 17271 22618 23498 21908 16789 11230 6800 -5186 -12511 -14722 -22924 -25529 -22525 -20184 -15355
583 -15355 -9680 56 8762 11479 20430 25325 21923 21832 18432 10483 2535 -5669 -10096 -15711 -20743
598 -20743 -16257 -14839 -14267 -6988 -3413 -699 2868 5557 10363 10177 11438 16904 14034 10913 9928 2822
614 2822 -4400 -11500 -16592 -18575 -21377 -17046 -8297 -4773 3292 11620 12741 13480 11626 9461 4964
629 4964 -1229 -740 -854 -4411 -265 1633 -677 -455 -2133 -4258 -7205 -9743 -6447 -5999 -4951 2413
645 2413 5361 6493 9223 8110 6140 1510 -2388 -2935 -7246 -7454 -2781 -2587 990 4861 5906 6097
661 6097 2812 691 -1080 -7014 -6998 -4971 -5650 -1282 2793 5414 7554 6349 6002 3421 -2827 -2669
677 -2669 -4185 -6647 -3684 -1760 494 1993 1619 3319 672 -2510 -837 -3344 -3812 -2 1113 3321
693 3321 5192 5524 6910 3556 1292 859 -3995 -4729 -4415 -5691 -3261 -2321 -152 2566 1052 2431
709 2431 3289 183 587 235 -1691 -368 -1633 -619 469 -1313 983 1334 -184 1744 748 211 1363
726 1363 -266 639 33 -1147 405 -744 -1150 1027 -755 -483 38 -1215 -151 -1302 -1652 225 -1243
743 -1243 464 1904 1250 2676 2416 1003 1145 -1742 -2632 -2734 -4980 -2919 -1747 -697 3090 3987 5420
760 5420 6008 3587 2829 574 -3248 -3051 -4377 -4184 -1718 -1256 1455 2033 1014 1678 -878 -2546 -2309
777 -2309 -4273 -2535 -113 802 4525 5532 5083 5619 1867 -748 -2538 -6311 -5857 -5373 -4310 904
793 904 2717 5064 7024 4448 3413 460 -3314 -4515 -6058 -5632 -2423 -1313 2270 4645 3765 4271
809 4271 1284 -1947 -3299 -6058 -5502 -3656 -2332 2421 4535 5846 7402 4608 2413 -296 -4322
824 -4322 -5111 -5868 -5279 -1593 26 2992 5156 3885 3884 1430 -1938 -2966 -4752 -5105 -2543 -1649 1844
841 1844 4067 3638 5229 2703 124 -1115 -4430 -4641 -3817 -3740 -40 2125 3440 6003 4718 3598
857 3598 2568 -1172 -1878 -3420 -4466 -1772 -1353 422 2619 1991 2827 1731 -880 -907 -3051 -3063 -1594
874 -1594 -2308 444 2398 2148 3417 2643 1379 1045 -1174 -1194 -1197 -2019 -30 674 823 2467 1125 931
892 931 651 -1753 -1061 -2126 -2641 -626 -901 31 1553 888 1476 945 -4 969 -375 -691 430 -1077
910 -1077 -490 -560 -1719 -1275 -2100 -2242 -709 -1033 1095 3211 2473 4274 4027 3025 2436 -189 -1042 -1716
928 -1716 -3853 -2677 -2861 -3912 -2332 -2953 -2906 -2197 -2243 -496 228 1260 4728 5370 5761 7603 5641 4047
946 4047 1195 -2507 -4484 -8033 -8750 -7350 -7184 -3943 -17 1693 4505 5365 5671 5708 3086 3089 2634 535
964 535 1520 1206 85 -447 -2092 -4139 -6135 -8399 -7158 -6944 -5561 -247 3294 6790 10450 11029 10643
981 10643 8020 3786 1284 -4132 -6776 -6233 -7226 -5894 -3300 -2103 -20 -29 215 378 -1255 -602 1507
998 1507 1379 3810 5581 6561 6421 4113 2522 -582 -5191 -6333 -7607 -8869 -5954 -3689 -258 2661
1014 2661 4655 7026 5835 3383 2847 -237 -2813 -2752 -2869 -1716 -35 1501 3705 2455 1077 879
1030 879 -2495 -4369 -4505 -4977 -3131 -1344 1378 4181 3484 4377 4059 133 -1012 -2349 -3659 -2748 -1908
1047 -1908 1059 3069 3569 5252 3953 429 -907 -3755 -6049 -6084 -5565 -2545 -712 1179 4999 5090
1063 5090 4415 4616 1924 -80 -1881 -2665 -1785 -2474 -1611 905 -119 240 1003 -830 -1564 -1896 -2253 -668
1081 -668 -678 1627 3665 3520 4858 5030 3221 1563 -957 -2857 -4626 -6680 -4948 -4157 -3805 -185 1261
1098 1261 1918 3352 2675 2659 1166 179 1203 468 -76 1998 1322 736 829 -261 -1322 -2941 -3490 -2185
1116 -2185 -3102 -1648 944 953 2389 2875 2639 2571 477 395 27 -2394 -1450 -861 -2166 -660 -361 -88 230
1135 230 -356 1192 630 -897 869 436 -526 472 399 334 325 246 688 75 -668 665 -69 -489 -54 -281
1155 -281 -571 -514 -410 723 -745 50 585 -1231 -848 -265 -705 -290 -189 542 980 56 1396 1239 -176
1174 -176 557 470 -442 364 -571 304 -49 -418 1204 181 -274 718 185 -443 36 -620 -84 -1418 -1448 -62
1194 -62 -892 -517 655 292 656 699 527 787 -134 -141 475 -678 150 491 -85 474 99 -266 -44 -718 -125
1215 -125 -205 -858 587 717 366 1247 297 129 -262 -1378 -662 -1239 -1741 -444 -742 -486 338 358 1034 721
1235 721 493 1363 519 711 1505 42 607 391 -447 -306 -1254 -1286 -721 -1945 -1018 -175 -1003 429 755
1254 755 713 1531 977 1109 835 -164 416 -133 -853 -583 -802 -971 -587 -1304 -476 -301 -523 1007 565 862
1274 862 1635 1416 1891 1400 430 757 -786 -1079 -747 -1800 -1296 -876 -774 388 387 192 956 -426 338
1293 338 134 -394 102 242 149 901 621 616 464 -491 -265 -823 -1185 -399 -536 245 947 1091 1507 1179 443
1314 443 684 -466 -1180 -1266 -1871 -997 -584 -554 501 503 214 429 -595 -640 -761 -1262 -267 -3 170 1344
1334 1344 1368 1545 1482 410 67 -604 -1394 -1136 -1481 -1035 326 230 1161 991 683 408 -294 -938 -888 -1688
1354 -1688 -987 -167 -107 1116 1189 912 1027 82 -414 -785 -1584 -796 -736 -500 1048 1099 1628 1765 693 413
1374 413 -479 -1408 -1011 -1435 -1353 -91 187 1263 1361 387 651 -467 -857 -1258 -1727 -916 -587 -177 1041
1393 1041 1108 1359 1799 960 443 -270 -1332 -742 -944 -271 553 434 1166 1328 334 550 -160 -851 -816 -1492
1413 -1492 -529 126 266 841 1240 778 1061 -241 -787 -846 -1717 -1157 -978 -1008 478 744 1018 1649 653 1179
1433 1179 -12 -531 36 -650 -328 467 142 481 799 375 282 -850 -1284 -1160 -1816 -1602 -729 -470 403
1452 403 1079 1264 1635 601 626 435 -706 -533 -272 -840 -223 8 567 440 65 551 -284 -848 -264 -137
1472 -137 -709 629 357 749 1202 885 793 -242 -867 -478 -1577 -1465 -721 -889 -314 23 478 1002 251
1491 251 96 730 -331 -128 433 -283 245 57 712 520 -220 510 302 -474 -558 -682 -469 -309 -4 292
1511 292 120 -226 865 418 -333 468 -206 -457 -549 -509 32 85 97 1053 197 145 553 -214 -379 -617 -269
1532 -269 -26 -336 387 788 48 391 420 -360 -195 -410 -139 -276 -394 298 112 -221 43 -26 -706 -293 -468
1553 -468 -292 -124 -44 645 340 157 666 282 242 408 114 436 -166 -323 158 -586 -516 108 -439 -271 254
1574 254 -147 503 -257 135 310 -479 147 6 -376 -255 313 23 -65 -49 123 -182 -830 72 261 -206 324
1595 324 345 621 649 490 622 141 -614 196 -484 -534 374 -125 -46 -295 -122 -25 -699 -573 76 -178 31 397
1617 397 -6 134 127 151 477 -339 543 426 -230 186 179 28 60 -129 208 80 -397 295 78 -470 -53 -236
1639 -236 -466 -496 -242 125 -214 -73 306 124 -399 47 -28 -391 76 -206 245 43 158 472 -253 -45 172
1660 172 -138 -198 25 82 151 -156 301 422 -133 -54 -39 -113 112 -365 -193 161 -508 -158 -19 -711 136 -141
1682 -141 -325 144 13 432 137 244 564 -12 305 545 192 73 232 80 116 -267 -84 -169 -682 -245 239
1703 239 -220 123 43 11 354 -120 214 303 -635 -3 -192 -286 -119 113 213 126 -314 369 305 -67 756 289
1725 289 -49 682 263 278 236 -33 190 -422 -560 -116 -421 -200 -144 -703 -51 -88 -169 209 -94 127 491 -558
1747 -558 183 157 -37 324 -10 -264 191 -334 372 -29 -398 230 197 5 215 130 436 63 -297 294 -220
1768 -220 -218 -328 -671 -232 -204 -575 -169 -47 3 170 -279 187 190 -151 110 270 80 322 108 -78 81 -76
1790 -76 55 -265 -226 123 -99 274 304 10 156 296 -396 271 35 -288 -6 -244 -140 -362 -254 142 -322
1811 -322 -168 -10 94 59 258 -81 321 291 98 715 283 136 -2 54 -141 -389 -204 -1 -291 -200 75
1832 75 -93 223 -26 -83 271 -159 84 421 -79 361 -440 -123 103 -76 -377 -233 -698 -142 10 116 226
1853 226 445 288 416 360 268 535 294 209 -66 -412 -259 -594 -529 -229 -732 -115 -302 -216 189 27 314 612
1875 612 414 195 548 529 344 -40 -279 -117 -461 -471 -502 -596 -463 -233 -226 208 61 719 657 180 169 317 -174
1898 -174 335 -287 -34 -251 -347 -208 -442 -653 -184 -246 -164 116 -93 445 622 196 895 501 387 228 -247
1919 -247 35 -279 -519 -259 -383 -358 10 30 220 83 156 99 284 3 50 -59 76 69 -60 58 108 102 -46
1942 -46 -71 -289 -57 -264 42 385 225 288 221 -122 172 172 59 65 -220 -134 -109 -152 -1 92 190 140 -32 291 -51
1967 -51 -701 -260 -396 -297 -109 -593 81 -182 -90 357 36 298 420 279 146 429 146 141 -173 -33 38 -459
1989 -459 -125 -252 -419 -308 -395 -1 116 -166 454 222 86 483 419 89 99 -74 -453 -389 -416 -168 -27 -170
2011 -170 156 116 265 -76 306 378 59 181 280 46 137 191 -4 -159 -78 -286 -251 -721 -137 -127 -292 -267 238
2034 238 10 189 74 171 168 -42 280 256 -160 210 106 -196 167 -52 -80 -29 -167 104 -65 -172 358 -24
2056 -24 -242 152 -119 -136 45 -19 429 -64 -9 247 -336 -39 -10 -45 -321 -313 295 -25 46 293 297 73 330 461
2080 461 -203 318 70 238 207 -316 -11 -384 -645 -286 21 -181 -361 -10 111 -45 101 407 59 294
2100 294 416 295 -97 -178 -141 -304 -530 -489 -154 -308 192 237 435 404 286 465 307 185 364 -90 -418 -165
2122 -165 -106 -691 -289 -641 -641 -491 -496 141 -160 6 502 668 855 868 548 501 63 -178 -288 -408 -739 -474
2144 -474 -704 -380 -228 -168 124 427 556 665 394 696 740 228 486 167 57 -230 -700 -527 -806 -981 -538
2165 -538 -654 -419 97 133 429 768 718 635 781 394 103 -298 -137 -348 -620 -438 -263 -626 -270 -222 33
2186 33 94 -4 356 393 473 555 323 76 228 -274 -198 -52 -549 -266 -471 -574 -99 -174 199 278 72 437 544
2209 544 34 322 144 170 126 -247 -84 -448 -391 234 33 -289 2 10 41 -84 -57 149 66 -82 -149 -187 -177 -114
2233 -114 -154 -67 59 272 164 384 395 401 172 506 125 -13 27 -137 -234 -137 -384 -104 -102 -334 426 212 216 491
2257 491 91 211 297 216 185 136 -306 46 -167 -219 -341 -361 -313 -221 299 180 119 344 264 452 372 555 180 186
2281 186 -108 -120 -240 -336 -249 -307 -547 -139 -142 132 88 -83 162 -39 250 416 166 203 179 20 173 -22 -118
2304 -118 -261 -290 -548 -203 -211 -94 261 49 227 233 316 354 114 390 -165 -217 -63 -411 -228 -102 -209 -248 -174
2327 -174 -260 7 -101 56 336 124 252 352 -55 462 171 60 67 -47 -316 -225 -472 -395 -290 -375 -399 -12
2349 -12 123 191 289 241 494 -28 211 -10 66 -42 -115 -417 -145 -196 -175 -322 -255 111 10 129 39 107 370 590
2373 590 331 471 -106 84 11 -344 -452 -459 -420 -365 -365 -393 163 45 28 251 1 202 365 -20 276 210 10
2396 10 -67 -107 108 -343 -298 -249 -114 -583 41 87 388 397 147 657 415 398 219 -150 0 -56 -386 82 -74
2419 -74 -417 90 -439 -264 -261 -205 -229 -139 209 412 6 371 166 229 90 173 -62 -64 -263 -442 -95 -450 89
2442 89 -200 83 271 173 -36 148 -64 178 103 -382 -22 -139 361 75 -91 18 44 -70 28 23 -258 -204 -99
2465 -99 -11 25 505 267 11 183 11 -281 -383 -56 -343 52 29 -130 21 -362 78 -8 -44 97 -422 -269
2487 -269 176 216 312 323 192 418 124 355 -131 102 -323 -49 -532 -297 -124 -111 79 -16 100 3 -137 227
2509 227 226 167 370 -1 -256 160 -4 66 -140 -32 -172 -261 -248 154 -145 210 251 241 360 360 145 5 -238
2532 -238 -315 -511 -480 -114 -460 -396 286 188 370 314 79 197 276 233 205 83 23 0 58 -257 -556 -556 -390 -298 -328
2557 -328 -153 -180 345 374 172 739 1083 277 502 215 41 -135 -220 -153 -428 -531 -397 113 -89 -180 -137 248
2579 248 208 5 278 -12 -268 218 144 109 -78 63 125 -277 -501 -464 -93 -194 215 275 151 22 193 302
2601 302 0 34 -214 -339 -73 66 -159 -85 -99 346 274 -6 198 -133 -120 182 -13 -332 -192 -74 -320 -348
2623 -348 -265 -306 -332 -198 -51 286 -54 639 543 837 810 450 272 -189 -220 -656 -947 -968 -889 -620 -480 -356 247
2646 247 722 831 920 999 537 577 256 2 50 -114 -62 -392 -706 -753 -766 -929 -499 -544 -269 537 671 1003 1326
2669 1326 1294 1063 587 98 -338 -769 -886 -1094 -1149 -838 -944 -252 -20 41 399 430 555 667 478 673 775
2690 775 172 608 359 86 -123 -393 -604 -915 -901 -955 -660 -505 194 386 992 942 797 607 279 135 -207
2711 -207 -556 -424 -479 -461 -488 -89 -241 -60 209 146 76 -2 -20 199 96 473 561 413 550 306 70 -341 -568
2734 -568 -446 -694 -410 -101 -116 110 344 309 201 579 -167 -110 -329 -369 -276 -196 137 386 338 678 61 470
2756 470 182 -413 -477 -253 -33 -144 -70 82 103 13 9 -13 -8 -89 105 -260 111 205 160 426 329 435 -120 -307
2780 -307 -442 -286 -539 -370 -251 -178 174 51 519 316 156 243 -28 222 -87 -151 -74 -77 -25 319 -17 -15 -51
2803 -51 -337 -280 -407 -281 -257 35 -123 193 387 269 389 261 45 -359 -367 -130 -523 -28 -114 1 316 262
2825 262 211 328 187 -92 11 -220 219 -305 12 212 -51 378 81 -342 -21 -284 -67 -117 36 -15 -98
2846 -98 354 434 292 130 394 164 -121 102 -419 -99 198 -305 79 348 178 63 145 42 -16 66 -140 279
2868 279 -297 -105 256 126 244 -74 154 -261 -279 -28 -262 -149 155 -306 -49 -84 116 200 283 43 204
2889 204 -159 11 -167 -149 109 331 165 -131 128 -9 -83 -294 -115 -104 65 183 2 291 208 69 166 34
2911 34 -134 -38 -4 -354 -28 -18 40 75 59 62 441 -97 110 -45 60 -78 18 -68 -32 21 184 -327 -83 -33 -39
2936 -39 -234 -248 -281 43 316 -118 78 94 81 149 -227 119 -118 -307 138 -12 142 224 -50 103 80 -197 -57
2959 -57 -25 -173 -340 -462 92 55 201 408 220 135 173 -247 -252 -494 -252 -231 44 -174 89 114 14 93 -73
2982 -73 -139 -252 -231 -157 184 93 340 270 381 234 -154 109 -30 -600 -284 -422 -306 33 169 433 299 231
3004 231 366 11 1 -96 -97 -290 20 -220 14 -295 -73 20 -52 -368 -363 -164 -182 356 544 685 421 731 377
3027 377 -48 -328 -595 -660 -920 -1071 -557 -477 -133 530 576 714 609 526 637 249 313 -178 54 -11 -144 -45
3049 -45 -263 -588 -460 -588 -772 -195 -176 143 548 868 1070 1176 1210 969 307 -79 -611 -916 -1149 -882 -1263
3070 -1263 -564 -352 -32 506 313 555 622 203 488 390 234 203 618 224 296 -102 -420 -454 -744 -1090 -704
3091 -704 -928 -308 -153 417 965 915 987 763 250 45 -201 -412 -243 -378 -284 72 -77 52 17 54 187 -186
3113 -186 -323 -207 77 -162 414 433 521 459 349 436 13 -159 -136 -485 -210 -204 217 77 80 512 288 23 -209
3136 -209 -532 -693 -729 -383 -153 89 534 778 926 730 509 305 246 -291 -268 -559 -535 -594 -360 1 -487 -154
3158 -154 -337 -361 21 45 419 83 794 666 714 653 626 76 -356 -619 -794 -968 -1460 -980 -698 -232 272 648
3180 648 479 851 788 740 546 380 157 -76 -99 -63 -379 -479 -522 -666 -890 -943 -598 -398 -101 444 698 834
3202 834 800 777 873 681 272 137 -284 -523 -819 -694 -653 -372 -338 -75 -47 -124 439 470 363 791 602 -2 490
3225 490 283 190 51 -189 -308 -561 -302 -239 -364 -205 -33 204 49 70 65 -19 361 176 219 22 140 28
3247 28 -176 -253 -241 -306 -472 -394 -348 -28 -170 232 381 162 111 -229 -32 134 -218 66 -58 81 162 408 273
3270 273 55 -449 -380 -87 -85 -126 -250 -30 132 160 -86 16 172 198 -103 -179 41 -191 -285 96 -60 339 331
3293 331 -240 3 -153 -272 8 -383 54 -23 84 280 329 258 341 46 302 32 -172 -129 -141 -87 127 -165
3315 -165 103 -32 116 51 31 -67 -161 -65 -61 93 25 -48 134 -250 -145 -66 -232 -162 -136 253 -185 -185 88 144 231
3340 231 37 52 -28 232 35 139 -25 -405 -101 -153 174 101 -90 150 -5 24 -29 20 -69 105 175 146 -56
3363 -56 1 18 -5 202 37 -7 21 192 -278 120 -11 -345 157 147 183 -127 166 163 -187 61 -55 94 -159
3386 -159 -303 -33 -136 -190 62 -49 239 266 295 74 88 159 -36 -98 7 -37 266 -218 213 -20 -237 -129
3408 -129 -355 -167 -28 218 100 219 139 336 257 -171 89 -326 -483 -125 -673 -108 -106 -241 24 63 294 314
3430 314 239 375 195 -5 -145 61 156 -49 97 428 -13 -169 31 -577 -328 -145 -205 -202 256 241 461 645
3452 645 632 318 -142 -74 -154 -581 -418 -408 -45 21 -14 311 409 467 208 141 302 176 -314 216 57 -17 208
3475 208 149 -85 31 -233 -260 -503 -505 18 -207 45 521 478 547 594 267 -83 -347 -377 -408 5 -503 247 54
3498 54 204 488 116 123 377 -111 -379 -207 -188 272 -198 139 25 55 -30 267 -288 18 -202 52 388 184
3520 184 368 85 138 -65 -10 -454 -392 -599 -276 -592 -400 150 179 208 567 400 394 254 -76 317 -82 45
3542 45 -349 -139 -572 -511 -478 -590 -665 -323 -52 169 581 799 662 847 746 417 222 289 -166 -482 -545 -494
3564 -494 -541 -723 -385 -562 -62 15 332 296 666 816 771 599 633 545 482 -42 -387 -777 -833 -1104 -758 -732 -571
3587 -571 -174 314 521 607 684 456 703 552 332 82 31 -10 71 -89 -153 -563 -549 -657 -974 -660 -437 -224
3609 -224 38 532 679 621 747 391 292 243 -200 -554 -282 -404 -341 -368 -56 -29 226 272 112 190 -245 76 69
3632 69 58 238 301 239 268 359 176 -53 -435 -287 -527 -493 -45 -164 171 273 102 46 52 -253 -54 -280 -287 -116
3656 -116 175 187 610 674 629 328 -118 183 -387 -815 -589 -455 -45 -219 177 49 294 601 59 -235 -165
3677 -165 35 -359 368 238 365 449 -7 482 -176 -623 -686 -813 -598 -665 -352 -6 474 680 675 605 329 541
3699 541 87 -239 -496 -405 -491 -146 -272 20 -19 -248 -221 -30 -332 -340 -221 -176 317 427 614 885 586 553 201
3722 201 -215 -396 -672 -798 -544 -126 -191 198 519 186 383 190 208 -155 -146 -102 -106 -22 132 66 194 127 201 -23
3746 -23 -356 -408 -351 -237 -88 137 252 33 165 209 277 253 -145 -86 -109 50 -108 -202 85 279 5 -41 192
3769 192 -127 -236 -120 -178 -183 -98 -1 -88 50 259 274 201 18 -67 89 104 -233 -193 45 37 141 27 298 92
3793 92 38 9 -45 108 73 -259 -36 207 419 74 43 -5 137 14 -211 -163 7 -302 21 231 -58 313 180
3816 180 203 94 51 36 127 -163 -37 -363 187 -53 -88 38 134 98 299 85 -226 -66 -122 -86 -97 112 179 46
3840 46 -25 182 267 55 -64 -67 37 133 -79 341 82 198 348 251 154 168 88 -1 -79 -203 -79 -130 368 -24
3864 -24 -1 123 57 217 -115 -77 -216 -269 -137 -15 -60 132 -378 -48 -224 -137 -28 -2 6 109 -52 59 -24 185
3888 185 236 131 207 114 176 -293 -50 29 -176 -114 41 -157 49 -70 -256 -201 -319 88 140 53 374 206 374
3911 374 -26 -17 78 -242 -281 -230 -31 -407 48 163 415 147 31 234 298 218 -51 -59 162 11 -43 374 80
3934 80 -87 -54 -257 -214 -273 -165 -123 60 117 360 210 240 279 185 233 -32 -489 -289 -212 -213 21 54 145 56 140 -18
3960 -18 -57 -272 -73 58 85 420 133 548 127 502 -228 -433 -388 -579 -667 -347 -198 129 637 362 640 345
3982 345 309 401 116 -193 162 -76 109 -31 19 126 75 -343 -113 -472 -461 -361 -166 -101 39 367 536 291
4004 291 591 317 -94 -231 -382 -481 -123 -361 28 228 369 404 315 292 -53 -111 -583 -443 -292 140 55 205
4026 205 372 389 296 270 -182 -242 -432 -289 -87 -212 -172 -259 228 182 116 -183 -228 -137 -569 -281 113 123 387 432
4050 432 598 351 323 51 -228 -358 -286 -634 -249 -397 -280 396 101 529 415 -9 245 -28 -149 51 -196
4071 -196 54 321 421 242 184 -186 -577 -882 -670 -223 -314 23 196 170 567 971 913 525 476 17 -308 -263
4093 -263 -446 -167 -58 -134 16 -51 15 -178 81 -121 -12 -27 -114 332 767 518 277 479 182 -133 -135 -441
4115 -441 -177 -442 -274 -16 129 170 -24 64 265 47 66 -207 -122 -283 217 -23 155 197 44 221 -120 59
4137 59 -228 -75 -126 -238 -183 30 179 161 395 248 463 111 -42 -21 -96 -44 72 166 -63 17 97 -14 92
4160 92 8 40 -101 -255 -248 63 208 148 150 271 226 -9 -200 -108 -10 17 -111 -96 46 -7 156 -88 50 -224 -112
4185 -112 399 56 198 189 -73 421 -81 6 327 109 -84 65 33 -161 -138 -190 -165 -283 -247 76 62 12 130
4208 130 10 139 -69 -62 123 -259 298 -50 -213 -110 -272 38 105 65 -36 -122 11 -53 80 -247 -7 309
4230 309 303 187 -24 -68 -179 -12 153 64 34 90 67 -207 90 78 160 -85 -31 -16 -288 -136 -95 -114 258 2
4254 2 44 -100 22 -233 -34 218 -75 -16 -28 304 -57 -76 -5 -147 122 29 174 -101 -24 -155 164 -84 32
4277 32 49 81 280 -267 200 109 -45 -190 159 -69 9 164 -25 39 -88 -304 -400 27 -118 -133 80 3 180
4300 180 0 49 70 -354 -298 -38 55 -106 -134 79 -35 -100 214 84 273 24 215 -201 -94 -200 31 -16
4322 -16 101 -124 128 309 -333 54 31 -289 -65 -64 -120 132 69 67 -84 -57 -94 -17 -133 182 -81 41 -47 77
4346 77 173 100 112 -184 -42 -305 -94 -268 -275 -160 -23 -28 -79 222 -26 105 -139 -15 179 8 -257 -198 75
4369 75 -167 181 255 -58 170 -84 -144 63 -153 -38 189 197 252 397 223 29 8 -166 30 -202 13 148
4391 148 226 32 -76 189 78 -109 -149 -43 -157 -174 217 -74 62 432 149 170 -19 -165 -91 -175 -259 -198 -136
4414 -136 24 -71 305 22 307 -129 -72 30 -237 88 -41 -80 -151 200 31 -203 -164 247 361 -4 197 135
4436 135 -209 40 289 134 -67 100 229 220 -26 -248 -329 -149 -217 75 -109 53 268 153 -75 55 -66
4457 -66 -64 -298 -127 10 -7 11 210 117 206 -66 -74 -69 20 -31 56 7 -36 120 196 245 295 253 -96 -211 191 -74 -55
4484 -55 -193 -81 160 -18 182 -36 -51 -91 41 -203 208 -70 23 70 -11 378 23 -230 32 93 -16 -168
4506 -168 -126 -64 -68 186 43 21 -126 -91 -112 -36 -145 -35 121 -41 179 462 -94 -1 252 156 -179 -96 -252 -214
4530 -214 143 -213 -30 92 -190 135 -86 -138 -67 -117 -42 -56 8 184 66 285 -40 -28 -269 -293 -120 -212 -133
4553 -133 -5 19 143 55 80 -121 261 162 123 -15 243 -21 182 228 32 216 181 140 -79 -317 44 -259 -379
4576 -379 139 -190 -100 -141 64 -49 60 -137 -93 -169 -87 -277 175 -124 54 21 -137 -130 -232 -87 -40 12 92 -9
4600 -9 59 61 -106 174 213 26 28 -302 235 -210 -104 304 -184 104 -31 190 239 4 175 51 186 -13 102
4623 102 -17 -39 248 54 -19 -183 14 -95 -72 -25 20 113 295 96 -93 -16 -110 170 -70 68 -18 58 350
4646 350 300 3 -89 -189 -298 -25 -87 49 167 119 -158 67 -197 -14 -63 -144 -32 40 177 155 56 40 2 163
4670 163 194 -42 -49 -34 103 -5 -223 61 -324 -93 62 13 -64 -33 -187 210 -70 54 61 -10 187 -27 -235
4693 -235 333 190 -207 188 -107 -30 -248 -102 70 124 -74 199 -36 47 -171 263 97 35 -21 54 270 58
4715 58 -67 121 -48 158 -313 -25 -174 -89 -42 58 37 -15 104 -143 243 -64 131 53 59 -61 82 120 -238
4738 -238 25 17 130 -11 44 -22 -48 -13 -39 -161 -152 8 -65 96 -120 -84 14 -77 141 -58 -61 -157 -108 -42 119 75
4764 75 -227 52 274 -31 175 136 -248 -109 -82 -170 -40 -160 -82 -94 127 95 -259 61 -130 -66 130 24 -81
4787 -81 -115 -284 15 -5 31 -141 -362 -29 133 487 -195 -104 -195 8 92 80 62 -112 5 -228 -85 -15 -73 42
4811 42 313 57 -48 40 170 43 -15 -56 24 247 29 -21 -3 128 -186 111 22 -177 97 87 21 -165 -172 -43
4835 -43 -49 -8 137 -41 168 -47 117 197 -133 -91 -89 -327 83 -239 -163 147 165 -27 107 -153 27 174 139 95
4859 95 -51 230 184 0 54 111 -77 -184 -139 203 -22 -6 -81 -231 5 -171 -110 54 148 -131 202 -17 147
4882 147 37 -76 -166 -31 302 301 144 -195 195 120 -81 -280 -61 -123 37 144 190 132 35 277 -79 52 -162
4905 -162 -33 -23 -83 -55 -147 -2 105 273 -147 157 -1 0 4 -93 -36 76 65 -173 -113 158 145 -34 236 38
4929 38 -101 -137 -45 -109 -36 1 323 -84 -172 218 -34 -87 -72 -33 -120 36 364 366 32 76 159 35 -89 230 52
4954 52 172 -222 -58 126 -171 42 7 112 25 114 73 26 -9 -59 -168 27 -14 -139 -43 199 223 21 166 -120
4978 -120 -238 -57 384 -155 23 112 90 168 121 34 -135 200 45 120 -169 34 -8 54 18 -164 150 -148 20
5001 20 138 2 -163 161 51 -192 -35 99 209 -225 -184 92 -112 -92 -276 -410 -199 278 -61 215 98
5022 98 202 74 48 39 211 223 57 143 -80 84 5 -65 -148 -188 4 -127 -166 -130 33 185 106 68 143 54 120 45
5048 45 -143 113 -160 128 -80 108 -27 98 6 93 109 92 112 132 3 -49 -247 137 -133 -15 74 54 100 179
5072 179 59 -167 -176 -300 47 -220 -189 142 -115 -24 -86 63 165 -93 82 134 -156 114 -131 17 131 160
5094 160 81 -315 -46 -162 86 17 139 -132 -5 34 190 -141 -16 -125 170 217 59 -78 128 221 -119 -46
5116 -46 -94 111 39 -150 80 34 -137 -98 129 -194 -25 129 -45 186 -113 -156 -46 -60 29 153 -138 -198 -254
5139 -254 134 -130 -28 -351 -171 6 244 82 -420 -108 -58 368 13 -120 -91 -4 7 -195 411 208 125 69
5161 69 -130 -11 -173 111 52 -157 -216 497 23 -145 -107 -131 259 -62 16 14 -93 -195 30 150 -108 -125 -41
5184 -41 161 5 89 -50 48 -74 -118 12 69 105 -101 -120 -20 195 -4 -14 -152 -73 114 -193 140 -10 -104
5207 -104 -13 76 58 239 -123 96 -138 36 191 -34 88 -186 331 -86 56 -23 29 137 -31 -263 316 -52
5229 -52 -127 44 -156 -145 105 -335 -138 20 -22 105 127 -199 210 53 -181 372 -182 -67 -44 15 106 -320 -221
5252 -221 -93 -130 -30 -99 185 112 32 -206 306 4 -87 11 -82 239 264 -71 -94 -74 -65 41 -53 130 126 -128 275
5277 275 -212 84 -54 233 3 62 178 113 69 5 -66 -163 -112 -317 -184 -95 212 173 269 364 -129 137 -131 -200
5301 -200 -148 23 -10 43 -14 73 -278 305 168 -147 -66 77 -10 145 20 12 155 134 176 92 -93 55 23 156
5325 156 26 20 23 10 123 267 81 121 166 -39 151 -28 109 346 12 107 -28 198 211 170 23 -333 63
5348 63 -258 -130 -21 159 175 134 117 -127 -56 -114 47 -69 110 172 237 20 29 482 -43 49 -245 -168 -65 -137
5372 -137 -247 32 290 -316 65 -255 275 40 -201 -347 -120 -220 -245 -42 -162 174 61 120 56 -74 163
5393 163 389 61 -156 -454 92 255 440 -178 61 87 -251 -19 30 132 -140 -85 145 121 -105 142 256
5414 256 -38 453 92 -257 -127 35 -54 55 64 -107 225 -51 -30 -141 102 -55 117 236 70 -52 440
5435 440 178 318 -85 121 -4 -101 -86 -129 -282 -195 -32 -77 -79 200 46 178 31 14 154 9 68 -221 -97
5458 -97 244 -353 -101 203 55 65 -76 -159 108 -55 -34 47 -4 27 -240 330 -15 81 212 39 2 183 131
5481 131 12 -70 217 52 -68 -17 -248 185 -67 -165 -28 -96 -4 129 -3 -15 117 158 65 66 136 -28 -1 -288
5505 -288 55 87 92 123 -110 97 103 303 365 -232 -170 -85 283 -36 -7 -81 -192 0 -109 -155 -286 -193 161 128 -15
5530 -15 -50 206 48 -37 175 250 66 94 -18 -15 -294 -186 -178 34 50 -206 235 -142 -219 124 -188 -10 -172 -265
5554 -265 104 93 -228 158 226 301 230 -188 -25 169 -28 122 -38 16 -124 104 -60 200 304 176 -133 195
5576 195 156 -190 45 21 -152 72 208 -10 28 -79 -110 179 41 -86 -33 -183 -38 -50 -87 -33 111 124 -82
5599 -82 9 -81 -148 33 -10 372 124 -87 -42 -113 -190 -208 66 29 93 -52 -227 86 72 -121 24 125 -2 26
5623 26 45 104 -208 -105 -94 -76 34 177 -161 152 -196 25 161 25 -136 67 -160 26 -87 -97 -167 -166 255
5646 255 76 -149 -38 209 75 302 164 255 25 -163 -20 15 -83 -270 -146 -106 -54 114 -220 -71 22 9
5668 9 -114 -64 121 145 7 -119 45 87 -15 -190 -196 -54 -384 -103 -57 -98 41 -244 -28 6 145 231 -127 156
5692 156 230 169 -7 -145 -151 151 -19 19 -22 164 276 149 -36 180 160 -144 -123 207 159 91 411 -16 -52 -344
5716 -344 -67 -176 -193 86 44 243 118 250 -68 -150 -2 -131 -2 -141 -332 140 229 197 70 87 -262 -117
5738 -117 -183 -13 -226 103 -260 62 60 27 336 159 122 59 -162 98 -333 0 211 67 -38 331 98 -68
5760 -68 -217 147 -128 65 205 54 -111 169 -317 89 26 52 279 -170 -151 -39 -291 -4 48 5 156 148 35
5783 35 -109 -138 -190 -97 -111 -226 -176 -147 2 173 23 49 131 230 -105 52 73 -14 210 -116 17 -22 -93 -70 -141
5808 -141 -23 -351 -51 -225 -97 216 39 130 197 163 189 113 -163 -337 -73 -296 -36 36 115 -31 -171 21
5830 21 -86 -69 32 -102 89 -17 -3 -12 -125 116 15 105 -125 -185 197 191 -116 -220 -121 -248 167 289 43
5853 43 50 162 188 -16 40 117 -124 -236 -130 457 -44 -45 -44 -170 30 207 -15 68 -264 232 223 -148 -69 200 79
5878 79 -2 189 78 -208 -277 252 -5 -73 -240 62 250 175 183 137 60 -212 147 15 16 74 130 11 8 -217 -112
5903 -112 -197 179 -169 -390 101 -41 209 122 -59 63 172 76 106 -279 -25 -127 -6 225 -78 -131 -189 17
5925 17 65 139 -112 171 210 -190 46 303 -35 179 -199 -195 68 -17 69 -107 -12 161 103 -257 7 1 71 131 252
5950 252 -143 -78 134 -103 81 -346 38 -205 -62 -479 -115 221 42 225 120 -170 -142 189 50 -57 239
5971 239 104 50 301 132 -247 -32 8 83 -136 -167 37 110 114 177 -132 223 69 250 152 149 75 183 -136 197
5995 197 76 213 -151 330 150 -29 12 71 87 -153 -211 127 21 -91 230 -1 143 -149 -110 25 -60 -134
6017 -134 124 89 -24 -99 -42 -11 107 20 -112 223 -105 -222 42 361 191 -316 37 12 107 110 9 -199 220
6040 220 -188 12 -92 -155 21 -86 -69 100 97 -61 -39 43 -94 -97 0 289 82 300 -120 207 -89 74 75 -4
6064 -4 -114 -34 101 354 -112 134 -146 -70 144 -161 -127 15 -78 92 199 62 95 43 125 -109 -9 25 -178
6087 -178 -208 -85 -112 -113 9 -228 -134 -67 236 76 -31 46 -66 22 26 56 -91 -26 -3 -183 25 -147 -208 23 112
6112 112 148 -98 158 141 214 -72 -20 -345 -19 -84 13 177 -145 139 77 158 -310 298 136 150 249 81 -30
6135 -30 -21 -40 231 -216 -296 -176 -24 -111 59 -214 -285 178 -294 99 293 299 47 -148 -266 -342 -126 -173 -208 -8
6159 -8 209 121 -119 173 147 -170 261 -63 -77 -1 109 41 -233 42 -95 -115 -255 -123 -244 -27 -190 -11 22
6182 22 112 275 257 138 438 461 220 175 -72 -119 152 -159 -84 -33 -77 -94 -69 101 -44 168 169 64 87 29 -84
6207 -84 155 257 64 78 66 -35 -242 55 -308 65 -4 56 -53 167 534 -152 92 -156 -77 157 264 5
6229 5 108 -344 24 -95 63 -220 269 38 35 129 -343 -22 -123 -95 126 118 -74 141 -51 120 6 -153 197
6252 197 -222 85 -5 -98 380 -49 80 -25 -274 -39 -74 92 -171 223 -2 56 256 205 -14 -4 51 71 -129
6275 -129 72 -111 -120 -126 -243 -114 -130 -223 99 -1 -29 -31 17 -227 -222 -186 -246 -11 6 -61 -106 -113 71 -208 -134 -45 -171
6302 -171 -256 134 -76 218 321 49 32 -144 142 -116 -169 17 141 -180 79 57 66 -165 167 93 -214 115
6324 115 -130 321 47 -24 -55 -164 317 114 -213 11 68 -172 6 34 -47 -133 122 115 52 255 187 14 -22 -43
6348 -43 -15 100 -29 110 -1 -28 -52 -48 142 -84 192 76 165 -99 234 149 32 -177 122 -213 50 27 228
6371 228 91 -54 -81 53 44 -2 152 19 -250 157 -11 -131 -67 -33 175 130 139 76 106 140 -38 -67 -72 87 -37
6396 -37 -109 15 -155 264 110 109 151 -125 -144 -91 -220 10 -107 189 42 4 182 130 -64 -173 -125 112 104 -67
6420 -67 102 -96 119 -247 41 -34 -124 172 304 -36 -98 167 0 -129 106 106 -158 -68 116 4 151 -128
6442 -128 193 186 19 111 19 71 -229 71 137 -216 -30 121 -296 -161 260 208 -50 10 -177 44 86 23 -8 96
6466 96 219 -105 26 -397 139 -160 34 46 5 208 -105 -334 -196 -73 -156 117 -1 7 -38 171 143 -2 -158
6489 -158 -5 -70 -3 -82 -253 13 227 -243 18 -302 39 40 -101 141 -108 339 146 99 -51 65 5 -266
6511 -266 -390 182 -217 25 63 -58 122 -4 -64 -74 145 17 93 248 47 -159 -18 -126 79 -11 73 -53
6533 -53 -35 33 191 82 239 190 -5 282 -116 13 435 -60 -21 -6 -85 -252 -6 -148 -58 74 -5 53 -88
6556 -88 182 -35 -188 -109 200 -17 -72 277 -142 -228 -30 -124 -188 27 -273 -45 -71 -193 -248 168 115 -56 154
6579 154 45 -19 -77 179 -337 26 -208 -99 -43 -85 -73 -40 -41 -290 17 199 44 -102 7 39 82 -104 22
6602 22 -201 -142 61 159 -265 -109 95 39 146 119 -16 -41 -86 -25 -186 -128 195 -24 -57 166 -5 8 25 -137
6626 -137 -104 36 24 -37 185 27 209 -265 317 159 33 -59 -215 71 -51 193 367 -116 -53 54 -31 -170
6648 -170 -24 185 -34 8 -30 -136 -6 -27 -75 -114 84 158 -12 -183 -13 199 156 222 -11 -126 -71 -22 -186
6671 -186 88 -134 -31 -144 12 20 101 -51 57 138 19 171 92 278 -114 -30 -205 -333 -324 100 -177 88 -113
6694 -113 -399 -62 -83 104 65 135 -26 204 -22 177 -127 -187 72 -26 -43 113 41 -28 -106 -254 207 -146 178
6717 178 76 -116 115 196 51 163 264 -11 111 -149 -20 -102 214 -89 -29 151 65 -292 -171 -257 133 -132
6739 -132 112 106 9 89 102 165 -166 34 67 3 1 -254 -124 232 213 42 -161 -326 43 -10 55 180 42 -120
6763 -120 6 -98 220 -114 -143 -108 -184 8 -104 -180 -93 80 26 -13 -173 53 80 113 200 -20 -167 17 -177
6786 -177 250 245 -164 212 54 218 46 254 58 -37 -17 -189 69 -25 238 134 27 -39 124 -123 62 -147
6808 -147 -116 -163 12 55 -132 106 102 -188 -57 216 -149 65 247 151 76 -44 134 -28 21 35 -93 164 -72
6831 -72 -104 -127 -142 -64 -37 111 2 -51 120 48 237 -62 -76 84 -156 -46 -170 14 264 48 40 96 -29 -69
6855 -69 -173 54 -155 -61 -67 -74 312 106 -153 158 -44 -28 -112 -202 -53 118 -53 -58 -239 69 -110 105 -159 -339
6879 -339 -70 -99 -72 80 114 -61 17 184 -150 -71 216 119 278 -54 -62 95 -106 -23 14 28 -77 38 109 247
6903 247 -130 -36 -162 58 98 87 240 334 -100 9 -521 48 273 223 309 99 -31 -121 149 86 -46 -159 8
6926 8 224 218 -187 57 -56 -22 -133 26 -31 -126 22 -147 81 198 151 122 96 109 162 12 -131 31 -78 73
6950 73 130 64 68 84 53 -54 -82 32 142 -107 79 -148 -359 51 118 118 -196 -80 -156 146 124 -2 -128 -262
6974 -262 239 16 109 143 -9 -52 -280 34 -1 69 226 125 2 -146 3 -40 -155 19 -26 -99 -134 -222 -205 297
6998 297 -102 -87 87 17 64 -147 -24 163 173 49 54 0 158 85 27 -56 193 121 84 148 37 -137 -21 36 15
7023 15 -98 -234 -9 -14 -84 -88 74 -275 68 68 61 -47 1 329 -35 157 -183 -138 -59 -51 83 114 48 58 -126 -255
7049 -255 68 69 -107 371 -74 -39 173 12 116 112 30 17 -55 82 -4 -178 -82 20 43 -49 322 80 232 207
7073 207 -41 -35 -225 -40 -58 43 -64 67 -87 -23 148 114 55 -39 145 75 275 108 133 40 122 -115 159 28
7097 28 -62 -91 -163 -247 -16 49 -43 -108 -75 159 -97 -3 23 38 91 -230 198 92 179 -88 -53 -112 169 -129 -105 6
7123 6 73 -98 -28 -74 17 -118 -201 -96 88 48 95 -53 -124 250 -53 20 59 -3 19 77 -120 -173 -103 14 34 2
7149 2 -27 3 -96 -228 -285 161 50 -450 -156 -207 -145 76 109 10 -68 -107 -43 332 -152 -185 152 218 -70 -46 -8 -113
7175 -113 -195 118 32 6 -56 -172 24 -221 110 -72 -252 -32 -96 -57 199 -165 53 -49 -50 -180 -116 7 -99
7198 -99 -79 -205 99 71 -107 -49 -118 -192 14 -71 141 40 65 -121 200 25 81 48 -101 10 148 -5 -38 -14
7222 -14 -25 -67 -236 -147 -112 -27 -104 183 -24 13 -13 102 -3 -68 -101 30 67 -258 -164 118 80 104 -135 -185 23
7247 23 -45 -93 -132 -76 -113 -169 214 282 -216 -158 53 -46 67 186 104 -77 56 181 56 -13 -47 -230 -131 164 46
7272 46 -67 -16 -241 10 33 25 -151 207 23 -219 -84 -86 -71 -9 63 10 -20 -198 142 -114 268 -60 -220 77
7296 77 -140 -106 285 -84 111 84 -9 -54 36 -285 -38 -151 172 -3 241 182 -184 -62 -100 28 69 17 16 -32
7320 -32 146 -38 -303 10 280 70 -64 63 -180 29 -69 13 192 -259 -245 -26 221 73 -165 128 -102
7341 -102 53 -116 -14 -10 135 -57 66 -2 -47 -179 -125 -25 -137 133 -130 64 -11 72 140 -71 -150 7 -211
7364 -211 -236 -173 -104 -162 22 203 -220 -75 -166 118 175 199 93 178 26 132 -48 45 68 -64 113 165 162 10
7388 10 23 -185 116 156 166 218 -177 -35 159 -61 -79 -96 -84 -48 -165 264 -104 -11 182 120 26 -1 18 131 -33
7413 -33 159 -65 -59 156 -42 98 181 19 75 12 -39 25 130 -6 141 21 211 65 -365 -59 93 -100 -291
7436 -291 -78 52 -12 -34 183 9 -4 132 47 479 -18 37 -19 -157 139 -39 -31 -19 -210 -169 110 123 48 96
7460 96 -61 88 -20 -192 -73 28 -70 89 137 -128 172 89 73 342 1 130 -59 -416 122 10 -34 7
7482 7 100 14 175 87 143 32 -13 -125 -85 172 74 -175 51 169 117 -148 -22 98 -15 224 116 21 -83 -100
7506 -100 76 44 -94 -14 20 -192 14 271 28 -97 161 24 81 10 99 120 262 21 104 -76 -48 150 120
7529 120 256 -96 68 -87 116 18 84 28 51 -266 -119 169 201 -112 22 88 11 -79 -154 132 98 -99 -22 96
7553 96 174 26 -191 -17 -67 151 52 263 120 190 -100 -166 -246 -109 242 -108 54 -125 101 264 3 -234
7575 -234 -98 69 -43 -91 52 -147 -83 142 -48 205 -33 -7 -129 131 -142 -35 14 25 17 13 52 -176 -275 257
7599 257 200 -1 106 -191 -36 136 187 -95 -228 -57 -212 48 121 112 176 -97 -71 -154 200 -74 27 104 174
7622 174 128 -36 127 90 23 85 24 -95 122 136 32 275 53 29 209 97 -75 -392 -120 -82 151 26 34
7645 34 -80 -175 -304 107 -16 -3 -91 24 49 209 -106 138 -48 62 119 102 236 227 -26 -149 -66 -161 -48 -79
7669 -79 -249 -272 43 -102 -149 116 46 71 5 176 67 -195 79 160 -128 -275 -74 -19 -40 -19 25 148 -234 -184
7693 -184 69 -96 236 274 -46 13 -203 63 -22 251 -141 -19 336 -21 65 64 138 -31 41 155 136 -98 -404
7716 -404 -30 -308 -57 48 -54 119 121 338 -8 103 -187 76 -211 47 -179 -204 -61 28 177 183 28 188
7738 188 318 -37 92 73 316 -121 129 -133 -207 37 246 44 -197 -112 -58 289 231 271 -70 -161 96 91 -192
7761 -192 -1 -164 123 -112 -136 120 8 -174 123 -51 -125 -69 244 18 -128 64 -92 213 -101 138 19
7782 19 -50 68 -83 155 205 94 72 -52 -45 144 -1 15 249 220 -98 -111 -86 -46 120 182 127 -84 46 -191
7806 -191 -227 -8 -129 -218 -163 -59 -28 -206 178 -28 54 24 107 29 177 56 -201 -60 -73 104 30 28 125 272
7830 272 -77 63 -436 -185 10 184 -27 174 40 -148 -5 -141 164 -138 -206 61 -22 145 -84 -144 11
7851 11 -200 33 -186 22 200 -181 70 -93 44 238 1 -114 201 -156 170 63 78 -14 -172 129 196
7872 196 -124 56 94 -111 -21 -9 145 123 -150 144 -122 -96 73 -46 -126 85 92 255 -127 199 54 180 -42
7895 -42 -75 72 -53 12 -74 193 -2 -362 102 -221 -92 -101 126 -126 -252 -140 -61 -164 176 -41 38 104 146
7918 146 -53 97 113 45 -92 -243 -128 95 80 101 -39 2 -168 -55 -290 28 244 -38 -100 -132 42 -37 3
7941 3 -159 -38 -120 -42 120 5 63 -78 157 58 144 -77 38 44 43 162 -140 127 82 -344 9 51 10 -153 156
7966 156 -60 43 -259 -331 19 -55 -90 198 225 29 155 108 18 -61 -56 92 26 142 134 204 -89 -103 -265 42 183
7991 183 274 10 -72 219 387 21 150 146 91 -43 23 -338 81 80 36 -143 -23 158 -48 172 -1 46 140 106
8015 106 89 114 10 32 313 0 103 -83 -143 19 194 119 0 -334 103 13 -330 -77 -103 -49 -101 14 -52
8038 -52 190 -234 142 172 -16 8 -88 74 46 -31 -137 80 6 -15 -146 -174 115 137 -59 185 -112 125 -68
8061 -68 10 -92 -88 -9 -280 -94 -13 69 128 -21 -20 182 -83 14 -138 -109 102 -208 68 126 -163 126 -62 210
8085 210 12 -1 147 -404 -164 -125 -261 115 -62 225 8 178 74 -257 -54 -237 146 -27 -149 220 109
8106 109 -63 -46 74 -146 -170 -120 88 -90 -52 117 116 -59 42 13 85 102 90 -251 -192 117 -133 39 82 -104
8130 -104 81 -136 -41 -87 156 105 155 -74 -93 -84 12 70 135 -173 -108 -64 213 -56 -19 307 -341 -38 -138 16
8154 16 -41 -69 -18 255 152 130 -104 1 -98 45 -58 -166 -51 52 -106 169 165 -142 -72 -103 120 129 59 -72
8178 -72 -48 156 226 58 -29 23 -40 301 -125 -125 -239 52 265
8191B65
##END NTUPLES=NMR FID
##END=
