##TITLE=1H_Pr 5088-22
 CDCl3
 8 sc, 
 16.02.2022
##JCAMPDX= 6.0         $$ Bruker NMR JCAMP-DX V2.0
##DATA TYPE= NMR FID
##DATA CLASS= NTUPLES
##ORIGIN= UXNMR, Bruker Analytische Messtechnik GmbH
##OWNER= root
$$ XWIN-NMR		Version 3.5
$$ Wed Feb 16 12:33:15 2022 Russian Standard Time (UT+4h)  she@DPX200
##.OBSERVE FREQUENCY= 200.131346
##.OBSERVE NUCLEUS= ^1H
##.DELAY= (6, 6)
##.ACQUISITION MODE= SIMULTANEOUS
##.ACQUISITION SCHEME= undefined
##.AVERAGES= 8
##.DIGITISER RES= 18
##SPECTROMETER/DATA SYSTEM= spect
##.PULSE SEQUENCE= zg30
##.SOLVENT NAME= CDCl3
##.SHIFT REFERENCE= (INTERNAL, CDCl3, 0, 15.7039)
##AUDIT TRAIL= $$ (NUMBER, WHEN, WHO, WHERE, WHAT)
$$ ##TITLE= Audit trail, XWIN-NMR		Version 3.5
$$ ##JCAMPDX= 5.01
$$ ##ORIGIN= Bruker BioSpin GmbH
$$ ##OWNER= she
$$ F:/spectra/data/she/nmr/H-F/1/audita.txt
$$ ##AUDIT TRAIL=  $$ (NUMBER, WHEN, WHO, WHERE, WHAT)
(   1,<2022-02-16 12:31:40.82 +0400>,<she>,<DPX200>,
      <created by zg, POWCHK disabled, PULCHK disabled
       configuration hash MD5:
       00 E9 B6 7A A2 85 ED C7 34 08 36 98 17 FE 4E 26
       data hash MD5: 16K
       4B 27 0D 24 2B 5A C5 44 5D 91 E8 7C 44 02 20 2C>)
$$ ##END=
$$ 
$$ hash MD5
$$ C1 BB 44 2A A7 22 5D FB 77 66 CC B6 65 FC 8F 2B
##$RELAX= 
##$RELAX= 
##$RELAX= 
##$RELAX= 
##$RELAX= 
##$RELAX= 
$$ Bruker specific parameters
$$ --------------------------
##$DU= <F:/spectra>
##$EXPNO= 1
##$NAME= <H-F>
##$PROCNO= 1
##$TYPE= <nmr>
##$USER= <she>
##$AMP= (0..31)
100 100 100 100 100 100 100 100 100 100 100 100 100 100 100 100 100 100 
100 100 100 100 100 100 100 100 100 100 100 100 100 100 
##$AQSEQ= 0
##$AQ_mod= 1
##$AUNM= <au_zg>
##$AUTOPOS= <>
##$BF1= 200.13
##$BF2= 200.13
##$BF3= 200.13
##$BF4= 200.13
##$BF5= 200.13
##$BF6= 200.13
##$BF7= 200.13
##$BF8= 200.13
##$BYTORDA= 1
##$CFDGTYP= 0
##$CFRGTYP= 5
##$CHEMSTR= <none>
##$CNST= (0..31)
1 1 145 1 1 1 1 1 1 1 1 1 1 1 1 1 1 1 1 1 1 1 1 1 1 1 1 1 1 1 1 1 
##$CPDPRG= <>
##$CPDPRG1= <>
##$CPDPRG2= <>
##$CPDPRG3= <>
##$CPDPRG4= <mlev>
##$CPDPRG5= <mlev>
##$CPDPRG6= <mlev>
##$CPDPRG7= <mlev>
##$CPDPRG8= <mlev>
##$CPDPRGB= <>
##$CPDPRGT= <>
##$D= (0..31)
0 1.2 0 0 0 0 0 0 0 0.06 0 0.03 0 0 0 0 0.0002 0 0 0 0 0 0 0 0 0 0 0 0 
0 0 0 
##$DATE= 1645000300
##$DBL= (0..7)
120 120 120 120 120 120 120 120 
##$DBP= (0..7)
150 150 150 150 150 150 150 150 
##$DBP07= 0
##$DBPNAM0= <>
##$DBPNAM1= <>
##$DBPNAM2= <>
##$DBPNAM3= <>
##$DBPNAM4= <>
##$DBPNAM5= <>
##$DBPNAM6= <>
##$DBPNAM7= <>
##$DBPOAL= (0..7)
0.5 0.5 0.5 0.5 0.5 0.5 0.5 0.5 
##$DBPOFFS= (0..7)
0 0 0 0 0 0 0 0 
##$DE= 6
##$DECBNUC= <off>
##$DECIM= 32
##$DECNUC= <off>
##$DECSTAT= 4
##$DIGMOD= 1
##$DIGTYP= 9
##$DL= (0..7)
0 120 120 120 120 120 120 120 
##$DP= (0..7)
150 150 150 150 150 150 150 150 
##$DP07= 0
##$DPNAME0= <>
##$DPNAME1= <>
##$DPNAME2= <>
##$DPNAME3= <>
##$DPNAME4= <>
##$DPNAME5= <>
##$DPNAME6= <>
##$DPNAME7= <>
##$DPOAL= (0..7)
0.5 0.5 0.5 0.5 0.5 0.5 0.5 0.5 
##$DPOFFS= (0..7)
0 0 0 0 0 0 0 0 
##$DQDMODE= 0
##$DR= 18
##$DS= 0
##$DSLIST= <SSSSSSSSSSSSSSS>
$$ [...]
##$SUBNAM2= <"">
##$SUBNAM3= <"">
##$SUBNAM4= <"">
##$SUBNAM5= <"">
##$SUBNAM6= <"">
##$SUBNAM7= <"">
##$SUBNAM8= <"">
##$SUBNAM9= <"">
##$SW= 18.0517287032376
##$SWIBOX= (0..15)
0 0 2 0 0 0 0 0 0 0 0 0 0 0 0 0 
##$SW_h= 3612.71676300578
##$TD= 16384
##$TD0= 1
##$TE= 0
##$TE2= 300
##$TE3= 300
##$TEG= 300
##$TL= (0..7)
0 120 120 120 120 120 120 120 
##$TP= (0..7)
150 150 150 150 150 150 150 150 
##$TP07= 0
##$TPNAME0= <>
##$TPNAME1= <>
##$TPNAME2= <>
##$TPNAME3= <>
##$TPNAME4= <>
##$TPNAME5= <>
##$TPNAME6= <>
##$TPNAME7= <>
##$TPOAL= (0..7)
0.5 0.5 0.5 0.5 0.5 0.5 0.5 0.5 
##$TPOFFS= (0..7)
0 0 0 0 0 0 0 0 
##$TUNHIN= 0
##$TUNHOUT= 0
##$TUNXOUT= 0
##$USERA1= <user>
##$USERA2= <user>
##$USERA3= <user>
##$USERA4= <user>
##$USERA5= <user>
##$V9= 5
##$VALIST= <valist>
##$VCLIST= <CCCCCCCCCCCCCCC>
##$VD= 0
##$VDLIST= <DDDDDDDDDDDDDDD>
##$VPLIST= <PPPPPPPPPPPPPPP>
##$VTLIST= <TTTTTTTTTTTTTTT>
##$WBST= 1024
##$WBSW= 4
##$XGAIN= (0..3)
0 0 0 0 
##$XL= 0
##$YL= 0
##$YMAX_a= 34657
##$YMIN_a= -45355
##$ZGOPTNS= <>
##$ZL1= 120
##$ZL2= 120
##$ZL3= 120
##$ZL4= 120
##$ABSF1= 10
##$ABSF2= 0
##$ABSG= 5
##$ABSL= 3
##$ALPHA= 0
##$AQORDER= 0
##$ASSFAC= 0
##$ASSFACI= 0
##$ASSFACX= 0
##$ASSWID= 0
##$AUNMP= <proc_1d>
##$AZFE= 0.1
##$AZFW= 0.1
##$BCFW= 1
##$BC_mod= 2
##$BYTORDP= 1
##$COROFFS= 0
##$CY= 11.3945322036743
##$DATMOD= 1
##$DC= 2
##$DFILT= <>
##$DTYPP= 0
##$F1P= 2.36226072786647
##$F2P= -0.459571619588291
##$FCOR= 0.5
##$FTSIZE= 0
##$FT_mod= 4
##$GAMMA= 1
##$GB= 0.15
##$INTBC= 1
##$INTSCL= 1
##$ISEN= 128
##$LB= 0.24
##$LEV0= 0
##$LPBIN= 0
##$MAXI= 10000
##$MC2= 0
##$MEAN= 0
##$ME_mod= 0
##$MI= 1.114404
##$NCOEF= 0
##$NC_proc= 0
##$NLEV= 6
##$NOISF1= 3.799351
##$NOISF2= 2.8
##$NSP= 1
##$NTH_PI= 0
##$NZP= 0
##$OFFSET= 15.70392
##$PC= 1
##$PHC0= -16386.05
##$PHC1= 9.40078
##$PH_mod= 1
##$PKNL= yes
##$PPARMOD= 0
##$PSCAL= 0
##$PSIGN= 0
##$REVERSE= no
##$SF= 200.130013532006
##$SI= 16384
##$SIGF1= 3
##$SIGF2= 2
##$SINO= 400
##$SIOLD= 16384
##$SREGLST= <1H.CDCl3>
##$SSB= 0
##$STSI= 0
##$STSR= 0
##$SW_p= 3612.71676300578
##$SYMM= 0
##$S_DEV= 0
##$TDeff= 0
##$TDoff= 0
##$TI= <>
##$TILT= no
##$TM1= 0
##$TM2= 0
##$TOPLEV= 0
##$USERP1= <user>
##$USERP2= <user>
##$USERP3= <user>
##$USERP4= <user>
##$USERP5= <user>
##$WDW= 1
##$XDIM= 8192
##$YMAX_p= 0
##$YMIN_p= 0
$$ End of Bruker specific parameters
$$ ---------------------------------
##NTUPLES= NMR FID
##VAR_NAME=  TIME,          FID/REAL,        FID/IMAG
##SYMBOL=    X,             R,               I
##VAR_TYPE=  INDEPENDENT,   DEPENDENT,       DEPENDENT
##VAR_FORM=  AFFN,          ASDF,            ASDF
##VAR_DIM=   8192,          8192,            8192
##UNITS=     SECONDS,       ARBITRARY UNITS, ARBITRARY UNITS
##FACTOR=    0.0002768,     1,               1
##FIRST=     0,             0,               0
##LAST=      2.2672688,     0,               0
##MIN=       0,             -45355,          0
##MAX=       2.2672688,     34657,           0
$$ Real data points
##PAGE= N=1
##DATA TABLE= (X++(R..R)), XYDATA
0@%%%%%%%%%%%%%%%%%%%qJ6j6J6j6J6j7K5l2L2l8M6m9N7o5P3q2R0j04J18j29J42
41G5j58J77k00K20k43K69k94L25l59L95m36M82n31N83o44P16p97Q89r98J128j286
62f87J485j738K079k567L318m655P775k9500k0865K1234P869K6168J0109J0972
76C0997L660p478p454q849j4876l8m342J85Q498J29J028K050j0244l318o049p055
92b3156N375M137Q273J6839P261R378M691q384o128j2927j7104o226q559j319
106b7849R292N413J1648J0578J760M700m229p878j420p957k000N615j06P216O366
121A1149j444K200n409q188l251q892k059L805J15R328P860K224O756k141n221
136F832k295r525l997j42k826O755N703K963Q258k81k112o17r045m323k641n737
$$ y = [0, 0, 0, 0, 0, 0, 0, 0, 0, 0, 0, 0, 0, 0, 0, 0, 0, 0, 0, 0, -8, 8, -8, 8, -8, 8, -9, 16, -16, 16, -22, 24, -25, 32, -33, 40, -42, 48, -56, 62, -67, 75, -83, 94, -106, 114, -129, 140, -154, 171, -188, 207, -229, 253, -278, 305, -339, 377, -420, 469, -529, 599, -687, 798, -940, 1139, -1428, 1890, -2765, 5010, -24490, -45355, -24121, -16252, 9916, 20025, 30997, 34657, 27179, 19725, 10876, -4000, -4038, -8380, -8195, 303, 432, 1460, 3510, -6734, -10052, -16101, -23156, -17781, -13644, -5371, 11468, 18729, 28107, 32798, 24414, 18286, 5359, -11745, -17971, -26530, -27849, -18557, -13144, -1496, 9082, 10842, 15542, 11313, 3435, 2015, -5942, -7942, -2327, -2433, 4783, 11149, 9705, 11905, 6496, -1692, -4943, -13835, -15894, -12089, -11974, -2646, 5214, 7438, 14194, 12053, 6832, 4537, -4988, -8985, -9127, -11953, -5198, 505, 3468, 11726, 11445, 9333, 8716, -329, -4652, -7293, -13030]
152a3030L597K789K118P913J272J497K369n413q15j618n201L015L60j39N449j031
168C132j45P45n944j401k460m581L337M98K237P827J461L907L858l594J13l229
184E761o438m66m387k298K843k035K592L113j804L454J96k054L483j429K25L688
200D444j836J953J024l407J112k909l803J178l695l22K848j552L474K890p29L883
216D553k53j177K007l250n95O43l921J236l09k732K566j386q83K837j899J333
232a230K207j879K910L20j595K804k020q61J851l276O48Q44k818K119n92j543
248b111K604j829K80K185k407J917R34k342K550j016j601K187k504m4J512k539
264b224J864M07j650K953j042p08K515k425N82J362k637J799n1j698K311j415
$$ y = [-13030, -9433, -6644, -4526, 3387, 4659, 6156, 8525, 3112, 2297, 679, -4522, -1507, -1147, -1286, 4163, 3132, 2987, 3732, -2212, -3613, -6073, -10654, -7317, -6819, -4582, 3245, 4706, 8613, 12471, 8877, 8990, 5761, -677, -1143, -5530, -7828, -4985, -7020, -4428, -1315, -3119, 335, 531, -1523, 1960, 531, 756, 4444, 2608, 4561, 5585, 2178, 3290, 381, -3422, -2244, -5939, -6261, -3413, -4965, -1491, 1399, 670, 4553, 4300, 3123, 5130, 1880, 1285, 1928, -1993, -757, -1066, -3798, -1232, -2618, -3501, -664, -2563, -1230, 977, -902, 2008, 2328, 733, 3537, 1517, 656, 2507, -769, -121, 723, -2095, 24, -568, -2111, 493, -1336, -1056, 1129, -1278, 639, 1573, -769, 1781, 765, -836, 1351, -1153, -1197, 315, -2224, -360, 47, -1603, 1350, 308, -400, 2115, -310, 272, 1634, -1003, 796, 745, -953, 1358, -57]
280e7n13J927k438R43Q38k541K042m70j566K475j530k9K029k047J451P38j911
297f59K135r79j414K047k134K7J701k157J782Q92j556K393r13j179J689k738N5
314a008R33k413K099M86j154K832r74p36J583k838m2M51k300K152M53k80L377
331B621o70O5J515l096k08n05k987J539j91m8L382l24J081J586k638R0j229l327
349c344J061q99k02L362N7J829K157j999M60j549l397M33j910k31L212Q2K889
366B011K782j170J187j621l552m38l130j057J906m36L208K910k32K289j188k864
382F05k82l627j385J365p12L281L083O35K994q88k383p99m668k346j61j739K888
399d139L147J854M621Q52l89L00m249k414j726l343J281J042P07M028O45J98O82
$$ y = [-57, -570, 1357, -1081, -138, 700, -1841, 201, -269, -1835, 640, -890, -919, 1110, -937, 514, 1252, -659, 1476, 497, -917, 1130, -1004, -977, 724, -1433, 349, 1241, -315, 2078, 1165, -14, 1675, -1063, -1008, -75, -2488, -389, 97, -1057, 1775, 801, 65, 1648, -1190, -1232, -781, -3081, -929, -476, -756, 2621, 1951, 2016, 3531, 435, 227, -278, -3265, -1726, -1917, -1965, 1417, 1093, 2174, 3760, 1122, 1212, -17, -3344, -2283, -3182, -3384, -22, 35, 1864, 4021, 2022, 2482, 933, -2464, -2031, -3941, -4172, -960, -878, 2011, 4793, 3623, 4810, 3189, -363, -801, -3931, -4988, -3082, -3518, -310, 2600, 2368, 4657, 3469, 605, 323, -3304, -4689, -3324, -4036, -755, 2328, 2963, 5957, 5069, 2686, 1887, -2781, -5127, -5288, -7027, -4139, -992, 862, 5483, 6335, 5946, 6246, 1997, -417, -2143, -5486, -4205, -3163, -2456, 1572, 2217, 2415, 3097]
416C097l572j687j410k687J980J592K164N314J774J681J205l944k550l833n616
431f492j031j476K71M424K174L779L810n50R00j372l646l37k097q54K524O1J913
448B001J734j876l84k675m117p34k316K16L876K092N005M838J214K208j516m014
464E552k423n313l447p16j834K240K659R76L568N61p04Q94k476q48R31r59K468
481A129K137L33K323j134k012j121m529k433q80k069K300K653J904M711J651R49
497E912J087k944j632j846l638K38l03j38K936M83P95J487k018k44q73k437Q49
514b286j97J96K824L12J303J584j664L0q95k562N68q72k12K336j60J322J248j510
532A365K19j352k731J72j562n90J999o0K180K289L9K083Kj157P20k088j345J92
$$ y = [3097, -475, -2162, -3572, -6259, -4279, -2687, -523, 4791, 6565, 8246, 9451, 5507, 2957, -876, -6492, -7523, -8999, -8728, -4304, -2130, 1649, 5459, 4909, 5809, 4437, 791, 454, -1643, -2497, 27, 88, 2001, 3735, 1859, 1475, -1200, -5317, -6051, -8367, -8151, -4275, -2183, 2822, 7660, 8874, 11082, 9566, 5552, 3129, -2184, -5631, -6347, -8181, -5941, -3282, -2306, 1262, 1823, 1119, 2013, -463, -1311, -380, -1339, 1129, 3266, 3599, 5922, 4788, 2776, 1655, -2874, -5307, -6187, -8256, -5956, -3303, -1399, 3312, 4963, 5912, 6999, 4055, 2423, 577, -3061, -2823, -3126, -3264, -328, 155, 950, 2437, 419, 175, -698, -3135, -2286, -2483, -2287, 537, 849, 2152, 3736, 2072, 2102, 1207, -1355, -787, -1659, -1871, 465, 305, 1627, 2875, 1365, 1584, 232, -2499, -2327, -3889, -4479, -2480, -2540, -360, 1929, 1968, 4051, 4053, 2896, 3616, 1528, 183, 375]
550C75k241n6J18j591J079l34n32J880l52J179K245j06J961J070r48R99j503j921
568A322l03k940j355j14k052P71O07j76K461O92J226K815l0J506J309j377L77
585D739j175k518o52k591j643K0j755J002J379l0K686J258L99K088m49R3P08j684
603A875K84k16j970N65j238j610M06j737j68Q66o78K185J626M36K818M02q0Q09
621D575j996j041q93k541O7n18p43J867j16L57J651r93L37K65j351R73j05k88
639d93J985m63M43J058j549n8n16j928L62p03m16J793k37J037J584r27O87l55
657A304j762M06j224p10J369n74J057J464o84J039j99j463M15j454p86Q58j014
674a958J048J279n93J444J15q16P98j251m56P52j234Q89O96r34J403m19q49O94
$$ y = [375, -1866, -1922, -1804, -3395, -2316, -2650, -3182, -1302, -1654, -475, 1770, 1664, 3625, 4695, 3747, 4746, 3243, 1322, 1019, -1921, -3276, -3390, -5442, -4671, -4064, -4240, -1779, -1087, 139, 2954, 2924, 4430, 5739, 4362, 4739, 3564, 1046, 394, -2197, -3840, -3820, -5575, -4573, -3194, -3224, -538, 720, 1119, 3207, 2758, 2851, 3559, 1875, 2159, 1943, -27, 538, -700, -2310, -1904, -3641, -3809, -2943, -3621, -1436, 190, 626, 3444, 3846, 3766, 4575, 2579, 1538, 645, -1896, -1829, -2347, -3090, -1223, -1339, -982, 669, -324, 13, 278, -1073, -100, -205, -493, 1492, 1029, 1472, 2530, 981, 923, 407, -1521, -1159, -1862, -2278, -485, -722, 315, 1899, 972, 1659, 1304, -458, -52, -1276, -1986, -617, -1191, -134, 1330, 646, 1685, 1486, 23, 438, -1016, -1802, -944, -1958, -910, 369, -224, 1220, 1335, 519, 1317, 66, -390, 362, -872, 17, 713, -221, 1182, 763, -86, 608]
692F08j468l70M51j191R37N85m41J825j02k24J164j288j34L07j511N65J5p88J331
711B71l60j83J325j036L34M37j179Q19l46q03J116q81n8R48j135O25L73j046J151
730C72k98o20J154r52R4Q17j062P09L73q93J068n18n10Q56j177J05N34j029J051
749G4L82n56J411m67l30P33j525j77j4j411Q21mk93J602j71L46J109j077K20J04
769G77j429N96k50m49J352m09L18R22j121K13l41j498N85n98k89J508k49Q70J231
788A739q08M96l77j597L11j116n58J050n06J074J256m02J029j64j203M39j232
805e69o07P58p44R69J015m13J249k60r96L54j487o90L74j008R68R39p5J547j1
824A313m47O55j569m98J7j250Q02N21j61J634qo1O75j293l02j50j383O90J34j66
$$ y = [608, -860, -1230, -779, -1970, -1033, -448, -889, 936, 834, 610, 1774, 486, 352, 659, -852, -287, -272, -1060, 271, -89, -272, 1053, 17, 351, 788, -391, 428, 82, -721, 395, -486, -544, 404, -731, -106, 267, -779, 372, 74, -546, 608, -344, -250, 567, -495, 214, 587, -306, 762, 244, -266, 590, -587, -482, 52, -977, 74, 456, -100, 1311, 844, 514, 1247, -278, -455, -469, -1880, -1059, -1063, -1356, 246, 75, 421, 1530, 453, 673, 777, -652, -56, -306, -755, 597, 188, 506, 1428, 307, 520, 179, -1319, -734, -1332, -1621, -113, -362, 508, 1739, 931, 1427, 1050, -547, -236, -1352, -1910, -860, -1366, -292, 964, 562, 1591, 1427, 224, 663, -569, -1176, -418, -1162, -193, 822, 409, 1658, 1398, 402, 756, -731, -1421, -1047, -2055, -1087, -148, -223, 1324, 1313, 866, 1521, -48, -546, -529, -1779, -977, -456, -617, 1017, 1009, 948, 1623, 330, 28, -122, -1505, -815, -681, -847]
844h47J557n7J17Q67j217j19k61j490M13k24l11J413n3N28J173r33L58j57j330
863e73M87m89l93J194l98N14R00q76N27k74j235O06p65l38R91n56N24Q56o65O75
883G12k05q81O50p62l28Q47p06O05O41o92Q50k09p68P83q63k04O40q46O07M01
903B72o64R92k26m68R08p89RP02r39M98nr13O57o68n78P78q10L85R03n93J090
924E41L14l84R70n23l45N35r87J11K61j006O14l57q38N89q42j32P75n96R74R29
944F03j33J396J76m71M72j225o97l59j555J17K4o19J313K23J88J266l97L00N75
963A197r03O70K13m90J028m29m93L74j515n39n04j448L28L5N2J762N89J029J553
982B509m12L58j31j551o6j027r57O09n97K96Q53n12N54J09q74N50l88k49J167
$$ y = [-847, 710, 653, 770, 1637, 420, 301, 40, -1450, -1037, -1261, -1572, -159, -212, 316, 1489, 556, 914, 757, -573, -86, -575, -968, 226, -172, 342, 1242, 366, 893, 619, -616, -10, -775, -1113, -122, -678, -154, 702, 37, 712, 507, -374, 276, -486, -814, 33, -673, -68, 573, -119, 731, 522, -246, 537, -326, -530, 110, -736, -129, 272, -392, 600, 374, -94, 814, 25, 34, 736, -203, 295, 290, -623, 34, -634, -1212, -434, -1244, -859, 44, -549, 541, 855, 471, 1441, 918, 573, 1108, 121, 232, 493, -513, 101, -256, -1094, -505, -1347, -1479, -704, -1300, -326, 603, 470, 1866, 2042, 1571, 2043, 818, 121, -238, -1793, -1676, -1652, -2271, -958, -735, -547, 719, 322, 622, 1197, 294, 964, 1177, 687, 1715, 1286, 793, 1167, -348, -887, -1391, -2839, -2511, -2476, -2424, -662, -73, 956, 2509, 2097, 2455, 2324, 773, 707, -320, -1277, -668, -1265, -969, -116, -628, -74, 35, -839, -289, -677, -926, 241]
1001B41n2P39J132n16N08m48j403j98j346q88M03n43P55J273J37J314L90n55M83
1020A426r41o43J84r93N66N85k34J099pm63L46j122n85P3j020N32N09r1J330K21
1040G72j07O55r21l72m5j136M32K37j75J315K04J07O90j054k57k76j413K45k40
1059a339k57J205J64N09J131m75L25m8j154K50o05o13P61m76J84P32o26K64Q0
1078A2r37M45l07k95J103j34O30R88l30N56k16r68L1j022p74L67o62L32P11k37
1098g07Q75K78m13P72n85k61N22p70M20M02o30O82j41o54M57p89j54L10o92N48
1118e30N19k76R16Q1k13P03p13j19J92j015K11po02P89k23j60O84m92J82L29o82
1139d26N29p6m50P17k90l5N80n47K54K26o89N10k61l98O56m44n2N40o04L50J20
$$ y = [241, 189, 928, 2060, 1544, 2052, 1604, 201, 3, -1343, -2231, -1828, -2371, -1616, -343, -206, 1108, 1498, 943, 1426, 485, -158, 26, -967, -401, 184, -50, 1049, 1042, 579, 925, -197, -782, -709, -1729, -1197, -688, -779, 551, 772, 665, 1320, 399, 27, -18, -1154, -722, -485, -660, 655, 859, 966, 1656, 602, 345, 69, -1344, -1099, -1339, -1596, -391, -227, 282, 1413, 938, 1263, 1215, 61, 311, -294, -907, -146, -622, -438, 294, -332, -68, 12, -925, -480, -787, -1082, 21, -113, 517, 1505, 1175, 1731, 1515, 547, 578, -444, -1218, -851, -1513, -1181, -470, -707, 168, 446, 33, 805, 220, -41, 481, -289, 131, 533, -97, 585, 444, -210, 247, -542, -696, -386, -1078, -530, -11, -287, 629, 710, 497, 1200, 487, 368, 560, -455, -244, -251, -853, -64, -287, -447, 237, -255, -73, 256, -426, 103, 27, -423, 294, 4, -31, 549, 2, 256, 482, -207, 303, 42, -356, 300, -144, -196, 344, -260, 90, 210]
1160B10n93N26k48l32N76n63J35N26o15N24J06m70O85l56k65O07o92J11L72o55
1180d11N31J0l34O46l29j68N40o34J53K32p11M54j03k86O09l61N1M47n28L17J20
1201B45p10O09j91k72N84m13J07L95n82L95J3n99O41j97r8N33m86K97L17n60L28
1222C56j38n75M21n12j18M61n02L39L08m56O32n0k34N98m61M4L78n49K63J38o19
1243b76M51k85l20N03n47J80M23m02N11J76m23N82l12k82M90o60J5J73n07L58
1263a52pm53O38l19k5N42m44L39K76m09O03p6l33M93n65j73K78p06J95Q0m53N68
1285a03k1j60O60l44n8L92o19K73Q0m41N86j55j98N11n09N0J86n94L48l9l19O70
1307A96j21O0O21m78N1J13o50J87j76m32N10k41J13N28m32K97J33n81L20k15l14
$$ y = [210, -383, 143, -105, -437, 139, -424, -289, 237, -378, 146, 252, -218, 467, 111, -154, 453, -239, -128, 244, -411, 120, 130, -204, 442, 113, -55, 485, -149, 4, 236, -475, -21, -124, -410, 199, -162, -111, 336, -192, 125, 245, -465, 144, -47, -319, 265, -148, -41, 354, -228, 167, 180, -419, 222, 25, -73, 460, -26, 271, 588, 28, 356, 218, -357, 64, -448, -566, -105, -607, -268, 40, -416, 216, 166, -68, 530, 69, 113, 491, -58, 205, 343, -276, 175, -110, -430, 73, -474, -294, 129, -273, 238, 414, -9, 573, 261, -21, 469, -191, -176, -3, -510, -152, -159, -612, 26, -293, -318, 224, -220, 119, 395, -14, 589, 513, 180, 673, 108, -65, 213, -493, -298, -218, -671, -103, -124, -284, 376, 32, -26, 366, -253, 20, 100, -341, 245, 90, -108, 403, -106, -56, 130, -464, -116, -155, -474, 196, 75, 135, 756, 278, 329, 442, -208, -21, -197, -629, -119, -360, -247, 281, -151, 146, 279, -302, 18, -197, -511]
1328e11N61l19J96N55m20L68N1n46L61m61l56M20l76K96M47l09N14Rm58M08o00
1349a70k12K78m61K14L78l57N96L7l04M48n48k25L00n78K87K82k11O49N3j80M76
1370G52n53j60J64p06J83J44k77O15L2j23M68m51j09Q3n70K09J1k87N97k1J37
1391A38M56l96J30M2p04K48j79k85N46j07J31N81m50K53L5n77J88k53l02M84k74
1412b95K57M58l63K33N5n36J84l75l06M51k12K13M86k01M21R6m02L32m62k52L12
1433I4m07J79L36l61M34j4l87M08n03k02K96m41K54L05k01N77jj98L37l70k13
1454g8J34n43J80J53l18M85Q7j09M79l64k3J92m45K63J7k84M34j03j15L98m97
1475e7M0N1n41K63j05k87N10jL7M70l10K04J35m55K00j40k67M07k59J5L48l54
$$ y = [-511, 50, -269, -73, 482, 62, 430, 481, -65, 296, -165, -521, -101, -477, -181, 266, -43, 471, 480, 22, 430, -170, -382, -104, -565, -351, 27, -330, 266, 303, -1, 447, -101, -326, -26, -604, -317, -35, -246, 403, 456, 276, 752, 199, 39, 203, -503, -320, -176, -453, 162, 194, 71, 539, 88, -21, 62, -508, -299, -288, -575, 22, 1, 138, 594, 198, 328, 370, -334, -86, -265, -550, -4, -111, 20, 601, 151, 404, 439, -138, 50, -203, -505, -21, -295, -38, 420, 57, 290, 345, -191, -7, -382, -688, -237, -449, -236, 250, 49, 470, 566, 164, 496, 34, -218, 94, -313, -134, 202, -159, 275, 261, -126, 282, -221, -423, -127, -568, -314, -9, -210, 367, 366, 168, 505, 135, -78, 56, -487, -307, -154, -472, 13, 100, -9, 470, 106, 83, 275, -170, 93, 110, -174, 260, 157, 42, 440, -57, -17, 34, -507, -244, -349, -636, -126, -127, -90, 380, 70, 274, 409, -46, 154, 14, -253, 154, -105, -90, 258, -96]
1497i6K34K0l68L22k07k41M47k76Q1L31l30K85J7l92L60k96k00L49l64J10M27
1518B13l75L34Kk97L34k42r9L15m42K35K51l32L55m8k33L32l37j7J63m67K31Q5
1540c9k97L31l7j53L89l31N6J90l25K75N2j92L41j06j48L25l68R7J90m61K33o7
1562d5k01L17j46q7L52k72J47J53l90K35n8k29L32k43o7L70l76K13R9l56L35q3
1584@j78L58k35Q9K51l13K76J1k64K52j91j82K83l52P0K21l28K75j0k56L40j96
1606g9j39L40l26J44J80l15K98J9j93L23k59j4K17l27J38J49l36L40j30r8L56
1627B88l50M5K53l79J62M6l17K97r4j10L50l26J25J45l34K70ll06L76j46r2L15
1649B15k65J43J70l72K52m3k23L23l06N3K30l44K05Q3l76L17r1k08K85k19J1K34
$$ y = [-96, 138, 158, -210, 112, -95, -336, 111, -165, -84, 247, -83, 202, 219, -173, 187, -109, -309, 40, -324, -214, 213, -162, 172, 174, -123, 211, -31, -130, 185, -257, -22, 229, -103, 252, 204, -29, 303, -34, -51, 112, -355, -124, -39, -336, -5, -42, -195, 194, -137, -81, 109, -216, 59, 111, -81, 260, 154, 6, 331, -37, 60, 250, -211, 22, -45, -246, 71, -75, -162, 190, -82, 65, 218, -172, 63, 5, -224, 108, -135, -202, 168, -208, 5, 104, -252, 83, 0, -178, 180, -55, 34, 285, -28, 248, 259, -5, 247, 56, -126, 157, -195, -125, 96, -232, 43, 33, -223, 117, -79, -218, 122, -204, -60, 120, -195, 103, 122, -71, 252, -7, -21, 196, -131, 7, 156, -180, 160, 30, -68, 288, -62, -17, 236, -143, 19, 65, -252, 45, -49, -159, 191, -135, -10, 135, -199, 71, 68, -238, 138, -8, -100, 215, -50, 93, 263, -109, 143, 100, -123, 200, -106, -53, 177, -167, 38, 121, -255, 62, -29, -237, 48, -171, -160, 74]
1671G4k60K22O3k11L31j54q6K45k67J7K28k97K17k4k49L84k49j08K84k67M4J21
1693E8k63K26j6k04L56j90r2K84l23J02J32l51K41k2r8K95j65OK75k89J89M0k71
1716h0K83j29j47K74k37n1K06l63K05Rk85M09k11p1L02k16Q9K16l39K93l3k93
1738a69L52k69n4K63l18K14J45l38L30j25r2L13k57j7K71k88Q0R1l31L10j84r2
1760a65K56l26J3K54k81K37O9k33L15p9n9K57k91R6J12l24K45o0j88K94j40n4
1782e2J70k38J62P3k70K21o2j52K81k09m4K37l06J82R6k94K29m3q3K29j34nK38
1805B26k98K74j2k34K23j05j46K17k73N2J36k56J95jj93K92j63K6J87k75J18J53
1827A43k59J99r5j59L21k34j7K13l12K29R2k86L31r5o1K85k05O5J29k89J15o7
$$ y = [74, -186, 36, 99, -112, 219, 65, -21, 224, -43, -26, 202, -95, 122, 98, -151, 233, -16, -124, 160, -107, -63, 58, -205, 21, 5, -199, 157, -33, -125, 159, -164, -62, 70, -281, -40, -62, -160, 135, -30, -24, 251, -38, 151, 191, -80, 203, 74, -73, 201, -36, -87, 119, -244, -39, -30, -315, 94, -117, -188, 114, -102, -13, 203, -136, 157, 124, -169, 183, -86, -140, 123, -195, 19, 164, -174, 156, 31, -61, 252, -5, -22, 249, -39, 41, 132, -199, 111, -73, -165, 91, -235, -222, 32, -249, -12, 57, -176, 139, 60, 1, 258, -33, 63, 175, -149, 96, 36, -152, 142, 2, -52, 118, -120, 42, 115, -155, 66, 4, -148, 133, -76, -120, 117, -189, -7, 89, -205, 24, -19, -102, 127, -7, -12, 226, -72, 202, 190, -44, 179, 74, -72, 145, -128, -76, 60, -196, -1, -2, -195, 97, -66, -40, 147, -128, -10, 143, -116, 83, -12, -171, 150, -84, -101, 112, -200, 29, 121, -165, 166, 71, 10, 295, 90, 155, 284, -5, 110, 43]
1849D3k63K74k14j44K72k57Q6K35k65K87J31k06K48j53m7K45l36J03Q2l16K56
1870F1j44j33K69k06QJ99j31J18J18j51K30m9j76K53l44j0J36l57R1N2k54L35
1892h5k1p4L21j65J20J64k27J78J8k91L49k77j08K28l14J27L6k87K44o1j48L76
1914A03j40J4K99k56J16N2k41J52j64j44K30k49L4K42k49K52R0k56K68p8p6J85
1936A84j86N5J20k46J59j4k08K08j08j44K24k62J41J17j65K24q0j33J90j14j11
1957a49K25k72K15M7j54K70p8q1K03k03J2J98l65J75o6j55K16j38n2K33k09J04
1979b4R3k47K79n7j56L12j53n4K35l15J06K1k50J90k4k50L40j60O7K82k28J47
2001A54J12l19K60r5j98J94k34o8K15k65J30J6j43K66p9n2K38j63J03J17k22K03
$$ y = [43, -220, 54, -160, -304, -32, -289, -203, 32, -233, 54, 185, -21, 227, 74, 27, 272, -64, 39, 121, -195, 61, -83, -216, 53, -153, -145, 54, -77, 41, 159, 8, 238, 189, 13, 266, -78, -88, 48, -309, -218, -166, -420, -85, -106, -180, 141, -24, 96, 260, 33, 211, 229, -62, 287, 10, -98, 130, -184, -57, -21, -308, -64, -125, -273, 103, -37, -23, 276, 20, 136, 188, -53, 99, -65, -209, 21, -228, -194, 48, -201, 51, 141, -115, 153, 75, -1, 184, -2, 53, 173, -73, 86, 72, -136, 72, -36, -180, 44, -218, -77, 40, -125, 99, 19, -114, 76, -38, -149, 76, -196, 19, 66, -88, 182, 104, 23, 226, 23, 35, 233, -132, 43, -23, -178, 38, -100, -152, 81, -128, -24, 69, -178, 101, 44, -112, 200, 47, -7, 228, -87, 19, 40, -210, -20, -44, -294, 46, -114, -47, 235, 7, 154, 266, -53, 207, 112, -86, 108, -126, -194, 21, -244, -114, -98, -241, 25, -54, -106, 132, -31, 72, 189, -33, 170]
2023A70m2k24K58k18p5K50k63J28N8j84K05j0j71K63j79j7J90k31J03Q5k47J41
2045a0m7j27K78k34P1J60k16J51N0j36J93j47l6K73k51J38Q0k38J46lj16J88j82
2068a5j88K49j92OJ74k14J86K5j44K72k14J5K23k33R9K6k53K38o5j92L07k61Q4
2091f7J79k70J85O0j94L25p2r8L03k82j2M9k89P4l1j96K15n6K4K38r7J20M6q0
2115G4J88q6j01J47j91j43K23k52M5J03l03K03p0kK41j04J03K47j61J15N1k69
2137E8Q6j45k09R1k38qK03j73K03J34j24L02l6N6K08k28J32Jk03M1j04k76J82
2160d7k82j7J11j17J35J60j13L82l5nK61j99k1N0k20n8n6k91J90q8LJ84p2J22
2184b3J85j41J72M3j30K22j88l8N5j47n6N9l19J19m1j05K37n1j7K91j16Q2J50
$$ y = [170, 128, -96, 162, -56, -131, 119, -144, -16, 42, -142, 63, 53, -118, 145, -34, -51, 139, -92, 11, 96, -151, -10, -57, -184, 94, -140, -69, 91, -125, 26, 76, -60, 133, -14, -50, 223, -28, 110, 190, -48, 98, 95, -21, 167, -15, -203, 46, -146, -140, 34, -180, 6, 31, -113, 159, -55, -40, 183, -50, 49, 75, -178, 60, -5, -197, 110, -151, -67, 112, -158, 27, 87, -107, 218, 146, 48, 351, 69, 57, 106, -183, -109, -140, -336, -121, -177, -153, 85, -12, 108, 154, 74, 262, 176, 75, 222, 31, -112, 111, -141, -96, 7, -296, -93, -163, -165, 76, -28, 75, 322, 161, 276, 327, 58, 144, -1, -210, -119, -357, -365, -162, -335, -132, 2, -122, 180, 144, 200, 408, 180, 312, 313, 110, 151, 47, -229, -47, -329, -346, -235, -352, -217, -57, -170, 212, 177, 172, 433, 234, 213, 263, 43, -15, -71, -362, -172, -260, -257, -73, -145, -23, 162, 21, 193, 236, 106, 328, 140, 102, 157, 10, -46, 13, -306, -187, -228, -333, -96, -147, -164, 127, 11, 93, 243]
2207B43k10J52j50j45J73j64L4J53k53K30%j62K32p3j09K24j64j5P8j54O7Nj27
2230a35K01r5j03J88j60Q7J29j67J80l0j48K29j91n5J47k06O2N7j13J70o9%K26
2253B04j08L1J42k72K2Q7k09N7n2o1O9j17P2R7j80J73R3p0J89m1KJ22j21j1M1
2278A59j96Q1j12j66J60j10O0O0q4J47J34j82J65m4l4J07j04o0Q0j94R8N1k27
2301b11J60o4o6J99j25J18J30j32J56%n3J13p2j30P3j58j7R4k18J04N9j49K52
2324F3r8q5J64r5J10K3j44J45Qj35J13j31j0J09j82O2O3j22J58L0l5K05j49L9
2348A06P4j29J4p2q4L2l4n3J48j81J18L3j58J80%p9J90r3J6J99j23N2N7k09k1
2373a7p2j30J33j21LJ78o4J61M2j09J95r0r7R1o4p4J15k11L1M0j35J48j17l8J37
$$ y = [243, 33, 185, 35, -110, 63, -101, -67, 86, -167, 63, 63, -99, 133, 60, -49, 175, 11, -4, 74, -80, -13, -8, -135, 66, -29, -132, 56, -104, -17, 112, -55, 125, 95, -53, 176, -15, -70, 77, -129, -67, -10, -123, 47, -22, -22, 204, 96, 127, 269, -3, 19, 106, -103, -46, -98, -159, -90, -207, -135, -38, -218, -45, 48, -22, 167, 126, 128, 250, 129, 118, 159, -37, 44, -68, -234, -74, -184, -124, -64, -148, -1, 133, -49, 116, 72, 38, 145, 41, -19, 61, -133, -35, 16, -211, -51, -115, -181, 18, -107, 11, 141, 9, 165, 165, 112, 225, 153, 23, 96, -62, -79, 15, -203, -99, -40, -189, 63, -35, -120, 44, -51, 59, 82, -62, 83, 91, -44, 69, -62, -72, 37, -145, -83, -20, -142, 16, 46, 11, 216, 67, 106, 180, 51, 65, -7, -91, -59, -93, -146, 2, -179, -61, -28, -186, -6, -6, -85, 105, 12, 28, 227, 104, 156, 213, 4, -17, -89, -219, -86, -207, -204, -26, -90, 71, 113, 4, 199, 109, 12, 103, 39, -35, 80, -131, -100, -60, -195, -47, -164, -202, -65]
2398f5r7J10J64j02J80Q4j27J21j35o1m5j66M4kj36R5O6n6J47o6L6J10r5P0m7
2423B7q6J86j6m0M9q2n7Q4k42R7l4n6J62KPJ24j12J89nj75P2l7j51J20o9o0J43
2450D0j27M0P8k00J69n3r5J37n3N6J55j19J11K5j33J08j18n5Q7j38lL9k6R3K5
2475D3j05J54n7p9J53j72M0M3m8J14Oj07J52j42l4P0j74K8J02j29J37P2m6J45
2499A66j29O4L6j56Q4m7j39J07n4r5J62o4j7J20j06P5j7K1O0l3N8L4n8J4k1k25
2525a60J65j62m8J09o7L2K17mJ26L9j23P3p6j08O5j79J3Kj31J7Q6n6KP7L2J56
2551I7j17J01R5m8J37l9j70Q0j54j19O3j59L0P3j17K61QQK08q5NP1j62j3j2j04
2577f2k8oj5P4j15qJ02j03R7P4q7J65K7m3J93j82J0M9k31M1o5o8J28k5K9K04j18
$$ y = [-65, -162, -52, 112, 10, 190, 274, 147, 268, 133, 72, 27, -139, -95, -97, -233, -138, -72, -128, 19, -47, -11, 99, 4, 74, 27, -59, 127, 111, 71, 120, 38, -19, 65, -177, -80, -114, -170, -8, -6, 1, 125, 13, 202, 197, 22, 94, 57, -94, 26, -43, -103, 40, -87, -47, 31, -169, 0, -53, -148, -11, -64, -8, 147, 28, 139, 164, 31, 139, 21, -34, 53, -85, -88, -49, -75, 18, 43, -62, 92, 35, -44, 109, -63, -23, 20, -28, 86, 92, -15, 137, -5, -39, 31, -143, -115, -13, -142, -5, 67, 21, 166, 37, 101, 137, -19, 65, 18, -121, -14, -68, -163, -1, -65, -82, 38, -68, 7, -10, 11, 71, 38, 96, 130, 72, 86, 65, -160, 5, -157, -205, -96, -163, -131, 86, 82, 208, 247, 124, 197, 121, 13, 78, -101, -88, -86, -217, -200, -114, -170, -168, -91, -59, 97, -20, 81, 176, 128, 265, 226, 56, 136, -18, -137, -74, -233, -203, -130, -247, 14, 22, 30, 238, 153, 158, 229, 67, 54, 42, -62, -90, -96, -111, -37, -152, -160, -58, -161, -64, 10, -77, 88, 115, 72, 265, 83, 93, 142, -89, -48, -113, -181, -53, -78, -49, 155, 37]
2604C7P2J0j46M2r2j16Q1q2N2R7k3R6P1j02J66K6j45J18j27jJ06j73N6m8j71L0
2630a66j02m9J54l1P4K38N8J43M7q7P7j38k15n8j74r8L0j62J72O7M1K46j1P6J48
2655B80MLO5m6M4j18j46n0j55j90k8k09L2M9K5K61K49N2K86L7L5J7j95j08j30
2680F4l08L2j07MP0j6P2J09r9J03J11K4J94J7K6J38q6q3J9l54p7j79j95Q9k6P1
2706c87K82J9K60J34m3R6j15j29J0j37J6J2n7K9M3j24J10q9j22M8l2O5R6N9J20
2731A64P6j0Rj16j26%k16j8O8m3J94M7L6J84j11q0K5j38q6O6q9Q2M5L4K03j01
2757I9J1m6j09n8R0j64Q8kN7J59j00L8m1j08nk4m2J04OM5J44N0M5Mj50j3j27j03
2785a52k8k0l0J77m4M7J43k8M8q8j22O8j14K6J69o8P6M7j13M7q4j09N7n4J0J21
$$ y = [37, 109, 119, -27, 15, -77, -193, -112, -194, -142, -45, -68, 28, 99, -3, 163, 189, 44, 162, 35, 34, 140, -33, 23, -25, -196, -166, -268, -317, -163, -194, -120, 118, 176, 319, 366, 279, 356, 218, 3, -55, -229, -327, -297, -459, -287, -220, -179, 67, 56, 132, 280, 284, 287, 352, 306, 350, 232, 86, 36, -119, -309, -337, -546, -514, -465, -440, -179, 70, 122, 408, 445, 480, 497, 302, 194, 64, -244, -212, -319, -315, -245, -261, -189, -80, -179, -76, 35, 59, 253, 270, 296, 434, 348, 265, 284, -70, -147, -326, -521, -432, -458, -387, -105, -86, 174, 308, 265, 361, 246, 117, 127, -10, 6, 18, -39, -10, 33, -91, 19, -70, -192, -144, -176, -111, -15, 44, 164, 240, 230, 239, 123, -3, -3, -219, -237, -169, -212, -18, 29, 65, 249, 138, 58, 83, -55, -141, -75, -164, -82, -37, -3, 200, 99, 110, 64, -45, -103, -13, -177, -89, -91, -34, 125, 25, 63, 22, -86, -91, -115, -157, -53, -47, -2, 142, 192, 237, 241, 91, 78, -49, -152, -180, -200, -230, -53, -97, -50, 93, 65, 113, 25, -97, -29, -143, -117, 52, -16, 60, 107, -6, 41, -43, -152, -95, -149, -139, -18]
2811a8k3J59M0j8Q6q2j04L6j23m8L4r1R5J2L3J09r9jM7j07L8K6j28R3K5lJ51o2
2839G7j4K7j20jk7j12J59q5O2J09l5J9L8r8J9n4n0O6r7M5R9q8J22M8j11M0j13
2866g5k1J14l0mP7o4N0J32j75O8n4j30R1n8m0Q3n3O1P7l3O0k5q7J35j50k0J16
2893D5j31M6K5r6J30lq4Q2r7N3K4l6M6Q2K9M7r2k4Ro8Nk2j11L6M7l0J41n4j8R1
2923G2j07M4k0q9J33o8J0J20r2O2O0k36J85o3m1Q1j18O2M0l3P0J4o2JLj04J04
2950B8j07O5J7nM3K2p4M0m2j12J05j20K5J26l3R7N6j50O9l1J7L6j37K0Pm2J11
2977C1K9j18J34j20k5P3n8o1J06p9J57K2o8P5k9k1n3j66oN5n2J56Q5j1N1qL6J1
3005A46o4l1m7j64Q6l1qO1J4m5K9l3L2M3k2Q7O3lJ15j4n8%j64r8j07j35K4J4J15
$$ y = [-18, -41, 118, 158, 140, 226, 144, 40, 76, -47, -95, -61, -152, -57, -45, -12, 97, -2, -3, 44, -63, -25, 1, -127, -34, -9, -12, 139, 77, 63, 90, -30, -31, -58, -170, -11, -96, -34, 75, 40, 59, 97, -1, 18, -36, -86, -20, -117, -72, 27, -61, 61, 109, -2, 38, -75, -96, 18, -12, -16, 61, -3, 47, 179, 4, 72, 18, -112, -21, -79, -119, -36, -89, -28, 49, 16, 76, 51, -36, 99, -51, -71, 45, -86, -40, -15, -111, 19, 16, -68, 14, -83, -30, -6, -42, 4, 86, 115, 162, 70, 46, 55, -13, -8, -30, -141, -105, -58, -88, 53, -1, -19, 72, -35, 9, -11, -100, 33, -35, -25, 95, 3, 65, 125, -111, 74, 11, -30, 51, -67, -5, 35, 2, 72, 86, 24, 25, 28, -76, 28, -79, -14, 3, -2, 41, 63, -11, 29, -13, -125, -20, -140, -115, 11, -22, 75, 131, -19, 50, 19, 36, 72, -65, -45, -38, -80, 31, 60, -58, 76, -44, -69, 4, -54, -115, -9, -88, 69, 91, 23, 98, 69, 48, -5, -171, -177, -122, -174, -18, 67, 56, 107, 99, 135, 146, 82, 51, 4, -160, -74, -105, -113, -52, -38, -83, -54, -87, -55, -12, -34, 53, 116, 113, 228, 214, 156, 156, -8, -106, -213, -348, -324, -310, -195]
3034a95J31J01J38J14m7P5j30j26J6j08m3Pr4J2oj03N1Oj45J40O8J07J39J58J05
3059C71J02p7n1j29k56l0l39l1L2OJ87J18Q3J66L2m5R8o1m6jp8M8j2n1O9j83j22
3086b00Nj74j4R3P4J23J33J06K48J4l4k3k46j36o0j62L5J1J9J27J2Q2L3j05J6
3111b3l1m3K4lJ39O4mO6l1j18K4r7j20P9k4%R6mJ67Rj12Mj06j36L6p9qJ41P6J51
3141A37J21p7O7p2n2r1j72m5on6R0Q7n9J30J4k4Q5m5L0J21l3P9Pk1l0j13j17p5
3169a20k13mm8m2J74R3J71K10K6j6Q6j47Q3q1j73kj25n7N7p0pN7j35J78N5M3J06
3196I9M3N6R6q2L0%j58p2n5j84L6j58J7J15N3L1J76J4Q2MK0R1j30J5j7r9l1m2
3224e0j10P2r6J6N4l4P5J52p5J7P3J4M9o0o3P6j04M9q6p1L9j4m5L3QN6j3J3N4
$$ y = [-195, -64, 37, 175, 289, 242, 317, 187, 61, 77, -31, -74, -67, -161, -149, -155, -258, -207, -201, -346, -206, -138, -31, 108, 266, 371, 473, 396, 345, 216, -40, -70, -409, -440, -408, -402, -215, -97, -14, 152, 184, 139, 237, 176, 130, 129, 51, 99, 87, 36, 105, -78, -200, -195, -369, -383, -290, -216, -93, 40, 146, 394, 408, 374, 351, 105, -31, -91, -253, -218, -207, -188, -61, -49, 33, 66, -39, -23, -54, -97, -73, -76, 63, 127, 123, 189, 158, 40, 64, -33, -153, -74, -98, -98, -2, -6, 161, 170, 58, 62, -44, -180, -144, -223, -231, -90, -14, 137, 258, 181, 248, 176, 124, 33, -139, -184, -190, -246, -156, -69, -128, 2, 16, -8, 77, 32, 62, 183, 150, 229, 236, 215, 185, 72, -45, -120, -333, -337, -385, -427, -253, -160, 11, 221, 247, 231, 317, 170, 253, 172, -1, -3, -128, -185, -128, -198, -205, -148, -283, -105, -50, -7, 99, 142, 198, 294, 212, 242, 242, 84, 12, -43, -227, -191, -349, -332, -217, -164, -133, 43, 57, 139, 143, 163, 254, 124, 139, 122, 23, -8, -50, -160, -88, -184, -168, -114, -148, -73, 79, 4, 21, 94, 108, 157, 97, 34, 110, 6, 55, -31, -102, -63, -77, -122, -89, -81, -25, -38, -25, 29]
3253B9Q5j07J00k1r8N1o9rP1j04L8O4r4R4j03k1M9j64N5J14N0K8J3j3M9j4o6M5
3281E2r7M9M0j28J01L5q6J20j17M2pp0j0K2l6J07mj8J11l2j01R6j20L9m4p8J26
3308hkm1J13p8P1Jn0nQ3j25N5p1J05l3J3l3J8n8P2l0k2j0m9K1L4K7M4Mo8N2k7
3339Cj8K4n8N9L5p3M3k4L3M0K4n7k4o7K4JM7Nk0j2K3mj5K6j05K5P5Ql2L7o2J01
3371F2o3k0J25j43P4j4q8L9m6rQ7Rm1N8q2O5P3o2K3r5k6N0o3K0N7n2N3L9j3J9
3401C6n2j6K8L3l5Pm0Q6N7p2j0n9KL7r8M8j7o8J38k2N1M2J8k3k7q3L3o5m4Q4q8
3432a19J02N5n9M0M1n2K2q6NN9J00p1Q8q9K2K4j21p0mq4L9lP8J02l3J00N2n6m7
3461C5mj1N1j33k4J07m6M4Ml9L1o2m0ML6QR7l0R7L3p7Rj13J5n3j12K2J16p1R7
$$ y = [29, 114, 7, 107, 86, -12, 39, -30, -39, 32, -72, -34, 30, -64, 30, -73, -94, -45, -209, -154, -40, 10, 38, 51, 38, 87, 73, 7, 52, -45, 4, 44, -84, 17, 52, -34, 86, -31, 11, 4, -66, -76, -54, -90, 17, 13, -5, 106, 74, -27, 69, -51, -12, -56, -134, -8, -10, -51, 62, -16, 55, 56, 6, 1, 84, -41, 14, -57, 48, 15, 28, -5, 13, -45, 27, -3, -25, -35, -84, -63, -29, -2, 42, 46, -22, 30, 3, -15, 9, -49, 10, 45, -28, 15, -9, 24, 64, 88, 31, 7, -60, -36, -35, 12, 17, -3, -15, 8, 4, -11, 15, -90, -65, 10, 18, -14, 23, -39, 62, -1, -21, 104, -39, 35, 21, -67, -28, -74, -83, 4, 13, -28, 30, -52, 13, 86, 24, 47, -48, -74, -24, -87, -67, -10, -62, -9, 30, 17, 36, -16, -32, -4, 29, -6, 1, -39, 47, 104, 32, 22, -37, -35, 2, -96, -48, -65, -133, 5, -17, 34, 76, 94, 71, 44, -39, -6, -71, -115, -31, -119, -17, 38, -21, 19, 60, 8, 30, -56, -51, 8, 108, 37, 125, 36, 58, 82, -39, -109, -113, -197, -158, -161, -83, 19, -14, 86, 138, 82, 35, 31, 20, 71, -62, -86, 21, -25, 19, 23, -16, 15, -47, -87, -83, -47, -39, 58, 28, 125, 158, 81, 90, -23, -8, -61, -173, -151, -35, -106, -9]
3491iO3k2P1m4K3k0q9J6Om5j2J18j0L9n8k0L7m3j2m0k5O6j4K2L8ko3N8j46O9L6
3522a2p8J49jl0R7Pn0Qp0o6q9nJ2k8J5P4M6qO8j2J37k1m1Qqm2qo5o9l7j05J8J6
3555a90l7N4J08O4J22qJ30n6MN1q6r0k0r1j3k1j00j4k3PO1J7M7J78j7J67K2k0
3583B46Jp0j02k6j31j22l9k7O4O8qJ17oQ0N5m7P0m9L1K6K8o9k7m5q5k5r8o2QL3
3613b11J08P3O8J09j0N7j1j09m4m0k4NJ8K1J5k9N8k2r0j3L7p2jM5M4J15%J2M9
3642A58j24k2k5n4k3kJ4J13K3LL2r5km7n0P4j31Q3Q4LJ47K0l4M7l9j49%j20o7
3671a83R7N2L4j1k4P4o6j31J29n7K7J06K7P8K8j4N7j09n7q9j65l5N5nR0P6K6J26
3699A36J3o2P9j17n8K3r7N8M7j8K5l7m2O5j48K9n2K2J04QN8Q7pK3j6q2j6p8o7
$$ y = [-9, 54, 32, 103, 59, 82, 62, -27, -11, -5, -50, -62, 56, 46, 85, 27, 7, 44, 1, -11, -51, -76, -10, -24, -2, 36, 34, -29, 29, -117, -48, -12, -90, 59, 58, 28, 125, 132, 82, 90, 20, -46, -135, -140, -128, -156, -141, -67, -21, -29, 39, 27, 164, 143, 102, 110, 102, 60, 52, -13, -82, -119, -224, -206, -190, -227, -173, -65, -1, 121, 113, 243, 187, 191, 242, 156, 66, 46, -45, -58, -79, -179, -193, -216, -209, -148, -131, -84, 94, 77, 244, 266, 246, 247, 177, 75, 49, -82, -204, -243, -270, -206, -138, -146, -29, -35, 45, 100, 53, 123, 74, 105, 131, 159, 90, 63, 18, -67, -92, -190, -252, -244, -211, -103, -30, 38, 147, 137, 194, 183, 74, 30, -10, -34, -29, -11, 10, 25, -4, 54, 32, -58, -71, -34, -106, -107, -62, -18, 97, 97, 109, 158, 34, 12, -13, -67, -90, -92, -78, 35, 58, 61, 93, -2, -4, -51, -101, -27, -158, -75, 9, 12, 159, 179, 145, 192, 153, 4, 4, -116, -183, -86, -34, 0, -11, -35, 39, -27, -158, -29, -86, -59, 47, 74, 152, 180, 166, 223, 114, 57, -32, -197, -232, -177, -182, -92, -16, 10, 136, 149, 87, 166, 49, -9, 14, -83, -25, 22, 4, 29, -8, -50, 15, -133, -104, -156, -134, -30, -22, 36, 123, 116, 139, 123, 41, 25, -53, -120]
3728a20K9m6J3P9O5pJ7K4l8K1r9N7l6KP8k2R2k1k6J1n9q3J0o4K5J03p1O8P8l8
3758D2N3J0j67Q1m5l7L9j8Q2m3j9J1L6k3K5l3r0M7j5P6j8L6K7RK7J7j10ML7l4
3788Gl6J2j2O2Qm6K9m6NM7r3L9rk3R2l5j7O3o3lQ9r8j5ml0M5K2MM8p1J06k2p4
3821a9P8l8j5mPj5K3n4l5J15n7O3n4J6L1j04L6N3l0K7j3j7M6m1j8Mk6L4l4PK2
3852a2lL0P6n6j8L5j13N7j3k3P9q2P4oj8j1M4m4J3k5k4K0L1J0k9M2Qm8o4N1l3
3883e2p1J14PK3qK3JKn7pN1j22R0k3J0M4k6L2n2m1P7p0K3P3j05J26oJ8J8k7l5
3914C0j2p3L4l0nK8J8L3OJ2J9Qr1K8l6j7P4K3q6N3%m3l2k2l2P6m6LR5k6M3k5P4
3947H1mm4n0j3n5M1j0kL2L9q0N5k1l1L5rM4K0l1J14n4K5P0r2j43N4j42LJ05n0
$$ y = [-120, -91, -137, -124, -45, 20, 13, 30, 54, 16, 37, -62, -5, -41, -39, 39, 17, 109, 88, 62, 73, 14, -69, -59, -123, -98, 5, -66, 2, 80, 42, 95, 105, -62, 19, -26, -63, -24, -42, 40, -3, -22, -11, 25, 2, 27, -6, -96, -49, -64, 12, -6, 30, 57, 66, 93, 110, 0, 4, 41, 7, -29, -17, -29, 33, 41, -5, 24, -22, -17, 30, -63, -24, -33, -56, 36, 1, -16, 47, -16, -19, 70, -28, -43, -47, -77, -32, -10, -6, 42, -29, 77, 55, -19, 59, 21, 6, 2, 9, -6, 17, -37, -72, 43, -14, 49, -5, 11, 42, -62, -26, 27, -3, 24, 11, -6, 40, -1, -19, -15, -41, -7, -41, -34, -12, -15, 15, 91, 35, 17, 52, -61, -4, -17, -40, 39, -43, 31, 25, 7, -4, 40, -4, 9, -16, -40, -20, 11, 21, -8, 34, 42, -6, -70, -19, -52, -123, -9, -2, 21, 13, 36, 37, 39, -18, -25, 26, -96, -6, -29, -19, 25, -1, 31, -21, -62, 15, -55, -32, 41, -64, 62, 56, 74, 92, 65, 30, 18, -55, -21, -51, -56, -28, -10, 23, 29, 41, 60, 68, -23, 5, -31, -48, 26, 49, -37, 16, 16, -27, -59, -81, -113, -37, -83, -80, 15, -11, 32, 7, 81, 77, 33, -17, -30, -85, -44, -54, -56, -24, 15, -65, -10, -31, -62, -27, -36, 8, 28, -3, 111, 57, 82, 152, 60, -83, -29, -171, -168, -63, -113]
3977a13Q9N0L0M9k7%p3m4M1j53Q4N0PM9%j5kj00Mj6M8j9O3j4J40L9j9o6k2%j18
4008e8J7p1M0lN4N4l9J00o6p4M5j10m2M0J2P1K7P6L1Nn7nr7J5o1l7J52l0R2J5
4038I6l5j5Ro4p8M0r4O4O2RJ75p4L5o6p2r4m8%lQ7m5Q8K3J7J20l6l5M0j41J1M2
4069A8l3O7m8L0l6l3n4J3j01J0J1N9J26J8oR8K5J7o7q0n6m3l9kJ7jQ4k8l0R6k8
4100DK0n3K2K1k0R3Om9K0rn4j6q5j11R4m5Q3O9m7J23J9k4n3p3J20Rj00N2Ln3M5
4131A1k4M3m9k9ok2l3K6N5QR8m9M5oqm8j9m7J3J3k1L9l1OR4j50J02jo5L9J1j8
4163b3K3M4pM7q5J2L7p3L3q0J5M4o9O0L9k5Ql5R0m3K3o6k3L1R3l6n9J27r6OPp7
4195e8R8p4l4K9L2K7jl2LR1l5nrn4Q1o8m2N6Lm6N0m5N0m3M3n7NN9l0J8NjN0n8
$$ y = [-113, -24, 26, 56, 105, 78, 78, 5, -39, 2, -151, -67, -17, -10, 39, 39, 24, 22, -78, -74, -90, -42, -61, 2, -12, 128, 167, 148, 82, 60, 60, -58, -41, -112, -72, -75, -21, 33, -6, 94, 28, -46, -1, -111, -153, -113, -101, -30, -3, 73, 104, 109, 52, 47, -50, -35, -96, -133, 19, -11, 81, 96, 61, 46, 55, -9, -87, -47, -141, -77, -15, -6, 169, 95, 130, 64, -8, -102, -150, -150, -153, -66, -111, -23, 0, 17, 137, 101, 66, 106, -35, -24, 18, -15, 52, 4, 34, -2, -35, -89, -76, -177, -167, -156, -97, 29, 47, 41, 139, 164, 181, 114, 34, -22, -65, -104, -106, -89, -90, -6, -34, -64, 32, 4, 24, -29, -7, 14, -6, 87, 93, 44, 64, 55, 1, -15, -100, -211, -117, -162, -79, -10, -57, 66, 85, 61, 8, -65, 55, 64, -36, 16, 19, -34, 11, -13, 30, -19, -48, -54, -76, -109, -83, -28, -20, 78, 29, 74, 68, 60, 12, -7, -54, -41, -28, -49, -10, -41, -35, 59, -91, 11, 10, -55, -16, -5, -23, 0, 44, 37, 84, -1, 11, 48, -25, 8, -72, -57, -13, -82, -22, 17, -8, 0, -35, 55, 12, 35, -31, -54, -23, 70, 34, -25, 102, 6, 12, 19, -58, 40, -34, -68, -39, -7, 20, 19, -13, -10, 81, 46, 41, 32, -22, 59, -9, -51, 5, 8, -38, 12, -33, 17, -26, 17, -40, -35, 24, -6, 12, 17, 16, 66, 8]
4229HL4j5o9J5j9lorN6L4PL1o4J4Qm4J3j1N8l3l6Q4j8m8O5m8j1J8o7N6K4n2L0
4262BJ3m2L0m7k0P4m2%O8q6P1m5PP6j7qJ6j09N5m2L6qN7l8L5k2QJj3l2O7n2K0
4295A3m2j7Q3l3k7j0k7J6K7l5M9k5J08n1n2L8j7m8M6J2p1N8NK1O1j36P9J0n0N
4325a0m2pN4loM0k2M4l9j0n9rJ06p9N7J6k5K2L6j8o9L6p3pM7k8K7J5L3J6J2n9
4357dnK5o5J8NM6Ln1Q6l6l7J2L2n6Kl5L8O5oJMNOo9n3M2o7Q2JJ0Kl0L7LJ6j7m4
4394c4l7M4KkRM3j8pJ0j6oJ8J0j2M0n9j9L9O2Km0K2q5J6j8Kj0N9OK6m6L5o8N4
4428B2om4L1l9J4N4k1j2M2K3q6l5l5N9k8M5K1P2n1M0L3j11Pl5PM6l7M2J1o5N4
4459A8q7K2L2m4K7K2L1j4K6l0k8P1j7j6m4K4k6k3Q7n8j6M3J6NK7k8kl0J2j3rq
$$ y = [8, 42, 27, -42, -27, -46, -49, -55, -64, -8, 26, 33, 64, 0, 14, 22, -22, -9, -20, 38, 5, -31, 53, 35, -13, 52, 4, -7, 11, -56, 0, 24, -28, 2, 15, -27, 3, -44, -64, 10, -32, -32, 36, -50, 21, -24, -17, 59, 42, 34, 50, -59, -4, -46, -10, -18, 39, 1, 36, 14, 22, 23, 10, -22, 45, -7, 13, -29, -46, 37, 4, -23, -33, -60, -44, -17, -52, -3, -28, 80, 29, -23, 15, -2, -50, -4, 8, -63, -5, 0, 21, 82, -54, 25, 35, -15, -10, -52, -59, -5, -8, -14, 26, 4, 48, 9, -1, -60, -69, 37, -42, 15, 31, 6, 28, 64, 46, -23, 13, -60, -67, -20, -48, -21, -6, 27, 43, 55, -4, -9, 16, -49, -31, -26, 20, 23, -28, 58, 22, -15, -3, 29, -27, -25, -60, -22, 43, 37, 38, 42, 47, 53, -16, -69, -27, -94, -12, -11, -1, 1, -29, 8, 11, 27, 10, -34, -71, -27, -25, -27, -18, 25, 7, 0, 10, -6, -12, 6, 16, 4, 44, -15, -34, 5, 67, 69, 29, 51, -34, -18, -36, -34, -44, 15, 21, 47, 1, 36, -32, 22, 16, -28, 3, -36, -22, 32, 11, -1, 41, 64, -22, -57, -92, -33, -61, -16, 5, 77, 26, 66, 99, -12, -5, -40, -33, 13, -24, 18, 29, -36, 18, -69, -47, -15, -59, -32, -10, 21, 7, 33, 3, -25, 46, 29, 13, -31, -7, -33, -56, 31, -27, -43, 0, 16, 21, 48, 20, 18, -12, 0, -13, -22, -30]
4491c0M0Mk5J5K0k7J1l2K0j5L4rj4J9L4j7Nq0kP7n5JJ1nLL6p6O2q4L9K7o6J8N4
4525gj9K9N3o5L5Nk1L4k8l1N3l3J3L6n9M4nq9K3J7KK1J0k9J8pM0k6j9pp4J7L4
4558c5O7K2p4K7qk9mK3l4QK6Nj8O6m3L6n8N0p1k3L5M8Lj0m9P9J0k1kKj8l0K1j
4592@pkj2L1OPl0kL9m3j2P4K6p9Q8j00L6N6j04Q1q1k2O2K0m0j0Ok7J4J2L7l7N6
4625D3p5M1%l4M3qj4J6J6j3Ppl7L5jn2K3M8k4L0o6kk9M1jN2n5J8L6n9J7J6LK5
4659C3o4J9%p1P8K6m1L9m7N4k4K8K1l0k4rP0j11Q0n6M5qn5QR5l1q1O2k1K9j5k
4691cK0m4N5L6k6m7K7K0m1m1N4n3PPO3LMm5J6N0l7p6RO6Omo8R4m8k1K5m7P0m7
4725a6o%j2qQ4r9P0n6Q5l1m6PL0JN3k9r6P4KK4o5N6k4l4P7k6Kn3R0L2o5M2n5m2
$$ y = [-30, 10, 14, -11, 4, 24, -3, 8, -24, -4, -19, 15, 6, -8, 11, 45, 28, 33, -47, -49, 28, -27, -26, -15, -20, -17, 19, -57, 5, -79, -40, -13, -79, -61, -7, -26, 3, 56, -9, 26, 31, 10, 44, 16, -15, 38, 5, 18, 54, -5, 39, 34, -55, -32, -15, -13, 8, 18, -11, 7, 0, 40, 14, -5, -12, -86, -69, -35, 32, 54, -20, 7, -1, -30, -34, -11, -45, -37, -11, -6, -24, 42, -1, 35, -23, 27, -44, -67, -32, 16, 19, 9, -40, 39, 49, 28, 26, 28, 10, -20, 1, 0, -7, -9, -21, 10, 16, 23, -7, -9, 30, -13, -25, 49, 75, -4, 84, -16, 20, 76, -28, 53, -28, -50, 12, 32, -8, -18, -12, -39, -25, -13, 24, -13, 43, -32, 9, 9, -25, 18, 10, -4, 12, 28, 15, 22, 15, -22, 13, 12, -40, -17, 31, 7, 37, -29, -31, -60, -19, -20, 32, -23, -5, 31, -28, -11, 5, 8, 33, -31, -12, -12, -83, -5, 21, -20, 19, -28, 26, 2, 30, 51, 21, -3, -12, 58, -53, 27, -29, 16, 8, -47, -39, 56, 25, -56, 6, -15, 14, -1, -3, 17, -27, 28, 64, 38, -9, 18, 38, -3, -44, 10, -43, -36, -29, 34, 37, 41, -4, 12, 62, 25, -51, -42, 24, 30, 26, -42, 52, 4, -17, 8, -39, 31, -16, -22, -22, -34, -42, 42, -57, 13, -43, 42, 11, -35, -28, 2, 3, 56, 27, -69, 5, 7, 31, -34, 22, -2, -36, 41, 15, 17, -36, 54, 86, 21, 63, 8, -34]
4759c4L4kJ4j3k2mJ9LJ2J9n6L6k8m5J03r1P6k9ok5J1j6K1l%O5o8O3On1J5kK3m0
4793a5M7lj6Nj8M2Nk4m9LL1k1rL1k9P9n9k9M5l0m7J37m4Jj3M0J8p6%L3l6K4l2
4826iPK2OPqo0N8o1J0O3l6Qj4M2J1j6l0PJ9n6J1j5k2N8p3O2j5L7KK0o1M4Np9N6
4861@Rn7J03j5%m2l6P8o6J3k5K6J8j5M7n3M5kJ6Om3j9J1nk3L3j4J2j4J0k3J6l0
4894c9K5m5K6L2j4R9q6Qkm9L5j4J4nMO1m8L4L8m0mJ7m1J0k2l2L7M2k1l8qO6ok8
4928FP0q9L7p8N7K1m0j2K0L4n6L5q7J4P2oK5oJ4j9o0P7J7n4rK7jMm0oQL6n9N7
4962IJ5l7Pk0Kj8O7n6M0k6M8k4Pmp2Q6Rk7l2M8k2QJ7k8kok7L5m4J8n0K5P0k2J9
4997A3QLJ3k5m4N6J8j8JJl8J2L1m2K0n3J6L4kj4J00o7lj0K3n3K5Nm7j9N0p0O3
$$ y = [-34, 0, -2, 12, -1, -23, -27, -8, -5, 7, 26, -30, 6, -22, -67, 36, -55, 21, -8, -14, -39, -28, -44, -23, -26, -26, 39, -29, 34, 40, -11, 4, 2, 25, -15, 32, 29, 13, 18, 0, 42, 47, 23, -26, -23, 8, -13, -22, 9, -20, 59, 0, -29, 16, -14, -61, 76, 32, 33, 20, 60, 78, 2, 2, 35, -1, 23, -9, -2, 20, 26, 33, 25, -35, 23, -38, -28, 35, -1, 7, -7, 35, 46, 30, 0, 7, 26, -30, -19, -34, -56, 2, -71, -9, -24, 13, 15, 35, -26, 18, 23, -56, 0, 9, -48, 55, 40, 40, -2, -38, 40, -26, -13, -38, -12, 6, -9, 38, -15, 30, 28, 44, 50, 7, -12, -1, -6, -29, 4, -10, 2, -12, -2, -25, -9, -39, -14, -59, -33, -1, -15, 84, -2, 6, 4, -45, -10, -24, -10, -15, -11, 50, 2, 36, 74, 34, 30, 47, 6, 16, -6, -38, -1, 41, 20, -18, -26, 40, 34, 6, 76, -13, 24, -54, 3, 24, -16, -28, -8, 26, -30, 5, -82, -68, 4, -2, 23, 17, 31, 12, -48, 29, 46, -8, -17, 10, 9, 13, -27, -33, -25, 11, -48, 9, 24, -13, -6, -26, -24, -42, 25, -31, 9, -17, 31, 7, 14, 10, -62, 24, 33, 6, -26, 22, 0, 8, 25, -3, -5, -11, -38, -3, -47, -29, -79, -54, 16, -6, 13, 21, 24, 37, 12, -32, 24, 42, 24, 25, 26, -12, 0, 31, -11, 9, -44, -28, 6, 4, -10, 90, 23, 20, 10, 33, -20, 5, 10, -37, -56, -6, -76, -13]
5030a3p4J10k6N5n9P6p0l4J2kJ5J0J4K2m0kNj8lj5lK2j3L1N6m3Mr9J06k8K8k9
5062eL5r0Q1j6L0r1N7J5l4N0n8%J0K1o9N7N4j1k6POml3M1l5l2oJ5M9ol1JJ7Rl
5097EL1k8k4J0l8JOQ4o1L3j30Q2J9k5N4n8l9J12p5L0Q1j11O8j8n0K1j0J6k9P4
5127C1o7P0rjJ5k5l7J4j3KQ1m1l7l5M5J5m6L7j6K1m7N3loM8p6M1rk6J8jMl8N8
5161B0l1jJ6J1KK5j1pL5r7K6k8PN4lk5K5k4l3J4OJ4Okl3J1K0k3J0M1Nm4j8N3m6
5196b5QJ6N9m5m1qJ1L9j3q5L3M7m4PP6J9r3K1L4j3L8m2M9k5Jo3NK0O5o5J4k9K
5229b7L0J5pj8j4k0R7o4J6%j1k2O2p0L6KJ3l4L7j1l2oN0R%Rl1K4k5j3N4k1p2P6
5263C2m6K5m0N5km6L1jm9K9pM0Ml4jK2q7L8J2j6J4j5N5NN1o9M5%j4L0p8m2O1l7
$$ y = [-13, -87, 23, -3, 52, -7, 69, -1, -35, -23, -25, -10, 0, 14, 36, -4, -6, -1, -19, -22, -37, -40, -18, -31, 0, 56, 13, 17, -82, 24, -4, 24, -5, 30, -60, 21, 5, 35, -56, 1, 16, -18, 32, -26, -26, -16, 5, -64, -7, 47, 36, 10, 17, 23, 19, -14, 27, -8, -40, -46, -31, 18, 12, -19, -18, -1, 8, 5, 36, 8, -16, -6, -44, -43, -37, 47, -14, 19, -111, -29, -10, -35, 19, -39, -78, 34, -41, -11, 70, -41, 27, 9, -41, -20, -30, -14, -43, 31, -36, 34, 25, 24, 39, 14, -23, -9, -22, -20, 61, 20, -17, -52, -7, 8, -38, -1, -17, 4, -43, 10, 7, 1, 49, -27, 14, 5, -21, -3, -4, 0, -38, 20, -11, -12, 4, 15, 17, 42, 31, 24, 59, -38, -12, -40, -33, 21, 18, -7, 18, -6, -39, -25, -19, -5, 1, -1, -34, -23, -3, -26, -16, 25, 30, -14, -32, 21, -25, -17, -1, 58, 13, -28, -36, -25, 14, 1, -84, -51, -4, -48, -41, 35, 54, -39, -18, 16, 3, 41, -1, 48, 23, 24, -39, -34, -14, 51, -14, 0, -29, -27, 3, 18, 11, -7, -21, -41, 56, -8, 8, 8, -3, -25, 37, -33, 3, 5, 18, -16, 21, 10, -22, -28, 22, 31, 31, 40, 9, 33, 8, -5, 49, 28, -44, 32, -14, 11, -29, 26, 24, -22, 9, 8, -41, -12, -19, 21, 25, -9, -10, 12, -75, -37, -25, -41, -27, -42, 13, 18, 69, 0, 45, 45, 31, 61, -17, -59, 2, -35]
5297c5N1K6o5M3J6p0J4j4K0K0n2L2N2j7j1k5rK1j0l3L2j9M2l7K9J4k9L0k1j6k
5328b3Ml3K2J8L0k3j8L8K9k6k4N8n4qj7N3Jj5j8L1QM8q8j4jn2nL4O5r4N8L1k9
5361a4J8k2N1m9Kk3N3k3K5m0MM3l2l6Lk0M2j8LO4jm3J3k5O2m7ML5j8p5L7MJ6O5
5395E8r4R0l3o7LK3jj0l0N1M5l8L4J9n3n7N5l0l7O3O2k2k3JpK7m1L5j4l8K8J4
5427A3J3l2k5K2nL7n1k3O1J1n1M0l3J0J1L5o4P3l9kk2N3m7J5J8n7j6P0K5j07O9
5458Bn6N9j8o1Q8o2N8M1m0J9q1LK1k7L3j4m5Q4Nj8J5qNnn4O2qJ1l6J7k1Q5m5j7
5492hK7q6L2k5O1k7o6O8O6J5qJ6k0k6mJ5o1jj2J5M1j2J5k9j3nK9j9rN6l7J3lJ8
5526A6Kr0O2Jj0K3m7N2j7K2k3M2n5O9j6m2LL2n5L3j2N4m5J2Qm9Q8o8k2J9n7M0
$$ y = [-35, 16, 42, -23, 20, 36, -34, -20, -34, -14, 6, -46, -14, 38, 21, 10, -15, -24, -3, -13, -46, -14, -33, 9, -28, 1, 15, -14, 16, -5, -21, -23, -19, -52, -30, -12, 18, -5, -23, 15, 44, 18, -6, 52, -2, -10, -27, 26, 27, 12, -6, 25, 33, 81, -7, -21, -22, -74, -79, -45, 20, -74, -16, 15, -14, 4, -18, 33, -16, -14, -37, 16, -7, 18, -22, -18, 25, -7, -43, -40, -60, -18, -36, -33, 31, 30, -13, 0, -25, 37, -10, -6, 29, 11, -64, -27, -23, -7, 58, -36, 54, 21, -46, -43, -20, -21, -31, -61, -10, 35, -3, 31, 50, -3, -60, -5, -35, -72, -9, 53, 31, 8, 9, 2, 29, -12, 23, 9, -29, -1, 13, 26, -6, -31, -9, -14, 23, -28, -51, 10, 21, -30, 10, -23, -13, -2, 33, -31, 42, 3, 1, -21, 32, -15, 0, 18, -39, -55, 15, 40, -67, 2, -54, 5, -13, -74, 14, -48, 10, 51, 11, 30, -51, -48, -27, -54, -21, -35, -80, 4, 9, -9, 6, -2, 3, -2, -56, 6, -2, 9, -27, -10, -31, 54, 9, -8, 19, -67, -35, -60, 1, -26, -92, -24, 42, 57, 49, 65, 45, 19, 15, 30, -31, -32, -44, -29, 12, 0, 15, -14, -27, -32, -3, -22, -31, 25, -12, 1, -2, 16, 18, -72, -10, -9, -19, 4, -43, 9, -8, 14, -9, 33, -22, 47, 31, -11, -8, 24, -31, 2, -10, 44, -1, 11, 19, -30, 58, -10, -32, -13, -70, -30]
5558c0K2m7P6J5n5J7k1j1P5n1k2l2j1J12m6p8J26p0M3K1n8OK0l9K1K7MN6q7K5
5588Hrn7M0J7L1r4J5N2J4L5o1K7k8n2J23n8rM3p5l0oM8j3L2NRJ3j3kk8M4k3l4
5621c6P2o4k0K7n3K8J4Q4j04M6J4J2l1L4o7Q6L1p9K1n7O8n9M0k6QJ3l0LJM6rj5
5653bk6ML3k3J2r9L3N1rO6o5j0L4pM7r2OK6J1K8l1k0O2k3Lk0K2j9m2K3m4Q8q1
5686f4K3P9m1k8K7J3l1M5k5n3O9k8Nk4K2n6J00l5j2L0l5M2j6L8L1o6j2l2J6j1
5716b9N1j0p9J05k4j1jM3l1Kj8r1M9L3l1J7N8Kp4P2p3L2J8l9K5k3j3L7K4k5J9
5747A5l8J1L4o8L0L4l9N7j3j5K1j7J8o4M4l7J2qK3J9k2j9KM2Om3QlL2l0L1k7j2
5780a6j3L4lm5M3k3ooN2j3K7J1k8k4L0p9J8K4m6L2O0j8P1q7NK1m1j1L3N2m6m0
$$ y = [-30, -8, -55, 21, 36, -19, -2, -23, -34, 41, -10, -32, -64, -75, 37, -9, -87, 39, -31, 12, 33, -25, -19, 1, -38, -17, 10, 14, 70, -17, 8, -1, -58, -18, -1, 30, -64, -49, 3, 17, 52, -9, 18, -10, -62, 61, 3, -6, 37, -38, -68, -74, -26, -39, -7, -2, 7, 20, 7, 5, -23, 21, -2, -36, 36, -28, -48, -21, -74, -46, -32, 52, -52, -6, 8, 20, -11, 23, -44, 42, 73, -6, 15, -42, 26, -33, 7, -19, -11, 2, -28, -25, -24, 22, 13, -2, -28, -24, 9, -14, -2, -101, -68, -17, -26, 40, -25, -35, -1, -8, 39, -53, -47, -21, -10, 18, -13, -33, 29, 6, 9, -11, 11, -8, -50, -27, -71, 17, -64, -41, 38, -3, -31, -4, 9, -22, 23, -2, -55, 14, -14, -9, -33, -11, -67, 33, -2, -14, 16, -19, 23, 7, 45, 76, 10, -2, -34, -18, -29, 22, 12, -67, 38, 14, 3, 2, 45, 14, 16, -2, -93, -44, -11, -42, -25, 33, 35, -39, 33, -40, -8, 10, -29, -4, -27, -40, -3, 21, -4, 15, -23, -12, 22, -46, -16, 18, -21, 36, 23, 8, 29, 12, 30, -34, 10, -27, -15, -23, 0, 19, -3, -22, -20, 22, 28, -15, -7, -10, 22, -8, 23, -4, -16, -29, 5, 2, -43, 0, -23, -29, -35, 17, 4, 31, 42, 14, -10, 20, -59, -41, -17, -63, -31, 29, 11, 82, -5, 0, 21, -20, -31, 2, 54, 8, -32]
5812c2j5L6L3J3l7K9o0PK4m2J9M7j5l3%NkK6m8qN0m2Q9k6k9J1J0p9R7j8Nl7K3
5845Am2M9M0p3O1l6l2N5k9M9m6k4RK0j7ml8K4l5K4N0Mn4K9m2M7M6j0n4N6j7j4
5877cj7l7M4L4qol4M0nl1N3K3l5k2K0m6JM7mo2L6j0L1l0L4j7L2j6m6L2n1N4N0
5910E1j15M2O0m1m9M7Noj1J0L4p9R8n5M4oq1M9K6k6%k3J3N4L1n4l4j3Q4k2m3J3
5942Cj2K6J1j0l1P5j05O3J9o5j7L2k4K6Kk9R3n0kq0Q6J5J1r2K7LL9k2%P4r3RM0
5975B2qQm1K%k9N2l7k6K6L8ko4N5m5J32n0n6kN3n7M2K9o2kJ9Kj2p3J13n4Q6n1
6008Hl0K0M3n8j2P0m0M2mr5J7N8k5J6K0j9k1J8k4JK1k6L7o3N5j1l6P9o9mM9k3
6040fK8l6j3N1m2NJ4l4J8L3l4M7l5kJ6j0m5O4onj9L6k0N5j0p6J2P0n8K4m0K0r
$$ y = [-32, -47, -11, 22, 35, -2, 27, -33, -26, -2, -44, -25, 22, 7, -26, -26, -21, -23, 3, -45, -53, -3, -45, 44, 18, -11, 0, 10, -69, 28, 10, 15, -22, 1, -41, 8, 48, -25, 36, 0, -32, 23, -6, 43, -3, -27, -18, 2, -15, -19, -57, -33, -68, -44, 6, 10, -44, -15, -57, -10, 36, 26, -28, 28, 11, -3, -20, -57, -13, 21, 13, 7, -27, 13, 8, -23, 30, 53, 18, -4, 16, -30, -29, 18, 14, -48, -12, -22, 9, -21, 13, -4, 28, 12, -34, -2, -53, 1, 51, -64, -22, 38, -3, -52, -5, 0, -6, -17, -7, 27, -52, 46, -9, 35, 29, -52, -3, 23, -3, -3, -26, -13, 41, 72, 18, -16, -29, 55, 33, -10, 3, -9, 17, 28, 18, -13, 62, -43, 20, 39, -26, -43, -11, -35, -9, -7, -36, 57, 7, 5, -75, 11, 26, 37, -55, -28, -25, 14, -8, -8, 66, -27, -18, 22, 14, 22, -19, -17, -17, -46, 6, -31, -57, -31, 7, 5, -59, -4, -49, 83, 33, -23, -25, 28, -29, 13, 42, -20, -22, -3, -1, -13, -86, 27, -27, 59, 8, -22, -2, 41, -17, -29, 41, 1, 43, 39, -56, -39, 19, -6, 10, 30, 11, -10, 8, -16, -15, 6, -20, 17, -46, 9, -2, -38, 41, -28, -32, 17, -6, 22, -14, -27, 24, -18, -13, 1, -33, -15, 18, -16, 31, -4, -6, 10, 0, -45, 19, 13, 8, -11, 25, 5, 60, 50, -26, -14, 56, -2, 22, -18, 2, -7]
6073gRk6l0P4k2l2j1K2N0m3N7l9L7q4M1L1j5n0K5L4k6l8KN1k9K6m3J9k6N0l3K7
6105Ak9J13q0J1k4j9qM1k9j0M7k7Jql2O6p2J02r3M2K7r7R6n6L6J8k7%J2K2jl1
6137hj0MQ4n8k3M5k4J1L8r2Rj2rO8ll0J0nj6JN5qKm1J2K0k1k1j3M1l0O0j2o3%
6172c9lL0M1L4n0k9O4n7K5o3LM0n2L4M0JK1l4K7n3N2j7L6l3k2k0k8K9j9M1qL5
6204B6nj2l2LJJ2j2K3J6j3Oo2K0PJ3MRKq9L5O7L0o7rO8k2m2R1q9L1j5j0l8M0K1
6239Hl4Pm1O6k0J0L7K4n5K2n1L9o1J2M1j2ll0M7n1J12l9Jk2k9K1pJK5j2k4L5l1
6272a4N7o3J1M7r8L9L0n2PK1MoMK5k2j6m6R3l9k9JN0nK2K6n7K3J3J0l2L0q3O2
6305A3l7l7Q0J1k4j5J3J9n1K7k3qLK9k0K0nk4L4l2K3j8L6k8l8M3L0l2L3K2m7K7
$$ y = [-7, 2, -24, -54, 20, -2, -34, -45, -23, 27, -16, 41, 2, 39, -45, -4, 27, 12, -38, -13, 21, -5, -43, -41, 10, -19, 7, -36, -17, -43, 7, -26, 1, -28, 85, 5, 16, -8, -27, -35, 6, -23, -33, 14, -13, -12, -20, -52, 14, -58, 44, -49, -7, 20, -77, 19, -37, -1, 17, -10, -10, 2, 24, 23, -8, -18, -14, 70, 12, -11, 34, 10, 21, 59, -33, -24, -36, -45, 23, 20, -10, 0, -5, -21, -20, 35, 27, 29, -12, 0, 20, -1, -22, -35, 6, -24, 36, 24, -39, -39, -42, -12, 29, 63, 13, -16, 48, -9, 16, -47, -44, -4, -56, -22, 18, 19, 40, 6, 33, -20, 32, 15, 51, 18, -4, -24, -52, -23, -42, -1, -9, 26, 21, 9, -23, -20, -19, -7, -19, 4, 20, 7, 13, -49, -29, -22, -9, -5, 4, 6, -83, -48, 19, 49, -18, -27, 41, 19, -23, 68, -21, 10, -5, -15, -53, -13, 8, -26, -19, -60, 6, -14, -4, 33, 57, 2, 24, -27, 12, -49, -37, 4, -8, -11, -41, 6, -45, 67, 28, 29, 7, -22, -1, -8, -7, 18, 6, -18, 17, -14, 43, -20, -9, 38, -60, -21, 9, -43, -36, -15, -11, -17, -13, 12, -10, -26, -72, 21, -18, -47, -46, 4, -1, 21, 47, -10, 13, 26, 36, 4, 34, -49, 13, -24, -61, 19, 30, 6, -9, 4, 23, -28, -1, -24, -32, -29, 0, -20, 0, -5, -29, 5, -27, -4, -22, 14, -14, -52, -9, 21, -11, 22, 44, -3, 24]
6337B4k2k9K7rO8m9k6j0N1j8j9m2N2N6n1l4K3J0k0J7j2L1l7J7J0ol2%OK2k9K7
6369dk2J1m3O9l1L1qOrk9K4%K9o1M2m5N5KRJ9j4l3MJ8%l9P5j6Lj06O0J8j9l8N4
6404A2J9o2L4Mp6L9j9P8l3J6OPn7N5j7k6j2J5J5m6K3m4K6O4l7N1k9j0m1O8k6M
6436AK3k9k3M3m2Pk0J1P3n1J1QqJ5K5p2N5o4RLM5n3J3J8J7l3J2N1n2oJ2J6l4O4
6470D5n5M0j5rL6j2l9kj5O8k5j2jM1l0K4n4k1M5j8KJ8ll0J5pJ8n1N0k1K4k6N3
6503C3ql8qP8m7l8mO0o1K8kL8n2pP0j6l2k2M3n4N2l9l1L2O6j8o8M1k6M7j6Jj6
6536a4L9k2m4N0l5M7n3RmkJ6k5P4r0P6J9k4K8Qq5QM4n7M8Np2O0l6M2M6p5N6p5
6569c8j0K2Rj0J5M2m5N5k8j9j9j4J0J0j3k9L7J1k2M5lJ8rk7K4mL3l8mM8p9PN8
$$ y = [24, 2, -27, 0, -9, 59, 10, -16, -26, 25, 7, -12, -54, -2, 54, 3, -31, -8, 2, -18, -1, -13, 18, -19, -2, 8, 2, -30, -30, -24, -2, -31, -4, -26, -15, -58, 11, -20, 11, 3, 9, 0, -29, -5, -5, 24, -37, 5, -40, 15, 17, 26, 45, 31, -2, 2, 20, 20, -19, 56, 40, 43, -63, -3, 15, -4, -42, 12, 31, -31, 3, 7, -69, -30, -49, 29, -4, 12, 18, 25, -32, 23, 6, -20, -32, -17, -2, -48, -25, -69, -43, 21, -16, 35, 6, -4, -45, 23, -3, 1, 24, -5, -28, 15, -27, -20, -40, -29, 44, -7, 4, 12, 4, 19, 44, -28, 27, -37, -28, -25, 20, -33, -20, -2, 15, -18, -6, 45, -7, -13, -1, 15, -19, 45, -10, 30, 15, 6, 42, 30, -9, -11, -26, 42, 17, 5, 4, 45, 15, 39, -15, -36, 9, -9, -7, 11, 8, -22, -7, -14, 4, -47, 3, -18, 6, -20, 33, 25, -13, -21, 57, 10, -28, -32, 28, -33, -5, -7, 31, -21, -28, 42, 26, -6, -28, 15, -39, 13, -26, -57, -25, 41, 23, -45, -4, -30, 17, 1, 2, -14, 25, 3, -41, 9, -26, 21, -32, -23, -27, -29, -13, -38, 36, -54, 22, 41, 17, 45, 53, -32, -24, 20, -37, 11, 16, -56, 4, -32, 10, 56, -19, 37, -38, -48, -26, -17, -27, -12, 30, -15, 40, 12, -7, -26, -40, -30, -20, -33, -62, -25, -14, -36, 9, 6, 24, 15, -12, 12, 8, 41, 3, -1, 47, -32, -25, 33]
6602C3l6RoQj9K4J5jj8k2K9j9nN9p9M4m0K0J4jqk9L5k8J7kLl5Q1l0k2l1L0k0P5
6637D5m5q8J55m7k0k0MJ2j5J1Rl4N0o2N7k3pkO6p5K8J8lm6M6m4M8m3jL9J2j5M
6670A4m2K1J4k6N3j08O4pLP5l2k0ljj4K8k9J5M0j9j2L7m9k6Rj5J6m7N0J4ol8m
6703d5ON0j2K3L1q0qO0Prk3qM6j4K4m2j9pJ1l1K3QK3o1j1M7KoL3k1N1k0o4ML7
6738ENK7kn9O3o9NK6k8L4nl6M4L2l9J8o8L7L5j6M4r8M5Rn4N1rMk7K0j3L6rk6O1
6773D3k1roj2oN0k3J2m6j1J4JK8rk4rL0Om3N1Jl0KN9k2l8o5Q5j0K1L2l6j5qmL
6809iO9n9k1M2K6l4l2J1J5l2J8jj4KN4mm2mR7j12l1M3Rmj4N5q5L4k5N8J1p5N9
6842Em3M6l9l1P2L4Jr2L8k5N9k0n1O9j7L0J0n8N0o8J3O5n3j0rRj0J1oqJ7ok3L5
$$ y = [33, -3, 6, 0, 8, -11, 13, 28, 27, 9, -13, 16, -3, -8, 51, -28, 16, -24, -4, 10, 9, 1, -28, 7, -21, -4, -6, -3, -38, 43, 13, -9, -40, -10, -30, 45, 0, -88, 67, 20, 0, -20, -16, -4, -19, -8, 1, -33, 17, -45, 12, -11, -18, -20, 46, -29, -1, 17, 14, -32, 14, -30, 18, -25, -26, 13, 25, 10, 14, -28, -7, 7, -19, 34, -74, -10, -17, -14, 61, 29, 9, 6, 5, -9, 19, -10, 5, 45, 26, 14, 51, 2, -24, -15, -30, -14, -61, -11, 3, -3, -41, -45, -39, 11, -1, 22, 53, -27, -35, 25, 32, 23, 0, -8, 38, 24, 48, 6, -13, -20, -9, -40, -17, -9, 14, -47, -58, -11, -9, -15, 18, -3, 48, 28, -36, -32, 5, 10, 37, 35, -24, 39, -30, -25, 1, -27, 7, 2, -34, 10, 42, 3, 21, -47, -10, 25, 9, 53, -45, 0, 9, -45, 6, -3, 1, -26, -6, -19, 17, 8, -18, 43, 22, 13, 7, -5, -11, 39, 16, 28, -18, -29, -15, -14, 14, 5, -19, -28, 2, 8, -35, 16, 17, -13, -11, 48, 26, -12, -77, 8, -2, 19, 51, 15, 0, -8, -12, -9, 60, 1, -20, 22, 48, 14, -18, -7, 8, -24, -6, -7, -21, -19, 35, 31, -11, -15, 82, -30, -61, -18, -9, -13, -27, 28, -57, -23, -48, 10, 21, -54, 5, -38, 8, -31, -62, 10, 44, 45, -47, -9, -34, 25, 5, -46, 23, 6, 36, 46, -12, 38, -30, -17, 48, -5, -15, -24, -15, -25, -14, -20, -28, -11, -17, -40, -5]
6876em2L0J5m8Q3rl6n2O1l7j3L3L6M7o6Pj9ln8J17k4l8J0kJJ6l0K9K2l2J5n1J9
6909b4j3LK0L6nl8J5oKj9MO6l0om4J6M2K2n0l3L2m5N1Ol7K5J7J4Mm0K1J2k6k8
6943c6N3p5J29r6K5l2O4l0M2o3K9j7m1N1o2N2l2J5j9O5j6J1k3j4j0N1J6k5L0k5
6973A7Kk9K2lj3MPK5L%m3jN0n2J3N0l6m2P3n2MJ1l0L3jk9lL0j8J9k0l1Q3o2m5
7008f4P9%j8j6M3j3J7pk7m2Q1Rp9J1jN1k3Lj6J1p5P2K1j2k8M4l5k0P3n3J1k4J7
7041a0P8p0K1k2n1N2L4m1j9O9p9Q0m9Nl9L9kj3Q0p9J7o1M9Rj2K1O0l9lj9Rl9K6
7074Bj6k4M7K5m1n5L0J6kJ4L8n6L7p2L0Q1l1n6M8rj0l3P4J3n5M9l2l9J5Lm1J03
7106E3j03N8oMLRk1KK8k3K5l8%M1m2j3K5j7j0o2M8K3Lk2J3J2k9O1q5M9J5k1M4
$$ y = [-5, -47, -17, -2, -50, 33, 24, -12, -64, -3, -40, -53, -20, 16, 63, -3, 4, -15, -18, -76, 41, 17, -21, -11, -13, -12, 4, -26, 3, 25, -7, 8, -43, -24, -37, -34, -14, 22, 17, -21, -6, -12, -10, -29, -25, 41, 11, 5, -39, -23, 19, 41, -9, -42, -10, -55, -4, 2, -35, -10, 7, 21, 25, -15, 6, 18, -8, -36, 17, -58, 71, -25, 0, -32, 32, 2, 44, -19, 10, -7, -48, 3, -59, -7, -39, -24, -43, 22, 6, 17, -6, -20, -30, 21, 37, 12, 42, 17, 19, -10, 12, 9, -4, 0, 7, 32, 35, 35, -8, -9, 41, -11, 2, 52, 16, -26, 47, -5, -1, 10, -20, 13, 12, -17, -20, 10, -8, 11, -9, -40, 43, -19, -64, 15, 15, -3, -19, 24, 11, 28, 21, -6, -48, 33, 42, -37, -26, -27, 24, 1, 4, -12, -1, -76, -4, 17, 5, -23, 21, -14, -34, 39, -14, -3, -27, -10, 68, -2, 19, -3, -54, -2, 32, -9, -28, 41, -38, 42, -7, -2, -41, -2, -4, -17, 63, -16, 1, -60, -11, -2, -14, 7, 67, 28, 25, 6, 15, -24, 2, -14, -38, 9, 34, -7, -62, -32, -16, -18, -4, 34, -22, 15, -57, -27, 54, 23, -33, 15, 6, -4, -37, 37, 50, -5, 44, 12, -27, -12, -9, -50, 53, -50, 8, 2, 6, 9, 18, -3, -1, 27, 4, 29, -9, -9, 32, -10, -23, 2, -15, -25, -87, -39, -16, -13, -35, -22, -10, -39, 22, -63, -14, 1, -20, 24]
7139B4K2j05K8M7m6K7M1l2rK4m6J7m3P5nrl8L8nNm3QJ8k1lK9l6J2K4k9N6m3k0
7172c8J1J5k2M7j7k3K8k5P8m0l4M0o9N6l5M3l5QK1J0m5L0m4N4j7j9K9j9RMk4L3
7204A0m9QRQl0P1o3J0L2Mm4N1j6jm1L2j4J1m2M2J0n8Q7o0K6Mj3P1l6K4n5OqM5
7238C1j0j2j6K4k3K6K3n1K5k9OqK1n3J7kL6l1k3N2m1J6Ln4O9k6K5K7PM1j07J5
7270b2j1K4L8j1j4j6L4K2j24J00lK3qnK2j9l0l4J2N2j2l3K5l7M5J6n5N5Nq1O4
7301B2J2l0J0K3n3M4l6K6lkm1L8m2Q0l8j4Jm2P3m0N0n2NL0l8J8l6L1l8O2n8K6
7333a2M4n8J5j8kK7n2lP5Mnj3mjJ6%Jn7L7J2J0LL4n9R2j26K9J5Pj4J2K1n4JR1
7368F8k9k3m0l1M6l3K9L2q5L7K7L1n2jj7N2Lmm1N8o6N4j8J5l9KJ1L8OL1p6qM3
$$ y = [24, 46, -59, -31, 16, -30, -3, 38, 6, -3, 21, -25, -8, -51, 24, 19, 10, -28, 10, 5, 10, -33, -25, -7, -28, -31, -2, -38, -26, -2, -31, 25, -18, -38, -27, -12, -34, 13, -4, -27, 1, -24, 54, 14, -20, 20, -49, 7, -28, 15, -20, -12, 9, 19, -26, 4, -40, 14, -3, -22, 7, -12, -3, 1, -23, 10, -39, -31, -22, -14, -44, 27, -36, -26, 6, 10, -34, 17, 1, 0, -41, -9, -23, -12, -54, -12, -2, -60, 27, -33, -7, -3, -16, 55, 19, 43, -12, -6, -14, 31, 21, 9, -7, 17, -6, 20, 43, -8, 17, -12, -6, -14, 7, -46, -29, -31, 5, -26, -49, 3, -38, -22, -19, -73, -4, -30, -5, 22, 29, 70, -37, -22, -33, -9, 29, 18, 4, -12, 22, 44, -80, 20, 17, 40, 32, 27, 49, 30, 0, -34, -22, 30, 18, -15, 10, -27, 18, 34, -21, 34, 39, -42, 22, 34, 4, 14, 37, -16, 28, -8, 18, 15, 13, -28, 10, -32, 48, 10, -4, -3, -45, 28, -12, 38, -14, -9, 21, -17, 1, -35, -4, -42, 20, -38, -12, 32, -26, -11, -29, -31, -4, -56, -59, 16, 20, 15, 2, -2, -3, 13, 13, 14, -43, -6, 6, 16, 19, 53, -6, 86, -40, -11, 4, 11, -3, 9, 30, -24, -23, 68, 39, 16, -24, -55, -9, -42, -13, 19, -66, -29, -2, 29, -23, -24, -41, 11, 14, 10, -31, 27, -39, 15, -3, 12, -27, -25, -14, 24, 30, 61, -15, -23, 20]
7401B0l1k%N8n1L7j29O5J6MK6j8j6j9M1j8L9m4j1O8p5J4M6J2kn4mJ1p5J35n9K5
7433Ik0k2L6J1K7n8J4K6J3l6K8l5n3J4P0J1m3qQ6p6L3L0o9J4J9l4K9l1kJ0L2k7
7465bk6L8j9LMKM1l3J1j8m2M4Nk1N2m8m1J1P1p0K2mn2Q5pj9K5l8k7M9l8L0j9J3
7499a8J8J3Qo2L3K3l9L2j0j3J2L6n1N1m1K2n6K8M1k5Lj1MJML1J3m5K7m2l5M0k0
7532b8L1n0K2L4m8N0j9j2qj2jL8k8qM7J1kJ8r1O3%J7j3J1k1Kj6J9jo9N1m8Q8K4
7566E1k9l5M5Jk7K4L5p9K5l6J9K5m0ORl5L9j0N3m4K9m8L3k5K6m7J5L1lO0r4K3
7598cl3qL5M1p4N2m5M9k0k5l2N1PK3k5J5K5j12Q7l3L7M3q0L2L0o0M0%l5K7m0M6
7630A5k5pk5Q4n5J4k1M0j1K1o1J8k2NN3qJ1k6L7r9Q7o4Q4n9K8k7N0l4m2L8%jJ4
$$ y = [20, -11, -13, -13, 45, -6, 31, -98, -33, -17, -13, 13, -5, -21, -40, 1, -17, 22, -22, -33, 35, -40, -26, 20, 32, 30, -24, -28, -17, -92, 43, -16, 9, -11, -33, 3, 14, 41, -17, -3, 23, 36, 0, 28, -7, -60, -46, 24, 35, -8, -16, 70, -6, 27, 57, -12, 2, 21, -13, 16, -15, -17, -7, 25, -2, -28, 10, -9, -6, -2, 0, 41, 8, 19, 1, -41, 3, 8, -13, 39, -9, -50, -39, 32, -38, -16, -20, -72, 13, 6, -13, 12, -26, -53, -4, -42, -12, -31, -18, 0, 13, 21, -41, -8, 15, -24, 8, -2, -15, -3, 33, -18, 33, -8, 14, -42, -14, 27, 2, 5, -6, -2, -1, 3, 34, 47, 2, 29, -13, -48, -8, -28, 3, -47, -25, 9, -39, 11, -8, -20, -28, -40, -41, -3, -31, -39, 8, 19, 17, 35, -56, 7, 7, 24, 11, 22, 1, 3, -13, 6, 5, -64, -13, -61, 27, 51, 22, -13, 32, 33, 6, 30, 65, -14, 11, -25, -6, 19, -21, -15, -6, -41, -2, -12, 41, -3, 26, -22, 11, -14, 12, -35, -20, 11, 8, 68, -26, -3, -36, -44, -9, 32, -42, 10, -35, 14, -6, -31, -63, -12, -5, 18, -7, 8, 33, -79, 8, -25, 12, 55, -25, 7, 37, -23, 17, 17, -18, 9, -31, 15, -10, -17, -42, 42, -13, 1, -20, 20, 9, 30, -31, -13, -35, -30, 23, 15, 26, 0, 37, -62, 25, -39, 45, -14, 14, -13, 37, 3, -39, -1, -1, -2, 12]
7663A2PJ2k7oL5J0q1N0J2rm9L1J8p0N6j2KoP1r0L2O0m6k2K9m2J2oN8lPj5Mn3P9
7698F0k9k5jL2Np5j4L4j3K9J7pK4n8l7R0mq0M1J9j8pL7n4j4P4m0%N5q5K5K2k4
7731b1J8k0P8j03Q6m1J2o8Q5l6mNm3R1j9m7pL1m2K1K0K5j8k8J1QomO5n2L0qJq
7765A2Lk6OK4m6j2OJ9J5K0r1M9L7Ln7K1J2k5K4L3r3N8k2N0l9qM2k1L3o9Ppk5L5
7799c2K6J9m4O7l7k2L2l2K9n2L7l6P4K1Qp1OK3J6m2j3K4J3m4j7L6l0M7k0J2J1
7830INKq6L7M5k0l0M9kl8j8J5RJ3n8K8J8N8p8K9K5j4RL3o6J4J8m1MM0m7K9K2%
7864A3K6J6l9k8P3q9L5l4N6l8K9n7P5rjk2Nj1Mj7JQ3q5N3k9m0OL5n8N5Ll0mO2
7898C9j8kl6k7J3K3L4p%n1M6m8J2oM2r1M8N0%n9K5l1Q4l0j6j9l1M4j3L8p4Q6j3
$$ y = [12, 19, 31, 4, -2, 33, 43, -38, 12, 24, 15, -34, -3, 15, -55, 1, -11, -9, -15, 56, -34, -2, 58, 12, -10, 19, -23, -11, -17, 41, 38, 45, 30, 34, -19, 60, 31, 6, 5, 37, 42, -33, -47, -13, -26, 3, 20, 13, 37, -21, -58, 32, 28, -52, -11, 8, -10, -17, 20, -34, -48, 26, -14, -14, 41, -44, -19, 3, -21, -3, -23, 55, -48, 38, -3, 9, -59, 26, -10, -14, -9, -52, 39, 20, -27, -34, -3, -45, -24, -4, 21, 3, -25, -14, -6, -12, -16, 49, -3, 27, 19, 20, 12, 15, -11, -5, 19, -27, -39, -33, -14, 1, 21, -70, -21, 16, 19, -38, -17, -5, -30, -6, 27, -66, -8, -30, 20, -19, -27, 15, -6, 27, -42, -35, -42, -67, -32, -6, 13, -31, 36, -1, -23, 9, -23, 6, -46, -9, -45, 29, 50, 58, -13, -7, 16, 32, -10, -23, 1, 14, -30, -47, -11, -41, 6, -14, -2, 9, 14, 16, -70, -33, 12, -8, -38, 11, 9, -29, -47, -32, -23, -10, -68, -40, -22, 36, -42, -13, 12, -2, 7, 40, -26, -12, 6, -35, -31, 9, -38, -9, 13, 13, 39, 55, 16, -12, 61, -28, 7, -27, 29, -9, 20, -37, 38, 29, 28, 6, 11, 0, 4, -13, -12, 71, -14, 39, 10, -30, -24, 11, -47, 8, 11, -19, -23, 39, 21, 19, -17, -44, -31, -8, 26, 19, 19, -32, 14, -34, -22, -28, 14, -77, -29, 21, 21, -38, -13, -44, 40, 10, -6, -25, -56, -12, -25, 13, -61, 25, 12]
7931A2j0k8j2K5NNk8J3m0O6M9k6j7rJ1Qj4NK0n7K2m6M3O1n3m4O3j5ml4J6N3p3
7964c3K5J1Mm8J9n7M7l2P5p4O9L0l2k6KJ5lk9J1nJO1Kj9N4r4O6l3kL0q4M8lk1
7998b5M0l4pj2j0Kk4M3J2k6K1L9o3kJ3O0q4O3j3P6n4L5j04L1K2nnJllK8m9L3K6
8032B2l0J9K0Jj5qK1j04P5k1J3J8k6J0j6L9J6l1mK1l6l1P2j3l2K9l6J0J5k1K4
8063AJ8k5K7n1O0m3RJ0kK1%k9l8M2N4k7p1P0l2M%K7l2M3j3K5k9l3K6rm0N2k0L3
8097B8m5N2k9k9M4Nk5rl6L8J0K2j7L9J0k2n9M2L3p7L8n9NJ02p2K9qk3K7rL7m0
8129Bkj2mj2pL7j2qrk1JM8m2J9M8l7JK4M6j14M4L2l2k5M1K4j9m0RK5K1k1k9O0
8163C6n0lk5J2j0L2qj5L7L1pl6n0L3L3o4K4N9m5K2qJ7km7MK2j1j9
$$ y = [12, 2, -26, -38, -13, -8, -3, -31, -18, -58, 8, 57, 31, 14, 5, 16, 24, 10, 15, 35, -22, 0, -46, -3, 58, 5, -39, 24, 9, 5, -29, -13, 40, -33, -8, 3, 7, -41, -22, -79, -32, -64, 11, -63, 6, 36, 4, -22, -20, -5, -8, -37, -26, -31, -30, 31, 33, 14, 68, -26, 40, 7, 5, 35, -49, -1, -4, -25, 15, -19, -26, -38, -48, -46, -70, -27, -15, -41, -20, 19, -44, -46, -33, 27, -57, 6, -7, 69, 15, 50, -54, -23, -1, -6, -11, -10, -13, -16, 12, -37, -4, 22, -8, 11, 31, 32, 17, 9, 30, -74, 1, -20, -7, 11, -15, -5, -21, 18, 34, 3, -1, 20, -16, -47, 25, 12, -20, 9, -27, -17, -2, -23, 1, 19, -6, 21, -30, 30, -13, -4, 6, 4, 25, 25, -4, -42, 0, 54, 27, -44, 26, -6, -2, -2, 25, -7, 36, 23, 48, 19, -14, 12, 3, -37, 15, -5, 28, -17, 35, 6, -23, 21, 26, 1, -8, -44, -6, 4, 26, 9, 48, 58, 36, -23, 19, 52, -25, 13, -46, -41, 61, -11, 18, 10, -13, 14, 5, 42, 2, 0, -12, -16, -28, -35, 2, -10, -18, -27, -48, -47, 1, -41, -22, 26, -11, -10, 14, 60, -54, -10, 22, -10, -35, 6, 30, 11, -29, -20, 5, 26, 5, -24, 36, -14, -17, -42, -30, -40, -8, -16, -31, 6, 37, 30, -6, -56, -23, 10, -54, -30, 29, -16, 6, -2, 15, 13, -34, -30, -8, -19, -38]
8191c8
$$ Imaginary data points
##PAGE= N=2
##DATA TABLE= (X++(I..I)), XYDATA
0@%%%%%%%%%%%%%%%%%%%%%%%%%%%%%%%%%%%%%%%%%%KmMnOoPqQqRj2J4j5J7j9K1
59A1k3K3k5K9l3L9m8O2r0J97k457j2829k1535m678J793M593J7736J2161J2906
78G832J2380j815N74l841j1490l58l195j921Q722Q64K436L008r433n548q726j3217
94b3728j258j959L520J5009R544J4084J3018j24J330p055j5389q050j2357p965
108b1380K626K63Q248R959K654P346p18o573k94p610m211M128m06O817Q030J442
124A0321N548k363o860k755j0534n859L94l372O165P471L024Q836J438k560o4
139H830q747n403k055n737L686M525K481R448K623O19K528o731m267l085p663
154h948L76L56PO879J494K245M260m012k40n52n400K028M32l51N690K47J121K162
$$ y = [0, 0, 0, 0, 0, 0, 0, 0, 0, 0, 0, 0, 0, 0, 0, 0, 0, 0, 0, 0, 0, 0, 0, 0, 0, 0, 0, 0, 0, 0, 0, 0, 0, 0, 0, 0, 0, 0, 0, 0, 0, 0, 0, 2, -2, 2, -3, 3, -3, 4, -4, 4, -4, 5, -7, 7, -8, 9, -10, 11, -12, 11, -14, 15, -18, 21, -27, 35, -55, 142, -2315, -15144, -36679, -41357, -39564, -34971, -17235, -5074, 7832, 20212, 18397, 18971, 15130, 3640, 3282, 87, -1834, 6888, 7752, 10188, 13196, 3763, -1785, -10511, -23728, -24986, -26945, -23425, -8416, 1128, 15212, 28230, 28106, 29436, 22381, 6992, -1058, -13415, -21380, -18754, -18491, -10243, -284, 2370, 9716, 8998, 2425, 2131, -5479, -9690, -5562, -5968, 849, 8879, 10321, 15869, 13506, 6646, 3891, -6643, -12502, -12108, -15480, -9315, -1844, 1180, 10016, 11454, 8894, 8830, 83, -5320, -7375, -13112, -9426, -4901, -2420, 7028, 9651, 10270, 12798, 6067, 1800, -1285, -8948, -8572, -8216, -8209, -1330, 164, 2409, 6669, 2657, 2417, 1865, -3535, -1507, -1075, -1426, 4264, 4511, 5632, 7794]
172G794n252j670l240p014O37j703n32O403J899M587O094o16K648m25m883K37
188D964m250l495J645l350P69K240k799K424J23k731L063j163RM087q99K824K612
205F073k298K327j700l878Q88m128k173J549k915J933K295j000M108N45m16L354
221D564k122OJ647l436J075n7l223J914j718j703K164k412N73J974k101K706Q16
238F67j498L323j231p23K404k713N11J120k922J821m59k009K490j979l23K355
254H34k511J589J370k194K512m19j666K372k205m36J467k808J490M86k069K742
270E54p64r33K699k150L35J725k569J703K69j843K491j236n92K218k380O43J159
287A329k599J737k47j885K248j490m28K047k074J291J092k025K244m97j626K115
$$ y = [7794, 2542, 872, -2368, -9382, -8745, -10448, -10980, -4577, -2678, 1909, 8003, 7387, 10035, 9610, 4727, 4964, 714, -2781, -1136, -4486, -3717, -1477, -4276, -1852, -1729, -4460, -1397, -2560, -2551, 1536, 637, 3461, 6073, 3775, 6102, 4402, 524, 1412, -2716, -4889, -3340, -6255, -4322, -2027, -3027, 1081, 1626, 1210, 4564, 2442, 2448, 4095, 659, 1734, 1677, -1546, 368, -1350, -3053, -889, -3301, -2728, -754, -2855, -149, 667, -831, 2492, 1261, 538, 2942, 229, 740, 1860, -1062, 759, 300, -1709, 781, -1198, -1521, 834, -1677, -88, 1282, -912, 1600, 1181, -485, 1887, -318, -754, 713, -2095, -605, -119, -2188, 554, -210, -1143, 1556, -594, -259, 1466, -1103, 600, 869, -974, 1517, 281, -311, 1907, -473, 170, 1329, -1270, 467, 220, -1665, 583, -907, -1335, 712, -1362, -71, 1021, -1004, 1240, 743, -883, 1232]
303A232k094l85J654k243J432J158j572K683n08j034J992k427l09R69k682J503
319f31O74j345K891m80o00J768k581l63J61k812J461K59p34L498r8L93K293k315
337A439k22l32l326Q31n76q55L253j3J287K554j938L99p10l586L03j412j195K843
355a256j40J950K962j223J123q71l536l6k548j502K250l19K616L568j49K272l28
372D833k923k86l461k204J014j416K320L196J32L079J22k187q4l717k394K46j785
389e515K320L022J149M113P45j187K33m291l264j315l467J075K055J171M974K174
405C992J018K012k842j880j463m096J65L31J3L766J179O91J516l004k029k091
421b722m210J56K80J029N261K988L363L743j322q99k639n756k411l297k121K298
$$ y = [1232, -862, -1247, 407, -1836, -404, 754, -818, 1865, 1357, 323, 2315, -112, -421, 548, -2134, -631, 43, -1302, 1589, 1109, 509, 2277, -304, -667, -506, -3318, -1857, -1598, -2332, 1166, 1068, 1461, 3754, 1439, 1217, 885, -2441, -1610, -2186, -3041, 212, 199, 1486, 4040, 2102, 2501, 1791, -1795, -1492, -2904, -4099, -1256, -1396, 554, 3516, 2293, 3416, 2545, -991, -1027, -3575, -5077, -2827, -3146, -530, 3038, 2889, 5161, 4833, 1910, 1624, -1837, -4041, -3027, -4443, -2123, 1073, 1205, 4284, 4406, 2219, 2135, -1582, -3976, -3730, -5515, -3195, -173, 976, 5089, 5834, 4647, 4880, 589, -2675, -3990, -7457, -6382, -4327, -3156, 1818, 3992, 5010, 7022, 4180, 2300, 837, -3259, -3094, -2763, -2750, 1016, 2195, 2886, 4402, 1398, -631, -2722, -6932, -6776, -6496, -5467, -206, 2782, 6145, 9888, 8566, 7667, 5028, -728, -3139, -6436, -8557, -6259]
437f259P53K944M122M14J867k4k854n8j913j219K265L82K403K746q16N68k149
454C172m775k091m171k494J516N28M022N404K777M517J488j484n41m242l729j566
470a669l261L43J408j11L090O46q00R72k317j290N53j274K177K539J236L716O79
487F637q06Q7m000l222j973l882J18Q36P49M283K195J962K752j378n55q62l529
504e88l60p72r96K396L04R15K010j539j70o72k927R3p92p04K479L29J369K311
522B686j123O10l42k468K68j078o76J970J5J489K060j020Q59o21k712l08k119
539b510j717Q00j005J262K058O8K607J042m77J725r39p90P45j911k20j60k172
556a594M15j122j598R98j052L34J970K0K219K061P6K233o2r32O72k271j480n91
$$ y = [-6259, -5506, -2562, 1560, 1974, 3841, 3817, 963, 905, -1008, -2227, 38, 420, 2823, 5569, 4753, 5321, 3172, -1603, -3694, -7865, -10359, -8843, -8315, -4293, 1111, 3888, 8405, 9893, 8409, 7868, 3626, -103, -1669, -4930, -4587, -3179, -3290, -200, 446, -354, 618, -1699, -2989, -2436, -3710, -1533, 1006, 2242, 5958, 6637, 5831, 5918, 1918, -1304, -3277, -7159, -7041, -6205, -5456, -1173, 1022, 2984, 5736, 4358, 3803, 2941, -588, -948, -1720, -2716, -320, -16, 899, 2909, 1370, 1200, 528, -2399, -2306, -3098, -3802, -1323, -994, 375, 2686, 1563, 2173, 1831, -637, -369, -1447, -2123, -153, -138, 1351, 3411, 2391, 3250, 2629, -83, -391, -2510, -4227, -3427, -4432, -3170, -1112, -1044, 1563, 2605, 2128, 3853, 2914, 2124, 2869, 958, 738, 578, -1594, -1179, -2301, -3899, -2901, -3953, -3619, -1649, -1629, 590, 2651, 2727, 4960, 4898, 3966, 4638, 2367, 887, 296]
574B96k809n26p97j639J248l10L67K630M08K014K589M6J744K83j423K27k260k075
592A3n42k748n27L25j189J600Q14K24K283M4O88J609q40R26O21j227R30r51j558
611D95J10k337j183q5j832R23J095J11K917J235P83J921r20j06k11k501j57o97
629d39j505J267k95m4J405r87K86K34j620P26j92n48K019p1N52J721r82K92j92
648A627k079J38j053r74J400l50P37J880o06R70J02j652M72j265j155J018p77
665a567O61J649m81J346K32j259P06j387j041O26j392M73J105o72J380L85o62
682A02J084j039n73P95j334P38Q40p43J391Q9p81R05j272o52K92j651N01M34p47
701a621J540J42q5J409r16JN48j516M92l7j060J158l65k13J243q90M11O70j199
$$ y = [296, -2513, -3039, -3836, -5475, -4227, -4537, -4170, -1540, -1132, 882, 3471, 3517, 5261, 5544, 4121, 4348, 2088, 13, -529, -3277, -3804, -3479, -4668, -3068, -2254, -2030, 253, 297, 985, 2594, 1754, 2680, 3301, 2074, 3004, 2053, 495, 605, -1732, -2915, -3000, -4832, -3909, -2814, -2703, 214, 1449, 2232, 4153, 3233, 3127, 2916, 415, 258, -439, -1944, -677, -972, -1016, 389, -598, -312, -78, -1698, -972, -1164, -1712, 307, 236, 788, 2509, 1527, 1819, 1627, -452, -314, -1367, -2341, -941, -1291, -554, 1326, 720, 1690, 1792, 140, 612, -653, -1808, -790, -1567, -906, 743, 262, 1608, 1840, 581, 1287, -100, -1141, -515, -1907, -1434, -329, -1001, 379, 764, 102, 1186, 147, -426, 369, -965, -227, 613, -130, 1261, 1350, 569, 1474, 202, -450, -158, -1809, -1308, -874, -1621, -81, 61, -24, 1385, 469, 470, 1018, -498, -6, -43, -1103, 55, -310, -523, 720, -170, 241, 911, -288]
720b88Q69j16r66J123p52k66Q75j060M07M99j087R67j39p55J158q12j72R04j036
739f47O51M66r07J162k94n72Q76j062j70N22j217P51M50n35J547o1k29J114j165
758F80k41J4j626L34j93p33J374j23K07J323p87L00K69j390M80l41o02J311l11
777e5M33J210r34M14n9j704L40p20p70J128k40P36J425m51Q92M5j419K35j090
796e84j061P75q66O34J315l78J240K07r08N98j163q02N08j010P21J064l09J463
814A444K17p26O19j378r27K20j342M52O98k63J646L74k52R20j139o60N1j523L72
833a197L08l74J613K52N3J035r82k66L1j641L48N5n39J502J11K64J209q01r2K
853H91j593J19m42p28J183j37L27J305o47M63J28j222L56m53p06J020l69L96J112
$$ y = [-288, 581, 465, -501, 622, -130, -396, 479, -581, -174, 325, -762, 205, 66, -689, 469, -343, -515, 389, -647, 4, 470, -437, 725, 431, -141, 735, -327, -497, 25, -1192, -441, 9, -526, 1021, 960, 731, 1845, 680, 439, 453, -1173, -839, -1032, -1765, -391, -514, -307, 1016, 229, 529, 798, -592, -112, -453, -1055, 256, -55, 378, 1588, 654, 1068, 1009, -695, -355, -1075, -1845, -717, -957, -221, 1204, 753, 1645, 1690, 271, 506, -584, -1645, -870, -1736, -1102, 213, -165, 1075, 1282, 374, 972, -191, -993, -485, -1495, -774, 290, -19, 1444, 1661, 935, 1554, 176, -751, -531, -1873, -1421, -723, -986, 660, 1034, 782, 1702, 563, -97, -46, -1569, -1197, -889, -1263, 350, 602, 655, 1690, 708, 442, 473, -1168, -820, -765, -1304, 198, 309, 573, 1782, 981, 889, 891, -702, -583, -1025, -1753, -570, -707, -380, 925, 278, 741, 869, -353, 3, -450, -1156, -136, -505, -109, 1003]
872A003o53O13J12j166N04p05o75Q56o56L85R36o89P69M1q87O97q46m77Q09p60
892g89M03P30o96Q65J1o51P58p06l66O32r98M49M76p82R76p5n42R87o05Q6P63
913I26q32O12K01r05O43o51p88N21j037K6O44o81Q93M64m07J152l03k09R28p94
933D03K58M93q39O22k16j011M09j049n94L88r64N63Q61j83J524P63j6J130p57
952A785m71M4j644k61l02j041P33p7j23J012m13J83P03p39P23M37k77J363J71
971A806%Q31j084n57n20j932l68o99p65J141K50Q06J809O4Q77N68r51J94o91j085
991c06N35p52M5Q08o35L22J27j113L97o31o08J017j50P87J404J7J022K54j076
1010A464Nj273j252k4j122K17Q77n6J226N87k31O93p15n40K58j059K61O15l24
$$ y = [1003, 350, 963, 1075, -91, 413, -292, -967, -111, -767, -382, 554, -135, 634, 675, -212, 485, -361, -838, -29, -789, -386, 344, -352, 513, 524, -127, 631, -75, -441, 191, -807, -358, 118, -664, 312, 237, -305, 682, 77, 163, 926, 94, 706, 907, 2, 645, -6, -794, -273, -1310, -1284, -640, -1321, -428, 36, -371, 781, 478, 269, 1197, 403, 661, 1154, 315, 937, 721, -290, 119, -930, -1524, -1136, -2100, -1537, -676, -859, 665, 1428, 1412, 2542, 1785, 1314, 1358, -286, -547, -849, -1890, -1157, -1234, -1357, -345, -758, -575, 128, -611, 112, 549, 272, 1635, 1806, 1806, 2637, 1553, 996, 476, -1456, -1824, -2523, -3288, -2147, -1897, -1091, 718, 782, 1659, 2227, 1276, 1470, 779, -306, 229, -523, -478, 330, -305, 17, 144, -969, -572, -1203, -1811, -794, -944, -157, 1247, 1264, 2286, 2540, 1464, 1469, 196, -1056, -1080, -2202, -1985, -1108, -1164, 62, 649, 418, 1111, 396, -144, 114, -945, -684, -69, -393]
1029c93J202L96l08P28r45o36J6j316M9K93l75J221M05J1R21p07l23O1j353J44
1049i09J92n19J227M05K72J056n33r3j76j439r5m70p39Q29K6M10J188j65N35L09
1069A311r16K56m22p56P19l68M5Q04o78K93J3j105K14m61n57P76j82M97J169j10
1089E42Q93K78o46L96p50q69K03r56q6M76m84P57K05l21P60l91l14O84p26L06
1109d3N00m83O64N6n46N56o99m14K64r34K19L62m21Q71K19nQ06m96O5L23q48K00
1131B16l3p46O59k65k34O98n42J08L80q02M95mn49O60k42n6O33n35K67L52p29
1152b69N70j01n23O28l75r9N53n42K83K28o37N79k17m85O32n13k8M51n69M19J81
1173A66n63O99k34k57O12o51M8L77p00N15L1l99P36k55j63N84n66Q7L01o58L46
$$ y = [-393, 809, 1205, 897, 1625, 680, 44, 60, -1256, -1207, -914, -1289, -68, 337, 348, 1269, 562, 239, 300, -1053, -909, -717, -1236, -9, 396, 668, 1724, 1191, 1098, 922, -517, -612, -1082, -1821, -992, -966, -556, 632, 467, 1002, 1311, 395, 651, 229, -527, 192, -176, -131, 673, -5, 288, 301, -804, -590, -1051, -1608, -832, -1014, -517, 652, 542, 1435, 1713, 1067, 1463, 713, -156, 47, -909, -995, -519, -1003, -246, -41, -362, 398, 7, -307, 377, -349, -43, 457, -26, 638, 694, 148, 704, 5, -409, -145, -1079, -860, -498, -919, -48, 171, 166, 972, 476, 541, 864, 16, 216, 183, -563, 96, -169, -403, 295, -247, -139, 241, -561, -66, -70, -619, 41, -201, -257, 376, -159, 108, 460, -269, 301, 200, -323, 305, -70, -169, 384, -158, 125, 353, -284, 295, 78, -407, 225, -288, -316, 135, -434, -15, 166, -397, 302, 68, -189, 423, -228, -180, 197, -503, 12, 43, -356, 380, 125, -38, 546, -20, 67, 368, -290, 56]
1194E6n4m13O58m65K5N49o22K99J84n68M35o2m25O61m47J01M22n90K79J52n58
1215c83N01k18k94O63l91K29M45m83M56k2n54M49m15l46L09n24K49L02o17N43
1235a01J02l78O14k78k9N35n78M22J51n95M78k01m88M74m96k0M21n54M66K63l66
1256a58P01j70l13O12n93KK56o53L24K9n72N14l25k07N19n07J72M20l98N97J07
1277C57k67O59l54k13L32o97P3J72n93N18j05k15N99l83jM91o29K28J64m83N65
1298B18j42j98O27m83k3K16o86K54nm27N47J2o2O59l23K48K50o72K50j49n66N12
1320E7l31mN25l95K92J65n58L17j79m62M03k63J50N34k93L77K27m83L23l88m17
1341d03L99m23P7M52l18N46J93m03M22l52l67K77n93Q7L32l09N57R1k54M67m21
$$ y = [56, 2, -411, 247, -218, -193, 356, -266, 33, 217, -351, 84, 22, -403, 258, -189, -88, 334, -256, 23, 175, -383, 118, -100, -394, 269, -122, 107, 552, 69, 525, 503, -51, 398, -17, -363, -54, -578, -329, -27, -644, -101, 1, -377, 237, -41, -70, 465, -113, 309, 460, -135, 343, 142, -346, 128, -368, -388, 33, -521, -55, 208, -158, 543, 373, 60, 672, 79, 81, 337, -316, 8, 37, -535, -21, -346, -553, -34, -541, -369, 51, -347, 250, 357, 90, 749, 395, 182, 514, -183, -110, 62, -531, -13, -118, -333, 266, -117, -118, 373, -256, -28, 136, -347, 218, 76, -122, 505, 22, -1, 215, -471, -217, -222, -649, -102, -90, -152, 507, 184, 432, 682, 10, 260, 111, -455, 57, -274, -278, 247, -148, 144, 309, -249, 68, -111, -573, -170, -433, -283, 251, -42, 335, 562, 79, 402, 14, -403, -4, -427, -350, 102, -216, 330, 523, 120, 542, 190, -177, 100, -493, -406, -74, -383, 174, 265, 11, 478, 57]
1362E7k34J45n89J77K40l50O47J35j58N86k70k41K22o50J34J7m14O31Jn7O27l77
1384B79o7J32o58P8j09k64M89o6M0O08k81Q7J76o13J53j69m00M22r4O3N65k51
1406A20K36J92n63K31l01l66M47k90J38N31l36L63Q5l86J85l41m82K80l40N1N08
1427c8k92M73K24l13L40k56k75L81m57M6M04l85M68K1k58K47l08k68K42n32J51
1448c85K51l31N79J22j39M63l27r8J72o48P5J17l61M42jj11M53k86J1K83m47J25
1470d1P5k71M75n8n1M05l65M5Q8n50J16j29l07L78j41L8M26k22J19K74m39L17
1492A82j22l05L47k18M1L89l29J54J50m17K81j65k82L96k71M5L17l04K79J50l89
1513g1K79k22k20L47l90O5K59l45L74lk09L66k42j79L33l30P0K39l55M04K1k29
$$ y = [57, -177, -32, -621, -444, -204, -554, 93, 228, 70, 656, 386, 145, 367, -283, -149, -132, -546, 85, 86, 29, 656, 279, 212, 344, -314, -236, -345, -609, -120, -186, -146, 462, 181, 268, 444, -169, -16, -185, -585, -163, -257, -194, 371, 120, 356, 548, -15, 216, -85, -451, -4, -294, -156, 375, 39, 402, 487, 101, 286, -55, -537, -257, -597, -546, -38, -330, 143, 367, 54, 394, 138, -137, 244, -213, -167, 237, -148, 320, 341, 83, 330, 22, -246, -4, -536, -385, -134, -465, 114, 236, 97, 560, 233, 135, 307, -341, -266, -149, -510, -68, -69, -180, 273, -13, -2, 281, -166, -41, 34, -237, 238, 180, 129, 534, 169, 214, 302, -248, -132, -261, -568, -190, -331, -293, 133, -89, 30, 304, -135, 182, 60, -245, 102, -116, -75, 314, -15, 139, 289, -128, 153, -12, -294, 102, -169, -124, 193, -111, 168, 318, -71, 208, -14, -234, 113, -277, -212, 47, -298, 76, 73, -136, 230, -12, -191, 142, -188, -118, 121, -234, 170, 191, -38]
1535c8M62k97j24K81m20Q0J44l58L55q4k05L58k91j8L08m37J85J42k72L75j00
1556D6j05M06l06J9K78m66K57p3l02L43j66p8K89k21J21K07m47L36o0k80L58k09
1578e3j00K86k91J16J22l37K90l5k75L26j86L3K70k51K07J53l39L90j86j89L15
1599B66l01J8J96m08K80jl06L88j30k02K69k82Q7K32l43K60mk02L58j89o1K82
1621B07l50J20J99l94L30o3j44L79k63n7K78l39K07Ok95L18j91j28L43k59J0K34
1643A48l12J47N0l22L58j34p9L31l44J22K60l50K27k2k18L56k24k6L06l69J70
1664G5J42l62L25o5k44K43k45o5K67l56J86J61l17L56l9k16L85l10K6K56l23K08
1686H8P5l30L81j67j48K94l03P4J84m20L54n2k02L54j55q6K75l75J61Q7l47K33
$$ y = [-38, 424, 127, 3, 284, -136, -56, 88, -270, 85, 1, -204, 154, -137, -155, 153, -284, -99, 43, -229, 146, 46, -59, 347, 41, 60, 338, -128, 129, 56, -246, 97, -69, -147, 142, -79, 42, 249, -198, 138, 78, -202, 156, -53, -153, 133, -158, -42, 80, -257, 33, -2, -277, 49, -137, -104, 166, -85, 122, 275, -64, 326, 140, -49, 266, -35, -17, 179, -229, 51, 50, -256, 132, 2, -200, 69, -213, -126, 106, -237, 23, 19, -183, 175, -14, -75, 207, -143, -23, 176, -218, 112, 49, -95, 284, 21, -36, 242, -97, 110, 116, -179, 139, -52, -180, 163, -96, -86, 148, -164, -17, 33, -289, 69, -65, -144, 187, -157, -35, 225, -125, 102, 80, -138, 218, -6, -32, 274, -95, 75, 217, -145, 180, 115, -129, 114, -131, -196, 71, -285, -99, 62, -255, 101, 62, -154, 231, -79, -53, 203, -120, 88, 163, -167, 214, 47, -101, 193, -110, -36, 148, -272, 82, 30, -172, 182, 27, -59, 216, -159, 2, 89, -258, -25]
1708b5o3j73L22k02k0L11l22K08J54k29J74Oj96L40k42l3K36l33J16O2k81K50
1730F0j54j04K62k22J03K08l21K08Q1k14J93j56j16K75k79J19J32k57K59j6j64
1751a03K88j29p5K31k13J34N9k35K66j68k03K27k28K5J71l15K00Q2k33L12r1j26
1773a24L47l05P3J89k91J61N2j86J98j24j51L13k80R3J61k53K07N2j90K42j68
1794A6j28K70k59N3O3k36K53r3j46K84k18N3K35l30K35R7k82L23j19q0K16k56
1816d9P0J84l43J67M3k44K07o1j00L10l11J51J46l59K81m8j93K74k24m8K39k77
1838a85J07J08k25K72q6j48L52j99P1K63k80J15P0k45K73k51j77K06k82M1J51
1859d9k62K77K7j84L36j01p0K77k66M8J64l12J73P4l14K70k26r6L06l08J80J54
$$ y = [-25, -88, -261, 61, -141, -161, 150, -172, 36, 190, -39, 135, 141, -55, 285, 43, 10, 246, -87, 29, 91, -190, 60, -94, -198, 64, -158, -55, 153, -168, 40, 121, -93, 100, -56, -172, 103, -176, -57, 75, -182, 77, 61, -103, 185, 56, -19, 212, -1, 133, 192, -43, 223, 55, -148, 79, -149, -124, 47, -268, -68, 14, -219, 93, 2, -124, 223, -82, -9, 180, -111, 50, 102, -84, 114, -10, -161, 152, -128, -35, 126, -127, 80, 132, -58, 184, 16, -112, 158, -101, -48, 15, -221, 32, -61, -207, 77, -141, -88, 147, -183, 52, 149, -133, 190, 71, -9, 207, -49, 21, 205, -138, 29, 72, -172, 35, -26, -126, 184, -127, 24, 170, -189, 92, 44, -149, 125, -99, -147, 92, -185, -78, 30, -195, 77, -9, -157, 195, -4, 67, 330, 50, 165, 235, -10, 263, 12, -165, 41, -241, -200, -49, -311, -34, -7, -191, 145, 44, -26, 251, -15, 33, 197, -115, 58, 132, -182, 88, -138, -234, 72, -236, -56, 98]
1881I8j38K96Pj56K74k38p5J99m53P4%k36K11j05q9L78k19R7K09k24J96Rj20K65
1905B60j34p9K71l12j2N2k74J87l9k23K98j41K0L39k62K19O1k83K64q5k14J62
1927G5k34k6K25l21K15J02j84K74p9j35K42j64NK10k31J68K1k03K19k24p6J66
1949D5k24O1J76k65K56l4j61L01k24k0J61k80J38J03k10K36mj57L38j14k0R9k19
1972a8J14Pk18J88j01j51K79k49M4K10k49J21R2k13L10j03r0K31k87J01N1k40
1994a71J21m2j80K62j49L7K55k17J49J40j55K46j15j43K03k44l2J25k85J25O7
2015ck41K38q8o7K19k23J27J62k01K19l5j67K05j03j33J80k09R1N7j89J87Jj79
2038a52K98j26n1J58j77J17nj39J85j08j54K63k29J5J99k33J57N9k17K63r8j67
$$ y = [98, -40, 256, 263, 107, 381, 143, 68, 267, -186, -112, -112, -348, -137, -242, -331, 47, -172, -75, 134, -90, 106, 115, -5, 260, 126, 47, 318, 6, -6, 46, -228, -41, -80, -303, -5, -146, -126, 213, -49, 170, 231, -52, 212, 127, -87, 75, -159, -185, 40, -281, -66, 36, -148, 126, 47, -88, 154, -10, -5, 205, -26, 142, 163, -40, 179, -45, -121, 45, -179, -118, 58, -207, 49, 15, -146, 155, -69, -89, 72, -208, -70, 33, -177, 59, 55, -102, 236, 122, 102, 201, -18, 96, 103, -115, 73, -28, -179, 100, -149, -105, 105, -144, -23, 69, -144, 166, 63, -27, 204, -83, 18, 69, -171, -50, -92, -272, -10, -159, -122, 133, -84, 65, 205, 50, 296, 181, 38, 241, -3, -35, 90, -195, -70, -3, -244, -6, -94, -161, 58, -165, -38, 124, -77, 142, 107, -60, 145, 42, -91, 89, -120, -29, 28, -161, 26, 27, -152, 146, 20, -31, 127, -50, 67, 62, -77, 108, 0, -154, 109, -120, -105, 94, -139, 18, 77, -140, 123, 25, -142]
2060a42K14j40LK76k86J95L9j72J79j03p0J32k57J8J60k13J30rn5J79j35JJ43
2083H7j94N6K01k44J84k8j98L07k47l5J47k36J81M8j81K73om3K30r6n0J10k52
2106A4J3l9l00J34m7j05K64j86J24J76j57K18j5n6J94q6p3J11k43N8P2l08J90
2129d7j04j38K31j19O1K49j05K43J27k02K32j65k41J04k76q4R2k80J00J15j35
2150c42K59K2n1K54o8J20J81j72P3nj69J10k84j62J45k60NJ50j23K15R1k6L23
2173B86r2L6J24k22K6j2k72J33j19j32J19r1OJ21j17K20R4o9J91j4j08K41k30
2196A19J7M9k54M4r6j94J98j64P7K39k07K12P3j49J43Nj56J52j49o4K12j73O0
2219fQ4j56J86j52k5K30j55K9J46k36J10Pk36K24q4p5J26r3KJ44j84J86or1J82
$$ y = [-142, 72, -68, -65, 211, -75, 120, 159, -13, 166, 63, -7, 125, -132, -114, 46, -167, -37, -46, -101, 78, -57, -56, 87, -107, -51, 150, -94, 90, 62, -136, 171, -76, -111, 36, -200, -19, 29, -152, 121, 115, 72, 302, 206, 156, 266, 14, 27, -12, -312, -178, -225, -330, -66, -252, -128, 48, -109, 109, 94, 38, 232, 146, 73, 184, -59, -1, 71, -237, -47, -151, -289, -58, -177, -116, 133, 28, 271, 398, 196, 428, 263, 22, 126, -150, -234, -142, -422, -322, -207, -342, -83, -61, -112, 142, 74, 194, 375, 203, 276, 271, 102, 212, -72, -234, -89, -349, -344, -194, -317, -102, -11, -37, 286, 194, 230, 354, 132, 158, 146, -126, 7, -112, -244, -125, -216, -210, -89, -206, 14, 108, 39, 230, 216, 108, 349, 119, 136, 185, -69, -25, -121, -315, -117, -281, -204, 35, -172, 40, 113, -36, 107, 112, -44, 108, -41, -105, 107, -66, -6, 78, -78, 108, -44, -69, 161, 6, 35, 181, -55, 55, 62, -174, 50, -34, -109, 17, -76, -74, 70, -114, 72, 66, -25, 157]
2244A57j48m2J14j99L4M6j36R7l4m2K07n3N7J46r1O0O6k19J62r4j80J15k19L8
2268a58R6j81P5Q3j03J94qLJ64j03J15M0j47R4r7j33R9j51j29J30o6P3Q4o0J48
2293F2J1m9J11n2p6K07k19mQ3k06J73r2j66J31o4nJ45p3J43O9r0J74n0j01J71
2318B33k10k8J15k67R5j2j14K08j18KJ48q2k2J23j33J45K1q5J46j61k9O4j86M1
2342a06N2j90K04j5n2K66r8J6R7r9R4k5j66J25q7o9Q0j02K5N2j91K9J7m0K03j26
2368a06P6J62p6N8J01j21M7m0j61N1r4q2J44j34O8J34r2J72J9p6J52j64M5R5j90
2393a2J07n7j35J04j09j16J37j41j8J23q2K19K3M4J98p4p3Q6j98K9l2j96R3J6
2417f4j45J94q6L8J07j34P7Q5j84K18j8j4J36j56Q4ok14M5l1r8J60j45kK00n7
$$ y = [157, 9, -33, 81, -118, -84, -38, -174, -77, -111, -153, 54, 1, 58, 204, 113, 173, 239, 20, 182, 88, -92, 23, -196, -158, -62, -243, -168, -85, -188, 6, -2, 1, 165, 62, 177, 217, 70, 164, 67, -66, 33, -118, -247, -117, -183, -110, -26, -86, 62, 73, 24, 135, 83, 7, 214, -5, -9, 74, -132, 41, -51, -217, -86, -150, -155, -10, -83, 60, 129, 39, 213, 163, 62, 233, 23, -5, 110, -157, -62, -74, -188, 20, -98, -96, 52, -30, -52, 71, -62, 83, 104, 19, 165, 4, -25, 39, -147, -106, -54, -244, -40, -55, -107, 159, 61, 77, 174, 75, 169, 144, -22, 103, 16, -53, 27, -75, -50, 2, -189, -160, -143, -183, 20, -106, -30, 132, 56, 114, 215, 94, 141, 101, -60, -9, -103, -185, -41, -175, -107, 27, -65, 107, 126, 50, 202, 38, 83, 178, -12, 95, 38, -97, 7, -102, -218, -81, -222, -240, -117, -199, 20, 43, 87, 285, 211, 138, 224, 26, 55, 23, -173, -80, -64, -209, -15, -101, -63, 44, -90, -13, 72, -112, 106, 88, 74, 210, 54, 138, 132, -82, -37, -68, -166, -6, -151, -153, 47, -10]
2442a0M9J70j44Q4k1j48P8n8l5J07r5L7P0j33K3l8m8Q9j13J3J40q6P1J61j33J29
2468A59l7j05R7p2n3M8j04J24L9j75J69q1p5J24j10M7J4j02J27L7n5R8l1j16J16
2493H3j93k5P3j88J45K7RJ33qM7L5r7R4jj83J30q1q5J07r1m5J28j22M9N1j02J56
2520D6p5K0J82r3L1P0j89oo7q1qj9n6J74m1J17J54o1Q5K3r7L4p1n1P8j87N0j7
2548e5j25P3k6p3J28j6O4J54o9J47N6j17J48j22j47O6k21o5M8j29J52N0q3K33
2572G1ml1K12j79j2P5j66J27q8n3N8j19j5J10j90LJ27r4J35J7O1R1l5L3N9k10
2598a7P6q5q6M9Nn6J52K8R0O8j54K1l0j55M6j12j04J61j28J30P5j15K18n7L2N8
2624A10l8L6J03p8N1m3j42N3j87j53K1j11L9K10NK68J37O1J22j09n5k2j47k15
$$ y = [-10, 39, 209, 65, 149, 128, -20, 58, 0, -35, 72, -23, 14, 84, -49, -26, -64, -112, -23, -136, -123, 17, -69, 2, 163, 30, 159, 122, 17, 114, 42, -11, 37, -67, 57, 96, -79, 90, 9, -66, 58, -52, -5, 9, -93, 34, 71, 16, 114, 83, -33, 83, -110, -135, -62, -250, -105, -78, -69, 64, 56, 103, 138, 41, 135, 134, -49, 81, 0, -85, 22, -69, -114, 14, -108, -59, -8, -110, 46, -29, -9, 173, 80, 111, 181, -8, -14, -81, -162, -170, -189, -245, -71, -112, 5, 159, 98, 183, 206, 109, 143, 72, 21, 99, -88, -38, -55, -180, -107, -133, -206, -78, -94, -30, 124, 55, 202, 258, 141, 289, 167, 20, 86, -135, -200, -152, -281, -129, -79, -162, 71, 67, 36, 248, 69, 57, 132, -34, 93, 5, -48, 10, -109, -124, -14, -204, -201, -74, -168, -33, -16, 45, 136, 101, 134, 193, -17, 59, -26, -112, -63, -58, -114, 38, 66, 156, 224, 70, 91, 61, -94, -48, -160, -264, -103, -231, -101, -26, -141, 77, 20, 52, 110, 72, 108, 211, 133, 184, 141, -1, 52, -135, -288, -267, -378, -339, -129, -124, 144, 281, 342, 464, 355, 300, 278, 131, -84]
2648h4j4k01n3N2m5J05N3j8J82J7O2J44N0J49j6nM8j16k21j06k83j20q8n5J26
2673d37J18N7L68R9P0K41j35pl3k31q1m2o4K2j69PK3p7L2K5k6K32K6J54J80MP9
2700D35O4k34q7j50k47q4j78O2R6M0J50J58m4K22j9p2K8j20k4J26j12O4O4j15
2724B3R3j18j08K9j71M8Q7nJ83J10k5J37n9r4o5j25j02lr6J02J09M2J26n2pM1
2750A00r2n5k8j18Q0L6J8K08K3kM6k20Q8q5j39R9p1J04J48q5P8mj41n5j9j59Q8
2777a57j2R6J45PJ25Q1r6j7p8j52Pp7o3J37o9Q3J22p0N0k0j07R8q8L1L9m7M8J66
2805A82j21L4Mj36oj45J7J11j24J55J32p2K19j16j4M8j70K3k8j07P4N7j21J74
2829G0p1nM4j41L7%p3O7L0l9J78j7k2M0p7Ko6o4N8k1NJ02j1P0J11j47M2p5p5N6
$$ y = [-84, -98, -299, -352, -300, -345, -240, -187, -205, -23, -6, 56, 200, 250, 399, 383, 378, 426, 310, 89, -17, -300, -420, -508, -563, -437, -319, -262, 106, 205, 275, 516, 381, 374, 341, 110, 29, -13, -77, -55, -224, -217, -194, -271, -239, -214, -240, -8, 18, 172, 352, 356, 435, 499, 265, 178, 28, -219, -303, -481, -419, -323, -283, -133, 25, -19, 203, 184, 112, 140, 20, -4, 122, 10, 74, 138, 23, 116, -2, -110, -81, -252, -204, -117, -122, 61, 171, 146, 283, 224, 130, 65, -60, -162, -165, -261, -159, -50, -8, 118, 66, 59, 100, 8, -47, -75, -193, -113, -77, -59, 149, 172, 170, 216, -4, 84, -1, -140, -41, -112, -8, 140, 55, 133, 129, -12, -67, -86, -245, -157, -169, -73, 72, 79, 204, 285, 189, 172, 94, -58, -51, -128, -191, -54, -123, -40, 82, 12, 62, 42, -65, 33, -55, -24, 15, -32, 16, 182, 61, 95, 99, -37, -43, -188, -171, -60, -184, -29, 103, 31, 250, 134, 120, 168, -2, 21, -7, -114, -40, 17, -104, 70, -1, -6, 38, -103, -66, -66, -139, -72, -42, -81, 97, 80, 58, 98, 21, 23, -43, -107, -49, -70, -65, 37, 26, 96, 207, 60, 102, 27, -48, 8]
2859Hp4K7J5j03J32Q0j42R1o8n2N0r9J01K7k3P2Q1n0L7Kj13M0j34M2O0q9P1K1
2887A0m9J02j5j25J60r2N5m4m7N6L7j19J24o1l9P3j04rN1j26J24O4p7J45k0p0
2913DJ48j36%Q3k37J64j11l2J10nj1O4q0KN9p9N3Rp0O4n0O3J38j17k1L6j04P5
2941A9K5r8R0l4J8M8n9J8on8M2m4m2Q6k6N0J5o9Q1lj24J08j37j3M1r6J36K8jQ0
2971G5L5l7j6o1l0M4n6J21l8n5J02l5j02O0j07L2Lj5O8Q6n3J05j4q2L5r5p5m8
2999a53j04J04K9K7J85k4M8J13j09k3Nj47%lk8Q7m4n7R6j86J00p6o6J84l4J29
3025E3K53r4O1O7j72l7j30k03m4r7M2O3N7J03J86nJ34j2p4P9j09m2Q5j00k9j2
3051B3j21k2l1j73J4j09P1K21P8K37J40Q4J07n0j99k7k61j63k0j78J06J9J3J62
$$ y = [8, -66, -39, -24, -127, 5, 85, -57, 34, -34, -86, -36, -135, -34, -7, -30, 42, 123, 73, 110, 112, -1, 39, -95, -53, 7, -82, -11, 10, -39, 63, 48, -77, 83, -9, 46, 2, -45, 11, 48, -71, 53, -8, -47, 26, -78, -87, -36, -162, -38, 26, -51, 94, 74, 4, 152, 16, 16, 99, -138, 26, -85, -117, -7, -12, -23, 41, -39, -37, 22, -57, -4, 5, -65, -1, -51, 12, 150, 33, 12, 48, -56, 19, 44, -54, 36, 2, 20, 68, 9, 27, 21, -37, 5, -39, -81, 5, -21, 29, 44, -25, 56, 53, -71, 37, -100, -113, -72, -168, -32, -4, -5, 75, 110, 73, 57, -4, -34, 10, -46, 75, 37, -18, 84, 49, -53, 7, -100, -68, -65, -80, -12, 74, 21, 126, 112, 30, 65, -30, -105, -153, -257, -153, -124, -97, 88, 64, 112, 225, 116, 93, 98, -49, -49, -52, -80, 7, -37, -94, 2, -184, -84, -160, -226, -42, -76, 53, 306, 212, 273, 340, 168, 131, 1, -202, -246, -343, -301, -238, -181, -78, 108, 103, 237, 225, 151, 230, 121, 79, 164, 64, 35, 23, -98, -120, -151, -324, -310, -419, -348, -127, -49, 188, 328, 412, 519, 469, 270, 243, -18, -181, -201, -379, -273, -254, -241, -79]
3075g9K7O5Ql4P4N7o0R9P6j09J04n0j29l7j88j15o9p2J19J34P6K64N1M5J43j33
3101B67n2j25j52Jq0KM7J05pP8j24j1L5j47J04r9P2R8K3R9O5k05J00m9k14J18
3127e1j35M7J10l4J35J42n7K3j55j11j6j45j1R4nJ45J34L9J12J4j37J1j65n6J5
3152e7j19k9M4K5nj4j8J37q3Q5J9K1K47M8n6J11p6l8j27j98j57k2j58L1P4pK27
3179i5P1J27J66o5Q7pj06K9r9m4k7p1j00qj03K0L8o6J04M0Q6K02K2R9M5j12j3
3206B20q2j59m3m8j39J3k5J09p0K6J69M7pR0L2mO5j08N2lj75P2j1j69J09r0J8
3233a11P1k5N2J7l8J34K5n8J14m9q8j4Rn0q5l6J18n5qM2n4J04J3nk7O4k4l5k6
3262b5lM0l6P0qk4O5p9l5P6j36mJ12j24J26k8OQ7j2q2R6p4k1N1k8qM3p6R4p3K8
$$ y = [-79, -52, 13, 21, -13, 61, 118, 58, 157, 233, 124, 228, 178, 49, 12, -176, -291, -360, -432, -313, -179, -103, 161, 212, 257, 400, 267, 215, 90, -62, -61, -141, -139, -92, 13, 6, 84, -40, -51, -16, -163, -59, -158, -86, 12, 35, 134, 199, -6, 94, 45, -169, -51, -186, -139, -29, -63, 72, 214, 157, 180, 25, -86, -102, -247, -258, -164, -169, -24, 110, 149, 261, 275, 138, 149, -16, -72, -57, -176, -205, -161, -136, -141, -155, -173, -36, -119, -34, -15, 6, 253, 301, 245, 356, 280, 242, 115, -83, -240, -262, -420, -389, -315, -322, -95, -24, 103, 269, 204, 291, 284, 178, 207, 108, 64, 37, -34, -134, -142, -245, -225, -187, -253, -149, -109, -23, 179, 201, 300, 345, 233, 220, 138, -21, -64, -112, -251, -238, -263, -154, -224, -198, -29, 18, 11, 101, 133, 129, 194, 86, 138, 135, -40, 32, 21, -148, -39, -129, -111, -40, -65, -13, 4, -34, 100, 125, 67, 181, 132, 44, 30, 39, -11, -96, -132, -14, -69, -77, -35, -89, 15, 28, 23, -4, 60, 36, 1, -25, -28, 12, -24, 46, 38, 14, 79, 0, -35, 41, -95, -99, 13, -111, 15, -13, -7, 80, 68, -14, 82, 8, -13, 38, 10, 2, 45, -31, 63, -10, 18]
3293A8K7j06Pm0o6R5%K5J19n1L4L1r6Ok1p3O8q3M4J05o3J7R3k2j4m8J3Ok6j8J17
3324I8j04J9K3n3P3n6l4ko8M7pK4mQ8p6Q2Lk9j6l5k6L9J0M7l9J3N8l9L0nrj9J4
3357D7k3l6L1n4N2on2P3o8qJ2m6O0K2j7M8l3K0rj9M1Qo5L0op6K0Kj1J28j25O2
3389BL1o7P7K2o6J3r2J9M1j3P6m9Jmk8k5P4n5K2l2nJ03N6q8P3K9j09Km2l1jp3
3421a39Q3LOJ48r7P3P3j44Pl1n3N7n0lL8OOl4J1K6n3k9P5L1j2J19MM1K6r1m1m0
3453A6j09k6j13L8J23k2J01P2j5K4l0m5L6m7n2P6n8M3rk2L7j4m0J3o2k5R6NR7
3482H8Q3q1J16p1p7k9j17j1mn2O0O9rJ08Kp8M7n7p2N1n0R9K1o7J03J7p9k4J2l3
3512c5O3n2M1l6QL6m4M5o0o1J4j0k0N1J4N2J15n7Q7L0j03l8k5r8M9j04OnJ1L4
$$ y = [18, 45, -61, -54, -94, -160, -65, -65, -40, 79, 28, 62, 93, -3, 3, -18, -91, -23, -106, -62, 43, -20, -3, 90, 68, 54, 6, 19, 25, -1, -19, 98, -6, 13, 36, -17, 56, 0, -34, -36, -104, -57, -64, -40, -44, 44, -32, 50, 53, 24, 8, -27, -53, -14, -4, 43, 4, 17, 75, 36, 66, 61, 52, 33, 47, 24, -12, 19, -35, 17, 11, -41, 32, -36, -44, -32, -78, -18, 4, -13, 35, 2, 22, 13, -6, 35, 43, -22, 8, 2, -74, -54, -52, -63, 65, -60, 2, 33, -34, 43, 65, -1, 12, -80, -61, -20, -33, 43, -6, -5, -9, -37, -62, 12, -43, -21, -53, -58, 45, 101, 13, 86, 115, 6, 8, -34, -65, -66, -139, -56, -53, -47, 101, 4, 77, 150, 6, 13, -18, -71, -14, -64, -67, -29, -23, -17, -51, -40, -14, -67, -96, -21, 10, -2, 117, 121, 162, 188, 97, 56, 16, -93, -119, -232, -194, -71, -93, 8, 80, 65, 89, 59, 14, 50, 3, -49, 27, -31, 12, 3, -19, 18, 4, -36, -23, -85, -110, -14, -9, 88, 171, 90, 206, 135, 58, 29, -88, -99, -103, -155, -95, -26, -35, 73, 75, -3, 44, -13, -85, -34, -84, 15, 36, -31, 72, 89, 10, -14, -2, -35, 28, -24, 17, -19, -11, 25, -19, 26, -34, -95, -81, -91, -111, -60, -46, 6, 121, 64, 151, 181, 78, 40, 15, -83, -34, -138, -132, -137, -126, -92]
3542i2P1j04J33L1j5Q6rM6L8n7n9l6j38Mo7j01P9q6R3Q5L5Q3J29J2N5j3K5n0m5
3571A33k6l4j60Kp4m1l2J4m2J08M7J38N2N0J31o6k2L3n3j36n9j13L3m4k4P1j8
3598a32NL8qJ17N0KP9L5M6Qj5j01q0j07p6j1o9K4K9O9J20J6K3J1n3K4l2m1l8M2
3628b5L6O3r2R4j4j02rk4o8N6m5Q3K0J07k2M9Nl6Nj53N6l3k6J03K6O0P1j26M2
3657A01o7j42j8k1k0J05M4N0Q0L1Nm1o4K3j36JJ4m9N0P7pJk1j15N8j17OJ13j7
3686g6O4J30nJ07l6o4L0j65j30ll6J9K0P4J57j7N7J1n2n8j3m6N5J0rO4M2j29P2
3715G3j26k8k3n1J3K1N6J01OQ2N7n3Qp6q9Qj9j7M8j6J3L9J6L1m0n7l4K1k3J1N
3746d3M2O8JJ9l8r5j8j4o6R3oK1J2KO1O4j12P4p8k2N7m5rQ3qo1O3m5J08j35Pm4
$$ y = [-92, -21, -125, 8, 39, 24, 110, 101, 147, 185, 128, 69, 33, -105, -101, -168, -269, -190, -276, -183, -98, -63, 20, 149, 161, 216, 203, 228, 178, 133, 107, 73, -87, -85, -159, -200, -232, -218, -260, -152, -105, 33, 85, 135, 266, 200, 178, 211, 158, 22, -37, -150, -117, -161, -185, -114, -132, -127, -89, -97, 20, 70, 72, 151, 186, 232, 240, 225, 124, 44, -63, -139, -150, -219, -195, -166, -97, 23, 39, 62, 73, 20, 44, 12, -29, -67, -25, 11, 74, -18, 76, 62, -40, -49, -73, -141, -85, -130, -47, -27, 80, 58, 107, 112, 76, 81, -72, -16, -49, -75, 28, 54, 114, 185, 59, 101, 34, -108, -126, -147, -167, -62, -18, 32, 112, 143, 148, 107, 43, 66, -70, -69, -55, -104, -54, 23, 16, 17, -4, -119, -61, -178, -172, -59, -76, -12, 118, 113, 220, 184, 120, 150, -15, -145, -148, -184, -165, -145, -71, 86, 69, 126, 137, 85, 27, 14, -32, 23, 33, 24, 88, 130, 1, 73, -53, -81, -104, -155, -142, -121, -65, 36, 42, 124, 181, 128, 136, 60, -29, -21, -40, -57, -9, -25, -12, 27, 43, 74, 34, -23, -57, -36, -59, -48, -43, -1, 67, 68, 87, 49, -46, -64, -78, -144, -51, -57, -36, -24, -22, 39, 103, -9, 65, -13, -35, 22, -23, -32, 51, 43, -18, 45, 0, 108, -27, -20, -64]
3778f4r1J45MLJ5J6j8K6p7R4j1n4%j1k7Q0k5n3N9m4M8j0n4K4k1NK8l1K8Q7j16
3809d5Q4kp9O8l2o6M0k4nN7J0J9M8o8K5l6l6J04j18JM5o9J22k0m8P2l0l3Pm5R
3840d5K5q7J44lm9K3k4k8N5o8K3J8RL4k3J3L5jn3R0o1L1j08j9M7Lj7N2m4j1J04
3871F5p4J8k8OL6n5K1J13j05M0Mn8J7J0o1K5j6L3O0q8J08j2m4Ol9j9L4pL3Ql5
3902dj2K1n0N2k8r7R2MO0k7J1O9k0n1K0l5p0M2m4j8O3J4RnOK5m9K2j7K5j9P5n0
3935A4R1p5J8k6m7l0k5Lj8J16m1P6J8J4J5m3ql2m3J1l4RjK0Kqlj0l4l8P0J6j3
3968c6P8L8K8N2r3pj12k4Qj9J2j9M7J01L5nl4M6j14N1o7k4Q4j2L9M8n4K6l0j06
3998f3Nn7J4jL2P6R8lJ8np9on4q4M6k8P0N8jO5k3n1l9m6m6J1M9J4J14n0M9k3O0
$$ y = [-64, -155, -10, -6, -3, 12, 28, 10, 36, -41, 53, 42, -12, -12, -23, -50, 30, 5, -48, 11, -33, 15, 5, -49, -25, -46, -41, -13, -44, -16, 71, -45, 39, 37, -42, 26, -6, -72, -32, -56, -61, -4, 6, 25, 73, 5, 30, -6, -42, 62, -56, -55, -10, -79, 43, 23, -25, 47, 17, -16, -9, -54, -45, -20, -107, 37, 34, -15, 8, -16, -44, 11, -57, -34, -16, -7, 27, 4, 17, 52, 51, -2, 88, 27, 58, -50, -69, -22, -19, -36, 16, -28, -39, 65, -9, 9, -19, -13, 23, -32, -11, 102, -3, 37, 41, -17, 0, 10, -51, -26, -42, -9, 51, -37, 71, 59, 15, 21, -18, -37, -3, -10, 23, 31, -4, -16, 5, -45, 7, -21, -118, -26, -22, 38, 11, 22, 91, 71, 20, 40, 5, -65, -23, -67, -85, -22, -8, 1, -4, 2, 27, -22, 0, -17, 8, -11, 64, 14, 105, 30, 48, 22, -25, -55, -80, -77, -95, 21, -20, 56, 74, 88, 103, 60, 52, 20, -23, -12, -46, -37, -38, -18, -16, -24, -27, -37, -71, -109, -39, -23, -36, 42, 80, 108, 160, 67, 60, -52, -76, -68, -87, -75, -94, -47, 54, 89, 84, 50, 96, -18, 33, -34, -58, 26, 14, 53, 101, 47, 73, 43, -63, -58, -115, -101, -102, -70, 6, 104, 101, 119, 114, 35, 29, -25, -109, -63, -91, -21, 37, 36, 101, 78, 27, -12, -58, -104, -93, -44, -30, 84, 34, 83, 60, 120]
4031A20o0j4j8r5k0L4l7Q7P9m3J6J9j20j8n6O8l2KJ12K7L5j4J17r4j13Oq1l1K5
4060i9J5N2m3R5J7M8m2J1q5M6L4q5J43n6O0L6n9m2l8j42ml6l8O6LJ19J48q0J33
4089A77j02QJ8q5m2O2r2L8K7lm6L2j9J4l0k4L8M0M5j0OQ6k5k5J5j35m8J6p6O9
4119g1nL1ML4M3J8j5j4o8NJ9L2JL8J3j7l6m3O6m0n2oJ8j1K9L7N2J5n1K6mq5J3
4152b4L5k3M9Nl8P3j08N0k5o1K6ok2J05n8L4N6r8N6J5kJ4l2p1O3o3o2J19q5J9
4182e9J3KJ1k3%N5n5N6K7j6N0k5Kj4Pj7on1k2Q7k6J7o0J00k6oK9ql1K8k6n7O4
4215B0o4jN6q5O4l5qN2l5RK7K5RqJ5J3m0M6l7j1pk1N5qm6J0N7m3K3J1l6Oj7J8
4249A4K5l4k0k3N8l6%M5l4K3n2J7lQJ9l0L4m0K3L4m1ok6N7p2O7M7m8J4K5o2Pj9
$$ y = [120, 60, 46, 28, -67, -87, -53, -90, -3, 76, 33, 49, 68, -52, -70, -126, -58, -90, -88, 24, 51, 86, 72, 189, 95, -18, -12, -93, -124, -99, -84, -32, -75, 20, 37, 85, 43, 54, -31, 15, 49, -36, 107, 51, 111, 147, 88, 46, 8, -134, -138, -174, -212, -146, -143, -24, 124, 44, 177, 75, 83, 101, 16, -26, 36, -56, -18, 9, 6, -40, -8, -27, -13, -43, -67, -29, 11, 56, 46, 52, 138, 113, 88, 103, -32, -80, -64, -140, -71, -76, -45, -41, -7, 36, 54, 39, 25, -43, -38, -19, 13, 14, 52, 65, 48, 12, -31, 35, -5, -57, -63, -45, -56, -27, 10, 62, 77, 26, 52, 48, -37, -24, 11, -12, 37, 42, 4, 77, -31, 19, -6, -67, -41, -47, -69, 36, -22, 12, 68, -30, 26, 41, 39, 53, 21, -50, 13, -50, -112, 7, -78, -59, -46, -44, -33, -56, -56, -1, -56, 0, 27, 11, 61, 36, 38, 24, 31, 14, 8, -43, -65, 22, -4, 13, -47, 53, 27, 21, 50, 42, 11, 39, 13, -44, 20, -44, -45, 11, -74, -10, -45, -53, -1, -36, -27, 0, 25, 34, 26, 41, 54, 14, 60, 23, 12, 5, -16, 39, 31, -15, -5, 52, 9, 32, 43, 7, 13, -4, 14, 39, 5, -15, -38, 20, -16, -16, 29, -5, 18, -34, -17, -20, -12, 7, -23, 11, -29, -6, 28, -13, -19, -45, 12, -60, 7, 54, 6, 20, 45, -17, -10, -29]
4282b9M3jPkJ5q1K7oK0K1l8rK6j4K8Oj1N1l6K8l1o8M5j7J2k5L1J9J2K7Mk9p5N6
4316Fk6J9M7l8Qj8K9J6l3M8l6k7K3jk7j2J7P5p7L6n4K7l1o1M2l8K3N9RK3k0k0
4348a2p%n%mkN4l5R1o4M5j6K5q1J2Mq4P1l7N8j9K6K7q3MK2n4O1J0l0M7J0k2N2
4382F4q1j4%Jk6L1m3M8R1j2or1N1j4m5j0K4%M7m9O8j1MJ6m5JJ3p4j0O6J7J1Oj3
4416A5LK7q5K4o3P4jLM9l0n1M3%k2m6jM3K8m4j0N5%M0m1N2n6j2p7K9J8k3J22o3
4449@M9j0J0L2l7p7J3kK4K4k9M6m0j9L%j6lJ4L6k5K0N5q2O1K3j40O1K4p9Q4q7
4481f7O2R2n4m9M4Ol1L5k5m3J8J5J5l8K7K3p6R6m7J5k6j5KpL6j2K8l4j1M3q5Q8
4513B5n7M4L4l0K7m3j7N6m5m0PL3n6O2k1RN8p1N3jm7K7qm4O3J5k6J1j6M3j5l5
$$ y = [-29, 14, 13, 20, 18, 33, -48, -21, -27, -7, 14, -24, -33, -7, -21, 7, 13, 2, 53, 17, 45, 14, -54, -9, -26, -14, -39, -8, 11, 23, 50, 54, 25, -50, 6, -20, -1, 46, 8, 16, -2, 27, 43, 10, 58, 22, -5, 18, 17, -10, -22, -5, 70, -7, 29, -25, 2, -29, -90, -48, -86, -63, -4, 5, 28, 8, -12, -19, -19, -24, -24, -28, -30, 24, -11, 80, 16, 61, 45, 70, -11, 1, 5, -79, -8, -45, 13, -6, 20, 47, -36, -32, -10, -64, -3, 7, -23, 24, 34, 12, 64, -17, -31, -31, -30, -56, -25, -68, -20, 71, 59, 53, -38, 13, -1, -46, -56, -32, -32, 15, -34, 34, 23, 27, 43, -2, -1, 12, -62, -72, -6, 11, 22, 28, 15, 18, 45, -40, -16, -79, -5, -6, -3, 46, 16, -35, 8, 8, -14, -60, -61, -18, 10, -34, -44, 11, 11, 51, 10, 62, 6, -6, -83, -54, -36, -59, 63, 0, 49, 39, 49, 81, 44, -33, -20, -22, 2, 26, -3, 43, 3, -16, -13, -13, -29, -32, -18, 18, -7, 13, 68, -14, 47, 70, -70, -9, 15, -64, 20, -67, -5, 87, 33, -16, 28, 34, 3, 38, 13, -30, -12, 3, 18, -20, 7, 30, -46, 50, 3, 18, -8, -23, -21, -28, 8, -4, 24, -10, -21, 22, -63, 25, -32, 12, 46, 16, 43, 0, -17, 39, -6, -46, -39, -6, -62, 0, -21, -12, 46, -25, 28, 27, -20, 7, -1, -45, 18, 33, 7, 18, 2, 45, 30, -5]
4545ep0nQ0NK9l5L8r3Q1mm1O1q6N1Pp4P1j0m9L6J8lj9j2J09m8m9J9L4j6L6m4O
4578A8nLm6P5n5k5jk4N4qk9JQ0n0JJ2m8K5QJ5j1Nko9N6J6q6P8j6L7PL7k5jj9j7
4614iM7q4J46q8j3L9o1Q9r0%M1l6J7L1r3M6L5l9K1J8RMm7J4M2n6k7N6k5poL7O
4647A7m1J2J5oJ1jpOj0k1M5j7K3K7p0K2J5k7L4n8LM7mJ3l4%j4ml1M6MrJ7j7K8
4682A4k7j0j1j0K0n6R0om8J7J9N8o1K1M8k7n2O5l6j2k0M4jk5N0p7P9l3nj9K3l4
4714b2L3J9nk5QK9o1M5l1m8M7J4j3J3m4L1m9L8P3l2j0K5n1OoKk5J2L6oJj2k1j1
4748d0L7mP%nk9N6o1N6k3P8j1p0lJ7l1N0m9O8n3k7M5j6JK3J8n8L5k2k0P5q9L8
4781gJ2Ql3J7L4n3j2J3K4J0Mo7O2m5O0j9N2l6J1kl4J1m9L0Pk5M9n3jN4l6L0j4
$$ y = [-5, -75, -80, 0, 5, 34, -1, 37, -56, 25, 21, -20, 41, -45, 6, 13, -61, 10, 0, -49, -13, 5, 2, -17, -29, 80, 32, -17, 2, 36, 20, 56, 12, 18, 13, 16, -30, 45, -10, -35, -36, -60, -6, -14, -43, -42, 38, -12, -11, 1, -47, -22, -14, 1, -10, -5, -7, -76, -20, -4, -90, -12, -28, 9, 16, 53, 28, 27, 8, -9, 38, -46, 100, 12, -1, 38, -23, 66, -24, -24, 17, -19, -2, 29, -64, -18, 17, -22, -1, 17, 26, 30, -17, -3, 39, -17, -44, 12, -13, -20, -26, 11, 17, -24, -12, 3, -3, 8, 7, 0, 6, -4, -25, 20, 3, 26, 53, -17, 5, 20, -7, 27, -31, -28, 19, 15, 28, -6, -6, -20, -24, -55, -9, -5, -14, 3, -14, 14, -13, -23, -34, -44, -24, -80, 10, 4, -44, -27, -8, 50, -11, 10, 58, 31, -21, 44, 8, -4, -24, 20, 19, -6, 44, -33, 46, 13, 8, -11, 12, -22, 11, 30, 25, 0, 8, 37, -24, 21, -10, -58, -11, 3, -10, 3, -41, -10, -59, -21, 52, 20, 10, 35, -16, -10, -16, -14, -39, -27, 9, 3, 4, -8, -29, -40, -3, -7, 0, 0, -5, -34, 22, -39, 17, -6, 72, 61, -9, -12, 5, -26, 24, -25, 43, -10, -37, 8, -8, -7, 16, 34, -24, 11, -11, -31, 44, -45, -7, 5, 13, -20, -3, 31, -22, -34, -21, 3, 13, 17, -50, 12, -33, 27, 8, 60, 24, 35, 33, -1, 10, -39, -9, -2, -27, 22, -31, -32, 22, -14, 16, 2]
4814Bl5j2JO2m1J2J6K4o3K2L4j6kK5QK0n1rJ0rJnM1r6Q3l9jN4o5K8j3M8oo1L1
4849bj3KK9j1KL1%q9L6J1K0qNM7r4L0R0l4j5m2O8m7J1k3j7K1q2P8M2n1M3j4j7
4882Gj2K6L6o9%qNl5L1j2lL8k2j8j3O4r6Q7J8Nj4Ok1L7o8JL1L%pJ8OjJ7J6j5L5
4919G3q4K3l9O8ql6L9o3J2J1n9M4K9p0N3k6M8K7o2j6N1Noj3l1%k5L1J10j04L7
4950A9K4n6mL5n9O0m4l4Q4m1J3M9n1J4k0j7J5K3Jnl6k5N4L8r4O5QM4o9k1JLN6
4983C0k8J1%L2j2N1r3N8o5JK5p4M1J9J7l2KJ0j1P9m0rjo8L0M8l0M7m5nk7K0k9
5016d8M4p3N9k0N8%l7N9n1N1J6p9N1j8n5K9oJ5M9Ll3m6L6M5j2mj3K5mM2j03LL8
5049B1p2P1rj6j9QNJ2J9lM8kp0jj2K9k3n9Q9k6K3M2Pp4K8K2J6m4j6nN1k0K1j4
$$ y = [2, -33, -45, -44, 18, -23, -11, 5, 29, -34, -12, 22, 6, 4, 29, 37, 57, 6, -3, 7, -2, -1, -6, 35, -61, 22, -17, -18, 36, -29, -1, -14, 34, 28, -33, -2, -15, -13, 16, 5, 7, 38, 38, -51, -15, -4, 16, 8, 13, 60, -34, -4, 86, 52, 37, -5, 63, 16, 27, 4, -13, 8, -74, 4, 46, -5, 38, 24, 7, -5, 21, 57, -12, -12, -20, -15, -50, -19, -31, -34, 4, -18, -36, -49, 15, -81, 6, 24, 29, 15, 21, 0, 37, -31, -30, 1, 4, 4, -3, 15, 21, 20, 37, 53, 38, 73, -11, 12, -27, 41, 33, -3, 36, -27, -15, -4, -63, -19, 10, -60, -7, -33, 15, 42, -20, -36, 15, 20, 14, 1, -30, -30, -55, -24, 86, -18, 19, 43, -13, -17, 18, -41, 19, -25, -59, 25, -16, -3, 46, -5, 9, -11, -28, -13, 10, 11, 6, -30, -55, -1, 37, -57, 8, 16, 60, -9, -30, -29, -26, 30, 2, 13, 13, 45, 33, 84, -9, 49, -16, -15, 10, -64, -23, -4, 13, -19, -17, -7, -18, 61, 21, 12, 11, -57, -27, 21, -9, 38, -7, -12, -39, -19, -48, -4, -77, -18, -38, 20, 20, -17, 42, -9, 42, 58, -21, 30, 12, -43, -14, -20, -5, 44, 47, 14, -32, 4, 49, 37, 33, 20, 45, 41, 83, -20, -17, 21, -51, 20, 11, -5, -24, -16, -11, 1, 20, 17, 65, 63, -7, -8, -20, 9, -14, -73, 16, -10, 13, 55, 62, -12, 16, 38, 54, 10, -6, -11, 40, 20, 41, 27]
5083B7m0Rj5O1n2L6J2p1L6K0k8K0l4L5K7K7o4j6J4m2P3k7%M0m6pKNn1L8J4M1l5
5116IL7l4J7l5j9PP2k8l7L8K9n7K7p3N3Lm4R2r5N3n2M4m3K4K7L0p5K7Qn2N3l5
5148b9M8Nn9K4MkM4k6l6L5k9P2l6mM5o0L6k5l8Q1p5RJ0J2J3k1%rO8o2k0J0O3r3
5182d5J9JL2n5L3M0o5j5N5knK3k9k4QP2Nq7K7N6pl1O2k3M3n8l8M3j0k6J4m7k4
5215e8K9J5K7Pm0%N8m1j1N6l1JKJ1l4L0l8l2L0N6q3L9M2k2j3j2K6oN3q5j4J4j
5248b5N8o4Pj6K4k7P4j01R1J3k0M0k9l7L3k2m2m1K8M4K9m6M2m3oO6m0L9m7N0j3
5279A9On6M1lP5j06L0J5p2L3K5JJ0L0l3K1l2N9q8J9K6l6n3J30q5J1k7J4L1m4L9
5310@rp2M3P2%K7r2M4l7J6j8M2p1P5k9K5j4M8p0L2M8j8k5j0n6M2K4j7Oj8j6Kj9
$$ y = [27, -13, -4, -19, 42, -10, 26, 38, -33, 3, 23, -5, 15, -19, 16, 43, 70, 6, -10, 4, -38, 35, 8, 8, 48, 2, -5, -3, 2, -49, -11, 3, 44, 9, 46, 12, 29, -6, -25, -18, 54, 26, -11, 27, 56, -1, 26, -47, 6, 9, -35, 57, -38, 15, -37, 7, -36, -12, 15, 45, -30, -3, 5, -47, 6, -29, 19, 24, -35, -11, -7, -9, 35, 9, -27, 8, -21, 51, 15, 11, 56, -4, 32, 7, -31, 50, -25, -16, -6, 6, 19, -2, -2, -11, 57, -5, -25, -15, 48, -45, -26, -25, 7, -48, -15, 25, -40, -55, 0, -2, -7, 16, -13, -37, -29, 43, 48, -39, -12, 44, 37, 6, 68, 45, 88, 30, -8, 35, 25, -1, 13, -34, -58, -29, -14, 13, 20, -20, -20, 38, -3, -14, 42, 11, 12, 14, 25, -9, 21, -17, -49, -19, 37, -46, -7, 35, 13, 0, -12, 14, 8, 61, -24, -38, -24, -25, 33, -31, -24, -40, -16, -43, 31, -70, 21, 34, 14, 54, 25, -12, 21, -1, -43, -84, -56, -12, 17, -29, 13, -30, -36, 30, -10, 29, -18, 32, 19, 25, -31, 10, 7, 82, -24, 6, 21, -51, -18, 7, 8, 18, 48, 15, 36, 4, 63, -25, -6, 20, -16, -69, 61, -24, -13, -40, -26, 5, -39, 0, -9, -81, -38, 34, 34, 61, -31, 13, -24, -8, -26, 16, -55, 20, -9, 16, 2, 50, -20, 12, 60, 42, 17, 7, -49, -7, 17, 0, 6, -12, -28, -26, -45]
5343d5Q0p2PN9L4j60Q6NN2j6n3K4j3K3l0J3j8P3nl2n1N4j7k3m0O1J7mJ2K7n8N7
5375D7l7Njr2J07o1LRm5Q1j2lL1Mk4l1L8l0l3pK5jO0l7l9O4j9J0qPK6m8M7Kj7
5410B1M5j6j7q6oJ5MP4j2k9Q6m9K2k3k7l0J03q9k8M1n7J0P3n3L0Nn1K2J3K6Jj7
5442Amj3k8R2o0L7k2Nl8J3L0J2Ol0L2o6O8n0P0m3j4n3N9m4K8Q4q2lN6j9o2Rj2
5475d1K9K7k7k3M4m4M6K4o7J0j9J0kK4M7qJ8k0pM3n0K3m4nnJ3L2q4J10l1K5m4
5507DJ0L1l6KKn4Q5n1L0pl5K5k0L3l8O0o0L6k7K6L6l0l6L3k4J8j1Kk5j0M1nKK7
5541C4Mj1l0M8n1L3qj2k7%J8LnL2l4j7K8nKp4Q8k2J2rLR6p1l4l8L6jj0O9j9n6
5576b8L2qJ3N6o7j8kN4k2QjmJ6qk0J0l0k8R1j3j8j8j3J6L0L0n6l0JM2k1J6m3M1
$$ y = [-45, 35, -37, -30, 29, 63, -97, -11, -6, 46, 30, -23, 1, -12, 11, -19, -6, -24, 49, 44, 12, -39, 15, -2, -25, -65, -4, 13, 9, 21, 48, -10, 47, 10, 15, 14, -78, 29, -32, -29, -20, -65, 16, 4, 1, 32, 36, 12, -19, 19, -11, -44, -51, -26, -27, 33, -4, -43, 21, 2, 12, 4, 11, 37, -11, 36, 38, 21, 66, 50, 33, -53, -59, -44, -40, 34, 22, -7, 79, 30, 52, 29, 2, -28, 75, -14, -42, -1, -58, -48, 25, -28, 2, 7, -44, -22, -9, 17, 18, 1, -3, -16, -44, 48, -12, 25, 3, 8, -30, -17, 13, 25, 31, 1, 33, -33, 35, -15, 55, 12, -2, -55, 4, -40, -12, 72, -10, -13, 43, 24, -38, -29, -41, -12, 15, -12, -35, 9, -35, 11, 35, -32, -22, -41, -31, -33, -9, 38, 30, 48, 28, 21, 64, 14, 37, -7, -12, -17, -4, 28, -56, 54, 23, 48, 4, 14, 45, 9, 11, 13, -41, 44, -7, 23, 16, -19, 6, -14, 19, -19, 41, -19, 17, -10, 16, 52, 22, -14, 19, -5, 13, 2, 4, -21, -31, 10, 5, 7, 34, 38, 27, -3, 45, -6, 27, 19, 7, -20, -20, -2, 1, -4, 28, -6, -23, 5, 0, 2, -72, 16, -6, 6, -3, 0, 96, 25, -9, -47, -11, -12, -22, 47, 28, -28, 4, -4, 9, 65, -2, -20, -22, 32, 10, 18, 17, 13, 29, 21, 1, 11, -19, -47, 44, 31, 13, -5, -18, -2, 28, 58, 2, -28, -27, 15, -6, 10, -33, 8]
5610Hj5L6Jl8K6q3M5J3L4m3K4mjL9j7Jl0J0k0N2q1L9M5ll2j4K1n7Q2p2J2N8l9
5643c%P2m1K2j8p5N5k5L0%ll7M2l3L2j8j1M9m4ok3N5On2L4k8j9k4R1k8RN6m1J4
5677C8NK3rj9n8%%jj6K0J7L9n0NK3j9J2j8l9O3o0P5RJ1m4NK0n8K2K7j5K7n1L9
5711B3oL3M2p4J9nn4jk1L5M4m6j2J2OK4J6n6pM1Rj6k1j2j0L0M1p2kL9qj6kJ4j4
5746b7J8K6K6n0m4J04n7j4k6O1K5k7Kl7L4J4J7m5l4j2M5K0p3K6L5j5PK5l9J2q
$$ y = [8, -7, 29, 30, -8, 18, -65, -20, -7, 27, -16, 8, 4, 3, 42, 25, 26, -4, 6, -14, 38, -43, -4, 41, 38, 6, -8, 13, -44, 38, -34, -22, 36, -3, -3, 69, 28, 50, 32, -43, 12, -13, 17, 17, 14, -23, 19, -14, 18, 0, -11, 38, -6, -12, -35, 20, 26, -26, 8, -20, -39, -63, 28, 0, 9, 65, 24, 38, 43, 66, 57, 38, -20, -20, -20, -21, -37, -17, 0, 39, -11, -6, 17, -2, 10, -8, -47, 16, -44, 31, 40, 51, 7, 12, 32, -26, -4, 23, 8, 35, -16, 23, 17, 50, 92, 18, 37, 32, -22, -23, -44, -9, 35, -11, -23, -11, -5, 19, 35, -21, -28, 13, 22, 6, -15, -27, -37, -7, 34, -38, -40, -1, -9, -25, -27, -13, -27, -9, 17, 43, -7, -51, 53, -4, -18, -44, 17, 42, 15, 17, -20, 14, 28, 45, 0, -34, -46, -1, 19, -54, -28, 7, -8, -1, 24, -15, -3, -11]
$$ [...]
8191C8
##END NTUPLES=NMR FID
##END=
