##TITLE=1H_Pr 5088-2
 CDCl3
 8 sc, 
 23.12.2022
##JCAMPDX= 6.0         $$ Bruker NMR JCAMP-DX V2.0
##DATA TYPE= NMR FID
##DATA CLASS= NTUPLES
##ORIGIN= UXNMR, Bruker Analytische Messtechnik GmbH
##OWNER= root
$$ XWIN-NMR		Version 3.5
$$ Fri Dec 23 16:02:02 2022 Russian Standard Time (UT+4h)  she@DPX200
##.OBSERVE FREQUENCY= 200.13135
##.OBSERVE NUCLEUS= ^1H
##.DELAY= (6, 6)
##.ACQUISITION MODE= SIMULTANEOUS
##.ACQUISITION SCHEME= undefined
##.AVERAGES= 8
##.DIGITISER RES= 18
##SPECTROMETER/DATA SYSTEM= spect
##.PULSE SEQUENCE= zg30
##.SOLVENT NAME= CDCl3
##.SHIFT REFERENCE= (INTERNAL, CDCl3, 0, 15.7039)
##AUDIT TRAIL= $$ (NUMBER, WHEN, WHO, WHERE, WHAT)
$$ ##TITLE= Audit trail, XWIN-NMR		Version 3.5
$$ ##JCAMPDX= 5.01
$$ ##ORIGIN= Bruker BioSpin GmbH
$$ ##OWNER= she
$$ F:/spectra/data/she/nmr/H-F/1/audita.txt
$$ ##AUDIT TRAIL=  $$ (NUMBER, WHEN, WHO, WHERE, WHAT)
(   1,<2022-12-23 16:01:05.59 +0400>,<she>,<DPX200>,
      <created by zg, POWCHK disabled, PULCHK disabled
       configuration hash MD5:
       00 E9 B6 7A A2 85 ED C7 34 08 36 98 17 FE 4E 26
       data hash MD5: 16K
       5D 70 5E D5 D7 11 7C AA AA 8D 4E C7 8C 21 E3 2B>)
$$ ##END=
$$ 
$$ hash MD5
$$ 04 86 85 95 C6 07 00 13 FE 9A 83 9B 2B 8D 30 48
##$RELAX= 
##$RELAX= 
##$RELAX= 
##$RELAX= 
##$RELAX= 
##$RELAX= 
$$ Bruker specific parameters
$$ --------------------------
##$DU= <F:/spectra>
##$EXPNO= 1
##$NAME= <H-F>
##$PROCNO= 1
##$TYPE= <nmr>
##$USER= <she>
##$AMP= (0..31)
100 100 100 100 100 100 100 100 100 100 100 100 100 100 100 100 100 100 
100 100 100 100 100 100 100 100 100 100 100 100 100 100 
##$AQSEQ= 0
##$AQ_mod= 1
##$AUNM= <au_zg>
##$AUTOPOS= <>
##$BF1= 200.13
##$BF2= 200.13
##$BF3= 200.13
##$BF4= 200.13
##$BF5= 200.13
##$BF6= 200.13
##$BF7= 200.13
##$BF8= 200.13
##$BYTORDA= 1
##$CFDGTYP= 0
##$CFRGTYP= 5
##$CHEMSTR= <none>
##$CNST= (0..31)
1 1 145 1 1 1 1 1 1 1 1 1 1 1 1 1 1 1 1 1 1 1 1 1 1 1 1 1 1 1 1 1 
##$CPDPRG= <>
##$CPDPRG1= <>
##$CPDPRG2= <>
##$CPDPRG3= <>
##$CPDPRG4= <mlev>
##$CPDPRG5= <mlev>
##$CPDPRG6= <mlev>
##$CPDPRG7= <mlev>
##$CPDPRG8= <mlev>
##$CPDPRGB= <>
##$CPDPRGT= <>
##$D= (0..31)
0 1.2 0 0 0 0 0 0 0 0.06 0 0.03 0 0 0 0 0.0002 0 0 0 0 0 0 0 0 0 0 0 0 
0 0 0 
##$DATE= 1671796864
##$DBL= (0..7)
120 120 120 120 120 120 120 120 
##$DBP= (0..7)
150 150 150 150 150 150 150 150 
##$DBP07= 0
##$DBPNAM0= <>
##$DBPNAM1= <>
##$DBPNAM2= <>
##$DBPNAM3= <>
##$DBPNAM4= <>
##$DBPNAM5= <>
##$DBPNAM6= <>
##$DBPNAM7= <>
##$DBPOAL= (0..7)
0.5 0.5 0.5 0.5 0.5 0.5 0.5 0.5 
##$DBPOFFS= (0..7)
0 0 0 0 0 0 0 0 
##$DE= 6
##$DECBNUC= <off>
##$DECIM= 32
##$DECNUC= <off>
##$DECSTAT= 4
##$DIGMOD= 1
##$DIGTYP= 9
##$DL= (0..7)
0 120 120 120 120 120 120 120 
##$DP= (0..7)
150 150 150 150 150 150 150 150 
##$DP07= 0
##$DPNAME0= <>
##$DPNAME1= <>
##$DPNAME2= <>
##$DPNAME3= <>
##$DPNAME4= <>
##$DPNAME5= <>
##$DPNAME6= <>
##$DPNAME7= <>
##$DPOAL= (0..7)
0.5 0.5 0.5 0.5 0.5 0.5 0.5 0.5 
##$DPOFFS= (0..7)
0 0 0 0 0 0 0 0 
##$DQDMODE= 0
##$DR= 18
##$DS= 0
##$DSLIST= <SSSSSSSSSSSSSSS>
$$ [...]
##$SUBNAM2= <"">
##$SUBNAM3= <"">
##$SUBNAM4= <"">
##$SUBNAM5= <"">
##$SUBNAM6= <"">
##$SUBNAM7= <"">
##$SUBNAM8= <"">
##$SUBNAM9= <"">
##$SW= 18.05172834244
##$SWIBOX= (0..15)
0 0 2 0 0 0 0 0 0 0 0 0 0 0 0 0 
##$SW_h= 3612.71676300578
##$TD= 16384
##$TD0= 1
##$TE= 0
##$TE2= 300
##$TE3= 300
##$TEG= 300
##$TL= (0..7)
0 120 120 120 120 120 120 120 
##$TP= (0..7)
150 150 150 150 150 150 150 150 
##$TP07= 0
##$TPNAME0= <>
##$TPNAME1= <>
##$TPNAME2= <>
##$TPNAME3= <>
##$TPNAME4= <>
##$TPNAME5= <>
##$TPNAME6= <>
##$TPNAME7= <>
##$TPOAL= (0..7)
0.5 0.5 0.5 0.5 0.5 0.5 0.5 0.5 
##$TPOFFS= (0..7)
0 0 0 0 0 0 0 0 
##$TUNHIN= 0
##$TUNHOUT= 0
##$TUNXOUT= 0
##$USERA1= <user>
##$USERA2= <user>
##$USERA3= <user>
##$USERA4= <user>
##$USERA5= <user>
##$V9= 5
##$VALIST= <valist>
##$VCLIST= <CCCCCCCCCCCCCCC>
##$VD= 0
##$VDLIST= <DDDDDDDDDDDDDDD>
##$VPLIST= <PPPPPPPPPPPPPPP>
##$VTLIST= <TTTTTTTTTTTTTTT>
##$WBST= 1024
##$WBSW= 4
##$XGAIN= (0..3)
0 0 0 0 
##$XL= 0
##$YL= 0
##$YMAX_a= 296016
##$YMIN_a= -202641
##$ZGOPTNS= <>
##$ZL1= 120
##$ZL2= 120
##$ZL3= 120
##$ZL4= 120
##$ABSF1= 10
##$ABSF2= 0
##$ABSG= 5
##$ABSL= 3
##$ALPHA= 0
##$AQORDER= 0
##$ASSFAC= 0
##$ASSFACI= 0
##$ASSFACX= 0
##$ASSWID= 0
##$AUNMP= <proc_1d>
##$AZFE= 0.1
##$AZFW= 0.1
##$BCFW= 1
##$BC_mod= 2
##$BYTORDP= 1
##$COROFFS= 0
##$CY= 11.3945322036743
##$DATMOD= 1
##$DC= 2
##$DFILT= <>
##$DTYPP= 0
##$F1P= 2.36226072786647
##$F2P= -0.459571619588291
##$FCOR= 0.5
##$FTSIZE= 0
##$FT_mod= 4
##$GAMMA= 1
##$GB= 0.15
##$INTBC= 1
##$INTSCL= 1
##$ISEN= 128
##$LB= 0.24
##$LEV0= 0
##$LPBIN= 0
##$MAXI= 10000
##$MC2= 0
##$MEAN= 0
##$ME_mod= 0
##$MI= 1.114404
##$NCOEF= 0
##$NC_proc= 0
##$NLEV= 6
##$NOISF1= 3.799351
##$NOISF2= 2.8
##$NSP= 1
##$NTH_PI= 0
##$NZP= 0
##$OFFSET= 15.70392
##$PC= 1
##$PHC0= -19111.17
##$PHC1= 10.00073
##$PH_mod= 1
##$PKNL= yes
##$PPARMOD= 0
##$PSCAL= 0
##$PSIGN= 0
##$REVERSE= no
##$SF= 200.130013532006
##$SI= 16384
##$SIGF1= 3
##$SIGF2= 2
##$SINO= 400
##$SIOLD= 16384
##$SREGLST= <1H.CDCl3>
##$SSB= 0
##$STSI= 0
##$STSR= 0
##$SW_p= 3612.71676300578
##$SYMM= 0
##$S_DEV= 0
##$TDeff= 0
##$TDoff= 0
##$TI= <>
##$TILT= no
##$TM1= 0
##$TM2= 0
##$TOPLEV= 0
##$USERP1= <user>
##$USERP2= <user>
##$USERP3= <user>
##$USERP4= <user>
##$USERP5= <user>
##$WDW= 1
##$XDIM= 8192
##$YMAX_p= 0
##$YMIN_p= 0
$$ End of Bruker specific parameters
$$ ---------------------------------
##NTUPLES= NMR FID
##VAR_NAME=  TIME,          FID/REAL,        FID/IMAG
##SYMBOL=    X,             R,               I
##VAR_TYPE=  INDEPENDENT,   DEPENDENT,       DEPENDENT
##VAR_FORM=  AFFN,          ASDF,            ASDF
##VAR_DIM=   8192,          8192,            8192
##UNITS=     SECONDS,       ARBITRARY UNITS, ARBITRARY UNITS
##FACTOR=    0.0002768,     1,               1
##FIRST=     0,             0,               0
##LAST=      2.2672688,     0,               0
##MIN=       0,             -202641,         0
##MAX=       2.2672688,     296016,          0
$$ Real data points
##PAGE= N=1
##DATA TABLE= (X++(R..R)), XYDATA
0@%%%%%%%%%%%Qj6J6j6K4l2L5m3N6o5P3q8J05j27J51j76K02k33K70l07L48l96
$$ 0 0 0 0 0 0 0 0 0 0 0 0 8 -8 8 -8 16 -16 19 -24 32 -33 40 -48 57 -70 81 -95 107 -126 144 -163 185 -211
33b11M50n10N75o46P26q12R05j007J119j244J379j524J686j862K052k261K490
$$ -211 239 -271 304 -342 384 -428 477 -530 589 -655 724 -800 886 -976 1076 -1185 1305
50A305k742L018l324L668m051M479m963N517o158O908p800Q883j0229J1953j4256
$$ 1305 -1437 1581 -1743 1925 -2126 2353 -2610 2907 -3251 3657 -4143 4740 -5489 6464 -7792
65g792J7510k2498L1234n1155J85390J43327n2470k9111j47336m1958j57332J4411
$$ -7792 9718 -12780 18454 -32701 152689 296016 243546 214435 67099 25141 -132191 -117780
77a17780q4861M2599L8388K6107Q5763j6390P0702m6723M230p322l9878N0356
$$ -117780 -202641 -160042 -121654 -95547 -9784 -26174 44528 -2195 2035 -5287 -45165 5191
89E191l7469R3419j0335N4171J8726k7573J3188r7248K632r1825j7598j2942j6444
$$ 5191 -32278 61141 50806 104977 123703 96130 109318 12070 14702 -77123 -94721 -107663 -124107
102a24107O6026j6220R3971r470L8013M069k9831J8872o9599M1624m0233K7589
$$ -124107 -58081 -74301 19670 10200 48213 52282 22451 41323 -28276 13348 -26885 704
114G04J7956o48M6817m8334M0307o0043q527k3719l2439L1266l4339P2034q917
$$ 704 18660 18012 64829 16495 56802 -3241 -11768 -35487 -67926 -36660 -70999 1035 -7882
127g882M4165J4804j6251J7354p1625J4799o2608L352r4L860O5820k597Q1540
$$ -7882 36283 51087 34836 52190 -19435 -4636 -67244 -63892 -63986 -60126 5694 3097 84637
140H4637p734K6884j3841m3826r218q4535N646n4262J4824R577J2467O2653r430
$$ 84637 76903 103787 89946 46120 36902 -47633 -41987 -96249 -81425 -71848 -59381 3272 -6158
153f158O1964k0655J5722j7589l2274J0178n3022L2716k5832K9376J0548L051
$$ -6158 55806 35151 50873 33284 1010 11188 -41834 -9118 -34950 -5574 4974 8025
165H025L7244l4698L2085l9813M098j7606j9742K3565l2051M3754j8659K7536
$$ 8025 45269 10571 42656 2843 6941 -10665 -30407 -6842 -38893 4861 -13798 13738
177A3738J499r246K1491m0162K5948l5704J3325n758p900K8478k5335L8399k3225
$$ 13738 15237 5991 27482 -12680 13268 -22436 -9111 -14869 -22769 5709 -19626 18773 -4452
190d452K0734m093r205K3048k9737L1911k6431J7316q422j5417J3050l8548J9901
$$ -4452 16282 12189 2984 26032 -3705 28206 1775 19091 10669 -4748 8302 -30246 -10345
203a0345l3950J5171l516n75L3589j1931M4397j2283K6538l537j2635J0380l9866
$$ -10345 -44295 -29124 -32640 -33215 374 -11557 32840 20557 47095 43558 30923 41303 1437
216A437J3789l7875P137j1700r019K1442k0831L3362j7933K2244j772m053J8989
$$ 1437 15226 -22649 -15512 -27212 -36231 -14789 -35620 -2258 -20191 2053 281 -3772 15217
229A5217k3299K7327k2354J8482l416m887J7963k3532K4324k5900J1945j0786
$$ 15217 -8082 19245 -3109 15373 11957 7070 25033 1501 25825 -75 11870 1084
241A084j1452J0033k7179K2179k4630J6861k433j524K0497j4741K9779j7229J8509
$$ 1084 -10368 -335 -27514 -5335 -29965 -13104 -15537 -17061 3436 -11305 18474 1245 19754
254A9754m608o856J1722k4880J8511k5424J2057p152m707J5701j7675K5090j8825
$$ 19754 15146 8290 20012 -4868 13643 -11781 276 -6876 -11583 4118 -13557 11533 -7292
267g292J5998n717n462J1470k1476J9641k1306J4571n211j689J5147j6846K3348
$$ -7292 8706 2989 -2473 8997 -12479 7162 -14144 427 -4784 -6473 8674 -8172 15176
280A5176j8496J4177o663m724R916k0663J8469k0677J2741n757k072J2756j5142
$$ 15176 -3320 10857 4194 -530 9386 -11277 7192 -13485 -744 -6501 -8573 4183 -10959
293a0959K2595j6657J4916n564l264R411j8795J7761k0238J2388n583j010J2450
$$ -10959 11636 -5021 9895 4331 1067 10478 -8317 9444 -10794 1594 -3989 -4999 7451
306G451j4288K0524j7181J2587p712n108O759j7603J7241j7012J4856l041R69
$$ 7451 -6837 13687 -3494 9093 1381 -3727 3032 -14571 2670 -14342 514 -2527 -1558
319a558J2352j4044J7243j9106R625q882m171Q536j2952K0610j1796J6725l103
$$ -1558 10794 -3250 13993 -5113 4512 -4370 -8541 -5 -12957 7653 -4143 12582 9479
332I479j526O861j8698J0715k1604Q227p052J002J3234o941K2553j0723J3205
$$ 9479 7953 14814 -3884 6831 -14773 -6546 -13598 -12596 638 -6303 16250 5527 18732
345A8732q279o809N28k1326J0598j7463J4078j92P181J5804o615J8135j6686N374
$$ 18732 10453 3644 4172 -17154 -6556 -24019 -9941 -10133 -2952 12852 6237 24372 7686 13060
359A3060j4000q607J083j3941J8303p872K0199L209N666Q524j5396O613k4752
$$ 13060 -940 -9547 -8464 -22405 -4102 -11974 8225 11434 17100 25624 10228 16841 -7911
372g911N44j3579l308Q801m390K3507m521J7411l142k570O4j8972O306j7472J1169
$$ -7911 -7367 -20946 -24254 -15453 -19843 3664 -857 16554 13412 10842 10906 -8066 -1760 -19232 -8063
387h063m23Q944J5785l016J6440j5497J859j8368j3059n540j6686J3759m395K2912
$$ -8063 -8486 458 16243 13227 29667 14170 16029 -2339 -15398 -20938 -37624 -23865 -28260 -5348
401e348R414J4159J4171p965O978k2486l196j8225o869L073n757K0748j405J7841
$$ -5348 4066 18225 32396 24431 31409 8923 5727 -12498 -19367 -16294 -22051 -1303 -2708 15133
415A5133k275j105k994k0449l58j9794P603o55J2950K1184Q354K4127m733O693
$$ 15133 12858 11753 8759 -11690 -12048 -31842 -24239 -24894 -11944 9240 17594 41721 36988 43681
429D3681j6593j6290j4672k6032j206j4252J4167N585J6290J9403L417J5820j1196
$$ 43681 27088 10798 -3874 -29906 -31112 -45364 -31197 -25612 -9322 10081 13498 29318 18122
442A8122L395j5248q017j674r461J2349m135J5891j435J394q72j6079k065k0042
$$ 18122 21517 6269 -1748 -3422 -12883 -534 -4669 11222 9787 11181 10309 -5770 -7835 -27877
456b7877L084o200Q133J6652R560K4934K220J4348q668r125j1563k2873n901j9053
$$ -27877 -24793 -30993 -22860 -6208 3352 28286 30506 44854 36186 27061 15498 -7375 -13276 -32329
470c2329N814k008R384J2958L153J3892q190O078j0055l885N96m348J3842q91
$$ -32329 -26515 -28523 -19139 -6181 -3028 10864 2674 8752 -1303 -5188 -4592 -8940 4902 4011
484D011J7619J993L412o81j4795n508k4608m640j3037l28Q070O382K2133N301
$$ 4011 21630 23623 27035 26354 11559 6051 -18557 -23197 -36234 -36562 -28492 -22110 23 5324
498E324J9746J161Q17l804j4536l406j8056K336n426M368Q204K180J3288n737
$$ 5324 25070 26231 27048 23244 8708 5302 -12754 -10418 -15844 -11476 -3272 -1092 12196 6459
512F459O800q619n563n312r723M589q026J1176J794P653O362j471P746j0603M141
$$ 6459 13259 4640 -923 -6235 -15958 -11369 -19395 -8219 -6425 1228 7590 6119 13865 3262 7403
527G403o643q7J585k376J0036n363P759m713j705n104j0827R10j3208L761l144
$$ 7403 760 673 2258 -118 9918 4555 12314 7601 5896 792 -10035 -9125 -22333 -18572 -21716
542b1716N188O447L513J4297j301J0607o66L004p67n822M046j1253J592q719k928
$$ -21716 -16528 -10081 -6568 7729 6428 17035 16369 19373 18606 12784 16830 5577 7169 -1550 -4478
557d478n333q592K784r042O094j371P925P115M678J4401N84J0042k068K424l535
$$ -4478 -9811 -18403 -15619 -24661 -18567 -19938 -12013 -4898 -220 14181 14765 24807 22739 25163 21628
572B1628r491q16j4063l126j0416k635l050m459Q050j827J0808L438J0692P521
$$ 21628 12137 11321 -2742 -5868 -16284 -18919 -21969 -26428 -18378 -20205 -9397 -5959 4733 12254
586A2254K246J0283m100L475p925k663p031j1013q05j0311J167m587M566K887
$$ 12254 14500 24783 20683 24158 16233 13570 6539 -4474 -5279 -15590 -14423 -19010 -14444 -11557
600a1557K56R181j321P247k280M558J258k263O078l756N097n044R90l711q215
$$ -11557 -11301 -2120 -3441 3806 1526 6084 7342 5079 11157 7401 12498 7454 8444 4733 -3482
615c482p88r735R29n352M687M998K907J1275K052Q662l082J207l105q729j084
$$ -3482 -4270 -14005 -13076 -18428 -13741 -8743 -5836 5439 7491 16153 13071 14278 11173 2444 1360
630A360q524J851m888M143L539q89O030l207L801o420O84p43l351M460j539P294
$$ 1360 -7164 -5313 -10201 -6058 -2519 -3408 2622 -585 3216 -3204 -2520 -3263 -6614 -2154 -3693 3601
646C601j272M754J486l304J206o872J187o779R37Q86n19N876n90O312k926J231
$$ 3601 2329 7083 8569 5265 6471 -401 786 -5993 -5056 -4170 -4689 1187 597 6909 3983 5214
662E214k089n251j001n996L199l511M517M202K138O193j356M220n536q43l196
$$ 5214 3125 -2126 -3127 -9123 -5924 -9435 -4918 -716 1422 7615 6259 10479 4943 4100 904
677I04m596K35l713M896j985L831K231q5K450m385K979n449J433l21o21L909j808
$$ 904 -3692 -3457 -7170 -2274 -4259 -428 1803 1718 4168 -217 2762 -2687 -1254 -1575 -2196 1713 -95
694i5N009k578J451q23k812j31m725K626l846K212J526J7L932k095M734l074J129
$$ -95 4914 2336 3787 2964 152 21 -4704 -2078 -5924 -3712 -2186 -2169 1763 -332 4402 1328 2457
711B457j026j480J245l774L530k566J803j51j98K231l283L775k738J625o37q31
$$ 2457 1431 -49 1196 -2578 952 -1614 189 38 -160 2071 -1212 2563 -175 1450 813 -18
727a8J832l262L249k972J065j003n90J385l397L271k727J565k62m60K743k196
$$ -18 1814 -1448 1801 -1171 -106 -1109 -1699 -314 -3711 -440 -3167 -1602 -1864 -2324 419 -1777
743a777M065j043K766J55m3J498l460J251m686n79k452j208J830j544N047O6M160
$$ -1777 2288 1245 4011 4166 4123 5621 2161 3412 -1274 -1853 -4305 -5513 -3683 -5227 -180 -114 4046
760D046L43o0P02m474m17n176m5j676O95L629P23N924M38K798p41k550j244n494
$$ 4046 4389 4329 5031 557 140 -5036 -5081 -6757 -6062 -2433 -1710 4214 4652 7450 6709 4159 2915 -2579
778b579l74l696K049N16K315M294J35L470k253j95l431l072q44l179K628j63M402
$$ -2579 -2953 -6649 -4600 -4084 -1769 2525 2660 6130 3877 3682 251 -2821 -3665 -6844 -4216 -4379 23
795B3K140K414K261k000L01m849j165l259j679J312r55M263k07L576L05p57k3
$$ 23 2163 4577 6838 4838 5139 290 -875 -4134 -5813 -4501 -5456 -1193 -1400 2176 2481 1724 1701
812A701l390O94k464K011R16K441L239L66K600k868r92m179l746j715l171K054
$$ 1701 -1689 -995 -3459 -1448 -532 1909 5148 5514 8114 5246 4254 75 -3671 -5386 -8557 -6503
828f503j59M416K410K765K474j598J62m687j122l077p82J765P71N465J564M365
$$ -6503 -6662 -2246 164 2929 5403 3805 3967 -720 -1842 -4919 -5701 -3936 -3165 2300 3864 8229
844H229L16l18j478n406k327n039q33j703J458L404K116M840L91K354j458j796
$$ 8229 8545 8227 6749 1343 -984 -6023 -6856 -8559 -7101 -3697 -1581 3259 3650 6004 4546 2750
860B750j880l163K06k450K092P42K172K619K7J444k352J38k789j419q18j573J949
$$ 2750 870 -2293 -2087 -4537 -2445 -1703 469 3088 3115 4559 2207 2345 -444 -1863 -2681 -4254 -2305
877b305p26K551M95R56J216r45J393k135J452j087L52Q22r23Q80k214Q18k347
$$ -2305 -3031 -480 15 971 2187 1242 2635 500 1952 865 1217 2039 1116 1996 -218 600 -1747
894a747j199q81j516J890p43K338J025J836J477M1J311j450O90j213o36k54j354
$$ -1747 -2946 -3827 -5343 -3453 -4196 -1858 -833 1003 2480 2521 3832 2382 3072 1859 1223 969 -385
911c85J331k436R00j336l53l68j160J889p11K340R72J871J499m13J385k467m68
$$ -385 946 -1490 -590 -1926 -2279 -2647 -3807 -1918 -2629 -289 683 2554 4053 3640 5025 2558 2090
928B090k175j237j236j550J225j712J149L3O10L30J45K167J60K817J386K665J546
$$ 2090 -85 -1322 -2558 -4108 -2883 -4595 -3446 -3413 -2803 -2473 -2328 -161 -1 2816 4202 6867 8413
945H413j06R80l408k404m500l622l570l458Q10r8L653K986M815L621K129K135
$$ 8413 8307 9287 5879 3475 -1025 -4647 -8217 -11675 -10865 -10963 -7310 -4324 491 4112 6241 8376
961H376j419n99k336j348j218j552J083o84L41j479o30j947k887J2j466J580J866
$$ 8376 6957 6358 4022 2674 1456 -96 987 303 644 -835 -1465 -3412 -6299 -6287 -7753 -6173 -4307
978d307M708M085K976L360j5p08l891l630m744m589j535j106J909J486M158K760
$$ -4307 401 4486 7462 10822 10807 10099 6208 2578 -2166 -6755 -8290 -9396 -7487 -6001 -1843 917
994I17J345J319j019j048k434k28n97M64K709J778K659J12L79j441m243l246l905
$$ 917 2262 3581 2562 1514 -920 -1148 -1745 -1281 1428 3206 5865 5977 6356 4915 672 -2574 -6479
1011f479k067j697K066L289L752M880L288K541j081j304l407m884k887k965O65
$$ -6479 -8546 -10243 -8177 -4888 -1136 3744 7032 9573 8492 7188 3781 -1103 -3990 -6955 -6290
1026f290j24K921L199J786J953j6l22l227j458j365j422O10J108K972J207K335
$$ -6290 -6414 -3493 -294 1492 3445 3429 3107 -120 -1578 -2943 -4365 -3755 -2647 325 1532 3867
1042C867J197p32n04k041m29k156o91P75K98N45k53P95j940j326j909j693o96
$$ 3867 5064 4332 3828 1787 1358 -798 -1489 -714 -416 129 -124 671 -1269 -2595 -4504 -6197 -6893
1059f893J06K824K173L725L678K793J352o47q35l524l278l005k395j419p47K211
$$ -6893 -6787 -3963 -1790 1935 5613 8406 9758 9111 8276 4752 1474 -1531 -3926 -5345 -6092 -3881
1075c881N74J770J149J46p04j340n41j250M68J742K724L513K666L418J92q17k824
$$ -3881 -3307 -1537 -388 -242 -946 -2286 -2827 -4077 -3609 -1867 857 4370 7036 10454 10646 9829 7005
1092G005l514m961n382k443k159k67J454L448L610K718M206J770J179m36m01o94
$$ 7005 3491 -1470 -6852 -9295 -11454 -11721 -10267 -6819 -3209 -491 3715 5485 6664 6228 5827 5133
1108E133k008m87j471n94q85J29P6q48M05m92n19j158ll00r50M24K07O57M08J450
$$ 5133 3125 2638 1167 573 -312 -183 -107 -955 -550 -1042 -1561 -2719 -2722 -3022 -3972 -3548 -3341 -2684 -2276 -826
1128h26J703O20J770J089P90K6M79o18k568j202j807j478k204j12K45p0J183J186
$$ -826 877 1497 3267 4356 5146 5172 5651 5033 2465 1263 -544 -2022 -4226 -4338 -4093 -4163 -2980 -1794
1146a794J845J30O86M78j309p69o42K35k67P38K143N58J726R92R34r58j469j081
$$ -1794 51 181 867 1345 36 -733 -1375 -1140 -1407 -669 1474 2032 3758 4750 5684 4726 3257 2176
1164B176k999k287k242p75j208R15J870J663K529K139K510N99O17l30j337j499
$$ 2176 -823 -3110 -5352 -6127 -7335 -6420 -4550 -2887 -358 1781 4291 4890 5507 5177 3840 2341
1180B341j747q57j407l76N28P84R11P65J056o39j275q45k038j851j432L95O9J279
$$ 2341 594 -263 -1670 -2046 -1518 -734 177 942 1998 1359 84 -761 -2799 -4650 -6082 -5687 -5618 -4339
1198d339K710K669K880K127K375q6o18j545k166k653k979j637j827q23J14R37
$$ -4339 -1629 1040 3920 6047 8422 8336 7718 6173 4007 1354 -1625 -3262 -5089 -5912 -5798 -4861
1214d861Q42J036J878O44P45M01L37k1j110Q70L1L76M64O35Q10N6L26k86r68j582
$$ -4861 -4019 -2983 -1105 -461 284 685 1022 1001 -109 761 792 1168 1632 2267 3077 3133 3459 3173 2205 623
1234F23j558j513j886l53j046O02J259J353K301J555K316Q80M76n33j125j233
$$ 623 -935 -2448 -4334 -4687 -5733 -5131 -3872 -2519 -218 1337 3653 4533 5009 4476 3351 2118
1250B118k397j408j153l66M07J108J712Q16J342L92j2j464j473j140k171l35m89
$$ 2118 -279 -1687 -2840 -3206 -2799 -1691 21 837 2179 2571 2559 1095 -378 -1518 -3689 -4024 -4513
1267d513P51J421J675K148J187J777M74L57j004j070j435j578j345j193o78o01
$$ -4513 -3762 -2341 -666 1482 2669 4446 4920 5277 4273 3203 1768 190 -1155 -2348 -3026 -3627
1283c627K46O57k27J215K38Q65P44MN44j10M98n78K38N98NQ36N05O57J8K12q81
$$ -3627 -3381 -2724 -2951 -1736 -1498 -633 111 115 659 549 1047 469 707 1305 1310 2146 2651 3308 3326 3538 2657
1304B657j310j852k015j605j602n50Q1J316K075J992L049J369J259K99r28j155
$$ 2657 1347 -505 -2520 -4125 -5727 -6277 -6196 -4880 -2805 -813 2236 3605 4864 5163 4235 3080
1320C080j944j325j389o12J39Q02J218Q38J112p3m48j061j605j214q00j08j3J300
$$ 3080 1136 -189 -1578 -2190 -2051 -1249 -31 807 1919 1846 1398 337 -1268 -2482 -3282 -3390 -3403 -2103
1338b103J614J733J236Q26M57m38l90j340j158q75r26L5n91M38j68J73K22m19
$$ -2103 -489 1244 2480 3306 3763 3325 2935 1595 437 -438 -1364 -1329 -1920 -1482 -1650 -1477 -1255 -1674
1356a674N01j55N58N25P49R35K09P17k45l56p91o13k97p60M17j04J076J11K96
$$ -1674 -1173 -1328 -770 -245 504 1439 1648 2365 2120 1764 973 360 63 -697 -280 -384 692 803 1099
1375A099j1p91r31j408p01r97L9N88J131K186J463J564M12K02q57j102j431k009
$$ 1099 1088 297 -634 -2042 -2743 -3740 -3701 -3113 -1982 204 1667 3231 3643 3845 2988 1886 455 -1554
1393a554n77n35N79R55J259J442M60P58p22j062j068j653o12o47N70N35J367R33
$$ -1554 -2131 -2666 -2087 -1132 127 1569 2029 2787 2065 1003 -65 -1718 -2330 -2977 -2407 -1872 -505 428
1411D28P64Q36k97j73j336n19q13m34N80K27R94N76P74j71q8m66j096p77p63J04
$$ 428 1192 2028 1731 1558 222 -297 -1110 -1544 -964 -737 257 833 1607 1436 1348 882 -214 -991 -1754 -1650
1431a650J96N14J040L89N70N6J05q62m82j3m99n2K79N68K71J73J80m88o23n13
$$ -1650 -1454 -940 100 489 1059 1115 1220 358 -124 -137 -636 -688 -409 159 430 603 783 295 -328 -841
1451h41n33m39k9M35P91R41O75J083M19j33k38o26q69r97l36j58k83L16L8M17
$$ -841 -1374 -1813 -1842 -1407 -616 325 1000 2083 2502 2369 2131 1505 636 -361 -697 -855 -1138 -822 -784 -367
1471c67J33J25J83n71L15j48j71ON12L27l0M31J43l45m41j68n82n70L58K74O15
$$ -367 -234 -109 74 -497 -182 -330 -501 -495 17 344 314 745 888 543 102 -66 -648 -1218 -860 -586 29
1492B9J76R09K19j44l85j60k69j109L57J2o14P90L25J46L0o9N5r59m14k02l58
$$ 29 205 1114 1333 1189 804 644 375 -734 -377 -365 -979 -189 136 282 312 243 298 -661 -1075 -1277 -1635
1513a635j63J075O41M78O13O56M12m93j56k63q56k36m73k50m4j09M68O9QK23K82
$$ -1635 -1798 -723 -82 396 1009 1665 2077 1584 1428 1165 309 73 -400 -650 -694 -803 -335 -266 -258 -35 247
1534B47m88N9q8k12j75RM29N1K90P36J95O5L56j1q84n38O7m97n87k02K74q01J05
$$ 247 -241 -182 -270 -482 -657 -648 -219 -168 122 858 1053 1118 1474 1463 579 41 108 -389 -976 -1178 -904 -1705 -1600
1557a600O15K97K20P85Q67K94M59J6j84n15p43j43j016m57j54N4Q7L06M49l72
$$ -1600 -985 -688 -468 317 1184 1478 1937 1953 1769 1254 511 368 -648 -1105 -1259 -1205 -1118 -812 -363 -735
1577g35J64J12k84j94l13O66k48M61P02Q52pM34P65j91l18l62p43q51r05m56k88
$$ -735 -571 -459 -743 -937 -1250 -584 -832 -371 331 1183 1176 1610 2375 2184 1866 1504 761 -90 -995 -1451 -1739
1598a739n47m3Q30O96J26J093J25J35K8k90l62n20j9K17o6L99P46L38k20L63k12
$$ -1739 -2286 -2329 -1499 -803 -677 416 541 676 704 414 52 -468 -487 -270 -336 63 809 1147 927 1290 1078
1619A078j16r17k47n22o20P4q3J35M7N17O22L55O18L80J25j68o5l57p29k62m46
$$ 1078 962 45 -202 -724 -1344 -1270 -1353 -1218 -1171 -654 -32 323 941 1321 1446 1278 1213 856 127 -135 -581
1640e81k35j43J18K88k90O52J90P8k28N9J86o15J67j05N29K82J51O23j37Q0L41
$$ -581 -816 -959 -841 -553 -843 -191 -1 77 -151 -92 94 -521 -354 -459 70 352 503 1126 989 1069 1410
1661A410J13n38q3o80p43n79p16j2l47N34P68K55M06N55Q45J79l12J7m66m16o1
$$ 1410 1523 985 902 222 -521 -1100 -1816 -1828 -2175 -1641 -873 -618 -212 343 1188 1367 1055 1072 606 190 129
1682A29k33r7l1O59K4o5j27L00j75m24k12l74r9k98J11J64K4M02L18L39JK70J40
$$ 129 -104 -201 -232 427 451 386 259 559 384 -40 -252 -626 -725 -1023 -912 -748 -724 -322 -4 335 336 606 746
1705G46k17j25j87k94k61l8K70k32N96j68j8L15Q3k50j50k25k54k0j98L93j98
$$ 746 529 404 217 -77 -338 -376 -106 -338 258 90 72 387 470 220 70 -155 -409 -429 -627 -234 -432
1726d32J56L63%O12J75k10r7K7l98j86l18n33j0l32L89q8L79K40L07M30J51m7
$$ -432 -276 87 87 699 874 664 567 594 196 10 -308 -841 -851 -1183 -794 -882 -503 -263 44 474 625 578
1748E78L90k26k52o7j32j31l09L73l08L15l49q0K1k46Lp8J24j18l3K48o3M00J02
$$ 578 968 742 490 423 291 160 -149 224 -84 231 -118 -198 -177 -423 -420 -498 -374 -492 -525 -277 -340 60 162
1771A62J05J22J56n1k48J22m1k62j00j92l4J75Q4j28L47j89K55J4J85m70J0j19
$$ 162 267 389 545 494 246 368 327 65 -35 -227 -261 -86 -2 -130 217 28 283 297 482 12 22 -97
1793i7r6K14k77j70j50j89L68k00J63L00K98P4r5K16l48K08j60j44J79r1J06l17
$$ -97 -193 21 -256 -426 -576 -765 -397 -597 -434 -134 164 238 143 359 11 219 59 -85 94 3 109 -208
1815b08R7L60l03O8J11k55J25J25l56L27j01j22L35j01j53j15P5k35j83K06l5
$$ -208 -111 249 -54 14 125 -130 -5 120 -236 91 -10 -132 203 102 -51 -166 -91 -326 -509 -303 -338
1836c38J52k22M2K18L13n8L82m0j38q4M03J09k89J80k71l19q9j53ll76j24k97
$$ -338 -186 -408 -366 -148 165 107 489 449 311 227 630 739 450 630 359 40 -49 -202 -205 -581 -705 -1002
1858a002M66K42L02J99L85R5l1Kj87j11j89n35k84k84r1R0M55j7L04L60K35o2
$$ -1002 -536 -294 8 207 592 687 656 658 471 360 171 -364 -648 -932 -1023 -933 -478 -495 -191 169 404 342
1880C42J89K73j31J6j39k1N2k89l98j30l3k73l25k33J66J07j04M30M77J06QK34
$$ 342 531 804 673 689 550 529 581 292 -106 -236 -269 -542 -867 -1100 -934 -827 -931 -501 -24 82 90 324
1902C24K97N8P9m9j71P4j60l47r3l56n2J01k53k6K93q6L58J89M15j21K0j7q7l64
$$ 324 621 679 758 709 538 612 452 105 12 -344 -396 -295 -548 -574 -281 -367 -9 180 595 474 494 477 390 26
1926B6q5k99j85J93k72L58J97K51L66rj8l59k10j73q9n7j52j33J16L91M87O2O30
$$ 26 -59 -358 -543 -350 -622 -264 -67 184 550 541 523 164 -46 -219 -308 -365 -517 -650 -534 -143 344 406 1036
1949A036j00Q8j51m28k7o53p3k6j42n0R6m62M3L53j73j17J68K82N49j5K26N09
$$ 1036 936 1024 873 445 418 -235 -308 -334 -476 -526 -430 -892 -849 -496 -669 -786 -618 -336 213 198 424 933
1971I33L1j47J04q0m78O4l63m26n8Q3l18j11N2K33J52J40L09K35q6R5M25k29l45
$$ 933 964 817 921 841 363 427 64 -362 -420 -337 -655 -766 -714 -481 -329 -189 120 355 269 364 789 560 215
1994B15Q5l13n24o5J62m66K06J14J19M31L01L40L00m06K44J20m57j10l95r4l14
$$ 215 300 -13 -537 -602 -440 -906 -700 -586 -467 -36 265 605 905 499 743 863 406 296 -99 -193 -507
2015e07R0K12j17P5j72P89m92k00M39r3j67K62k3k83J3J84m1O7p9j51k34L91k59
$$ -507 -417 -205 -322 -247 -419 370 -122 -322 117 24 -143 119 96 -187 -174 10 -31 36 -43 -194 -428 -37 -296
2038b96m0K43l8K17oj96N85l63J95J58K82l92j4O7m88n32n6J18l20P7L93P3j37
$$ -296 -336 -93 -131 86 80 -116 469 106 301 459 741 349 335 402 -86 -618 -674 -556 -876 -799 -406 -333 -470
2061d70M59K76m03j08M46l3R6J07J55P8m3M6K06o36l33j98J29m26M9P7q5N11K71
$$ -470 -11 265 -138 -246 200 167 263 370 525 603 560 606 812 176 -157 -355 -226 -652 -603 -526 -611 -100 171
2084A71j89J75N07mq9k46J72l67j99l77l17J29J78R5l47J37K26M76l38M26M79
$$ 171 -18 157 664 660 571 325 497 130 -69 -446 -763 -634 -456 -361 -708 -571 -345 131 -207 219 698
2105F98K93Q7R0k8Q5q80j66m75o93n7l66r2K36M81N15K50N29N47M1j29J28l29
$$ 698 991 1078 1168 1140 1225 345 179 -296 -989 -1046 -1412 -1504 -1268 -787 -272 -22 507 1054 1095 966 1094 765
2127G65j35k90j87m27l31o9k92L7k58N43p8M47N48L78J81M72J37J4o08r7j57n40
$$ 765 630 340 153 -274 -605 -674 -966 -929 -1187 -644 -722 -275 273 651 832 1304 1441 1455 847 750 593 53
2149E3k57m83l89j53k76M41N0L37M71M93M6K61m0L79n17L85j87q2k18k51n09P6
$$ 53 -204 -687 -1076 -1229 -1505 -1064 -1014 -677 -206 287 333 594 554 933 416 801 614 532 314 63 -446 -370
2171c70j61j65K3J03J61K70L85L92K77L7k52r6m18m74j02l65m07M5J58O9O54M0
$$ -370 -531 -696 -673 -570 -409 -139 246 638 915 952 700 604 186 -288 -390 -755 -1162 -1117 -959 -890 -236 -196
2193a96O28L52J05J54L6n13j47j78m06j67m18J53J35L0R0K5L87M49l42K04j87
$$ -196 432 784 889 1043 1079 566 419 241 -165 -332 -750 -597 -462 -432 -342 -317 70 519 177 381 194
2214A94n9m7j55j70N2l3j29J94J36j26K18J17K08j31j66J56k2n36L37k37L27j98
$$ 194 135 88 -67 -237 -185 -218 -347 -153 -17 -143 75 192 400 269 103 259 237 -299 38 -199 128 -70
2236g0j00L30m20M77k20l85K55k0p1P6K74L20K14M23k7j32l03k52q31n72l00n11
$$ -70 -170 160 -260 217 -3 -388 -133 -153 -224 -148 126 446 660 1083 1056 924 621 369 -462 -1034 -1334 -1845
2258a845R0m8K27N25J123N58Q10M72M0K78m40m75k53r44l71m11n58k98L81k93
$$ -1845 -1755 -1803 -1576 -1051 72 630 1440 1912 1952 2230 1790 1315 1062 118 -253 -664 -1222 -1520 -1139 -1432
2278a432K64K33M64J69J96J69J90N2Q6L46K99j82R0J42j28r3m13m02l16m96k25
$$ -1432 -1168 -935 -471 -302 -106 63 253 305 391 737 1036 854 944 1086 958 865 452 50 -266 -762 -987
2299i87j85q1J07j18O66M72N02L31N20L34k11j40n57j98p35k03l32k10J31PM72
$$ -987 -1172 -1253 -1146 -1264 -598 -126 376 707 1227 1561 1350 1210 653 455 -280 -483 -815 -1025 -894 -887 -415
2320d15L79L32L8J20K46o39Nm18n1q9j77L13JM37O14K25L05j10k14j42o87j77
$$ -415 -36 296 334 454 700 61 66 -352 -403 -492 -669 -356 -355 82 696 921 1226 1116 902 760 73 -104
2342a04l01m82J3K9L68K17O7M97j40m97K52l99j84j15K12J93M29J99L44O12L17
$$ -104 -405 -887 -874 -845 -477 -260 -193 304 164 -333 -81 -480 -664 -779 -567 -374 55 254 598 1210 1527
2363A527O0m2l59l88o51m84n49j98o51n1O7L50N04L30O63M08K67K54J82K77j61
$$ 1527 1587 1545 1186 798 147 -337 -886 -1084 -1735 -1786 -1719 -1369 -865 -535 128 536 803 1057 1239 1516 1355
2384A355n81k46m12l57o4j82j92Q2J33j27J14P2j0j70K35j10K64P0L38L23J57
$$ 1355 774 528 116 -241 -305 -487 -679 -597 -464 -591 -477 -405 -415 -585 -350 -460 -196 -126 212 535 692
2405F92P52K19l23m74l53m50p42n92l74K2J61L59N11M02P83M8P2j6N2l30k33k60
$$ 692 1444 1663 1340 866 513 63 -679 -1271 -1645 -1623 -1462 -1103 -592 -190 593 641 713 697 749 419 186 -74
2427g4o4O7J50L20l2P2k0L77m58l97k30l6m34q1o3J58K12K99m0J33O05p7J55j53
$$ -74 -138 -71 79 399 367 439 419 796 338 -59 -289 -325 -759 -840 -903 -745 -533 -234 -274 -141 464 387 542 389
2451C89k00Q1Q0q1j70q4L4k96k9j22K21O3K69K8K56l02l0k7l66N4m39J50J05L38
$$ 389 189 270 350 269 99 15 49 -247 -276 -398 -177 -114 155 183 439 137 107 80 -286 -232 -671 -521 -416 -78
2475g8k9L00N11j04n5j01l88J08m03j61j97k08J15K25L72J88K99k47M0k27J82
$$ -78 -107 193 704 600 545 444 56 164 -239 -400 -597 -805 -690 -465 -93 95 394 147 187 -40 142
2496A42q7k16N1R6J54L37J74j24j04l33K2k07n55k10J22m09L80N29L23K2J61L67
$$ 142 55 -161 -110 -14 140 477 651 527 423 90 112 -95 -650 -860 -738 -1147 -767 -238 85 107 268 635
2518F35J28N0l62M4k21j39o6j95rj98p2J10K5J25j43L62j59M24J53K26j48k27
$$ 635 763 813 451 495 274 135 69 -126 -135 -333 -405 -295 -270 -145 -288 74 -85 339 492 718 570 343
2540C43j89k01l65r6k02K2k58L84M64j3N14q4K83k64L10m58J34m10NR5k00k48
$$ 343 154 -47 -412 -508 -710 -688 -946 -562 -98 -111 403 319 602 338 648 190 324 -86 -81 14 -186 -434
2562d34J82K75j74j6j53p7J19k8L75p2Q5J14J61m7l13O2k80l73n2L22o9M33L85
$$ -434 -252 23 -151 -167 -320 -397 -278 -306 69 -3 82 196 357 310 -3 59 -221 -594 -646 -324 -393 40 425
2585D25J31mK63j59k89l4n12k47l25j6J90K11q6R5M30J2J6K34J71l1K28K23l22
$$ 425 556 552 815 656 367 333 -179 -426 -751 -767 -577 -366 -452 -357 73 85 101 335 506 475 703 926 604
2608F04j60j2k40n00k00m34o18ll5L02O38O02O12P06N98J56Jm62Oq29q76o58l55
$$ 604 444 432 192 -308 -508 -942 -1560 -1563 -1598 -1296 -658 -56 556 1262 1860 2016 2017 1555 1561 732 -144 -802 -1157
2631a157n24J66j38K76R3N06jO30K74O38L70M88J51L6l90m27o49p04m93o92j42
$$ -1157 -1681 -1515 -1653 -1377 -1284 -778 -779 -149 125 763 1133 1621 1772 1808 1418 991 342 -362 -855 -1547 -1689
2652a689q3j11Q25N59M87N90P32J81n0J19m11o43p6m00J2m18m89k2n5m25K18j22
$$ -1689 -1772 -1883 -1058 -499 -12 578 1310 1491 1441 1560 1149 506 430 30 42 -376 -865 -887 -942 -1367 -1149 -1271
2674a271J39J00O05M87O54O63M30L98m41m58o99p98q89l91m96J09M56M64P48N30
$$ -1271 -1132 -1032 -427 60 714 1377 1807 2205 1764 1306 607 -191 -1080 -1471 -1967 -1858 -1402 -938 -190 340
2694C40O09n7L2m68j16j13m76P9L02l11M10p7k1o4j10n54o2j56k9M28J60L45M69
$$ 340 949 892 924 456 340 227 -249 -170 132 -179 231 154 133 69 -41 -595 -657 -813 -842 -414 -254 91 560
2717E60KK94K1l22n93k23O7m2j04K46L24J15N7J42m62l24j43m49n7l46L46N05
$$ 560 562 856 877 555 -38 -261 -194 -236 -340 -94 230 345 402 544 82 -242 -385 -834 -891 -1237 -891 -386
2739c86K48M86N67n02j22L0k44o6Q2J33K7L14L49j76j29l93m53k37p63m53J20
$$ -386 -138 348 915 413 291 321 77 11 93 226 253 567 916 740 611 218 -235 -472 -1235 -1688 -1568
2760a568K27M78M53Q92O65N66j02l15o6l80o93r25p9k59L20N6L02L11j0j26O06
$$ -1568 -1341 -863 -410 482 1147 1713 1611 1296 1230 850 157 -768 -847 -1106 -786 -730 -428 -117 -127 -253 353
2781C53m96j02P6K56j23N93J93k49L29Lq8o07l83m34j83q4M36K4O6P8M88K75j48
$$ 353 -143 -245 -169 87 -36 557 750 501 830 833 745 138 -245 -679 -862 -946 -510 -486 -420 -342 146 421 273
2804B73j04K6j44n7r5J05J10K64o1J69k85m43R9l14M4l9J10L19K53J22J87J97
$$ 273 169 195 51 -6 -101 4 114 378 317 486 201 -242 -143 -457 -413 -452 -342 -23 230 352 539 736
2826G36j25p05j6m12j99j8J68K54NM70j32N42K7j11k05m50O6J29j78R6J72J83
$$ 736 611 -94 -110 -522 -721 -739 -571 -317 -312 158 26 568 595 484 279 -171 -105 24 -154 -58 114 297
2848B97M4j82j47r9m9l24j49K00J32r5K09K4O48j22J89J3k88O4m90k11J1k04m2
$$ 297 341 159 12 -87 -136 -460 -609 -409 -277 -372 -163 -139 509 387 576 589 301 365 -125 -336 -325 -529 -571
2871e71J98oj43L02J03J71J30K5m3J77o3L1R6j01o3j77O9k24k07K3q6j91k1L74
$$ -571 -373 -379 -522 -220 -117 54 184 209 166 343 280 311 407 306 243 66 135 -89 -296 -273 -359 -550 -571 -197
2895a97oJ37M4j21J71K61k25q8J4L64j20Q4K0r0j79K24l44l08J35J8M2k57L02
$$ -197 -203 -66 -22 -143 28 289 64 -24 -10 354 234 318 338 248 69 293 -51 -359 -224 -206 -164 -421 -119
2918a19M03j37K70o5L9j61m5k05j92K20l01J4J29K42j19J19J24l10k8J96l68O0
$$ -119 284 147 417 352 391 230 185 -20 -212 8 -293 -279 -150 92 -27 92 216 -94 -122 74 -294 -234
2940b34J51J01K1N06j14j12n7J24m16m7J17j47M9j65J69J74N3n7M8j41j48k25
$$ -234 -83 18 39 545 431 319 262 386 -30 -77 40 -107 -58 -223 -54 120 173 116 164 23 -125 -350
2962c50L11j70J34J29r8L56l03k39L00j83l81J58n5J05L3M37J63K81J1O1k63J5
$$ -350 -39 -209 -75 54 -44 312 9 -230 70 -113 -494 -336 -391 -286 -253 184 347 628 639 700 437 452
2984D52m21n49K7RM0L07k82M38K15j90K1m2J69kM9n6K37r4N8q8k30j52m62j79
$$ 452 31 -518 -491 -482 -442 -135 -417 21 236 46 67 25 194 192 241 185 422 328 386 298 68 -84 -546 -725
3008g25k15J17K1%N44M04N72J68K64K35n39k45n25m46q7m02o9J45R3J55j02K74
$$ -725 -940 -823 -802 -802 -258 146 718 886 1150 1385 846 601 76 -370 -457 -859 -928 -783 -690 -535 -637 -363
3030c63j98L30j04K26L85L89M38lM46j74l17o02m41o90r09J78q3L9P50M43M61
$$ -363 -561 -231 -335 -109 276 665 1103 1100 1546 1372 1055 453 12 -678 -1587 -1409 -1492 -1453 -703 -260 201
3051B01O29L82j30L4m77k40k45m02q5j4L15J28p5k21k04lk34J40k91M20L47L17
$$ 201 830 1212 1082 1116 639 399 154 -248 -333 -347 -32 96 21 -200 -404 -407 -641 -501 -792 -372 -25 292
3073B92L02N88j05k90j99m90m06l30Nk64j4M00O90NK54o7Rk70m08k04p9J98j46
$$ 292 594 1182 1077 787 588 98 -308 -638 -633 -897 -911 -511 179 184 438 371 380 110 -298 -502 -581 -383 -529
3096e29M66L13o7M33P2l28l06j54l23J18q2N41P2R7J51j26l48j41o13j89m88N64
$$ -529 -63 250 183 616 688 360 54 -100 -423 -305 -387 154 226 323 474 348 0 -141 -754 -943 -1431 -867
3118h67L62L92N70O14K10J3Q5l63p09n18m30m30l79M67P0K05L52K16L18K83M14
$$ -867 -505 -113 457 1071 1281 1294 1379 1016 307 -211 -641 -1071 -1450 -983 -913 -708 -356 -140 178 461 875
3139H75j87k7J29n9L4k14q5k63j93n74l26l80r0j39M63K53K39N05O99N82K28M4
$$ 875 688 661 790 731 765 551 466 203 10 -564 -890 -1270 -1360 -1499 -1036 -783 -544 -39 660 1242 1470 1514
3161A514j66k80k98n17l39n26k02p2j67J38J24j29M42P4J76L47N28J93N2L54j77
$$ 1514 1348 1068 770 253 -86 -612 -814 -886 -1053 -915 -791 -920 -478 -404 -228 119 647 840 892 1246 1069
3182A069mk27m54n94m17m59n4k50J81J75L21L45N72L52J40K34j01J61l92L4L0
$$ 1069 1065 838 384 -210 -627 -1086 -1140 -1390 -1209 -1034 -713 -368 204 556 696 930 829 990 598 632 662
3203F62m70j43q7J49n81J11m2NK8m0K49J12o5M23R1k14p3K40R8k37l1k09j25R3
$$ 662 192 49 -38 111 -470 -359 -401 -396 -368 -408 -159 -47 -112 311 402 188 115 355 453 216 185 -24 -149 -56
3227e6r6J2j14q8J95o4L9L62j99L24m02p0K24j75J1l3O1j65N75j01K90l60L9r7
$$ -56 -152 -140 -254 -342 -147 -211 -172 190 -9 315 -87 -157 67 -108 -97 -130 -69 -234 341 240 530 170 209 112
3251A12l56j18L4j27J13J25k6J24L02N1N4Q7M7k24j79J03j38O3K05o9j66j27Q5
$$ 112 -244 -362 -328 -455 -342 -217 -243 -119 183 234 288 375 422 198 19 122 -16 47 252 183 17 -110 -25
3274b5N3j62p1k05j66L67j6O5L42J10L40k63J43n51n3l12M1L4l5M8O6L46l2j33
$$ -25 28 -134 -205 -410 -576 -209 -225 -160 182 292 632 369 512 -39 -92 -404 -363 -329 -364 -316 -250 96 64 -69
3298f9K15j40j04J23K4K79j39K5j1M2k07K9r7n05K49K05j52M2P9o1m4k8K11L16
$$ -69 146 6 -98 25 49 328 189 214 203 245 38 67 -30 -535 -286 -81 -233 -191 -112 -173 -217 -245 -34 282
3322B82l20m3Q3j11j37K78N1M0J28j29J88k2l3k28l6j00k08mj32L14M73m64J97
$$ 282 -38 -81 2 -109 -246 32 83 123 251 122 310 288 255 27 -9 -109 -317 -321 -453 -139 334 -130 67
3345F7J6j64j69L9J18n9m4K26k68J64J26RR0P2k61J3j69J86k84L43k60j25L10
$$ 67 83 -81 -250 -211 -93 -152 -196 30 -238 -74 52 61 151 223 -38 -25 -194 -8 -292 51 -209 -334 -24
3368b4j39K72J79N0k55j22J9j12J5k7K50l78J49K49j64J77q4M6r2k44P7j0o4j59
$$ -24 -163 109 288 338 83 -39 -20 -132 -117 -144 106 -272 -123 126 -38 139 55 101 9 -235 -158 -168 -232 -391
3392c91J78N4J98K41p2J92j03o8k06q6k79M35l49p2n6L18J39J93j54j17j26K57
$$ -391 -213 -159 39 280 208 400 297 229 23 -63 -342 93 -256 -328 -384 -66 73 266 112 -5 -131 126
3414A26k29j4NOj0M21j86K8O5p8k65K79J05j09N7j45J6J02M9j28l36j37J02j16
$$ 126 -103 -117 -112 -106 -116 305 119 147 212 134 -131 148 253 144 201 56 72 174 223 95 -241 -378 -276 -392
3438c92j52m3N2M98L41K22J23J18l97j42k31m9j04nO7j89K77L87j64j59j21k1
$$ -392 -544 -587 -535 -37 304 526 649 767 370 228 -3 -52 -156 -161 -94 -283 -6 381 217 58 -63 -84
3460h4J14o10O8J83K73J22L47k5p7J90j24M2l74k52k70q8J66m6M58Q2Q0J55l34
$$ -84 30 -580 -512 -329 -56 66 413 388 311 501 377 419 45 -207 -477 -565 -399 -445 13 95 175 330 -4
3483dJ84n72J24r4k8K81P2n0J75J37q2L52k33O3R8K6m98J28R7j37m16J83n12j57
$$ -4 180 -392 -268 -362 -390 -109 -37 -87 88 225 143 495 262 325 423 449 -49 79 176 39 -377 -194 -706 -863
3507h63L41j26J87N3K34M16N68k59N4M76j01m58j43j70k69k42m37k40K33J70n3
$$ -863 -522 -648 -461 -408 -174 242 810 551 605 1081 980 522 379 209 -60 -302 -739 -979 -746 -576 -629
3528f29R8J83P8L73J49M4K67K63J44k28j2J54l79m35p97k53m0k84K01M56j96M36
$$ -629 -531 -348 -270 103 252 296 563 826 970 742 730 884 505 70 -727 -980 -1020 -1304 -1103 -647 -843 -407
3550d07M54K83K34O7K89k6r2l14M0l87l01k20j34k33j92K45M4LM24O46N7j11J79
$$ -407 47 330 564 631 920 894 802 488 528 141 -160 -380 -514 -747 -939 -694 -650 -647 -223 423 480 369 548
3573E48J72k61k16l85K60m45K2Q5M6K78Nk26q5J05k04k9L26o2q5O55j08K24k58
$$ 548 720 459 243 -142 118 -327 -305 -220 -174 104 109 -117 -202 -97 -301 -330 -4 -66 -151 504 396 620 362
3596C62J8Q6n40l44j95J50l55L28M74l7L25k43K9K97m11n3q8j58O7m6L80L85j04
$$ 362 380 466 -74 -418 -613 -463 -818 -490 -16 -53 272 29 58 355 -56 -109 -197 -355 -288 -334 46 431 327
3619C27K69k55O9m23J07m33Q2J75n2K49%j32R4n9k03k62q5L61m8M68P5M56p5J35
$$ 327 596 341 410 -13 94 -339 -257 -82 -134 115 115 -17 77 18 -185 -447 -532 -171 -219 249 324 780 705 840
3643H40J02n29n22l36l51o00M36N5L08J94N79K98K59R0l66k28J52j8j79K06j24
$$ 840 942 413 -109 -445 -796 -1396 -960 -905 -597 -403 176 474 733 823 457 229 381 363 184 390 266
3664B66K29n1k15l74K2n43p4j99l5K44K59M69Q92JL09Pl36m75j78n94j60k35Q1
$$ 266 495 444 229 -145 -123 -666 -740 -939 -974 -730 -471 -2 890 891 1200 1207 871 396 218 -376 -536 -771 -690
3687f90K26n2K77M75m08L4n6J5Q2QR0J12J34J52K69j19k82r5o25l34K11k59K09
$$ -690 -464 -516 -239 236 -172 -138 -194 -179 -97 -89 1 113 247 399 668 549 267 172 -453 -787 -576 -835 -626
3710f26K71J34K50L97j43L75j92N6l28k36Nl35M99k27L13N5n7r0j20%k22j71R8
$$ -626 -355 -221 29 426 283 658 466 522 194 -42 -37 -372 127 -100 213 268 211 121 1 1 -221 -392 -294
3733b94J14k05M53L2J57j78K49j45O6K2m21n2j35Q3L48J67j07l6K33l66k6j59
$$ -294 -180 -385 68 100 257 79 328 183 249 271 -150 -202 -337 -254 94 261 154 118 351 -15 -41 -200
3755b00Nr2L2M39j10K65j2O8j28j42k20Lr6j10q9K5j62M72L44k66j55L21j83m5
$$ -200 -195 -287 -255 184 74 339 327 395 267 125 -95 -92 -188 -298 -387 -362 -524 -52 292 26 -129 192 9 -36
3779c6QJ22k34J22J44K0J52j71K79l82m9j79J3l0j35jo2L97r1L71j41J49r5k56
$$ -36 -28 94 -140 -18 126 146 298 127 406 24 -25 -204 -191 -221 -356 -357 -419 -22 -113 258 117 266 171 -85
3803h5O6J27l5j56n3j06K5N04k23K52n0l5j66J46l50J15k27K9K05k76M20j79R9
$$ -85 -19 108 73 -83 -136 -242 -217 287 64 316 266 231 65 211 -139 -24 -251 -222 -17 -293 127 -52 47
3826D7O9m65K64J53j32L9K61L6j81l72L41J23k49O1o3k05J0J79k61L25J29J88
$$ 47 116 -349 -85 68 -64 -25 236 272 91 -281 60 183 -66 -5 -68 -273 -263 -84 -345 -20 109 297
3848B97q2j31K1M7J1k41K31j17m7L10j74K2j32l03J04J4q1j62J68j0M70j51K25
$$ 297 215 84 105 152 163 -78 153 36 -11 299 125 147 15 -288 -184 -170 -251 -413 -245 -255 215 64 289
3871B89k90L39M4k01m5l0j04l22K41M3l21M78nr2o1J79Q2j71k89J42K5J6J1K9
$$ 289 -1 338 382 181 136 106 2 -320 -79 -36 -357 121 116 24 -37 142 224 53 -236 -94 -69 -53 -42 -13
3895a3K84j32l31j7K04j97J52n3J5Q8j04L94l02J38l6Nl94J21K27O8j35M7jK57
$$ -13 271 139 -192 -209 -5 -202 -50 -103 -88 0 -104 290 -12 126 90 95 -299 -178 49 117 -18 29 28 285
3919B85n30K87j07l31l7K21L80O0J03R8J62j40J2l86L1m85j08J41j02J57J15R
$$ 285 -245 42 -65 -396 -433 -212 168 228 331 429 591 451 463 77 108 -377 -485 -344 -446 -289 -174 -165
3941a65N35j98p0K35k84j13k2K26k01J82J13J97j46j72L39p35pl26K98l12K30
$$ -165 370 172 102 337 53 -60 -82 144 -57 125 238 435 289 117 456 -279 -286 -612 -314 -626 -396
3962c96N37O7n1K12J59l69J64l18m6j43L25j14K11j17N7P7j00k06l99L14m50K25
$$ -396 141 208 157 369 528 159 323 5 -41 -184 141 27 238 121 178 255 155 -51 -450 -136 -586 -361
3984c61L47k0K92J35L6k61n7j02j43j00j77O8K79J85J94P0j02K15l25o03m8k19
$$ -361 -14 -34 258 393 429 168 111 9 -134 -234 -411 -343 -64 121 315 385 283 498 173 -430 -478 -697
4006f97J03K73J4M80l3N36j9K7j75j01j54m90k50j1K91M2J74J42n0j2j54o9kl77
$$ -697 -594 -321 -307 173 140 676 657 684 509 408 254 -236 -486 -497 -206 -164 10 152 102 90 -64 -133 -135 -512
4030e12J88J70J62L32J73K50N0j45k99m08k00o0p61J57L62K32J85M13J36K24m77
$$ -512 -324 -154 8 340 513 763 813 668 369 -39 -239 -299 -1060 -903 -541 -309 -124 289 425 649 172
4051A72K3L5k25O1O8j6J71pJ60m4m49j37l87p5j33J89K3M26J84O45J56j79K23
$$ 172 195 230 5 66 134 118 289 282 442 398 -51 -188 -575 -650 -783 -594 -571 -145 39 684 840 661 884
4074H84l82k94j81l97J6M3Q9Q4n0L47j35j37M5R7k16j65Q5M73N1p5K11l4j2k67
$$ 884 502 208 27 -370 -354 -311 -222 -138 -188 159 24 -113 -68 29 -187 -352 -267 206 257 182 393 359 347 80
4098H0J60n19K4Ok89K18J47J56J03J7L3J55j01j53j04P6p7LO8L3L30j77P0k11
$$ 80 240 -279 -255 -249 -538 -320 -173 -17 86 103 136 291 190 37 -67 9 -68 -65 3 36 366 189 259 48
4122D8Nq7m37J91K02j98o0K41K28Q8j50M2R7q3j55l6K00Kj43J30m19O34k53K8
$$ 48 53 -34 -471 -280 -78 -276 -336 -95 133 221 71 113 210 127 -28 -64 136 138 -5 125 -294 340 87 115
4146A15k97j03K26l46O9J16M9Q2K04J26Q7k37o2J26r5o4K4j89J96l5n8k26J07
$$ 115 -182 -285 -59 -405 -336 -220 -171 -89 115 241 328 91 29 155 60 -4 20 -169 27 -8 -66 -292 -185
4169a85j10K74j71L23K1o2O0K39j4k9k81P3j39J3o6j26r1RP0k15L91j15M0L2L36
$$ -185 -295 -21 -192 131 152 90 150 389 375 346 65 138 -1 12 -54 -180 -271 -262 -192 -407 -16 -131 -91 -59 277
4194B77j61R2J45k39J36l22R3N5m5Q2o5K16k15p6J28m00J07j8K75j86L09rp9j6
$$ 277 116 208 353 114 250 -72 21 76 31 113 48 264 49 -27 101 -299 -192 -210 65 -121 188 179 100 84
4218H4R4j28j95L39l84P6j80nL57j41Q5J52j11r9L96n95L45k02L79k33m2J17J60
$$ 84 178 50 -145 194 -190 -114 -294 -299 58 -83 2 154 43 -56 340 -255 90 -112 267 34 -8 109 269
4241B69l38K87j21q1j62K52j5l16L52k77o6R4Ln5K38j92J52Pl6j82N53j88r0O4
$$ 269 -69 218 97 16 -146 106 91 -225 127 -150 -216 -122 -119 -174 64 -128 24 31 -5 -187 366 178 88 152
4265A52J6n4l33m5J81k6j22M99l80K7j25j29M14o6J3q6mO4J6J17j75K08J33k63
$$ 152 168 114 -219 -264 -83 -109 -231 268 -112 -85 -210 -339 75 9 22 -64 -68 -4 12 129 -46 162 295 32
4289C2R1j42j26J65j60l0J72m0L21l69J57Q5o2j80J32j42J0o2l24N32L6j41k0
$$ 32 123 -19 -145 20 -140 -170 2 -38 283 -86 71 156 94 -86 46 -96 -86 -148 -472 60 96 -45 -65
4312f5L14j38j66N6J0Lj56n1K25j66K13J6j06n14O15j00k07K28K13k72%O9K30
$$ -65 249 111 -55 1 11 14 -142 -193 32 -134 79 95 -11 -525 90 -10 -217 11 224 -48 -48 21 251
4335B51k6K6J3k83j53N3p2j32L02k97L99m0J09Rk61J46j43m1n8N4J95j48R4J81
$$ 251 225 251 264 -19 -172 -119 -191 -323 -21 -318 81 41 150 159 -102 44 -99 -140 -198 -144 51 -97 -3 178
4359A78J78k66K18n91L81n68J9M77k58K79J49Q8o6k86R8j59k9l06L84k28K68j5
$$ 178 356 90 308 -283 98 -470 -451 26 -232 47 196 284 218 -68 30 -129 -158 -464 -80 -308 -40 -55
4381e5O4K29j04N3k50M6l52J91R9j53J61J49j20L57m29J6q0n4K40j53K98k06N0
$$ -55 9 238 134 187 -63 -17 -369 -178 -79 -232 -71 78 -42 315 -114 -98 -178 -232 8 -145 153 -53 -3
4404cK09j35q2K48j53r6j53L24n75L03pQ5j3J48p2J03j52Kj80j7K57j48L39j16
$$ -3 206 71 -11 237 84 -12 -165 159 -416 -113 -120 -35 -48 100 28 131 -21 -19 -199 -216 41 -107 232 116
4428A16K90j0j09l31K34j23l80M4L12k4n2N5J74j34K38l60j9L0j63L72k73J33
$$ 116 406 396 287 -44 190 67 -313 -269 43 19 -33 22 196 62 300 -60 -79 -49 -212 160 -113 20
4450B0k14o0L59N7k21K46k15q6M8j16P2r5L18%k97K54k12L04J9k84O5M8m6m3K17
$$ 20 -194 -254 105 162 -59 187 -28 -114 -66 -182 -110 -205 113 113 -184 70 -142 162 181 -103 -38 10 -36 -79 138
4475A38k60K21p5K7j95j23p8K15K53m01M16k37K98N7j18j7M8k80K41R0l91J15
$$ 138 -122 99 24 51 -144 -267 -345 -130 123 -278 138 -99 199 256 138 121 169 -111 130 220 -171 -56
4497e6J15K0j2n4k2j23p3J27k63QM29k77J48NJ47K8%j31M1j41Q6n5j9r9L57k11
$$ -56 59 79 67 13 -9 -132 -205 -78 -341 -333 96 -181 -33 -28 119 147 147 16 57 -84 2 -53 -72 -171 186 -25
4523b5k71R4O8O7k64K99RL15k14R9n4r3rP4l13L02l23o5L59k38J50j80Q4J8M21
$$ -25 -296 -202 -134 -67 -331 -32 -23 292 78 177 123 30 21 95 -218 84 -239 -304 55 -183 -33 -213 -129 -111 310
4548C10k16r6K4j50J03j95J18Q3K80l4k05j33o3K5RM3K3l3J68p7k09M45j90J33
$$ 310 94 -2 22 -128 -25 -220 -102 -19 261 227 22 -111 -174 -149 -140 -97 -74 -107 61 -16 -225 220 30 163
4572A63l54L31k49P5J02p8p4Q0N8n0J34n79M98p1l11L41J26m91M69k92J74J8J17
$$ 163 -191 140 -109 -34 68 -10 -84 -4 54 4 138 -441 57 -14 -325 16 142 -349 120 -172 2 20 137
4595A37l89L95r2j40O6qJ2J5lJ03j6j31k94M36j05m8j1j78K20r1J5RK60k67K80
$$ 137 -252 143 51 -89 -23 -31 -19 -4 -7 96 80 -51 -345 91 -14 -62 -73 -251 -31 -122 -107 -98 162 -105 175
4620A75Nj64L6K1o8n3K01j91jjK79L1l98K19j13K9J84l44P4J45K4J12j6l42J50
$$ 175 180 16 52 73 5 -48 153 -38 -39 -40 239 270 -128 91 -22 7 191 -153 -79 66 90 202 186 -156 -6
4645fj65R6j2K17j66J20l30R3L28k11K03j08J32j0j30j44R2p6R1q0k2j46K82J05
$$ -6 -171 -75 -87 130 -36 84 -246 -153 175 -36 167 59 191 181 51 -93 -1 -77 14 -66 -88 -234 48 153
4669A53m51L92k21p7K55j12K68p8k87K33j4m2l0j55J91o5L0J41k31L65n67M95
$$ 153 -298 94 -127 -204 51 -61 207 129 -158 75 61 19 -11 -166 25 -40 -10 131 -100 265 -302 193
4691A93N8qk12J75j05O0k61N4K42l57K30K1j60j85K53k18L10j73L3n6K2J65l60
$$ 193 251 243 31 206 101 161 -100 -46 196 -161 69 90 -70 -255 -2 -220 90 -83 -50 -106 -84 81 -279
4714b79L87P9l51L52k08J61j36rj04J47j04K90l4l72J47p3J88l12L6K35o7P7k01
$$ -279 108 187 -164 188 -20 141 5 -4 -108 39 -65 225 191 -181 -34 -107 81 -231 -195 40 -27 50 -151
4737a51m6Q8J06J03j29K05k51N18n32L8j22J98k37J70K94j82nj95K0K96l03R8
$$ -151 -197 -109 -3 100 -29 176 -75 443 -89 -51 -173 25 -212 -42 252 70 65 -130 -110 186 -117 -19
4759a9j22J75R0j68n2J42j72J09J16j11k9J6J01r8J94l09K93k95j18L2Q8J14k42
$$ -19 -141 34 124 -44 -96 46 -126 -17 99 -12 -41 -25 76 -22 172 -137 156 -139 -257 -225 -137 -23 -265
4782b65K70l1lJ4J3J85o4J76k94QOJ83l47J85j07j40l9M07l01O5J78l15Q7K46
$$ -265 5 -26 -29 -15 -2 183 119 295 1 9 15 198 -149 36 -71 -211 -250 157 -144 -79 99 -216 -129 117
4806A17N7j24j59J88j37M8J44l71K17p5N4j71M60k05M8%p9j7O9K8k14K03O6j72
$$ 117 174 50 -109 79 -58 -10 134 -237 -20 -95 -41 -212 248 43 91 91 12 -5 64 92 -122 81 147 -25
4830b5l1K57j3k89J31j64O3L99m65P6j51O8K93j78j7K65j70J24j63k66L99k99
$$ -25 -56 201 188 -101 30 -134 -71 328 -137 -61 -212 -144 149 -29 -46 219 49 173 10 -256 143 -156
4852a56L15j61L6j62J85p5M4r9j50K19j08j68L12R7j01q1J55Ol49L07j37J51r0
$$ -156 159 -2 34 -128 57 -18 26 -73 -223 -4 -112 -280 32 129 28 -53 102 108 -241 66 -71 80 -10
4875a0j15k6L95k07N9K72l69%J1n5P9j8l27K97m1L08k13J49r4o4p9j5j31J55O7
$$ -10 -125 -151 244 37 96 368 -1 -1 10 -45 34 16 -311 -14 -55 253 40 189 95 31 -48 -63 -194 -39 28
4900B8j89J5M7J43L81l13Q5q8k14L0Q4r0j24J41K72n5K29l64q0J48J53j24l22
$$ 28 -161 -146 -99 44 425 112 197 109 -105 -75 9 -81 -205 -64 208 153 382 18 -62 86 239 115 -207
4923b07N6K72k88J16qo5j2r1J37J05j92L22k42J02N6J19j08K53k74JJ99k48l04
$$ -207 -151 121 -167 -51 -59 -124 -136 -227 -90 15 -177 145 -97 5 61 180 72 325 51 52 251 3 -301
4946c01k0L72k43J37J2L59k66J99k75J41onj71j72J85j82K01Kj39o5L52k29L7
$$ -301 -321 51 -192 -55 -43 316 50 249 -26 115 109 104 -67 -239 -54 -236 -35 -33 -172 -237 115 -114 -77
4969g7k18MK25l20L42J11J44OJ67j32K9j85j38Q5k78P8p9JJ85P2N9J33Q1J41k25
$$ -77 -295 -291 -66 -386 -44 67 211 217 384 252 281 96 -42 43 -235 -157 -236 -235 -50 22 81 214 295 436 211
4994B11m4j93K14k37J38k29N4m5J83J3N9j98L0O0m23L93j42L24J17k43p1j95J33
$$ 211 167 -26 188 -49 89 -140 -86 -131 52 65 124 -74 -44 16 -407 -14 -156 168 285 42 -29 -224 -91
5017i1J27o2j91L39n5k98K18l04M37k72J48k4J4j34K50j4k73J98K3J37K8j58j30
$$ -91 36 -26 -217 122 67 -231 -13 -317 120 -152 -4 -28 -14 -148 102 88 -185 13 36 173 201 43 -87
5040h7N5Q7j94k22M61k67M61n67K55J7J84Q1m43k8K49p1o6J59o9j23L94j65L7
$$ -87 -32 55 -139 -361 100 -167 294 -273 -18 -1 183 264 -179 -207 42 -29 -95 64 -5 -128 266 101 138
5063A38K2J3j59o0l6K1R9P7j35o3K1J41R2j99r7O1L16j52j01p8j4J67J27j69j47
$$ 138 160 173 14 -46 -82 -61 38 115 -20 -83 -62 79 171 -28 -125 -64 252 100 -1 -79 -93 74 201 32 -115
5088a15J87J64P4l86l2n0J01j60P1J59j81Q9j3L33j52J2m4j4P6l40J54q3Q9o3
$$ -115 72 236 310 -76 -108 -158 -57 -217 -146 13 -168 -79 -92 241 89 101 57 43 119 -221 -67 -150 -61 -124
5112a24J70K6k78M8J71J99k86J81j46J25p3J16j82J24l00K44o7J36l7Mo5j91J24
$$ -124 46 72 -206 -158 13 212 -74 107 -39 86 13 129 -53 71 -229 15 -52 84 47 51 -14 -205 -81
5135h1J33j12j15K54j44L20l6j7k07j14K91j40N7r8L00l56J6J81l92J96J2J24
$$ -81 52 -60 -175 79 -65 255 219 202 -5 -119 172 32 89 -9 291 -65 -49 132 -260 -64 -52 72
5157G2j67N4o3P7K4L10k42PO0M6m36J04m7K85j85M0R2j66L31j33l29L31Q3j82
$$ 72 -95 -41 -104 -27 -3 307 65 72 132 178 -258 -154 -201 84 -101 -61 31 -135 196 63 -266 65 148 -34
5181c4J07j57J09J48j15k02K10J24j96j17R9l51M60j92LK39k96K30m3K92j85K66
$$ -34 73 -84 25 173 58 -144 66 190 -6 -123 -24 -375 85 -107 -104 135 -161 69 26 318 133 399
5203C99j27j99J77l00k11J7J37j18K89j99k4K41J87k59N4k30K06Q5j47J68q6k70
$$ 399 272 73 250 -50 -261 -244 -107 -225 64 -135 -159 82 269 10 64 -166 40 125 -22 146 60 -210
5225b10p5Q1Q3m11K01K95j82K09r0L14n2l01J69K67Kq3p6n7l31J24J55l37J85
$$ -210 -285 -204 -121 -532 -331 -36 -218 -9 -99 215 163 -138 31 298 300 217 141 84 -247 -123 32 -305 -120
5248a20K21P4q8k05P8J12O2N3j77m7r7K38j59Lj57K25j82K21p6O9m5Q5o8J93q3
$$ -120 101 175 87 -118 -40 72 134 187 10 -37 -134 104 -55 -52 -209 16 -166 55 -21 48 3 88 20 213 130
5273A30J2K00l51p0L35R8n71J33L8j00o8M9n3J77K80l47J19J19j80O8k71lO2j3
$$ 130 142 342 -9 -79 256 354 -217 -84 -46 -146 -214 -165 -218 -41 239 -108 11 130 -50 18 -253 -256 -194 -207
5297b07M43j20l48N58m04R2n9j21J65L9l57K24JJ73j77L56k29J2L8j23m0j34M8
$$ -207 236 116 -232 326 -78 14 -45 -166 -1 38 -319 -95 -94 79 -98 258 29 41 79 -44 -84 -218 -170
5320a70j77p3L09L11j20%K6L7l7l26J15Q4j25K17k65L47Q6j15M7k90J07k95J55
$$ -170 -347 -420 -111 200 80 80 106 143 106 -220 -105 -21 -146 71 -194 153 239 124 171 -119 -12 -307 -152
5343a52j36M6J71K73J44m3j14j47m8P1l06J35k51L78J00r2M01l49m2n8J28k02
$$ -152 -288 -242 -71 202 346 303 189 42 -6 65 -241 -106 -357 21 121 29 430 81 39 -19 109 -93
5365i3O9q1R4o3k19K72J82Q4j85q6j04L23l81L43l91j20L60j60M11L1J55k74j20
$$ -93 -24 -105 -11 -74 -293 -21 161 245 60 -26 -130 193 -188 155 -236 -356 4 -156 255 286 441 167 47
5388D7J39m45J41j93L60o7J2r0J89J70j10r4j17J25j37l70K16Q5J22L45j91L4
$$ 47 186 -259 -118 -311 49 -18 -6 -96 93 263 153 59 -58 67 -70 -440 -224 -139 -17 328 137 171
5410A71p0k0k37k7Nn7n3J56K21K88o2J69l64M2j29j14k3k50J80j19K24PJ41K05
$$ 171 101 81 -156 -183 -178 -235 -288 -132 89 377 315 484 120 162 33 -81 -104 -354 -174 -293 -69 -62 79 284
5434B84l3m15L85P5l27rM9j98L04P8j89k81K18mj83K06LP6j54N4R6n4J74q0K51
$$ 284 251 -164 221 296 -31 -40 9 -189 115 193 4 -277 -59 -63 -246 -40 -37 39 -115 -61 35 -19 155 75 326
5459C26k61m5M6k9k79J11j46J89n7N2M49m31K98j90K40O3j01k59P2P5l13J88J72
$$ 326 65 20 66 37 -242 -131 -277 -88 -145 -93 356 -75 223 33 273 336 235 -24 48 123 -190 -2 170
5482A70m81K54O4k63J26PJ0J96k95L62k02K33J4q9M0k04K52m21J32q1M3J54L43
$$ 170 -311 -57 7 -256 -130 -123 -113 83 -212 150 -52 181 195 106 146 -58 194 -227 -95 -176 -133 21 364
5505C64k73k31O3%J24N2k4k99M1M13j25p5O4J13o0k22J68q7j43N2P0J64m02J70
$$ 364 91 -140 -77 -77 47 99 75 -224 -183 230 105 30 94 207 147 -75 93 6 -137 -85 -15 149 -253 -83
5529h3nQ0R4P4j94L7O9J26M7k32q0J14J42j45K8p7M6j96J35N2o9j69o8K18O6j88
$$ -83 -88 -8 86 160 -34 3 72 198 245 13 -67 47 189 44 72 -5 41 -155 -20 32 -37 -206 -274 -56 10 -178
5555a78J99J23N4k29K12m41J57Q3k63K18K08r2j66Q2KL55l74k14M5M15l4J7k22
$$ -178 21 144 198 -31 181 -260 -103 -20 -283 -65 143 51 -115 -33 -31 324 -50 -264 -219 196 162 179 -43
5578d3K55j21j82M7p5R0Q5k02n8J07M3K04k31K4R3K83Kp9m1q7j77j52K75j70p7
$$ -43 212 91 -91 -44 -119 -29 56 -146 -204 -97 -54 150 -81 -57 36 319 321 242 201 114 -63 -215 60 -110 -187
5603a87J32M6k8j7k07K19O9O9J06lk08J34j97J94l62L31j67K42l93J77o2k96M73
$$ -187 -55 -9 -37 -54 -261 -42 27 96 202 199 -9 125 -72 122 -240 91 -76 166 -227 -50 -112 -408 65
5626F5J82j85K07k68K44j55j00r0M6J70k24J98l84jOJ81Q9k76K33K44m1J07R7
$$ 65 247 62 269 1 245 90 -10 -100 -54 116 -108 90 -294 -295 -289 -108 -19 -295 -62 182 141 248 345
5649C45k22j51q8j83K44J61l22J47O0Q4k95K6L17L2k79J06R0J8N5k8j20j32R1
$$ 345 123 -28 -116 -299 -55 106 -216 -69 -9 75 -220 -194 123 155 -124 -18 72 90 145 117 -3 -135 -44
5672d4n9K57k27j95L02l4j89L00k21K20Q6r5J3j58J52j7j51k2l35K15R1L46o3
$$ -44 -103 154 -73 -268 34 0 -189 111 -110 110 196 101 114 -44 108 91 -60 -82 -417 -202 -111 235 172
5695A72K6K5M0j15Kj52J48j01J79k56Q0n2QK0j57J17k96J58j55K64J15O9J09J93
$$ 172 198 223 263 148 150 -2 146 45 224 -32 48 -4 4 24 -133 -16 -312 -154 -309 -45 70 139 248 441
5719D41o4J06l06k7m39k45p3K83k91L04J94K25K8J05n9L5j86n3K40l54L8K49p7
$$ 441 377 483 177 150 -289 -534 -607 -324 -615 -311 -117 108 136 241 182 217 31 -22 218 -136 -98 151 74
5742G4K22k33l41J77k58J07q%m1J62P4K50L15j18Q6J28l81K01l77l90j23J43J62
$$ 74 296 63 -278 -101 -359 -252 -260 -260 -301 -139 -65 185 500 382 468 596 215 416 39 -351 -474 -331 -169
5765a69K66k83J95N5k00J88k8n7j30j5Kk7L45J53p1j46o8j75j26L37l14L8K13
$$ -169 97 -186 9 64 -136 52 24 -33 -163 -178 -176 -203 142 295 224 78 10 -165 -291 46 -268 -230 -17
5788a7k25L76K67j47j69J63j62l01L5J41l28J27J99J82j78qK00j30q4J50j52N7
$$ -17 -242 134 401 254 85 248 86 -215 -180 -39 -367 -240 -41 141 -37 -45 155 25 -59 91 -61 -4
5810dj71J57jL8L08j87m3m7M3l21K3r3k6N39k61K74q6K1j49JL63k69j20J0m6K1
$$ -4 -175 -18 -19 19 327 140 97 50 93 -228 -205 -298 -324 215 -46 228 142 163 14 15 378 109 -11 -1 -47 -26
5836b6p1n5J40j60J91J6j86J95r4M0p3L%J78m7K38q4k96R8j86J09K06mj48k9o
$$ -26 -97 -152 -12 -172 19 35 -151 44 -50 -10 -83 -80 -80 98 51 289 205 -91 7 -179 -70 136 132 -16 -45 -51
5862e1J82l4k01K34k76Q2n7J6J81k24q7J93J70k26L97j78j60r4K75k84m2K2O2
$$ -51 131 97 -104 130 -146 -64 -121 -105 76 -148 -235 -42 128 -98 299 121 -39 -133 142 -142 -184 -162 -100
5885a00K19M3j25k20K89J4q6j02K14k8j93lJ29j54J9J51p8j35K16j10K41l22j61
$$ -100 119 162 37 -183 106 120 34 -68 146 118 -75 -78 51 -103 -84 67 -11 -146 70 -40 201 -121 -282
5908b82K02j49L22q7J79Jmk82M84j77j69k87J95J24N0m52K39J63r3L8K0N8p9p8
$$ -282 -80 -229 93 6 185 186 182 -100 384 207 38 -249 -54 70 120 -332 -93 70 -23 15 35 93 14 -64
5932f4O2k22L57l0J96k72K8l4k06J19K33m12R1J41k18O7K76j86K31L3l83J61M
$$ -64 -2 -224 133 103 299 27 55 21 -185 -66 167 -245 -154 -13 -231 -164 112 -74 157 190 -193 -32 -28
5955b8J47k30J13j62J66R9Lj81K62l08j68K25m0J48k66P6K29k45K23j78K64R6
$$ -28 119 -111 2 -160 6 105 108 -73 189 -119 -287 -62 -102 46 -220 -144 85 -160 63 -115 149 245
5977B45j53J5j4j28RL8j36R4j02K75n6j69J35jp7j9n8j2m6K74n0Q3j43M9j30j59
$$ 245 92 107 93 -35 -26 12 -124 -30 -132 143 87 -82 53 52 -25 -44 -102 -114 -160 114 64 147 4 53 -77 -236
6003b36K07K37k86j3J56j77q2L66m16K70J33L9k03k51M78k46N0J48J82m65L08
$$ -236 -29 208 -78 -91 65 -112 -194 172 -244 26 159 198 -5 -256 222 -24 26 174 356 -109 199
6024A99j99J22k80J91P4k52L65k85O8l71K91j39L49l6J56l30J54r5K28m6j00j68
$$ 199 0 122 -158 33 107 -145 220 -65 3 -368 -77 -216 133 97 253 -77 77 -18 210 164 64 -104
6046a04R8j30j09J82K15k31J64J52Mj26n7m1j6J47l24K56N5l11K01m5J03j08k63
$$ -104 -6 -136 -245 -63 152 -79 85 237 241 115 58 17 1 148 -176 80 135 -176 25 -20 83 -25 -288
6069b88J18Q4N0J06N7M8ML4M4p6k51j09K49l04j30j05N69j13q2J07o5K19l2j81
$$ -288 -170 -86 -36 70 127 175 179 213 257 181 -70 -179 70 -234 -364 -469 100 -13 -95 12 -53 166 134 -47
6093d7K11l7j68j63P5J68m04M02q8j00Ll55K06j07K06L90N4P5L9J60k68N7j21
$$ -47 164 127 -41 -204 -129 39 -365 37 -51 -151 -148 -503 -297 -404 -198 192 246 321 360 520 252 309 188
6116A88k07k03j44J75k01Q8J09jK64j12J69J13q2R1n7K8l80J96J8j87J05L7j96
$$ 188 -19 -222 -366 -191 -392 -304 -195 -196 68 -44 125 238 156 247 190 218 -162 34 52 -135 -30 7 -189
6139a89K56k27Ol40K26K73j62L99Q7O2n0J06l46pj45j22r6r9J42j33JQ7L96l87
$$ -189 67 -160 -154 -494 -268 5 -157 242 329 391 341 447 101 94 -51 -173 -269 -368 -226 -359 -358 -271 125 -262
6163b62J87M7j79J31J03PJ22J8n2j8R5l11J86m6k3j38l48K74J44J8L16j61j7M
$$ -262 -75 -28 -207 -76 27 34 156 174 122 104 199 -112 74 28 5 -133 -481 -207 -63 -45 271 110 93 97
6187I7L6l01K13j55J63m2PJ07r6J58j10q8J31k4l55M9L58j90k09J94O6k09O7J90
$$ 97 133 -168 45 -110 53 11 18 125 29 187 77 -11 120 96 -259 -210 148 -42 -251 -57 9 -200 -133 57
6211E7O0r7K29k12N0J7j22J07J10j42j27q8R6j70J89n1k80J85P2j58K01K82J50
$$ 57 117 20 249 37 87 104 -18 89 199 57 -70 -158 -62 -232 -43 -94 -374 -189 -117 -275 -74 208 358
6234C58q5M7M3o6j46J32m87J71q4j16L01j15l14J55K56l41J37M15pj68J28j33
$$ 358 273 320 363 297 151 283 -204 -33 -117 -233 68 -47 -361 -206 50 -291 -154 261 254 86 214 81
6256H1O4O2n0j9j33m3J25n11K06k76L12k36K78J15K03R9l4J57k29j41j29O8p3
$$ 81 145 207 157 138 5 -38 87 -424 -218 -494 -182 -418 -140 -25 178 277 243 400 171 30 -99 -31 -104
6279a04J9j47M51l90J11Jm9j22N1J63J21r7K70j35O5j26P2j43N2j01Lqk06J70
$$ -104 -85 -232 219 -171 -60 -59 -108 -230 -179 -16 105 8 278 143 208 82 154 11 63 -38 -35 -43 -249 -79
6303g9k1M3j28L28j76J28LK4j54J22J61k33l7k3J58j73j64K14n1k3J35j74m3M8
$$ -79 -100 -57 -185 143 -33 95 98 122 -32 90 251 18 -19 -42 116 -57 -221 -7 -58 -81 54 -120 -163 -115
6327a15n2P5M3j2J43j81L95l29J22j82l9j02J32J27J07m3j44L39k60j96J48Pm00
$$ -115 -167 -92 -49 -61 82 -99 296 -33 89 -93 -132 -234 -102 25 132 89 -55 284 24 -172 -24 -17 -417
6350d17N03J54j57l2j1j25J16k9K4n0M24o38K14j7j32K26k92L38m8K8J79j44j57
$$ -417 86 240 83 51 40 -85 31 2 26 -24 400 -238 -24 -41 -173 53 -239 99 51 79 258 114 -43
6373d3j26K78j11m9j7j50R0O9j10o9K87j62R5J00j13p8K60j77P9K6k6r4J14O5
$$ -43 -169 109 -2 -51 -68 -218 -128 -59 -169 -238 49 -113 -18 82 -31 -109 151 -26 53 79 53 -41 73 138
6397A38j1m28O36k78P7J61j95l9k98M16k55k8K1K60k38M8j77J67l8J19p0j95P
$$ 138 127 -301 335 57 134 295 100 61 -237 179 -76 -104 -83 177 -61 -13 -190 -23 -61 58 -12 -207 -200
6420b00K39j06o0J65Q8J5j67K33k47o4K67j74J06j16L8J00j51J29J97l02L4j73
$$ -200 39 -67 -127 38 126 141 -26 207 -40 -104 163 -11 95 -21 17 117 -34 95 292 -10 24 -149
6442a49q1J56J3O9l0j21K43O3j71K58l41Q2j76j4L95j93J22q4k60P3K38m62M08
$$ -149 -230 -74 -61 8 -22 -143 100 163 -8 250 -91 -9 -185 -199 196 3 125 41 -219 -146 92 -370 38
6465C8k65M28j32k9O6K66m13O8q3K08l07N8J3j20K17j97J74J92m2k04N9Q1N2k92
$$ 38 -227 201 69 40 106 372 -41 27 -56 152 -155 -97 -84 -204 13 -184 -10 182 140 -64 -5 76 128 -164
6489a64K87k24j59K56J43p7K6k58k36M32j49L13k38J22k6k7K64j39j05p2K89l85
$$ -164 123 -101 -260 -4 139 62 88 -170 -406 26 -123 190 -48 74 48 21 285 146 41 -31 258 -127
6511a27J71k46n8K99k9j98K63k66K84q1q6K21n6K75m66J00r0K55J05l95p6K02
$$ -127 44 -202 -260 39 10 -188 75 -191 93 12 -74 147 91 366 -100 0 -90 165 270 -125 -201 1
6533AO0R9k86JJ86L7q7J55J4j05K36P6l44l97J6L99j1l61J95jL6K81j35q0j19
$$ 1 61 160 -126 -125 61 98 11 166 180 75 311 387 43 -354 -338 61 50 -311 -116 -117 -81 200 65 -15 -134
6558a34K71p5J09M6k77R1J15r2l8J63l96J06L3lrm4R6L13j96r4j40K37j57L4m5
$$ -134 137 62 171 217 -60 31 146 54 16 179 -217 -111 -78 -81 -90 -134 -38 275 79 -15 -155 82 -75 -41 -86
6583h6J01j85RQ2O9L49k98N0J15j35m8q6J16j91J62l2O1j27j60K50k53K46o0q5
$$ -86 15 -170 -161 -79 -10 339 41 91 206 71 23 -63 53 -138 24 -8 53 -74 -234 16 -237 9 -51 -136
6607a36K9K26q7J4J10q9j01j16N79n65R4l47L3P2J19j81K4J74J47K67l8PK3k0
$$ -136 -107 119 32 46 156 67 -34 -150 429 -136 -42 -389 -356 -284 -165 -346 -322 -148 -1 266 228 235 258 238
6631B38n7j33q3r4q5R0l0o0k36J97L2Q7j31L82k54J69J83J66k5p9r3n3p0j12J14
$$ 238 181 48 -35 -129 -214 -124 -154 -214 -450 -253 -221 -134 -265 117 -137 32 215 381 356 277 184 131 61 -51 63
6656F3l20j78L46j31m3jL00M4J86Q6k79P3N1K35l91m2J85l44M3J25p6nR5k26o3
$$ 63 -257 -435 -89 -220 -263 -264 36 80 266 352 73 146 197 432 41 -1 184 -160 -117 8 -68 -73 22 -204 -267
6681b67L19j94N3r2M2K81J03rk3r6j76J71j12j09J22%O4j39K86k4O8m53n2K60
$$ -267 52 -142 -89 -181 -139 142 245 236 213 117 -59 112 0 -109 13 13 77 -62 224 200 268 -185 -237 23
6705B3j59J17m7J28Kj61J56N9KL8o2j28k3Q3k8k7m5l9N6k1j3J60j99J53mj20n4
$$ 23 -136 -19 -66 62 64 -97 59 118 120 158 96 -32 -55 28 0 -27 -72 -111 -55 -76 -89 71 -128 25 21 -99 -153
6732a53L11Q0l34M21l55O1j50J19Q2l14J05r6O2k15J71p5K68p7K36p7k19L20L9
$$ -153 158 238 -96 325 -30 31 -119 0 82 -232 -127 -223 -161 -376 -205 -280 -12 -89 147 70 -149 171 210
6755B10j3l02Q6R2k77J75j35J47j48L4j02Q3J6M3K14Q5J80j10r7k00L18l71j4
$$ 210 197 -105 -19 73 -204 -29 -164 -17 -165 -131 -233 -150 -134 -91 123 208 388 278 181 -19 299 -72 -86
6778h6k1K32q1k64PL05k66Q0K33k80J9M6J03N8j86J25K54l37K12k59J20J8n2J27
$$ -86 -107 125 44 -220 -213 92 -174 -94 139 -141 -122 -76 27 85 -101 24 278 -59 153 -106 14 32 -20 107
6802A07j06k4q9J3K59k82N9K19j78k4P1K16p4k87L96k9l84J76j08N1n4K1q4K17
$$ 107 1 -23 -112 -99 160 -122 -63 156 -22 -46 25 241 167 -120 276 247 -137 39 -69 -18 -72 -51 -135 82
6826H2r0o5j73J70l5P8J35j77k67M16m1Pk32J70K4K33k08p7N5k09K25R2k33J74
$$ 82 -8 -73 -246 -76 -111 -33 102 -75 -342 74 33 40 -192 -22 2 235 27 -50 5 -204 21 113 -120 54
6850E4j31j95L28k08P4Q3l9n3q1J30J10j90K34M7j82N8q0k8ML75l17p5L99k30
$$ 54 -77 -272 56 -152 -78 5 -34 -87 -168 -38 72 -118 116 163 -19 39 -41 -69 -65 310 -7 -82 317 87
6874H7k0k02L68j50k96J30Q2L3K04l91J13K39r8L0N0q6j44J9K37r5j23J7J55q5
$$ 87 67 -135 233 83 -213 -83 -1 32 236 -155 -42 197 99 129 179 93 -51 -32 205 110 -13 4 159 74
6898G4R0n2J85k89J56j01J34m12K33j74J94j37O7K3p6K31K2k73L07k76K9l1J02
$$ 74 164 112 297 8 164 63 197 -215 18 -156 38 -99 -32 -9 -85 146 168 -105 202 -74 -45 -76 26
6921B6r8R3K2J57l27O6K09k23j7N4R3j25R0j21R2o2J79p0k05J99O0p9q6R4j22
$$ 26 -72 21 43 200 -127 -61 148 -75 -92 -38 55 -70 20 -101 -9 -71 108 38 -167 32 92 13 -73 21 -101
6946a01J61P0n5l60N18k43N1J5j04K9K6M4o3J38k50L01l83P7M1J29k1m0M8J1j8
$$ -101 60 130 75 -285 233 -10 41 56 -48 -19 7 51 -12 126 -124 177 -206 -129 -88 41 20 -20 28 39 21
6971B1R7k84L43j41N8k47J22j17J78M1j16K90M4j92J11n4n5n8l0J03p9q5q1K37
$$ 21 118 -166 177 36 94 -153 -31 -148 30 71 -45 245 289 97 208 154 99 41 11 114 35 -50 -131 106
6995A06j80J21k57m5L85k78O5p3L60j27l2j76J69N3k83l8Q7J91L6j92J0k3Rj55
$$ 106 -74 47 -210 -255 130 -148 -83 -156 204 77 45 -131 38 91 -192 -230 -143 48 84 -108 -98 -121 -112 -267
7019b67J44K53J31j62L9N8k87o8n2R1jK2O5k50L32k03J92o5r9J41K43l63J16j54
$$ -267 -123 130 261 99 138 196 -91 -159 -211 -120 -121 -99 -34 -284 48 -155 37 -28 -127 14 257 -106 10 -144
7043a44M6J53r6J9j56j08l6N2L44k02K26j61O0J18N5j70NJ99J43k51J31l10O8
$$ -144 -98 55 -41 -22 -178 -286 -322 -270 74 -128 98 -63 -3 115 170 0 5 204 347 96 227 -83 -15
7066a5j0K7P3k61J06l5m9J16J4j52K53j11J15J36j35p0J96k79J10j39K01j06J70
$$ -15 -25 2 75 -186 -80 -115 -164 -48 -34 -186 67 -44 71 207 72 2 198 -81 29 -110 91 -15 155
7089A55J48k42j20j15l0K70%o6M1j58K64k21o3J64J21j92k14P14k69p6j32M37
$$ 155 303 61 -59 -174 -204 66 66 0 41 -117 147 -74 -137 27 148 -44 -258 456 187 111 -21 416
7111D16m66j11N1J2L27l45j53J32k14K31J83j95Q1kK40j43J24l7k27M49l20k10
$$ 416 -50 -161 -110 -98 229 -116 -269 -137 -351 -120 63 -132 -51 -53 187 44 168 131 -96 353 33 -177
7133a77K53j18MJ8k39m9K77q1J49J71k36K97k31k2L80l49J92j06j22k07M65m37
$$ -177 76 -42 -38 -20 -259 -308 -31 -112 37 208 -28 269 38 16 396 47 239 133 11 -196 269 -168
7155a68Q8J00m6j53M5r2mL45K30j92k6J50j60k1j56L62j26m69K97oj84q6L63k35
$$ -168 -80 20 -26 -179 -134 -226 -230 115 345 153 127 277 117 96 -60 302 176 -293 4 -2 -186 -272 91 -144
7179a44J35Q2Q1o8q9K92K4l45r6L05k41K40k18RJ9L56k42m17J44K76j35j8K5J7
$$ -144 -9 73 154 86 -3 289 313 -32 -128 177 -64 176 -42 -33 -14 342 100 -317 -173 103 -32 -50 -25 -8
7203hm69N30n2Q4%k8P5Or2r5m2J44J52k38qj22L48k35p4K9k84P0J2L69j05K01
$$ -8 -477 53 1 85 85 57 132 138 46 -49 -91 53 205 -33 -41 -163 185 -50 -124 -95 -379 -309 -297 72 -33 168
7229A68jM3o4k0L4l9k4k47o8J96jj52QK49Oj69P0j95K67j33K3M9L0R9M7k98Q0
$$ 168 167 210 146 126 160 121 97 -150 -218 -22 -23 -175 -167 82 88 -81 -11 -206 61 -72 -49 0 30 129 176 -122 -42
7256d2J05q5J42j24j41l1J65N2r6J08K5j19K07j34j32J62j54J43J63k96L70k90
$$ -42 63 -22 120 -4 -145 -176 -11 41 -55 53 78 -41 166 32 -100 62 -92 51 214 -82 288 -2
7278bq0n9p5L2J65j43%j1J71K13l3kl19N4m6J34l44J25Q4O6L16l49J52k7K6j69
$$ -2 -82 -141 -216 -184 -19 -162 -162 -173 -2 211 178 176 -143 -89 -135 -1 -345 -220 -136 -70 246 -103 49 22 48 -121
7304a21J56l0J4r3j30J72j58K52J61k27L3j73O3J2J89j77Q2O6J47k94o5N4KJ6
$$ -121 35 5 19 -74 -204 -32 -190 62 223 -4 29 -144 -81 -69 120 -57 25 91 238 -56 -121 -67 -65 -49
7328d9J23j18J23K20k24k15J14j17KJ49k17J70K49p9k03k6J04j9N0K9j95J38j1
$$ -49 74 -44 79 299 75 -140 -26 -143 -141 8 -209 -39 210 131 -72 -98 6 -13 37 66 -129 9 -2
7351bo5J95k76l5k8J97j1jr3K6n9J22J7K99k0l70R0J23j39R0LK9m6j93O7L3j87
$$ -2 -67 128 -148 -183 -211 -14 -25 -26 -119 -93 -152 -30 -13 286 266 -104 -14 109 -30 60 63 92 46 -147 -80 -47 -234
7378b34K17O8lJ6j25k06L79r5M0K8J51k67q9K06k16L17m54M96kk77J80m5n8J92
$$ -234 -17 51 48 64 -61 -267 112 17 57 85 236 -31 -120 86 -130 187 -267 229 227 -50 130 85 27 219
7402B19k65J28k22L4k5N3k3K53O4j77J76k04j21P9j96J06K99k13J83j47p8R0K
$$ 219 -46 82 -140 -106 -131 -78 -101 152 216 39 215 11 -110 -31 -227 -121 178 -35 148 1 -77 13 15
7425A5Okj20J3p7K19j41j0K5K81j55k02K31j83J20J77j07k47L2O0J51J16k77m0
$$ 15 21 19 -101 -88 -165 54 -87 -97 -72 209 54 -148 83 -100 20 197 90 -157 -125 -65 86 202 -75 -115
7449a15N9K61j91m3p9n6J91M5o1J61j11k0O1j30Q6j95K4J76K6L44m40J72k6q9
$$ -115 -56 205 14 -29 -108 -164 27 72 11 172 61 41 102 -28 58 -137 -113 63 89 433 -7 165 139 50
7473E0kM5K7j44j38J0R8K12o0n7J33j83j28J8Q1j9k05N0O7L68j86r6J86j58o6
$$ 50 48 93 120 -24 -162 -152 -54 158 98 41 174 -9 -137 -119 -38 -57 -262 -212 -145 223 37 -59 127 -31 -97
7498i7J6J99J00p5r9k2p2l3K84j51J1j81L0J2j7K17l29J87K25l26J27J03m3j01
$$ -97 -81 118 218 143 44 22 -50 -83 201 50 61 -120 -90 -78 -95 122 -207 -20 205 -121 6 109 66 -35
7522c5J46J4j05N1P2l3j72R7J23l44K9K26Nm9o8R6J8q0n4n1L93l95J24m6M3o2
$$ -35 111 125 20 71 143 110 -62 35 158 -186 -157 69 74 25 -43 53 71 -9 -63 -114 279 -116 8 -38 5 -57
7548e7j72J69m1N1L44j63J9k62r3J44j07K47k73L30k87J69K08k09k4P0k14K20
$$ -57 -229 -60 -101 -50 294 131 150 -112 -205 -61 -168 79 -194 136 -151 18 226 17 -7 63 -151 69
7570F9k76P8m2L1K11o3Q1j29K69l52q4J37J03K9j56M0O7K20k11O4j06j71J07m7
$$ 69 -207 -129 -171 -140 71 8 89 -40 229 -123 -207 -70 33 62 -94 -54 13 233 22 86 -20 -191 -84 -131
7594a31K05q4k05J46J96m4M5L4m61K33J79k6j34Q0j78L34j36n0M3l2K12j50l02
$$ -131 74 -10 -215 -69 127 83 128 162 -299 -66 113 87 -47 33 -145 189 53 3 46 14 226 76 -226
7617b26Om5K63L86n76J88r1P2j25K00O0k93K64k86L55k28n9K24j48j36M28j92
$$ -226 -220 -265 -2 384 -192 -4 -95 -23 -148 52 112 -181 83 -203 152 -76 -135 89 -59 -195 233 41
7639D1l8o2j97L04K4oK1L7q9p4K14p6k2J19l06m7M8k00L04L18k18k4j72K59M3
$$ 41 3 -59 -256 48 72 66 87 124 35 -39 175 99 77 196 -110 -157 -109 -309 -5 313 95 71 -101 158 201
7664B01k28j6O5J14l15K25j39P5J56j81r2J28k9j17lR3n4j8k6ML31k94P0J05l4
$$ 201 -27 -43 22 136 -179 46 -93 -18 138 -43 -135 -7 -36 -153 -156 -63 -117 -135 -161 -157 174 -120 -50 55 21
7689B1N0K20m03O6l2O6L76l12J02j67q3j2J99J8j02J64l27k5L7L78k92QJ7Q3M8
$$ 21 71 291 -112 -46 -78 -12 364 52 154 -13 -96 -108 91 109 7 171 -156 -181 -144 234 -58 -50 -33 50 98
7714I8j70KQ6q7L63l45L15l02J44j18j25J10O6J6k4J70k25o2R4J88j7r4J1l18
$$ 98 -72 -70 16 -71 292 -53 262 -40 104 -14 -139 -29 37 53 29 199 -26 -88 6 194 177 83 94 -224
7738b24J35o3J36n1K0J02j09j29M38m50J44nm4J63o5P1k62O0K1O6P7j1R7j81p4
$$ -224 -89 -152 -16 -67 -47 55 -54 -183 255 -195 -51 -56 -100 63 -2 69 -193 -133 -112 -46 31 20 117 -64 -138
7763a38k1K38J32l15MN2J5l7J05J09M1j06K5k19j9j18L40j01jk1K91j94j84N8
$$ -138 -159 79 211 -104 -100 -48 -33 -70 35 144 185 79 104 -115 -134 -252 88 -13 -14 -35 256 62 -122 -64
7787f4J23k28J04L7J32J60j81j82L9K4k54R8J72J54l12K42j16K7j02J68k15L28
$$ -64 59 -169 -65 -28 104 264 83 -99 -60 -36 -290 -192 -20 134 -178 64 -52 -25 -127 41 -174 154
7809A54j18p0j63J37L83m37PM7j64K83k4N7j89n9Q2j19J20K09j85l5M1Q1J03j35
$$ 154 36 -34 -197 -60 323 -114 -107 -60 -224 59 35 92 -97 -156 -74 -193 -73 136 -49 -84 -43 38 141 6
7833FK9j2l5J50k06J79j99J19j22j93M35l79r2K52M2j96M43m58K86k39N27m15
$$ 6 35 23 -12 138 -68 111 -88 31 -91 -284 151 -228 -320 -68 -26 -222 221 -237 49 -190 337 -78
7855g8o2J99o8k9J35Lj66m4L59j56j22j32K19p5r6J22j66J95J3J30k02O2M1l40
$$ -78 -140 59 -9 -38 97 100 -66 -110 249 93 -29 -161 58 -17 -113 9 -157 38 51 181 -21 41 82 -258
7879b58M66l25K28j35K00k19J47k39J11J14j32J13Qj27J37l01L25k72J25O1mL7
$$ -258 208 -117 111 -24 176 -43 104 -135 -24 90 -42 71 79 -48 89 -212 113 -159 -34 27 23 60
7901F0j26K7J5j14J38j62R6K02j95P7P8j19l8m4K4Qr8K12k1J10k32J63r8J97n2
$$ 60 -66 -39 -24 -138 0 -162 -66 136 -59 18 96 -23 -61 -105 -81 -73 -171 41 20 130 -102 61 -37 160 108
7926A08j99j08L2J10j41J49l9L0n7K62K6k45K30mk32N3J81l5k4M0j70J08J6Q5
$$ 108 -91 -199 -167 -57 -198 -49 -88 -58 -115 147 173 -72 158 154 -78 -25 156 121 97 137 -33 75 91 176
7950A76j35J47k33m8J07k57J29N9J33LO2j50J02m1k0ll2j17k11N15l78O6L68l61
$$ 176 41 188 -45 -93 14 -243 -114 -55 78 81 143 -7 95 54 34 31 -1 -118 -329 186 -192 -126 242 -119
7974a19N4l2K13K9K4J4k44K3R9j0j54J15J00m08L43j87mJ21K8RN3j9p1K42k36
$$ -119 -65 -97 116 145 169 183 -61 -38 61 51 -103 12 112 -296 47 -140 -144 -23 5 14 67 48 -23 219 -17
7999a7L8M4R4k47J86j63J93j60j70J59o9j55N74l96L8k08K23J18j67j7K80o7j78
$$ -17 21 65 159 -88 98 -65 128 -32 -202 -43 -112 -267 307 -89 -51 -259 -36 82 -85 -102 178 111 -67
8022f7J88j00j63N4K40l40J39L0J75MK18k15l40L40j14l80L56k68l7K89J43k73
$$ -67 121 21 -142 -88 152 -188 -49 -19 156 160 378 163 -177 163 49 -331 25 -243 -280 9 152 -121
8044a21J80K06l78K36k9J9k15P8k9J1K72j37k21Q1L2n2r2K52o8R9l47Q2r0J59
$$ -121 59 265 -113 123 94 113 -102 -24 -53 -42 230 93 -128 -47 -15 -67 -159 93 25 124 -223 -141 -231 -72
8068g2M5n2J98J48o01M37j3r9k09k9P8M9K2J19n5J53n0j06J55j16l12K30J18k36
$$ -72 -27 -79 119 267 -334 103 90 -9 -218 -247 -169 -120 -98 21 -34 119 69 -37 118 2 -310 -80 38 -198
8092a98K00LL05k77r5o4j37J11K95q4m10L22l2K67Q2k24r7J37j11j67L47l09J42
$$ -198 2 5 310 33 -62 -126 -263 -152 143 59 -351 -29 -61 206 288 64 -33 104 -7 -174 173 -136 6
8115FM6n9r3K64k19J10rJ09k44J77j81L7p6J18k8M4k9Q1k18J49P9k29M0J80jj03
$$ 6 52 -7 -100 164 -55 55 46 155 -89 88 -93 -56 -132 -14 -42 2 -27 54 -164 -15 64 -165 -125 55 54 -49
8141d9Q8JL15k9j14%l52J50R5J78n64M39J4N1k42j91M17k50k4P6j83J93nR4r1
$$ -49 39 40 355 326 212 212 -140 10 105 283 -281 158 172 223 -19 -210 207 -43 -67 9 -174 19 14 108 17
8166A7J19r4K57l91j25L49k29J79k2R9l04N5J44J44j01O8q0J45pl00J71n4P6O8
$$ 17 136 42 299 -92 -217 132 -97 82 60 159 -145 -90 54 198 97 165 85 230 223 -77 94 40 116 184
8190A84k37
$$ 184 -53
8191e3
$$ Imaginary data points
##PAGE= N=2
##DATA TABLE= (X++(I..I)), XYDATA
0@%%%%%%%%%%%%%%%oJ4j6J6j6K2l0L2l9M7n5O3p2Q8j02J16j33J51j72J95k21K50
$$ 0 0 0 0 0 0 0 0 0 0 0 0 0 0 0 0 -6 8 -8 8 -8 14 -16 16 -23 24 -31 32 -40 48 -54 62 -71 80 -92 103 -118 132
37A32k81L18l55L95m42M93n48O08o75P46q23R09j003J106j217J340j477J628j797
$$ 132 -149 169 -186 209 -233 260 -288 320 -355 391 -432 477 -526 580 -637 703 -774 854 -943
56i43J986k200K441k720L051l440L909m496N255o282P786j0287J5672n2690L6792
$$ -943 1043 -1157 1284 -1436 1615 -1825 2084 -2412 2843 -3439 4347 -5940 9732 -42958 -6166
71f166R2548J32887q60L5683l4179r4154l5362j28807R085r0587L9228Q520J1816
$$ -6166 86382 219269 218409 254092 219913 125759 90397 -38410 -29325 -119912 -80684 -72164 -60348
84f0348N9990l5252N3724p1288R656k7203k6172M5249k0614J03176m446P8463
$$ -60348 -358 -35610 18114 -53174 -43518 -70721 -96893 -51644 -72258 30918 26472 104935
96A04935J8961p655J3006q5451Q088r7221o285k8110j2165M5911k0861Q2400k8244
$$ 104935 123896 116241 129247 43796 51884 -45337 -51622 -79732 -91897 -45986 -66847 15553 -12691
109a2691L9724j1017k1497J2295n5411N0421l9287M6070J3989J0969L8102m1814
$$ -12691 27033 16016 -5481 6814 -48597 1824 -37463 8607 22596 33565 71667 29853
121B9853L7851o8898R18l3018k3465K3874k7329P2159j4938N2006L504r331O641
$$ 29853 67704 -1194 -276 -33294 -56759 -32885 -60214 11945 -2993 49013 52517 43186 49827
134D9827o8985J1276p2517P708j2959J0605N6448L850Q6388o047M3069j4028k6937
$$ 49827 -19158 -7882 -80399 -72691 -85650 -75045 -18597 -14747 71641 65594 108663 94635 67698
147F7698j1851p6544N553o1260J6314m657J4971M8128j0624N8833k7805K1278
$$ 67698 55847 -20697 -15144 -76404 -60090 -64747 -49776 -1648 -12272 46561 18756 40034
159D0034k4584k0311M325m5074L6749k7961L5943L093J0503K8316l0988L2328
$$ 40034 15450 -4861 -536 -45610 -8861 -36822 -879 2214 12717 41033 10045 42373
171D2373m2954J1874k2659r971J7057k7246M2471k3778L1594p347j880J4434l5321
$$ 42373 -581 11293 -11366 -21337 -4280 -31526 10945 -12833 18761 11414 9534 23968 -11353
184a1353K6598l8549J8901j4211j641J9496k4633L5609k7284K5496r842M28J9952
$$ -11353 15245 -23304 -4403 -18614 -20255 -759 -25392 10217 -17067 8429 -1413 -985 18967
197A8967k1853L5522k4482K5694j3267p054O586l8338J5563m0489J3868j5830
$$ 18967 -2886 32636 8154 33848 20581 13527 20113 -18225 -2662 -43151 -29283 -45113
209d5113J423K4506j0536M4426j1171L4667m846J446J0508l1664J6851l7989J1520
$$ -45113 -43690 -19184 -29720 14706 3535 38202 33356 34802 45310 13646 30497 -7492 4028
222D028j8813m844J1245k1505K8971k3974K3211j0622R31J2589k0052K6891k2850
$$ 4028 -14785 -19629 -8384 -29889 -918 -24892 -1681 -12303 -11372 1217 -18835 8056 -14794
235a4794K3968p036L969J5537j6885K6508k5041J8578j4571n811M914k5255J8037
$$ -14794 9174 2138 6107 21644 4759 31267 6226 24804 10233 4422 9336 -15919 2118
248B118k9404J7291j1234J567J4664j2963K8867j8377K3574q308O19Q289k0687
$$ 2118 -27286 -9995 -21229 -19662 -4998 -17961 10906 -7471 16103 7795 8414 16703 -3984
261c984J8841k6048J5921j1650O06J0823j4867K3402j9771J8959j1143n71O792
$$ -3984 14857 -11191 4730 -6920 -6314 4509 -10358 13044 -6727 12232 1089 518 7310
274G310j8759J8164k2505J7313j0003L300J0271j3498K2718j9213J7861j0477
$$ 7310 -11449 6715 -15790 1523 -8480 -5180 5091 -8407 14311 -4902 12959 2482
286B482O95N724j7398J7491k2461J5702j0817J764Q197j2739K1458j7888J7621
$$ 2482 3177 8901 -8497 8994 -13467 2235 -8582 -6818 1379 -11360 10098 -7790 9831
299I831r411J488N435j5050J6746k0910J5667r122L450Q250j1069J9547j7932
$$ 9831 420 1908 7343 -7707 9039 -11871 3796 -5326 -1876 6374 -4695 14852 -3080
312c080J4932j1623q20L124j5180J6190j8093J7655p090N183P936j1917J5353
$$ -3080 11852 229 -591 2533 -12647 3543 -14550 3105 -3985 1198 9134 -2783 12570
325A2570k0205J1518j2920ON359r700K0005j1558J9740o431L066K648j6711R616
$$ 12570 -7635 3883 -9037 -9031 -3672 -13372 6633 -4925 14815 8384 11450 14098 -2613 7003
339G003k3011J0315j0248M775J0496m241K2378j1007J5312j1817l307l920j8538
$$ 7003 -16008 -5693 -15941 -11166 -670 -4911 17467 6460 21772 9955 6648 2728 -15810
352a5810Q943j7927J5594l345J0778J2481m135J6206j7829O861j7218n647k040
$$ -15810 -6867 -24794 -9200 -12545 -1767 10714 6579 22785 4956 11817 -5401 -11048 -13088
365a3088j0805J7263p334K3357J473R777N794j2523N448k4976K250j6182j00N274
$$ -13088 -23893 -6630 -13964 9393 10866 20643 26437 13914 19362 -5614 -3364 -19546 -19646 -14372
379a4372k498K1392n677J7739p641l38m276j7282N195j6584J4011j174J4497J4564
$$ -14372 -16870 4522 -1155 16584 8943 8605 4329 -12953 -7758 -24342 -10331 -11505 2992 17556
393A7556Q73J6631j4956K413k1477j1461j0423j6058J1164o010K3409O520J7046
$$ 17556 18429 35060 20104 22517 1040 -10421 -20844 -36902 -25738 -31748 -8339 -1819 15227
406A5227J1403n613P556k1407l98j8482k670J817k016K0023j502J8953n919j59
$$ 15227 26630 21017 28573 7166 6768 -11714 -14384 -12567 -14583 5440 3938 22891 16972 16813
420A6813q334k1201l667k2377O561l348J5883J9375J2516K6302j127J1298j6184
$$ 16813 8479 -12722 -16389 -38766 -32205 -35553 -19670 -295 12221 38523 37396 48694 32510
433C2510j1399j6376k4031l231j6198J2479L99J5508J4559L063J3133j1350M830
$$ 32510 21111 4735 -19296 -22527 -38725 -26246 -25847 -10339 4220 7283 20416 9066 13896
446A3896j5141k333j493m372J4334j969J7862l440K652m931j7411n986k2732Q55
$$ 13896 -1245 -3578 -5071 -9443 4891 2922 20784 17344 19996 15065 -2346 -8332 -31064 -30209
460c0209r865R238J3566J1151K4871M672J7439o915l076r987j8533m755j7897
$$ -30209 -40074 -30836 -17270 -6119 18752 23424 40863 33948 30872 20885 2352 -2403 -20300
473b0300O053n770Q479P430M24R053j0526M728j3082j704l21j289J4861K514K1524
$$ -20300 -14247 -20017 -11538 -4108 -3684 5369 -5157 -429 -13511 -15215 -15536 -16825 -1964 550 22074
488B2074L347Q144j2j1986o439k4826n743j7410j564L643N155J8797M915K0070
$$ 22074 25421 33565 33553 21567 15128 -9698 -15441 -32851 -34415 -30772 -25617 -6820 -1905 18165
502A8165k36L546l801j1410k438j5697N351n878O807O838L194J0886o516O670
$$ 18165 17929 21475 17674 6264 3826 -11871 -6520 -12398 -5591 1247 4441 15327 8811 15481
516A5481j0635l692o478p791L364p502J0698j888O950L008r97N520r560O120o321
$$ 15481 4846 1154 -5324 -13115 -9751 -17253 -6555 -8443 -1493 1515 518 6038 -3522 2598 -3723
531c723L333J859J294J0611l941J0173m757j51o178q969j776j4884K048p554K823
$$ -3723 -390 1469 2763 13374 9433 19606 14849 14698 8520 -449 -2225 -17109 -15061 -22615 -19792
546a9792J828K210J1545j445J2377N9O660J954m41O241p891M678p833j442p560
$$ -19792 -17964 -15754 -4209 -5654 6723 6782 13442 15396 14955 21196 13305 17983 10150 8708 1148
561A148q772j395j3256K048o411M817L338N374J4070K292J3576J701P105j225
$$ 1148 -7624 -9019 -22275 -20227 -26638 -21821 -18483 -13109 961 3253 16829 18530 25635 24410
575B4410m279J049j2588j326j1348l250p825o934K407o486P024L83J0405O060
$$ 24410 20131 21180 8592 7266 -4082 -7332 -15157 -22091 -19684 -26170 -19146 -18763 -8358 -2298
589b298O615J2120o69P475m784J231o938p865r20j0359Q10o289L024j846q64N116
$$ -2298 4317 16437 15768 23243 18459 19690 12752 4887 3967 -6392 -5582 -11871 -8847 -10693 -11557 -6441
605f441l827N636k699O013J408J448P823j299P123l743K600m838p070j808j0841
$$ -6441 -10268 -4632 -7331 -1318 90 1538 9361 8062 15185 11442 14042 9204 2134 326 -10515
620a0515l54p500M487J553L159R771J946Q765k440M099l142n632j97p104K041
$$ -10515 -10869 -18369 -13882 -12329 -9170 601 2547 11312 8872 12971 9829 4197 4000 -3104 -1063
635a063m952M907P11j76M562l848K847p169J478l478k482M173r26P201j165O783
$$ -1063 -6015 -1108 -397 -573 3989 141 2988 -4181 -2703 -6181 -8663 -4490 -5416 1785 620 7403
651G403J84k097M86o080M39o923K376l02R85O129J39O632l936J907l751n247j837
$$ 7403 7587 5490 5976 -104 335 -6588 -4212 -4514 -3529 2600 2739 9371 5435 7342 3591 -1656 -3493
668c493n754K984m055N606K817K310N350j169M053n286P50l315l476M48l148M499
$$ -3493 -9247 -6263 -10318 -4712 -1895 415 5765 4596 8649 3363 4113 798 -2678 -2230 -5378 -879
684h79k669M578M88k66J348l393K606n526J798n14J5L143j225N699k613K925j588
$$ -879 -3548 1030 1518 1252 2600 -793 1813 -3713 -1915 -2429 -2414 729 -496 5203 2590 5515 3927
701C927j793o73m529K049m673K427j19R95K906j410M380l238K028j830r31O11
$$ 3927 2134 1461 -3068 -1019 -5692 -3265 -3384 -2389 517 -893 3487 249 2277 447 -484 127
717A27k920L577l301K688o17N33J346k698L778l036K082o70J37J596k978L502
$$ 127 -2793 784 -2517 171 -446 87 1433 -1265 2513 -523 1559 889 1026 2622 -356 3146
733C146l423J885j436n45J242l525K798l605J458j644m96J454j413L977j023M174
$$ 3146 -277 1608 172 -373 869 -2656 142 -3463 -2005 -3649 -4145 -2691 -4104 -127 -1150 3024
749C024M97J620J513l073J225n186l89l356q80P54r02M934q5N042L29O53j55m408
$$ 3024 3521 5141 6654 3581 4806 -380 -769 -4125 -5005 -4251 -5153 -219 -304 4738 5067 5720 5565 1157
767A157o20n557m06k364R16L457Q66N792J40L630j528j020j701n470m3l496K209
$$ 1157 537 -5020 -5426 -7790 -6874 -3417 -2551 3241 3381 7011 5483 4463 2762 -2708 -2751 -6247 -4038
784d038K66K819L493P74L374k647q6l957k951j517k766K531m07N124J831L098
$$ -4038 -3772 -953 2540 3314 6688 4041 3955 -2 -2953 -4470 -7236 -4705 -5112 12 1843 4941
800D941K068j799P59m962n08l939q58N60n05L843n55L262p71o26j151l498O07
$$ 4941 7009 5210 5969 1007 499 -3440 -4298 -3738 -4243 -400 -955 2307 1536 910 -241 -3739 -3132
817c132k440K611R00L511L775Q78L233k352l94m547l189k664l348K212p59M467
$$ -3132 -5572 -2961 -2061 1450 5225 6103 9336 6984 6590 2043 -1146 -3810 -7158 -4946 -5705 -1238
833a238J737K858J796j884q2m886j496l612m50R79J415N655J805M850Q91P25j328
$$ -1238 499 3357 5153 3269 3187 -1699 -3195 -6807 -7257 -6278 -4863 792 2597 7447 8338 9063 7735
850G735m367k283n174o19k292P17K727J886M040P8K379j660j093j880k892K57
$$ 7735 3368 1085 -4089 -4708 -7000 -6283 -3556 -1670 2370 2448 4827 3167 2074 194 -2698 -2441
866b441k196K354K06K622K090L45J527k252M10k686j444m90j782J530j246K517
$$ -2441 -4637 -2283 -2077 545 2635 2980 4507 2255 2665 -21 -1465 -1955 -3737 -2207 -3453 -936
882i36p04J199L89m45J308j221K197o64J150R13o38J471k158Q6k435j101j279
$$ -936 -1640 -441 -52 -497 811 -410 1787 1123 2273 3186 2548 4019 1861 1947 -488 -1589 -2868
899b868j446Q40j406K436M5J636J278J30J507j529J617q61O26j25n2J027k192
$$ -2868 -4314 -3474 -4880 -2444 -2399 -763 515 645 2152 623 2240 1379 2005 1880 1828 2855 663
916F63P62k239r58j252j319R04j139L099J050K248J498R11J485j896O8k126m34
$$ 663 1425 -814 -1772 -3024 -4343 -3439 -4578 -1479 -429 1819 3317 4228 5713 3817 3885 1759 1325
933A325j425j192J00k012L12r57m59j226l75J275L51L361K210M166K520J988K058
$$ 1325 -100 -1292 -1192 -3204 -2892 -3849 -4308 -5534 -5909 -4634 -4283 -922 1288 5454 7974 9962 12020
950A2020k057j513m700l665m741l686j229j320K241J962L896K185K194K781j014
$$ 12020 9963 8450 3750 85 -4656 -8342 -9571 -10891 -8650 -6688 -2792 -607 1587 4368 3354
965C354P18j463K23j03j66J598p18J64j411j361l480l291j672k328R77J406M262
$$ 3354 4072 2609 2832 2729 2563 4161 3443 3607 2196 835 -2645 -5936 -7608 -9936 -8959 -7553 -3291
982c291M058L909M472Q98O16k512k760m723m190j679j796J166J142L276J531L54
$$ -3291 767 4676 9148 10046 10662 8150 5390 667 -3523 -5202 -6998 -5832 -4690 -1414 117 471
998D71J221j628j417k450k5P8R98L674K819L368R45P86k456l913l581m690k371
$$ 471 1692 64 -1353 -3803 -3828 -3750 -2752 922 3741 7109 8054 8840 6384 2471 -1110 -5800 -8171
1015h171k083J804K654L377M775L035K804j160J72l160l523k584k282J72l29K593
$$ -8171 -10254 -8450 -5796 -2419 2356 5391 8195 7035 7207 4047 524 -2060 -4342 -4170 -4499 -1906
1031a906K099J618J439k43o91k892j557j638q35j7J047K614J213K492J096m64
$$ -1906 193 1811 3250 3007 2316 -576 -2133 -3771 -4606 -4623 -3576 -962 251 2743 3839 3375
1047C375k46j194m92j464P06Q91R53J197J44p2k887k219l041k894k224l22K149
$$ 3375 3129 1935 1443 -21 685 1576 2529 3726 3870 3798 911 -1308 -4349 -7243 -9467 -9789 -7640
1064g640J660M211M377L420K070L16k8l265k005k342j840r72J00J601O4R16l75
$$ -7640 -5980 -1769 2608 6028 8098 8414 8386 5121 3116 774 -1066 -2038 -1938 -337 -273 643 268
1081B68o70k185k640q56j930K83K269K909L739L945M432J752N91j516k718m056
$$ 268 -402 -2587 -5227 -6083 -8013 -7730 -5461 -2552 1187 5132 9564 11316 11907 10391 7673 3617
1097C617n083k992l986j444j1J339K285K214L568J598J514O18k7k39j246Q16q82
$$ 3617 -1466 -4458 -8444 -9888 -9899 -8560 -6275 -4061 -493 1105 2619 3237 3210 2971 1725 2541 1659
1114A659K75K38O98j92o63M18j036q41j514o2j065j635M04r61j71m94J004J062
$$ 1659 1934 2172 2870 2678 2015 2433 1397 556 -958 -1020 -2085 -3720 -3316 -4277 -4448 -4942 -3938 -2876
1132b876Q19K385J497K129N32J205j11j330p03j754j670j805n15j24n28J280N01
$$ -2876 -2057 328 1825 3954 4486 5691 5580 4250 3547 1793 123 -1682 -2197 -2321 -2849 -1569 -1068
1149a068N89r3N53j45j502k63r81J18p31J439J548J058K317J678J629l6k74o00
$$ -1068 -479 -572 -19 -164 -1666 -1929 -2910 -2792 -3523 -2084 -536 522 2839 4517 6146 6110 5836 5236
1167E236k726k459k387k245k202o5R78P04K207J949K878P62J136K41q07j030j250
$$ 5236 2510 51 -2336 -4581 -6783 -6848 -5870 -5166 -2959 -1010 1868 2630 3766 4007 3200 2170 920
1184I20q83j223L15Q09Q82J005Q70R87p26n06j518k221k415k306j065j030O72
$$ 920 37 -1186 -871 -62 820 1825 2695 3682 2956 2450 932 -1289 -3704 -6010 -7075 -8105 -7433
1201g433J871K369K938L018K977J402Q03j98j360j962k265j811k018j274l29Q7
$$ -7433 -5562 -3193 -255 2763 5740 7142 7945 7747 6387 4425 2160 349 -1669 -2943 -3272 -3185
1217c185j41L48J658j4J58nq7k11k64L44j97R79Q50J438J327M70J616l54l12r25
$$ -3185 -3326 -2978 -1320 -1334 -1176 -1181 -1268 -1479 -1743 -1399 -1596 -617 233 1671 2998 3468 5084 4730 4418 3493
1237C493j571j960k101j340j670l13L40J130J473K021K357J285O68j59k41j235
$$ 3493 1922 -38 -2139 -3479 -5149 -5462 -5122 -3992 -2519 -498 1859 3144 3812 3653 3412 2177
1253B177k136q73j370k76L01J069J496J184J242M44or88j788j624j853j142q41
$$ 2177 41 -832 -2202 -2478 -2177 -1108 388 1572 2814 3258 3252 2264 476 -1148 -3001 -4143 -4984
1270d984K26O27J209K007J522J684R38J111P4k02n19j260o45j400j111o97p28
$$ -4984 -4758 -4131 -2922 -915 607 2291 3229 4340 4414 4212 3693 2433 1788 388 -723 -1420 -2148
1287b148J37n59N72j11P53m7r9Q14n41J98k94L11Q5P11J376R89J345J135J008
$$ -2148 -2011 -2570 -1998 -2109 -1356 -1403 -1502 -688 -1229 -1031 -1325 -1014 -929 -218 1158 2147 3492 4627 5635
1306E635m32q65j502k627k030k639r32q15M32J289K020K369J668J587L04p1q14
$$ 5635 5203 4338 2836 209 -1821 -4460 -5392 -6207 -5775 -4486 -2466 -97 1571 3158 3462 3391 2577
1323B577j476j349j019n6p4R59J465P74Q84j76j0j576j442j510j313o23l38J172
$$ 2577 1101 -248 -1267 -1323 -1397 -438 1027 1801 2685 2509 2499 923 -519 -2029 -3342 -3965 -4303 -3131
1341c131R88J748J315J453N81M3j14p93p35o80m75m5l30K8m58j68l39n26m11j58
$$ -3131 -2143 -395 920 2373 2954 2997 2883 2090 1355 675 200 155 -175 -147 -605 -773 -1112 -1638 -2049 -2207
1361b207M88J81P32J092L85O63o8J0m35l92m09k04N28L22R37M07J87R3p27j295
$$ -2207 -1719 -1538 -806 286 671 1334 1266 1276 841 449 40 -164 364 686 1623 2030 2217 2310 1583 288
1381B88j547j296j116k63J43Q90J551J993J306O68M71n21j147j028j413p44m02
$$ 288 -1259 -2555 -3671 -3934 -3791 -2901 -1350 643 1949 2617 3088 2567 1420 392 -1021 -1765 -2167
1398b167K00J056J430R92O81O00m62p98j384j039q00p45N84K21J048J067L31O67
$$ -2167 -1967 -911 519 1511 2192 2792 2330 1532 148 -891 -1691 -2436 -1852 -1631 -583 484 815 1482
1416A482m29k36q11p94l64l63Q33L9J053O98M14mm23k61j183j73n68l31K21M46
$$ 1482 1053 817 6 -788 -1152 -1515 -682 -643 410 1108 1522 1518 1095 834 -349 -522 -1090 -1421 -1200 -754
1436g54R70O3O01p1K04n99m45jo72M72N35L18M06K35J51q84p48o11q56o02k46
$$ -754 216 279 880 809 1013 414 -31 -32 -704 -232 303 621 1027 1262 1413 529 -219 -830 -1686 -2288 -2534
1457b534M10M45J130P52J159J35M28N6p66o31r67J32k57L1N38J04K99j79J5p19
$$ -2534 -2124 -1679 -549 203 1362 1497 1925 1981 1215 584 -383 -251 -508 -477 61 165 464 285 300 -419
1477d19j04l48k54K64L11O75K32K05N13j99n23n23k61p15J46o3J31P55K29Q87
$$ -419 -523 -871 -1125 -861 -550 125 357 562 1075 876 353 -170 -431 -1146 -1000 -1063 -932 -177 52 939
1497I39J60k78J53m20j73n79K52j03q0K88M92K43m12N54o34q24k64o32o66m06
$$ 939 1099 821 974 554 381 -198 54 -49 -129 159 651 894 482 1036 402 -422 -686 -1318 -1984 -2390
1517b390P24K10P88J020N74O87l36K03j43q14k51m17J37o40N02L91l11K16K36
$$ -2390 -1666 -1456 -668 352 926 1613 1277 1480 1337 523 272 -145 -8 -648 -146 245 -66 150 386
1536C86j27n84K0j79n99R9K43J20l02R30K08K09K26O69K68n21J06j65q85q55j94
$$ 386 259 -325 -305 -484 -1083 -984 -741 -621 -923 7 215 424 650 1319 1587 1066 1172 1007 122 -733 -927
1557i27k6j154N08K17J15O11M81N46K27M92N04r5m99J78j03q52j31j36k68kj09
$$ -927 -953 -2107 -1599 -1382 -1267 -656 -175 371 598 1090 1594 1499 1000 1178 1075 223 92 -44 -312 -314 -423
1578d23M51m39K33l49P5m05o34l4l00L25N37P99M54R68Q84K11K06k51o01q93q42
$$ -423 28 -411 -178 -527 -452 -857 -1491 -1525 -1825 -1500 -963 -164 290 1258 2142 2353 2559 2308 1707 814 -28
1599b8l3r34k42n2N8L29J80N91J21J50J96l79j15k49Ol03P8L03P96L1M01O97K21
$$ -28 -61 -995 -1237 -1289 -1231 -902 -722 -131 -10 140 336 -43 -158 -407 -401 -704 -626 -323 473 504 905 1602 1823
1622A823n16r4n42r12n86l38p3n75J08O00M13M80P00J58L53P4J7J16n54k26j13
$$ 1823 1307 1213 671 -241 -827 -1165 -1238 -1813 -1705 -1105 -692 -212 488 646 999 1073 1090 1206 652 426 313
1643C13p84Kj09R8k90O77j61K05M9k27N7m71k57R0J0J23M68M61J33J199Q9L77
$$ 313 -471 -469 -578 -480 -770 -93 -254 -49 0 -227 -170 -641 -898 -808 -798 -675 -207 254 387 1586 1675 2052
1665B052j78r9o01r33o58l68n40m52K03P7N47J61N82M04O1K08Q5m16K36o63J38
$$ 2052 1874 1775 1174 241 -417 -785 -1325 -1777 -1574 -1497 -950 -789 -207 197 258 466 551 135 371 -292 -154
1686a54j90K99N05J00K58p2M93m65m08j63n05k89m32L24m54L10O93K06J86J9K97
$$ -154 -344 -45 460 560 818 746 1239 774 366 203 -302 -591 -1023 -699 -1153 -843 -150 56 242 261 558
1707E58k14k63o3j6k18q1K67L4k54K93J52j66L9K03J91m82L32l97k58l68J63k76
$$ 558 344 81 18 2 -216 -297 -30 4 -250 43 195 29 68 271 462 -20 312 -85 -343 -711 -548 -824
1729h24L96K92R6M23%M35L41l36k32k00l50k68n26j19j73o5K12J35K72M12J16
$$ -824 -428 -136 -40 383 383 818 1159 823 591 391 41 -227 -753 -872 -1045 -1110 -898 -763 -491 -79 37
1750C7L91J40m0J09J7k43j8j8kJ03j81k60L15Pl97n9l77J9j72K54m05L53Q0K96
$$ 37 428 568 528 637 654 411 393 375 373 476 295 35 350 357 -40 -99 -476 -457 -629 -375 -780 -427 -347 -51
1774e1K5j24O67k90J62k89J40j53m38J47QJ00l21K19M64r6J48P8J31l28J45J74
$$ -51 -26 -150 517 227 389 100 240 87 -351 -204 -196 -96 -417 -198 266 170 318 396 527 199 344 518
1796E18j39j37k78k82J87l39K17n0r5K26n3K37j53L8O8J09j66Q3J26J48j94q3
$$ 518 379 242 -36 -318 -131 -470 -253 -303 -398 -172 -225 12 -141 -103 -35 74 -92 -9 117 265 71 -12
1818a2J50j94K84l96K73k16J18J34jK5N7J62K44l86j71j28J07l6m53L24l60J71
$$ -12 138 -56 228 -168 105 -111 7 141 140 165 222 384 628 242 71 -57 50 14 -439 -115 -475 -304
1840c04j59Q2O7N9J03K1K53K5Q1K5N6J33M02j74j34m84j54l55mk79J27j24P7L20
$$ -304 -463 -381 -314 -255 -152 -131 122 147 228 253 309 442 844 670 536 52 -102 -457 -461 -740 -613 -737 -660 -340
1864c40J05P80J10L26k21o4k93j28l02k97l5o33M56l63J63K13J9L62M73k04J13
$$ -340 -235 545 655 981 760 696 403 275 -27 -324 -359 -992 -536 -899 -736 -523 -504 -142 331 127 240
1885B40K82K58r8K59j28ll12K71n45m57k30k26j19j95K22J05P7K55N8N33K3J80
$$ 240 522 780 682 941 813 810 498 769 224 -233 -463 -689 -808 -1003 -781 -676 -599 -344 -286 247 270 450
1907D50Q3j09K29k55J4l7j01l00j37L5m02N9K79m54N45O5P3J23L95j21P3m54N4
$$ 450 533 424 653 398 412 375 274 -26 -163 -128 -530 -471 -192 -646 -101 -36 37 160 555 434 507 53 107
1930A07k25n37J76K94j58l7P49K9J20k31L8j18m99p2l36k07l0J50K64K02N14K55
$$ 107 -118 -655 -479 -185 -343 -380 369 398 518 287 325 207 -292 -364 -700 -907 -937 -787 -523 -321 193 448
1952D48J40J21K95k91J32m73L32o24j40l79K26k34l2m1j89M0Mk9K5L54J27J62
$$ 448 588 709 1004 713 845 372 704 80 -60 -439 -213 -447 -479 -520 -709 -669 -665 -694 -669 -315 -188 -26
1974b6M37L37J24Q6j6j29l57m77K7k93k77j33K72j20M4Q6K03K73J32M22j47P5
$$ -26 411 748 872 958 942 813 456 -21 6 -287 -564 -697 -425 -545 -501 -415 -212 61 193 615 468 543
1996E43J9q1n1n32k50k63k68j01K18J87M50L77M8R2r2K91J54n37Q9J13k32l42
$$ 543 562 481 430 -102 -352 -615 -883 -984 -766 -579 -129 248 296 388 296 587 741 204 293 406 174 -168
2018a68J02P6n29J27m0L00O4J47R1k83L23J2k12j42J10Q5J07j33J05j01k24J5
$$ -168 -66 10 -519 -392 -432 -132 -68 79 170 -113 210 222 10 -132 -22 63 170 37 142 41 -183 -168
2040a68O5l48Q5k7K75j56l5N90N5J00L02n5k7j98r6j70m11K57N0p79l0K67Lk62
$$ -168 -103 -451 -366 -393 -118 -274 -309 281 336 436 738 683 656 458 362 192 -219 38 88 -691 -721 -454 -451 -713
2064g13M44Q8l18L74J94j99J54J15O8K1L65J47k14p5K6l09m55l09K11l23Q0J10
$$ -713 -269 -181 -499 -125 69 -130 24 139 207 228 593 740 526 451 477 168 -287 -596 -385 -708 -628 -518
2086e18L91J17j9N38o1K8j32N1j68j26L04k51n89o7M2m39m6J85p3K64M28N42L35
$$ -518 -127 -10 -29 509 448 476 344 395 227 101 405 154 -435 -502 -460 -899 -945 -760 -833 -569 -141 401 736
2109G36K61K44J21k72j58j48o20n21J3o05l36J7Q6L57L75K29M46M47K80M87k60
$$ 736 997 1241 1362 1090 932 784 164 -357 -344 -949 -1285 -1268 -1182 -825 -450 -221 225 672 952 1439 1179
2130A179j48n24K84l15n26l13j47p04j76l1J27K84N07O08J53N26L21L34j30q0
$$ 1179 1031 507 791 476 -50 -363 -510 -1214 -1390 -1421 -1294 -1010 -503 105 258 784 1105 1439 1309 1229
2150A229l58l91n14r4k88l58r2P2j53J94L17J5k3K01M34N4K07K58J44q6p5p9l89
$$ 1229 871 480 -34 -128 -416 -774 -866 -794 -947 -753 -436 -421 -444 -243 191 245 452 710 854 768 693 614 225
2173B25k24k82m53J5j50K92J52N58L83O31k46J29Lr4o70l27n38m23n2k11J12J77
$$ 225 1 -281 -734 -719 -869 -577 -425 133 516 1147 901 1030 1033 939 269 -58 -596 -1019 -1071 -1282 -1170 -993
2195i93N14M68M04J24M49n9k17k93J8l56m49R5nk60J31J8L81o5O0L81j58k01K79
$$ -993 -479 -11 393 517 966 907 690 397 415 59 -390 -295 -300 -560 -429 -411 -30 -95 -35 346 188 -13 266
2218B66m3m20Ln9J55m32L03Q6J33lrJ26j1J7j38L57m13K65k57K3K36K0j07k83
$$ 266 223 -197 -194 -253 -98 -530 -227 -141 -8 -11 -20 106 95 112 -26 331 -82 183 -74 -51 185 205 98 -185
2242a85P0p5m23n2R6n9K92K81L61M29N88R7O1k80J00o28p09p66o35k73m50j6L77
$$ -185 -115 -190 -613 -665 -569 -628 -336 -55 306 735 1323 1420 1481 1201 1301 673 -36 -802 -1437 -1710 -2160 -2176 -1799
2265a799M78J053N41P27M90K97L06k68k38m08l06q54j63p68K20k55j18L90l01
$$ -1799 -1321 -268 273 1000 1490 1787 2093 1825 1587 1179 873 19 -144 -912 -692 -947 -1065 -675 -976
2284i76K88l2K4J36L15M5L25L41Q2J64M89J07J22k68m44j81q29k29k85m29l8K1
$$ -976 -688 -720 -696 -560 -245 -200 125 466 548 712 1201 1308 1430 1162 718 537 -292 -521 -806 -1235 -1273 -1252
2306a252K12J69N47M49O12L49O9p7J52o74j71m77k02j98j50r6J99J88N68K10J8
$$ -1252 -1040 -871 -324 125 737 1086 1155 1078 1230 556 385 -92 -294 -492 -642 -738 -539 -351 217 427 445
2327D45J12k58n77l87j44k21k15L32O09L09J39M81L51K41L9m00j70o02m0k89k10
$$ 445 557 299 -278 -665 -809 -1030 -1245 -913 -304 5 144 625 976 1217 1256 856 686 84 44 -245 -455
2348d55L02J26R2J90P8k6j41k22n57k65j69r7J22J85L92R58N61K59k3L96o4l32
$$ -455 -153 -27 65 255 333 307 166 -56 -613 -878 -1047 -1144 -1022 -837 -445 513 1074 1333 1310 1706 1642 1310
2370A310k22l79q52k89n50m19kj02o3L60M41M08O63M10K63J13m0P5m54R9j67n20
$$ 1310 1088 709 -143 -432 -982 -1401 -1403 -1505 -1568 -1208 -767 -359 304 714 977 1090 1050 1125 671 770 603 83
2392H3k76J46j60K27r6j51l30J50l69l84O1J15Q0M18P79L30M84N16L44l81k39
$$ 83 -193 -47 -207 20 -76 -227 -557 -407 -776 -1160 -1099 -984 -904 -486 293 623 1107 1623 1967 1586 1347
2413A347n58m66o59n69j76m05K94K84N26L39K15J35J71l82O4o0k86o2k16M59K25
$$ 1347 789 323 -336 -905 -1081 -1486 -1192 -908 -382 -43 172 307 478 96 160 100 -186 -248 -464 -5 220
2434B20M51ML34l23j23j72m44j91j40k75o8J02k38K03J54N67j90L32J56q6j4M3
$$ 220 671 675 1009 686 563 391 -53 -244 -384 -659 -727 -625 -863 -660 -506 61 -129 203 359 273 259 302
2456C02K14j93k3j12j38m66L67k42L50j03p6L88q9J79q1j52j75j82k48L6o0K11
$$ 302 516 323 300 188 50 -416 -49 -291 59 -44 -120 268 179 358 277 125 -50 -232 -480 -444 -504 -293
2478b93j43L84N84r0J41j33j00m42P0k92k76k3K47M75p3N7oq2k3l59L09k00L1
$$ -293 -436 -52 532 442 583 450 350 -92 -22 -314 -590 -613 -366 109 36 93 87 5 -18 -377 -68 -268 -237
2501b37j13L24L34L29J91J5j69k42P4p26m8j62n8l64J5kJ94J67O17K58P0J2L48
$$ -237 -350 -26 308 637 828 843 674 432 506 -220 -268 -430 -488 -852 -837 -839 -645 -478 139 397 467 479 827
2524H27k97j06m8n9k05j48J45j02m87L27k90K53L6K08M2J95L36P3j97p6j6m30
$$ 827 530 424 376 317 112 -36 109 7 -480 -153 -443 -190 -154 54 96 291 627 700 503 427 411 -19
2546a9l37k45L7k50J94L32J57J5L99K9o4k40M16r3j4j12j4J57n2j07O8o10k4J03
$$ -19 -356 -601 -564 -814 -620 -288 -131 -116 283 312 248 8 424 331 317 205 191 348 296 189 257 -353 -377 -274
2570b74j25J23J76L04p2J33j49K30j78j83J04n20j21K83k95J40L85J97P6K84J11
$$ -274 -399 -276 -100 204 132 265 116 346 168 -15 89 -431 -552 -269 -564 -424 -39 158 234 518 629
2591F29K53j82j72l40l41m11p8l7PJ02Q8J13K64j42J84K6R5O94K09j09L02j2m32
$$ 629 882 700 528 188 -153 -564 -642 -679 -672 -570 -482 -369 -105 -247 -63 -37 58 752 961 852 1154 1142 710
2614G10k90o20n91l64q09j65J00N26N69N39Q76P12O17j35K00j80j00o74m65m92
$$ 710 420 -200 -791 -1155 -1964 -2129 -2029 -1503 -934 -395 481 1193 1810 1675 1875 1695 1595 921 456 -36
2634c6j56p59p1m47K5j53L78M36K1O77M68O37N71K03K47o3q73o81n38q10l60m98
$$ -36 -192 -951 -1022 -1469 -1444 -1597 -1219 -783 -762 -85 383 1020 1591 1794 2041 1978 1105 424 -114 -924 -1284 -1782
2656a782l03L99M35P37N40M71M63J07N6J34k23j56m1k97N1j36n80R8j055l93j54
$$ -1782 -2085 -1686 -1251 -514 26 497 960 1067 1123 1257 1034 878 837 540 591 455 -125 -27 -1082 -1475 -1629
2677a629j94P0K82R29P12P65P37L54R0n73m54o20p64l80n13m7p2J90O35J34P09
$$ -1629 -1823 -1753 -1471 -542 170 935 1672 2026 2116 1543 1089 469 -295 -675 -1188 -1235 -1307 -1117 -482 -348 361
2698C61K4J14j6n5l83q2P5O4J98r7L55l71j61k32k60l34q2L95k65N44K33J62J50
$$ 361 385 499 483 428 45 -37 38 102 300 203 558 187 26 -206 -466 -800 -882 -487 -752 -208 25 187 337
2721C37K58l0j58m70j37k9l50L18K16N42J88K89m5m92j35m80m39j33jK09m6N55
$$ 337 595 565 407 -63 -200 -229 -579 -261 -45 497 685 974 929 437 302 -178 -617 -750 -751 -542 -588 -33
2743c3L2R7j08K9k70j73J12J91J57L86L79L86K79l93k14n47m55o24p45q7J99j9
$$ -33 -1 96 -12 17 -253 -426 -314 -123 34 420 799 1185 1464 1071 857 310 -145 -769 -1514 -1601 -1402 -1421
2765a421M73R03Q26L60K85P2m63l55n57K9m07L4l50L56nJ70j94l9l19P2K7k03
$$ -1421 -948 -45 781 1141 1426 1498 1035 680 123 152 -255 -221 -571 -215 -220 -50 -244 -283 -602 -530 -503 -706
2787g06L08J15N74K99O41k15j6l43k93mo07m26M9J52j03L36K77k28L48j89j06
$$ -706 -398 -283 291 590 1231 1016 1000 657 364 360 -247 -673 -624 -472 -575 -239 38 -190 158 -31 -137
2808a37l5J81M2k41J98J15J04J82P1k39j93l93k9p0O8R0L39O4K54M04j63Jj64
$$ -137 -172 9 51 -190 8 123 227 409 480 241 48 -345 -374 -444 -376 -286 53 117 371 775 612 613 449
2831D49n08j55l09p6J33K6L9K66N73k21J74r9rl18k86J36J81k8J72J18J87L7k25
$$ 449 -59 -214 -523 -599 -466 -440 -401 -135 438 217 391 292 283 -35 -321 -185 -4 -32 140 258 445 482 257
2854B57k2m2o71k9j00p7K41P5L69l5K11L87R8k73k02j56J34k14K9k49j11J83k99
$$ 257 235 193 -478 -507 -607 -684 -443 -368 1 -34 177 564 662 389 187 31 165 -49 -20 -269 -380 -197 -496
2877d96J80l1J30J04J22N6r6L48J29J51j12j53Q7j38M4k32j73k88J34l0J22M8
$$ -496 -316 -347 -217 -113 9 65 -31 317 446 597 485 332 419 281 325 93 -80 -368 -234 -264 -142 -94
2899i4J18k11o7L66O1k82J09j13J00J8P9K03j20R5o6J9k19m07K43q0J9J25J00
$$ -94 24 -187 -254 112 173 -109 0 -113 -13 5 84 287 167 262 196 215 -4 -411 -168 -248 -229 -104 -4
2922dM29l00L9K43o7l7p1l64j33L91k17J55l89K72l5N1J43k34O4o4K47l46J28
$$ -4 425 125 164 407 340 303 232 -132 -265 126 -91 64 -325 -53 -88 -37 106 -128 -64 -128 119 -227 -99
2945i9M6K44K79m48K56l7j43j74O9K48l62L47n46N15l10J32p1K84k55l7o6K29
$$ -99 -53 191 470 22 278 241 98 -76 -7 241 -121 226 -320 195 -115 17 -54 230 -25 -62 -128 101
2967A01r4L50j3n4j19k98q1J1j92l62L83j31L25O3N99L05j09LJ27m89O6l10l54
$$ 101 7 357 344 290 171 -127 -208 -197 -389 -751 -368 -499 -174 -111 488 793 684 687 814 325 391 81 -273
2990b73j78J55J22q0J41%L6q3J52J20k40J65K34O5K62K66j64k59j71o29j07p46
$$ -273 -451 -296 -174 -254 -113 -113 -77 -160 -8 112 -128 37 271 336 598 864 700 441 270 -359 -466 -1212
3012a212k84K47L36K47N15M68L82M95Q3j49j75m49on03k81j07J42r3l31Mn7J66
$$ -1212 -1496 -1249 -913 -666 -151 317 699 1194 1277 1128 953 504 498 -5 -286 -393 -251 -344 -675 -671 -728 -562
$$ [...]
8191i0
##END NTUPLES=NMR FID
##END=
