##TITLE=1H_Pr 5080-0
 CDCl3
 8 sc, 
 6.05.2022
##JCAMPDX= 6.0         $$ Bruker NMR JCAMP-DX V2.0
##DATA TYPE= NMR FID
##DATA CLASS= NTUPLES
##ORIGIN= UXNMR, Bruker Analytische Messtechnik GmbH
##OWNER= root
$$ XWIN-NMR		Version 3.5
$$ Fri May  6 14:26:59 2022 Russian Standard Time (UT+4h)  she@DPX200
##.OBSERVE FREQUENCY= 200.1313499996
##.OBSERVE NUCLEUS= ^1H
##.DELAY= (6, 6)
##.ACQUISITION MODE= SIMULTANEOUS
##.ACQUISITION SCHEME= undefined
##.AVERAGES= 8
##.DIGITISER RES= 18
##SPECTROMETER/DATA SYSTEM= spect
##.PULSE SEQUENCE= zg30
##.SOLVENT NAME= CDCl3
##.SHIFT REFERENCE= (INTERNAL, CDCl3, 0, 15.7039)
##AUDIT TRAIL= $$ (NUMBER, WHEN, WHO, WHERE, WHAT)
$$ ##TITLE= Audit trail, XWIN-NMR		Version 3.5
$$ ##JCAMPDX= 5.01
$$ ##ORIGIN= Bruker BioSpin GmbH
$$ ##OWNER= she
$$ F:/spectra/data/she/nmr/H-F/1/audita.txt
$$ ##AUDIT TRAIL=  $$ (NUMBER, WHEN, WHO, WHERE, WHAT)
(   1,<2022-05-06 14:25:41.14 +0400>,<she>,<DPX200>,
      <created by zg, POWCHK disabled, PULCHK disabled
       configuration hash MD5:
       00 E9 B6 7A A2 85 ED C7 34 08 36 98 17 FE 4E 26
       data hash MD5: 16K
       88 07 06 37 D3 04 66 4B 63 56 28 66 99 B8 D5 AA>)
$$ ##END=
$$ 
$$ hash MD5
$$ 33 46 A0 5D D4 6E FE BC 4C 2C E3 73 DF 49 B7 7A
##$RELAX= 
##$RELAX= 
##$RELAX= 
##$RELAX= 
##$RELAX= 
##$RELAX= 
$$ Bruker specific parameters
$$ --------------------------
##$DU= <F:/spectra>
##$EXPNO= 1
##$NAME= <H-F>
##$PROCNO= 1
##$TYPE= <nmr>
##$USER= <she>
##$AMP= (0..31)
100 100 100 100 100 100 100 100 100 100 100 100 100 100 100 100 100 100 
100 100 100 100 100 100 100 100 100 100 100 100 100 100 
##$AQSEQ= 0
##$AQ_mod= 1
##$AUNM= <au_zg>
##$AUTOPOS= <>
##$BF1= 200.13
##$BF2= 200.13
##$BF3= 200.13
##$BF4= 200.13
##$BF5= 200.13
##$BF6= 200.13
##$BF7= 200.13
##$BF8= 200.13
##$BYTORDA= 1
##$CFDGTYP= 0
##$CFRGTYP= 5
##$CHEMSTR= <none>
##$CNST= (0..31)
1 1 145 1 1 1 1 1 1 1 1 1 1 1 1 1 1 1 1 1 1 1 1 1 1 1 1 1 1 1 1 1 
##$CPDPRG= <>
##$CPDPRG1= <>
##$CPDPRG2= <>
##$CPDPRG3= <>
##$CPDPRG4= <mlev>
##$CPDPRG5= <mlev>
##$CPDPRG6= <mlev>
##$CPDPRG7= <mlev>
##$CPDPRG8= <mlev>
##$CPDPRGB= <>
##$CPDPRGT= <>
##$D= (0..31)
0 1.2 0 0 0 0 0 0 0 0.06 0 0.03 0 0 0 0 0.0002 0 0 0 0 0 0 0 0 0 0 0 0 
0 0 0 
##$DATE= 1651832740
##$DBL= (0..7)
120 120 120 120 120 120 120 120 
##$DBP= (0..7)
150 150 150 150 150 150 150 150 
##$DBP07= 0
##$DBPNAM0= <>
##$DBPNAM1= <>
##$DBPNAM2= <>
##$DBPNAM3= <>
##$DBPNAM4= <>
##$DBPNAM5= <>
##$DBPNAM6= <>
##$DBPNAM7= <>
##$DBPOAL= (0..7)
0.5 0.5 0.5 0.5 0.5 0.5 0.5 0.5 
##$DBPOFFS= (0..7)
0 0 0 0 0 0 0 0 
##$DE= 6
##$DECBNUC= <off>
##$DECIM= 32
##$DECNUC= <off>
##$DECSTAT= 4
##$DIGMOD= 1
##$DIGTYP= 9
##$DL= (0..7)
0 120 120 120 120 120 120 120 
##$DP= (0..7)
150 150 150 150 150 150 150 150 
##$DP07= 0
##$DPNAME0= <>
##$DPNAME1= <>
##$DPNAME2= <>
##$DPNAME3= <>
##$DPNAME4= <>
##$DPNAME5= <>
##$DPNAME6= <>
##$DPNAME7= <>
##$DPOAL= (0..7)
0.5 0.5 0.5 0.5 0.5 0.5 0.5 0.5 
##$DPOFFS= (0..7)
0 0 0 0 0 0 0 0 
##$DQDMODE= 0
##$DR= 18
##$DS= 0
##$DSLIST= <SSSSSSSSSSSSSSS>
$$ [...]
##$SUBNAM2= <"">
##$SUBNAM3= <"">
##$SUBNAM4= <"">
##$SUBNAM5= <"">
##$SUBNAM6= <"">
##$SUBNAM7= <"">
##$SUBNAM8= <"">
##$SUBNAM9= <"">
##$SW= 18.0517283424761
##$SWIBOX= (0..15)
0 0 2 0 0 0 0 0 0 0 0 0 0 0 0 0 
##$SW_h= 3612.71676300578
##$TD= 16384
##$TD0= 1
##$TE= 0
##$TE2= 300
##$TE3= 300
##$TEG= 300
##$TL= (0..7)
0 120 120 120 120 120 120 120 
##$TP= (0..7)
150 150 150 150 150 150 150 150 
##$TP07= 0
##$TPNAME0= <>
##$TPNAME1= <>
##$TPNAME2= <>
##$TPNAME3= <>
##$TPNAME4= <>
##$TPNAME5= <>
##$TPNAME6= <>
##$TPNAME7= <>
##$TPOAL= (0..7)
0.5 0.5 0.5 0.5 0.5 0.5 0.5 0.5 
##$TPOFFS= (0..7)
0 0 0 0 0 0 0 0 
##$TUNHIN= 0
##$TUNHOUT= 0
##$TUNXOUT= 0
##$USERA1= <user>
##$USERA2= <user>
##$USERA3= <user>
##$USERA4= <user>
##$USERA5= <user>
##$V9= 5
##$VALIST= <valist>
##$VCLIST= <CCCCCCCCCCCCCCC>
##$VD= 0
##$VDLIST= <DDDDDDDDDDDDDDD>
##$VPLIST= <PPPPPPPPPPPPPPP>
##$VTLIST= <TTTTTTTTTTTTTTT>
##$WBST= 1024
##$WBSW= 4
##$XGAIN= (0..3)
0 0 0 0 
##$XL= 0
##$YL= 0
##$YMAX_a= 171235
##$YMIN_a= -105132
##$ZGOPTNS= <>
##$ZL1= 120
##$ZL2= 120
##$ZL3= 120
##$ZL4= 120
##$ABSF1= 10
##$ABSF2= 0
##$ABSG= 5
##$ABSL= 3
##$ALPHA= 0
##$AQORDER= 0
##$ASSFAC= 0
##$ASSFACI= 0
##$ASSFACX= 0
##$ASSWID= 0
##$AUNMP= <proc_1d>
##$AZFE= 0.1
##$AZFW= 0.1
##$BCFW= 1
##$BC_mod= 2
##$BYTORDP= 1
##$COROFFS= 0
##$CY= 11.3945322036743
##$DATMOD= 1
##$DC= 2
##$DFILT= <>
##$DTYPP= 0
##$F1P= 2.36226072786647
##$F2P= -0.459571619588291
##$FCOR= 0.5
##$FTSIZE= 0
##$FT_mod= 4
##$GAMMA= 1
##$GB= 0.15
##$INTBC= 1
##$INTSCL= 1
##$ISEN= 128
##$LB= 0.24
##$LEV0= 0
##$LPBIN= 0
##$MAXI= 10000
##$MC2= 0
##$MEAN= 0
##$ME_mod= 0
##$MI= 1.114404
##$NCOEF= 0
##$NC_proc= 0
##$NLEV= 6
##$NOISF1= 3.799351
##$NOISF2= 2.8
##$NSP= 1
##$NTH_PI= 0
##$NZP= 0
##$OFFSET= 15.70392
##$PC= 1
##$PHC0= -18032.24
##$PHC1= 11.80075
##$PH_mod= 1
##$PKNL= yes
##$PPARMOD= 0
##$PSCAL= 0
##$PSIGN= 0
##$REVERSE= no
##$SF= 200.130013532006
##$SI= 16384
##$SIGF1= 3
##$SIGF2= 2
##$SINO= 400
##$SIOLD= 16384
##$SREGLST= <1H.CDCl3>
##$SSB= 0
##$STSI= 0
##$STSR= 0
##$SW_p= 3612.71676300578
##$SYMM= 0
##$S_DEV= 0
##$TDeff= 0
##$TDoff= 0
##$TI= <>
##$TILT= no
##$TM1= 0
##$TM2= 0
##$TOPLEV= 0
##$USERP1= <user>
##$USERP2= <user>
##$USERP3= <user>
##$USERP4= <user>
##$USERP5= <user>
##$WDW= 1
##$XDIM= 8192
##$YMAX_p= 0
##$YMIN_p= 0
$$ End of Bruker specific parameters
$$ ---------------------------------
##NTUPLES= NMR FID
##VAR_NAME=  TIME,          FID/REAL,        FID/IMAG
##SYMBOL=    X,             R,               I
##VAR_TYPE=  INDEPENDENT,   DEPENDENT,       DEPENDENT
##VAR_FORM=  AFFN,          ASDF,            ASDF
##VAR_DIM=   8192,          8192,            8192
##UNITS=     SECONDS,       ARBITRARY UNITS, ARBITRARY UNITS
##FACTOR=    0.0002768,     1,               1
##FIRST=     0,             0,               0
##LAST=      2.2672688,     0,               0
##MIN=       0,             -105132,         0
##MAX=       2.2672688,     171235,          0
$$ Real data points
##PAGE= N=1
##DATA TABLE= (X++(R..R)), XYDATA
$$ plain form
0 0 0 0 0 0 0 0 0 0 0 0 0 0 0 8 -8 8 -8 8 -15 16 -16 23 -24 31 -37 40 -47 55 -63 74 -85 97 -110 124 -140
35 -140 159 -178 198 -222 247 -275 306 -338 376 -415 458 -505 560 -615 677 -746 822 -905 1000
54 1000 -1105 1222 -1361 1515 -1696 1910 -2168 2484 -2885 3412 -4136 5200 -6916 10167 -18540
69 -18540 92883 171235 97142 139653 78270 -10003 -22453 -27726 -105132 -90124 -44720 -67313
81 -67313 -61961 7582 -6689 -26994 14935 8241 -37331 -10217 405 -31490 -7681 31967 11694
94 11694 25705 65355 44218 26937 56831 32116 -3551 18956 8320 -34944 -18865 -14984
106 -14984 -58642 -53592 -26599 -52781 -49658 2012 2531 -3393 43802 50627 17951 34677 36119
119 36119 -9033 -10751 4702 -20611 -19632 15703 14535 9120 38843 34364 5491 7800 -6597
$$ packed form
0@%%%%%%%%%%%%%Qj6J6j6J6k3L1l2L9m7N5o8P7q7J02j18J37j59J82k07K34k64
35a40K99l37L76m20M69n22N81o44P14p91Q73r63J065j175J292j423J568j727J905
54A000k105K327k583K876l211L606m078M652n369O297p548R336j2116J7083k8707
69a8540J11423P8352p4093M2511o1383q8273j2450n273p7406J5008M5404k2593
81f7313N352O9543j4271k0305M1929o694m5572K7114J0622l1895K3809L9648k0273
94A1694J4011L9650k1137j7281K9894k4715l5667K2507j0636m3264J6079L881
106a4984m3658N050K6993k6182L123N1670N19n924M7195O825l2676J6726J442
119C6119m5152j718J5453k5313R79L5335j168n415K9723m479k8873K309j4397
$$ plain form
132 -6597 -48656 -52959 -50709 -71535 -54743 -18374 -11807 11027 51924 54743 48694 65346 50685
145 50685 15756 16402 7855 -25985 -22720 -9288 -28738 -25048 -525 -10155 -16209 3754 636 -16877
159 -16877 -6955 -4555 -24693 -19850 -8137 -19673 -12197 11732 9324 17930 41309 41721 35982 47021
173 47021 39925 17314 12025 335 -27960 -35810 -34861 -51035 -47196 -25305 -23439 -15991 10767 13682
187 13682 8921 21623 21051 2815 4546 10151 -2527 -565 15340 10957 9555 24872 19853 7328
201 7328 11472 3330 -15420 -16935 -18950 -31132 -29605 -18174 -19438 -12557 5109 8577 10005 23096
215 23096 21397 13452 16595 12153 -1001 -2011 -1008 -11809 -11774 -2926 -7191 -7703 4056 4432 -1282
230 -1282 6333 5645 -6000 -3420 -2426 -11537 -11515 -4456 -5989 -3750 7677 11139 10406 17888 18310 9431
$$ packed form
132f597m2059m303K250k0826J6792L6369O567K2834M0897K819o049J6652j4661
145E0685l4929O46q547l3840L265J3432j9450L690K4523r630o054J9963l118j7513
159a6877R922K400k0138M843J1713j1536P476K3929k408Q606K3379M12n739J1039
173D7021p096k2611n289j1690k8295p850R49j6174L839K1891J866P448K6758K915
187A3682m761J2702n72j8236J731N605j2678J962J5905m383j402J5317n019j2525
201G328M144q142j8750j515k015j2182J527J1431j264O881J7666L468J428J3091
215B3096j699p945L143m442j3154j010J003j0801L5Q848m265n12J1759L76n714
230a282P615o88j1645K580R94r111K2P059j533K239J1427L462p33P482M22q879
$$ plain form
246 9431 9279 7000 -4308 -8006 -9122 -15485 -16706 -12385 -11597 -10378 -3408 119 -96 5922 7161 2028
262 2028 4323 5590 -16 1597 4118 2092 2559 6780 6906 4442 7302 5968 1309 329 -1613 -8747
278 -8747 -8880 -9065 -11759 -11010 -6886 -6172 -3512 1696 2889 3980 7242 7023 4715 5412 4108 355 628
295 628 1256 -1806 -1203 1408 -838 -70 2625 1037 113 1381 261 -2428 -1080 -1267 -4546 -4222 -1296
312 -1296 -2969 -2241 1029 309 30 1650 486 -1784 -570 -1263 -2760 -1078 385 -101 1286 3897
328 3897 2842 2376 4166 1845 -125 831 132 -184 1598 2374 1666 1859 2348 -1367 -3053 -3717 -7085
345 -7085 -7581 -5442 -4968 -3265 1234 3347 4515 5100 4498 2592 -95 -1013 -2270 -3069 -914 1063 2380
362 2380 5238 5277 5368 4610 1202 -1860 -3164 -5164 -5857 -4910 -3008 -1121 351 2319 2771 1787 2093 394
$$ packed form
246I431j52k279j1308l698j116o363j221M321P88J219O970L527k15O018J239n133
262B028K295J267n606J613K521k026M67M221J26k464K860j334m659r80j942p134
278h747j33j85k694P49M124P14K660N208J193J091L262k19k308O97j304l753K73
295F28O28l062O03K611k246P68K695j588r24J268j120k689J348j87l279L24K926
312a296j673P28L270p20k79J620j164k270J214o93j497J682J463m86J387K611
328C897j055m66J790k321j970R56o99l16J782P76p08J93M89l715j686o64l368
345g085m96K139M74J703M499K113J168N85o02j906k687r18j257p99K155J977J317
362B380K858L9R1p58l408l062j304k000o93R47J902J887J472J968M52r84L06j699
$$ plain form
380 394 -456 212 971 561 2652 1957 2220 673 -1762 -3734 -6908 -7038 -6552 -5615 -1295 2747 5254 8708
398 8708 9128 8116 6601 1172 -2433 -4018 -6390 -6661 -3269 -159 2030 4227 6088 3257 -1475 -3751
414 -3751 -7409 -11802 -11267 -8476 -6295 -621 3831 7352 9250 9562 7399 3402 918 -2597 -4774 -3751
430 -3751 -2872 -581 2350 4097 5578 7492 4375 1547 -1428 -4419 -7051 -6766 -5269 -4225 -5941 -3463
446 -3463 -3510 -4667 -4379 -3394 -3989 -511 5422 9158 11306 14796 15399 12027 7537 3135 -3733 -9895 -11967
463 -11967 -13216 -12978 -7973 -4044 158 3413 5837 6674 3774 2385 -116 -3059 -3710 -2227 633 2855
479 2855 5649 8504 7251 4500 1923 -2046 -6754 -8113 -8275 -7839 -6151 -3010 1277 3043 4110 6119
495 6119 5554 3434 3556 2236 2094 1284 1145 2630 845 556 417 -540 -2297 -2284 -3425 -4509 -4253 -2853
$$ packed form
380C94q50O68P59m10K091o95K63j547k435j972l174j30M86R37M320M042K507L454
398H708M20j012j515n429l605j585k372k71L392L110K189K197J861k831m732k276
414c751l658m393N35K791K181N674M452L521J898L12k163l997k484l515k177J023
430c751Q79K291K931J747J481J914l117k828k975k991k632K85J497J044j716K478
446c463m7j157K88R85n95L478N933L736K148L490O03l372m490m402o868o162k072
463a1967j249K38N005L929M202L255K424Q37k900j389k501k943o51J483K860K222
479B855K794K855j253k751k577l969m708j359j62M36J688L141M287J766J067K009
495F119n65k120J22j320j42q10j39J485j785k89j39r57j757J3j141j084K56J400
$$ plain form
513 -2853 -2008 -1707 -173 -543 -2204 -1354 -1405 -2478 -1303 2944 4660 6447 9703 11088 7915 5441 2384
530 2384 -1666 -7171 -7097 -8324 -7563 -5982 -2986 -848 -193 2931 3371 2204 1039 1268 -2460 -3875 -5438
547 -5438 -4784 -4772 -5048 -1218 1566 2298 4880 7088 5807 5984 5947 5431 3113 1536 1999 -1949 -4752 -5010
565 -5010 -7340 -7209 -7174 -4199 -3084 -2129 -72 1783 1463 2050 3716 2961 2813 4338 5195 3813 2840 2421
583 2421 -106 -3243 -2928 -2753 -4952 -5263 -3242 -2899 -1997 -172 2794 2766 4050 6219 6456 4877 5254
600 5254 3333 25 -2388 -2426 -4511 -6731 -5959 -4191 -4696 -4019 -1236 -162 528 3213 4948 3484 2977
617 2977 3257 1908 -491 -2334 -755 -2250 -1719 1468 3005 2727 2986 3942 1456 -298 -58 -1586 -3951
634 -3951 -3206 -2322 -3053 -2750 -1377 168 -1036 -158 823 -1320 -1069 -809 -651 -726 7 2332 2103 1873 3064
$$ packed form
513b853Q45L01J534l70j661Q50n1j073J175M247J716J787L256J385l173k474l057
530B384m050n505P4j227P61J581K996K138O55L124M40j167j165K29l728j415j563
547e438O54J2k76L830K784P32K582K208j281J77l7n16k318j577M63l948k803k58
565e010k330J31L5K975J115R55K057J855l20N87J666p55j48J525Q57j382r73m19
583B421k527l137L15J75k199l11K021L43R02J825K966k8J284K169K37j579L77
600E254j921l308k413l8k085k220P72J768n05O77K783J074O90K685J735j464n07
617B977K80j349k399j843J579j495N31L187J537k78K59R56k486j754K40j528k365
634c951P45Q84p31L03J373J545j204Q78R81k143K51K60J58p5P33K325k29k30J191
$$ plain form
653 3064 1884 321 -265 -69 -1006 -1220 -115 1506 1582 1226 1833 369 -2173 -1749 -2800 -3686 -3275 -1756
671 -1756 -1677 -1118 143 1227 1168 650 1764 443 -42 427 229 374 202 1263 1932 1473 2084 2241 819
690 819 419 428 -487 -718 -786 -255 -531 -771 -421 -738 -1928 -1837 -1837 -2203 -1844 -953 -113 -85 651 1406 656 790
712 790 1470 750 734 1287 1170 1368 1356 1698 2072 1156 496 642 -968 -1667 -2058 -2722 -2611 -2908 -2029 -1228 -485
733 -485 760 2009 1900 2019 1736 1224 84 -626 -797 -1786 -2294 -1327 -1339 -911 717 1429 2028 2362 2097
752 2097 1099 380 -546 -1317 -2167 -1607 -728 -303 1222 2381 2975 3377 2732 1678 636 -1286 -2250 -3479
770 -3479 -4083 -4163 -3800 -3250 -2260 -1200 -220 1070 946 2273 2631 2703 2844 2642 2632 2037 1569 1209 640 -42
790 -42 -266 -435 -334 286 173 -115 -610 -1859 -3084 -4450 -5173 -5548 -5097 -3411 -1073 975 3281 5368
$$ packed form
653C064j180j563n86J96r37k14J105J621P6l56O07j464k542M24j051q86M11J519
671a756P9N59J261J084n9n18J114j321m85M69j98J45j72J061O69m59O11J57j422
690H19m00Rr15k31o8N31k76k40L50l17j190R1%l66L59Q91Q40K8P36P55p50J34
712G90O80p20j6N53j17J98j2L42L74r16o60J46j610o99l91o64J11k97Q79Q01P43
733d85J245J249j09J19k83n12j140p10j71r89n08R67j2M28J628P12N99L34k65
752B097r98p19r26p71q50N60Q79M25J525J159N94M02o45j054j042j922r64j229
770c479o04q0L63N50R90J060R80J290j24J327L58P2J41k02j0n95m68l60n69o82
790d2k24j69J01O20j13k88m95j249j225j366p23l75M51J686K338K048K306K087
$$ plain form
808 5368 6137 6291 5618 3910 1866 -352 -1261 -2536 -2954 -1945 -677 313 1210 1316 945 -24 -1248 -2359
826 -2359 -3671 -3696 -3669 -3229 -1553 -147 1034 2801 2899 3389 3409 2620 1659 957 -215 -557 -1358 -1798 -1846 -1985
846 -1985 -2011 -1645 -1883 -737 129 771 1740 2254 2311 2342 1458 602 -595 -952 -1499 -1622 -1300 -14 556 1244
866 1244 1856 1358 537 -762 -1846 -3426 -4209 -4189 -3512 -2505 -934 664 2366 4033 4403 4944 4276 3152
884 3152 2419 1489 -50 -803 -1289 -1315 -909 -1177 -666 -922 -1069 -1332 -1789 -2037 -1891 -2394 -1998 -1844 -1375 -10
904 -10 584 1885 3099 3389 4101 4530 3652 2765 1643 368 -1296 -2705 -2685 -3236 -2906 -2108 -865 -291 393
923 393 1189 1662 970 826 675 -79 -490 -479 -1110 -1421 -1330 -1363 -1150 -1192 -785 -353 -322 731 1696 1664 2197 2877
945 2877 2445 1867 850 557 -895 -1845 -1928 -1629 -1926 -963 -191 -194 50 -118 -159 -1215 -1060 -389 -493 -545 347
$$ packed form
808E368P69J54o73j708k044k218r09j275m18J009J268R90Q97J06l71r69j224j111
826b359j312k5K7M40J676J406J181J767R8M90K0p89r61p02j172l42q01m40m8j39
846a985k6L66k38J146Q66O42R69N14N7L1q84q56j197l57n47j23L22J286N70O88
866A244O12m98q21j299j084j580p83K0O77J007J571J598J702J667L70N41o68j124
884C152p33r30j539p53m86k6M06k68N11k56j47k63m57k48J46n03L96J54M69J365
904a0N94J301J214K90P12M29q78q87j122j275j664j409K0n51L30P98J243N74O84
923C93P96M73o92j44j51p54m11J1o31l11R1l3K13m2M07M32L1J053R65l2N33O80
945B877m32n78j017k93j452r50q3K99k97R63P72lK44j68m1j056J55O71j04n2Q92
$$ plain form
966 347 1082 618 909 551 1 -535 -192 -178 -836 -170 1074 1009 1439 2243 1826 1306 364 344 -1124 -1958 -1981
987 -1981 -1347 -1737 -617 13 121 -246 -214 -601 -1747 -1684 -826 -149 290 1884 3117 2839 2976 2101 693
1006 693 -1094 -2434 -2736 -3567 -3543 -2053 -1005 -45 1969 3391 3547 3291 3528 2388 649 -5 -587 -1837
1024 -1837 -1608 -799 -814 -943 -370 -405 -1254 -2018 -1329 -1877 -2013 -1333 -591 -738 -392 357 749 523 1634 3281
1044 3281 3739 4745 6259 5573 4056 2980 1215 -1844 -4813 -5750 -7150 -8185 -7142 -5426 -3900 -1798
1060 -1798 1320 3209 3632 4409 4141 2586 1082 815 190 -508 1096 2407 3386 3432 4099 3422 729 -599
1078 -599 -1892 -4500 -5910 -5437 -5458 -5304 -3872 -1741 -313 1112 3385 4753 4391 4652 4475 2699 1238
1095 1238 493 -1098 -1889 -2142 -1116 -1213 -1134 290 739 248 361 499 -1135 -2137 -2713 -3113 -4286 -3706
$$ packed form
966C47P35m64K91l58n50n36L43J4o58O66J244o5M30Q04m17n20r42k0j468q34k3
987a981O34l90J120O30J08l67L2l87j146O3Q58O77M39J594J233k78J37q75j408
1006F93j787j340l02q31K4J490J048R60K014J422J56k56K37j140j739o54n82j250
1024a837K29Q09j5j29N73l5q49p64O89n48j36O80P42j47L46P49L92k26J111J647
1044C281M58J006J514o86j517j076j765l059k969r37j400j035J043J716J526K102
1060a798L118J889M23P77k68j555j504k67o25o98J604J311R79M6O67o77k693j328
1078e99j293k608j410M73k1J54J432K131J428J425K273J368l62K61j77j776j461
1095A238p45j591p91k53J026r7P9J424M49m91J13J38j634j002n76m00j173N80
$$ plain form
1113 -3706 -1987 -526 1720 4585 6440 7543 7756 6997 5236 1908 -842 -3238 -6183 -7358 -7350 -7079
1129 -7079 -5830 -3865 -1615 18 1601 3402 3369 2428 2196 1577 41 -261 783 1520 1935 3780 5630
1146 5630 5237 4847 4259 2613 -573 -2685 -5120 -7427 -9482 -8900 -8842 -7490 -4546 -1153 1608 4200
1162 4200 6820 7722 7507 6853 5260 3222 1062 342 -491 -1176 -712 -209 37 475 486 553 -1307 -2323
1180 -2323 -3140 -5287 -6319 -6222 -5972 -5240 -2499 261 3002 5329 8080 9395 8395 7264 5544 2555
1196 2555 -133 -2435 -4472 -5997 -6126 -5171 -4108 -3010 -1011 402 1062 1466 1443 373 -826 -1282 -1298
1213 -1298 -1506 -557 1270 2906 4445 6182 6507 5756 4776 2658 -30 -3269 -5785 -7673 -8810 -8804 -7503
1230 -7503 -5517 -2987 110 2918 5049 6251 6918 6272 4702 3571 2161 311 -478 -766 -919 -163
$$ packed form
1113c706J719J461K246K865J855J103K13p59j761l328k750k396k945j175QK71
1129g079J249J965K250J633J583J801l3r41k32o19j536l02J044P37M15J845J850
1146E630l93l90n88j646l186k112k435k307k055N82N8J352K944L393K761K592
1162D200K620R02k15o54j593k038k160p20q33o85M64N03K46M38J1O7j860j016
1180b323q17k147j032R7K50P32K741K760K741K327K751J315j000j131j720k989
1196B555k688k302k037j525j29R55J063J098J999J413O60M04k3j070j199m56j6
1213a298k08R49J827J636J539J737L25p51r80k118k688l239k516j888j137OJ301
1230g503J986K530L097K808K131J202O67o46j570j131j410j850p89k88j53P56
$$ plain form
1246 -163 77 932 1017 927 131 -1128 -3259 -4468 -5937 -6531 -6678 -5822 -3814 -1471 1003 4026 5979 7976
1264 7976 8282 7904 6340 4576 2428 -120 -2027 -3346 -3948 -4260 -3186 -2666 -1984 -1047 -850 -431 -788
1281 -788 -1702 -2331 -2565 -2834 -2502 -1678 -189 1423 2999 5058 5962 6359 6241 5327 3404 1242 -1192 -3595
1299 -3595 -5291 -6283 -6530 -5584 -4383 -2310 -358 958 2834 3385 3351 2908 1820 797 -90 -789 -895
1316 -895 -601 316 1384 2342 2724 2675 1986 921 -1114 -2364 -3758 -4786 -5246 -4873 -3839 -1969 -147
1333 -147 1769 3294 4369 5310 5207 3980 3541 1829 773 -267 -1187 -1852 -2217 -2465 -2100 -1909 -1457 -722
1351 -722 -701 -663 -885 -1333 -1432 -1509 -1772 -1451 -1005 -131 1303 2912 4097 4582 4580 4860 3351 2233 403 -1282
1371 -1282 -2681 -3685 -4361 -3905 -3860 -2473 -1265 -474 267 886 626 346 308 -94 -905 -544 -39 461 1052
$$ packed form
1246a63K40Q55Q5r0p96j259k131j209j469n94j47Q56K008K343K474L023J953J997
1264G976L06l78j564j764k148k548j907j319o02l12J074N20O82R37J97M19l57
1281g88r14o29k34k69L32Q24J489J612J576K059R04L97j18r14j923k162k434k403
1299c595j696r92k47R46J201K073J952J316J876N51l4m43j088j023q87o99j06
1316h95K94R17J068R58L82m9o89j065k035j250j394j028m60L73J034J870J822
1333a47J916J525J075R41j03j227m39j712j056j040r20o65l65k48L65J91M52P35
1351g22K1L8k22m48r9p7k63L21M46Q74J434J609J185M85kK80j509j118j830j685
1371a282j399j004o76M56M5J387J208P91P41O19k60k80l8m02q11L61N05N00N91
$$ plain form
1390 1052 1915 2263 2398 2647 2085 1308 545 -350 -950 -1877 -1950 -2039 -2427 -2130 -1500 -939 -365 282 589 1517
1410 1517 1596 1909 1725 812 505 -571 -590 -1109 -1071 -1154 -824 -494 234 608 181 506 92 41 -299 -166 -87
1431 -87 -214 -133 317 669 1054 1693 1360 884 660 392 -304 -1219 -1784 -1892 -2106 -1318 -473 -418 -371 414 352 241
1453 241 -65 87 528 3 543 546 585 639 790 913 283 156 246 -46 -213 166 47 -78 87 338 -146 -373
1475 -373 -140 -384 -750 -532 -1065 -1041 -674 -732 -286 -264 265 425 343 -70 169 102 59 124 -171 10 453 772
1497 772 659 307 477 1086 1000 675 468 636 -59 -596 -445 -1226 -1608 -1104 -1242 -1283 -862 20 -98 -85 299
1518 299 856 965 910 1038 724 542 -69 162 142 237 1395 935 1095 1307 1266 -508 -629 -943 -1139 -1953 -1723
1539 -1723 -1633 -1747 -1329 -633 -335 388 736 1896 1621 1678 1835 1163 406 -348 -556 -1118 -228 399 -156 217
$$ packed form
1390A052Q63L48J35K49n62p77p63q95o00r27p3q9l88K97O30N61N74O47L07R28
1410A517P9L13j84r13l07j076j9n19L8q3L30L30P28L74m27L25m14n1l40J33P9
1431h7j27Q1M50L52L85O39l33m76k24k68o96r15n65j08k14P88Q45N5M7P85o2j11
1453B41l06J52M41n25N40LL9N4J51J23o30j27R0k92j67L79j19j25J65K51m84k27
1475c73K33k44l66K18n33K4L67n8M46K2N29J60q2m13K39o7m3O5k95J81M43L19
1497G72j13l52J70O09q6l25k07J68o95n37J51p81l82N04j38m1M21Q82j18J3L84
1518B99N57J09n5J28l14j82o11K31k0R5J158m60J60K12m1j774j21l14j96q14K30
1539a723R0j14M18O96K98P23L48J160k75N7J57o72p57p54k08n62Q90O27n55L73
$$ plain form
1559 217 666 795 -118 -501 -354 -860 -976 -1245 -1153 -981 -936 485 561 439 1650 2015 1787 1728 1469 555 -645
1580 -645 -1203 -1484 -2103 -1942 -1612 -917 -1100 -185 1100 617 581 1964 1854 623 789 576 -355 -547 -154
1599 -154 175 653 965 2416 952 1201 516 -202 -1633 -2260 -2368 -2762 -2319 -2635 -1815 -1720 144 875 1787
1618 1787 1866 2490 2087 2357 1913 1490 536 -219 -553 41 -743 -234 -426 -497 91 -612 -427 -1115 -1488 -1116
1638 -1116 -2068 -2600 -2189 -1676 -1699 -444 926 471 2269 2939 2764 2305 1523 795 -106 -810 -855 -1103 -1558
1657 -1558 -704 -830 -460 -570 -60 48 368 163 604 -597 -466 -1079 -664 -789 -316 842 607 1151 1600
1676 1600 1910 1033 289 464 -733 -869 -1481 -1227 -1891 -1210 -597 -356 26 694 1472 1572 1422 1820 1357
1695 1357 103 128 210 -825 -1145 -118 -526 -453 -548 -167 -388 -343 -57 -1244 -1608 -1718 -1253 -834 -550 -12
$$ packed form
1559B17M49J29r13l83J47n06j16k69R2J72M5J421P6j22J211L65k28n9k59r14j200
1580f45n58k81o19J61L30O95j83R15J285m83l6J383j10j231J66k13r31j92L93
1599a54L29M78L12J451j464K49o85p18j431o27j08l94M43l16Q20R5J864P31R12
1618A787P9O24m03K70m44m23r54p55l34N94p84N09j92p1N88p03J85o88l73L72
1638a116r52n32M11N13k3J255J370m55J798O70j75m59p82p28r01p04m5k48m55
1657a558Q54j26L70j10N10J08L20k05M41j201J31o13M15j25M73J158k35N44M49
1676A600L10q77p44J75j197j36o12K54o64O81O13K41L82O68P78J00j50L98m63
1695A357j254K5Q2j035l20J027m08P3r5L81k21M5K86j187l64j10M65M19K84N38
$$ plain form
1715 -12 204 12 1813 947 1987 1711 1748 1686 205 968 171 -325 -1083 -1895 -1292 -1077 -399 -1008 -779 104
1735 104 -246 83 -1200 -745 -156 267 -955 -203 537 460 1279 1461 1122 960 1545 352 578 707 -456
1754 -456 -365 -280 -8 -339 -706 -325 -265 -217 -275 29 270 462 475 54 -131 -396 -161 -498 -467 -64 -832 34
1776 34 84 551 626 -162 405 -142 132 266 -636 9 -330 344 349 224 594 277 493 78 -585 402 374 121
1798 121 -599 -1049 -1369 -363 -1585 -1513 -398 -204 -528 -96 209 64 -2 768 932 400 578 735 51 -611
1818 -611 -117 -152 667 253 47 -609 117 392 -5 -923 203 49 -238 -251 -1438 109 -130 -397 -73 139
1838 139 -75 535 -104 641 254 -140 305 525 366 -72 348 103 -5 297 -152 160 146 876 924 664 473
1859 473 -68 369 -854 -700 -1005 -1041 -915 -1514 -891 -279 -734 -920 257 -88 -250 386 419 -518 -11 -147
$$ packed form
1715a2K16j92J801q66J040k76L7o2j481P63p97m96p58q12O03K15O78o09K29Q83
1735A04l50L29j283M55N89M23j222P52P40p7Q19J82l39j62N85j193K26J29j163
1754d56R1Q5K72l31l67L81O0M8n8L04K41J92J3m21j85k65K35l37L1M03p68Q66
1776C4N0M67P5p88N67n47K74J34r02O45l39O74Nj25L70l17K16m15o63R87k8k53
1798A21p20m50l20J006j222P2J115J94l24M32L05j45o6P70J64n32J78J57o84o62
1818f11M94l5Q19m14k06o56P26K75l97r18J126j54k87j3j187J547k39k67L24K12
1838A39k14O10o39P45l87l94M45K20j59m38M20k45j08L02m49L12j4P30M8k60j91
1859D73n41M37j223J54l05l6J26n99O23O12m55j86J177l45j62O36L3r37N07j36
$$ plain form
1879 -147 -122 916 219 883 613 1297 555 1119 90 -449 115 -1024 -925 -1685 -472 -1302 -1275 -924 -539 76
1899 76 77 309 -533 617 -715 408 254 -110 69 309 646 39 481 1245 549 875 902 15 689 202
1919 202 -267 -702 -937 -1088 -607 -1340 -1157 349 -113 -78 1078 855 774 -287 431 -542 -322 -1458 -533
1938 -533 -283 -156 -401 -157 642 -36 -5 -238 -96 -174 -462 -66 -500 -768 -77 248 -13 -331 88 444 1276
1959 1276 -627 597 -311 -293 -467 -805 -1179 -891 -641 106 -1114 -281 586 445 -383 458 868 -685 329
1978 329 375 472 71 -109 797 158 319 1338 149 148 148 -66 -222 -1451 -425 -1201 -1499 -1064 -1710 -1527 -906
1999 -906 443 560 884 1222 658 764 1257 33 838 421 -821 176 -980 -815 333 974 -80 -242
2017 -242 215 277 -712 -195 -512 -1220 242 -473 -506 -442 -751 -749 -244 918 982 463 853 -210 18 -108 -959
$$ packed form
1879a47K5J038o97O64k70O84p42N64j029n39N64j139R9p60J213q30K7L51L85O15
1899G6JK32q42J150j332J123j54l64J79K40L37o07M42P64o96L26K7q87O74m87
1919B02m69m35k35j51M81p33J83J506m62L5J156k23q1j061P18r73K20j136R25
1938e33K50J27k45K44P99o78L1k33J42p8k88L96m34k68O91L25k61l18M19L56Q32
1959A276j903J224r08J8j74l38l74K88K50P47j220Q33Q67j41q28Q41M10j553J014
1978C29M6R7m01j80R06o39J61J019j189j%k14j56j229J026p76k98M35o46J83O21
1999i06J349J17L24L38n64J06M93j224Q05m17j242R97j156J65J148O41j054j62
2017b42M57O2r89N17l17p08J462p15l3O4l09KN05J162O4n19L90j063K28j26q51
$$ plain form
2038 -959 -83 -352 -1203 773 -198 -416 129 396 82 173 1530 570 3 -816 -147 277 -215 -457 32 -204
2058 -204 -358 654 165 -519 -453 -51 -938 -658 -231 -1100 -944 247 372 -22 145 1046 -648 863 1138
2077 1138 604 -306 237 717 1598 -418 -247 -7 -301 -454 510 -581 -707 -115 -1283 -572 -770 -311 -416
2096 -416 -123 -56 263 79 -16 274 576 668 627 618 447 189 -594 -154 -461 -152 415 -294 101 -533 301 -886
2118 -886 653 396 -223 527 34 -368 -175 -165 -603 -715 -740 -929 -194 -646 -88 895 -315 868 1594 802
2138 802 1283 443 545 140 648 942 77 -743 -209 152 169 -147 -41 -249 -1015 -713 -448 -647 -74 19 29
2159 29 -182 -834 174 -597 -50 -767 386 354 219 763 610 821 1344 121 40 84 343 -704 -682 -662 -746
2180 -746 176 -422 1200 -1334 30 258 373 -550 230 -796 93 -253 -1207 -344 -575 516 409 607
$$ packed form
2038i59Q76k69q51J976r71k18N45K67l14R1J357r60n67q19O69M24m92k42M89k36
2058b04j54J012m89o84O6M02q87K80M27q69J56J191J25l94J67R01j694J511K75
2077A138n34r10N43M80Q81k016J71K40k94j53R64j091j26N92j168P11j98M59j05
2096d16K93O7L19j84r5K90L02R2m1rj71k58p83M40l07L09N67p09L95o34Q34j187
2118h86J539k57o19P50m93m02J93J0m38j12k5j89P35m52N58R83j210J183P26p92
2138H02M81q40J02m05N08K94q65q20N34L61J7l16J06k08p66L02K65j99N73R3J0
2159B9k11o52J008p71N47p17J153l2j35N44j53K11N23j223q1M4K59j047K2K0q4
2180g46R22n98J622k534J364K28J15r23P80j026Q89l46r54Q63k31J091j07J98
$$ plain form
2198 607 -61 591 645 -600 505 -470 -455 -173 -23 -388 750 557 -89 1517 930 1435 565 472 -175 -155
2218 -155 -89 -698 -538 -148 -640 -827 -467 -369 -227 -307 455 -792 -1003 -397 -1241 -998 -397 47 711 1097 1522
2239 1522 2001 2728 2571 1750 774 91 649 -1750 -1437 -2567 -1894 -1661 -1611 -2230 -917 -172 -410 505 669
2258 669 462 123 605 755 -609 698 83 433 871 1710 503 1283 706 373 -413 -1050 -1528 -1451 -1753
2277 -1753 -1652 -1380 -1529 -683 -638 225 735 745 909 1890 1294 1155 1068 -45 -29 -479 -754 -598 79 -29 431
2298 431 -390 255 -142 -371 -693 -1214 -1403 -1768 -1337 -766 -408 1188 1686 2095 2027 2121 2616 1031 695 -95
2318 -95 -471 -1342 -1452 -1734 -1922 -2933 -1707 -333 -683 165 531 -207 -209 142 220 -161 -284 561 905 733
2338 733 781 1966 1968 1667 1911 717 -74 -1332 -1278 -2512 -2521 -3367 -2969 -2201 -2077 -534 405 1023 1327 1609
$$ packed form
2198F07o68O52N4j245J105r75J5K82J50l65J138j93o46J606n87N05q70r3o47K0
2218a55O6o09J60L90m92j87L60R8J42q0P62j247k11O06q44K43O01M44O64L86M25
2239A522M79P27j57q21r76o83N58k399L13j130O73K33N0o19J313P45k38R15J64
2258F69k07l39M82J50j364J307o15L50M38Q39j207P80n77l33p86o37m78P7l02
2277a753J01K72j49Q46M5Q63N10J0J64R81n96j39q7j113J6m50k75J56O77j08M60
2298D31q21O45l97k29l22n21j89l65M31N71L58J596M98M09o8R4M95j585l36p90
2318i5l76q71j10k82j88j011J226J374l50Q48L66p38kL51P8l81j23Q45L44j72
2338G33M8J185Kl01K44j194p91j258N4j234rq46L98P68J24J543R39O18L04K82
$$ plain form
2358 1609 1066 1863 2138 780 933 256 -486 -907 -187 -215 121 552 944 192 137 -80 -896 -1530 -2068 -2563
2378 -2563 -1925 -1764 -1111 -609 610 1044 1669 2500 2378 1135 1478 910 -108 158 -612 -942 -1157 -1287 -1382
2397 -1382 -327 -335 31 -273 -591 343 135 -620 -237 -109 -160 -589 44 288 -476 1623 1696 1138 1596 1934
2417 1934 159 -819 -1121 -1922 -2482 -2871 -1960 -2188 -1121 -1128 70 769 1471 1102 1606 943 1393 354 581
2436 581 127 162 -47 -55 -52 1337 154 279 57 -105 -721 -1329 -1702 -2153 -1445 -2088 -1847 -349 239 1369
2456 1369 1054 2155 1865 1801 1489 792 1097 438 -255 -682 -708 -1105 -283 -360 211 -176 -524 -149 351 -350
2476 -350 -775 -946 -761 -383 -739 -1203 -188 477 523 1640 800 702 1054 876 -267 26 -414 -1170 -1432 -1289
2496 -1289 -1906 -247 -533 -52 -560 275 936 930 1106 -27 -9 -545 -255 -21 367 392 -432 288 691 914
$$ packed form
2358A609n43P97K75j358J53o77p42m21P20k8L36M31L92p52n5k17q16o34n38m95
2378b563O38J61O53N02J219M34O25Q31j22j243L43n68j018K66p70l30k15j30r5
2397a382J055qL66l04l18R34k08p55L83J28n1m29O33K44p64K099P3n58M58L38
2417A934j775r78l02q01n60l89R11k28J067pJ198O99P02l69N04o63M50j039K27
2436E81m54L5k09qLJ389j183J25k22j62o16o08l73m51P08o43K41J498N88J130
2456A369l15J101k90o4l12o97L05o59o93m27k6l97Q22p7N71l87l48L75N00p01
2476c50m25j71J85L78l56m64J015O65M6J117q40r8L52j78j143K93m40p56k62J43
2496a289o17J659k86M81n08Q35O61oJ76j133J8n36K90K34L88K5q24P20M03K23
$$ plain form
2516 914 417 773 533 -350 -340 -666 -832 -455 -766 -495 -299 654 63 1210 247 1155 507 928 518 -141
2536 -141 464 53 -47 -1062 -1259 300 -527 -590 -107 -181 -150 146 -591 -782 -176 -300 32 -465 -107 420
2556 420 44 783 719 485 1181 20 726 238 -979 400 -466 -350 287 677 79 -339 190 -121 -100 27
2576 27 40 -461 -542 594 633 -663 184 617 601 361 956 76 -77 -38 567 186 317 -30 -298 63 -609
2597 -609 216 -292 95 -865 -295 57 -1341 -46 -399 725 -283 13 -320 360 564 -633 -1071 -767
2615 -767 77 -944 707 -719 426 -399 1735 455 832 1069 568 937 869 748 383 -994 53 -1457
2633 -1457 -1594 -92 -640 -443 -894 -737 -1365 661 470 429 386 542 -168 716 -341 -94 -55 -248 663 -547
2653 -547 59 111 -478 -368 -326 -868 -459 782 -290 343 192 413 -665 321 608 435 -8 -751 590
$$ packed form
2516I14m97L56k40q83J0l26j66L77l11K71J96R53n91J147r63R08o48M21m10o59
2536a41O05m11j00j015j97J559q27o3M83p4L1K96p37j91O06j24L32m97L58N27
2556D20l76P39o4k34O96j161P06m88j217J379q66J16O37L90n98m18N29l11K1J27
2576B7J3n01q1J136L9j296Q47M33j6k40N95q80j53L9O05l81J31l47k68L61o72
2597f09Q25n08L87r60N70L52j398J295l53J124j008K96l33O80K04j197m38L04
2615g67Q44j021J651j426J145q25K134j280L77K37n01L69o8j21l65j377J047j510
2633a457j37J502n48J97m51J57o28K026j91m1m3J56p10Q84j057K47L9j93R11j210
2653e47O06N2n89J10M2n42M09J241j072O33j51K21j078R86K87j73m43p43J341
$$ plain form
2672 590 -254 -215 -258 -589 -359 -886 -186 -711 -467 -783 878 -66 463 518 -263 -568 -945 371 -407 -762
2692 -762 1311 -265 369 405 197 550 1277 163 -199 -551 -1233 -1463 -502 -1265 -554 -648 -811 194 -51
2711 -51 1760 -42 -44 -75 -79 15 -191 -590 203 131 358 140 240 1228 801 970 -294 -1010 -659 298 -252 -356
2733 -356 -1296 -1075 -316 -348 -560 -1183 -505 424 203 298 -294 993 598 236 612 328 288 950 33 -334 -843
2754 -843 -532 -395 503 -95 -479 -432 -2161 -720 -846 -716 -615 -411 258 901 818 572 1723 551 531 7
2774 7 -1007 -876 -1822 -2103 -466 -901 -229 -146 1062 817 1091 -42 542 94 131 309 -275 406 74 353
2794 353 3 289 331 445 853 -121 79 -578 86 -774 -1463 -933 -696 -781 99 -642 -1513 -416 -74 932
2814 932 -279 278 1219 262 1135 688 -534 -722 -980 -446 2 -623 -169 -330 107 -253 198 -587 -826
$$ packed form
2672E90q44L9m3l31K30n27P00n25K44l16J661r44N29N5p81l05l77J316p78l55
2692g62K073j576O34L6k08L53P27j114l62l52o82k30R61p63P11r4j63J005k45
2711e1J811j802kl1mR4k06l99P93p2K27k18J00R88m27J69j264p16L51R57n50j04
2733c56r40K21P59l2k12o23O78R29k21R5n92J287l95l62L76k84m0O62r17l67n09
2754h43L11J37Q98n98l84M7j729J441j26J30J01K04O69O43q3k46J151j172k0n24
2774Gj014J31r46k81J637m35O72Q3J208k45K74j133N84m48L7J78n84O81l32K79
2794C53l50K86M2J14M08r74K00o57O64q60o89N30K37q5Q80p41q71J097L42J006
2814I32j211N57R41r57Q73m47j222j88k58N34M48o25M54j61M37l60M51p85k39
$$ plain form
2833 -826 -1717 -901 -272 -772 -956 -709 883 956 362 995 1273 708 822 707 -401 -408 -743 -271 44 -285
2853 -285 -584 -434 956 308 526 -1117 -27 -656 346 -882 281 -652 179 123 -436 -466 390 541 509
2872 509 994 243 -376 208 -568 -716 151 -808 -260 122 133 -419 -214 753 1146 -272 773 -1130 -216
2891 -216 -51 -576 -330 -857 -538 -1265 -422 979 817 -237 86 32 -578 -16 -150 -1335 -267 56 -626
2910 -626 -366 -516 391 412 846 264 314 589 33 952 -597 285 -236 -1092 -459 -498 -155 -480 627 -1398
2930 -1398 -247 89 -453 -511 -567 -457 -317 -456 -287 -165 24 402 459 2 -161 97 564 -647 -14 -1176
2950 -1176 -836 -463 293 -272 -463 -151 -325 -6 -244 -220 873 539 -385 139 -1368 -513 401 -519 -226
2969 -226 -175 815 175 633 959 332 94 169 231 -24 653 640 -467 335 -147 -848 146 109 -261 80 -689
$$ packed form
2833h26q91Q16O29n00j84K47J592P3n94O33K78n65J14j15j108pl35M72L15l29
2853b85k99J50J390o48K18j643J090o29J002j228J163r33Q31n6n59l0Q56J51l2
2872E09M85p51o19N84p76j48Q67r59N48L82J1n52K05R67L93j418J045j903R14
2891b16J65n25K46n27L19p27Q43J401j62j054L23n4o10N62j34j185J068L23o82
2910f26K60j50R07K1M34n82N0K75n56R19j549Q82n21q56O33l9L43l25J107k025
2930a398J151L36n42n8n6J10J40j39J69J22J89L78N7m57j63K58M67j211O33j162
2950a176L40L73P56n65j91L12j74L19k38K4J093l34r24N24j507Q55R14r20K93
2969b26N1R90o40M58L26o27k38P5O2k55O77j3j107Q02m82p01R94l7l70L41p69
$$ plain form
2990 -689 436 715 -72 248 -637 -998 -879 169 -169 -595 -573 -495 -45 1047 -153 113 80 73 -549 -324
3010 -324 -896 760 495 928 23 222 -3 -770 -356 513 -232 -1096 -133 -529 -591 -6 542 -8 479 41
3030 41 -103 -20 380 -41 -313 -412 296 -341 -286 -495 -381 -7 -177 995 -50 358 -190 -71 -209 -308 320
3051 320 582 -708 67 -326 -358 -529 122 -16 -1177 -248 -393 -155 771 192 -548 -553 -163 -251 -1390 -183
3071 -183 371 -153 770 -203 440 472 785 846 -49 -180 -157 -317 -86 -1247 -261 -488 -514 -759 -1190 -481 95
3092 95 -705 -310 -187 -64 468 1371 404 -191 231 -111 -759 -721 -747 -579 -425 -37 432 448 269 465 -7
3113 -7 -519 885 -1122 -379 -491 -587 -526 136 -70 -161 138 487 -94 -721 942 691 -494 -418 355 289 508
3134 508 627 1025 187 993 -222 27 -358 -599 -987 -337 -544 -373 -195 -352 -150 572 636 -160 831 117
$$ packed form
2990f89J125K79p87L20q85l61J19J048l38m26K2P8M50J092j200K66l3po22K25
3010c24n72J656k65M33r05J99k25p67M14Q69p45q64R63l96o2N85N48n50M87m38
3030D1j44Q3M00m21k72r9P08o37N5k09J14L74j70J172j045M08n48J19j38r9O28
3051C20K62j290P75l93l2j71O51j38j161R29j45K38R26n79p40nL90q8j139J207
3071a83N54n24R23r73O43L2L13O1q95j31K3j60K31j161R86k27k6k45m31P09N76
3092I5q00L95J23J23N32R03r67n95M22l42o48L8k6J68J54L88M69J6j79J96m72
3113gn12J404k007P43j12r6O1O62k06r1K99L49n81o27J663k51j185P6P73o6K19
3134E08J19L98q38Q06j215K49l85k41l88O50k07J71J78j57K02P22O4p96R91p14
$$ plain form
3154 117 634 -158 32 316 92 -79 -659 -902 -329 -1046 153 -268 251 -522 535 452 726 -252 1965
3173 1965 340 116 701 -105 -9 1107 -413 -196 274 -427 509 171 -1317 287 -348 -614 -1055 -281
3191 -281 775 -174 192 -182 -187 -40 677 280 362 -209 920 7 419 -599 895 110 -674 274 -137 406
3211 406 -184 -2 150 -140 623 -863 766 -725 -418 -449 -633 875 763 -249 -722 -57 -278 59 -531
3230 -531 -324 -475 36 -451 311 -290 326 54 447 1718 -23 281 35 -219 -395 -849 -527 150 -524
3249 -524 -460 584 900 45 2 76 377 -370 190 519 -317 -677 -1434 -245 500 273 -470 349 472 216
3269 216 -358 270 -429 499 711 518 166 -465 307 -644 516 -1661 -73 820 -472 -37 -1564 -538
3287 -538 -241 -241 343 -524 -146 26 -444 1168 -846 10 -588 -999 240 157 -502 -97 77 -192 -934 -1147
$$ packed form
3154A17N17p92J90K84k24j71n80k43N73p17J199m21N19p73J057q3K74r78K217
3173A965j625k24N85q06R6J116j520K17M70p01R36l38j488J604o35k66m41P74
3191b81J056r49L66l74nJ47P17l97Q2n71J129r13M12j018J494p85p84R48m11N43
3211D06n90J82J52k90P63j486J629j491L07l1j84J508j12j012m73O65k21L37n90
3230e31K07j51N11m87P62o01O16k72L93J271j741L04k46k54j76m54L22O77o74
3249e24O4J044L16q55m3P4L01p47N60L29q36l60p57J189P45k27p43Q19J23k56
3269B16n74O28o99R28K12j93l52o31P72r51J160k177J588Q93j292M35j527J026
3287e38K97%N84q67L78J72m70J612k014Q56n98m11J239q3o59M05J74k69p42k13
$$ plain form
3307 -1147 42 -635 569 -69 617 -433 420 162 -231 -203 -132 -415 -521 353 -263 -678 -762 -489 51 -285
3327 -285 -422 851 535 -25 -441 -301 226 255 377 858 -293 -635 -142 -323 -694 -794 560 -752 -747 -358
3347 -358 614 -252 562 -1081 -697 128 -341 135 -890 -1244 -1263 296 -490 228 -235 381 105 1110 996
3366 996 680 79 -474 549 261 -392 -596 291 -723 -250 -118 547 246 -1141 292 311 -988 111
3384 111 612 508 -144 -824 164 413 371 490 390 -648 -208 -280 -335 -558 -915 -1471 -512 52 -615 -83 -150
3405 -150 131 565 1147 -153 246 -610 130 -1130 -1244 104 -199 105 -90 -703 340 -29 1598 -712
3423 -712 118 -357 -1059 -329 617 88 406 -556 -361 -398 848 688 986 163 953 895 -13 -982 -1372 -944
3443 -944 -1532 -98 -193 -408 -159 20 61 -1519 525 -643 -105 -551 -359 -350 -341 330 187 -213 280 1561
$$ packed form
3307a147J189o77J204o38O86j050Q53k58l93K8P1k83j06Q74o16m15q4K73N40l36
3327b85j37J273l16n60m16J40N27K9J22M81j151l42M93j81l71j00J354j312NL89
3347c58R72q66Q14j643L84Q25m69M76j025l54j9J559p86P18m63O16k76J005j14
3366I96l16o01n53J023k88o53k04Q87j014M73J32O65l01j387J433J9j299J099
3384A11N01j04o52o80R88K49m2J19j00j038M40p2n5k23l57n56R59N64o67N32o7
3405a50K81M34N82j300L99q56P40j260j14J348l03L04j95o13J043l69J627k310
3423g12Q30m75p02P30R46n29L18r62J95l7J246j60K98q23P90n8r08r69l90M28
3443i44n88J434r5k15K49J79M1j580K044j168N38m46J92RRO71j43m00M93J281
$$ plain form
3463 1561 737 1309 1071 39 -212 -953 -1161 -357 -915 -143 -249 -680 -702 -141 222 152 35 844 408 743
3483 743 1353 330 773 3 720 -208 -671 -440 -905 230 -329 -3 619 -279 636 -357 -472 304 -629
3502 -629 -605 328 -186 839 958 383 294 838 197 418 -1567 8 -783 -703 -443 597 -421 -323 48 229
3522 229 604 857 -1091 71 -328 -591 -1261 -152 810 581 -54 531 -191 877 846 307 155 509 505 -428
3542 -428 254 -751 -1387 -1097 -680 -915 -392 -366 911 1041 1161 650 200 70 229 413 -220 -12 -252 116
3562 116 -42 900 -22 542 231 127 395 -1317 -655 -442 -117 -652 -750 -1050 190 476 904 594 793 162
3582 162 1035 438 593 9 -80 81 125 79 -1758 -182 -638 -284 -450 472 4 -200 367 316 -453 565
3602 565 619 109 754 122 167 152 351 405 -364 -475 -931 -34 -732 -990 -1070 232 -251 -63 1475 541 -294
$$ packed form
3463A561q24N72k38j032k51p41k08Q04n58P72j06m31k2N61L63p0j17Q09m36L35
3483G43O10j023M43p70P17r28m63K31m65J135n59L26O22q98R15r93j15P76r33
3502f29K4R33n14J025J19n75q9N44o41K21j985J575p91Q0K60J040j018R8L71J81
3522B29L75K53j948J162l99k63o70J109R62k29o35N85p22J068l1n39j52L54mr33
3542d28O82j005o36K90M17k35N23K6J277J30J20n11m50j30J59J84o33K08k40L68
3562A16j58R42r22N64l11j04K68j712O62K13L25n35r8l00J240K86M28l10J99o31
3582A62Q73n97J55n84q9J61M4m6j837J576m56L54j66R22m68k04N67n1p69J018
3602E65N4n10O45o32M5j5J99N4p69j11m56Q97o98k58q0J302m83J88J538r34q35
$$ plain form
3623 -294 481 6 549 -372 -244 -532 288 -117 361 -93 16 223 107 747 8 -249 -144 473 -87 82
3643 82 -145 761 -704 -627 -161 -399 -1357 -246 -46 591 561 682 1161 121 538 723 447 242 -451 -115
3663 -115 188 -40 179 -87 176 -578 -447 -92 -1236 -550 -963 -1154 -356 497 658 9 495 51 170 -123
3683 -123 -36 -206 -440 -640 -259 -20 215 102 -3 347 327 -676 92 136 -652 -127 -779 -1013 -482 -43 202
3704 202 483 221 5 -437 -488 92 -322 -303 -41 -119 -63 424 -188 -422 -404 -564 -281 591 -234 -8 28 -52
3726 -52 243 -148 404 -307 23 -690 -313 -310 -79 -329 -492 -641 -341 -444 85 60 415 -23 -47 -418 69 -567
3748 -567 340 974 208 187 -317 116 147 -374 -49 -318 -188 1528 596 712 348 56 97 496 700 -167 226
3769 226 37 -282 485 -479 169 50 -245 -23 -656 112 358 297 -234 482 373 434 95 0 -17 -5 612 352
$$ packed form
3623b94P75m75N43r21J28k88Q20m05M78m54J09K07j16O40p39k57J05O17n60J69
3643H2k27R06j465P7M66k38r58J111K00O37l0J21M79j040M17J85k76k05o93L36
3663a15L03k28K19k66K63p54J31L55j144O86m13j91P98Q53J61o49M86m44J19k93
3683a23Q7j70k34k00L81K39K35j13j05L50k0j003P68M4p88N25o52k34N31M39K45
3704B02K81k62k16m42n1N80m14J9K62p8N6M87o12k34J8j60K83Q72q25K26L6q0
3726e2K95l91N52p11L30p13L77LK31k50j63j49L00j03N29k5L55m38k4l71M87o36
3748e67R07O34p66k1n04M33L1n21L25k69J30J716r32J16l64k92M1L99K04q67L93
3769B26j89l19P67r64O48j19k95K22o33P68K46o1n31P16j09O1l39r5j7J2O17k60
$$ plain form
3791 352 18 -172 -459 -1216 -165 -432 -43 31 -423 -96 247 -262 -117 -811 -336 -420 -128 -451 200 -313
3811 -313 -344 -162 -495 439 -626 354 362 219 70 -186 13 443 -85 423 373 -342 -78 127 -197 117 -839
3832 -839 -239 -454 -481 433 317 -226 -476 176 -304 -187 -487 -28 -32 262 133 859 47 -155 -218 -452 -751
3853 -751 -480 -121 -329 144 -730 468 522 447 446 -94 -81 -99 190 -353 -388 -286 -56 -1094 223 -241 -622
3874 -622 841 -900 124 235 275 -304 -641 176 -931 -714 -207 -454 11 716 965 324 1214 21 484
3893 484 273 -7 -366 -19 -833 -219 151 -759 -354 -279 398 1 89 705 231 -236 71 419 544 -533
3913 -533 -34 -150 208 772 -377 -155 812 -201 -173 -26 172 262 -528 835 -32 -21 -725 -505 -173 -683
3933 -683 -440 -4 227 69 26 4 -267 -106 487 -97 -246 232 280 -47 1421 252 126 389 -12 -575
$$ packed form
3791C52l34j90k87p57J051k67L89P4m54L27L43n09J45o94M75q4K92l23O51n13
3811c13l1J82l33R34j065R80Qj43j49k56J99M30n28N08n0p15K64K05l24L14r56
3832h39O00k15k7R14j16n43k50O52m80J17l00M59mK94j29P26q12k02o3k34k99
3853g51K71L59k08M73q74J198N4p5jn40J3j8K89n43l5J02K30j038J317m64l81
3874f22J463j741J024J11M0n79l37Q17j107K17N07k47M65P05K49o41Q90j193M63
3893D84k11k80l59L47q14O14L70r10M05P5O77l97Q8O16m74m67L07L48J25j077
3913e33M99j16L58N64j149K22R67j013K8J47J98R0p90J363q67J1p04K20L32n10
3933f83K43M36K31j58m3k2k71J61N93n84j49M78M8l27J468j169j26K63m01n63
$$ plain form
3953 -575 -323 -217 -963 -737 337 161 161 207 -16 348 -346 494 347 -83 -419 374 97 -443 -801 -102 160
3974 160 -443 -190 -719 9 -689 -189 -88 -72 299 455 219 35 30 -696 480 563 416 -128 -212 -570 -141
3995 -141 -938 -365 -507 -681 -1225 -1231 -947 379 -283 -230 -44 349 -223 671 730 1016 223 -584 -1 -34 -50 -862
4017 -862 -404 408 385 -1412 173 196 106 206 -379 -738 847 -617 68 -118 -24 -669 -940 162 -245 -218
4037 -218 480 -100 -69 -38 676 120 -388 829 -629 -73 -372 55 -211 520 -184 -565 388 388 448 -756 -596
4058 -596 2 401 -166 -720 11 -923 286 675 388 587 -1 42 153 -53 75 -446 -469 -504 374 222 113
4079 113 -546 -56 349 -268 16 548 759 -441 -670 -776 -714 -350 66 -198 -900 -381 -50 -1271 148
4098 148 -410 -193 -85 1344 710 -427 -423 -518 861 188 304 -438 -203 610 400 -59 654 -371 -182 -369
$$ packed form
3953e75K52J06p46K26J074j76%M6k23L64o94Q40j47m30l36P93k77n40l58O99K62
3974A60o03K53n29P28o98N00J01J6L71J56k36j84np26J176Q3j47n44q4l58M29
3995a41p97N73j42j74n44oK84J326o62N3J86L93n72Q94N9K86p93q07N83l3j6q12
4017h62M58Q12k3j797J585K3r0J00n85l59J585j464O85j86R4o45k71J102m07K7
4037b18O98n80L1L1P14n56n08J217j458N56k99M27k66P31p04l81R53%O0j204J60
4058e96N98L99n67n54P31r34J209L89k87J99n88M3J11k06J28n21k3l5Q78j52j09
4079A13o59M90M05o17K84N32K11j200k29j06O2L64M16k64p02N19L31j221J419
4098A48n58K17J08J429o34j137Mr5J379o73J16p42K35Q13k10m59P13j025J89j87
$$ plain form
4118 -369 -825 -633 -792 -235 -171 550 -326 -223 156 -389 75 -1180 93 -183 -77 -437 -146 -785 330
4137 330 -365 414 -294 87 43 245 -235 502 657 -21 -709 -356 196 595 557 -533 54 184 403 -5
4157 -5 181 201 -466 95 -246 -289 -82 -258 -755 -395 67 -1009 728 -50 -550 327 167 -458 -73 739 240
4178 240 -1049 -371 -473 390 40 233 -347 -495 -966 819 445 27 149 -168 930 -262 -285 -89 -676
4197 -676 -633 595 -727 283 55 304 -103 -630 192 600 -264 98 -29 -411 492 -255 440 -25 283
4216 283 -197 -634 501 -546 -299 -238 -516 -434 -47 -428 1225 -241 104 -293 -288 209 212 467 -130 117 6
4237 6 298 -287 -347 382 -311 -44 -237 -387 -428 -555 447 67 -60 -352 -399 -575 -294 60 270 358 -102 109
4259 109 -299 -244 -354 -322 -923 28 704 -742 541 345 -735 192 318 37 -141 263 81 -68 257 116
$$ packed form
4118c69m56J92j59N57O4P21q76J03L79n45M64j255J273k76J06l60K91o39J115
4137C30o95P79p08L81m4K02m80P37J55o78o88L53N52L99l8j090N87J30K19m08
4157eJ86K0o67N61l41m3K07j76m97L60M62j076J737p78n00Q77j60o25L85Q12m99
4178B40j289O78j02Q63l50J93n80j48m71J785l74m18J22l17J098j192k3J96n87
4197f76M3J228j322J010k28K49m07n27Q22M08q64L62j27l82R03p47O95m65L08
4216B83m80m37J135j047K47O1k78Q2L87l81J653j466L45l97NM97LK55n97K47j11
4237FK92n85o0P29o93K67j93j50m1j27J002l80j27k92m7j76K81L54K10Q8m60K11
4259A09m08N5j10L2o01R51O76j446J283j96j080R27J26k81j78M04j82j49L25j41
$$ plain form
4279 116 -5 150 305 -321 326 -1315 -319 -487 -254 619 173 -557 131 463 -377 -10 -248 273 -244 57
4299 57 121 -32 20 210 686 0 38 132 -473 -79 -113 6 404 469 121 -284 739 373 -60 -159 436 84
4321 84 -548 57 -291 -296 234 -399 154 16 10 -10 200 801 -142 -192 -28 100 -588 -388 5 -90 -308 -154 21
4344 21 -273 -88 23 -398 -402 567 6 -57 -366 -343 321 102 -360 -764 605 56 -235 523 -287 -282 -282 483 -314
4367 -314 -209 -156 213 -316 -273 226 -342 57 377 464 -377 -111 139 -569 -569 8 -451 5 -206 44 213 -57
4389 -57 -6 -62 -339 -165 189 -46 397 -290 302 16 -237 262 331 137 -32 633 809 493 -381 620 -497
4410 -497 -485 -264 -603 -121 -48 112 -211 -129 313 -365 -43 296 -507 -369 74 -230 296 -303 81 -98 -687
4431 -687 518 -336 -641 118 290 173 68 431 -195 283 219 66 -283 91 134 -470 -18 -308 -345 -167 -483
$$ packed form
4279A16j21J55J55o26O47j641R96j68K33Q73m46p30O88L32q40L67k38N21n17L01
4299E7O4j53N2J90M76o86L8R4o05L94l4J19L98O5l48m05J023l66m33r9N95l52
4321H4o32O05l48nN30o33N53j38ok0K10O01r43n0J64J28o88K00L93r5k18J54J75
4344B1k94J85J11m21mR69n61o3l09K3O64k19m62m04J369n49k91P58q10N%P65p97
4367c14J05N3L69n29M3M99n68L99L20Q7q41K66K50p08%N77m59M56k11K50J69k70
4389e7N1n6k77J74L54k35M43o87N92k86k53M99O9j94j69O65J76l16q74J001j117
4410d97J2K21l39M82P3J60l23Q2M42o78L22L39q03J38M43l04N26n99L84j79n89
4431f87J205q54l05P59J72j17j05L63o26M78o4j53l49L74M3o04M52k90l7J78l16
$$ plain form
4452 -483 -41 -436 -39 -363 345 398 53 57 50 -347 277 -238 -157 189 14 203 115 262 353 -297 -449 562
4474 562 116 352 -223 -211 148 -175 180 69 169 169 -76 -422 171 -130 -586 -548 -293 106 -442 -783 51
4495 51 338 -142 -469 539 73 473 -308 237 129 -411 1 174 -43 22 -236 174 315 -476 -357 -46
4515 -46 -265 -619 209 -332 263 -14 -131 33 153 -388 174 264 201 478 -554 -449 138 237 315 266 -154 -124
4537 -124 156 -528 75 45 -35 419 -338 -169 -160 -905 -240 -141 -388 -109 119 -181 74 353 628 496 146 31
4559 31 634 -375 -467 181 211 -272 -126 -292 -362 -362 -552 415 -254 549 -201 -32 318 378 -118 -444 -711 -391
4581 -391 336 -339 135 338 563 -424 338 -336 -370 60 -53 79 62 115 -88 -63 -177 193 -118 672 239
4602 239 512 158 115 -614 -112 -435 -428 103 -167 59 -96 14 53 231 -86 704 -88 -236 -535 -478 518 -310
$$ packed form
4452d83M42l95L97l24P08N3l45Mpl97O24n15Q1L46j75J89q8J47R1o50j52J011
4474E62m46K36n75J2L59l23L55j11J00%k45l46N93l01m56L8K55L99n48l41Q34
4495E1K87m80l27J008m66M00p81N45j08n40M12J73k17O5k58M10J41p91J19L11
4515d6k19l54Q28n41N95k77j17J64J20n41N62R0o3K77j032J05N87R9P8m9m20L0
4537a24K80o84O03l0q0M54p57J69Rp45O65R9k47K79K28l00K55K79K75j32l50j15
4559C1O03j009r2O48L0m83J46j66p0%j90R67o69Q03p50J69L50O0m96l26k67L20
4581c91P27o75M74K03K25r87P62o74l4M30j13J32j7N3k03K5j14L70l11P90m33
4602B39K73l54m3p29N02l23PN31k70K26j55J10L9J78l17P90p92j48k99N7R96q28
$$ plain form
4624 -310 -167 189 -206 301 7 257 425 229 335 340 342 -467 -747 237 -630 -582 -795 -95 219 -135 109 -392
4646 -392 300 716 62 -301 -557 246 -733 -19 -321 -471 658 200 863 -690 -726 48 1055 174 -708
4665 -708 -141 -212 -157 248 -170 -255 -208 -274 -177 -773 -62 732 -147 -402 271 -594 -153 -507 260 363 318 -2
4687 -2 -252 -862 -142 -934 -641 -341 -501 -221 29 -205 -212 -252 280 132 981 -834 147 163 -8 -493 -599 -778
4709 -778 -953 375 198 251 -923 -445 -523 371 -385 -67 378 511 -643 -388 316 450 389 52 42 -349
4729 -349 267 278 -37 844 125 168 -246 17 -410 868 82 61 738 588 -40 -532 261 106 -337 63 333
4750 333 288 -528 -43 -894 -136 879 619 -600 275 261 -213 -434 -382 716 353 6 125 -48 1423 96
4770 96 252 -1078 -791 470 -233 -794 278 195 -762 394 863 1308 246 213 48 412 -304 898 -5
$$ packed form
4624c10J43L56l95N07k94K50J68j96J06NKq09k80R84q67M8k13P00L14l54K44n01
4646c92O92M16o54l63k56Q03r79P14l02j50J129m58O63j553l6P74J007q81q82
4665g08N67p1N5M05m18q5M7o6R7n96P11P94q79k55O73q65M41l54P67J03m5l20
4687bk50o10P20p92K93L00j60K80K50k34pm0N32j48Q49j815R81J6j71m85j06j79
4709g78j75J328j77N3j174M78p8Q94p56L18M45J33j154K55P04J34o1l37j0l91
4729c49O16J1l15Q81p19M3m14K63m27J278p86k1O77j50o28m92P93j55m43M00K70
4750C33m5q16M85q51P58J015k60j219Q75j4m74k21N2J098l63l47J19j73J471j327
4770I6J56j330K87J261p03n61J072q3r57J156M69M45j062l3j65L64p16J202r03
$$ plain form
4789 -5 1213 -1119 -579 -294 -107 234 370 532 56 835 856 -314 -491 164 -411 -40 -744 -411 62 -234
4809 -234 324 291 -537 -161 -482 625 57 60 -429 481 285 504 291 707 182 66 -342 -315 781 -369
4829 -369 749 -109 -35 324 -541 -98 -54 911 -289 278 273 -273 -181 139 -442 -486 -468 -57 -358 -448 48 178
4851 178 -956 -279 718 299 399 404 -389 401 -176 -686 152 610 74 -181 -748 -102 -107 -597 -457 611 -867
4872 -867 -676 -824 31 -407 -440 198 -31 46 -1044 -513 771 675 530 656 -235 222 326 -559 -104 344
4892 344 714 365 345 -812 -923 248 294 -396 -787 573 567 -555 -361 -331 133 -29 43 -257 -91 130 306
4913 306 -872 -1 -140 -283 -93 -119 -355 222 192 -337 -223 -282 -439 741 -823 -921 -592 124 -37 -1021
4933 -1021 -913 -205 -315 -282 -43 -264 -264 9 -65 -238 869 -609 -1112 -545 4 1297 -925 -9 -35 594
$$ packed form
4789eJ218k332N40K85J87L41J36J62m76P79K1j170j77O55n75L71p04L33M73k96
4809b34N58l3q28L76l21J107n68Lm89R10j96K19k13M16n25j16m08K7J096j150
4829c69J118q58P4L59q65M43M4R65j200N67nn46R2L20n81m4J8M11l01r0M96J30
4851A78j134O77R97m19J00Np93P90n77n10Q38M58n36k55n67O46nm90J40J068j478
4872h67J91j48Q55m38l3O38k29P7j090N31J284r6j45J26q91M57J04q85M55M48
4892C44L70l49k0j157j11J171M6o90l91J360oj122J94L0M64j62P2l00J66K21J76
4913C06j178Q71j39j43J90k6k36N77l0n29J14n9j57J180j564r8L29P16j61r84
4933a021J08P08j10L3K39k21%K73p4j73J107j478n03N67N49J293k222R16k6O29
$$ plain form
4953 594 632 -340 -240 241 190 -190 -65 -516 442 -964 -342 -626 -253 -1039 -526 19 -620 92 -256 139
4973 139 -30 -1027 -153 -345 224 414 -217 -635 -220 156 -254 -482 830 556 155 85 -429 293 -720 10
4993 10 -654 8 -272 -138 80 -316 105 -245 -423 353 -414 -117 -613 -48 -89 89 -195 418 -30 704 59
5014 59 -241 -176 -838 -143 -64 419 -387 111 -306 105 -737 -512 211 -303 -264 -110 585 94 361 -132 614
5035 614 453 -703 193 453 287 49 -434 94 -98 472 -352 210 -415 211 -855 244 395 168 567
5054 567 -84 233 347 676 -74 302 -755 492 360 129 -217 171 -437 76 277 346 -160 -378 302 -313
5074 -313 94 -301 -270 189 408 -376 -131 -622 -241 304 392 -81 287 -146 -276 -191 -515 53 809 -278 -150
5095 -150 5 28 388 -584 -111 249 -8 -438 -160 -96 -502 -530 0 -506 -414 -36 327 -257 -145 290 272 -957
$$ packed form
4953E94L8r72J00M81n1l80J25m51R58j406O22k84L73p86N13N45o39P12l48L95
4973A39j69r97Q74j92N69J90o31m18M15L76m10k28J312k74m01p0n14P22j013P30
4993A0o64O62k80J34K18l96M21l50j78P76p67K97m96N65m1J78k84O13m48P34o45
5014E9l00O5o62O95P9M83q06M98m17M11q42K25P23n14L9J54O95m91K67m93P46
5035F14j61j156Q96K60j66k38m83N28j92N70q24N62o25O26j066J099J51k27L99
5054E67o51L17J14L29p50L76j057J247j32k31l46L88o08N13K01O9n06k18O80o15
5074c13M07l95L1M59K19p84K45m91L81N45Q8m73L68m33j30Q5l24N68P56j087J28
5095a50J55K3L60r72M73L60k57m30K78O4m06k8N30n06R2L78L63n84J12M35j8j229
$$ plain form
5117 -957 -92 -432 495 94 -46 -315 241 526 195 77 -189 73 -410 -344 257 493 -114 399 26 176
5137 176 -385 54 160 223 -36 58 382 -700 -14 -196 -212 46 74 -365 -86 -106 84 357 -13 228 6
5158 6 -19 -247 -436 -83 -348 -235 -457 -449 -497 -86 -239 -28 94 -378 -168 -187 -9 -110 12 -44 -38 -223 -203 213
5182 213 110 223 86 -36 425 100 222 33 -390 20 -876 -55 391 -140 143 64 168 307 -313 -73
5202 -73 -100 129 14 -351 -22 -103 -111 -227 134 -143 -548 508 577 72 20 190 148 54 -353 -126 219 244 -155
5225 -155 -121 -288 345 74 -61 315 264 8 -116 283 203 -5 446 -261 168 477 291 251 -34 46 288 -76
5247 -76 -280 416 -462 126 -170 -529 169 -148 -101 279 -163 129 40 -255 -35 -72 100 -7 196 -175 -78 357
5269 357 8 523 -387 -189 -133 133 283 446 48 -147 -109 -76 10 -45 125 601 129 30 309 267 7 296
$$ packed form
5117i57Q65l40R27m01j40k69N56K85l31j18k66K62m83O6O01K36o07N13l73J50
5137A76n61M39J06O3k59R4L24j082O86j82j6K58K8m39K79k0J90K73l70K41k22
5158Fk5k28j89L53k65J13k22Qm8M11j53K11J22m72K10j9J78j01J22n6Oj85K0M16
5182B13j03J13j37j22M61l25J22j89m23M10q96Q21M46n31K83p9J04J39o20K40
5202g3k7K29j15l65L29q1qj16L61k77m05J056O9n05n2J70m2r4m07K27L45K5l99
5225a55L4j67O33k71j35L76n1k56j24L99q0k08M51p07M29L09j86m0k85Q0K42l64
5247g6k04O96q78N88k96l59O98l17M7L80m42K92q9k95K20l7J72j07K03l71R7M35
5269C57l49N15r10J98N6K66J50J63l98j95L8L3Q6n5J70M76m72r9K79m2k60K89
$$ plain form
5291 296 -113 28 46 -479 -314 70 -97 162 465 101 540 -123 -115 -270 114 251 -34 443 194 123 110 134
5313 134 -98 -115 29 -393 -123 -148 -369 95 -246 262 196 40 173 -287 432 -130 157 -114 -98 197 131 149
5335 149 115 -55 79 148 7 333 -146 -104 357 50 340 -340 -19 -126 26 -251 -572 -429 -398 -42 63
5356 63 124 -81 62 22 -495 108 -35 -629 -152 -146 156 329 407 101 243 -73 123 -413 -83 -45 340 484
5378 484 195 -364 51 734 -44 57 172 -359 -536 -93 -58 -602 -81 -78 -237 -15 -382 25 64 -169 -163 -187
5400 -187 101 -790 -98 -165 -163 100 -35 280 492 426 -134 -194 -167 69 -447 135 137 245 -607 11 -500 -231 -233
5423 -233 -288 -175 286 430 505 -585 -163 -249 -392 -104 -453 264 49 -508 -427 -245 146 295 158 118 544
5444 544 331 219 -425 169 252 257 218 -5 501 112 -178 153 91 135 -119 -36 -179 -185 55 23 496 514 124 176
$$ packed form
5291B96m09J41J8n25J65L84j67K59L03l64M39o63Qj55L84J37k85M77k49p1j3K4
5313A34k32j7J44m22K70k5k21M64l41N08o6j56J33m60P19n62K87k71J6K95o6J8
5335A49l4j70J34O9j41L26m79M2M61l07K90o80L21j07J52k77l21J43L1L56J05
5356F3O1k05J43m0n17O03j43n94M77OL02J73P8l06J42l16J96n36L30L8L85J44
5378D84k89n59M15O83p78J01J15n31j77M43L5n44N21Lj59K22l67M07L9k33Ok4
5400a87K88q91O92o7KK63j35L15K12o6n60o0K7K36n16N82KJ08q52O18n11K69k
5423b33n5J13M61J44P5j090M22q6j43K88l49P17k15n57Q1J82L91J49j37m0M26
5444E44k13j12o44N94Q3Nl9k23N06l89k90L31o2M4k54Q3j43oK40l2M73J8l90N2
$$ plain form
5468 176 180 426 -628 -397 -142 -128 497 -19 358 408 -134 -273 28 -196 72 -4 -6 -492 -450 -57 217 -179
5490 -179 -311 53 161 -137 -135 252 317 442 66 174 -107 -227 -208 -476 -463 -328 594 210 130 -138 126 -457
5512 -457 -89 431 -620 -289 84 -432 -2 68 320 229 363 -232 435 -450 218 84 429 741 -13 430
5532 430 205 402 134 474 -58 1205 -170 622 199 -290 182 -34 536 -74 453 142 357 348 -381 -96
5552 -96 -98 99 81 -71 -180 112 273 220 -368 440 -502 -538 -195 336 88 329 43 -141 195 676 232 691
5574 691 261 -344 222 -190 -669 -938 -75 546 -684 468 -176 1059 -18 -58 -258 72 35 -100 -125 -217
5594 -217 -465 183 250 -551 192 -914 -529 -162 192 -24 -464 -852 282 271 -37 88 517 561 74 -385
5614 -385 -49 -594 80 486 276 44 92 142 -499 -33 1030 -214 -429 207 -107 -48 208 -77 67 -420
$$ packed form
5468A76MK46j054K31K55J4O25n16L77N0n42j39L01k24K68p6km86M2L93K74l96
5490a79j32L64J08k98KL87O5J25l76J08k81j20J9k68J3J35R22l84q0k68K64n83
5512d57L68N20j051L31L73n16M30P0K52r1J34n95O67q85O68j34L45L12p54M43
5532D30k25J97k68L40n32J263j375P92m23m89M72k16N70o10N27l11K15rp29K85
5552i6kJ97j8j52j09K92J61n3n88Q08r42l6L43N31k48K41k86j84L36M81m44M59
5574F91m30o05N66m12m79k69Q63O21j230J152o44J235j077m0k00L30l7j35k5r2
5594b17k48O48O7q01P43j106L85L67L54k16m40l88J134j1l08J25M29M4m87m59
5614c85L36n45O74M06k10k32M8N0o41M66J063j244k15O36l14N9K56k85J44m87
$$ plain form
5634 -420 -717 -360 891 122 530 604 -322 343 -620 45 -655 -90 -500 -384 -89 -419 204 -81 -525 -757
5654 -757 10 -23 110 432 -644 434 210 339 32 -435 747 782 220 838 -215 -115 -652 -230 423
5673 423 -272 -45 162 -120 245 -203 -166 -502 458 368 -33 -32 -639 296 673 -888 -623 360 66 -532 -72
5694 -72 138 -78 -156 -620 -512 -171 449 -582 -200 527 171 363 212 -218 39 -418 -142 -42 77 -187
5714 -187 -113 52 874 479 216 -478 479 310 -81 781 179 650 -12 -206 104 4 -720 556 -199 -312
5734 -312 -453 -2 -388 -296 301 -150 -193 -210 529 -360 -26 -136 -64 283 -899 719 -15 -475 -427 -150 -423
5755 -423 -97 666 -269 -601 141 -116 550 -246 571 311 -236 -59 308 -94 677 292 614 246 -114 407
5775 407 -451 317 -679 -265 -808 507 648 -244 886 -638 -133 -243 166 -375 115 42 489 -258 -149
$$ packed form
5634d20k97L57J251p69M08P4r26O65r63O65p00N65m10J16K95l30O23k85m44k32
5654g57P67l3J33L22j076J078k24J29l07m67J182L5n62O18j053J00n37M22O53
5673D23o95K27K07k82L65m48L7l36R60r0m01Jo07R35L77j561K65R83k94n98M60
5694g2K10k16p8m64J08L41O20j031L82P27l56J92j51m30K57m57K76J00J19k64
5714a87P4J65Q22l95k63o94R57j69l91Q62o02M71o62j94L10j00p24J276p55j13
5734c12j41M51l86R2N97m51m3j7P39q89L34j10P2L47j182J618p34m60M8K77k73
5755d23L26P63r35l32P42k57O66p96Q17k60n47J77L67m02P71l85L22l68l60N21
5775D07q58P68r96M14n43J315J41q92J130j524N05j10M09n41M90p3M47p47J09
$$ plain form
5794 -149 -31 321 -54 -101 -443 -238 -657 584 512 340 -1153 269 40 -390 -54 -728 -566 37 394 69
5814 69 656 -44 -242 -191 407 -293 526 -438 36 -125 -453 -518 -945 921 716 5 -1195 335 583 -392
5834 -392 -442 473 -59 -470 90 291 -139 -169 -135 -677 251 -1080 -178 -79 -310 -118 814 44 -522 343 379
5855 379 444 65 359 -371 370 256 310 -416 -122 -7 38 -318 22 -273 10 -567 574 -358 364 -44 -450
5876 -450 -843 146 -169 -678 -27 190 -79 -363 642 27 268 -172 149 -185 141 -286 -164 -974 255
5895 255 -397 454 -501 -339 43 403 -731 -108 -132 -149 596 -6 103 -246 -46 793 -208 416 397 -143
5915 -143 20 -148 -451 -519 -362 9 -209 -371 -352 632 -250 -146 -127 -326 -94 -783 207 -80 344 -115 607
5936 607 22 -502 96 -422 134 -268 -466 -437 -85 -310 -181 -165 -435 -538 -880 -260 218 332 470 70 38
$$ packed form
5794a49J18L52l75m7l42K05m19J241p2j72j493J422k29m30L36o74J62O03L57l25
5814F9N87p00j98N1N98p00Q19r64M74j61l28o5m27J866k05p11j200J530K48r75
5834c92n0R15n32m11N60K01m30l0L4n42R28j331R02R9k31J92R32p70n66Q65L6
5855C79O5l79K94p30P41j14N4p26K94J15M5l56L40k95K83n77J141r32P22m08m06
5876d50l93R89l15n09O51K17k69k84J005o15K41m40L21l34L26m27J22q10J229
5895B55o52Q51r55J62L82L60j134O23k4j7P45o02J09l49K00Q39j001O24j9n40
5915a43J63j68l03o8J57L71k18j62J9R84q82J04J9j99K32o89R90k87M24m59P22
5936F07n85n24N98n18N56m02j98K9L52k25J29J6k70j03l42O20M78J14J38m00l2
$$ plain form
5957 38 586 -742 46 -535 131 -175 387 713 295 -46 -136 36 41 -705 17 -457 -71 278 133 0 -237
5978 -237 -169 273 75 212 -8 279 -238 -21 413 411 289 -302 604 -212 -366 -38 473 -244 -65 -242 -131
5999 -131 -31 -808 959 81 45 381 309 -433 204 -141 175 155 -497 -205 -341 379 -387 -444 -152 408 -206
6020 -206 -535 490 -134 -305 -323 -396 338 329 21 -487 353 -301 316 -160 -449 -116 -322 -187 365 -290 60
6041 60 245 -35 313 19 -209 72 44 -93 205 130 -8 1289 -337 -285 -18 -199 -412 553 -561 286
6061 286 268 135 -247 176 -27 540 -51 18 -481 -541 573 276 -194 312 407 -276 263 249 429 -319 441
6082 441 -380 164 -762 91 206 -92 -287 305 -298 30 157 -505 506 -226 427 -577 -214 130 -127
6101 -127 -379 255 -653 -8 -644 -305 167 -695 343 -192 992 151 -121 549 1002 464 -508 -428 -382 240
$$ packed form
5957C8N48j328P88n81O66l06N62L26m18l41r0J72Np46P22m74L86L49j45j33k37
5978b37O8M42j98J37k20K87n17K17M34kj22n91R06q16j54L28N11p17J79j77J11
5999a31J00p77J767q78l6L36p2p42O37l45L16k0o52K92j36P20p66n7K92N60o14
6020b06l29J025o24j71j8p3P34rl08n08Q40o54O17m76k89L33k06J35N52o55L50
6041F0J85k80L48k94k28K81k8j37K98p5j38J297j626N2K67j81k13R65j114Q47
6061B86j8j33l82M23k03N67n91O9m99o0J114k97m70N06R5o83N39j4J80p48P60
6082D41q21N44r26Q53J15k98j95N92o03L28J27o62J011p32O53j004L63L44k57
6101a27k52O34r08O45o36L39M72q62J038n35J184q41k72O70M53n38r72Q0M6O22
$$ plain form
6121 240 2 9 -320 169 -383 -298 -147 397 -159 -492 -185 266 312 -49 847 -221 33 -977 -35 388 47
6142 47 339 610 -205 573 930 573 -114 -143 706 296 177 -214 -162 278 475 182 264 242 314 -130 -94 358
6164 358 141 -587 66 -444 527 256 483 -583 -328 -380 55 -165 -73 -430 537 598 -478 -405 293 -756
6184 -756 599 -122 427 -85 33 140 -426 730 -517 -314 -221 -25 187 37 -74 -112 -287 235 421 -581
6204 -581 499 -463 174 25 -161 184 161 413 -294 332 786 423 -12 -61 586 -132 -125 -276 156 692 -509
6225 -509 -638 154 -1019 -67 -478 -145 150 807 239 262 661 -209 -575 305 690 494 -559 -15 134 -426
6245 -426 51 324 -346 -48 5 112 -291 113 657 -170 26 -536 1269 -885 837 -481 -14 122 0
6264 0 -1009 -291 -140 -595 393 -1082 274 -309 -69 359 -21 1102 -216 942 406 -682 -159 544
$$ packed form
6121B40k38Pl29M89n52Q5J51N44n56l33L07M51M6l61Q96j068K54j010R42M23l41
6142D7K92K71q15P78L57l57o87k9Q49m10j19l91N2M40J97k93Q2k2P2m44L6M52
6164C58k17p28O53n10R71k71K27j066K55n2M35k20R2l57R67O1j076P3O98j049
6184g56J355p21N49n12J18J07n66J156j247K03R3J96K12j50j11l8j75N22J86j002
6204e81J080r62O37j49j86L45k3K52p07O26M54l63m35m9O47p18Pj51M32N36j201
6225e09j29P92j173R52m11L33K95O57n68K3L99q70l66Q80L85j96j053N44J49n60
6245d26M77K73o70K98N3J07m03M04N44q27J96n62J805k154J722j318M67J36j22
6264@j009P18J51m55R88j475J356n83K40M28l80J123j318J158n36j088N23P03
$$ plain form
6282 544 -31 26 467 85 -352 -351 -343 231 141 -340 340 -167 -703 296 525 63 332 695 589 266 1104 323
6304 323 75 -129 208 251 355 -122 -125 82 -236 416 380 345 188 269 -86 561 -255 532 28 72 68 437 761
6327 761 525 -128 -25 100 225 346 -190 492 -733 -854 381 711 572 -873 -2 363 -144 -612 -89
6346 -89 185 169 284 -6 939 -143 -814 226 703 586 170 -541 302 -23 -655 -116 611 477 -168 28
6366 28 531 -665 709 -592 -645 -351 -253 484 323 695 -396 368 -125 786 -244 -647 -454 738 -745
6385 -745 -606 -202 -720 243 -747 415 608 994 -931 829 -652 488 631 -529 -890 880 1193 746
6403 746 -393 200 -76 -288 -602 1321 522 709 682 55 475 -487 -899 -23 -697 988 480 -33 -224
6422 -224 178 623 141 456 532 214 -651 108 -257 -661 -629 6 667 -684 -608 -556 71 -953 695 945
$$ packed form
6282E44n75N7M41l82m37JQN74r0m81O80n07n36R99K29m62K69L63j06l23Q38p81
6304C23k48k04L37M3J04m77lK07l18O52l6l5j57Q1l55O47q16P87n04M4mL69L24
6327G61k36o53J03J25J25J21n36O82j225j21J235L30j39j445Q71L65n07m68N23
6346h9K74j6J15k90R45j082o71J040M77j17m16p11Q43l25o32N39P27j34o45J96
6366B8N03j196J374j301n3K94R8P37j61L72j091P64m93R11j030m03J93J192j483
6385g45J39M04n18R63r90J162J93L86j925J760j481J140J43j160l61J770L13m47
6403G46j139N93k76k12l14J923p99J87k7o27M20r62m12Q76o74J685n08n13j91
6422b24M02M45m82L15P6l18q65P59l65m04L2O35O61j351P6N2O27j024J648K50
$$ plain form
6442 945 712 -543 -315 200 378 253 -196 342 -821 -322 486 -217 -515 150 -331 367 193 -682 -352
6461 -352 -350 -803 295 31 104 -360 613 217 -215 -142 776 -17 -309 499 699 -141 133 234 -315 -863 -315
6482 -315 -274 157 -156 11 -646 -124 420 5 711 101 205 1320 -219 466 316 500 796 -330 332
6501 332 249 -751 -243 -769 -549 270 -186 1070 823 495 651 -510 271 357 538 539 260 -1335 277 -627
6521 -627 175 43 -518 -133 -109 607 -196 -280 -151 -684 873 794 -257 -542 354 -503 41 576 892 1058
6541 1058 610 811 718 712 195 2 -253 -90 -784 953 30 238 8 -558 657 567 -355 701 -563 665
6561 665 -205 -245 46 299 -242 872 371 -390 460 -63 -150 652 -942 -571 -308 -37 796 225 -310 -723
6581 -723 -453 -888 -239 405 376 -490 285 107 -176 957 176 -116 692 -41 353 222 -252 175 -148 -32
$$ packed form
6442I45k33j255K28N15J78j25m49N38j163M99Q08p03k98O65m81O98j74q75L30
6461c52Km53J098k64P3m64R73l96m32P3R18p93k92Q08K00q40K74J01n49n48N48
6482c15M1M31l13J67o57N22N44m15P06o10J04J115j539O85j50J84K96j126O62
6501C32q3j000N08n26K20Q19m56J256k47l28J56j161P81Q6J81Jk79j595J612r04
6521f27Q02j32n61L85K4P16q03q4J29n33J557p9j051k85Q96q57N44N35L16J66
6541A058m48K01r3on17j93k55J63o94J737r23K08k30n66J215r0r22J056j264J228
6561F65q70m0K91K53n41J114n01p61Q50n23q7Q02j594L71K63K71Q33n71n35m13
6581g23K70m35O49O44k9q66P75j78k83J133p81k92Q08p33L94j31m74M27l23J16
$$ plain form
6601 -32 949 -523 -1124 -931 -210 -642 687 -118 -275 -353 108 -312 -429 207 -187 -495 569 -227 -434 1558
6621 1558 -465 -569 -93 -638 -257 489 -366 -634 219 31 880 -435 480 341 452 759 -745 -271 -107
6640 -107 570 -213 -212 -765 1137 -668 -464 318 235 76 -343 -516 -1263 -465 491 397 -674 -382 -421 -454 -453 -728
6662 -728 -362 -1094 373 1324 569 -175 -124 9 -92 783 138 -378 232 -154 615 -722 -74 332 163 -282
6682 -282 824 -324 -347 134 25 -236 746 -1851 -953 -194 583 -198 553 -609 540 -529 170 -24
6700 -24 -636 219 -1352 208 727 -194 986 -417 -446 -310 -14 367 -496 127 971 -705 -307 544 -730
6719 -730 156 877 433 73 -962 92 -468 610 -78 178 -239 -410 61 519 131 384 -19 -300 29
6738 29 886 568 573 -77 -483 370 -595 -59 -90 -321 282 442 689 225 -117 -908 379 79 -37 932 -2
$$ packed form
6601c2R81j472o01J93P21m32J329q05j57p8M61m20j17O36l94l08J064p96k07J992
6621A558k023j04M76n45L81P46q55k68Q53j88Q49j315R15j39J11L07j504M74J64
6640a07O77p83Jn53J902j805K04P82q3j59m19j73p47P98R56r4j071K92l9l3Jk75
6662g28L66p32J467R51p55p44N1J33j01Q75o45n16O10l86P69j337O48M06j69m45
6682b82J106j148k3M81j09k61R82k597Q98P59P77p81P51j162J149j069O99j94
6700b4o12Q55j571J560N19r21J180j403k9J36K96L81q63O23Q44j676L98Q51j274
6719g30Q86P21m44l60j035J054n60J078o88K56m17j71M71M58l88K53m03k81L29
6738B9Q57l18No50m06Q53r65N36l1k31O03J60K47m64l42p91J287l00j16R69r34
$$ plain form
6759 -2 600 -87 794 677 335 -300 -215 677 -9 -143 291 -465 401 827 -540 -1154 198 610 -492 -368
6779 -368 183 906 -122 -961 274 357 994 1107 -1150 -200 -971 -540 63 450 -342 -95 -375 264 191 -409
6799 -409 -56 274 -56 261 -717 415 547 -58 647 -33 -601 453 230 -24 293 67 -426 -396 -634 348
6819 348 327 940 -467 56 430 -507 112 -751 1375 -262 -110 439 523 650 66 -191 -433 -523 226 -128
6839 -128 744 -340 503 727 184 438 209 -251 529 562 299 -547 582 -1169 172 495 373 391 57
6858 57 833 167 428 -276 -311 -892 182 -24 1263 -714 82 537 -411 -814 664 -7 691 -53 -67 1168
6878 1168 353 268 -180 274 -42 312 493 -167 9 -557 -704 -34 451 -349 14 -144 65 682 312 74
6898 74 -889 -210 147 866 -940 -18 -204 -753 26 843 1637 588 -659 -949 -66 -322 -391 -279 -60 136
$$ packed form
6759bO02o87Q81j17l42o35Q5Q92o86j34M34p56Q66M26j367o14J352M12j102J24
6779c68N51P23j028q39J235Q3O37J13k257R50p71M31O03L87p92K47k80O39p3o00
6799d09L53L30l30L17r78J132J32o05P05o80n68J054k23k54L17k26m93L0k38R82
6819C48k1O13j407N23L74r37O19q63K126j637J52N49Q4J27n84k57k42r0P49l54
6839a28Q72j084Q43K24n43K54k29m60P80L3k63q46J129j751J341L23j22J8l34
6858E7P76o66K61p04l5n81J074k06J287j977P96M55r48m03J478o71O98p44j4J235
6878A168q15q5m48M54l16L54J81o60J76n66j47O70M85q00L63j58K09O17l70k38
6898G4r63O79L57P19j806R22j86n49P79Q17P94j049j247k90Q83k56o9J12K19J96
$$ plain form
6918 136 572 302 -618 125 -636 522 739 -481 498 495 429 571 -642 302 -376 -547 -31 -854 404 -1429
6938 -1429 92 769 38 405 42 264 892 220 -279 689 303 492 -86 -136 12 -912 695 217 -397
6957 -397 587 -96 86 -474 179 1070 -386 -240 -377 186 68 1131 -726 1016 648 -182 -633 133 526
6976 526 -274 162 676 -548 581 36 -677 -115 -426 -251 94 -955 -419 434 143 131 413 -427 -319
6995 -319 126 294 212 -192 664 460 448 289 276 122 -733 -783 702 -426 518 327 217 610 422 22 -20
7016 -20 -288 226 -352 1170 -242 672 585 708 -112 -187 239 884 -506 -88 302 442 172 310 240 -227
7036 -227 426 -231 238 -228 -86 -160 240 -102 121 477 58 -403 344 -26 -120 -108 1152 -148 -259 208
7056 208 666 669 763 -120 -623 372 683 642 -344 -376 -192 137 510 94 -75 190 380 437 -306 552 -540 -384
$$ packed form
6918A36M36k70r20P43p61J158K17j220R79lo6J42j213R44o78j71N16q23J258j833
6938a429J521O77p31L67l63K22O28o72m99R68l86J89n78n0J48r24J607m78o14
6957c97R84o83J82n60O53Q91j456J46j37N63j18J063j857J742l68q30m51P66L93
6976E26q00M36N14j224J129n45p13N62l11J75L45j049N36Q53k91j2K82q40J08
6995c19M45J68q2m04Q56k04j2j59j3j54q55n0J485j128R44j91j10L93j88m00m2
7016b0k68N14n78J522j412R14q7J23q20p5M26O45j390M18L90J40k70J38p0m67
7036b27O53o57M69m66J42p4M00l42K23L56m19m61P47l70r4J2J260j300j11M67
7056B08M58LR4q83n03R95L11m1r86l2J84L29L73m16j69K65J90N7p43Q58j092J56
$$ plain form
7078 -384 -233 -471 511 1077 -91 -364 -38 138 -537 337 185 -209 734 278 -224 -244 -151 80 15 -213 -69
7099 -69 75 172 238 -110 195 24 351 411 147 370 538 234 -152 467 230 158 -49 243 -292 37 -586 27
7121 27 -594 -326 390 319 534 -73 -532 31 -715 -186 333 -139 -498 -75 -173 467 -365 -117 -126 38 -64 -149
7143 -149 46 -57 -274 -155 62 -10 -160 -235 115 -387 415 216 -169 215 35 -64 -121 58 2 -76 -72 -100 -98 87
7167 87 126 59 -99 -213 -119 60 -216 -147 81 -60 -134 -123 -212 -215 181 -212 -129 207 -44 -97 -64 237 51 -3 146
7192 146 -374 -154 224 118 -41 -245 -80 7 18 -71 30 35 -215 201 129 -354 -106 476 39 -185 160 240
7214 240 -9 98 466 163 200 196 -32 10 393 -140 -227 320 -95 -235 283 215 -224 313 580 597 642 616 156
7237 156 -504 -585 -179 -204 307 270 252 -207 304 7 265 -113 -14 -35 271 -50 -70 167 40 -199 -262 -187 -191 98
$$ packed form
7078c84J51k38R82N66j168k73L26J76o75Q74j52l94R43m56n02k0R3K31o5k28J44
7099f9J44R7O6l48L05j71L27O0k64K23J68l04l86O19k37p2k07K92n35L29o23O13
7121B7o21K68P16p1K15o07m59N63p46N29N19m72l59M23r8O40q32K48rJ64j02q5
7143a49J95j03k17J19K17p2j50p5L50n02Q02j99l85L84j80r9n7J79n6p8Mk8KJ85
7167H7L9o7j58j14R4J79k76O9K28j41p4J1q9lL96l93Q3L36k51n3L3L01j86n4J49
7192A46n20K20L78j06j59k04J65Q7J1q9J01Nk50M16p2m83K48N82m37k24L45Q0
7214B40k49J07L68l03L7mk28M2L83n33q7N47m15j40N18o8m39N37K67J7M5k6m60
7237A56o60q1M06k5N11l7j8m59N11k97K58l78R9k1L06l21k0K37j27k39o3P5mK89
$$ plain form
7261 98 -30 22 11 24 27 -344 -225 -378 -160 -392 131 33 96 -213 90 223 180 -28 67 211 -19 43 -51 -73
7285 -73 50 -192 55 131 -296 -185 130 -328 174 63 -71 -30 -388 -29 -53 -301 -119 -181 -132 100 -61 40
7307 40 298 -191 54 115 -36 -34 -60 212 -47 74 41 21 -268 88 -323 40 -15 47 30 6 -95 -54 300 4
7331 4 251 681 -406 325 -100 213 0 -96 262 108 -165 -50 184 -63 -161 126 83 261 -610 268 268 130
7353 130 220 -151 401 -269 157 -139 142 -221 269 280 -136 337 440 425 134 25 204 223 -178 12 380
7374 380 770 224 -374 36 58 -80 463 174 537 11 340 45 -371 -30 22 487 823 192 32 -3 -291
7395 -291 366 -54 -154 -183 -2 -325 -518 62 366 23 -175 -530 317 153 -914 -21 194 -170 147 -94
7415 -94 5 -168 -6 481 185 418 -229 -346 70 -466 -71 799 -622 181 -572 -116 276 -624 207 20
$$ packed form
7261I8j28N2j1J3Ll71J19j53K18k32N23r8O3l09L03J33m3k08R5J44k30O2r4k2
7285g3J23k42K47P6m27J11L15m58N02j11j34M1l58L59k4k48J82o2M9K32j61J01
7307D0K58m89K45O1j51Kk6K72k59J21l3k0k89L56m11L63n5O2j7k4j01M1L54k96
7331DK47M30j087P31m25L13k13r6L58j54k73J15K34k47r8K87m3J78q71Q78%j38
7353A30R0l71N52o70M26k96K81l63M90J1m16M73J03j5k91j09J79J9m01J90L68
7374C80L90n46n98M10K2j38N43k89L63n26L29k95m16L41N2M65L36o31j60l5k88
7395b91O57m20j00k9J81l23j93N80L04l43j98l55Q47j64j067Q93K15l64L17k41
7415i4R9j73J62M87k96K33o47j17M16n36L95Q70j421Q03p53M56L92r00Q31j87
$$ plain form
7435 20 509 411 70 19 -545 -409 123 85 -816 -88 280 -187 466 314 140 82 -313 276 -425 -598 698
7456 698 -105 585 83 209 315 -382 287 -117 160 196 27 96 -243 238 565 700 93 480 83 30 -59
7477 -59 -421 87 -135 124 153 186 -42 -99 -130 -84 -142 -110 -314 -130 -155 268 204 124 -122 16 -207 -373 236 58
7501 58 -20 62 -2 187 -101 114 98 -208 52 -98 109 324 36 47 34 99 -92 -16 170 201 338 47 157
7524 157 -98 -155 116 -292 -141 418 275 -262 -129 163 81 199 -68 249 123 395 -171 164 94 72 -39
7545 -39 -75 -30 72 175 19 -213 81 -190 -2 88 -239 -122 -34 132 210 -105 -46 3 -5 129 -227 23 -240
7568 -240 22 166 -7 -42 62 378 127 92 33 -86 -7 -115 7 127 -33 -69 -171 -192 -111 86 -45 -29 -160
7591 -160 -23 70 -136 108 40 233 -100 310 -188 150 -156 -155 305 15 221 -91 10 55 277 -122 -113 -26 63
$$ packed form
7435B0M89r8l41n1n64J36N32l8r01P28L68m67O53j52j74n8l95N89p01j73J296
7456F98q03O90n02J26J06o97O69m04K77L6j69O9l39M81L27J35o07L87l97n3q9
7477e9l62N08k22K59K9L3k28n7l1M6n8L2k04J84k5M23o4q0k46J38k23j66O09j78
7501E8p8Q2o4J89k88K15j6l06K60j50K07K15k88J1j3O5j91P6J86L1J37k91J10
7524A57k55n7K71m08J51N59j43n37J33K92q2J18k67L17j26K72n66L35p0k2j11
7545c9l6M5J02J03j56k32K94k71J88R0l27J17Q8J66P8l15N9M9qJ34l56K50k63
7568b40K62J44j73l5J04L16k51l5n9j19P9j08J22J20j60l6j02k1Q1J97j31J6j31
7591a60J37R3k06K44o8J93l33M10m98L38l06JM60k90K06l12J01M5K22l99RQ7Q9
$$ plain form
7614 63 -179 147 31 195 -25 211 -106 -227 59 -118 101 -8 -90 -130 82 -74 -147 -26 169 3 -8 -48
7636 -48 -62 -33 182 147 138 -19 -126 79 -55 -254 170 -95 -291 -84 -36 -437 149 -203 425 296 -373 197
7658 197 -111 292 31 -135 269 -98 -20 115 -27 12 32 -135 255 48 85 -43 -15 94 68 56 -336 408
7680 408 204 -290 65 -323 4 166 47 66 -59 47 49 205 32 243 35 58 175 6 -271 69 -81
7701 -81 -235 -19 249 191 -217 60 -109 -69 214 -110 19 299 -288 232 -156 -62 -50 192 27 253 176 -193
7723 -193 221 -40 -13 -52 146 -99 -218 265 229 14 153 -65 -167 177 -133 -76 -60 62 -311 55 -176 110
7745 110 63 5 224 -182 -183 -185 112 -46 58 -432 -197 17 -67 58 191 -34 -48 36 -172 218 -8 -196 -102
7768 -102 -37 384 -173 -59 -128 -103 97 24 -3 18 47 -115 162 6 43 266 -123 -113 191 -69 44 -156 235
$$ packed form
7614F3k42L26j16J64k20K36l17j21K86j77K19j09q2m0K12j56p3J21J95j66j1m0
7636d8j4K9K15l5rj57j07K05j34j99M24k65j96K07M8m01N86l52O28j29o69N70
7658A97l08M03k61j66M04l67P8J35j42L9K0j67L90k07L7j28K8J09k6j2l92P44
7680D08k04m94L55l88L27J62j19J9j25J06KJ56j73K11k08K3J17j69k77L40j50
7701h1j54K16K68n8m08K77j69M0K83l24J29K80n87N20l88R4J2K42j65K26p7l69
7723a93M14k61K7l9J98k45j19M83l6k15J39k18j02L44l10N7J6J22l73L66k31K86
7745A10m7n8K19m06jkK97j58J04m90K35K14q4J25J33k25j4Q4k08L90k26j88R4
7768a02O5M21n57J14o9K5K00p3k7K1K9j62K77j56L7K23l89J0L04k60J13k00L91
$$ plain form
7791 235 85 -42 -56 -100 98 -311 -175 272 -159 -42 -266 -21 -155 39 66 -120 -183 117 -45 -79 32 -11
7813 -11 -108 -268 241 -28 15 -160 10 298 144 -432 61 -161 -89 -88 -177 35 105 -131 25 78 66 46 8 -12
7837 -12 -211 106 51 -145 -30 -23 14 -94 -178 -214 51 -91 -289 -346 -35 222 15 315 -97 33 -93 151 -307
7860 -307 -75 -57 -127 181 207 90 178 -79 -34 -58 -149 -99 168 -103 -40 -228 -286 -75 -19 -365 297 185 222 -5
7884 -5 -47 132 -247 163 -220 298 252 184 173 67 125 -154 -173 -11 267 -398 3 -311 -104 -3 -268 -169 6
7907 6 4 -109 -5 -116 10 -114 140 -215 155 254 -236 -94 297 392 -13 -67 -300 333 142 -132 195 317
7929 317 230 206 513 -132 -66 247 117 -91 155 216 342 -204 -40 259 -427 -16 115 85 234 -156 -184 30
7951 30 111 -133 -69 -176 58 -105 26 -309 86 -47 19 -145 258 174 16 -354 -330 -300 6 70 -96 395 -184
$$ packed form
7791B35j50j27j4m4J98m09J36M47m31J17k24K45j34J94K7j86o3L00j62l4J11m3
7813a1r7j60N09k69M3j75J70K88j54n76M93k22P2Jq9K12P0k36J56N3j2k0l8k0
7837a2j99L17n5j96J15PL7j08q4l6K65j42j98n7L11K57k07L00m12J30j26K44m58
7860c07K32J8p0L08K6j17Q8k57M5k4r1N0K67k71O3j88n8K11N6l46O62j12L7k27
7884em2J79l79M10l83N18m6o8j1j06N8k79j9J62K78o65M01l14K07J01k65R9J75
7907Fkj13J04j11J26j24K54l55L70R9m90J42L91R5m05n4k33O33j91k74L27J22
7929C17q7k4L07o45O6L13j30k08K46O1J26n46J64K99o86M11J31l0J49l90k8K14
7951C0Q1k44O4j07K34j63J31l35L95j33O6j64M03q4j58l70K4L0L06O4j66M91n79
$$ plain form
7974 -184 -171 139 28 -13 -19 243 33 -120 14 118 229 -100 120 120 46 51 345 41 -62 2 0 -74 19 -213 74
7999 74 430 -32 -175 267 -52 175 -95 -68 143 -122 -37 291 115 36 50 15 -353 302 -38 -92 34 153
8021 153 -431 -286 183 -47 125 -313 185 -69 -78 134 -16 -151 -146 -136 -300 -74 220 32 296 133 60 -141
8043 -141 -149 80 -223 -291 -36 78 -53 116 116 75 -445 -4 52 202 293 -339 -75 -153 25 -35 -56 120 146 151 237
8068 237 402 -129 119 89 -31 335 6 -66 334 -133 93 60 24 209 -250 246 142 50 262 58 -362 -37
8090 -37 12 -47 -195 167 -238 190 164 -307 -55 -14 153 -28 -130 215 -68 -95 115 -183 18 2 71 -32 164
8113 164 -302 73 -15 -28 576 193 180 -105 195 -138 219 104 106 -216 117 -131 49 191 -308 -57 40 134
8135 134 -18 -35 309 90 -104 -22 -178 129 -336 -89 82 2 398 124 284 100 -65 -79 21 227 -264
$$ packed form
7974a84J3L10j11m1oK62k10j53J34J04J11l29K20%p4NK94l04j03O4kp4R3k32K87
7999G4L56m62j43M42l19K27k70K7K11k65Q5L28j76p9J4l5l68O55l40n4J26J19
8021A53n84J45M69k30J72m38M98k54rK12j50j35NJ0j64K26K94j88K64j63p3k01
8043a41qK29l03o8K55J14j31J69%m1n20M41N6J50R1o32K64p8J78o0k1J76K6NQ6
8068B37J65n31K48l0j20L66l29p2M00m67K26l3l6J85m59M96j04r2K12k04m20L25
8090c7M9n9j48L62m05M28k6m71K52M1J67j81j02L45k83k7K10k98K01j6O9j03J96
8113A64m66L75q8j3O04l83j3k85L00l33L57j15Kl22L33k48J80J42m99K51R7R4
8135A34j52j7L44k19j94Q2j56L07m65K47J71q0L96k74J60j84j65j4J00K06m91
$$ plain form
8156 -264 -64 -120 176 -156 -129 -358 -78 205 -111 -163 216 177 87 180 -18 12 91 -64 -251 202 -339 32 252
8179 252 54 -129 -123 -129 -396 182 -85 448 201 -68 96 -69
$$ packed form
8156b64K00n6K96l32K7k29K80K83l16n2L79l9r0R3j98L0P9j55j87M53n41L71K20
8179B52j98j83Ook67N78k67N33k47k69J64j65
8191f9
$$ Imaginary data points
##PAGE= N=2
##DATA TABLE= (X++(I..I)), XYDATA
$$ plain form
0 0 0 0 0 0 0 0 0 0 0 0 0 0 0 0 0 0 0 -8 8 -8 8 -8 8 -16 16 -16 24 -24 29 -32 40 -41 48 -56 63 -70 78 -89 98
39 98 -110 123 -135 151 -167 185 -203 226 -249 274 -301 332 -365 402 -443 491 -541 602 -669 748
59 748 -839 949 -1085 1253 -1469 1761 -2183 2835 -4008 6790 -28894 169 44527 64855
73 64855 141617 132628 97570 106312 74535 -1549 -2079 -8888 -56418 -40657 -953 -29231 -23791
86 -23791 18767 -8631 -40073 -5392 -22755 -65914 -32195 -14657 -49132 -19034 22164 -2573
98 -2573 7571 52914 36836 22453 58625 50450 16125 35081 31432 -13278 -11296 -8715 -49340
111 -49340 -51869 -31309 -49919 -43801 -3923 -3672 -2216 33739 31746 4660 18834 13443 -27414
124 -27414 -17940 959 -19483 -2593 41173 35243 33983 63166 46828 7350 8248 -10075 -57831
$$ packed form
0@%%%%%%%%%%%%%%%%%qJ6j6J6j6J6k4L2l2M0m8N3o1P2q1Q9j04J19j33J48j67J87
39I8k08K33k58K86l18L52l88M29m75N23n75O33o97P67q45R34j032J143j271J417
59G48j587J788k034K338k722L230l944N018o843J0798l5684K9063M4358K0328
73F4855P6762q989l5058Q742l1777p6084n30o809m7530J5761L9704k8278N440
86b3791M2558k7398l1442L4681j7363m3159L3719J7538l4475L0098M1198k4737
98b573J0144M5343j6078j4383L6172q175l4325J8956l649m4710J982K581m0625
111d9340k529K0560j8610O118L9878K51J456L5955j993k7086J4174n391m0857
124b7414R474J8899k0442J6890M3766n930j260K9183j6338l9478Q98j8323m7756
$$ plain form
137 -57831 -60467 -49300 -71339 -58304 -17332 -12974 -585 39197 43141 33406 48187 41825 13953
150 13953 14755 13313 -10935 -8200 6969 -7895 -4880 14075 2188 -6145 9510 -1181 -21003
163 -21003 -11136 -14139 -37326 -31040 -20257 -35873 -29035 -1230 -810 6244 39522 45593 38170 53346
177 53346 50471 24972 17750 10526 -17268 -28133 -23312 -35118 -37646 -19654 -15952 -15954 1793 4700
191 4700 -3829 2469 2612 -9925 -7918 -620 -5862 111 16419 16270 17919 30966 26941 14216 16966
206 16966 7576 -11257 -13066 -15162 -28399 -27263 -17271 -19275 -15232 455 4784 4257 15265 17585
220 17585 9000 12116 9877 -1089 -1827 12 -7394 -6705 211 -1643 -534 7023 6757 2490 4699
235 4699 2105 -7469 -8090 -7703 -16576 -13598 -7747 -9161 -3778 8052 9962 11102 19935 17909 11474
$$ packed form
137e7831k636J1167k2039J3035M0972M358J2389L9782L944r735J4781o362k7872
150A3953Q02j442k4248K735J5169j4864L015J8955j1887q333J5655j0691j9822
163b1003R867l003k3187O286J0783j5616O838K7805M20P054L3278O071p423J5176
177E3346k875k5499p222p224k7794j0865M821j1806k528J7992L702kJ7747K907
191D700q529O298J43j2537K007P298n242N973J6308j49J649J3047m025j2725K750
206A6966r390j8833j809k096j3237J136R992k004M043J5687M329n27J1008K320
220A7585q585L116k239j0966p38J839p406O89O916j854J109P557k66m267K209
235D699k594r574o21L87q873K978N851j414N383J1830J910J140Q833k026o435
$$ plain form
250 11474 11896 10257 -2050 -3626 -3163 -11780 -12257 -7509 -9998 -9488 -3028 -2568 -4383 447 1527 -3178
266 -3178 -1289 1315 -3037 -1836 3760 2396 3191 9323 8899 8741 12662 9537 4418 3847 1390 -5439
282 -5439 -7112 -6566 -10656 -10427 -5940 -6621 -6485 51 319 -702 3755 3720 1282 2339 2588 -93 -381
299 -381 1282 -345 -514 1993 1666 1588 4048 3247 1720 3042 1660 -608 -1031 -1805 -2823 -2666 -1536
316 -1536 -1039 -807 1481 373 -647 1167 -514 -3354 -2585 -3599 -3241 -1903 -592 -564 776 2659 1497
333 1497 625 1460 119 -891 1231 1971 1754 5301 4631 4237 4657 2158 -1145 -3473 -4889 -7038 -6954
350 -6954 -4950 -3358 -1344 1930 2497 2144 3379 511 -2035 -2255 -3067 -3713 -2283 382 2684 4722
366 4722 6668 6500 4173 3567 745 -2399 -3455 -4141 -5317 -3385 -1465 -1553 558 1388 346 15 -470
$$ packed form
250A1474M22j639j2307j576M63q617m77M748k489N10O460M60j815M830J080m705
266c178J889K604m352J201N596j364P95O132m24j58L921l125n119n71k457o829
282e439j673N46m090K29M487o81J36O536K68j021M457l5k438J057K49k681k88
299c81J663j627j69K507l27p8K460q01j527J322j382k268m23p74j018J57J130
316a536M97K32K288j108j020J814j681k840P69j014L58J338J311K8J340J883j162
333A497q72Q35j341j010K122P40k17L547o70l94M20k499l303k328j416k149Q4
350f954K004J592K014L274N67l53J235k868k546k20q12o46J430K665K302K038
366D722J946j68k327o06k822l144j056o86j176J932J920q8K111Q30j042l31m85
$$ plain form
383 -470 -1155 -547 1998 2577 3435 5054 3854 1278 -816 -3689 -8214 -9277 -8218 -7537 -4713 -179 4182
400 4182 5721 8122 7866 4388 2386 -882 -3452 -4447 -2418 -1238 3103 5803 7754 8119 4690 1878
416 1878 -2567 -7331 -10818 -12076 -10893 -8070 -3919 1490 5227 6399 6115 4900 1643 -1674 -2987
431 -2987 -3698 -3920 -1290 1442 3051 6233 7628 7551 7275 4670 1990 1186 -85 -1113 -2017 -3563 -3041
448 -3041 -3879 -5794 -7976 -10425 -9764 -10461 -6689 -2043 4443 7802 14007 16515 14886 12937 7685 1820
464 1820 -4029 -7229 -9304 -9922 -6495 -2305 -454 1463 3895 2565 284 -579 -3268 -4762 -3681 -2244
480 -2244 -89 2489 5299 7657 8081 6820 3454 258 -3163 -6506 -8300 -8932 -8262 -5513 -1698 -543
496 -543 1447 3425 2239 882 1486 1183 -109 1599 4976 3547 2625 3996 2139 1177 -620 405
$$ packed form
383d70o85O08K545N79Q58J619j200k576k094k873m525j063J059O81K824M534M361
400D182J539K401k56l478k002l268k570r95K029J180M341K700J951L65l429k812
416A878m445m764l487j258J183K823M151N409L737J172k84j215l257l317j313
431b987p11k22K630K732J609L182J395p7k76k605k680q04j271j028r04j546N22
448c041q38j915k182k449O61o97L772M646O486L359O205K508j629j949n252n865
464A820n849l200k075o18L427M190J851J917K432j330k281q63k689j494J081J437
480b244K155K578K810K358M24j261l366l196l421l343j794o32O70K749L815J155
496e43J990J978j186j357O04l03j292J708L377j429r22J371j857r62j797J025
$$ plain form
512 405 -1284 -2755 -767 -710 -2522 -2329 -2346 -5724 -7060 -5911 -5807 -5893 -3847 173 2274 3420 9246
529 9246 10359 8341 7904 6706 2494 -1707 -3452 -4869 -6634 -4998 -2285 -966 893 4245 3884 1815
545 1815 2092 23 -2518 -3514 -4359 -5169 -6454 -6246 -4498 -4669 -3225 367 3634 4763 6009 7644 7791
562 7791 5074 5230 4115 942 -622 -28 -2462 -4887 -4479 -3861 -5410 -5655 -2740 -1812 -1885 -42 2054
579 2054 1010 2242 3199 3637 2673 4649 5269 2042 1565 711 -2201 -4985 -5550 -6029 -6513 -5192 -1710
596 -1710 -17 539 3309 5477 4725 5043 5674 5158 4420 3166 2027 -1971 -4550 -4533 -4699 -6879 -4886
613 -4886 -2822 -2307 -1002 1292 2376 965 1552 2414 -338 -898 -693 -1301 -2764 -1667 743 1549 1864
630 1864 4610 4837 2777 1963 1632 -489 -1951 -1299 -1332 -2131 -987 544 -121 -1308 -885 -1107 -3078 -2515
$$ packed form
512D05j689j471J988N7j812J93j7l378j336J149J04q6K046M020K101J146N826
529I246J113k018m37j198m212m201j745j417j765J636K713J319J859L352l61k069
545A815K77k069k541r96q45q10j285K08J748j71J444L592L267J129J246J635J47
562G791k717J56j115l173j564N94k434k425M08O18j549k45K915R28p3J843K096
579B054j044J232R57M38r64J976O20l227m77q54k912k784n65m79m84J321L482
596a710J693N56K770K168p52L18O31n16p38j254j139l998k579J7j66k180J993
613d886K064N15J305K294J084j411N87Q62k752n60K05o08j463J097K410Q06L15
630A864K746K27k060q14l31k121j462O52l3p99J144J531o65j187M23k22j971N63
$$ plain form
648 -2515 -532 -965 -1151 322 1587 718 923 1983 895 40 -76 409 -178 -293 1130 1925 1889 2690
666 2690 3594 1456 980 278 -1426 -2417 -3405 -2379 -2424 -1790 174 631 -224 584 254 -1117 -1817 -1456 -687
685 -687 -1161 -258 1591 854 939 1939 1664 913 1217 1237 789 646 1049 1230 357 584 890 -536 -517 -1035
705 -1035 -1663 -1999 -2138 -1461 -1163 -1410 -553 -358 -225 -486 -207 -283 -401 57 870 1133 1706 2658 2375 2358 2508
726 2508 1613 572 -426 -825 -1581 -2335 -2390 -2295 -1951 -1226 238 408 1550 1973 2151 1757 663 295 -756
745 -756 -2174 -1956 -2337 -1992 -848 -27 1000 1541 1994 2123 777 118 -646 -1828 -2490 -2045 -1623 -707 767
764 767 1945 3548 4097 4311 3664 2632 1246 150 -1735 -2534 -3528 -3966 -3353 -3638 -3015 -2223 -1989 -1075
782 -1075 -307 135 1122 1502 2011 2167 1877 1752 1609 919 1414 1347 1620 2362 2221 3259 2197 1360 256
$$ packed form
648b515J983m33j86J473J265q69K05J060j088q55j16M85n87j15J423P95l6Q01
666B690R04k138m76p02j704r91r88J026m5O34J964M57q55Q08l30j371p00L61P69
685f87m74R03J849p37Q5J000k75p51L04K0m48j43M03J81q73K27L06j426J9n18
705a035o28l36j39O77K98k47Q57J95J33k61K79p6j18M58Q13K63N73R52k83j7J50
726B508q95j041r98l99p56p54n5R5L44P25J464J70J142M23J78l94j094l68j051
745g56j418K18l81L45J144Q21J027N41M53J29j346o59p64j182o62M45M22R16J474
764G67J178J603N49K14o47j032j386j096j885p99r94m38O13k85O23P92K34R14
782a075P68M42R87L80N09J56k90j25j43o90M95o7K73P42j41J038j062q37j104
$$ plain form
801 256 -1813 -3612 -5386 -7032 -7162 -5774 -4441 -1808 493 2472 4264 4740 5026 3652 2241 872
817 872 -564 -1054 -1227 -616 381 1982 2416 2669 2264 1139 411 -1608 -2957 -3729 -4376 -4076 -3178 -1936
835 -1936 -412 560 1878 2220 2346 2385 2216 1517 1614 704 26 -334 -1222 -1687 -1988 -2667 -2054 -1813 -1046 26
855 26 853 2172 2533 2256 1624 949 -170 -776 -1039 -1054 226 904 2013 2282 2923 3024 2088 1007 -716
874 -716 -2841 -3849 -5187 -5149 -4078 -2661 -1311 159 1453 2683 3298 3294 3220 2191 2082 1448 445 606
892 606 683 195 662 660 214 564 -267 -796 -1488 -2506 -2939 -3618 -3716 -3262 -3064 -2284 -405 365 1812 3208
912 3208 3772 3923 3408 2913 1528 194 -386 -1424 -2283 -2200 -1612 -778 -543 75 739 876 624 1385 563
931 563 163 244 97 -181 -1026 -868 -1502 -2290 -2544 -2138 -2174 -2098 -662 536 1185 2220 2980 2582 2081 1731
$$ packed form
801B56k069j799j774j646j30J388J333K633K301J979J792M76K86j374j411j369
817H72j436m90j73O11R97J601M34K53m05j125p28k019j349p72o47L00Q98J242
835a936J524R72J318L42J26L9j69o99R7r10o78l60q88m65l01o79O13K41P67J072
855B6Q27J319L61k77o32o75j119o06k63j5J280O78J109K69O41J01r36j081j723
874g16k125j008j338L8J071J417J350J470J294J230O15mp4j029j09o34j003J61
892F06P7m88M67km46L50q31n29o92j018m33o79r8M54J98P80J879P70J447J396
912C208N64J51n15m95j385j334n80j038q59Q3N88Q34K35O18O64J37k52P61q22
931E63m00Q1j47k78q45J58o34p88k54M06l6P6J436J198O49J035P60l98n01l50
$$ plain form
951 1731 1344 -27 -287 -557 -835 -720 -186 357 153 -72 428 -127 -996 -867 -867 -1266 -833 248 389 284
971 284 508 689 -517 -1051 -813 -1710 -1427 -551 552 1129 2116 2338 2501 1456 1336 967 -314 -358 -388 -400
991 -400 -496 185 266 -37 -847 -728 -1346 -2301 -1836 -1583 -1580 -613 1548 2703 2932 3510 3339 2076 181 -1213
1011 -1213 -2998 -4446 -4067 -3252 -2275 -1026 1013 2077 2089 2394 2781 1669 1115 1574 968 241 483 1000
1029 1000 80 -211 317 -53 -944 -621 -644 -1738 -2440 -2429 -2420 -3079 -3320 -2751 -2422 -2061 -84 608 2030 4335
1049 4335 6349 7034 7118 7143 5639 2203 -217 -2360 -5794 -6952 -6591 -5934 -5000 -2824 -886 167 295
1066 295 1196 1097 -245 -458 -126 -701 -567 710 2373 2947 4449 5832 5496 4421 3539 1344 -1796 -3725
1084 -3725 -4496 -5803 -6138 -5168 -3157 -2492 -1146 1022 1505 1863 3133 3055 2805 2000 1939 907 -586 -674
$$ packed form
951A731l87j371k60k70k78J15N34N43k04k25N00n55q69J29%l99M33J081J41j05
971B84K24J81j206n34K38q97K83Q76J103N77R87K22J63j045j20l69j281m4l0j2
991d00r6O81Q1l03q10J19o18r55M65K53LR67K161J155K29N78j71j263j895j394
1011a213j785j448L79Q15R77J249K039J064J2L05L87j112n54M59o06p27K42N17
1029A000r20k91N28l70q91L23k3j094p02J1Ro59k41N69L29L61J977O92J422K305
1049D335K014O85Q4K5j504l436k420k143l434j158L61O57R34K176J938J053J28
1066B95R01r9j342k13L32n75J34J277J663N74J502J383l36j075q82k195l140j929
1084c725p71j307l35R70K011O65J346K168M83L58J270p8k50q05o1j032j493q8
$$ plain form
1102 -674 -866 -1262 -126 1712 1726 1663 2345 1584 -364 -1998 -3035 -5016 -5887 -5829 -4627 -3438 -1498 1656
1120 1656 4227 5795 7842 9042 7211 5615 4240 783 -2502 -4412 -5363 -6048 -5985 -3974 -2750 -2165
1136 -2165 -280 751 -276 -410 -752 -1261 -2207 -1808 -990 -503 1245 3693 5263 6480 8036 8573 7281
1153 7281 4807 2452 -697 -4641 -7182 -8276 -9564 -9428 -7151 -5329 -3420 -390 1946 3274 3896
1168 3896 4754 4593 2979 1994 1370 599 578 1295 2134 2570 3249 4364 3780 2035 577 -1639 -4359 -6412
1186 -6412 -7238 -7825 -8106 -6238 -3927 -1601 1247 4620 6261 7346 7928 7265 5554 3225 958 -1009
1202 -1009 -3236 -3587 -3403 -3250 -1989 -645 -138 157 385 -212 -1186 -2824 -3192 -3965 -4091 -2763 -1217 910
1220 910 3685 5931 7664 8144 7708 6705 4055 1183 -1422 -4492 -7029 -8055 -8301 -7603 -6302 -3658
$$ packed form
1102f74j92l96J136J838J4o3O82p61j948j634j037j981q71N8J202J189J940L154
1120A656K571J568K047J200j831j596j375l457l285j910r51o85O3K011J224N85
1136b165J885J031j027j34l42n09r46L99Q18M87J748K448J570J217J556N37j292
1153G281k474k355l149l944k541j094j288J36K277J822J909L030K336J328O22
1168C896Q58j61j614r85o24p71k1P17Q39M36O79J115n84j745j458k216k720k053
1186f412q26n87k81J868K311K326K848L373J641J085N82o63j711k329k267j967
1202a009k227l51J84J53J261J344N07K95K28n97r74j638l68p73j26J328J546K127
1220I10K775K246J733M80m36j003k650k872k605l070k537j026k46O98J301K644
$$ plain form
1236 -3658 -1160 541 2216 3680 3850 4036 2973 2065 844 198 332 427 1287 2916 3670 3858 4250 3588
1254 3588 1962 -238 -2643 -4712 -6781 -8231 -7959 -7807 -6076 -3357 -765 1717 4543 6041 6855 6433
1270 6433 5669 4575 2595 990 129 -934 -1156 -853 -697 38 47 539 206 -805 -1682 -2914 -4093 -4871
1288 -4871 -4952 -4617 -3550 -2037 406 2505 4317 5838 6911 6663 5795 4165 1982 104 -2217 -4150
1304 -4150 -5078 -5355 -4528 -3530 -1713 -159 998 1539 1476 1147 888 -207 -678 -1134 -1406 -532 277 1624
1322 1624 2783 3888 4162 4133 2900 972 -472 -2303 -3983 -5215 -5350 -5395 -4234 -3089 -1274 104
1338 104 1532 3092 3922 4336 3810 3402 2626 1460 889 204 -699 -773 -736 -635 -297 -311 -14 -576 -874 -1369
1358 -1369 -2183 -3142 -3585 -3831 -3196 -2654 -1034 834 1890 3704 4441 5219 4756 4109 2442 1384 -402
$$ packed form
1236c658K498J701J675J464J70J86j063r08j221o46J34R5Q60J629P54J88L92o62
1254C588j626k200k405k069k069j450K72J52J731K719K592K482K826J498Q14m22
1270F433p64j094j980j605q61j063k22L03J56P35RM92l33j011q77j232j179p78
1288d871q1L35J067J513K443K099J812J521J073k48q68j630k183j878k321j933
1304d150r28k77Q27R98J817J554J157N41o3l29k59j095m71m56k72Q74Q09J347
1322A624J159J105K74k9j233j928j444j831j680j232j35m5J161J145J815J378
1338A04J428J560Q30M14n26m08p76j166n71o85r03p4L7J01L38j4K97n62k98m95
1358a369q14r59m43k46O35N42J620J868J056J814P37P78m63o47j667j058j786
$$ plain form
1375 -402 -1403 -2208 -2729 -2684 -1880 -1180 -428 -269 -50 -278 -646 -1049 -1054 -1713 -1610 -1168 -941 173 873 1722
1395 1722 2024 2667 2960 2419 1606 1230 112 -662 -675 -1463 -1602 -1894 -1744 -1108 -1524 -615 350 600 886 1694
1415 1694 1502 996 407 239 134 -906 -768 -820 -894 -236 53 82 138 367 468 -44 -572 -576 -748 -849 70
1436 70 228 518 967 1494 1649 1665 1277 1318 176 -241 -79 -803 -1150 -1169 -689 -990 -315 48 111 -375 -434 -314
1458 -314 -577 -195 -379 299 -107 434 517 532 -180 329 616 -30 -31 637 731 187 604 932 291 -55 -172 -703
1480 -703 -1093 105 -312 -740 -672 57 -167 -391 -134 225 -170 122 411 -795 -1183 -93 -4 -542 -326 565
1500 565 854 378 1195 1261 857 798 1338 909 516 661 133 -142 -955 -1114 -1493 -1944 -1279 -1359 -957 -446 -109
1521 -109 192 -427 -216 -134 -745 -55 107 528 19 687 1415 1172 1604 2002 1912 1359 1137 870 -771 -926
$$ packed form
1375d02j001q05n21M5Q04P00P52J59K19k28l68m03no59J03M42K27J114P00Q49
1395A722L02O43K93n41q13l76j118p74j3p88j39k92J50O36m16R09R65K50K86Q08
1415A694j92n06n89j68j05j040J38n2p4O58K89K9N6K29J01n12n28mj72j01R19
1436G0J58K90M49N27J55J6l88M1j142m17J62p24l47j9M80l01O75L63O3m86n9J20
1458c14k63L82j84O78m06N41Q3J5p12N09K87o46jO68R4n44M17L28o41l46j17n31
1480g03l90J198m17m28O8P29k24k24K57L59l95K92K89j206l88J090Q9n38K16Q91
1500E65K89m76Q17O6m04n9N40m29l93J45n28k75q13j59l79m51O65q0M02N11L37
1521a09L01o19K11Q2o11O90J62M21n09O68P28k43M32L98r0n53k22k67j641j55
$$ plain form
1541 -926 -2019 -2105 -2669 -1769 -1230 -1189 -732 561 726 82 938 710 595 901 452 301 61 -115 385 71
1561 71 -74 684 1418 543 456 487 -622 -1704 -1618 -1567 -2137 -951 -472 -291 -224 1018 1737 2196 1489 2168 2064
1582 2064 640 110 -1235 -1639 -2338 -2214 -1338 -1402 -1078 -51 -304 264 1081 442 -366 622 92 -457 -206
1601 -206 660 475 423 1754 1345 1962 2253 1722 722 -31 -401 -2041 -2492 -2822 -2801 -2732 -2479 -1244 -988 -595
1621 -595 414 871 1875 1815 2122 1350 595 319 530 693 414 835 1208 450 892 1105 711 -64 -1606
1640 -1606 -1354 -2581 -2209 -2495 -1833 -2364 -908 626 335 499 1905 1411 2110 2129 2014 664 204 -138
1658 -138 -604 -1178 -1079 23 -315 67 410 663 -66 242 43 -374 -659 -259 -697 -1266 -1003 -143 453 968
1678 968 1263 1420 1500 1647 1087 -120 -36 -1080 -1435 -1971 -2137 -647 -912 -237 317 501 423 908 1689 1080
$$ packed form
1541i26j093q6n64R00N39M1M57J293J65o44Q56k28j15L06m49j51k40j76N00l14
1561G1j45P58P34q75q7L1j109j082Q6N1n70J186M79J81O7J242P19M59p07O79j04
1582B064j424n30j345m04o99J24Q76o4L24J027k53N68Q17o39q08R88n30n49K51
1601b06Q66j85n2J331m09O17K91n31j000p53l70j640m51l30K1O9K53J235K56L93
1621e95J009M57J004o0L07p72p55k76K11J63k79M21L73p58M42K13l94p75j542
1640a606K52j227L72k86O62n31J456J534k91J64J406m94O99J9j15j350m60l42
1658a38m66n74R9J102l38L82L43K53p29L08j99m17k85M00m38n69K63Q60N96N15
1678I68K95J57Q0J47n60j207Q4j044l55n36j66J490k65O75N54J84p8M85P81o09
$$ plain form
1698 1080 704 420 188 452 257 -273 -173 689 560 759 -322 246 -605 -413 -1193 -1513 -1724 -2425 -1544
1717 -1544 -1497 -1065 -817 288 176 735 1583 1218 1332 1258 250 114 133 129 -414 274 -949 20 -552 -38
1737 -38 -57 -543 -270 -875 -413 -702 -640 -940 -1521 -1042 -406 -310 755 1042 547 1282 460 428 456 836 500 129
1759 129 -450 -261 -674 -516 -271 79 31 194 -470 783 201 381 169 222 -152 -866 -955 -566 -908 -557 557
1780 557 -71 -753 222 -129 9 594 -72 512 -158 -1045 218 332 591 163 307 592 406 824 -409
1799 -409 971 -87 102 -1139 -178 -74 -337 -849 -585 -659 -694 -801 23 40 -414 -303 443 -207 -11 237
1819 237 995 9 0 226 181 152 -160 965 -322 239 257 -264 161 -503 -113 141 -681 -364 -524 -856 -508
1840 -508 -231 -296 -223 221 109 228 103 410 -10 -228 -142 147 240 141 424 -196 -126 195 -145 152 201 438
$$ packed form
1698A080l76k84k32K64j95n30J00Q62j29J99j081N68q51J92p80l20k11p01Q81
1717a544M7M32K48J105j12N59Q48l65J14p4j008j36J9mn43O88j223R69n72N14
1737c8j9m86K73o05M62k89O2l00n81M79O36R6J065K87m95P35q22l2K8L80l36l71
1759A29n79J89m13J58K45L50m8J63o64J253n82J80k12N3l74p14q9L89l42L51J114
1780E57o28o82R75l51J38N85o66N84o70q87J263J14K59m28J44K85j86M18j233
1799d09J380j058J89j241R61J04k63n12K64p4l5j07Q24J7m54J11P46o50J96K48
1819B37P58r86rK26m5k9l12J125j287N61J8n21M25o64L90K54q22L17j60l32L48
1840e08K77o5P3M44j12J19j25L07m20k18Q6K89R3r9K83o20P0L21l40K97M9K37
$$ plain form
1862 438 304 991 382 78 112 -303 137 -331 -1131 -325 525 -372 -1057 -75 -458 357 -366 -857 -491 -474 -397
1883 -397 590 217 851 942 1349 1865 864 1339 696 346 912 -192 -1511 -262 -354 -538 -1337 -620 -585 -209
1903 -209 -452 -487 183 -51 -650 -117 -366 -661 -615 -711 267 -135 275 841 642 697 615 819 344 334 -42 -841
1925 -841 -524 -1308 -1488 -732 108 -222 900 618 477 1525 763 -37 -880 -389 -9 -76 -1209 183 -495
1944 -495 85 650 -223 -101 -236 101 -94 -74 -182 317 495 -58 290 788 1147 907 1017 58 256 1010
1964 1010 -31 -117 150 -847 -1016 -1360 -1592 -415 -1187 12 -29 -431 -765 32 320 -444 754 -332 -166
1983 -166 -201 806 88 386 665 1191 832 992 233 1032 359 -112 -355 -1064 -940 -1449 -1438 -1992 -920 -121
2003 -121 -616 381 795 747 361 721 1007 251 210 162 148 175 15 429 282 -543 99 284 -17 -128 144 -53
$$ packed form
1862D38j34O87o09l04L4m15M40m68q00Q06Q50q97o85R82l83Q15p23m91L66J7P7
1883c97R87l73O34R1M07N16j001M75o43l50N66j104j319J249r2j84p99P17L5L76
1903b09k43l5O70k34n99N33k49k95M6r6R78m02M10N66j99N5q2K04m75j0l76p99
1925h41L17p84j80P56Q40l30J122k82j41J048p62q00q43M91L80o7j133J392o78
1944d95N80N65q73J22j35L37j95K0j08M99J78n53L48M98L59k40J10r59J98P54
1964A010j041q6K67r97j69l44k32J177p72J199m1m02l34P97K88p64J198j086J66
1983a66l5J007p18K98K79N26l59J60p59P99o73m71k43p09J24n09J1n54J072P99
2003a21m95R97M14m8l86L60K86p56m1m8j4K7j60M14j47q25O42J85l01j11K72j97
$$ plain form
2025 -53 -633 -1484 -62 -479 217 196 -367 -170 614 872 144 69 517 -153 -1079 -725 -531 -153 -974 114
2045 114 -588 -663 239 138 -152 456 338 215 -275 617 340 73 -374 681 -12 -43 -555 -103 -398 60
2065 60 -288 -153 -168 270 -1295 -820 -1137 -1140 -353 -937 406 365 205 396 1590 471 1017 588 -128 898
2085 898 383 69 755 270 -128 -310 -643 38 -331 -222 -88 -345 -1252 -1797 -489 -11 -496 -72 630 366
2105 366 -600 -168 -208 483 65 503 844 -359 579 -349 -536 -770 -679 443 534 -224 -113 475 -586 325
2125 325 696 -62 186 -827 -298 -341 -1379 -1215 -1253 -1144 -599 -512 -256 -959 84 500 149 -744 415 576
2145 576 197 584 1136 -47 -176 232 42 306 318 -16 -485 656 -230 -138 -153 -222 -1078 -661 -870 7 -470
2166 -470 -1365 -566 -352 26 1031 1076 230 662 1070 1189 -315 -226 -398 -354 -146 -652 152 -191 333 -1568
$$ packed form
2025e3n80q51J422m17O96k1n63J97P84K58p28p5M48o70r26L54J94L78q21J088
2045A14p02p5R02j01k90O08j18j23m90Q92k77k67m47J055o93l1n12M52k95M58
2065F0l48J35j5M38j565M75l17lP87n84J343m1j60J91J194j119N46m29p16J026
2085H98n15l14O86m85l98j82l33O81l69J09J34k57r07n45J308M78m85M24P02k64
2105C66r66M32m0O91m18M38L41j203R38r28j87k34R1J122R1p58J11N88j061R11
2125C25L71p58K48j013N29m3j038J64l8J09N45Q7K56p03J043M16l51q93J159J61
2145E76l79L87N52j183j29M08j90K64J2l34m69J141q86R2j5o9q56M17k09Q77m77
2166d70q95P99K14L78J005M5q46M32M08J19j504Q9j72M4K08n06Q04l43N24j901
$$ plain form
2186 -1568 -41 302 539 338 -422 -422 -35 -267 -777 -112 -163 -170 -203 228 235 436 294 567 5 -499 -511 -1161
2208 -1161 -1476 -628 -571 -456 43 688 283 736 -25 581 205 -1061 1014 505 -104 -142 -31 -57 211 400
2228 400 143 583 209 -21 -1130 -1821 -1153 -730 -2042 -1877 -1982 -403 19 596 1730 1836 3284 2087
2246 2087 2311 2152 982 297 -1029 -1135 -1475 -1605 -2303 -1731 -1101 -530 -8 -754 12 -806 -401 19 -57
2265 -57 -542 529 204 -130 426 964 1139 2049 1612 1222 1170 324 -930 -765 -752 -1302 -1763 -1478 -1538 -906 -570
2286 -570 777 642 323 476 729 82 894 324 -227 -377 -854 243 961 574 684 1576 1401 267 107
2305 107 -281 -1207 -1401 -2355 -1854 -2163 -984 -823 276 1207 1788 2439 2365 2362 1525 400 -77 -601 -1569 -851
2325 -851 -1772 -2198 -869 -814 -287 7 -397 -931 -209 -593 -682 -210 -918 -762 -216 -448 575 1464 1597 2948
$$ packed form
2186a568J527L43K37k01p60%L87k32n10O65n1pl3M31PK01j42K73n62n04j2o50
2208a161l15Q48N7J15M99O45m05M53p61O06l76j266K075n09o09l8J11k6K68J89
2228D00k57M40l74k30j109o91O68M23j312J65j05J579M22N77J134J06J448j197
2246B087K24j59j170o85j326j06l40j30o98N72O30N71N22p46P66q18M05M20p6
2265e7m85J071l25l34N56N38J75R10m37l90n2q46j254J65J3n50m61K85o0O32L36
2286e70J347j35l19J53K53o47Q12n70n51j50m77J097P18l87J10Q92j75j134j60
2305A07l88r26j94r54N01l09J179J61J099R31N81O51p4lq37j125m77n24r68P18
2325h51r21m26J329N5N27K94m04n34P22l84q9M72p08J56N46k32J023Q89J33J351
$$ plain form
2345 2948 2816 1950 349 944 -405 -1151 -1170 -2148 -2560 -3189 -2125 -2363 -1511 -749 550 1156 935 1138 656
2364 656 440 336 499 41 -54 611 309 583 1207 1366 2061 691 541 216 -929 -1585 -2604 -2466 -3118
2383 -3118 -1566 -1146 -116 -106 979 1528 2023 2020 1540 2019 1094 621 -363 -436 -883 -886 -831 -610 -467 62 270
2404 270 53 -67 -66 -331 -1335 -1533 -1159 -1342 -442 -207 979 1640 2044 2554 1921 2268 1926 698 -211 -348
2424 -348 -1591 -2172 -2757 -2630 -2583 -1466 -246 -305 989 1061 802 560 1246 -157 70 22 -183 1064 1201
2443 1201 1272 868 1832 1263 1238 572 -199 -241 -1557 -939 -2295 -2130 -2516 -1699 -781 -828 597 721 936 810
2463 810 1788 972 624 -89 71 151 -360 -118 -184 -199 67 342 213 760 226 -406 -288 79 -1259 -1251 -1372
2484 -1372 -1238 -1299 -535 -454 298 752 1939 1315 1249 1045 928 508 -258 -1276 -468 -970 -947 -693 -387 23
$$ packed form
2345B948j32q66j601N95j349p46j9r78m12o29J064k38Q52P62J299O06k21K03m82
2364F56k16j04J63m58r5O65l02K74O24J59O95j370j50l25j145o56j019J38o52
2383c118J552M20J030J0J085N49M95lm80M79r25m73r84p3m47lN5K21J43N29K08
2404B70k17j20Jk65j004j98L74j83R00K35J186O61M04N10o33L47l42j228r09j37
2424c48j243n81n85J27M7J117J220n9J294P2k59k42O86j403K27m8k05J247J37
2443A201P1m04R64n69k5o66p71m2j316O18j356J65l86Q17R18m7J425J24K15j26
2463H10R78q16l48p13J60Q0n11K42o6j5K66K75j29N47n34o32J18L67j338Qj21
2484a372J34o1P64Q1P52M54J187o24o6k04j17m20p66j018Q08n02K3K54L06M10
$$ plain form
2504 23 -96 451 582 174 721 -189 -48 -101 -759 215 385 256 413 1050 169 617 80 740 903 -89 -237
2525 -237 -479 -1435 -790 -517 -1104 -303 -56 769 -28 984 697 555 697 408 678 75 503 -316 -35 201
2545 201 -324 -592 249 -905 -308 -130 -100 -984 -227 -655 -1038 -758 -962 603 21 -41 546 600 768 98
2565 98 208 -132 376 702 234 352 527 79 -758 730 105 -275 -390 802 -469 -1115 -455 -963 -498
2584 -498 -1434 -141 -746 -247 111 -265 -120 419 347 719 151 753 937 170 -17 -594 951 -659 238
2603 238 -773 -680 -440 -777 503 -501 387 210 1337 -853 497 -816 -756 -1138 -907 -946 -269 81 -101
2622 -101 -754 -428 242 -484 406 -71 316 1387 1478 1431 8 199 132 -580 -1484 -1052 -1146 -542 -1287 -1209 246
2643 246 -468 285 301 108 -350 -869 -267 -390 27 -1046 -210 179 -142 -376 235 -535 853 427 -585
$$ packed form
2504B3j19N47J31m08N47r10J41n3o58R74J70j29J57O37q81M48n37O60J63r92j48
2525b37k42r56O45K73n87Q01K47Q25p97J012k87j42J42k89K70o03M28q19K81K36
2545B01n25k68Q41j154N97J78L0q84P57m28l83K80k04J565n82o2N87N4J68o70
2565I8J10l40N08L26m68J18J75m48q37J488o25l80j15J192j271o46O60n08M65
2584d98r36J293o05M99L58l76J45N39p2L72n68O02J84p67j87n77J545j610Q97
2603B38j011R3K40l37J280j004Q88j77J127k190J350j313O0l82K31l9O77L50j82
2622a01o53L26O70p26Q90m77L87J071R1m7j423J91o7p12r04M32r4O04p45P8J455
2643B46p14P53J6j93m58n19O02j23M17j073Q36L89l21k34O11p70J388m26j012
$$ plain form
2662 -585 -185 -1145 -1223 -585 -628 297 -5 508 155 -290 312 -400 641 235 -285 -866 -416 -407 -645 -675 -852
2683 -852 -866 -1076 -756 -610 271 -601 -535 -80 -355 -248 -117 7 546 -114 87 1217 785 360 342 892 488
2704 488 -105 1243 -1352 -1583 -1108 -1497 -808 -623 334 432 691 -75 566 58 -408 -251 -813 -857 -1006 -1014 79
2725 79 889 496 1290 1658 1516 1909 749 103 -105 -284 -569 -1685 -1347 -1150 -204 -456 -1314 -608 -836 -73
$$ packed form
2662e85M00r60p8O38m3R25l02N13l53m45O02p12J041m06n20n81M50Rk38l0j77
2683h52j4k10L20J46Q81q72O6M55k75J07J31J24N39o60K01J130m32m25j8N50m04
2704D88n93J348k595k31M75l89O89J85R57R8K59p66O41n08m66J57n62m4j49qJ093
2725G9Q10l93P94L68j42L93j160o46k08j79k85j116L38J97R46k52q58P06k28P63
$$ [...]
8191A84
##END NTUPLES=NMR FID
##END=
