##TITLE=1H_Pr 5076
 CDCl3
 8 sc, 
 9.12.2021
##JCAMPDX= 6.0         $$ Bruker NMR JCAMP-DX V2.0
##DATA TYPE= NMR FID
##DATA CLASS= NTUPLES
##ORIGIN= UXNMR, Bruker Analytische Messtechnik GmbH
##OWNER= root
$$ XWIN-NMR		Version 3.5
$$ Thu Dec  9 13:55:48 2021 Russian Standard Time (UT+4h)  she@DPX200
##.OBSERVE FREQUENCY= 200.131346
##.OBSERVE NUCLEUS= ^1H
##.DELAY= (6, 6)
##.ACQUISITION MODE= SIMULTANEOUS
##.ACQUISITION SCHEME= undefined
##.AVERAGES= 8
##.DIGITISER RES= 18
##SPECTROMETER/DATA SYSTEM= spect
##.PULSE SEQUENCE= zg30
##.SOLVENT NAME= CDCl3
##.SHIFT REFERENCE= (INTERNAL, CDCl3, 0, 15.7039)
##AUDIT TRAIL= $$ (NUMBER, WHEN, WHO, WHERE, WHAT)
$$ ##TITLE= Audit trail, XWIN-NMR		Version 3.5
$$ ##JCAMPDX= 5.01
$$ ##ORIGIN= Bruker BioSpin GmbH
$$ ##OWNER= she
$$ F:/spectra/data/she/nmr/H-F/1/audita.txt
$$ ##AUDIT TRAIL=  $$ (NUMBER, WHEN, WHO, WHERE, WHAT)
(   1,<2021-12-09 13:55:07.90 +0400>,<she>,<DPX200>,
      <created by zg, POWCHK disabled, PULCHK disabled
       configuration hash MD5:
       00 E9 B6 7A A2 85 ED C7 34 08 36 98 17 FE 4E 26
       data hash MD5: 16K
       E2 F4 38 8A F0 4B 5D FC FE 9D 21 52 C2 93 9D D7>)
$$ ##END=
$$ 
$$ hash MD5
$$ 3C 6C E2 F6 57 2E 7E F0 E7 D8 A8 F7 31 ED 63 EA
##$RELAX= 
##$RELAX= 
##$RELAX= 
##$RELAX= 
##$RELAX= 
##$RELAX= 
$$ Bruker specific parameters
$$ --------------------------
##$DU= <F:/spectra>
##$EXPNO= 1
##$NAME= <H-F>
##$PROCNO= 1
##$TYPE= <nmr>
##$USER= <she>
##$AMP= (0..31)
100 100 100 100 100 100 100 100 100 100 100 100 100 100 100 100 100 100 
100 100 100 100 100 100 100 100 100 100 100 100 100 100 
##$AQSEQ= 0
##$AQ_mod= 1
##$AUNM= <au_zg>
##$AUTOPOS= <>
##$BF1= 200.13
##$BF2= 200.13
##$BF3= 200.13
##$BF4= 200.13
##$BF5= 200.13
##$BF6= 200.13
##$BF7= 200.13
##$BF8= 200.13
##$BYTORDA= 1
##$CFDGTYP= 0
##$CFRGTYP= 5
##$CHEMSTR= <none>
##$CNST= (0..31)
1 1 145 1 1 1 1 1 1 1 1 1 1 1 1 1 1 1 1 1 1 1 1 1 1 1 1 1 1 1 1 1 
##$CPDPRG= <>
##$CPDPRG1= <>
##$CPDPRG2= <>
##$CPDPRG3= <>
##$CPDPRG4= <mlev>
##$CPDPRG5= <mlev>
##$CPDPRG6= <mlev>
##$CPDPRG7= <mlev>
##$CPDPRG8= <mlev>
##$CPDPRGB= <>
##$CPDPRGT= <>
##$D= (0..31)
0 1.2 0 0 0 0 0 0 0 0.06 0 0.03 0 0 0 0 0.0002 0 0 0 0 0 0 0 0 0 0 0 0 
0 0 0 
##$DATE= 1639043707
##$DBL= (0..7)
120 120 120 120 120 120 120 120 
##$DBP= (0..7)
150 150 150 150 150 150 150 150 
##$DBP07= 0
##$DBPNAM0= <>
##$DBPNAM1= <>
##$DBPNAM2= <>
##$DBPNAM3= <>
##$DBPNAM4= <>
##$DBPNAM5= <>
##$DBPNAM6= <>
##$DBPNAM7= <>
##$DBPOAL= (0..7)
0.5 0.5 0.5 0.5 0.5 0.5 0.5 0.5 
##$DBPOFFS= (0..7)
0 0 0 0 0 0 0 0 
##$DE= 6
##$DECBNUC= <off>
##$DECIM= 32
##$DECNUC= <off>
##$DECSTAT= 4
##$DIGMOD= 1
##$DIGTYP= 9
##$DL= (0..7)
0 120 120 120 120 120 120 120 
##$DP= (0..7)
150 150 150 150 150 150 150 150 
##$DP07= 0
##$DPNAME0= <>
##$DPNAME1= <>
##$DPNAME2= <>
##$DPNAME3= <>
##$DPNAME4= <>
##$DPNAME5= <>
##$DPNAME6= <>
##$DPNAME7= <>
##$DPOAL= (0..7)
0.5 0.5 0.5 0.5 0.5 0.5 0.5 0.5 
##$DPOFFS= (0..7)
0 0 0 0 0 0 0 0 
##$DQDMODE= 0
##$DR= 18
##$DS= 0
##$DSLIST= <SSSSSSSSSSSSSSS>
$$ [...]
##$SUBNAM2= <"">
##$SUBNAM3= <"">
##$SUBNAM4= <"">
##$SUBNAM5= <"">
##$SUBNAM6= <"">
##$SUBNAM7= <"">
##$SUBNAM8= <"">
##$SUBNAM9= <"">
##$SW= 18.0517287032376
##$SWIBOX= (0..15)
0 0 2 0 0 0 0 0 0 0 0 0 0 0 0 0 
##$SW_h= 3612.71676300578
##$TD= 16384
##$TD0= 1
##$TE= 0
##$TE2= 300
##$TE3= 300
##$TEG= 300
##$TL= (0..7)
0 120 120 120 120 120 120 120 
##$TP= (0..7)
150 150 150 150 150 150 150 150 
##$TP07= 0
##$TPNAME0= <>
##$TPNAME1= <>
##$TPNAME2= <>
##$TPNAME3= <>
##$TPNAME4= <>
##$TPNAME5= <>
##$TPNAME6= <>
##$TPNAME7= <>
##$TPOAL= (0..7)
0.5 0.5 0.5 0.5 0.5 0.5 0.5 0.5 
##$TPOFFS= (0..7)
0 0 0 0 0 0 0 0 
##$TUNHIN= 0
##$TUNHOUT= 0
##$TUNXOUT= 0
##$USERA1= <user>
##$USERA2= <user>
##$USERA3= <user>
##$USERA4= <user>
##$USERA5= <user>
##$V9= 5
##$VALIST= <valist>
##$VCLIST= <CCCCCCCCCCCCCCC>
##$VD= 0
##$VDLIST= <DDDDDDDDDDDDDDD>
##$VPLIST= <PPPPPPPPPPPPPPP>
##$VTLIST= <TTTTTTTTTTTTTTT>
##$WBST= 1024
##$WBSW= 4
##$XGAIN= (0..3)
0 0 0 0 
##$XL= 0
##$YL= 0
##$YMAX_a= 40747
##$YMIN_a= -61053
##$ZGOPTNS= <>
##$ZL1= 120
##$ZL2= 120
##$ZL3= 120
##$ZL4= 120
##$ABSF1= 10
##$ABSF2= 0
##$ABSG= 5
##$ABSL= 3
##$ALPHA= 0
##$AQORDER= 0
##$ASSFAC= 0
##$ASSFACI= 0
##$ASSFACX= 0
##$ASSWID= 0
##$AUNMP= <proc_1d>
##$AZFE= 0.1
##$AZFW= 0.1
##$BCFW= 1
##$BC_mod= 2
##$BYTORDP= 1
##$COROFFS= 0
##$CY= 11.3945322036743
##$DATMOD= 1
##$DC= 2
##$DFILT= <>
##$DTYPP= 0
##$F1P= 2.36226072786647
##$F2P= -0.459571619588291
##$FCOR= 0.5
##$FTSIZE= 0
##$FT_mod= 4
##$GAMMA= 1
##$GB= 0.15
##$INTBC= 1
##$INTSCL= 1
##$ISEN= 128
##$LB= 0.24
##$LEV0= 0
##$LPBIN= 0
##$MAXI= 10000
##$MC2= 0
##$MEAN= 0
##$ME_mod= 0
##$MI= 1.114404
##$NCOEF= 0
##$NC_proc= 0
##$NLEV= 6
##$NOISF1= 3.799351
##$NOISF2= 2.8
##$NSP= 1
##$NTH_PI= 0
##$NZP= 0
##$OFFSET= 15.70392
##$PC= 1
##$PHC0= -15508.53
##$PHC1= 3.0008
##$PH_mod= 1
##$PKNL= yes
##$PPARMOD= 0
##$PSCAL= 0
##$PSIGN= 0
##$REVERSE= no
##$SF= 200.130013532006
##$SI= 16384
##$SIGF1= 3
##$SIGF2= 2
##$SINO= 400
##$SIOLD= 16384
##$SREGLST= <1H.CDCl3>
##$SSB= 0
##$STSI= 0
##$STSR= 0
##$SW_p= 3612.71676300578
##$SYMM= 0
##$S_DEV= 0
##$TDeff= 0
##$TDoff= 0
##$TI= <>
##$TILT= no
##$TM1= 0
##$TM2= 0
##$TOPLEV= 0
##$USERP1= <user>
##$USERP2= <user>
##$USERP3= <user>
##$USERP4= <user>
##$USERP5= <user>
##$WDW= 1
##$XDIM= 8192
##$YMAX_p= 0
##$YMIN_p= 0
$$ End of Bruker specific parameters
$$ ---------------------------------
##NTUPLES= NMR FID
##VAR_NAME=  TIME,          FID/REAL,        FID/IMAG
##SYMBOL=    X,             R,               I
##VAR_TYPE=  INDEPENDENT,   DEPENDENT,       DEPENDENT
##VAR_FORM=  AFFN,          ASDF,            ASDF
##VAR_DIM=   8192,          8192,            8192
##UNITS=     SECONDS,       ARBITRARY UNITS, ARBITRARY UNITS
##FACTOR=    0.0002768,     1,               1
##FIRST=     0,             0,               0
##LAST=      2.2672688,     0,               0
##MIN=       0,             -61053,          0
##MAX=       2.2672688,     40747,           0
$$ Real data points
##PAGE= N=1
##DATA TABLE= (X++(R..R)), XYDATA
0@%%%%%%%%%%%%%%%%%Qj6J6j6J6j6K4l2L2m0M8n6O4p2Q0q8J04j20J36j52J68j86
$$ 0 0 0 0 0 0 0 0 0 0 0 0 0 0 0 0 0 0 8 -8 8 -8 8 -8 16 -16 16 -24 24 -32 32 -40 40 -48 56 -64 72 -80 88 -98
39i8K10k35K59k88L20l54L91m32M78n26N80o40P05p76Q55r44J044j158J287j436
$$ -98 112 -123 136 -152 168 -186 205 -227 251 -275 305 -335 370 -406 449 -495 549 -609 678 -758
59g58J611j819K070k380K780l313M060n195P158j1494M1209l1599m9846O5341
$$ -758 853 -966 1104 -1276 1504 -1809 2251 -2944 4214 -7280 33929 2330 -47516 17825
73A7825J9006l4364j5509J9455q391m619J1847j337k1184Q021J7995q882k2358
$$ 17825 36831 2467 -13042 6413 -1978 -6597 5250 3913 -17271 -9250 8745 -137 -22495
86b2495R608K4875j563k5260m204K0266J2654r953p953j18K748O123Q651o401
$$ -22495 -12887 11988 10425 -14835 -19039 1227 13881 3928 -4025 -4143 -1395 4728 13379 6978
100F978j2158L858J0280l623l013L072m937n834Q319L475j1832o77J2117m416
$$ 6978 -5180 -1322 8958 5335 2322 5394 457 -5377 2942 6417 -5415 -6092 6025 1609
114A609j3285L408J2306J016r135p550L778J1875J457r981j474O279j171N46Q147
$$ 1609 -11676 -8268 4038 5054 -4081 -11631 -7853 4022 5479 -4502 -5976 303 -868 -322 7825
129G825l057j0752P282J0863q913p256J2593K692j6348j232J5771j434j4815M
$$ 7825 4768 -5984 1298 12161 3248 -4008 8585 11277 -5071 -6303 9468 8034 -6781 -6777
143f777R311k741p287K968N167k609n520R27O103K102k248j955m90J513N940L721
$$ -6777 2534 -207 -7494 -4526 641 -1968 -7488 -6561 -458 1644 -604 -2559 -3049 -1536 4404 8125
159H125q187n168R936N654r280l006P780m27p157J576K412k862J365J345p542
$$ 8125 -62 -5230 4706 10360 1080 -1926 5854 5427 -1730 -154 2258 -604 761 2106 -5436
174e436k311J0247K042j0823k279R016J988n921k59M360N38k387n0J961K232p14
$$ -5436 -7747 2500 4542 -6281 -8560 456 2444 -3477 -3736 624 1162 -1225 -1275 686 2918 2204
190B204k668l01K758Q04n15j169j594M32L288p88l817P08K743j295k496J326Q25
$$ 2204 -464 -765 1993 2797 2282 1113 -481 -49 3239 2451 -1366 -658 2085 790 -1706 -380 445
207D45j294k40j047m13K246R02k959n42K387l33n55K474l97l183J989L366j073
$$ 445 -849 -1089 -2136 -2549 -303 599 -2360 -2902 -515 -848 -1403 1071 674 -2509 -520 2846 1773
224A773j968J402M68m19J454l24k816J270L056k349l923K060L213k296l023j48
$$ 1773 -195 1207 1675 1256 2710 2386 -430 840 3896 1547 -2376 -316 2897 601 -2422 -2570
240b570J589P94j99k250j597K342K813j424k389L45L316R62j954j177K845J861
$$ -2570 -981 -187 -386 -2636 -4233 -1891 922 -502 -2891 -2546 770 1732 -222 -1399 1446 3307
256C307k137j455K006P30r79K29l03j557R63J825k391j993J648Q54k095m60J627
$$ 3307 1170 -285 1721 2451 1472 1701 1398 -159 804 2629 238 -1755 -107 747 -1348 -1808 -181
273a81j509j261J513M30r32k2J132j23K44P07l18L80J251N8j058R42Q75k53m79
$$ -181 -1690 -2951 -1438 -1008 -1940 -1962 -830 -953 -709 -2 -320 60 1311 1369 311 1253 2128 1875 1396
292A396L1k86O04L32j470j192Q07O25j366j069O74l38j73k42m09m2P13O5l03L35
$$ 1396 1427 1141 1745 2077 607 -585 222 847 -519 -1588 -914 -1252 -1425 -1667 -2076 -2118 -1405 -1340 -1643 -1308
312a308P19P3M24M15j03R19P14l70l57J135o2n30k67O12q19j061Q52J10j660m41
$$ -1308 -589 -516 -92 323 220 1139 1853 1483 1126 2261 2199 1669 1402 2014 1195 134 986 1096 -564 -1005
332a005N45n71q89M01lp66L64N70m36kQ02M12K93J94M90N23L62J97Q4K05K90k71
$$ -1005 -460 -1031 -1920 -1519 -1522 -2288 -1924 -1354 -1790 -1792 -990 -578 -285 -91 399 922 1284 1481 1565 1770 2060 1789
354A789P9m1q17j5M56p28r06P7m41k11l80p8n23l25O33r1o66L30O05M50n2L72
$$ 1789 1868 1827 1010 995 1451 723 -183 -106 -547 -758 -1138 -1216 -1739 -2064 -1431 -1522 -2188 -1858 -1253 -803 -855 -483
376d83L40O97N09m6J51K78M51Q9k07m20J90O6k78l55o86j38n9q33l78Q8o5m47
$$ -483 -143 554 1063 1017 1168 1446 1897 1986 1779 1359 1549 1615 1337 982 296 158 99 -734 -1112 -1024 -1089 -1536
398a536l4J69k63K36k20M14R95k86l57P86N67N65k68K32M92J93J32l79k76L38
$$ -1536 -1570 -1401 -1664 -1428 -1648 -1234 -239 -525 -882 -96 471 1036 768 1000 1492 1685 1817 1438 1162 1500
418A500O53r01j017q8K54Q3q57j128j39J005o3j002j130J032J264l47q20L01J224
$$ 1500 2153 1252 235 147 401 484 -373 -1501 -1640 -635 -698 -1700 -2830 -1798 -534 -881 -1701 -1400 -176
437a76O44l44k14M47O48P02l72j24m87R82O52p45j874P65J260o53j581m81M13
$$ -176 468 124 -90 357 1005 1707 1335 1211 724 1706 2358 1613 -261 504 1764 1111 -470 -951 -538
456e38M14k62j254j72O24L02m99J20J09k97M02J193l33j136J398J570k12j607
$$ -538 -124 -386 -1640 -1812 -1188 -886 -1385 -1265 -1156 -1453 -1051 142 -191 -1327 71 1641 1429 -178
474a78N62J438K72j129j76O29l66k22r2K89j288p56J079M73j624q97J055P02q52
$$ -178 384 1822 2094 965 789 1418 1052 830 738 1027 -261 -1017 62 535 -1089 -1986 -931 -229 -1081
493a081n18L9N41K56J22j52M7O44N33L8K46l76J10J536M13j837j036J917J504
$$ -1081 -1599 -1560 -1019 -763 -641 -793 -746 -102 431 469 715 339 449 1985 2398 561 -475 1442 2946
512B946j829j795L61J483l03j647m83N04P30n65n43o95J36P97O80r25j476J485
$$ 2946 1117 -678 -317 1166 863 -784 -1267 -763 -33 -598 -1141 -1836 -1700 -903 -223 -1148 -2624 -1139
530a139K683q72k481N25K991P32j857j205J718J092p02j098M53N43o36j93L81
$$ -1139 1544 672 -1809 -1284 1707 2439 582 -623 1095 2187 1485 387 840 1383 747 554 935
547I35j119n93R43M64j791j240J601J112j557q75R27P10k72J26R0J38N03N8L66
$$ 935 -184 -777 166 630 -1161 -2401 -800 312 -1245 -2120 -1193 -483 -755 -629 -539 -401 102 160 526
566E26M3M65l73J2P40j56o42L81O01q98n73L52N32q90j220L26R97m43j572M90
$$ 526 569 1034 661 673 1413 1257 615 996 1597 699 126 478 1010 120 -1100 -774 223 -220 -1792 -1302
586a302J275j235r86J619Q64q79p59R26Q34m73M72O08n15k35J305L00r70o10Q69
$$ -1302 -27 -1262 -2248 -629 235 -644 -1403 -477 357 -116 356 964 449 214 1519 1819 849 239 1108
605A108O39p33q90k6J065l11j809J42R74j50r99r65O30M95L20n49m04J68Q71K42
$$ 1108 1747 1014 124 98 1163 852 -957 -815 159 9 -990 -1955 -1325 -830 -510 -1059 -1463 -1295 -424 -182
625a82K63r3k7N69K69M9O4J06N20m89k36J81o5m10J41m26n50M81k96n03J2k72
$$ -182 81 -12 -39 530 799 848 912 1018 1538 1049 813 994 929 519 660 234 -316 165 -131 -634 -622 -894
647h94n43J38J149n78j339P23J326j64p12N31N60j59L63M33M8m71O35l6k17j13
$$ -894 -1437 -1299 -150 -728 -2067 -1344 -18 -182 -894 -363 197 38 401 834 882 411 1046 1010 793 680
667F80M52N0m98o26k0O23m80l58l02j3n8%j42m00l87N43N41m52k40K18N85J42
$$ 680 1132 1182 684 58 38 661 181 -177 -479 -492 -550 -550 -692 -1092 -1479 -936 -395 -847 -1087 -869 -284 -142
689a42L60o9J02L72N96k58k65M89L77l14p56r0K89K98m06q68l61K26K99n44m74
$$ -142 218 149 251 623 1219 961 696 1185 1562 1248 492 402 691 989 583 -285 -646 -420 -121 -665 -1139
710a139n5K04L77j48k69l9J000l27j56L31N60J41j20r4J03O18K60m78K8J44Mk23
$$ -1139 -1194 -990 -613 -761 -1030 -1069 -69 -396 -552 -221 339 480 360 266 369 987 1247 769 797 941 945 722
732G22j96l12R0j98K6m17k99P1J9m61L66j62m89L91L45k72Q4J70P11l74L9M84
$$ 722 526 214 304 106 132 -285 -584 -513 -494 -955 -589 -751 -1240 -849 -504 -776 -692 -522 189 -185 -146 338
754C38K53j85O02r3n39M77L9j22k31K0j2m49Q0l51ML6k67m34Q0K19j52N2l29J00
$$ 338 591 406 1008 915 376 853 892 770 539 559 547 98 178 -173 -169 -133 -400 -834 -754 -535 -687 -635 -964 -864
778h64M07J2j46J97J31L44M7J50L74K9J88p4M7k72L25r9l63O5j54k33m05M18n27
$$ -864 -457 -445 -591 -394 -263 81 128 278 652 681 869 795 842 570 895 796 433 498 344 111 -294 124 -403
801d03k88K67l65k3m12M74Rk0N3L03p3K49J40k5q3O88K3k4L20j77K45J24m41j3
$$ -403 -691 -424 -789 -812 -1224 -750 -741 -761 -708 -405 -478 -229 -89 -114 -197 491 514 490 810 633 878 1002 561 548
825E48j1K2o2k65%j77p52J38L3m21P0J10k29N8J86J46J02J20K53J89O9J33j80
$$ 548 537 559 497 232 232 55 -697 -559 -526 -947 -877 -767 -996 -938 -752 -606 -504 -384 -131 58 127 260 80
848H0J87N51l53K0M23k15J7Mj49j46p0J48l83l45N4K2l95k2P2k44k59K31K23j10
$$ 80 267 818 465 485 908 693 710 714 565 419 349 497 114 -231 -177 -155 -550 -572 -500 -744 -1003 -772 -549 -659
872f59j4M76R4j20J75j4J73K41K6J62K13o1J64j03q0n3m6J17m24l63J66j20k17
$$ -659 -673 -197 -103 -223 -48 -62 111 352 378 540 753 692 856 753 673 620 574 691 267 -96 70 -50 -267
895b67k39j85N1n2O2Q9m12J50K17J7J71K28N6P3L73L0O0o6M59j25J29k86J9J19
$$ -267 -506 -691 -640 -692 -630 -541 -953 -803 -586 -569 -398 -170 -114 -41 332 362 422 356 815 690 819 533 552 671
919F71l61J25j73k28j37m6J43n66j11LP7j40j30L41J82j71j43M03J41o8L75j69
$$ 671 310 435 262 34 -103 -149 -6 -572 -683 -680 -603 -743 -873 -532 -350 -521 -664 -261 -120 -188 187 18
941A8K29K61j09N7J28J37l54K94J16m21j38J99O0n13n6l7k25p8k33J10k26K95
$$ 18 247 508 399 456 584 721 367 661 777 356 218 417 477 -36 -92 -129 -354 -432 -665 -555 -781 -486
963d86k31j55M54j8M4J99J38n3K23K0M21Nj40K65N6R4k52P6Mj59j77k12P7k18
$$ -486 -717 -872 -418 -436 -392 -193 -55 -108 115 135 556 561 421 686 742 836 584 660 664 505 328 116 193 -25
987b5l32K14l10j81K4M46n47m25N26K47l7j32J36K02K24k67O54o7Q2N7J6J30R0
$$ -25 -357 -143 -453 -634 -610 -164 -711 -1136 -610 -363 -400 -532 -396 -194 30 -237 417 350 432 489 505 635 725
1010G25l14J74K09l80k78J70o7J2m90oQ0j19l22J49K24k59k47N60k40o0L2L68
$$ 725 411 585 794 414 136 306 239 251 -239 -245 -165 -284 -606 -457 -233 -492 -739 -179 -419 -479 -447 -79
1032g9K22l60J99J43N29j71j58N8R6J38O8p2j74j48k69J06K40n12m21M09M2n88
$$ -79 143 -217 -18 125 654 483 325 383 479 617 685 613 439 291 22 128 368 -144 -565 -156 -114 -702
1054g02O3J67L16l90j42K42M24j29m38N65n4J20K28J99j22l79P60K46o47j00L40
$$ -702 -639 -472 -156 -546 -688 -446 -22 -151 -589 -24 -78 42 270 469 347 -32 728 974 327 227 567
1075E67J70n53k60J21K37m05q5K7l58P9Qk67O9J11m8j7M45kk73L60J78K19j29
$$ 567 737 184 -76 45 282 -123 -208 -181 -539 -460 -452 -719 -650 -539 -587 -604 -159 -161 -434 -74 104 323 194
1098A94l8L07r3K9L23j15J52l38K4mj99L1J01m55l9k35j10K33l76M7R6j03o2L69
$$ 194 156 463 370 399 722 607 759 421 445 441 242 273 374 -81 -120 -355 -465 -232 -608 -561 -465 -568 -630 -261
1122b61j16K8L0J42P3PN68l48K03L50o7K9n9l7n1j13J18j97JL6j27j5l82j1j37
$$ -261 -377 -349 -319 -177 -104 -97 471 123 326 676 609 638 579 542 491 378 496 299 300 336 209 194 -188 -199 -336
1147c36p9j99R7KJ3o2L60r2J2K79p1J91nJ90Q7O0J5jM5R6k25l26L90j38o8J24
$$ -336 -415 -614 -517 -515 -502 -564 -204 -296 -284 -5 -76 115 110 300 387 447 462 461 506 602 377 51 441 303 235 359
1173C59l34J43n88J97r7k3lO9%l13j28L20M1R4l0K64K81l45M13J9J77j90j3o1
$$ 359 25 168 -420 -223 -320 -343 -346 -277 -277 -590 -718 -398 -357 -263 -293 -29 252 -93 320 339 516 326 313 252
1197B52K56O0q1L7k16j13R8p3k90L2j76n6m0j95O3j17J6L3K65k84L12J9j61M30
$$ 252 508 568 487 524 308 195 293 220 -70 -38 -214 -270 -310 -505 -442 -559 -543 -510 -245 -529 -217 -198 -359 71
1221G1L6N6J78J4mJ38J15l5q9j5k39K38j59q7K5l95J73O9k93j78j5j07J66J23
$$ 71 107 163 341 355 351 489 604 569 480 465 226 464 305 218 243 -152 21 90 -203 -381 -396 -503 -337 -214
1245b14Nj82J6J29k23J70L33k47J94L43j19K28j73M6J14J08j94j41J78j71J26
$$ -214 -209 -391 -375 -246 -469 -299 34 -213 -19 324 205 433 260 306 420 528 334 193 371 200 326
1266C26l09K1j6j99K20k89j37J21m1j67k11K49J85j86L15j00J17n6L31n3l0L07
$$ 326 17 38 22 -177 43 -246 -383 -262 -303 -470 -681 -432 -247 -433 -118 -218 -101 -157 174 121 91 398
1288C98L7k02K93j72j00q7J76k01k3J49k78p9j66J61J68k85q9n7m6J65k28J05
$$ 398 435 233 526 354 254 167 343 142 119 268 -10 -89 -255 -94 74 -211 -300 -357 -403 -238 -466 -361
1310c61K03K6K25m07L19J55L5nK55L3k61J23J6J42j71j42M1j61r4nj43L00k80
$$ -361 -158 -132 93 -314 5 160 195 190 445 478 217 340 356 498 327 185 226 65 -29 -34 -177 123 -157
1333a57j73Q3j99J50J63j82j68R4K50m2K07P7l38L02j01J57L36K7j61j06M1J08
$$ -157 -330 -247 -446 -296 -133 -315 -483 -389 -139 -181 26 103 -235 67 -34 123 459 486 325 219 260 368
1355C68Q0n6r7k45m8J08R1j01j70r9k12RQ4K8j00J89j47P0o8j6L9J84J13K03j76
$$ 368 448 392 295 50 2 110 201 100 -70 -169 -381 -372 -288 -260 -360 -171 -318 -248 -316 -332 -293 -109 4 207 31
1380C1N6M3K37N7K24m49O4O8J91k30p9j85n9p4m9R9j89J10j89M2J30j18R2j33
$$ 31 87 130 367 424 648 199 263 331 522 292 213 28 -31 -105 -154 -55 -244 -134 -323 -281 -151 -269 -177 -310
1404c10j48J59P7J00m1R2J23J35j11J78K27l74L57k32j5K70l45M6M2k51r6k2J21
$$ -310 -458 -299 -222 -122 -163 -71 52 187 76 254 481 107 464 232 217 487 142 188 230 -21 -117 -139 -18
1427a8j49j38R2q4M2j18J8K25J0k82K87N7p1K6K92j34M0K81J06M5r9rK3r0pl03
$$ -18 -167 -305 -213 -297 -255 -373 -355 -130 -120 -402 -115 -58 -129 -103 189 55 95 376 482 527 428 419 442 352 345 42
1453D2Q8J45l58R1k57J97n3j97n4l5J39j45K01o7j0J32K52m15N30l3j48L00k07
$$ 42 130 275 -83 8 -249 -52 -105 -302 -356 -391 -252 -397 -196 -263 -273 -141 111 -304 226 193 45 345 138
1476A38N0J71k41J03j43K11k36J32P9l66k0K08j96J02j10J79k20l33M37l41j91
$$ 138 188 359 118 221 78 289 53 185 264 -102 -122 86 -110 -8 -118 61 -159 -492 -55 -396 -587
1497e87K96M5O1rJ3J37M5k8J30K06k81L47J42k55R8j0k38j03K60k55J48p9k76
$$ -587 -291 -246 -185 -194 -181 -44 1 -27 103 309 28 375 517 262 360 350 112 9 269 14 162 83 -193
1520a93K75k66l41L16J8o3j80l8K24R7J9Q1K14k57J9MJ24L3r1J50K01j2j64J08
$$ -193 82 -184 -525 -209 -191 -254 -434 -472 -248 -151 -132 -51 163 -94 -75 -71 53 86 -5 145 346 334 170 278
1544B78j18J77k8j02J1j68k79k9K70j33j05j22j58K91j60J92L0J8j13LJ25J67
$$ 278 160 337 309 207 218 50 -229 -258 12 -121 -226 -348 -506 -215 -375 -183 -153 -135 -248 -245 -120 47
1566D7OJ7J93k72L71k24J02J42j62N1J50k38q2J34j20o1K7m87J51k2K9j02j8J27
$$ 47 53 70 263 -9 362 138 240 382 220 271 421 183 101 235 115 54 81 -406 -255 -277 -248 -350 -368 -241
1590b41J06j39O2R4K8l3J13j97K11L62j37J37o6j60Q6O5j3j32P8L2j37k98K89
$$ -241 -135 -274 -212 -118 -90 -123 -10 -207 4 366 229 366 300 140 226 291 278 146 224 256 119 -179 110
1613A10k03q0J53l28J29K0n4M2r6q6M1J53J04P8KJ01L6K76l23L7J46J40J27j84
$$ 110 -93 -173 -20 -348 -219 -199 -253 -211 -307 -393 -352 -199 -95 -17 -15 86 122 398 75 112 258 398 525 341
1637C41j4j34J2O3j93N5j84J68j55j17M0j20j51L93k00J30k09j18J19J2N9j53
$$ 341 327 193 205 268 75 130 -54 114 -41 -158 -118 -238 -389 4 -196 -66 -275 -393 -274 -262 -203 -356
1659c56L26k99M52r4K18m4j36L35j9j82k0J22p2j33q7j56M47j99k97k00L93m49
$$ -356 -30 -329 123 29 247 203 67 402 383 201 181 303 231 98 11 -145 302 103 -194 -394 -1 -450
1681d50K84n4J75k63J31M4j19J39N4K89j7R5k05J26j23L13r3K4j69J45K15m65
$$ -450 -166 -220 -45 -308 -177 -133 -252 -113 -59 230 213 308 103 229 106 419 326 350 181 326 541 76
1703G6J76k73o8K74j09m9J29k30m47J72J18o9L4r8K29j0o7m6N3K23J3J6L4J54
$$ 76 252 -21 -89 185 76 27 156 -74 -521 -349 -231 -300 -266 -364 -135 -145 -212 -258 -205 18 31 47 81 235
1727B35O8j26J76j60q9J89j60Q3l8j56O1j12j14n4J87k24K13m6n9l67M10J4k1
$$ 235 303 177 353 193 104 293 133 216 178 22 83 -29 -143 -197 -10 -234 -21 -67 -126 -493 -83 -69 -90
1750i0j39j76M91o0k07J95J85j18o0M35q2j68j27J06r4K26q1m11L12ok36J06k49
$$ -90 -229 -405 86 26 -181 14 199 81 21 456 374 206 79 185 91 317 236 -175 137 131 -105 1 -248
1773b48o5J08k0N3OK60l06rK07q7j26L40j50K67k4j32K17q0R7k49M4J87j29J23
$$ -248 -313 -205 -225 -172 -166 94 -212 -221 -14 -101 -227 113 -37 230 206 74 291 211 308 59 103 290 161 284
1797B84O4n60L52l42Q9K1j13J6k37o5M18j25p2J11j8J10k91K25J55n5K7J63O7
$$ 284 348 -212 140 -202 -113 -92 -205 -189 -426 -491 -73 -198 -270 -159 -177 -67 -358 -133 22 -33 -6 157 224
1820B24k49N37l87K91m05Q7j66K09j01r1k57J34K51j53K7j58K06l14K26k12k31
$$ 224 -25 512 125 416 11 98 -68 141 40 -51 -308 -174 77 -76 -49 -207 -1 -315 -89 -301 -532
1841e32O95m34K39o9J38J41m25N81l09J3L80k11or9J7K76k12n6K30k07O4r4j41
$$ -532 163 -271 -32 -101 37 178 -247 334 25 38 418 207 201 102 119 395 183 127 357 150 214 120 -21
1864b1n2p5m2Lk4L20l49Q2o8l8J49J65p8l9J15m2N5J61j90J59J0j16J34Lj01p8
$$ -21 -73 -148 -190 -187 -211 109 -240 -158 -226 -264 -115 50 -28 -67 48 6 61 222 32 191 201 85 219 222 121 43
1890D3Q7M8j35o9J33k67J89K1n4l6l45K31j50N6J59q2K25j31j2K44k2r2J76L0
$$ 43 130 178 43 -26 107 -160 29 50 -4 -40 -385 -154 -304 -248 -89 -171 54 -77 -89 155 133 41 217 247
1914B47J42k85Q6Q8J91l17K22j25k03Ok0K4l17J36J41r1k06l8J81J3j39L20l39
$$ 247 389 104 190 278 469 152 374 249 46 52 32 56 -261 -125 16 -75 -281 -319 -138 -125 -264 56 -283
1937b83K11J23k5oJ96j22j19J6p1L35r6J8k08R3m4j31K72l39K81K26m17J40K0
$$ -283 -72 51 26 20 216 94 -25 -9 -80 255 159 177 -31 62 18 -113 159 -180 101 327 -90 50 70
1960G0k49J0j21J24k49J22J38k00J87j68K28J33Q1l06L62P6j39o7rL4K27j10p4
$$ 70 -179 -169 -290 -166 -415 -293 -155 -355 -168 -336 -108 25 106 -200 162 238 99 32 23 57 284 174 100
1983A00j80M4K57k49Rj84j91K23O9j51j17k6L26j26J25N1j43o1K67j66K01K7n
$$ 100 -80 -36 221 -28 -19 -203 -394 -171 -102 -253 -370 -396 -70 -196 -71 -20 -163 -224 43 -123 78 105 100
2006A00k91M02J67k79K15m2o6k19l3O1K97j11m43K83j67O8K18j29k32J83o8N6
$$ 100 -191 211 378 99 314 272 206 -13 -46 15 312 201 -242 41 -126 -58 160 31 -201 -18 -86 -30
2028c0j37J74m23J96N8J45j7j37K81q4K01l44K01K80l78l3J60L10n55M0j1K59
$$ -30 -167 7 -416 -220 -162 -17 -34 -171 110 26 227 -117 84 364 -14 -47 113 423 -132 -92 -103 156
2050A56k61P2k69k1K32r5Q2k62L55j25J30r1J0Q1j9j4lJ13j00O4J85J3p5q2J83
$$ 156 -105 -33 -302 -323 -91 -186 -104 -366 -11 -136 -6 -97 -87 -6 -25 -39 -42 71 -29 35 220 233 158 76 259
2075B59J06j71k62L09l71K0j24K32p6p3J78j66N2j51L83j82J51j19j98J96J46
$$ 259 365 194 -68 241 -130 -110 -234 -2 -78 -151 27 -139 -87 -238 145 -37 114 -5 -203 -7 139
2096A39j42K2k21L10r2N2J00j19K89m34L04J24k96Q7J36k38j87K87J2l7j70N3
$$ 139 -3 19 -202 108 16 68 168 49 338 -96 208 332 36 123 259 21 -166 121 133 96 -74 -21
2118b1l6j70J39L8j27r4p6L27j39j00L85j20m3J72l59K02j03R9j47L69N9m74M75
$$ -21 -57 -227 -88 -50 -177 -271 -347 -20 -159 -259 126 6 -37 135 -224 -22 -125 -26 -173 196 255 -219 256
2141B56k04n6j0j8K65k32n1j32J4p7K49k63J86n1J08j93P3Q9m9N7j11K87r3K04
$$ 256 52 -4 -14 -32 233 1 -50 -182 -168 -245 4 -259 -73 -124 -16 -209 -136 -47 -96 -39 -150 137 44 248
2165B48O0jj56R0l1j11J46j71k48K09r8K21k31j70J77R8l23K95j95J73j11M1Q
$$ 248 308 307 151 241 210 99 245 74 -174 35 -63 158 -73 -243 -66 32 -291 4 -191 -18 -129 -88 -80
2188h0J41R6j99Q0m5M5m8L11j55q2J21P0Q7n0k85J43k33O8m6n2j78P5L82l60q8
$$ -80 61 157 -42 38 -7 38 -10 301 146 64 185 255 342 292 7 150 -83 -15 -61 -113 -291 -216 166 -194 -282
2213b82N1Q4k7L5mr1o6J65K07m8J92J0k50J80j25j09K43o3nN9o8p7Q6m0k47L4
$$ -282 -231 -147 -174 -139 -143 -234 -300 -135 72 24 216 226 -24 156 31 -78 165 102 97 156 88 11 97 57 -190 -156
2239a56J94j03J20K8j49k48K30k83N9J7K13R9o3j24L34l08J51P2J78k81J59j34
$$ -156 38 -65 55 83 -66 -314 -84 -367 -308 -291 -78 21 -42 -166 168 -140 11 83 261 -20 139 5
2261EP3O5o9J62j63q2K10j00m25K99j28p5N3mP7l7j60K66k09j0M09k97J00p7K16
$$ 5 78 143 74 236 73 -9 201 101 -324 -25 -153 -228 -175 -179 -102 -139 -299 -33 -242 -252 157 -140 -40 -117 99
2286I9P1o6pp7k5J31O5J02p3j70K56k63j01LJ8J00L8j59P2k02l02M58k88M22k79
$$ 99 170 104 97 20 -5 126 191 293 220 50 306 43 -58 -55 -37 63 101 -58 14 -188 -490 -32 -320 102 -177
2311a77L14k04K58J89n88M03l71K04rK01J06q5p6LJ19r9k07K89j80J99k90J4P9
$$ -177 137 -67 191 380 -208 195 -176 28 19 220 326 241 165 168 287 188 -19 270 90 289 -1 13 92
2334I2l01Q6J03r4j80J01K1J20j83J18J45k00K66j53k1j43K53k17J33K92j77q7
$$ 92 -209 -123 -20 -114 -294 -193 -172 -52 -235 -117 28 -172 94 -59 -80 -223 30 -187 -54 238 61 -26
2356b6M91l94O6j34q2L00k62L7M7k72J76oq9J98j71J35k12J71l2P3m10K76L55
$$ -26 465 71 137 3 -79 221 -41 -4 43 -229 -53 -59 -148 50 -121 14 -198 -27 -59 14 -396 -120 235
2379B35j28k82J90L8R8j95J60k9K36l33J13R8k16J90l10J75k21J04j76K45m4r5
$$ 235 107 -175 15 53 151 -44 116 87 323 -10 103 201 -15 175 -135 40 -181 -77 -253 -8 -52 -147
2401a47m7j5P2J15k87M05m50L24J2k03K98L4j84K75q6P7lO3oq7k3l56L81j96L2
$$ -147 -194 -209 -137 -22 -309 96 -354 -30 -18 -221 77 111 -73 202 116 193 190 253 247 160 137 -219 162 -34 -2
2426bj67m5j61L29j3j28r0J09n1oK47kn9M7J32J77l45K38k00J58J67k46M6j86
$$ -2 -169 -214 -375 -46 -59 -187 -277 -168 -219 -225 22 20 -39 8 140 317 -28 210 10 168 335 89 135 -51
2450e1J75k1k4k29K46o4K2r9L5M0l23K66l22K61j62J36J62n1Q5N1n2j26J20K0
$$ -51 124 103 79 -150 96 32 54 -45 -10 30 -293 -27 -349 -88 -250 -114 48 -3 82 133 81 -45 75 95
2474I5l65N12j64k3J87k62j19L49J5j06r7J47ol53J63n6nJ31k07J10j28J8Q3l7
$$ 95 -270 242 78 55 242 -20 -139 210 225 119 22 169 163 -190 -27 -83 -88 43 -164 -54 -182 -164 -81 -118
2498a18J77r3j15J3J83MK6K9o1M4k34K78J24k7j31K65l08j93K08j21q5J58l4O
$$ -118 59 -34 -149 -136 47 51 77 106 45 89 -145 133 257 230 99 364 56 -137 71 -50 -135 23 -11 -5
2522eJ2p2j52K43p8r1q4q8K31J87j13J08p9o4J16m4j27J86l2J32j36n1J27k6j87
$$ -5 7 -65 -217 26 -52 -143 -227 -315 -84 103 -10 98 19 -45 71 27 -100 86 54 186 50 -1 126 100 -87
2547h7n5J44N0J44j28l1p4j68n0J20J49j76P4J79l91J25L07pm03K18K18R1j90
$$ -87 -142 2 52 196 68 37 -37 -205 -255 -135 14 -162 -88 91 -300 -175 132 125 -278 -60 158 249 59
2570E9M1J60k76J7K41ok79p8Q3K38k88J5%M9j72K8Q3k6M6m5K5jJ44k74K05p2K49
$$ 59 100 260 -16 1 242 236 -43 -121 -38 200 -88 -73 -73 -24 -196 -168 -85 -111 -65 -110 -85 -86 58 -216 -11 -83 166
2597A66j03Po3J99j80K51k09N3R8j5q3j45K34k61K48q5k44KK15p7n8Q6r4L9l7
$$ 166 63 70 7 206 26 277 68 121 219 204 121 -24 210 -51 197 112 -132 -130 85 8 -50 36 -58 -19 -56
2622e6K9q6M2j75K40j03K90Pk06K23k79J62J76j43Q9J55k54j70R6o4J50K4j53
$$ -56 -27 -113 -71 -246 -6 -109 181 188 -18 205 -74 88 264 121 210 365 111 -59 37 -27 123 147 -6
2645fJ97l67N4jJ0J10j31q1m4KJ16K08P1Qp7l5j62K12l9j7p8K28q1O1n0j44J21
$$ -6 191 -176 -122 -123 -113 -3 -134 -215 -259 -257 -141 67 138 146 69 34 -128 84 45 28 -50 178 97 158 108 -36 85
2672H5NL7k34J34m4n6j49K8R4O6m1jl8NP7j92K08L7k78J49rK27j81J39Q4L5j93
$$ 85 90 127 -107 27 -17 -73 -222 -194 -100 -34 -75 -76 -114 -109 -32 -224 -16 21 -257 -108 -117 110 -71 68 152 187 -6
2699fJ16on8K3j27L82j00k51j55P9L4k37J82q4J39n3J52j46O8J15k8j85K46k78
$$ -6 110 104 46 69 -58 324 224 -27 -182 -103 -69 -306 -124 -208 -69 -122 30 -116 -48 67 39 -146 100 -178
2723a78P5L62l08n3K93k50N2L6J09m3M9j13P6J63p16K78J35j15L4k26L91j46j24
$$ -178 -103 259 -49 -102 191 -59 -7 29 138 95 144 31 107 270 -446 -168 -33 -148 -114 -340 51 -95 -219
2746b19L50j65o5L4l9J44J3j41J17j54J56R8k21P1j42L44o2L1j24l8k0J54j56
$$ -219 131 -34 -99 -65 -104 40 53 -88 29 -125 31 129 -92 -21 -163 181 119 150 26 -12 -32 122 -34
2769c4j05o6K65k06NQ5q4LK2K0R9n3l2J7Q7n2K2R0m5M7N3k7k70K58q7N5n7J29
$$ -34 -139 -205 60 -146 -141 -56 -140 -137 -115 -95 4 -49 -81 -64 23 -29 -7 83 38 85 138 111 -159 99 12 67 10 139
2797A39l5j51l1J93p7m11K27l8J50j1j62J42l3NJ61p1O3j21K86J29m44K14j56
$$ 139 104 -47 -78 115 38 -373 -146 -184 -34 -45 -207 -65 -98 -93 68 -3 60 -61 225 354 -90 124 -32
2820c2K2NL06k59J96k35q0L57l07jK16k89J27K17l48J19M5k91J54n4K35k55K4
$$ -32 -10 -5 301 42 238 3 -77 280 -27 -28 188 -101 26 243 -105 14 59 -232 -78 -132 103 -152 -128
2843a28j07J50J06P7p6rl8L6oq0L8KR2j08J64K8k18L95j31k19p7M29l31k13L33
$$ -128 -235 -85 21 98 22 13 -25 11 5 -75 -37 -35 57 -51 113 141 -77 318 187 -32 -109 320 -11 -224 109
2868A09k62K52m92L07r0K37j44J52K07j40k02J20k17J06J65n3O4L35m94J65k0
$$ 109 -153 99 -393 -86 -176 61 -83 69 276 136 -66 54 -163 -57 108 55 119 454 -40 125 105
2889A05J7p0j03k6J84j53l5Q6j07K71k54qoj5k08L22k45M44m59J35J78o7K52k14
$$ 105 122 52 -51 -77 107 -46 -81 5 -102 169 -85 -93 -99 -114 -322 0 -245 199 -260 -125 53 -14 238 24
2913B4j25K04J7k30K04k52K79j72J45J9J18j46J98k23k39NJ88r5l0K31l0j34N6
$$ 24 -101 103 120 -110 94 -158 121 -51 94 113 231 85 283 60 -179 -174 14 -81 -111 120 90 -44 12
2936A2j22p2M68m76P2J03po5L87j14k95K17r8k11K03J3M7P4J9j64l7JJ15J07l76
$$ 12 -110 -182 286 -190 -118 -15 -22 -87 300 186 -109 108 10 -201 2 15 62 136 155 -9 -46 -45 70 177 -199
2961a99J25K43k36n0O8k79J99l2J71q5J90o2K6k36O8J89J10l0K06l74J3K8j37
$$ -199 -74 169 -67 -117 -49 -328 -129 -161 10 -75 115 53 79 -157 -89 100 210 180 386 12 25 53 -84
2984h4J63M3j63l6KK89m20L5J25QM4o6k03J65o9O1J51qk04M8P1K33j0j1J85j04
$$ -84 79 122 -41 -77 -75 214 -206 -171 -46 -38 6 -60 -263 -98 -167 -106 45 37 -167 -119 -48 185 175 164 349 245
3010B45k27R4j37R4j6K4j71K78j47q2j90J08J00N7j99J08J4k14K46q3j34J86k11
$$ 245 18 112 -25 69 53 77 -94 184 37 -45 -235 -127 -27 30 -169 -61 -47 -261 -15 -98 -232 -46 -257
3033b57L56K6k58K72l3n5R9l6q7J18M0q2P1l10K90L9n08L68j10j4N4k7j20n6K2
$$ -257 99 125 -133 139 106 51 150 114 27 145 185 103 174 -136 154 193 -315 53 -57 -71 -17 -44 -164 -220 -198
3058a98j55L17j11J00r4M8J21l4Kj24j05K48m7p5K59q3j71J81j11K09J77k37j37
$$ -198 -353 -36 -147 -47 -141 -93 28 -6 -4 -128 -233 15 -32 -107 152 69 -102 79 -32 177 354 117 -20
3081b0J12j19R7L3P6k54lm7p1j37K85j25L0J50p1J55P8j99K67j80j38K57J53m6
$$ -20 92 -27 70 103 179 -75 -78 -125 -196 -333 -48 -173 -143 7 -64 91 169 -30 237 57 -81 176 329 283
3105B83k12o2o7K45j95Q8j31K15k29l5k9J19k47L8R0mQj25J59j57L0J66lQ9K41
$$ 283 71 9 -58 187 -8 80 -51 164 -65 -100 -129 -10 -257 -219 -129 -133 -125 -250 -91 -248 -218 -52 -55 34 275
3130B75l12J1n1L35q3j51J27j47j65J63l5K38j68O9k81j3J03j47J94n5J76j40
$$ 275 -37 -26 -77 258 175 24 151 4 -161 2 -33 205 37 106 -175 -188 -85 -232 -38 -93 83 -57
3152e7J16j11k42K25m3j5J5K41r8kj79J61K38j64q4K05j1j07j12p3K05K4K7k01
$$ -57 59 -52 -294 -69 -112 -127 -112 129 31 29 -150 11 249 85 1 206 195 88 -24 -97 108 132 159 -42
3176d2J6k4q8k0J34j44KK12k81K41k19R7j14M04j13j44j49M1J70J16L7L0R5k28
$$ -42 -26 -50 -138 -158 -24 -168 -166 46 -235 6 -213 -116 -230 174 61 -83 -232 -191 -21 95 132 162 257 29
3200B9R5j2j1J31k99O0R9l3k8Oj65p1K82k50J42k16L00j44J81k62Q5J19O9l6m6
$$ 29 124 112 101 232 -67 -7 92 59 31 37 -128 -199 83 -167 -25 -241 59 -85 96 -166 -81 38 107 71 25
3225B5P5J3m9r4J73n5j78L72q6n1k39K48M5k7j09j15r1K27m0j43J25q0R6j32L
$$ 25 100 113 64 -30 143 88 -90 282 196 145 -94 154 199 172 63 -52 -143 84 44 -99 26 -54 42 -90 -87
3250h7j8l9K02j71J11J48P9n2N9k41m3Q7J48k24j9K05k01R9M2n7q1j40J7J20n6
$$ -87 -105 -144 58 -113 -2 146 225 173 232 -9 -52 35 183 -41 -60 145 -56 43 85 28 -53 -193 -176 -56 -112
3275a12M4J04j73J18J30l52L03o6k9Q2k23J66J48j83k3Q8pJ17q6K38l05N2r2K26
$$ -112 -68 36 -137 -19 111 -241 62 -4 -33 49 -174 -8 140 -43 -66 22 15 132 46 284 -21 31 -61 165
3299A65n8j1p1P1O0q3j02o3p7J18q5P5k79N18j10p7j45K80K9j96K88k23K37k38
$$ 165 107 96 25 96 156 73 -29 -92 -169 -51 -136 -61 -340 178 68 -9 -154 126 155 -41 247 24 261 23
3323B3J43r5K8l4K13k66J35N8k43%J2Jk6o9J13L9j09j85N1J43j11j2J34J40k58
$$ 23 166 71 99 65 278 12 147 205 -38 -38 -26 -25 -51 -120 -7 32 -77 -262 -211 -68 -179 -191 -57 83 -175
3348a75L62O4l7l83L08r9J10m5l0jK0j68K09j55m2J35j89O3L8J02j26L3l10L02
$$ -175 187 251 214 -169 139 40 150 105 75 74 94 -74 135 -20 -62 73 -116 -53 -15 87 -39 -6 -316 -14
3372a4j42L55l20n1O5J39J6P6Rq6j47j3K44J19j67l2k38M01k23j36L7j7M09l66
$$ -14 -156 199 -121 -172 -107 32 48 124 133 47 -100 -113 131 250 83 51 -187 214 -9 -145 -108 -125 284 -82
3396h2NK11j40j73R0%M1N8j52O6j28K68O5l29K21K3q9J81L5j31o5J81k17K10k72
$$ -82 -77 134 -6 -179 -89 -89 -48 10 -142 -76 -204 64 129 -200 21 44 -45 136 171 40 -25 156 -61 149 -123
3421a23J84N1j17R1P5q8q3k27O7J13k18kL58j79LJ50l6j24R1oj27J84O5K19m95
$$ -123 61 112 -5 86 161 73 -10 -237 -170 -57 -275 -277 81 -98 -95 55 19 -105 -14 -20 -147 37 102 321 -174
3446a74L64r0j10J68n0n6j10L44l30j12J38qj50N1J8j65L28l09L08k32K48r3l8
$$ -174 190 100 -10 158 108 52 -58 286 -44 -156 -18 -26 -176 -125 -107 -272 56 -253 55 -177 71 -22 -60
3469f0k4k3N7mk6J55k6j30N6J57o6O0K9j53P6q3J7j24J77j77K93k19J96l01j5
$$ -60 -84 -107 -50 -54 -80 75 49 -81 -25 132 66 126 155 2 78 -5 12 -112 65 -112 181 -38 158 -143 -158
3494a58J88n4k3j70J26L7k5j00M05j55o0J58j23j07Q7K28j26j31q2K71m4k71J96
$$ -158 30 -24 -47 -217 -91 -54 -79 -179 226 71 11 169 46 -61 26 254 128 -3 -85 186 142 -129 67
3517F7Q3Lq7k9l58L60j39J7J05l54N25j67j16QL5o8n0L01n5j18J94o0P7n7lr7
$$ 67 150 153 66 37 -321 39 -100 -83 22 -332 193 26 -90 -82 -47 -115 -165 136 81 -37 157 97 174 117 114 17
3543A7nj96M45l01J67l0k11Kl02O54k75k6m3l8n3J18n5J43j65L6k9nJ34Q1QQ0
$$ 17 12 -184 261 -40 127 97 -114 -112 -414 240 -35 -61 -104 -142 -195 -77 -132 11 -154 -118 -147 -152 -18 63 71 151
3569A51l1j81N7j60N74k74j69J53J3k13K34o4j83J77j72K3J13j44J30m2j54j78
$$ 151 120 -61 -4 -164 410 136 -33 120 133 -80 154 90 -93 84 -88 -65 48 -96 34 -8 -162 -340
3591c40M14q0o7n2O3Q2l31L93J33l73L27P3l94K58J29l47K51K3k20j37R2l6j4
$$ -340 74 -6 -73 -125 -62 20 -311 82 215 -158 169 242 -152 106 235 -112 139 162 -58 -195 -103 -139 -153
3614a53J32J4Q5j67O7p0R9j22O4M9k13Pl0K14P7J58j07n2k8L1j59J93J95k29J36
$$ -153 -21 -7 78 -89 -22 -92 7 -115 -51 -2 -215 -208 -238 -24 53 211 104 52 24 55 -104 89 284 55 191
3639A91q0J06k45L1m9J22R4k03j16J18P2j05o4K2j07J21O0o5N1P4k21N97j94r1
$$ 191 111 217 -28 3 -46 76 170 -33 -149 -31 41 -64 -128 -106 -213 -92 -32 -97 -46 28 -193 404 210 119
3663A19pk15J51j32J55K1r3J62oj88p9K26M8j57J00j23O1j68O4M6J6N1l6j43p
$$ 119 112 -103 48 -84 71 92 -1 161 155 -33 -112 114 162 5 105 -18 43 -125 -61 -15 1 52 16 -127 -134
3688a34J56j40l8L9L8K72jk14J3L6J8K76l85J60j04j49K68O3K2j35Pj68j46J13
$$ -134 22 -118 -156 -117 -79 193 192 -22 -9 27 45 321 -64 96 -8 -157 111 174 196 61 68 -100 -246 -133
3712a33O4n6J01j48O6R1l03M12j52r2R2q4K68J71l84P9J55J0j44J3J46j38K62
$$ -133 -69 -125 -24 -172 -106 -15 -318 94 -58 -150 -58 -142 126 297 -87 -8 147 157 13 26 172 34 296
3735B96k09j19j8K65k41j04K24r6m7J36j84NL5J55j21Ln4J27k7J3j35K04k9r4
$$ 296 87 -32 -50 215 -26 -130 94 -2 -49 87 -97 -92 -57 98 -23 -20 -74 53 26 39 -96 108 79 -15
3759a5J73j73R6l9J42j87j2K7r5K52o8l45L49k82M55l50R8n1k32P9L39k90Q5k48
$$ -15 158 -15 81 42 184 -3 -15 12 -83 169 101 -244 105 -177 278 -72 26 -25 -257 -178 161 -129 -44 -292
3783b92L03q8K1k6J01j8Q1r6K82j02J34k33J87k08K01l7o6q7j31J31mj11j2j46
$$ -292 11 -77 -56 -82 19 1 82 -14 268 166 300 67 254 46 247 210 144 57 -74 57 53 -58 -70 -216
3807b16J48M7o2k2L1R3j41J68k13m5K20J18j93L36j33q8Jl1J32j34N5J3j59Q6
$$ -216 -68 -21 -83 -105 -74 19 -122 46 -167 -212 8 126 -67 269 136 48 49 18 150 16 71 84 -75 11
3831A1K9k17R1K76l8P4k28R3k27M4J7J04p8l8q2K0P2Q6J61o0k51K46j31p6J92
$$ 11 40 -177 -86 190 152 226 -2 91 -136 -92 -75 29 -49 -87 -169 -149 -77 9 170 110 -141 105 -26 -102 90
3856I0K22m70K00J59K7l53M95j40l39L6l1J41j85O0o0K27k08K85l19j9j9J86k19
$$ 90 312 -158 42 201 228 -125 370 230 -109 -73 -104 37 -148 -88 -148 79 -129 156 -163 -182 -201 -15 -234
3879b34jK80j08J04Q4P4j36j29J07N2J25j56j05k6o7M53k19j14J6o9J04Oj50K54
$$ -234 -235 45 -63 41 125 199 63 -66 41 93 218 62 -43 -69 -136 317 98 -16 0 -69 35 41 -109 145
3903A45j90J22j08K13j19p5j69K84k8j30j55J72J70j10j5Q6J78j28M4j59j49J73
$$ 145 -45 77 -31 182 63 -12 -181 103 75 -55 -210 -38 132 22 7 93 271 143 187 28 -121 52
3925E2p5j10Q4n1K13k16P8J3j14J44o1j86K47j37L85l64J08n2J9J23N5j11n5K1
$$ 52 -23 -133 -49 -100 113 -103 -25 -12 -126 18 -43 -229 18 -119 266 -98 10 -42 -23 100 155 44 -11 10
3949A0p9K14j8k3k3j63L62l95Q5J58K3k36k29N52k09p3K5k83J15O2M5K97k49j5
$$ 10 -69 145 127 104 81 -82 280 -115 -30 128 151 -85 -314 238 29 -44 -19 -302 -187 -125 -80 217 -32 -47
3973d7Mm2Q8mK0L73l06j76P5Q1qk65j00L68J26l26k6J59j25K50j02K8K4j50J13
$$ -47 -43 -85 3 -1 19 392 86 -90 -15 66 58 -207 -307 61 187 -139 -165 -6 -131 119 17 45 69 -81 32
3998C2L4j53m5%J66L9p4K0L4K4j47J73q7J92m56K44J27N7N4m01J85k7M8P6o6k51
$$ 32 66 -87 -132 -132 34 73 -1 19 53 77 -70 103 16 208 -248 -4 123 180 234 -167 18 -9 39 115 49 -202
4024b02j40J87J77%n13M80j51L9k07J44l7K48j05Q2R4m53L59J42k65J26J9K64
$$ -202 -342 -155 22 22 -491 -11 -162 -123 -330 -186 -223 25 -80 2 96 -357 2 144 -121 5 24 288
4046B88j90n2j30J63o5J76l34J27j14jm9R8P6O9o6r2Nn1J84j19Q3j5L1M8j26J40
$$ 288 98 46 -84 79 14 190 -144 -17 -131 -132 -181 -83 -7 62 -4 -96 -91 -142 42 -77 6 -9 22 70 -56 84
4072H4Q9j08J45j16Olk20M5J49m3J5j13L18k97j5k70K66Q4j9o8j71K28j91K59
$$ 84 173 65 210 94 100 97 -123 -78 71 28 43 -70 248 -49 -64 -334 -68 16 -3 -71 -242 -14 -205 54
4096E4J04k31j29J19j0M37l18K7O2j03L9k00%K84J79k09k29J70JJ70r7l35J62
$$ 54 158 -73 -202 -83 -93 344 26 53 115 12 51 -149 -149 135 314 105 -124 46 47 217 120 -215 -53
4119e3n0Q9r6J30k58J04K70J30k28k22J39J72r1m8j30L69r1O8k32J20l57K42K25
$$ -53 -103 -14 -110 20 -238 -134 136 266 38 -184 -45 127 36 -12 -142 227 136 204 -28 92 -265 -23 202
4142B02j02K22l02Q7k08P5K30o15L35n6K52j37j87L44j48j45o6O2P5Q1j16N8L1
$$ 202 100 322 20 107 -101 -26 204 -411 -76 -132 120 -17 -204 140 -8 -153 -219 -157 -82 -1 -117 -59 -28
4165b8K9%j54K35J53o8N1k50K18j23j46K16j30J09j44Q5Ql92L94j92J66j62r2
$$ -28 1 1 -153 82 235 167 218 -32 186 63 -83 133 3 112 -32 53 61 -331 63 -129 37 -125 -217
4188b17L1R9M3j79J39J50j12J91k58J46j72l5J91n8%P4p6L31m76J48o7L46m14
$$ -217 -186 -87 -44 -223 -84 66 -46 145 -113 33 -139 -174 17 -41 -41 33 -43 288 -188 -40 -107 239 -175
4211a75J16K05j17m68L29n2K02q4j24q0K85J7o9k1l6K23o3J45j35n1O2J89k43
$$ -175 -59 146 29 -439 -110 -162 40 -44 -168 -248 37 54 -15 -36 -72 151 88 233 98 47 109 298 55
4234E5l4l6j08J14j16J71j24J31K4O0j30J12l8M8n1l9j45J56n6p4nJ7K6K12k43
$$ 55 21 -15 -123 -9 -125 46 -78 53 77 137 7 119 81 129 78 39 -106 50 -6 -80 -85 -68 -42 170 -73
4259g3K30j9j00R4j97J11P1J1j26K12l00K61k40QJ12J9l46K74k52J03R7O0k64
$$ -73 157 138 38 132 -65 46 117 128 2 214 -86 175 -65 -57 55 74 -272 2 -250 -147 -50 10 -254
4282b54J06J32ol2n8J83p5K49k62Q5J40J00l65J43m9Q9j42Mr8K63j28J3Q7k01
$$ -254 -148 -16 -22 -54 -112 71 -4 245 -17 68 208 308 -57 86 37 126 -16 -12 -110 153 25 38 125 -76
4306g6r6N2K63n8l1j60J66j43J1J30K6P5q7k59K66n7J01n2J70J16l49L48j05l23
$$ -76 -172 -120 143 85 54 -106 60 -83 -72 58 84 159 72 -187 79 22 123 71 241 357 8 356 251 -72
4330g2K01j47K2P8J48j74j62N5j0M2K29n4m8j17m2p8J41j1l3K69j35o9K8k67J92
$$ -72 129 -18 4 82 230 56 -106 -51 -61 -19 210 156 108 -9 -51 -129 12 1 -32 237 102 33 61 -206 -14
4355a4P6r9P7J9j93K17LJ45m23K78k34j6K19j1L1j3k71J81j22J0j3QL24m2K0l23
$$ -14 62 -37 40 59 -134 83 86 231 -192 86 -148 -164 55 44 75 62 -209 -28 -150 -140 -153 -145 179 137 157 -166
4381a66J57Q9j47J37J42k51R8j5k2K45o6j68j04k8L6J17q7J50l35N7J79J71l94
$$ -166 -9 80 -67 70 212 -39 59 44 22 267 201 33 -71 -99 -63 54 -33 117 -218 -161 18 189 -205
4404b05K21j78J25o4J37j02q6J61J66j26J37l27n7L47j30K96l16J00k6Q3k27J64
$$ -205 16 -162 -37 -101 36 -66 -152 9 175 49 186 -141 -198 149 19 315 -1 99 73 156 -71 93
4426I3q2j36K28J29m23R7o5J48j80R1J16k77K1K31j94J78J22l76K22M7p0R5p2
$$ 93 11 -125 103 232 -191 -94 -159 -11 -191 -100 16 -261 -240 -9 -203 -25 97 -279 -57 -10 -80 15 -57
4449e7J54J01l28J12n9K79k0l29J88j42Q8p6R2p6k58M45j78j04k1J06K0J65q9
$$ -57 97 198 -130 -18 -77 202 182 -147 41 -101 -13 -89 3 -73 -331 114 -64 -168 -189 -83 -63 102 13
4472A3J11j13n1K73j37r8J08k4q0O4j93L08k88L93l48j58N0K43K66k37j06J28
$$ 13 124 11 -40 233 96 -2 106 82 2 66 -127 181 -107 286 -62 -220 -170 73 339 102 -4 124
4494A24m3j75N3J79K06j98l67J60J31j56J38o4N2j27M06l93J69K16q8M9k77N0
$$ 124 81 -94 -41 138 344 146 -221 -61 70 -86 52 -12 40 -87 319 -74 95 311 223 272 -5 45
4516D5L46k39o2j53J35p0P1j29K18K0n9l83Q6O2M1K12k33l7O0q4K35J16q0j80
$$ 45 391 152 90 -63 72 2 73 -56 162 182 123 -260 -174 -112 -71 141 -92 -129 -69 -153 82 198 118 -62
4540f2j25J82R4K18k60o8J20P4j08l1j75J84m1r3K83j33r1j00j20J93j5j48K92
$$ -62 -187 -5 89 307 47 -21 99 173 65 34 -141 43 2 -91 192 59 -32 -132 -252 -59 -74 -222 70
4563G0j54j3j55K02K99l26O2oK39j24n7J16k63J47P8j35n3M25k75K28j10j33k
$$ 70 -84 -97 -252 -50 249 -77 -15 -21 218 94 37 153 -110 37 115 -20 -73 352 77 305 195 62 60
4586F0k07P4J53j16k33J93J1Q2P4J08j22K7M1O3l65O3J28j20P9k3J79j7o8J72
$$ 60 -147 -73 80 -36 -269 -76 -65 17 91 199 77 104 145 208 -157 -94 34 -86 -7 -30 149 132 64 236
4610B36j13j79l1K65l50L46J15j61k24k7J21j62R7j06J54k16K27l3KJ6J73k09
$$ 236 123 -56 -87 178 -172 174 289 128 -96 -123 -2 -164 -67 -173 -19 -235 -8 -41 -39 -23 150 -59
4632e9O9K03o2j39J41p1K47j80n8k3J32l6p9j99K60m4J7j24O3j33rk7k24L84l44
$$ -59 10 213 151 12 153 82 329 149 91 68 200 164 85 -114 146 102 119 -5 58 -75 -84 -111 -335 49 -295
4657b95L36j45J92o9j40P2oj00r7L23J78Mk28lM3j42K23j94K1j17J82j47J82k17
$$ -295 41 -104 88 19 -121 -49 -55 -155 -252 71 249 253 25 22 65 -77 146 -48 -27 -144 38 -109 73 -144
4681a44J6J67P8j73j43m7K59j01J25P9l4k33J80j75J05J06J23j79k02L99j54m
$$ -144 -128 39 117 -56 -199 -246 13 -88 37 116 82 -151 29 -146 -41 65 188 9 -193 206 52 48
4703D8k70N4M04j29j25R5q3j24o9J47P9o5L2J07l06k57K80M9j12K58k56J15k62
$$ 48 -222 -168 236 107 -18 77 -6 -130 -199 -52 27 -38 -6 101 -205 -462 -182 -133 -245 13 -243 -128 -390
4726c90M05L7L3l0L41n50K79p7k5j89J52k19ML25qk17K55k90J58j40K02J12n34
$$ -390 15 52 85 55 396 -154 125 48 23 -166 -14 -233 -229 96 88 -129 126 -164 -6 -146 56 168 -366
4749c66N34j31J11l3M1j59J06j27L8j61N4P9O6k9J4P4Q7l5k48K53k78J59P0pL
$$ -366 168 37 148 115 156 -3 103 -24 14 -147 -93 -14 52 23 37 111 198 163 -85 168 -110 49 119 112 115
4774A15l6O8j77n4j89J38k63K16J7J0J82j60J58j4j13O8N4j00O3L8J16k08R3J20
$$ 115 79 147 -30 -84 -273 -135 -398 -182 -165 -155 27 -133 25 11 -102 -34 20 -80 -17 21 137 -71 22 142
4798A42L0j28N9l5m7m6p2K69j00j53O6k13m1J79j31J78j8R8j26K06j28o9L7n0
$$ 142 172 44 103 68 21 -25 -97 172 72 -81 -15 -228 -269 -90 -221 -43 -61 37 -89 117 -11 -80 -43 -93
4822i3j2J89j85K16Q7k47J85j35L0q1Q2Nm4p6J68k33OK50j31P4m2j22J11j42K6
$$ -93 -105 84 -101 115 202 -45 140 5 35 -46 36 41 -3 -79 89 -144 -138 112 -19 55 13 -109 2 -140 -114
4847a14K38l8m6j82l3j07J60K29j70J62o3N6n9pj02j02J53R4K02j66K3j32l5Q9
$$ -114 124 86 40 -142 -175 -282 -122 107 -63 99 36 92 33 26 -76 -178 -25 69 271 105 128 -4 -39 50
4871E0N3k00l4J6J76j19r3R6jP0Rj86POL18L2j19l29L7L25j06J03Q2Q4k72j91
$$ 50 103 -97 -131 -115 61 -58 -151 -55 -56 14 23 -163 -156 -150 168 200 81 -248 -211 114 8 111 193 277 5 -186
4897a86M00l67Q0j5l3p8J1j11M3J47R2P9j76o6k1K03k79M76j86k36J67K77N7j88
$$ -186 214 -153 -73 -88 -121 -199 -188 -299 -256 -109 -17 62 -114 -180 -201 2 -277 199 13 -223 -56 221 278 90
4921I0K2j57J13K68k26k18J69L3j04J70q9l2j70k3j21L82k00L8J14k68pJ06J50
$$ 90 112 -45 68 336 110 -108 61 94 -10 160 71 39 -131 -154 -275 107 -93 -55 59 -209 -216 -110 40
4944D0l9n2J11p3m9j55K98J34k07N8j46J90j06J28k49K26o5j8P2l37L00Q8j65
$$ 40 1 -51 60 -13 -62 -217 81 215 8 66 -80 110 4 132 -117 109 44 26 98 -239 61 149 -16
4967a6q4J61j00p3j57K97k08J9k5J51J47O4j26j0n9rJ54J02N2k47j39J85j57Q2
$$ -16 -100 61 -39 -112 -269 28 -180 -161 -186 -35 112 176 50 40 -19 -28 126 228 280 33 -106 79 -78 4
4991DP8k28P5j5J19j94L02k65K31l09q6L54n1R7N6k61J98j50l9r8M11M2j99r3
$$ 4 82 -146 -71 -86 33 -161 141 -124 107 -202 -288 66 15 112 168 -93 105 -45 -84 -182 229 271 72 -21
5015b1J33j34J36j97K17L3j61n2pj9J13K81m05K11p5j65K42N0m00L34o0J7NK17
$$ -21 112 -22 114 -83 134 167 6 -46 -53 -72 41 322 -83 128 53 -112 130 180 -220 114 54 71 76 293
5039B93m23K29l66N46k6l92L06j92K92k53p1J57Mk23m0L61j28q6o0L4J1K8M7j01
$$ 293 -130 99 -267 279 253 -139 167 -25 267 14 -57 100 104 -119 -159 202 74 -12 -72 -38 -27 1 48 -53
5063e3J49l05L11j35j1K21j94J8j17J23M2Q9j70J44J54l22J74N7j15j03J15o3
$$ -53 96 -209 102 -33 -44 177 -17 1 -116 7 49 138 -32 112 266 -56 118 175 60 -43 72 9
5085IN5o1j81J81j48J40p8J63k07J11J39j75J68j67j8k35M85o2j31j02N8j19L4
$$ 9 64 3 -178 3 -145 -5 -83 80 -127 -16 123 -52 116 -51 -69 -304 181 119 -12 -114 -56 -175 -141
5108a41L81j89J05j31j16J16j5J14Q2l50J51k87K08N4J98k33K81k05k79J74k27
$$ -141 240 51 156 25 -91 25 10 124 206 -144 7 -280 -72 -18 180 -53 228 23 -256 -82 -309
5129c09K46J29j37J62K54l08L7K37l02O4k27J29J00l9n1J49P0n31L45mk83M19
$$ -309 -63 66 -71 91 345 37 74 311 9 73 -154 -25 75 36 -15 134 204 -327 18 14 -269 150
5151A50k11Q7k31j12M63l73K67k45J63j4J0j37J66J37j4j56K26k44L7J29j1r2
$$ 150 -61 26 -205 -317 146 -227 40 -205 -42 -56 -46 -183 -17 120 106 -50 176 -68 -31 98 87 -5
5173eJ77r6K25k82J66j41J42l14kK04p8j13K08j99J74o2J07j8k26O0J05kk6qr5
$$ -5 172 76 301 19 185 44 186 -128 -130 74 -4 -117 91 -108 66 4 111 93 -133 -73 32 30 4 -4 -99
5198i9K45k34J82m6R5J9j3Q9k08Qq8k5NJ4k6M4L1J19o2k48k03L33j31J95q1M4
$$ -99 146 -88 94 48 143 162 149 238 30 38 -50 -75 -70 -56 -82 -38 -7 112 50 -198 -401 -68 -199 -4 -85 -41
5224d1m1l9qJ90N9j09L9j46K83k6k9j71j2K18J53l26P5K3k96L31j93j8n8Q5k61
$$ -41 -82 -121 -129 61 120 11 50 -96 187 161 132 -39 -51 167 320 -6 69 92 -204 127 -66 -84 -142 -57 -318
5249c18K26K40j39j22J52N5k7j0O0j13K7J02j95J52m0j1m2K6J5R1J76l14o4R3
$$ -318 -92 148 9 -113 39 94 67 57 117 4 31 133 -62 90 50 39 -3 23 38 129 305 -9 -73 20
5273B0m2j76L18j08K28j49j44Ln0L8J58k37pJ37%JK7k7K8K6Q0o4j05J31r6R9J10
$$ 20 -22 -198 120 12 240 91 -53 -50 -100 -62 96 -141 -148 -11 -11 -10 17 -10 18 44 124 60 -45 86 -10 89 199
5300A99k26J4J15Nm5j84K19q0J36l13m4R0j8L85k41k61L8L7N6K54j44rl8K9R1
$$ 199 -27 -13 102 107 62 -122 97 17 153 -160 -204 -114 -132 253 12 -249 -211 -174 -118 136 -8 -17 -55 -26 65
5325F5o8J61j51k21J18L69j94n2j01K09L2r8p6k84J52r3J13J75P0j51k32K07P9
$$ 65 -3 158 7 -214 -96 273 79 27 -74 135 167 69 -7 -291 -139 -232 -119 56 126 -25 -257 -50 29
5348B9j8J28j03R3n2m1R0m7R5J3M5l05L0K70l82Q2J25j36K97j67L6k37R5J86j19
$$ 29 11 139 36 129 77 36 126 79 174 187 232 -73 -43 227 -155 -73 52 -84 213 46 82 -155 -60 126 7
5373GJ1Ok13M19k38R1k2P7po1j12J13k0k77M24n0R5j85k62J11K14J86j97k46K38
$$ 7 18 24 -189 230 -8 83 61 138 131 70 -42 71 51 -226 198 148 243 58 -204 -93 121 307 110 -136 102
5398A02Rk62R3R3qj96J22Oj12K33k15J60j5M0p7On8O8J2Q8M8j63M69l76j10k2
$$ 102 111 -151 -58 35 27 -169 -47 -41 -153 80 -135 25 10 50 -27 -21 -79 -11 1 89 137 -26 443 67 -43 -65
5424f5K63k91K42j35J96j97o8K01j96n8J28M7j98L06j51J45k12J33j30N5q2J88
$$ -65 198 -93 149 14 210 13 -55 146 -50 -108 20 67 -131 175 24 169 -43 90 -40 15 -67 121
5446A21j32j51K07q4j5K69j2m5k36O4O5m9K1M4l24N20j84j84K27l68m4K85n0l2
$$ 121 -11 -162 45 -39 -54 215 203 158 -78 -14 51 2 23 67 -257 263 79 -105 122 -246 -290 -5 -55 -87
5470h7K93l20J34j76l7M02o9k61J01J35j15J93q7l7n2r4N3n6J26J00j60Q3l00
$$ -87 206 -114 20 -156 -193 209 140 -121 -20 115 0 193 106 69 17 -77 -24 -80 46 146 -14 69 -231
5493b31M5M31j78o7K0J3M8j71J48l9Q4j22K19k46j08J10o3o1K22p5J60N3P2j80
$$ -231 -186 245 67 0 20 33 81 -90 58 19 103 -19 200 -46 -154 -44 -107 -168 54 -21 139 192 264 84
5517H4k44J61n6m1l5K09j71J50j60J50n0r0n4J35q0J3m4J28r5K45k72p6R3M7M0
$$ 84 -160 1 -55 -96 -131 78 -93 57 -103 47 -3 -93 -147 -12 -92 -79 -123 5 -90 155 -117 -193 -100 -53 -13
5542a3k1L71k98J85l17L22j14J47l56J08J66k32K24J9K6n13K10J21N0k13L51l00
$$ -13 -34 337 39 224 -93 229 115 262 -94 14 180 -52 172 191 217 -296 -86 35 85 -128 223 -77
5564g7l9J61j01l7O9J29n6r3j61J15j3J37J98k22k52L24M2j78n7L01k95K2M7j44
$$ -77 -116 45 -56 -93 -24 105 49 -44 -205 -90 -103 34 232 10 -242 82 124 -54 -111 190 -105 -83 -36 -180
5588a80L8k2M09k45J35l32K03k5K1j10J6n3J41K0N0p7K72k13j26L02k32l4r7M33
$$ -180 -142 -164 245 0 135 -197 6 -19 2 -108 -92 -145 -4 16 66 -11 261 48 -78 224 -8 -42 -139 294
5612B94o20M22j16j9K00j39j80J03J90k09R9k26K42j83n5L87l29J45k26K31j21
$$ 294 -326 96 -20 -39 161 22 -158 -55 135 -74 25 -201 41 -142 -197 190 -139 6 -220 11 -110
5633a10L32k43J52q1j94K14P3Q0m1j40j20Q7R8r1K40j93R6j27j55J52m3p3k13
$$ -110 222 -21 131 50 -144 70 143 223 182 42 -78 9 107 16 256 63 159 32 -123 29 -14 -87 -300
5656c00J86K19p4l2k73J25K14m0K4l2m8j25K77j37K31j72P0j61J78j69MQ1r9J55
$$ -300 -114 105 31 -1 -274 -149 65 25 49 17 -31 -156 121 -16 215 43 113 -48 130 -39 -35 46 -53 102
5680A02r9QM8k85M66k88R8j43j91M20l73K45L1lj54R5K3k36O6L56j15j39K0R1
$$ 102 3 11 59 -226 240 -48 50 -93 -284 136 -237 8 39 36 -118 -23 0 -236 -170 186 71 -68 -48 43
5704D3O1k54K11K3O2k04k52L93j11%m8N1q5J02q6J28j10P9K3j25o3Q1j7J44j6
$$ 43 104 -150 61 84 146 -58 -310 83 -28 -28 -76 -25 -110 -8 -94 34 -76 3 26 -99 -162 -81 -98 46 30
5729C0r4P8J00j85o1K06Q4j03N0k92K77j28J86j72R7k98p7L70l31K53J07r0r5
$$ 30 -64 14 114 -71 -132 74 158 55 105 -187 90 -38 148 -24 73 -225 -302 68 -263 -10 97 7 -88
5752h8K28p7k68J23K5P7m1j20j1K01j88K34L5Q7l78K00j0J70l77L60m03J30K16
$$ -88 140 63 -205 -82 -57 20 -21 -141 -152 49 -139 95 130 217 -161 39 29 199 -178 182 -221 -91 125
5775A25j71Q0P7j30L4j24L90l89J5k3J53P8r7J42k07Q2m3j84J85M38l63k19K76
$$ 125 -46 34 111 -19 15 -109 281 -108 -93 -116 37 115 18 160 -47 35 -8 -192 -7 431 68 -151 125
5798A25P3l01L32k3j9l07Q0m9n0j0m6K3L74m37k3K5L1l4J09l6K79Jk18Q7L3q9
$$ 125 198 -103 229 206 187 -120 -40 -89 -139 -149 -195 -172 202 -235 -258 -233 -202 -236 -127 -163 116 117 -101 -14 19 -70
5824g0J05k07Q5N9Q9m6j7K86l89L5j62K68l9j10L1P3P4j94L04k23j82J14j0j66
$$ -70 35 -172 -87 -28 61 15 -2 284 -105 -70 -232 36 -3 -113 -82 -9 65 -129 175 -48 -230 -116 -126 -292
5848b92L00P6k39K47l7n6j42K00m5J27p7L5J17n8j2l4j43K7Q0j24R3M8J10k75
$$ -292 8 84 -155 92 55 -1 -143 57 12 139 62 97 214 156 144 110 -33 -6 74 -50 43 91 201 -74
5872g4R3J4J57r1l0L2k60O6p2K41q5j03J74J02j80j12K86j82J47l41j9K56J13
$$ -74 19 33 190 99 69 101 -159 -93 -165 76 -9 -112 62 164 -16 -128 158 -24 123 -218 -237 19 132
5895A32l75K72r4J60q4j86L52k40J05J50l75J81j68P0M4j02J9J11k12K49j11J69
$$ 132 -243 29 -65 95 11 -175 177 -63 42 192 -183 -2 -170 -100 -56 -158 -139 -28 -240 9 -102 67
5917F7J1k01J01j51J08k1J75nJ9L7k39J25r9n1N7K08l30M8j3j7R3j72K19J23j04
$$ 67 78 -123 -22 -173 -65 -86 89 84 103 140 -99 26 -73 -124 -67 141 -189 -141 -154 -171 -78 -250 -31 92 -12
5942a2J12L7M4k32K24k17O4K38j64m6J10l14p7J99K23j38j90j07L37J0j43L4K01
$$ -12 100 137 181 -51 173 -44 20 258 94 48 158 -156 -233 -34 189 51 -139 -246 91 101 -42 -8 193
5965A93m01J30R9j11J25m1J19N8l34J38Oj36K18p8n6K13j79J40j81J21k03J23
$$ 193 -208 -78 21 -90 35 -6 113 171 -163 -25 -19 -155 63 -15 -71 142 -37 103 -78 43 -160 -37
5987c7N2l1j05J52rM1m1Kj71J53K0l27K34J87j34p1n2K24m0p9j13J07R1q8qQ0
$$ -37 15 -16 -121 31 22 63 22 24 -147 6 26 -301 -67 120 -14 -85 -137 87 47 -32 -145 -38 53 -35 -43 37
6013C7o4J68J0j12j15O9J22k20M28j70j6q0r4K43k48LJ14K06l40M5R6k96L62l89
$$ 37 -27 141 151 39 -76 -7 115 -105 323 153 137 57 -37 206 -42 -39 75 281 -59 -14 82 -214 148 -241
6037b41J53J2O1K84k14p0j07L19j42M5l10M13l21M27o6m73J47L4q2L06k94l5K11
$$ -241 -88 -76 -15 269 55 -15 -122 197 55 100 -210 203 -118 309 243 -230 -83 -49 -131 175 -119 -154 57
6060E7j23J72j41R1L6k57K40k58M33l02k1K92k14l2K03j97j84J77J79j51K62j19
$$ 57 -66 106 -35 56 92 -165 75 -183 250 -52 -73 219 5 -27 176 -21 -205 -28 151 0 262 143
6082A43j24J59j91Jj30J76j5j71L01k26r8J95j13J35j09J15n8k94K85K38O9k41
$$ 143 19 178 -13 -12 -142 34 19 -152 149 -77 -175 20 -93 42 -67 48 -10 -304 -19 219 288 47
6104D7Q0j60K39l20K10j12J87O9q3Ql14Q4L5m3N4J35j07Q0m8j72R8j46J39p6J41
$$ 47 127 -33 206 -114 96 -16 171 240 157 165 -149 -65 -30 -73 -19 116 9 89 41 -131 -33 -179 -40 -116 25
6129B5k65K17n4j5K96l37MJ22k50M5L24j37K35m5Q4l17R8k65R5K17l26K98m6j7
$$ 25 -240 -23 -77 -92 204 -133 -129 -7 -257 -212 112 -25 210 165 249 -68 30 -235 -140 77 -249 49 3 -14
6153a4M1j78j11K77J30l0M2j80Q4l37L02l4R5k82L00Q5j44n6Q3p9O4M6j44j33
$$ -14 27 -151 -262 15 145 115 157 -23 61 -276 26 -8 87 -195 105 190 46 -10 73 -6 58 104 -40 -173
6177a73M1L6j24J35J17o2m6M4k35J89pp5L18k12O9q6L7J4M5M5J4j13M6J4k73L88
$$ -173 -132 -96 -220 -85 32 -30 -76 -32 -267 -78 -85 -160 158 -54 15 -71 -34 -20 25 70 84 -29 17 31 -242 146
6203A46J00l29o6K62k53J2K91k82R1o2L1l3K21k65O6k7J30j11j03J27j77R2q0
$$ 146 246 -83 -149 113 -140 -128 163 -119 -28 -90 -59 -92 129 -136 -70 -97 33 -78 -181 -54 -231 -139 -219
6226b19K59R7p3R5l64J1J65J8O0j83J53R2Pj75Q2N1j04j3k8O9J44n4k52J30N5
$$ -219 40 137 64 159 -205 -194 -29 -11 49 -134 19 111 118 -57 25 76 -28 -41 -69 0 144 90 -162 -32 23
6251B3j34J16k6j9J00l1Q4n2P8j58j8O3j10J24j14L00l48J16J32j91R8J5J55n4
$$ 23 -111 5 -21 -40 60 29 113 61 139 -19 -37 26 -84 40 -74 226 -122 -6 126 -65 33 48 203 149
6275A49l41K93J51j60m4j9K55n90K44O0j10J25k4K43k31L6n3o2M9r5J23M7J9k6
$$ 149 -192 101 252 92 48 29 284 -306 -62 -2 -112 13 -11 232 1 37 -16 -78 -29 -124 -1 46 65 39
6299C9n7J9K14l54K77k79J30L5L8j42j3k9oK05j39J78j07Q3n0N7k29k03K38N23
$$ 39 -18 1 215 -139 138 -141 -11 24 62 -80 -93 -122 -128 77 -62 116 9 92 42 99 -130 -333 -95 428
6323D28m43l7j70M18k43k85L59k46J98J75k05J46p3j58O6K70q2o5r1nK02k22J44
$$ 428 -15 -52 -222 196 -47 -332 27 -219 -21 154 -51 95 22 -136 -70 200 118 53 -38 -43 159 -63 81
6346H1j62K92j70l2p7J14j16j27M13m15K92j50J38L3j52K5L5j19M69m37k62K72
$$ 81 -81 211 41 9 -68 46 -70 -197 216 -199 93 -57 81 114 -38 -13 22 -97 372 -65 -327 -55
6368e5K07r7j4o8l1KP5k3N7N1l17J40K3k75K51J33k0M2l46M08L4j56J71k19J55
$$ -55 152 55 41 -27 -58 -56 19 -4 53 104 -213 -73 -50 -325 -74 59 39 81 -265 143 177 21 192 -27 128
6393A28j85J8m8j05K40k9K04k7j25j74R4p9J61j22j25K01L5l46J91J4R1n0j32
$$ 128 -57 -39 -87 -192 48 19 223 196 71 -103 -9 -88 73 -49 -174 27 62 -284 -93 -79 12 -38 -170
6416a70J20L0PQ2j93Q5j57L22k8n8k45M48k29p9J02K8l1j01O2N7k07O7J56j67
$$ -170 -50 -20 -13 69 -124 -39 -196 126 98 40 -205 243 14 -65 37 65 34 -67 -5 52 -155 -88 68 -99
6440i9P4J80l18J11nr5N09l99J39j55J5M6q1j28J86J74j79o6Q6K07m14Q6J38o4
$$ -99 -25 155 -163 -52 -57 -152 357 -42 97 -58 -43 3 -78 -206 -20 154 -25 -91 -5 202 -212 -126 12 -52
6464e2j90L11r0K12l5k23J88k36J78r1p6j9K92j22m0k2j17K34k15K0K93j71j5
$$ -52 -242 69 -21 191 156 -67 121 -115 63 -28 -104 -123 169 47 7 -15 -132 102 -113 -93 200 29 14
6487A4j13K80k3m26K5J92n4J1Q3O0O5m8j20m0J45k78J89l3Q4L1l12J31R4j00K06
$$ 14 -99 181 158 -268 -243 -51 -105 -94 -11 49 114 66 -54 -94 51 -227 -38 -71 13 44 -268 -137 -43 -143 63
6512F3j27rm3K6J49p6K81k05l8Q2N5k71N04m72oNJ42K19m64Q8M1j06K69l00nM0
$$ 63 -64 -73 -116 -90 59 -17 264 59 21 103 158 -113 391 -81 -87 -82 60 279 -185 -97 -56 -162 107 -193 -198 -158
6538a58J55J4j51J34n0J86j36koK1j89K55j36L4j04J46Q8J6j95M2N1j56J66R1
$$ -158 -3 11 -140 -6 -56 130 -6 -8 -14 7 -182 73 -63 -29 -133 13 101 117 -78 -36 15 -141 25 116
6562A16k1j42K24j54j50J3OQ7o1K4n1j32L24l3k40M1J73qnLO3n2j12J02k5O1J9
$$ 116 95 -47 177 23 -127 -114 -108 -21 -82 -58 -109 -241 83 50 -190 -149 24 16 11 14 77 25 -87 15 -10 51 70
6589G0k59K35j5j90k2q0K12L06k23j57R4j59j10J37J22O2r4J95j10j01J49J44
$$ 70 -189 46 31 -159 -181 -261 -49 257 34 -123 -29 -188 -298 -161 -39 23 -71 124 14 -87 62 206
6611B06m90L53q5j43K19pk8Q8j53j12K22r1q3j7j2J02O8j27p9J01L1O9n7R2PQ
$$ 206 -284 69 -16 -159 60 53 25 113 -40 -152 70 -21 -104 -121 -133 -31 37 -90 -169 -68 -37 32 -25 67 74 82
6637H2K47j99j9J54l27J96r7j53J78rP3J76m38L5K26ok34j5L61r5r0J1J13O5l14
$$ 82 329 130 111 265 -62 134 37 -116 62 53 126 302 -136 -101 125 119 -115 -130 231 136 46 57 170 235 -79
6662g9m5M3K48j41m3rj9J65p1q3J7k06L62l67N5J98P1P2r9kj64M01j70Mn1J06
$$ -79 -124 -81 167 26 -17 -26 -45 120 49 -34 -17 -223 139 -228 -173 25 96 168 69 67 -97 304 134 138 87 193
6688A93k89l4r8J68L6n9q0Q7OP5%mj22p7J80K01j94J16l29N0M04j53l80K43L9
$$ 193 -96 -130 -228 -60 -24 -83 -163 -76 -70 5 5 1 -121 -198 -18 183 -11 105 -224 -174 230 77 -303 -60 -21
6713b1P0r5Q1k20L3J55j16K17j35k12J27l0J02k45J74p6J34J09lj8m7k7o5K67
$$ -21 49 -46 35 -185 -152 3 -113 104 -31 -243 -116 -146 -44 -289 -115 -191 -57 52 49 31 -16 -43 -108 159
6737A59q8J60j37L3j45J85j95j35J62J09k53J31p8J20j21n0n5K03L1J56m95K22
$$ 159 71 231 94 127 -18 167 -28 -163 -1 108 -145 -14 -92 28 -93 -143 -198 5 36 192 -303 -81
6759h1L23p8q0K3o8l7p5J18K00L3pk78k8j87M27l12J7R0j4O6j07J40OL6j65j2
$$ -81 242 164 84 107 39 2 -73 45 245 278 271 -7 -35 -222 205 -107 -90 0 -14 52 -55 85 91 127 -38 -50
6785e0n4J60k40L6J02K91l05N0J5N1l8q6k3J07J40p6j8n7j82K20J39k65J26k9
$$ -50 -104 56 -184 -148 -46 245 -60 -10 5 56 18 -68 -91 16 156 80 62 5 -177 43 182 -83 43 14
6809A4J20l99K03R7J05m12L13k6R3k90N6q8L14Nj86K4j73Q0J4N7J04j28j78L40
$$ 14 134 -265 -62 35 140 -272 41 15 108 -182 -126 -214 100 105 -81 -57 -230 -150 -136 -79 25 -103 -281 59
6833E9j44K51L1k82Mj9K76n3j60O9P2p4q1R9n3J75j65M7p1N4r8k6Q6p9m9L86j63
$$ 59 -85 166 197 -85 -81 -100 176 123 -37 32 104 30 -51 48 -5 170 5 52 -19 35 -63 -89 -3 -82 -131 255 92
6860I2M5k3j76j3n1J46l1M17p24K37J06m1L2m9R5m0m2R3K58l51J14J51l39L30
$$ 92 137 114 -62 -75 -126 20 -11 406 -318 -81 25 -16 16 -33 62 22 -20 73 331 -20 94 245 -94 236
6884B36l19J82r1jk82R9K74j75J0J01M1l03J56J85lK2l04P1p2P4J21l0j16m3R
$$ 236 -83 99 8 7 -275 -176 98 -77 -67 34 75 -228 -72 113 110 132 -172 -101 -173 -99 22 -8 -124 -167 -158
6909a58J84J07l13M6O2J28m3P9k17Q7K32q7k02R7j6Q9k39K49J4J4J0j48o7j8K19
$$ -158 26 133 -180 -134 -72 56 13 92 -125 -38 194 107 -95 2 -14 75 -164 85 99 113 123 -25 -92 -110 109
6934A09J0j45J38K5p8q5o2L8J05o7k38L02j52M9l8K50k08p3J97R4j81k04K04l7
$$ 109 119 -26 112 137 59 -26 -88 -50 55 -12 -250 52 -100 -51 -89 161 -47 -120 77 171 -10 -214 -10 -47
6958d7K49p5j01j29K13j8P8j93J22l0O2j60j0K3NJ53l15J34L8m0m5Q3K20j28J07
$$ -47 202 127 26 -103 110 92 170 -23 99 69 131 -29 -39 -16 -11 142 -173 -39 -1 -41 -86 -3 217 89 196
6983A96K3k80K37qj46O2l11L42kj9M0J12j32q5k66L23Q2l35K32k84K05j1J04k41
$$ 196 219 -61 176 168 22 84 -227 115 113 94 134 246 114 29 -237 86 168 -167 65 -219 -14 -25 79 -162
7007a62R1l0R1N4j08K76j83M2o3k42K84j54Q6J28r0K17k13j39J47j90NK59l05
$$ -162 -71 -101 -10 44 -64 212 29 71 8 -234 50 -104 -18 110 20 237 24 -115 32 -158 -153 106 -199
7030a99Q8J85j10J7K7mj89K57j94L39r7J5j67j13J79Q4k18K7K34r5J34j41k67
$$ -199 -111 74 -36 -19 8 4 -185 72 -122 217 120 135 -32 -145 34 118 -100 -73 161 66 200 59 -208
7053b08K53j49J60Rr6J02j57l1L9K05j73m3J06lj2J98k52m0K10l4N9j7P3k5j79
$$ -208 45 -104 56 65 -31 71 -86 -117 -78 127 -46 -89 17 14 2 200 -52 -92 118 84 143 126 199 174 -5
7078eJ07k37L58j93k64N0K51o9m7K87k55pj81L63j65m7J20k0o3J31j00l0P2K00
$$ -5 102 -135 223 30 -234 -184 67 -2 -49 238 -17 -24 -205 158 -7 -54 66 46 -17 114 14 -16 56 256
7102B56m05L00j7k44O5q8Q2k6L5j4L3J32k47L55l01K27r1j44J05q0K37j53Q9J8
$$ 256 -149 151 134 -110 -45 -133 -51 -77 -42 -56 -23 109 -138 217 -84 143 52 -92 13 -67 170 17 106 124
7126A24k75n6L71j25j10J72n3R4j60j52J03M6N8j03P7O4J4m4j33m1K92j94J00
$$ 124 -151 -207 164 39 -71 101 48 142 -18 -170 -67 -21 37 -66 11 75 89 45 -88 -129 163 -31 69
7149F9m9L31n70K00J74k09R1m7j11R2J76k98K42k7J54m36J09Q2q0K78k25j11K28
$$ 69 20 351 -219 -19 155 -54 37 -10 -121 -29 147 -151 91 64 218 -218 -109 -27 -107 171 -54 -165 63
7172F3k30K51j58R4l3j44J41J8j78j61K06J79j83l9K37m0J3j47j8L11Pl23J13
$$ 63 -167 84 -74 20 -13 -157 -16 2 -176 -337 -131 48 -135 -174 63 23 36 -111 -129 182 189 -134 -21
7195b1K0j23p4j6K55q8m9J06O8j47J14j40J14R8J2n6P5j45M5K02k78L0k08N06
$$ -21 -1 -124 -198 -214 41 -47 -96 10 78 -69 45 -95 19 117 129 73 148 3 48 250 -28 2 -206 300
7219C00j79k11L5j27P5j83M74n15K20M51j74j08J05j45k13J84k2k22M48k33N2
$$ 300 121 -90 -55 -182 -107 -290 184 -331 -111 340 166 58 163 18 -195 -11 -33 -255 193 -40 12
7240A2k60P4K40j89K59j43L6j68J95q7j58J69j63K8Q2k57L35k88J91N6n5J80n5
$$ 12 -248 -174 66 -123 136 -7 29 -139 56 -31 -189 -20 -183 -155 -73 -330 5 -283 -92 -36 -91 89 34
7263C4m5j97K79P1j24o8P4j41K86j58l14M07l7j27J43j05j40O9J91k61J39p7J74
$$ 34 -11 -208 71 142 18 -50 24 -117 169 11 -303 104 67 -60 83 -22 -162 -93 98 -163 -24 -101 73
7286G3j00J29j62J6m4l1P7j5L3l81M60O6j26n3Q8j60J27M6j17J64p0j13J0L5K41
$$ 73 -27 102 -60 -44 -88 -119 -42 -57 -24 -405 55 121 -5 -58 30 -130 -3 43 -74 90 20 -93 -83 -48 193
7311A93l00R0m2L5K9j30P4O8K00k23J2K6K2k34K49k58M22j02j16pj65Q3mq9L63
$$ 193 -107 -17 -59 -24 5 -125 -51 17 217 -6 6 32 54 -180 69 -189 233 131 15 8 -157 -74 -78 -167 196
7336A96po0j47M7j10K8q3kJ92J63k93K7K53j47R7j77l25K38J0L0M07m67J0J85
$$ 196 189 129 -18 29 -81 -53 -136 -138 54 217 -76 -49 204 57 154 -23 -348 -110 -100 -70 337 -130 -120 65
7360F5j0N5k42J24M0j3J66m8j95J60j58K11k90K16J01Pj65%j31l4J42N0j65P4
$$ 65 55 110 -132 -8 32 19 185 137 -58 102 -56 155 -135 81 182 189 24 24 -107 -141 1 51 -114 -40
7384d0M2m3J62j33J67mj46K55k53J29M2k62k3J95q8j71K54k17J84j19P4J89k36
$$ -40 2 -41 121 -12 155 151 5 260 7 136 178 -84 -107 88 0 -171 83 -134 50 -69 5 194 -42
7407d2R4o3K77k25j02R1k90L42ll3j14K05k28k2K81o4J89l09J33l29J00O6l5J51
$$ -42 52 -11 266 41 -61 30 -260 82 79 46 -68 137 -91 -113 168 104 293 -16 117 -212 -112 -46 -81 70
7431G0J34j74P0q8J18j67J5J0m2j4K6j03P0K61k29J29k60J95j00Q9k08L6K87k23
$$ 70 204 30 100 12 130 -37 -22 -12 -54 -68 -42 -145 -75 186 -43 86 -174 21 -79 10 -198 -162 125 -98
7455i8J05r7P0K63j16PL4l49K45J51k84pJ66j17OoJ32j74J2J11J78k82r4J76R1
$$ -98 7 -90 -20 243 127 134 168 -181 64 215 -69 -76 90 -27 -21 -27 105 -69 -57 54 232 -50 -144 32 123
7480A23j20j29J38j7l0K68o8j15k04K37J72j45j92K57J47m76L6N1mR7K78l58r8
$$ 123 3 -126 12 -5 -35 233 165 50 -154 83 255 110 -82 175 322 -154 -118 -67 -71 26 304 -54 -152
7503a52K71k68K10J58l09J3J1M4J16nk23K58j42j6L9K06j54k1K55l05j02L10j26
$$ -152 119 -149 61 219 -90 -77 -66 -22 94 89 -134 124 -18 -34 5 211 57 36 291 -14 -116 194 68
7526F8L9k6j82P5J23k03K33n4O9k46J63J8J32j9o4j26Mj38K13k44Nk59M77Mq9
$$ 68 107 81 -101 -26 97 -106 127 73 142 -104 59 77 209 190 126 0 4 -134 79 -165 -160 -419 58 62 -27
7551b7J96Nn9k53J24O2j49n1O7j6N1N6q7J47j98J99j84K02o5K9K82k36J3J17o8
$$ -27 169 174 115 -138 -14 48 -101 -152 -85 -101 -50 6 -81 66 -132 67 -117 85 20 49 331 95 108 225 157
7576A57m2j86J06k18N01k31k18K68l09N7M2P7J01l35L64q4r0L44k71j8p5K1K1
$$ 157 115 -71 35 -183 318 87 -131 137 -172 -115 -73 4 105 -230 134 50 -40 304 33 15 -60 -39 -18
7599a8J62j12K07m27J46k29R1L19J7j85m0j2K10k61J36J02J51Pn64L73k96J96
$$ -18 144 32 239 -188 -42 -271 -180 139 156 -29 -69 -81 129 -132 4 106 257 264 -300 73 -223 -27
7621b7P4J07m45M82j22j01q3L2K74j96J19m33J89J30R8j11K4k2J3p3j08K31j57
$$ -27 47 154 -291 191 69 -32 -115 -83 191 -5 114 -319 -130 0 98 -13 11 -11 2 -71 -179 52 -105
7644a05N9K16j71L3J63k57j54L43l5K8k02J55Ok37K33pr6K84r6p4oq3j05J56j37
$$ -105 -46 170 -1 32 195 -62 -216 127 92 120 -82 73 79 -158 75 68 -28 256 160 86 80 -3 -108 48 -89
7669h9J70R6j92R7j05j34P1J95n0j53K94J40j14l79L43m8l78j27L59nK1j96o9
$$ -89 81 177 -15 82 -23 -157 -86 109 59 -94 200 340 226 -153 190 142 -236 -363 -4 -9 12 -184 -253
7692b53K57j28N1m6J80j0M7k95J72K5J11J10j48k1q4J04j82J62q3K17l16K10j51
$$ -253 4 -124 -73 -119 61 51 98 -197 -25 0 111 221 73 52 -32 72 -110 52 -31 186 -130 80 -71
7715g1K38J07p5l6k64J6K9j71K93j48m7K61k6k44j65K56O3K77k27J4J19k33j20
$$ -71 167 274 199 163 -101 -85 -56 -227 66 -82 -129 132 106 -138 -303 -47 16 293 66 80 199 -34 -154
7738a54O4J32Q2l21L57j42m4Q7j78J01P2R6k39J41j74L39j0j5o8k63J5J30l6J49
$$ -154 -90 42 124 -197 160 18 -26 61 -117 -16 56 152 -87 54 -120 219 209 194 126 -137 -122 8 -28 121
7762A21l3l70L05k63K58j9l99M39K2R4n61M46k67N36l72l8m7J17N8j85J31K24
$$ 121 88 -282 23 -240 18 -1 -400 39 61 155 -406 40 -227 309 -63 -101 -148 -31 27 -158 -27 197
7784A97k42J13Q9j85J43q0o8o6J9lK69k20K34k18Q2j69J24J9k52J45j39j85J37
$$ 197 -45 68 157 -28 115 35 -33 -99 -80 -83 186 -34 200 -18 64 -105 19 38 -214 -69 -208 -393 -256
7807b56L54j27oK3J08j44K20k09N5k11J64J12k0J3l0j3K13l05K22m56L13j51k7
$$ -256 98 -29 -35 -12 96 -48 172 -37 18 -193 -29 83 63 76 46 33 246 -59 163 -293 20 -131 -158
7830a58L48k78J4N0L0j34KK27j43n6K42l61M00n8n5l82K85j8l3j18K16R3j72L6
$$ -158 190 -88 -74 -24 6 -128 -126 101 -42 -98 144 -217 183 125 70 -312 -27 -45 -78 -196 20 113 -59 -23
7854b3N1R0r0J59j94n5O5j85K04j91J89j25M30k66j09K84k54J43m6k08K10Mn0
$$ -23 28 118 28 187 -7 -62 3 -182 22 -169 20 -105 325 59 -50 234 -20 123 77 -131 79 83 33
7877C3K00l85P7K86m16L15O2j29q9j2l5J25N0n2J53q4j83m0L37k25R7p1J6o6o
$$ 33 233 -152 -75 211 -205 110 172 43 -46 -58 -93 32 82 30 183 99 -84 -124 213 -12 85 14 30 -36 -42
7902d2N1r5J46j3l03J70o2M19j41k15K91k49K66o8k2j84J3j20J23k26K76j14R0
$$ -42 9 -86 60 47 -256 -86 -148 271 130 -85 206 -43 223 155 133 -51 -38 -158 -35 -261 15 -99 -9
7925iL0M7O1j98J17l3J00j30J9N6m0RL5J88k04l4m2j9p2J98j13K4j37j12L49j69
$$ -9 21 68 129 -69 48 15 115 -15 4 60 20 29 64 252 48 14 -28 -47 -119 79 -34 -10 -147 -259 90 -79
7951g9q2L9j20J24K88M0k73P2J27l8k93K62j71o2O8J83M5j17l16L02J3j56J95
$$ -79 -161 -122 -242 -118 170 210 -63 9 136 98 -195 67 -104 -166 -98 85 130 13 -303 -1 12 -144 51
7974E1k47J49R6j48K52l68L05j30J96j49R6q1Q1j74O9k6m4N0J69m5k87K54J4j51
$$ 51 -196 -47 49 -99 153 -215 90 -40 156 7 103 22 103 -71 -2 -28 -72 -22 147 102 -185 69 83 -68
7998f8J6J26k08J50J27k23K5J39l6q8O4q4J39K7l03L59j73K24K2m6m11K83J01
$$ -68 -52 74 -134 16 143 -80 -55 84 48 -40 24 -60 79 106 -197 162 -11 213 235 189 -222 61 162
8021A62j67q9J74l6N9j84Qk02K42O2k47J47j91L1J57j10n9K74j48J98j00K3r1
$$ 162 -5 -94 80 44 103 -81 -73 -275 -33 29 -218 -71 -262 -231 -74 -184 -243 31 -117 81 -19 4 -87
8044h7O2J90n13J03J85K52r0j71J40J92l24J48N9m3l30K67m3l1K06l20m8M59l98
$$ -87 -25 165 -348 -245 -60 192 102 -69 71 263 -61 87 146 103 -227 40 -3 -34 172 -148 -196 263 -135
8067a35r2Q1J85N8k87K98o8k73l6K67J44j29j2K26l22J97J27l04K22k60J21L8
$$ -135 -227 -146 39 97 -190 108 40 -233 -269 -2 142 13 1 227 -95 102 229 -75 147 -113 8 46
8089D6j93J6J44l7K08j93k6K7K02j54j83J03J89k32J89J41l03K3L19m84K73o0
$$ 46 -147 -131 13 -24 184 -9 -35 -8 194 40 -143 -40 149 -83 106 247 -56 -33 286 -198 75 15
8111A5k3K03l52J71K9P2j40k9J0j49J8K01Kj57MK8k8J37N7O3j38j15J56k62QR3
$$ 15 -8 195 -157 14 43 115 -25 -54 -44 -193 -175 26 28 -129 -125 -97 -125 12 69 132 -6 -121 35 -227 -219 -126
8137a26L6R2J49l84R5J92Q6o9j34K9K6j9O5nJ43j04J62l85J08K98l5k78l8l4M4
$$ -126 -90 2 151 -233 -138 54 140 71 -63 -34 -8 -27 38 33 176 72 234 -151 -43 255 220 -58 -96 -130 -86
8162h6J10r8L3J5k39K64k58L14j06J05k7M0k2J98k12J09J0k53j22L12j08J21m7
$$ -86 24 -74 -41 -26 -265 -1 -259 55 -51 54 27 67 45 243 31 140 150 -103 -225 87 -21 100 53
8185E3k31K32JMp5J19
$$ 53 -178 54 55 59 -16 103
8191A03
$$ Imaginary data points
##PAGE= N=2
##DATA TABLE= (X++(I..I)), XYDATA
0@%%%%%%%%%%%%%%%%%%%%%pJ5j6J6j6J6j6K1k9L2l2L7m5M9n5O2o9P9q7R7j10J19
$$ 0 0 0 0 0 0 0 0 0 0 0 0 0 0 0 0 0 0 0 0 0 0 -7 8 -8 8 -8 8 -8 13 -16 16 -16 21 -24 25 -30 32 -37 42 -45 52 -58 61
43F1j30J46j62J79j97K17k41K65k91L23l57L92m33M83n38O02o79P71q86J031j220
$$ 61 -69 77 -85 94 -103 114 -127 138 -153 170 -187 205 -228 255 -283 319 -360 411 -475 556 -664
64f64J481j867K488l651O541k5831l9550P1212L0588m4532j9310K9625K985r498
$$ -664 817 -1050 1438 -2213 4328 -21503 -61053 10159 40747 -3785 -23095 6530 9515 17
78A7J0867J920j7565N263J8217r038k1740Q853K2118p417k7475k470K2286P993
$$ 17 10884 12804 -4761 502 18719 9681 -12059 -3206 18912 11495 -15980 -18450 3836 11829
92A1829j6708j1127L985O174M337M381o530r797O176J3775j997n695M458n9l302
$$ 11829 -4879 -16006 -12021 -5847 -1510 2871 -3659 -13456 -7280 6495 4498 -1197 3261 3202 -100
107a00P509N304j0324k322J1197k610j3872L260J2004k991j2151n749N399R220
$$ -100 7409 12713 2389 67 11264 8654 -5218 -1958 10046 7055 -5096 -10845 -5446 3774
121C774j113j2276k320Q811P64k268N769j106r093O163J2335p118q384J1489N055
$$ 3774 2661 -9615 -11935 -3124 -2360 -4628 1141 35 -9058 -2895 9440 2322 -6062 5427 10482
136A0482j4151j329J6386l98j5894M62J1773k034q446K286N400l478o104J388
$$ 10482 -3669 -4998 11388 10990 -4904 -4442 7331 5297 -3149 -863 4537 1059 -5045 -3657
150c657N771J7m785k476J372J438L483J356p060m245R738O131r398m008R167J810
$$ -3657 2114 2131 -2654 -5130 -3758 -2320 1163 2519 -4541 -8786 952 7083 -2315 -6323 2844 4654
166D654p336J528M963j469q12K450m385k071Q678K075j1330k501R479J767p597
$$ 4654 -2682 -1154 3809 2340 1528 3978 -407 -2478 6200 8275 -3055 -5556 3923 5690 -1907
181a907j672M210l20l236m06J705J179j246k379N10K919J074j196m14l43J603
$$ -1907 -3579 631 311 -2925 -3331 -1626 -447 -1693 -4072 -3562 -643 431 -765 -1179 -1522 81
197H1K993m14k865N93L378j156k471J639J358j685p35n98m28J185N38l067j159
$$ 81 3074 2660 -205 388 3766 2610 139 1778 3136 1451 716 118 -310 875 1413 -1654 -2813
214b813K165K33j677J320n25k592J533L448j247k842J659J592m73Q05O76j724
$$ -2813 -648 -415 -2092 -772 -1297 -3889 -2356 1092 -155 -2997 -1338 254 -219 586 1262 -462
230d62O61L373j756l815L117L432k376l441J152J998R3n20k274j060K101J831
$$ -462 199 3572 1816 -1999 1118 4550 2174 -1267 -115 1883 1976 1456 -818 -1878 223 2054
246B054k038k911M75K514J34k449j067K186K010k330j678K327J483r80J7O86o01
$$ 2054 16 -2895 -2420 94 228 -2221 -3288 -1102 908 -1422 -3100 -773 710 -270 -253 433 -168
263a68J313J882j329k024K327J465k338m60J350o50j773J153K73j669n62Q20o86
$$ -168 1145 3027 1698 -326 2001 3466 1128 668 2018 1368 -405 748 1021 -648 -1210 -390 -1076
280a076p19J66j30pL80j2r04Q30J262r0k66M11M29P31Q01o97o46J390J082j129
$$ -1076 -1795 -1629 -1759 -1766 -1386 -1398 -2302 -1472 -210 -300 -566 -155 274 1005 1806 1109 463 1853 2935 1806
300A806q39P41O3o62l41l49l57k1p78o43RL46q12N2j07q4J01R34k20p0Q01O69
$$ 1806 967 1708 1771 1109 768 419 62 41 -737 -1380 -1371 -1025 -1837 -1785 -1892 -1976 -1875 -941 -1161 -1231 -430 239
322B39o68M85J496l33m95J013O95j035r2O08k21n44j84J84j077J86M1q00r55J72
$$ 239 -429 56 1552 1219 724 1737 2432 1397 1305 1913 1692 1148 964 1148 71 257 298 -502 -1457 -1285
342a285K64o15m96J96M21j44J0K34L79L99N36K16L82Q5L21Q72p2p75Q37P15r68
$$ -1285 -1021 -1636 -2132 -1936 -1515 -1659 -1649 -1415 -1036 -637 -101 115 497 582 903 1775 1703 928 1765 2480 1512
363A512j97J14m19l53o5k67r98k62K39k29p75P7k22J2J66k71J70N87N20Q7l5P00
$$ 1512 1315 1429 1010 657 592 325 -673 -935 -696 -925 -1700 -1623 -1845 -1833 -1667 -1938 -1768 -1181 -661 -574 -609 91
385I1L27K10O73l4J68J79L85m14j98J53j31n06n12M6k56n72l79k5j83k21r49Q18
$$ 91 418 628 1301 1267 1435 1614 1999 1585 1387 1540 1409 903 391 437 181 -391 -770 -795 -978 -1199 -2148 -1330
407a330K8k61j53J24R10L52m5J46J21P19O65k68l66M84R17p1l73q71K88P36j09
$$ -1330 -1302 -1563 -1716 -1592 -682 -330 -375 -229 -108 611 1276 1008 642 1126 2043 1972 1599 728 1016 1752 1643
428A643j567q39O93Q17j099j360O5R72Q2r84q41J011M14K42k60m01M08J133J084
$$ 1643 76 -763 -70 747 -352 -1712 -1647 -675 -593 -1577 -2418 -1407 -993 -751 -1011 -1412 -1004 129 1213
447A213q35r41J145J568n9j382m4Q69N14m45j106j58M95j49p72l24K9k39n17O92
$$ 1213 378 -563 582 2150 2091 709 665 1534 2048 1603 497 339 834 685 -87 -411 -382 -621 -1138 -446
467d46p66j232J027J376j022j155O70J537J90r85O7J044N71Q4K12K10n04j31J108
$$ -446 -1212 -2444 -1417 -41 -1063 -2218 -1548 -11 179 -806 -739 305 876 960 1172 1382 878 747 1855
486A855M14j413m05O97M82j124r06K12J19m38k41m73k84M18J22M5n05m0M79Q62
$$ 1855 2269 856 451 1148 1630 506 -400 -188 -69 -507 -748 -1221 -1505 -1087 -965 -920 -1425 -1465 -986 -124
506a24O08j619o72K888J245j935j526J758J923k31j818l32J113O32o01j078l32
$$ -124 484 -1135 -1807 1081 2326 391 -1135 623 2546 2315 497 165 1278 1910 1309 231 -101
523a01K66M74J11j322j548J033K051j558k587R38K430L73k460n30J861J591j013
$$ -101 165 639 750 -572 -2120 -1087 964 -594 -3181 -2243 187 560 -1900 -2430 -569 1022 9
540Io93O33P27J41j57L56r4k37Q79N23j624o03J331J059j863j724J256O19o39
$$ 9 -684 -51 676 817 660 1016 922 685 1564 2087 463 -140 1191 2250 387 -1337 -81 538 -101
559a01q75k02J71qk2j00N4K76k31J98O62m7l89Q40O01m06k33P27R33o27o76L86
$$ -101 -976 -1178 -1007 -1015 -1037 -1137 -1083 -807 -1038 -840 -178 -225 -614 226 827 421 188 915 1848 1221 545 931
581I31J042m02j584M84Q77j066j373R76Q06j211j360J028O76p46o78P45k33j04
$$ 931 1973 1571 -13 471 1348 282 -1091 -115 691 -520 -1880 -852 -176 -922 -1600 -855 -1088 -1192
599a192Q60M30r27K38P02R19m71n08K90J355r0j579N93R23J91j299n13N19P03
$$ -1192 -332 98 -829 -591 111 1030 559 51 341 1696 1606 27 620 1543 1734 435 -78 441 1144
618A144j055o60k68N1K56Q2l97o25K93L80J25j27j66K39M38q4j28P87M90j82l24
$$ 1144 89 -571 -839 -788 -532 -450 -847 -1472 -1179 -799 -674 -801 -967 -728 -290 -374 -502 285 775 593 269
639B69K52M46L52j58l13q7J92l07pL35o60j450L52R39l24j249L77M78n28l79N10
$$ 269 521 967 1319 1161 848 761 953 646 639 974 314 -1136 -784 155 -169 -1418 -1041 -563 -1091 -1470 -960
660i60L12l85K89O28j29m7M43N60j35j85L33N88O8o31O3J3J90l20K5m60l19K9
$$ -960 -648 -1033 -744 -116 -245 -292 151 711 576 391 724 1312 1380 749 812 825 1015 695 720 260 -59 -30
682c0M45o93p55M23j65P0k92j79J3L75N68n78l17J279P88q17l60L08O94M44l61
$$ -30 415 -278 -1033 -610 -775 -705 -997 -1176 -1163 -788 -220 -798 -1115 164 952 135 -225 83 777 1221 860
703H60R3o07P03M68r02J0j34j57J23l19p55M52j39n01j20n5L63n4m68k49O53L85
$$ 860 953 346 1049 1517 615 625 491 334 457 138 -617 -165 -304 -805 -925 -980 -617 -671 -1139 -1388 -735 -350
725c50J19q8j97N78K88K15Q0L21j58j83K87j77J75k23K29m85o2J9n51N5j56k41
$$ -350 -231 -319 -516 62 350 565 645 966 808 625 912 735 910 687 916 431 369 388 -163 -108 -264 -505
747e05n18L18j19q8j82R1K10J01K65j38R2L30L82j92J35N28J36k81K52K02l78
$$ -505 -1023 -705 -824 -912 -1094 -1003 -793 -692 -427 -565 -473 -143 239 47 182 710 846 565 817 1019 641
768F41J24j1m93Q7L41j14p07R0l35j32j27j1j54O6Kk54j33L82J12j2L99J99r0
$$ 641 765 754 261 348 689 575 -132 -42 -377 -509 -636 -647 -801 -735 -733 -987 -1120 -738 -626 -638 -239 -40 -130
791a30M2M18n7K31L99l19J03J36L8m66K16K81p84K35m61J05k75r0j58n2j28P6
$$ -130 -88 330 273 504 903 584 687 823 861 395 611 892 108 343 -118 -13 -288 -378 -536 -588 -716 -640
813f40r3o5K36r0j16K75J48O2J56J52J44J57K15K7N7R9J91q9K0m8k89n9J4m36
$$ -640 -733 -798 -562 -652 -768 -493 -345 -283 -127 25 169 326 541 568 625 724 915 826 846 798 509 450 464 28
837B8o2m7o3k69j25r9k54m2J45J33l04L60K25J07J47MK01R2M04j52R7P0j02K70
$$ 28 -34 -81 -144 -413 -538 -637 -891 -933 -788 -655 -959 -599 -374 -267 -120 -116 85 177 581 429 526 596 494 764
861G64J28j85j7k96j30nj60m6k82p6j95k15J73P5l10Q6%N6j37L1L31Q1K98r9R2
$$ 764 892 707 690 394 264 259 99 53 -229 -305 -500 -715 -542 -467 -777 -691 -691 -635 -772 -741 -410 -329 -31 -130 -38
886c8J80K32K43n7j60M64p6k59k9J05j11m1j40j44m29R1j30l1m65L87n22K25K12
$$ -38 142 374 617 560 400 864 788 529 500 605 494 453 313 169 -260 -169 -299 -330 -795 -408 -930 -705 -493
909d93j44J29J62J29j37J66n1M74R6r0L3J83M32k09j70N7O3J6k13n6k42k74R4
$$ -493 -637 -508 -346 -217 -354 -188 -239 235 331 241 274 457 889 680 510 567 630 646 433 377 135 -139 -45
932d5J34m89N6N7l09J13k40j71J51K1J95K98N2J31k32M77L53k05j97M46M74n74
$$ -45 89 -400 -344 -287 -596 -483 -723 -894 -743 -722 -527 -229 -177 -46 -278 199 552 347 150 596 1070 496
954D96R5j2M0J45k56j96J33m96R5j36k64o0KK2j95k60PK28K1j58K31L35k6N2J33
$$ 496 591 579 619 764 508 312 445 -51 44 -92 -356 -416 -414 -392 -587 -847 -840 -612 -591 -749 -518 -183 -209 -157 -24
979b4K64J05J57o2O5J21j39J82j15K91k18m58L01k58m70J95P9p3m33J3O1j22r4
$$ -24 240 345 502 440 505 626 487 669 554 845 627 169 470 212 -258 -63 16 -57 -490 -477 -416 -538 -632
1002f32lm6K15j45L81m2K37J8L28J07j54k6K00L47m52jK16N6l0j20k96J35j86
$$ -632 -635 -681 -466 -611 -230 -272 -35 -17 311 418 264 238 438 785 333 332 548 604 574 454 158 293 107
1025A07l00Q3J52l49n20L99K30o40L07J40K01n64K40J44J89j1K77jm7K82O9M8
$$ 107 -193 -110 42 -307 -827 -428 -198 -838 -531 -391 -190 -754 -514 -370 -181 -192 85 84 37 319 388 436
1047D36K09j57o4L40j67k29k96K17L1o50k8Q7K91n37k60L08J42l29J33R4k55P8
$$ 436 645 488 424 764 597 368 72 289 320 -330 -358 -271 20 -517 -777 -469 -327 -656 -523 -429 -684 -606
1069f06O8L65p6J1J66N13k1k99K25L23j20r9J77k24K97k04k05j39K9J5k20k68
$$ -606 -538 -173 -249 -238 -72 441 420 121 346 669 549 450 627 403 700 496 291 152 181 196 -24 -292
1091b92o6j59N6K81k16m39J70L04K8k98K34O47k02p2N43j31o4N1L92k29pJ8M8
$$ -292 -358 -517 -461 -180 -396 -835 -665 -361 -333 -631 -397 250 48 -24 519 388 324 375 767 538 531 549 597
1114E97J18l01k60K4j62j22j09M6l75J8k9m3K04n3J47j40R7r8Q3M10j02k6K28
$$ 597 715 414 154 178 16 -106 -215 -169 -544 -526 -555 -598 -394 -447 -300 -440 -343 -441 -358 52 -50 -76 152
1137A52J58L5R0K15k78J21J49j69j3r7j89J28j58k03j67o9m2m6o4N8q2j09rL8
$$ 152 310 345 435 650 372 493 642 473 460 363 174 302 144 -59 -226 -295 -337 -383 -447 -389 -471 -580 -589 -551
1161e51K84P5r5J4L05j6J30l3K09M9J46j50L65r1k19L4k4j90q0j28K07j74j89
$$ -551 -267 -192 -287 -273 32 16 146 113 322 371 517 367 732 641 422 456 432 242 162 34 241 67 -122
1184a22k70J55n6Q2m67J86j20J48K0K25j00p8K82L37k0r5J14Q7J85m6j13O7k06
$$ -122 -392 -237 -293 -211 -678 -492 -612 -464 -444 -219 -319 -397 -115 222 202 107 221 308 493 447 334 401 195
1207A95K21K43k43l9j82j88K3n6%j92p2n1j50M6J12%k5J05j71J78L26j40k5J28
$$ 195 416 659 416 377 195 7 30 -26 -26 -218 -290 -341 -491 -445 -333 -333 -358 -253 -424 -246 80 -60 -85 43
1231D3J55j8K01O3l4Q7j70K12p6j68k13L75l80J66p18K78k4l4k06n8K84k23Q3
$$ 43 198 180 381 444 410 497 327 539 463 295 82 457 77 243 -475 -197 -221 -255 -461 -519 -235 -458 -375
1254c75k41K37M8J62N2k00L44K33N2J09J24k42J14J41o5k08J94L6j18l6k51N5
$$ -375 -616 -379 -331 -169 -117 -317 27 260 312 421 545 303 417 558 493 285 479 515 397 361 110 165
1276A65k07m5j22j34J88k37J24k13K84j02R0K2L0k5K07N5k7Q7K78r3J40k92J09
$$ 165 -42 -87 -209 -343 -155 -392 -268 -481 -197 -299 -209 -187 -157 -182 25 80 53 140 418 325 465 173 282
1299B82J47j83K03J5k48q1J15j24k94n5P7j31j88N2j51r6J03J65KL10j00J87k28
$$ 282 429 246 449 464 216 135 250 126 -168 -223 -146 -277 -465 -413 -564 -660 -557 -392 -390 -80 -180 7 -221
1322b21P4M2L36J47j12J43k34K74k44L46j06n4p4l67L13q7L1o0l34m6k3j52K5
$$ -221 -147 -105 231 378 266 409 175 449 205 551 445 391 317 -50 263 176 207 147 -187 -233 -256 -408 -383
1345c83o0J36K9j88RK10J35O7k44K32o5L56k05K07O3J9k45L54L8m22J28j0m5j51
$$ -383 -443 -307 -278 -466 -457 -247 -112 -45 -289 -57 -122 234 29 236 299 318 73 427 465 43 171 161 116 -35
1369c5N0M4l77J57j56m9J60k34j4k04L67M4J6n6L08j50J01K19k61K68J48j57J36
$$ -35 15 59 -318 -161 -317 -366 -206 -440 -454 -658 -291 -247 -231 -287 21 -129 -28 191 -70 198 346 189 325
1392C25M9r7l9N1o4n8j88P5Q1j42r2l0P4m20J63n5q2K05J70k21O7K12j21j11K80
$$ 325 374 277 238 289 225 167 -21 54 135 -7 -99 -129 -55 -475 -312 -367 -449 -244 -74 -295 -228 -16 -137 -248 32
1417C2J42O4j71L6K95j97P3J37j67J64k80O9N6l48J71q2p5P1n00L44m0J04p4j85
$$ 32 174 238 67 103 398 201 274 411 244 408 128 197 253 -95 76 -6 -81 -10 -510 -166 -206 -102 -176 -361
1441c61N1k9K3L8J11K28L9k89N76j41j69L14r9Rk53O25l80r1L39m27M7j72J84
$$ -361 -310 -339 -316 -278 -167 61 100 -189 387 246 77 391 292 301 48 673 293 202 541 114 161 -11 173
1464A73j36j45p2r6q6M2o7r7K49j78J74K91k42l3J87R8K46p6j84kJ42j17L85l22
$$ 173 37 -108 -180 -276 -362 -320 -387 -484 -235 -413 -239 52 -190 -223 -36 62 308 232 48 46 188 71 456 134
1488A34J52Kr8N9k54P1j96j57L16k00L7j47l4j9N3k3q2J81j28J55%J59k21K59
$$ 134 286 288 190 249 -5 66 -130 -287 29 -171 -134 -281 -315 -334 -281 -304 -386 -205 -333 -178 -178 -19 -240 19
1512A9R4J92l54K05J49J66j54O3O0j55J1k49k35M0L86n96J74L6N7k75M1K18n1
$$ 19 113 305 -49 156 305 471 317 380 440 285 296 47 -188 -148 238 -358 -184 -148 -91 -366 -325 -107 -158
1535a58j19j01N1K54j73K64j04k04L52j90K85K94k69J62q2j71L78Ol12N4k78L05
$$ -158 -277 -378 -327 -73 -246 18 -86 -290 62 -128 157 451 182 344 262 91 469 475 163 217 -61 244
1557B44k04j92r5R5k53K49j19P2q8P7P1k38K87j18K14m8mK14J25o6J25j87J02
$$ 244 40 -152 -247 -152 -405 -156 -275 -203 -291 -214 -143 -381 -94 -212 2 -46 -50 164 289 223 348 161 263
1580B63K5o1J43J02r5l62J38j49q3J4k9l09K24ok29K76l4L4j51j89J08L64j29
$$ 263 288 227 370 472 377 15 153 4 -79 -65 -94 -403 -179 -185 -414 -138 -172 -138 -289 -478 -370 -6 -135
1603a35M8K42m8q6l9M20J09j05j37q5M1m4J38m60L53m4K82m93j31J47k28kJ36
$$ -135 -87 155 107 21 -18 402 511 406 269 184 225 181 319 -141 212 168 450 -43 -174 -27 -255 -257 -121
1626a21k54j4J5J04N0j79J11N9J77oN3J57MJ89j73K54j29k50K68l06R8J26o7j20
$$ -121 -375 -389 -374 -270 -220 -399 -288 -229 -52 -58 -5 152 156 345 172 426 297 47 315 9 107 233 166 46
1650D6oO7j87nj42r1K17q7q4o5J25j13K68l26M38k52k8K38p6K69K3L5l4J37r8
$$ 46 40 107 -80 -85 -227 -318 -101 -188 -272 -337 -212 -325 -57 -383 55 -197 -225 13 -63 206 229 264 230 367 269
1675B69k68J52J64m66K98K2r6M9j16k60K61j98j95K33j22j59J78R7j1K5M9R6m6
$$ 269 1 153 317 -149 149 171 75 124 8 -252 9 -189 -384 -151 -273 -432 -254 -157 -168 -143 -94 2 -44
1698d4j4P9R3q5J27j78n9M06k4k93j4N2J17L5j90l3J44m0R5l27R8j84j6m6N5q9
$$ -44 -58 21 114 29 156 -22 -81 325 301 8 -6 46 163 198 8 -25 119 79 174 -153 -55 -239 -255 -301 -246 -335
1724c35P2L5k6J25rJ45r5L3Q8J35K44k01p8J91o2L5M5k15J91l40l3Q2j25o4J9
$$ -335 -263 -228 -254 -129 -138 7 -88 -55 33 168 412 211 133 324 262 297 342 127 318 -22 -55 27 -98 -162 -143
1749a43j54J4r4J23j56R0J18J82k8l5k4%K38j45O6Q8K0O1R8j24R0l9o8n1p0J3
$$ -143 -297 -283 -377 -254 -410 -320 -202 -20 -48 -83 -107 -107 131 -14 52 140 160 221 319 195 285 246 178 127 57 70
1775G0N0J39j33j19k39P3j03J16J54p6k35J56j59L41l84K11LJ14N2K00k3n0J42
$$ 70 120 259 126 7 -232 -159 -262 -146 8 -68 -303 -147 -306 35 -349 -138 -135 -21 31 231 208 158 300
1798C00j78rj34J86J70l5Lj66M1r1j3l17M3K11k25K3k8K49m26J31Q2J44KL7k4
$$ 300 122 113 -21 165 335 300 303 137 178 87 74 -243 -200 11 -214 -191 -219 30 -396 -265 -183 -39 -37 0 -24
1823b4J4K2j56M16j22J3J61k86Q2J01O1k25J5%Q2R5n4l35L17m15J39j7m0l8j49
$$ -24 -10 12 -144 272 150 163 324 38 120 221 282 57 72 72 154 249 195 -140 177 -238 -99 -116 -156 -194 -343
1848c43K1Q6N5P9m4J28pj11P9K19j07J44J32j84J5K1j78K97k08j49J75j1J07j75
$$ -343 -322 -236 -181 -102 -146 -18 -25 -136 -57 162 55 199 331 147 162 183 5 302 94 -55 120 109 216 41
1872D1L6m9%k15o3j37K00J07J65k58P3K8J12p3J85n3k8L3K22j69J26j35kJ59m5
$$ 41 77 28 28 -187 -250 -387 -187 -80 85 -173 -100 -72 40 -33 152 99 71 104 326 157 283 148 146 305 260
1897B60j47J01Q1k62j76l4j72J67n0K40n20L23k11kM35l03J35j46J59n0L07K07
$$ 260 113 214 295 33 -143 -177 -349 -182 -232 8 -512 -189 -400 -402 33 -270 -135 -281 -122 -172 135 342
1919C42j37k71R4j00J86K45j25o6j12L4J42l35K7J59M2j51n61N26p0l3J4K3j90
$$ 342 205 -66 28 -72 114 359 234 168 56 90 232 -103 -76 83 125 -26 -587 -61 -131 -164 -150 -127 -317
1942c17K99j27J02Q3l15P8L07q0l3K04j49J76k90J96L0K62k14j09P6J34k48l4
$$ -317 -18 -145 -43 40 -275 -197 110 30 -3 201 52 228 -62 134 164 426 212 103 179 313 65 31
1964C1J86l16J81j16l2l77J32J39j2p2R9k23K51K79r0Nj36J18p0M0J90p7p8N8
$$ 31 217 -99 82 -34 -66 -443 -311 -172 -184 -256 -157 -380 -129 150 60 65 -71 47 -23 17 207 130 52 110
1988A10J65O8j02k7Q3k02j91r8K42p6k34K60k30j84K72k46P6J79j24P0J71j17
$$ 110 275 343 241 214 297 95 -96 -194 48 -28 -262 -2 -232 -416 -144 -390 -314 -135 -259 -189 -18 -135
2010a35l1J62J09K0L6J71j09k4J10l73j23K83R5j45L52k06o5j86J48j0l45J31
$$ -135 -166 -4 105 125 161 332 223 199 309 -64 -187 96 191 46 398 192 127 -59 89 79 -266 -135
2032a35k03N0J93O5nqq6j7J61Mj55J21J00L9K8j73o6J83J18j46J08j57L27j10
$$ -135 -338 -288 -95 -30 -35 -43 -129 -146 15 19 -136 -15 85 124 152 -21 -87 96 214 68 176 19 346 236
2056B36j73L1j26L3J1l13J30K7M6j09r3L24k31P1o4L16j02j32N1K58k00J84P0
$$ 236 63 94 -32 1 12 -301 -171 -144 -98 -207 -300 24 -207 -136 -200 116 14 -118 -67 191 -9 175 245
2079B45k25M76m06J47Lq8rl2j46Q7q2r1Q5k24r5K80k8q7o9J67J7K80l93J17K67
$$ 245 20 496 90 237 240 152 143 111 -35 52 -30 -121 -36 -260 -355 -75 -103 -190 -259 -92 -75 205 -188 -71 196
2104A96k52Q8q9J24P4J85l2k8k75P7L39l10k36J14n3j29LJ28R7r3J93p1l40K53
$$ 196 -56 32 -57 67 141 326 294 266 -9 68 407 97 -139 -25 -78 -207 -204 -76 21 -72 121 50 -290 -37
2128c7l9o4j57J50J50J47j0j54J16j81J85M0P7j80j21M25j74N06l31j8j97M8n5
$$ -37 -76 -140 -297 -147 3 150 140 -14 102 -79 106 146 223 43 -78 347 173 679 348 330 133 181 126
2151A26j3j96J49J71l13Qr0J1q2K33o0k27m9M50o4P8k61K16j16J75j1j33J21J48
$$ 126 113 -83 66 237 -76 -68 -158 -147 -229 4 -56 -283 -332 118 54 132 -129 87 -29 146 135 2 123 271
2175B71k95J97mkj65K30k65m4M30l37lm2L2k62P0J82j8k30K27j41P4M1N7q2J06
$$ 271 -24 173 169 167 2 232 -33 -77 353 16 13 -29 3 -259 -189 -7 -25 -255 -28 -169 -95 -54 3 -79 27
2200B7M5J24m2M2k90R3J16M2r6Q6j32L62j53l22j8K5J06LJ8k67P1n6J80N0P5k22
$$ 27 72 196 154 196 -94 -1 115 157 61 147 15 377 224 -98 -116 -91 15 18 36 -231 -160 -216 -36 14 89 -133
2226a33j28L6L8J75q5K95j27k8j52K35J43k60O5j15K13o9J98j88j49Q0m6R1j44
$$ -133 -261 -225 -187 -12 -97 198 71 43 -109 126 269 9 74 -41 172 103 301 113 -36 44 -2 89 -55
2249e5j34P5j23K3J46j9J02k55L54j57p8P3j20M75o6k55j6J43J2Q7o9J48p5l8
$$ -55 -189 -114 -237 -214 -68 -87 15 -240 114 -43 -121 -48 -168 307 241 -14 -30 113 125 212 143 291 216 178
2273A78L6K3k68K54k23n1O2k02J20M1k5l13J82L11l85J97j38M31j69R3m2j84R7
$$ 178 214 237 -31 223 0 -51 11 -191 -71 -30 -55 -368 -186 125 -260 -63 -201 230 61 154 112 -72 25
2296B5m6K2K69Q7m01L13l19R5m5o8J30L5j11l3J3PK4J33j88J49j40M7NM1l9l8
$$ 25 -21 1 270 357 -44 269 -50 45 0 -68 62 97 -14 -47 -34 -27 -3 130 -58 91 -49 -2 3 44 5 -33
2322c3J70j00N6k22p1M87k34J87k57L48Jj94pM4k15j8J60k64J85j25K94l51l0
$$ -33 137 37 93 -129 -200 287 53 240 -17 331 332 138 131 175 -40 -58 102 -162 23 -102 192 -159 -189
2345a89K05k26J59j04J6p8O9J87m83L52M75k15j36J76k99K72J19k71l5mK26j39
$$ -189 16 -210 -51 -155 -139 -217 -148 39 -444 -92 383 168 32 208 -91 181 300 29 -6 -10 216 77
2367G7j54L5l3K20j78P9k00J10L0J27k40k33j5J88J29j17J72k37J98kJ96l8k15
$$ 77 -77 -42 -75 145 -33 46 -154 -44 -14 113 -127 -360 -375 -187 -58 -175 -3 -240 -42 -44 152 114 -101
2390a01L48m81K01j0R1j20K19j30K01q6r0j01R4n6r9L25l64q5rK18r5K34l52J13
$$ -101 247 -234 -33 -43 48 -72 147 17 218 132 42 -59 35 -21 -120 205 -159 -244 -253 -35 -130 104 -248 -135
2414a35Q2l4J25j79L27k66R5J89j95K47K4j22K4j70J17O6l0l43J84L2j57J54j12
$$ -135 -53 -87 38 -141 186 -80 15 204 9 256 280 158 182 12 129 195 165 -178 6 38 -119 35 -77
2437g7rr1k4J51lJ38n43N46k0j78J18o2J47k11J32M5N1k5J45p3r3QK69j37j57
$$ -77 -86 -177 -201 -50 -53 85 -458 88 68 -110 8 -54 93 -118 14 59 110 85 230 157 64 72 341 204 47
2462D7j00Q9p2j00O5N6k55K33K49m85O9J26P7j06N7lQ4m2K59l42K86k26L3J04
$$ 47 -53 36 -36 -136 -71 -15 -270 -37 212 -273 -204 -78 -1 -107 -50 -53 31 -11 248 -94 192 -34 -1 103
2486A03k19L54k75K49j4j13K2q0K2j12P5R5j61j43P4j02L18k73n3L43l68K4l11
$$ 103 -116 238 -37 212 198 85 107 27 49 -63 12 107 -54 -197 -123 -225 93 -180 -233 110 -258 -234 -545
2509e45N63p1k21K92j17J0M15k40L1J20P2j57j61J32j48K00j19q5J39q7l1o3p
$$ -545 18 -53 -274 18 -99 -89 326 86 117 237 309 152 -9 123 -25 175 56 -29 110 23 -8 -71 -78
2532g8k52j06L08N0q0k01J90J33o4Q5l9Q4J73k62Q0K43k3k29J71k94O1J97J64
$$ -78 -330 -436 -128 -78 -158 -359 -169 -36 -100 -15 -54 30 203 -59 21 264 241 12 183 -111 -50 147 311
2555C11m10J08o7O6k1l09J06Q4M27n52J53J28k09k17K33K92r7J40l14J56p0q3
$$ 311 -99 9 -58 8 -13 -322 -216 -132 295 -257 -104 24 -185 -402 -169 123 26 166 -148 8 -62 -145
2577a45p3L66L9j9m8j25K88j56J77m71L73j46j34j11J57l3j43N9N3k7R2k28q2
$$ -145 -218 148 187 168 120 -5 283 127 304 -167 206 60 -74 -185 -28 -61 -204 -145 -92 -119 -27 -255 -337
2600c37P5L39j85J09oj29K3j5L39l7l43K40j25N6J86o9J24M5r4k5j36M4k03M8
$$ -337 -262 77 -108 1 -5 -134 -111 -126 213 176 -167 73 -52 4 190 121 245 290 196 171 35 79 -124 -76
2624g6j64K96k47j70K31j81m8J45L6R3J75k44k5K90K17l00O1J21r7m3P8j64Q2
$$ -76 -240 56 -191 -361 -130 -311 -359 -214 -178 -85 90 -154 -179 111 328 28 89 210 113 70 148 -16 66
2647F6R2j61j72L60j05k5NN9k96j91L13j24J38l32J90O1J34j49pj81J65M3K12
$$ 66 158 -3 -175 185 80 55 60 119 -177 -368 -55 -179 -41 -373 -183 -122 12 -137 -144 -325 -160 -117 95
2670I5k39J91K07l89O2J72j5q6n2J16rj38J77k29J05j51J70j66m2N3Q0j32J06
$$ 95 -144 47 254 -135 -73 99 84 -2 -54 62 53 -85 92 -137 -32 -183 -13 -179 -221 -168 -88 -220 -114
2693a14N4j0n3j19L92l14K44J8Q4k15OK74j79J90q0l5j88J85M7j31M6q3p1J84
$$ -114 -60 -70 -123 -242 150 -164 80 98 182 -33 -27 247 68 258 178 143 -45 140 187 56 102 19 -52 132
2717A32l11o6K56k36J43N2J2j29J14j49K62o8J13l2j64J43j57J59K1J56r7k45
$$ 132 -179 -245 11 -225 -82 -30 -18 -147 -33 -182 80 12 125 93 -71 72 -85 74 95 251 154 -91
2739i1J93m3J31qJ32n80J02K24k4k39K71j51Lo4J75j75J04K2l28K74O1p4K33J09
$$ -91 102 59 190 182 314 -266 -164 60 36 -203 68 -83 -80 -144 31 -144 -40 -18 -346 -72 -11 -85 148 257
2763B57k30R8p2p9J98p5m4J36j14K10m8l27K4J40J89o6j37K2j32m4j06J43j05
$$ 257 27 125 53 -26 172 97 53 189 75 285 237 -90 -66 74 263 197 60 82 -50 -94 -200 -57 -162
2786a62N7r4K7l6K20K08m64m8M01j06o3L50k20J45k60K84j50J13k24P9j97K47
$$ -162 -105 -199 -172 -208 12 220 -244 -292 109 3 -60 290 70 215 -45 239 89 202 -22 57 -140 107
2808A07k49K84l89K45kk03O1R9j34J60j73l9J28j38J96M46n57J05P3J43p1k74
$$ 107 -142 142 -247 -2 -4 -207 -146 -47 -181 -21 -194 -233 -105 -243 -47 399 -158 -53 20 163 92 -182
2830a82J3kL11m5n7K32p8k41J82j65o3O8J95k29L21n27L33j11j10J64k90M27j66
$$ -182 -169 -171 140 95 38 270 192 -49 133 -32 -95 -27 168 -61 260 -267 66 -45 -155 9 -281 146 -20
2853b0n3l6K47l9p6k9M0P2K2J50j27m9j1J62k98J21N8o8J6q9k42L19j28J10K0
$$ -20 -73 -109 138 99 23 -6 34 106 128 278 151 102 91 253 -45 76 134 66 82 -7 -249 70 -58 52 72
2878G2l49J55k3j1J70j57nJ23O6kJ07k41O5kl2N4L1O0k8L13q1k52R1k03k17N07
$$ 72 -277 -122 -145 -156 14 -143 -148 -25 41 39 146 -95 -30 -32 -64 -10 21 81 53 366 285 33 124 -79 -296 211
2904B11k7l30J54q1r8J43k52J38j4nN4m7K12L7j45k18L50J22j90P7j25Q0J57j52
$$ 211 184 -146 8 -73 -171 -28 -280 -142 -156 -161 -107 -154 58 95 -50 -268 82 204 14 91 -34 46 203 51
2928E1M8k6j43K96q3k14j08K49j43kJ25j33L0lJ15p1J19n22L16L01l32MJ33J12
$$ 51 99 73 -70 226 143 -71 -179 70 -73 -75 50 -83 -53 -56 59 -12 107 -415 -99 202 -130 -126 7 119
2952A19j1j3m1k4o7o5J76K7j31J86l88L05j5k14J48R1j83r9Q1o2Ko6K02R8j95
$$ 119 108 95 54 30 -37 -102 74 101 -30 156 -232 73 58 -156 -8 83 -100 -199 -118 -180 -178 -244 -42 56 -139
2977a39P1J97Q4J04l72Q1L2P1q6L2P1k60M8J10J34Q3q7k61L2O5j2L3k19J7o0K52
$$ -139 -68 129 213 317 -55 26 58 129 43 75 146 -114 -66 44 178 261 174 -87 -55 10 -2 31 -188 -171 -231 21
3003B1m97L02J53r5J94j05j0N9o8O9l4L10l76K27J39n9k84K8K41p6k0k76K07m9
$$ 21 -476 -174 -21 -116 78 -27 -37 22 -46 23 -11 299 -77 150 289 230 -54 -26 215 139 119 -157 50 1
3027Aj08L5RJ23l4l19K27j16k92M03J5J85l21J72R1k60J53P2Q4J4o9J00k00L08
$$ 1 -107 -72 -63 60 26 -293 -66 -182 -474 -71 -56 129 -192 -20 71 -189 -36 36 120 134 65 165 -35 273
3051B73j86k72J79K8J64R2j56k95K54j34p2p4M4J58J02k10l1M8J03L1q0p8M0J10
$$ 273 87 -185 -6 22 186 278 122 -173 81 -53 -125 -199 -155 3 105 -105 -136 -88 15 46 -34 -112 -72 38
3075C8o7N4M7nj21J25J61l39J49L79k51r9L6J31k13j78J7J41p0Q9k50O7L46k46
$$ 38 -29 25 72 67 -54 71 232 -107 42 421 170 71 107 238 25 -153 -136 5 -65 24 -226 -159 187 -59
3099e9J46n3N3k47K19l9n0J55j53K0OL1n2L2J14k76J96K22j59j19L4J20jk89J06
$$ -59 87 34 87 -160 59 20 -30 125 -28 -8 -2 29 -23 9 123 -153 43 265 106 -13 21 141 140 -149 -43
3124d3J02j19J66k63q5r0K72K4L0j7p1J47k46R4k70M21l7k37M13N1k29OK16l04
$$ -43 59 -60 106 -157 -242 -332 -60 -36 -6 -23 -94 53 -193 -99 -369 52 15 -222 191 242 13 19 235 -69
3148f9J80j8l0K4l01M14k57R9m8J50k46k70K37J29R9k37j28L04m3j16L2O0j21
$$ -69 111 93 63 87 -214 200 -57 42 -6 144 -102 -372 -135 -6 93 -144 -272 32 -11 -127 -95 -35 -156
3171a56J73J0J58R4P5l61J01k5k7j36J0J86n2j34R6j93K52k75q6L41k15J05J04
$$ -156 17 27 185 279 354 -7 94 69 42 -94 -84 102 50 -84 12 -181 71 -204 -290 51 -164 -59 45
3194D5j60lk6k4K07j4j13J12n8P1M7K59k27m1J61j57j40K3j9n6K15M1m39L83P5
$$ 45 -115 -118 -144 -168 39 25 -88 24 -34 37 84 343 116 75 236 79 -61 -38 -57 -113 102 143 -296 87 162
3219A62m02o4J68R2j36K15j66M4M4r2j5K37l0j02J5p0J86Q1J7j37R6j42n2J97
$$ 162 -240 -304 -136 -44 -180 35 -131 -87 -43 -135 -150 87 57 -45 -30 -100 86 167 184 47 143 1 -51 146
3243A46m0j36N1n9K6M3k5n2Ln2K17k86P9N8mj32M1J34P7j52J71O1q9Q8nj87o3
$$ 146 106 -30 21 -38 -12 31 6 -46 -43 -95 122 -164 -85 -27 -31 -163 -122 12 89 -63 108 169 80 168 163 -24 -87
3270h7K59k78N92l07M4k96L03l30j04J7pK53k88J76L2j84k3K90j12jr7J44L6N6
$$ -87 172 -106 486 179 223 -73 230 -100 -204 -187 -194 59 -229 -53 -21 -205 -228 62 -50 -51 -148 -4 32 88
3294H8k7O4k6l41L51lK4k23K73P8k43J35r7j09J11j94J57j23j10JK50k53J39j95
$$ 88 61 125 99 -242 109 106 130 -93 180 258 15 150 53 -56 55 -139 18 -105 -215 -214 36 -217 -78 -273
3318b73L34k5l76L95J59k72N5p2%L2j81K33J5P1J85l89K94k60K42j14l3j23J51
$$ -273 61 36 -340 55 214 -58 -3 -75 -75 -43 -224 9 24 95 280 -109 185 -75 167 53 20 -103 48
3341D8j70M1j33M7LJ48J09p2o6J48J22l22Q8L8J27l75K00K0n4M11k07oNk5j69
$$ 48 -122 -81 -214 -167 -164 -16 93 21 -45 103 225 -97 -9 29 156 -219 -19 1 -53 358 151 145 150 125 -44
3366d4R8k95K03J33l43J93J3K7O2J07m89M78M7l06J43j80J04J85j18L14m38J50
$$ -44 54 -241 -38 95 -248 -55 -42 -15 47 154 -335 143 190 -116 27 -153 -49 136 18 332 -106 44
3388D4j02K81J12l90%J18qM0K05m53P3jL63k66j52J30rJ8N9k13P5q1J33Lj77N5
$$ 44 -58 223 335 -55 -55 63 55 95 300 -153 -80 -81 282 16 -136 -6 -15 3 62 -151 -76 -157 -24 -21 -198 -143
3414a43J67l83M03q5j62M35o1k24K4Q9j1R6k25J48J11o6J25m62L47k25K01j27
$$ -143 24 -359 44 -41 -203 232 171 -53 -29 60 49 145 -80 68 179 113 238 -224 123 -102 99 -28
3436b8k0j76J15j67K22J46j68L37j88j39K0jJ32j09J94n0R7l26K83P1j03J22J11
$$ -28 -48 -224 -109 -276 -54 92 -76 261 73 -66 -46 -47 85 -24 170 120 217 -109 174 245 142 264 375
3459C75L0n14J51m6k1JL1j58N9J30l2j14o4J70k8k35K78j82J64j7J58k04l7J56
$$ 375 405 -109 42 -4 -25 -24 7 -151 -92 38 6 -108 -172 -2 -30 -265 13 -169 -5 -22 136 -68 -105 51
3483E1K72j53j21N5K14l64p6K21L1j76j96K3K54l5p1m8J28p0M1r1j3J3j17M04
$$ 51 323 170 49 104 318 -46 -122 99 130 -46 -242 -219 35 0 -71 -119 9 -61 -20 -111 -124 -111 -228 176
3507A76k65o3J13j47K0J19j41L10o2Q0k77K39p6K6K8K80l44m9J41l16J23J20O1
$$ 176 -89 -152 -39 -186 -166 -47 -188 122 60 140 -137 102 26 52 80 360 16 -33 108 -208 -85 35 96
3530I6j32R3m19M33q3Q9j97P3J03k75K28N5K27l79K6N3J04q0nj00RK46p6N7j51
$$ 96 -36 57 -362 71 -12 77 -120 -47 56 -219 9 64 291 -88 -62 -9 95 15 10 -90 -81 165 89 146 -5
3555eJ06j06j52Q7P9J42k0k07N2K5n5j17j01OM29j01j75Q4K2q8l7J78p5k9l7J28
$$ -5 101 -5 -157 -70 9 151 131 -76 -24 1 -54 -171 -272 -266 163 62 -113 -29 -7 -95 -132 46 -29 -58 -95 33
3581C3J26k23M4J58M7jj98r2Q7j82R2J38M2j48j1N2J7k25k6M6K63j35J62r4q1
$$ 33 159 -64 -20 138 185 184 -14 -106 -19 -201 -109 29 71 -77 -88 -36 -19 -244 -270 -224 39 -96 66 -28 -109
3606a09J00n2r7O5K19K03k00P0k66J43K21j46o0k98MJ84N8Q0j90m9j22N05m58
$$ -109 -9 -61 -158 -93 126 329 129 199 -67 76 297 151 91 -207 -203 -19 39 119 -71 -120 -242 263 -195
3629a95j9Q6J22j59J49k79K07L05m03J20%O6O9j23J86l6l9r9r9J99K9n5r6L0K23
$$ -195 -214 -128 -6 -165 -16 -295 -88 217 -186 -66 -66 0 69 -54 132 96 57 -42 -141 58 87 32 -64 -34 189
3654A89j19k07j49Q3j0MK63j51o0J22j14J35R5J56l49J72Oj98J73J9L5J08k66
$$ 189 70 -137 -286 -203 -213 -209 54 -97 -157 -35 -149 -14 81 237 -112 60 66 -132 41 60 95 203 -63
3677f3J07k31J15L40j74j99J07k07L07j28q5j24J72R0k59J99J37j82J52O2j51
$$ -63 44 -187 -72 268 94 -105 2 -205 102 -26 -111 -235 -63 27 -232 -33 104 -78 74 136 -15
3698a5k8L6J26q7P7n6J72m55J29L65j82P4q5j93K8K04n2j83J37j45J08Mj70L17
$$ -15 -43 -7 119 32 109 53 225 -230 -101 264 82 156 71 -122 -94 110 58 -125 12 -133 -25 -21 -191 126
3722A26l50J16j10K21n0l63M90j42J50k06J17O8j50N5J62j60N0jj14J51P4o0l3
$$ 126 -224 -108 -218 3 -47 -410 80 -62 88 -118 -1 67 -83 -28 134 -26 24 23 -91 60 134 74 41
3745D1J21k23L8J55O1M2k42k12K6K6J67j23k20K79Q6n2J39j43L7j28K85j07n6
$$ 41 162 -61 -23 132 193 235 -7 -219 -193 -167 0 -123 -343 -64 22 -30 109 -34 3 -125 160 53 -3
3768cj46N38k33q5j8L5Q8Lj34k21L27n41L95J86m09J56K5P1K71k85j81o3J44K51
$$ -3 -149 389 156 71 53 88 176 179 45 -176 151 -390 5 191 -218 -62 -37 34 305 20 -161 -224 -80 171
3792A71p8q7K13l37L45j12k41K42J01J8k69J39J0j02k25Q7K13l9M5l22L21J2o6
$$ 171 93 6 219 -118 227 115 -126 116 217 235 -34 105 115 13 -212 -125 88 49 94 -228 93 105 39
3815C9k40R8j76K31o6Q4K7NN9J56j42j66K92j39M2j83j97M85k83R1pN3j02J10
$$ 39 -201 -103 -279 -48 -114 -30 -3 2 61 217 75 -91 201 62 104 -79 -276 209 -74 17 10 63 -39 71
3839G1j37j00j1K59o6Ok10O7Q8q6j82L46J22j71j24J22Q6oQrJ7p4K67l14j01J30
$$ 71 -66 -166 -177 82 16 22 -188 -121 -33 -119 -301 45 167 -4 -128 -6 80 74 82 73 90 16 283 -31 -132 -2
3865bJ20J20k06p3J85L0l07K20p3j83J4M7P2J89j26j6k27J32K3l3J8%j35L16p7
$$ -2 118 238 32 -41 144 174 -133 87 14 -169 -155 -108 -36 153 27 11 -216 -84 -61 -94 -76 -76 -211 105 28
3890B8l9J57l0j10K9R1n4l6j66L98j92Qj33J61l1j08mm4n3k0l3J98J42k19J65
$$ 28 -11 146 116 6 35 126 72 36 -130 268 76 84 -49 112 81 -27 -31 -75 -128 -148 -181 17 159 -60 105
3915A05k6r1Nj78J92P7r3L6M3Om1k70K14Q6l4J90n9j20n4J94J4m14K22o9j16K08
$$ 105 79 -12 -7 -185 7 84 -9 27 70 76 35 -235 -21 65 31 221 162 42 -12 182 196 -218 4 -65 -181 27
3941B7k78L10J01m11K04Q2L7Qj11R3O6n2o0K4p1K9j34L42j63K31j36lK0k00J5
$$ 27 -251 59 160 -251 -47 35 72 80 -31 62 128 76 16 40 -31 -2 -136 206 43 274 138 135 155 -45 -30
3966c0P2Q7j27K5p4J1n2J0q2k9K21O1Q2j10Q7l4P1j70K3j30K11j61J11Q2o1J81
$$ -30 42 129 2 27 -47 -36 -88 -78 -160 -189 32 93 175 65 152 118 189 19 42 -88 123 -38 73 155 94 275
3992B75l47O2q4j77L75k11R6kj77l8n3K57N7J2j04P4J1k38K76L1rk52K48p3O5
$$ 275 -72 -10 -94 -271 104 -107 -11 -13 -190 -228 -281 -24 33 45 -59 15 26 -212 64 95 86 -166 82 9 74
4017G4o4k5q8L0K48l5Po8J78l05o7o0M61m00P3J73j17m7Q4q3p8J57j85J73n4l4
$$ 74 10 -15 -103 -73 175 140 147 79 257 -48 -115 -175 286 -114 -41 132 15 -32 52 -31 -109 48 -137 36 -18 -52
4043e2j13J93j02J93jk40l5J08K4K91k84L10q7m4l48j09J65K01j16j01K38j43
$$ -52 -165 28 -74 119 118 -122 -157 -49 -25 266 -18 292 205 161 -187 -296 -131 70 -46 -147 91 -52
4065e2K18m44N8M7K32r8K48j50j51r3K04L4K9jk03K75n9J01j41O5j71J25J59k35
$$ -52 166 -278 -220 -173 59 -39 209 59 -92 -185 19 53 82 81 -122 153 94 195 54 119 -52 73 232 -3
4089cm4K14k30K78j65q1r8M3n2O9k69K20K83j31l63L50J15N5j38j59J85j84o5
$$ -3 -47 167 -63 215 50 -31 -129 -86 -138 -69 -338 -118 165 34 -329 21 136 191 53 -106 79 -105 -170
4112a70J82J33j7l21L87P1n5J41k24j07P9M3j33L1j24N6j61L7K05j61J13q4l01
$$ -170 12 145 128 -193 194 265 210 351 127 20 99 142 9 40 -84 -28 -189 -152 53 -108 5 -79 -380
4135c80L70K37m09K25j37J93Qj94J51L9j53M11k75j39N9%K20j18j41M8J59l48
$$ -380 -10 227 -182 43 -94 99 107 -87 64 103 -50 361 86 -53 6 6 226 108 -33 15 174 -174
4157a74L00l14J51J85j40k9K6K61j85r0Q5J00j92P8j03q0J43n2J34o9J13j57K86
$$ -174 126 -188 -37 148 8 -21 5 266 81 -9 76 176 -16 62 -41 -121 22 -30 104 35 148 -9 277
4180B77j38k00J60k00j8L33l62kq7J57L8K3L4J42k92J26R9j74J04rok16M57j70
$$ 277 139 -61 99 -101 -119 214 -148 -150 -237 -80 -42 -19 15 157 -135 -9 90 -84 20 11 5 -211 246 76
4204G6j20Q6j31L2J32Lk03J47Q6k4%j2j96K06n6r1q6L8K30l1k95k7L38o8j48O2
$$ 76 -44 42 -89 -57 75 78 -125 22 108 84 84 72 -124 82 26 -65 -151 -113 117 86 -209 -236 102 34 -114 -52
4230e2n2q0R7N9M8k15L27j07j59J70J00O3q9j34K94k15k67J80K97k13j07J73j68
$$ -52 -104 -184 -87 -28 20 -195 132 25 -134 36 136 199 110 -24 270 55 -212 -32 265 52 -55 118 -50
4253e0J5r3R6q5J6k04N6L21n9J81l8j69K40k03k0l4K02j25k32K98n9o1N6L05l83
$$ -50 -35 -128 -32 -117 -101 -305 -249 72 13 194 156 -13 227 24 4 -30 172 47 -185 113 54 -7 49 354 -29
4278b9J6J1p2k34L56j45P0O8K7M9p8l8j01J48j35Q3%Q8k04R0K1j63L74o6K5J0
$$ -29 -13 -2 -74 -308 48 -97 -27 41 68 117 39 1 -100 48 -87 -4 -4 84 -120 -30 -9 -172 202 136 161 171
4304A71j81Q6k02K20j6k77L15l75J35o3K48K1l06K40p6JJ7o3K80l4j59q3L32n4
$$ 171 -10 76 -126 94 78 -199 116 -259 -124 -187 61 82 -224 16 -60 -59 -42 -105 175 141 -18 -101 231 177
4328A77J8j66Kp5K23k08R5j12J17o0Q4j0k65Q4R5p5J36M9n14L27J57L0k27J14
$$ 177 195 29 31 -44 179 -29 66 -46 71 11 95 85 -180 -96 -1 -76 60 109 -405 -78 79 109 -118 -4
4352dk2p7N9J26j07J30j46Q6pK93n6l09P2j28K08K6N4qJ1o7N3j69j28K4n7L0J46
$$ -4 -26 -103 -44 82 -25 105 -41 45 38 331 275 -34 38 -90 118 144 198 190 201 134 187 18 -110 -86 -143 -113 33
4379C3O0j75l1K2q2j6K27l0j39k3O9J83k07R0J06kr6J34N6k24J70q0Ml13Q8O9
$$ 33 93 -82 -113 -91 -173 -189 38 8 -131 -154 -85 98 -109 -19 87 85 -11 123 179 -45 125 45 49 -264 -176 -107
4405a07J53L7j75J63j8J01k02k00J92j39K36o1k66M83j02q6J87o6Q6j47Pl2Q4
$$ -107 46 83 -92 71 53 154 -48 -248 -56 -195 41 -20 -286 197 95 9 196 130 216 69 76 44 128
4428A28K6j40k15M71m41L28k81L3J66j03N9j35q8K32j6N0j35j20K46l9l4k61K70
$$ 128 154 14 -201 270 -171 157 -124 -91 75 -28 31 -104 -192 40 24 74 -61 -181 65 26 -8 -269 1
$$ [...]
8191A36
##END NTUPLES=NMR FID
##END=
