##TITLE=1H_Pr 5074
 CDCl3
 8 sc, 
 14.12.2021
##JCAMPDX= 6.0         $$ Bruker NMR JCAMP-DX V2.0
##DATA TYPE= NMR FID
##DATA CLASS= NTUPLES
##ORIGIN= UXNMR, Bruker Analytische Messtechnik GmbH
##OWNER= root
$$ XWIN-NMR		Version 3.5
$$ Tue Dec 14 13:47:35 2021 Russian Standard Time (UT+4h)  she@DPX200
##.OBSERVE FREQUENCY= 200.131346
##.OBSERVE NUCLEUS= ^1H
##.DELAY= (6, 6)
##.ACQUISITION MODE= SIMULTANEOUS
##.ACQUISITION SCHEME= undefined
##.AVERAGES= 8
##.DIGITISER RES= 18
##SPECTROMETER/DATA SYSTEM= spect
##.PULSE SEQUENCE= zg30
##.SOLVENT NAME= CDCl3
##.SHIFT REFERENCE= (INTERNAL, CDCl3, 0, 15.7039)
##AUDIT TRAIL= $$ (NUMBER, WHEN, WHO, WHERE, WHAT)
$$ ##TITLE= Audit trail, XWIN-NMR		Version 3.5
$$ ##JCAMPDX= 5.01
$$ ##ORIGIN= Bruker BioSpin GmbH
$$ ##OWNER= she
$$ F:/spectra/data/she/nmr/H-F/1/audita.txt
$$ ##AUDIT TRAIL=  $$ (NUMBER, WHEN, WHO, WHERE, WHAT)
(   1,<2021-12-14 13:46:26.85 +0400>,<she>,<DPX200>,
      <created by zg, POWCHK disabled, PULCHK disabled
       configuration hash MD5:
       00 E9 B6 7A A2 85 ED C7 34 08 36 98 17 FE 4E 26
       data hash MD5: 16K
       CF D9 C3 8C D0 6A BD 6C AD E9 D7 2A 10 12 3D C0>)
$$ ##END=
$$ 
$$ hash MD5
$$ 86 0F 0F B7 AE 7B D5 A3 BE F6 39 E7 02 B5 4E 34
##$RELAX= 
##$RELAX= 
##$RELAX= 
##$RELAX= 
##$RELAX= 
##$RELAX= 
$$ Bruker specific parameters
$$ --------------------------
##$DU= <F:/spectra>
##$EXPNO= 1
##$NAME= <H-F>
##$PROCNO= 1
##$TYPE= <nmr>
##$USER= <she>
##$AMP= (0..31)
100 100 100 100 100 100 100 100 100 100 100 100 100 100 100 100 100 100 
100 100 100 100 100 100 100 100 100 100 100 100 100 100 
##$AQSEQ= 0
##$AQ_mod= 1
##$AUNM= <au_zg>
##$AUTOPOS= <>
##$BF1= 200.13
##$BF2= 200.13
##$BF3= 200.13
##$BF4= 200.13
##$BF5= 200.13
##$BF6= 200.13
##$BF7= 200.13
##$BF8= 200.13
##$BYTORDA= 1
##$CFDGTYP= 0
##$CFRGTYP= 5
##$CHEMSTR= <none>
##$CNST= (0..31)
1 1 145 1 1 1 1 1 1 1 1 1 1 1 1 1 1 1 1 1 1 1 1 1 1 1 1 1 1 1 1 1 
##$CPDPRG= <>
##$CPDPRG1= <>
##$CPDPRG2= <>
##$CPDPRG3= <>
##$CPDPRG4= <mlev>
##$CPDPRG5= <mlev>
##$CPDPRG6= <mlev>
##$CPDPRG7= <mlev>
##$CPDPRG8= <mlev>
##$CPDPRGB= <>
##$CPDPRGT= <>
##$D= (0..31)
0 1.2 0 0 0 0 0 0 0 0.06 0 0.03 0 0 0 0 0.0002 0 0 0 0 0 0 0 0 0 0 0 0 
0 0 0 
##$DATE= 1639475186
##$DBL= (0..7)
120 120 120 120 120 120 120 120 
##$DBP= (0..7)
150 150 150 150 150 150 150 150 
##$DBP07= 0
##$DBPNAM0= <>
##$DBPNAM1= <>
##$DBPNAM2= <>
##$DBPNAM3= <>
##$DBPNAM4= <>
##$DBPNAM5= <>
##$DBPNAM6= <>
##$DBPNAM7= <>
##$DBPOAL= (0..7)
0.5 0.5 0.5 0.5 0.5 0.5 0.5 0.5 
##$DBPOFFS= (0..7)
0 0 0 0 0 0 0 0 
##$DE= 6
##$DECBNUC= <off>
##$DECIM= 32
##$DECNUC= <off>
##$DECSTAT= 4
##$DIGMOD= 1
##$DIGTYP= 9
##$DL= (0..7)
0 120 120 120 120 120 120 120 
##$DP= (0..7)
150 150 150 150 150 150 150 150 
##$DP07= 0
##$DPNAME0= <>
##$DPNAME1= <>
##$DPNAME2= <>
##$DPNAME3= <>
##$DPNAME4= <>
##$DPNAME5= <>
##$DPNAME6= <>
##$DPNAME7= <>
##$DPOAL= (0..7)
0.5 0.5 0.5 0.5 0.5 0.5 0.5 0.5 
##$DPOFFS= (0..7)
0 0 0 0 0 0 0 0 
##$DQDMODE= 0
##$DR= 18
##$DS= 0
##$DSLIST= <SSSSSSSSSSSSSSS>
$$ [...]
##$SUBNAM2= <"">
##$SUBNAM3= <"">
##$SUBNAM4= <"">
##$SUBNAM5= <"">
##$SUBNAM6= <"">
##$SUBNAM7= <"">
##$SUBNAM8= <"">
##$SUBNAM9= <"">
##$SW= 18.0517287032376
##$SWIBOX= (0..15)
0 0 2 0 0 0 0 0 0 0 0 0 0 0 0 0 
##$SW_h= 3612.71676300578
##$TD= 16384
##$TD0= 1
##$TE= 0
##$TE2= 300
##$TE3= 300
##$TEG= 300
##$TL= (0..7)
0 120 120 120 120 120 120 120 
##$TP= (0..7)
150 150 150 150 150 150 150 150 
##$TP07= 0
##$TPNAME0= <>
##$TPNAME1= <>
##$TPNAME2= <>
##$TPNAME3= <>
##$TPNAME4= <>
##$TPNAME5= <>
##$TPNAME6= <>
##$TPNAME7= <>
##$TPOAL= (0..7)
0.5 0.5 0.5 0.5 0.5 0.5 0.5 0.5 
##$TPOFFS= (0..7)
0 0 0 0 0 0 0 0 
##$TUNHIN= 0
##$TUNHOUT= 0
##$TUNXOUT= 0
##$USERA1= <user>
##$USERA2= <user>
##$USERA3= <user>
##$USERA4= <user>
##$USERA5= <user>
##$V9= 5
##$VALIST= <valist>
##$VCLIST= <CCCCCCCCCCCCCCC>
##$VD= 0
##$VDLIST= <DDDDDDDDDDDDDDD>
##$VPLIST= <PPPPPPPPPPPPPPP>
##$VTLIST= <TTTTTTTTTTTTTTT>
##$WBST= 1024
##$WBSW= 4
##$XGAIN= (0..3)
0 0 0 0 
##$XL= 0
##$YL= 0
##$YMAX_a= 581644
##$YMIN_a= -761126
##$ZGOPTNS= <>
##$ZL1= 120
##$ZL2= 120
##$ZL3= 120
##$ZL4= 120
##$ABSF1= 10
##$ABSF2= 0
##$ABSG= 5
##$ABSL= 3
##$ALPHA= 0
##$AQORDER= 0
##$ASSFAC= 0
##$ASSFACI= 0
##$ASSFACX= 0
##$ASSWID= 0
##$AUNMP= <proc_1d>
##$AZFE= 0.1
##$AZFW= 0.1
##$BCFW= 1
##$BC_mod= 2
##$BYTORDP= 1
##$COROFFS= 0
##$CY= 11.3945322036743
##$DATMOD= 1
##$DC= 2
##$DFILT= <>
##$DTYPP= 0
##$F1P= 2.36226072786647
##$F2P= -0.459571619588291
##$FCOR= 0.5
##$FTSIZE= 0
##$FT_mod= 4
##$GAMMA= 1
##$GB= 0.15
##$INTBC= 1
##$INTSCL= 1
##$ISEN= 128
##$LB= 0.24
##$LEV0= 0
##$LPBIN= 0
##$MAXI= 10000
##$MC2= 0
##$MEAN= 0
##$ME_mod= 0
##$MI= 1.114404
##$NCOEF= 0
##$NC_proc= 0
##$NLEV= 6
##$NOISF1= 3.799351
##$NOISF2= 2.8
##$NSP= 1
##$NTH_PI= 0
##$NZP= 0
##$OFFSET= 15.70392
##$PC= 1
##$PHC0= -15865.45
##$PHC1= 5.200801
##$PH_mod= 1
##$PKNL= yes
##$PPARMOD= 0
##$PSCAL= 0
##$PSIGN= 0
##$REVERSE= no
##$SF= 200.130013532006
##$SI= 16384
##$SIGF1= 3
##$SIGF2= 2
##$SINO= 400
##$SIOLD= 16384
##$SREGLST= <1H.CDCl3>
##$SSB= 0
##$STSI= 0
##$STSR= 0
##$SW_p= 3612.71676300578
##$SYMM= 0
##$S_DEV= 0
##$TDeff= 0
##$TDoff= 0
##$TI= <>
##$TILT= no
##$TM1= 0
##$TM2= 0
##$TOPLEV= 0
##$USERP1= <user>
##$USERP2= <user>
##$USERP3= <user>
##$USERP4= <user>
##$USERP5= <user>
##$WDW= 1
##$XDIM= 8192
##$YMAX_p= 0
##$YMIN_p= 0
$$ End of Bruker specific parameters
$$ ---------------------------------
##NTUPLES= NMR FID
##VAR_NAME=  TIME,          FID/REAL,        FID/IMAG
##SYMBOL=    X,             R,               I
##VAR_TYPE=  INDEPENDENT,   DEPENDENT,       DEPENDENT
##VAR_FORM=  AFFN,          ASDF,            ASDF
##VAR_DIM=   8192,          8192,            8192
##UNITS=     SECONDS,       ARBITRARY UNITS, ARBITRARY UNITS
##FACTOR=    0.0002768,     1,               1
##FIRST=     0,             0,               0
##LAST=      2.2672688,     0,               0
##MIN=       0,             -761126,         0
##MAX=       2.2672688,     581644,          0
$$ Real data points
##PAGE= N=1
##DATA TABLE= (X++(R..R)), XYDATA
0 0 0 0 0 0 0 0 0 8 -8 8 -8 16 -16 24 -32 40 -48 56 -72 88 -104 121 -145 174 -200 236 -274 320 -368 421
30 421 -481 550 -625 709 -799 899 -1012 1135 -1268 1412 -1576 1753 -1945 2153 -2378 2630
46 2630 -2903 3203 -3527 3886 -4281 4717 -5199 5735 -6334 7011 -7782 8663 -9683 10887
60 10887 -12329 14089 -16299 19163 -23046 28635 -37404 53228 -90815 373566 48550 -420726
72 -420726 452003 214559 -169019 280033 281573 -504376 -170471 462518 -9325 -320292
82 -320292 253191 62992 -385068 111657 333824 -260392 -107704 341205 -143769 -379171
92 -379171 354951 324566 -394629 -127885 319190 -149134 -151059 401709 40502 -450464 104079
103 104079 385112 -165698 -165734 199021 -160338 -308036 204688 61596 -409369 -35311 222227
114 222227 -207414 -108338 337570 6428 -270224 231745 268064 -247777 -23058 304842
124 304842 -150725 -219352 299996 123943 -283322 75545 294590 -95912 -31204 309649
134 309649 -5516 -195580 226746 171893 -218720 17382 195579 -173390 -130693 242767
144 242767 14805 -244093 99857 144836 -207689 14457 284915 -122338 -249728 163753
154 163753 114384 -167470 34236 98704 -234232 -104367 263886 12374 -235099 51869
164 51869 71668 -150957 61401 165928 -186756 -180541 145810 -7195 -216807 60390 87696
175 87696 -239394 -72268 207906 -40472 -110538 176298 45288 -185907 103723 249978
185 249978 -85295 -107651 137708 -13445 -94430 185245 86811 -212729 2229 200647
195 200647 -42647 -63531 149559 -19283 -169019 122287 151928 -159650 -44516 163678
205 163678 -72887 -115331 165596 59517 -169790 34892 140425 -105855 -47941 166470
215 166470 -54230 -180238 101866 71517 -176236 -18663 95359 -148370 -113236 144071
225 144071 -18225 -203237 49200 98271 -156563 -28548 149563 -102092 -144108 137831
235 137831 47127 -164665 31783 115823 -130656 -48094 189686 -24696 -157148 118360
245 118360 95962 -131273 42432 156891 -106357 -90771 177351 43830 -140306 82080
255 82080 111533 -136089 3920 194774 -51138 -118108 133761 53667 -130681 71123 140853
266 140853 -133063 -80799 165313 -7324 -135396 99348 52566 -178418 2753 153188
276 153188 -91771 -124249 101191 -10138 -158525 71996 97376 -174768 -69690 134554
286 134554 -63700 -121410 110226 16891 -181326 25732 142218 -105833 -84455 132393
296 132393 -29773 -140311 114923 94658 -150090 -15199 136937 -61806 -74615 142464
306 142464 20364 -151098 69525 136234 -99673 -22422 149562 -41246 -96875 140400
316 140400 81945 -124085 23346 132139 -72114 -48807 150797 -4045 -136223 81572
326 81572 93265 -109847 -6610 114859 -75543 -98097 116195 32498 -142313 22062 83613
337 83613 -117645 -45071 122511 -52038 -136249 68218 48215 -121009 1870 92886 -100452
348 -100452 -83928 119064 2408 -127518 50708 61303 -114770 -8139 121076 -53619
358 -53619 -98718 91098 38045 -104490 46236 98355 -95565 -40309 126565 -3267 -80311
369 -80311 78772 49336 -96046 27689 122380 -55753 -65269 104740 16506 -83629 74477
380 74477 74562 -93825 -7759 116951 -21498 -66589 86763 31174 -98843 36390 91859
391 91859 -77133 -41280 86115 -34610 -87552 70819 38030 -115841 -17096 78202 -63033
402 -63033 -62134 76649 -28351 -119013 47183 61492 -98677 -35517 70610 -45361 -63470
413 -63470 84075 19350 -102446 32966 84625 -69295 -23386 96947 -25876 -80841 68164
424 68164 45120 -84628 11379 83409 -62053 -47192 106704 17496 -79620 52055 61060
435 61060 -61154 17449 96998 -42146 -63968 88594 38492 -76925 38521 71755 -71975
446 -71975 -12528 108727 -13480 -73601 63764 39153 -85557 10227 79681 -69521 -69035
457 -69035 71475 -8071 -86041 42201 32706 -98683 -10773 86142 -46878 -79160 58647
468 58647 4014 -100784 27272 59188 -97068 -43433 85829 -25330 -76957 69588 49447
479 49447 -80963 11593 94192 -36236 -32756 89910 -8369 -86006 61549 66332 -78951
490 -78951 -20153 74458 -28554 -38682 91501 16744 -94545 47448 101318 -54744 -28856
501 -28856 85040 -11977 -58178 73428 46158 -81161 11429 94041 -41077 -47468 85493
512 85493 12123 -76302 34564 36955 -82821 -13968 67498 -63562 -94784 56675 23120
523 23120 -93043 7642 52737 -71870 -18433 99054 -18364 -91817 49273 55695 -72216
534 -72216 -9771 64344 -56393 -57324 76094 6764 -81872 36004 57523 -61568 -9237 82821
546 82821 -19732 -55331 67235 26430 -76304 32841 78969 -60528 -33042 91487 12400
557 12400 -53879 57897 54277 -62002 8541 91512 -28969 -55551 60551 9951 -68452
568 -68452 32457 49106 -63872 -20574 70032 -16980 -49582 63047 21152 -83881 17220
579 17220 70946 -59843 -53079 52798 -16924 -73809 34748 32859 -82531 -19603 71745 -26344
591 -26344 -50637 54381 9001 -63489 28460 45593 -58440 -18950 63980 -24874 -62777 53716
603 53716 34414 -64146 12694 60251 -42994 -20796 77897 -572 -68715 36351 56486 -43565
615 -43565 -6637 57615 -26839 -27664 78186 22746 -59266 30343 60776 -32736 -7515 61945
627 61945 -18635 -53044 50283 24462 -71022 5781 54857 -47985 -37746 56833 -234 -56455
639 -56455 30747 33110 -61427 -6844 62761 -35474 -57664 42426 5705 -60663 18582 32570
651 32570 -62786 -25595 60837 -13860 -58369 35840 19291 -62233 12434 54679 -46076 -34886
663 -34886 57043 2809 -49936 37672 42653 -50441 -687 70869 -15706 -34996 57239 15909
675 15909 -50728 30329 51915 -42350 -18098 59835 -7647 -43745 49865 29390 -58256 11520
687 11520 58938 -33378 -26013 56046 -2731 -57607 31559 42017 -53800 -16179 50892 -28437
699 -28437 -42696 49125 6717 -66408 10496 42249 -43993 -26651 44551 -21920 -59030 37027
711 37027 25224 -65464 -6553 44763 -38848 -34330 49881 746 -58861 21770 41591 -43623
723 -43623 -8749 58335 -19717 -41523 51295 25943 -45424 17135 46274 -34328 -15264 63531
735 63531 2000 -49557 35686 36699 -43427 8104 54814 -29572 -34545 51050 15326 -46874
747 -46874 19474 37920 -44925 -12829 58003 -14257 -46503 36631 17284 -49226 10324 43023
759 43023 -39934 -34747 44148 -2255 -52638 22478 22930 -56741 -9513 46128 -26190 -40329 33190
772 33190 5363 -49443 14450 36848 -44557 -24577 45306 -11775 -41337 32875 17152 -47906
784 -47906 4961 46384 -22213 -24802 43624 5780 -39105 32114 37893 -37679 -4119 47623
796 47623 -11456 -23603 41491 14407 -41509 16608 45017 -26846 -15029 44322 -8241 -35346
808 -35346 34656 22462 -42435 -1663 35511 -22784 -23637 37305 -912 -45292 19140 28071 -36532
821 -36532 -7097 34079 -23400 -32998 31238 9617 -44735 1149 25404 -34278 -17347 36603
833 36603 -14012 -41780 21601 16505 -34518 554 28574 -26122 -24095 35745 3610 -36816
845 -36816 17595 22438 -32831 934 41104 -12232 -24683 31248 15390 -26457 18171 34078
857 34078 -26777 -9993 43383 -197 -24282 27751 14867 -29459 11169 36723 -19707 -19750 33973
870 33973 2321 -31549 22108 20073 -36631 -5324 31635 -17316 -25038 25208 1787 -38864
882 -38864 9016 26938 -30244 -16005 27510 -15024 -29222 25510 8044 -40148 -1238 27251
894 27251 -22361 -20914 26908 -6880 -36013 20263 19965 -33712 -3455 29754 -17233 -20381 31535
907 31535 8717 -32499 12830 29071 -23460 -3086 39957 -8961 -25986 32140 21885 -24853
919 -24853 8665 31030 -18180 -10552 40121 1849 -33471 20575 22588 -28635 440 30619
931 30619 -18799 -23471 29287 7727 -33778 11174 26211 -31123 -14121 33923 -8532 -30565
943 -30565 18369 7231 -34244 3531 28075 -26438 -27373 27115 445 -32264 14597 12988 -36692
956 -36692 -3306 32831 -16903 -29235 23630 9119 -31440 9869 28360 -25779 -11758 35465
968 35465 -3793 -24350 25994 18245 -27875 2550 31731 -12569 -14453 31301 836 -29338
980 -29338 23694 27948 -26302 -4368 32791 -6440 -17321 28455 10220 -32444 8354 31114
992 31114 -21366 -14912 27101 -7059 -27236 18785 14194 -28870 -3628 23448 -17197 -19294 26208
1005 26208 -650 -34530 10113 18368 -26447 -8300 23505 -13603 -24923 21463 10787 -30868
1017 -30868 1423 23345 -20581 -14012 25734 -4986 -26551 13995 13179 -23534 702 26209
1029 26209 -13796 -18509 26707 9098 -20951 14901 18656 -20641 444 31870 -5064 -21087
1041 -21087 20109 15182 -19367 8122 23472 -18013 -8115 30019 886 -21505 14373 14405 -19563
1054 -19563 -893 21637 -12648 -17391 20022 211 -26029 10495 15985 -22952 -9658 18483
1066 18483 -8956 -18922 15193 3699 -29460 2228 21857 -18503 -15784 17799 -3915 -18703
1078 -18703 14671 9910 -23526 -2349 22560 -10124 -15089 19142 -55 -22768 12678 15892
1090 15892 -19838 -3129 22562 -7110 -15404 21576 11707 -20572 7809 23195 -13037 -4291
1102 -4291 26099 -1490 -16812 17937 15482 -16061 2429 21217 -11806 -10917 24526 2110 -23090
1115 -23090 10586 13180 -20217 -3365 20050 -11330 -21956 14721 6794 -23865 2502 15419
1127 15419 -21018 -10829 21092 -5955 -23032 10676 8642 -21622 -808 19541 -15950 -16803
1139 -16803 21735 1683 -23428 11458 14925 -21292 -4328 23344 -6409 -17026 18097 7722
1151 7722 -22910 8468 23176 -16818 -9184 24163 -1650 -16105 18624 13634 -20786 2409
1163 2409 27216 -8695 -13590 22831 3871 -20389 14807 17978 -19266 -5042 22520 -5950
1175 -5950 -17206 17297 7429 -25007 3662 19705 -18063 -11384 20075 -5685 -23094 11865
1187 11865 11698 -22932 -5469 18715 -13402 -17371 19307 1149 -25456 6799 15137 -18384 -6164
1200 -6164 19673 -7843 -19339 17339 10836 -22435 3099 20104 -15082 -9087 23114 -512
1212 -512 -19761 12424 14879 -16971 -719 22275 -9022 -14691 21326 6457 -19150 9707 16758
1225 16758 -15021 -3715 23050 -2252 -16782 15539 11642 -18199 4582 20167 -13363 -11148
1237 -11148 19228 698 -17989 8367 10265 -19261 -4423 18782 -9781 -17565 14058 2196
1249 2196 -21034 5248 12846 -17540 -9759 15901 -3643 -18061 10619 7555 -20133 464 17322
1262 17322 -11858 -10914 15531 -346 -16209 9803 12600 -16016 -3487 18595 -5962 -12478 17096
1275 17096 5231 -17153 7101 16708 -10457 -5231 17599 -876 -13608 13776 11495 -15805
1287 -15805 2112 17338 -8797 -6886 17592 1205 -15185 8953 13103 -13339 -3223 16528
1299 16528 -7175 -13857 14362 3893 -17919 2297 10644 -13592 -7814 13427 -4940 -18145
1311 -18145 8178 6732 -17832 -385 12775 -13114 -10976 14565 165 -16383 6127 10500
1323 10500 -13812 -3210 16870 -6123 -12690 14431 4858 -14676 6329 13142 -11485 -5164 16808
1336 16808 -563 -13285 11717 8893 -15289 3563 17933 -8872 -8624 15594 2976 -12398
1348 -12398 9296 12183 -13304 -2513 17933 -4668 -11653 13609 3801 -15354 5481 12660 -12322
1361 -12322 -7690 13777 -3011 -15861 9760 7488 -18452 -2201 13204 -10638 -10506 12021 -2095
1374 -2095 -17126 5616 10416 -15073 -5902 14339 -7096 -12244 13563 3425 -16871 4277 13734
1387 13734 -10445 -6494 15435 -498 -14082 10758 10051 -13415 1610 15027 -8689 -7631 15506
1400 15506 3299 -13746 6308 11635 -11048 -2012 16777 -5150 -12460 13857 7243 -13480 3209
1413 3209 12822 -9017 -5831 15127 67 -14137 8933 9009 -13928 -276 13430 -8797 -10323
1426 -10323 11267 1275 -14547 3726 8987 -14226 -6572 13656 -5194 -14135 8547 3185 -14250
1439 -14250 2030 10501 -10458 -8334 12553 -69 -13219 7768 8245 -12941 -203 13952 -5935
1452 -5935 -7883 11966 3337 -11732 5647 12496 -9283 -4199 13713 -2006 -8290 10956 5103
1465 5103 -11951 3045 12444 -6193 -5708 11634 426 -10970 8607 8811 -11316 -787 12382
1478 12382 -4838 -7740 9850 3048 -11220 2720 8956 -9218 -3982 10789 -5303 -11150 8031
1491 8031 3844 -11966 -271 7026 -8750 -6508 10061 -2016 -13901 5069 6740 -11248 -1635
1504 -1635 9023 -6240 -7016 9224 2376 -10037 3599 9030 -7602 -2485 11902 -2316 -7666
1517 -7666 9668 4648 -8491 3697 10409 -5922 -5154 11235 2066 -8574 6726 6495 -9401
1530 -9401 988 10998 -4416 -6622 8624 2735 -8856 3802 8051 -9015 -3243 11201 -3348
1543 -3348 -9109 7541 2653 -11003 1594 8694 -7513 -7121 8259 -1672 -11108 5987 5015 -12282
1557 -12282 -1469 8939 -6498 -7677 8003 328 -11583 3404 8419 -9547 -3403 10900 -3564
1570 -3564 -8080 9453 3952 -9806 2705 9797 -5867 -3692 11757 -245 -9690 8679 8055
1583 8055 -9071 1059 10610 -4960 -5539 10840 2741 -10146 4024 9175 -8217 -2883 10919
1596 10919 -3704 -8197 8915 3659 -10039 1997 8842 -7550 -5869 10887 -647 -11643 5861
1609 5861 5476 -11634 -945 9894 -6444 -8857 7709 1799 -11104 2731 7323 -10718 -4169
1622 -4169 10627 -4283 -10171 7374 3346 -10311 1784 9338 -7144 -5982 10984 1064 -9531
1635 -9531 6645 7318 -9342 107 11318 -3303 -6484 9062 3365 -9116 4648 9890 -7562
1648 -7562 -3014 11275 -1539 -7836 7739 4685 -9454 683 9755 -5066 -6303 9128 768
1661 768 -9694 5328 6871 -8989 -1785 9086 -3742 -7226 7196 2054 -10901 1484 8168
1674 8168 -8014 -5111 8586 -2985 -9373 5529 4087 -9396 -1374 7772 -5239 -6867 7658
1687 7658 417 -10134 3957 6007 -7538 -1381 8853 -2680 -6407 7701 4680 -7775 2204
1700 2204 8778 -5356 -2987 9913 -302 -7126 5662 5347 -6117 701 8354 -3535 -4907 8365
1714 8365 1857 -7819 4173 5586 -7667 -1481 7948 -2903 -7145 5340 3215 -8004 1386 6790
1728 6790 -6388 -4168 7416 -1271 -7332 4053 2736 -7915 -586 6734 -5052 -6259 6351
1741 6351 417 -8503 3574 4752 -7610 -1950 6856 -2492 -6089 5412 2140 -7592 1705 7069
1755 7069 -5517 -2649 7945 -976 -5206 6536 4493 -5952 944 8061 -3042 -3686 8162 1114
1769 1114 -6813 4972 5958 -5987 -427 7127 -2445 -4904 6168 2208 -7678 2009 6059 -6705
1783 -6705 -3216 6817 -2901 -7143 4797 3082 -7471 83 6514 -4685 -4861 7066 -223 -7914
1797 -7914 3591 3634 -7552 -766 6555 -4183 -6486 5941 1797 -8218 2223 5769 -7013 -3012
1811 -3012 7747 -1944 -7029 4828 3419 -6929 682 7241 -4092 -3983 8115 898 -6296 5921
1825 5921 5771 -6110 419 8366 -1915 -5118 6773 3076 -7538 2806 7424 -6281 -3038 8021
1839 8021 -1029 -6497 4856 3414 -7459 -387 6879 -4672 -5792 6718 -118 -8567 3802 5099
1853 5099 -7283 -1861 6852 -2499 -6465 5402 2704 -8324 925 6714 -6106 -4097 6733 -1642
1867 -1642 -7022 4346 4093 -7314 -1306 7286 -3677 -5723 7092 1324 -7768 2961 5635 -5437
1881 -5437 -1779 7610 -963 -5782 5884 4620 -6511 1506 7644 -4054 -2843 8112 368 -6519
1895 -6519 4104 5459 -5549 -1038 7347 -2863 -5783 6431 1950 -7316 1779 5317 -5473 -2972
1909 -2972 5968 -1403 -6920 3510 3003 -7130 135 6334 -4949 -4734 5915 135 -6422 2416
1923 2416 4064 -6036 -2177 6049 -2421 -5887 5062 1696 -6447 1641 4659 -4650 -2411 5835
1937 5835 -356 -5406 4056 4236 -6068 409 6650 -2888 -3116 5847 1247 -4721 3163 5261 -3992
1952 -3992 -1186 6474 -1070 -3830 5398 1692 -5585 2013 4582 -4020 -2300 5204 -564 -5659 3231
1967 3231 2854 -6010 -524 4844 -3574 -3596 4094 -312 -5687 1681 3025 -4672 -1640 5017 -2489 -4567
1983 -4567 4717 1273 -5576 1295 3971 -3959 -2222 4742 -655 -4979 3378 2677 -5162 414 4917
1998 4917 -3077 -2414 4535 491 -3982 2831 3708 -4188 -357 5769 -1733 -3725 4972 1889 -4172
2013 -4172 2477 4446 -3176 -1275 5070 -177 -4144 3489 2450 -5125 655 4775 -3569 -2865 4368
2028 4368 -636 -5235 1908 3296 -5237 -1748 4806 -2719 -4641 4133 642 -5756 1513 3962 -4080
2043 -4080 -2301 4548 -1076 -4749 3688 2310 -5738 730 4922 -3715 -2971 4902 141 -5050 2360
2058 2360 3506 -4434 -1012 5346 -1868 -3859 4893 1084 -5178 2022 4433 -3447 -1261 5548 -263
2073 -263 -4267 4283 3415 -4744 1167 5403 -3036 -2463 4939 431 -4914 1963 3578 -4726 -1497 5114
2089 5114 -2362 -4300 4248 920 -5573 1082 3402 -4304 -2543 4526 -941 -5530 2800 2792 -5110 -28
2105 -28 4596 -3015 -3113 3766 379 -4409 1737 3530 -4045 -1412 5261 -1295 -3986 4116 1476 -4472
2121 -4472 1248 4132 -2795 -2106 4645 468 -4211 2570 3121 -4464 56 4860 -1811 -2437 3818 1126
2137 1126 -3511 2021 3957 -3186 -1260 4696 -845 -3790 3521 1556 -4258 360 3416 -2651 -2712
2152 -2712 3475 -247 -4397 1836 2339 -4630 -591 3498 -2766 -3153 2990 430 -4498 669 3345
2167 3345 -3313 -1591 4416 -1038 -3478 3280 1717 -3622 855 3299 -2011 -2025 3893 173 -3680
2182 -3680 2695 2781 -3619 339 4221 -1819 -2344 3455 971 -3571 909 3118 -2818 -1297 4144 -813
2198 -813 -2696 3217 1798 -3138 1265 3429 -2155 -1886 3473 61 -4007 2256 2116 -4134 -361 3236
2214 3236 -2252 -2981 2288 535 -3952 726 2222 -3685 -1996 3302 -1680 -3426 2815 844 -3905
2229 -3905 952 3207 -2302 -1898 3973 236 -3440 2726 2628 -3546 408 3601 -1935 -1993 3126 629
2245 629 -3412 1495 3301 -3042 -921 4161 -1276 -2984 3514 1312 -3456 733 3320 -2271 -1850
2260 -1850 3502 229 -3683 2745 2505 -3444 491 3704 -1984 -2185 3217 578 -3883 1077 2900
2275 2900 -3694 -1730 3844 -1761 -4002 2555 1008 -3684 154 2861 -2678 -2378 3436 -217 -4125
2290 -4125 1968 2296 -3711 -146 4065 -1912 -2405 3417 1435 -3520 1486 3518 -2756 -1552 4160
2305 4160 -817 -3036 2632 1437 -3153 603 3548 -1701 -2041 3769 502 -3478 2161 2541 -3669
2320 -3669 -207 3882 -1178 -2671 3216 1575 -3333 1023 3436 -2710 -1597 3736 -554 -3350 2314
2335 2314 1197 -3953 -387 2904 -2059 -2661 2824 -100 -4065 1418 2455 -3396 -1030 3081 -852
2350 -852 -2621 2313 936 -3447 229 3179 -2305 -1678 3436 -426 -2555 2456 1955 -2852 362 3331
2366 3331 -1437 -2049 3277 716 -3363 1589 2436 -2289 -400 3231 -839 -2135 2241 1516 -2858 247
2382 247 2761 -1990 -1392 3447 -362 -2654 1640 1576 -2573 -115 2922 -1307 -2272 2263 625 -3375
2398 -3375 1117 1700 -2834 -875 2391 -990 -2657 1348 820 -3054 354 2328 -2599 -1628 2914 -522
2414 -522 -2530 1731 1369 -2255 -81 2660 -990 -1610 2768 822 -2285 1767 2296 -1990 -143 2837
2430 2837 -632 -1702 2258 1228 -2727 380 2743 -2195 -1346 2803 -559 -2531 1883 1367 -2367
2445 -2367 -24 2686 -1127 -1911 2624 157 -2654 1388 1813 -2595 -591 2646 -1080 -2445 1779
2460 1779 1136 -3275 89 2267 -2530 -1616 2411 -1111 -2589 1295 972 -2716 -355 2482 -1793 -1926
2476 -1926 2708 143 -3085 1693 2256 -2344 -218 2989 -697 -1973 2487 1671 -2637 779 2820
2491 2820 -2068 -1015 3301 -284 -2387 2124 1738 -2559 -277 2917 -1352 -2304 2830 815 -3166
2506 -3166 1312 2192 -2429 -739 2775 -710 -2438 2038 1218 -2945 469 2641 -2279 -1619 2816 -824
2522 -824 -2944 1526 1373 -2652 -942 2689 -1281 -2638 2293 108 -3455 928 2128 -2570 -1071
2537 -1071 2720 -933 -2320 2012 1505 -2746 450 3118 -1759 -1300 3096 522 -2247 1603 2387 -2004
2553 -2004 -267 2666 -686 -2097 2443 967 -2858 948 2090 -1948 -1117 2601 -312 -2550 1719
2568 1719 1681 -2948 -157 2726 -1540 -1806 2244 287 -2216 891 1486 -2082 -843 2167 -615 -2297
2584 -2297 1937 799 -2778 514 1769 -1847 -1244 1922 -215 -2691 1171 1605 -2177 -402 2252
2599 2252 -1033 -1656 2024 177 -1865 1076 1457 -1245 -461 2561 -175 -1646 2127 1299 -1930 497
2615 497 2001 -1057 -981 1955 447 -2074 990 1546 -1987 -87 1959 -1212 -1475 1582 273 -1941
2631 -1941 670 1668 -1649 -877 1792 -438 -2186 1762 1028 -1918 462 1596 -1043 -826 1663 6
2647 6 -1988 866 1049 -2320 -382 1482 -1224 -1422 1607 -317 -2124 399 1308 -1470 -803 2076 -516
2664 -516 -1637 1669 484 -1606 653 1568 -1124 -413 2042 76 -1381 1458 1264 -1771 163 2048
2680 2048 -1151 -1002 1886 133 -1537 580 1256 -1419 -361 1862 -509 -1799 1713 439 -2302
2695 -2302 791 1288 -1655 -672 1692 -702 -2178 1226 1234 -2017 137 1927 -1417 -1197 1722 -178
2711 -178 -1786 734 1098 -2071 -563 2019 -987 -1488 1995 265 -2085 836 1561 -1496 -625 2080
2727 2080 -42 -1774 1462 1304 -1947 225 2346 -1296 -852 2194 435 -1518 1205 1347 -1445 -533
2743 -533 2244 -953 -1857 1957 496 -2227 631 1470 -1528 -956 1603 -196 -1831 1135 1337 -2193
2759 -2193 -206 1725 -1386 -1321 1813 34 -2094 709 1409 -1842 -734 2071 -837 -1821 1436 990
2775 990 -2227 459 1351 -1201 -1072 1937 96 -2211 788 1430 -1842 54 2202 -992 -1248 2121
2791 2121 804 -1759 673 2007 -1218 -440 2245 -308 -1731 1785 1242 -1614 383 1743 -979
2806 -979 -983 1723 156 -2116 732 1418 -1991 -526 1783 -1076 -1419 1215 535 -1792 37 1420 -1489
2823 -1489 -1117 1674 -413 -1832 1152 729 -1843 135 1257 -959 -1144 1694 456 -2035 398 1265
2839 1265 -1814 -475 1603 -765 -1413 954 500 -1422 110 1614 -1002 -821 2052 -271 -1453 1175
2855 1175 851 -1344 451 1662 -523 -583 1768 688 -1411 740 1417 -1249 -41 1574 -586 -1181
2871 -1181 1274 101 -1547 219 1300 -1363 -1097 1800 -512 -1753 1003 745 -1697 -69 1112
2886 1112 -632 -1023 1334 343 -1533 779 990 -1718 158 1310 -747 -889 1109 564 -1179 146
2902 146 925 -1228 -535 1536 -332 -1252 1342 762 -1230 359 834 -578 -613 1071 171 -1317 1208
2919 1208 1126 -1452 -49 1828 -275 -825 1287 500 -1226 608 1579 -1043 -671 1584 -600 -1373 1044
2936 1044 372 -1487 56 863 -1254 -1153 1325 -238 -1856 831 885 -1926 -109 1710 -770 -1172
2952 -1172 988 479 -1457 179 1278 -1124 -863 1541 -345 -1301 1138 773 -1324 198 1550 -905
2968 -905 -1070 1766 524 -1766 603 1229 -1318 145 1508 -485 -1136 1280 619 -1331 491 1713
2984 1713 -1224 -577 2010 -151 -1374 1288 909 -1351 78 1363 -490 -1378 1158 176 -1826 316
3000 316 1039 -1641 -524 1279 -650 -1279 812 500 -1761 -89 1247 -1102 -1085 1682 54 -1806
3016 -1806 1031 793 -1061 -119 1502 -312 -1198 1325 545 -1469 677 1291 -1185 -656 1595 -170
3032 -170 -1099 1314 965 -1380 -220 1715 -854 -1005 1566 235 -1325 766 958 -1206 -285 1511
3048 1511 -127 -1247 1194 611 -1431 543 1460 -1080 -482 1055 -585 -1264 374 781 -1304 -466
3064 -466 1043 -939 -930 1012 106 -1211 517 480 -1098 -114 1217 -254 -1107 1105 916 -1380 455
3081 455 1185 -804 -272 1075 -57 -1009 605 927 -823 -213 1183 -756 -849 1304 9 -1273 905
3098 905 594 -698 -232 1334 -179 -945 1103 867 -1147 363 1061 -885 -199 1227 41 -749 582
3115 582 636 -1191 43 1283 -832 -951 1172 -96 -1242 546 573 -1187 -664 1013 -281 -1077 790
3132 790 419 -1321 87 891 -955 -92 1040 -356 -763 841 778 -810 217 1430 -612 -823 1284
3149 1284 -187 -1156 785 653 -1002 -483 905 -99 -993 1048 501 -1112 581 1114 -919 -95 1332
3166 1332 -23 -1031 804 806 -1218 125 1484 -750 -744 1415 -108 -1082 383 648 -959 -336 1149
3183 1149 -439 -1226 632 494 -1575 322 916 -1261 -742 1212 -159 -1204 627 750 -1205 -413
3199 -413 1219 -555 -994 1472 95 -972 557 687 -870 -321 1276 -194 -943 1041 827 -1290
3215 -1290 538 1151 -544 -442 1369 139 -1093 384 1234 -1007 -182 1150 -519 -745 1252 360
3231 360 -995 550 1023 -851 -644 1273 48 -1339 860 599 -1394 34 1184 -576 -888 693
3247 693 -122 -1139 471 794 -989 -411 1202 -285 -961 898 320 -966 19 1042 -647 -521 1177
3264 1177 5 -852 814 656 -889 434 1112 -351 -626 963 150 -686 453 1035 -908 -318 1192
3281 1192 -321 -966 653 226 -886 164 508 -464 -712 832 -88 -1076 458 600 -847 214 912
3298 912 -621 -175 745 153 -1133 348 622 -1022 -427 826 -396 -523 679 53 -571 265 623 -566
3316 -566 -555 579 16 -897 527 497 -834 430 691 -161 -134 636 388 -743 170 565 -536 -287 736
3335 736 -374 -466 772 6 -357 494 391 -654 -383 936 -108 -898 823 411 -894 170 494 -727
3353 -727 -288 528 212 -766 395 951 -820 -33 651 -436 -344 960 -39 -581 104 600 -671 -391 674
3372 674 -390 -865 729 394 -945 47 630 -604 -544 420 166 -1054 534 706 -1012 -78 1159 -462
3390 -462 -294 907 176 -598 471 809 -735 -497 962 16 -745 1070 417 -1009 150 610 -601
3407 -601 -150 764 -168 -840 670 648 -1055 -255 834 -231 -760 818 -5 -939 276 678 -635 -431
3425 -431 960 26 -791 737 393 -1106 63 527 -552 -624 740 247 -1193 172 694 -956 -490
3442 -490 1006 -592 -734 753 266 -798 126 667 -524 -502 774 133 -930 674 547 -836 307
3459 307 914 21 -594 749 316 -918 223 740 -776 -328 734 -428 -753 557 -27 -845 -13 907
3477 907 -537 -869 1076 -72 -1196 417 790 -890 -287 851 -425 -605 756 93 -698 284 548
3494 548 -832 -111 716 -206 -478 456 102 -598 -53 792 -359 -615 846 -53 -963 326 666 -721
3512 -721 -158 883 -149 -559 931 602 -501 194 558 -440 10 969 -185 -419 523 321 -724 -276
3530 -276 656 -308 -381 837 151 -778 198 178 -462 -49 456 -313 -276 599 231 -707 256 687 -663 -373
3550 -373 534 0 -260 389 227 -345 -154 731 -353 -304 611 31 -417 267 113 -608 -130 502 -432 -504
3570 -504 676 64 -755 491 663 -549 -105 935 -102 -265 298 273 -223 -81 706 -158 -509 957
3588 957 -143 -529 733 229 -552 161 655 -510 -627 412 -92 -780 503 478 -679 -54 701 -248
3606 -248 -363 435 307 -667 228 762 -461 -305 906 -102 -784 712 376 -733 -110 609 -332 -619
3624 -619 480 -7 -850 285 581 -866 -230 793 -227 -428 611 216 -700 134 939 -578 -403 979
3642 979 -307 -704 758 556 -609 219 625 -157 -525 658 262 -607 476 536 -739 -228 755 -214
3660 -214 -441 319 95 -691 -168 691 -595 -373 703 24 -482 317 531 -417 -122 607 -193 -539 619
3679 619 278 -765 319 734 -571 -376 688 -470 -482 421 322 -628 -1 602 -440 -678 729 206
3697 206 -452 340 543 -328 72 711 -45 -433 308 471 -567 185 552 -354 -84 623 84 -473 215 482
3717 482 -372 -224 439 -414 -616 504 25 -802 375 332 -508 -279 503 -95 -657 194 368 -866 25
3736 25 740 -319 -389 418 95 -392 327 327 -560 -265 769 -116 -321 640 300 -555 248 292 -191 -191 584 77
3758 77 -404 422 119 -543 41 539 -217 -311 581 -46 -521 479 531 -653 -221 756 -253 -529 506 299
3778 299 -563 132 284 -209 -293 235 4 -533 158 31 -448 298 501 -668 -129 214 -56 -304 537 253
3798 253 -545 179 663 -421 53 550 214 -433 229 269 -313 -182 292 -20 -253 455 51 -440 204 497
3818 497 -497 -229 260 9 -16 231 296 -474 -56 904 5 -29 573 -242 -179 225 399 -529 -20 436 22
3839 22 -349 313 270 -527 48 383 -510 -350 537 -450 -394 285 31 -914 -128 678 -304 -282 280 109 -507
3860 -507 336 601 -544 -180 545 -315 -662 307 417 -361 168 329 -599 -214 530 -39 -333 243 518 -420
3880 -420 -67 741 -300 -354 342 27 -678 227 423 -179 -127 442 109 -516 496 330 -843 423 461 -527
3900 -527 -182 424 -130 -411 466 310 -566 -73 569 -583 -749 391 128 -439 -135 510 -244 -233 567 -171
3920 -171 -469 682 419 -428 -104 582 -355 -129 226 256 -467 91 580 -323 -71 756 -450 -483 518 -256
3940 -256 -626 326 291 -392 -153 534 52 -528 380 69 -405 245 746 -169 -344 455 87 -355 21 460
3960 460 -338 -283 544 -126 -428 260 -46 -367 -77 209 -513 -417 64 -23 -746 243 140 -527 64 170 -177
3981 -177 -67 -9 -64 -365 124 442 -403 140 491 -152 -289 421 35 -285 274 325 -232 -169 441 23 -285
4002 -285 134 -125 -168 -35 171 -460 -122 536 216 -432 157 432 -551 2 859 -261 -251 422 -19 -567
4022 -567 322 352 -30 -148 191 -208 -401 143 150 -368 262 307 -503 -83 433 12 -587 -51 297 -440 -46
4043 -46 512 -64 -322 610 -2 -278 -66 378 -146 -204 545 150 -357 460 368 -533 367 494 -124 -317 351
4064 351 -169 -430 -53 372 -684 -77 734 -320 -156 133 -126 -351 136 493 -248 -108 612 -88 -403
4083 -403 409 420 -392 -1 252 -327 -349 272 129 -150 -78 282 -285 -139 166 -307 -321 430 -80 -271 -115
4104 -115 381 -197 -120 713 68 -420 498 276 -100 84 272 -7 -167 419 135 -464 131 512 -433 -125
4124 -125 480 -187 -271 409 130 -328 -74 464 -141 -540 648 31 -408 375 356 -183 21 318 -188 -124 554
4145 554 6 -465 153 388 -347 -172 695 -39 -346 -31 329 -209 -105 208 1 -345 341 -20 -645 78
4165 78 -4 -419 9 289 105 -195 354 254 -286 80 350 -206 -150 609 -16 86 515 58 -360 -10 66
4186 66 25 28 363 -58 -702 435 8 -471 -270 352 -21 -393 217 53 -255 39 310 -313 -310 392 -41 38
4208 38 126 158 -114 96 276 -412 -243 349 116 -513 397 -67 -346 -209 133 -184 -269 -114 6 -370 78
4229 78 417 -385 -3 392 -316 -114 131 277 -230 78 339 -107 -70 226 71 -516 423 337 -221 98 221
4250 221 -106 -329 58 221 -441 213 92 -180 -281 420 -344 -344 122 50 -454 -187 520 46 -153 292 53
4271 53 -376 344 187 -431 35 348 -456 -23 147 28 -609 180 364 -400 -20 506 -229 -159 183 80 -580
4292 -580 -156 429 -320 -394 392 -299 -482 331 154 -272 163 342 -77 -368 315 97 -593 99 361 -198
4312 -198 -29 204 -380 -256 185 66 -342 15 395 -443 -302 623 -81 -529 288 -45 -459 -61 347 20
4332 20 -464 268 193 -450 73 349 -414 -127 447 -77 -166 185 -52 -387 -84 259 -82 -430 356 131 -407
4353 -407 107 28 -427 -192 516 91 -238 177 288 -180 -28 366 -221 9 212 86 -151 33 6 -112 -278
4374 -278 495 -229 -226 200 52 -338 -96 216 -337 -26 416 -30 -175 177 306 -422 -162 521 -216 -10 329
4395 329 66 -40 138 456 -172 -23 580 -72 -292 38 118 -364 66 13 -246 -27 215 31 -279 392 126
4416 126 -452 65 173 -498 -29 358 63 -33 223 369 66 -142 261 154 -79 200 167 -178 130 28 -259
4437 -259 -184 -23 -23 -145 53 28 -266 -59 170 -255 41 -100 -122 -296 216 -81 -204 96 169 -67 268 313
4459 313 114 -118 197 385 -10 105 106 105 -247 259 112 -268 -62 103 -272 86 250 128 -222 61 5 -35
4481 -35 70 234 -140 -109 317 86 -95 179 91 -269 6 119 -28 -295 237 262 -408 36 358 -83 158
4502 158 272 -42 -612 108 -10 -343 -195 391 50 -282 189 -201 -243 54 13 -69 22 61 -33 -60 395 165
4524 165 -171 161 198 -229 45 297 -95 -100 -52 370 -213 -59 573 -171 -298 287 39 -301 216 55 -369
4545 -369 -131 261 -121 -359 307 61 -383 193 428 -99 -107 567 39 54 13 321 -83 -14 357 -212 -233 140
4567 140 6 -484 162 118 -223 -173 181 43 -254 -12 -30 -337 -63 178 -166 -243 127 -119 -142 -14 18 -175
4589 -175 -87 317 -53 -398 186 -137 -440 232 192 77 -167 521 -125 -497 218 84 -352 32 278 -103 -64
4610 -64 216 263 -220 48 366 33 22 609 -176 -326 370 -28 -393 -62 -51 19 -181 175 -4 -434 67 -19
4632 -19 -198 -12 260 -233 -65 96 98 -94 -14 185 -20 -114 354 -58 -51 284 254 -174 -65 353 76 -196 35
4655 35 73 -249 29 97 -263 -121 97 -235 -75 253 59 -446 -55 273 -276 -127 212 49 -79 164 388
4676 388 -101 -118 -46 36 24 119 127 -335 179 216 -233 -88 178 -9 -6 168 -16 26 -28 128 -105 -270 85 -254
4700 -254 -334 205 -103 -269 44 50 -232 -162 -39 143 -226 -51 262 -208 -51 91 -342 51 128 18 -372 -48
4722 -48 250 -123 -155 300 -130 -124 211 294 43 -169 569 40 -135 212 281 -276 35 219 -208 152 70 -190
4744 -190 -137 155 104 -91 142 379 -98 22 281 -311 -466 65 -53 -274 -65 213 37 -243 -6 -33 -257
4765 -257 167 201 -329 -63 188 -105 54 193 0 -3 300 357 -171 -177 223 -385 -149 28 -102 -104 -209 146 -206
4788 -206 -125 14 40 -341 274 101 -374 70 -38 -318 -186 266 -18 -180 178 228 -185 -70 429 -52 -206
4809 -206 210 336 -99 159 103 -80 -203 163 39 -353 97 42 -206 -33 37 152 -275 44 158 -236 -90
4830 -90 254 -154 -148 266 78 -75 458 -195 -16 12 256 -51 -199 441 0 -85 -21 42 -79 -14 -34 -40 -256 80
4854 80 175 -184 105 121 -144 -113 84 -102 -264 30 217 -200 -24 1 5 -151 -82 171 -356 12 79 -142 -143 133
4878 133 -66 -171 -200 44 -314 -108 151 -258 -338 205 72 -90 213 72 -57 -104 -65 -14 -205 555 45 -46
4900 -46 226 -20 -153 -147 357 -86 -77 120 137 -163 -27 246 -124 -42 -31 61 -219 -49 43 -107 -119 106 30 -130
4924 -130 227 41 -49 -148 -26 -480 -23 371 112 19 -249 94 -265 -122 325 -261 -84 134 -191 37 178
4945 178 -30 0 -92 76 -123 -358 -44 2 -118 151 -95 -202 230 -97 -161 -192 40 276 80 15 103 -277
4967 -277 -380 507 -140 89 34 136 -138 -136 78 32 -161 154 74 -285 58 27 -222 -95 148 35 -157 246
4989 246 -159 -70 -15 120 -85 -98 384 -250 35 341 -117 -248 -45 248 -233 -243 -81 -42 -278 139 -110 -58
5011 -58 -16 216 -208 -120 47 231 -344 -10 406 -194 -160 400 62 -2 110 84 -41 -145 87 -323 175 -83
5033 -83 101 -160 69 334 -345 -67 131 -128 21 371 -38 -174 93 -8 11 -272 -17 -30 -111 -25 -87 68
5055 68 -107 162 -47 -151 275 54 -167 -60 21 57 -124 -132 57 -234 81 -186 -491 56 44 -125 -39 271
5077 271 -183 -160 85 200 82 -156 73 -9 -170 97 -191 -228 52 25 24 -137 -29 -23 -15 -317 79 -41 -163
5100 -163 -126 -9 -67 206 -149 -269 42 250 -28 -234 264 108 -139 -127 264 -236 -2 67 -54 75 -51
5121 -51 25 -293 -20 96 -114 -22 174 -364 3 297 37 -163 -86 -26 -273 -73 -46 209 33 229 -49 -107
5143 -107 152 123 -316 31 99 -155 -44 -45 91 -50 9 137 -267 -195 332 147 94 -8 174 -203 -78 201
5165 201 -169 -189 299 -99 -309 131 19 -275 -143 272 141 8 337 -50 -65 11 -261 -192 -50 109 -130
5186 -130 -112 -104 172 -18 67 126 -238 -334 446 -186 -11 84 59 -18 -157 122 28 81 -94 65 124 136 305 -181
5210 -181 130 -16 -56 212 -58 -12 -68 -160 201 -112 -59 254 -48 -217 -89 197 -61 39 70 -227 -139 149
5232 149 -15 -218 -126 -30 -58 42 82 -27 23 174 31 -115 37 -37 -23 -172 -85 -103 -40 52 195 101 -269 2
5256 2 -125 -39 145 494 -243 -60 431 -54 23 45 -100 36 -27 -40 210 -114 179 85 74 172 224 -191 80 327
5280 327 10 -78 152 43 -48 -113 -38 -30 -236 -40 115 -24 128 -97 -231 132 142 -30 -217 80 -33 -122 121
5303 121 -26 -53 157 132 46 -426 23 154 -156 233 193 -115 -42 170 12 -36 -227 11 -5 -69 89 -104 110
5326 110 90 -76 -177 74 16 -9 52 105 189 54 128 279 -85 -34 235 -189 -172 28 138 -12 -23 37 40 -65
5350 -65 -14 -155 -87 9 -219 -388 28 -149 28 -28 284 126 -20 97 66 -5 114 305 -107 180 259 13 -143
5373 -143 129 237 213 -15 91 -59 -139 66 -242 101 -54 -16 -292 25 15 -15 -195 201 108 65 208 -10
5395 -10 -212 139 1 -139 29 153 155 -8 -84 90 175 -159 166 -37 106 64 -10 -133 -3 127 -36 56 66
5418 66 -79 53 63 82 -217 -59 -71 -21 70 258 63 -63 70 -4 -136 176 25 -164 -92 94 125 -29 92
5441 92 13 -223 -51 47 -231 -287 155 146 -53 -30 -268 -14 -150 16 -183 -151 63 -64 50 -102 104 7 35
5464 35 155 -69 -31 9 78 -58 96 273 -17 -191 -41 1 -199 -120 -221 -181 95 111 143 -434 34 140 -190
5487 -190 7 -121 -16 -155 26 -316 2 52 145 -166 -92 304 37 117 -100 42 -218 36 32 33 133 -120 -64
5510 -64 80 87 56 10 -212 211 -172 208 117 56 -64 182 171 56 43 218 23 -70 59 328 103 15 120 83
5534 83 -85 -99 73 24 134 -134 -64 -92 16 143 -108 -271 33 -164 1 40 -210 -271 -50 -328 17 140
5556 140 -46 72 221 306 67 -5 110 -167 -50 1 -79 -114 -147 3 247 -117 -1 222 98 9 181 12
5578 12 -86 -251 126 -201 -47 168 -139 -40 -6 -153 102 5 -116 76 -238 163 -81 173 116 -136 83 75 55
5601 55 -56 -64 181 -66 -170 -15 -134 32 -93 278 -126 51 -78 -154 -46 65 115 -44 60 -40 -110 -222
5623 -222 181 174 -7 -16 44 -136 360 -102 51 -140 120 150 -135 23 -24 -63 205 300 35 -51 137 11 110 38
5647 38 115 97 99 116 -86 -74 73 47 41 110 -25 -112 -77 -13 134 -106 65 -116 -174 165 43 -46 -56 -90 201 19
5673 19 -110 108 -156 84 -230 154 -164 3 -108 -79 -72 -115 -23 -30 112 -114 -283 -170 -35 -57 16 -72 111 -138
5697 -138 244 31 -314 179 41 -308 -69 -20 -75 -217 114 130 19 -162 299 -111 -237 24 144 -39 101
5718 101 21 -208 -41 -7 368 -256 -29 63 -13 -150 44 18 58 -37 54 145 150 -131 -25 -240 -139 179 15 213
5742 213 -27 -101 168 69 -148 36 -50 253 -66 -3 159 -110 -216 34 16 -39 -183 49 -48 -46 -31 -163 -45
5765 -45 120 -34 -197 56 96 -278 22 -171 63 42 304 104 143 187 245 -251 -70 92 -171 -91 -176 -31 -11
5788 -11 155 -28 -183 -77 92 16 -121 -26 302 -135 -218 58 -99 96 -60 28 -19 131 110 -112 -9 188
5810 188 -21 253 39 -73 210 181 136 -108 -14 -74 -124 79 199 32 -113 268 -20 9 245 156 -165 201
5832 201 -148 58 -14 -113 -77 -234 186 42 -22 66 -65 96 -102 73 47 -26 79 -182 33 -111 -73 -91 30
5855 30 114 23 -259 -61 -209 68 -39 -36 127 33 1 -75 234 60 49 -355 97 -28 -44 28 79 73 83 -73 343
5880 343 -61 -73 -126 -155 -10 108 -57 -70 -50 96 157 -14 17 -247 -189 -188 71 -31 -19 -112 67 -144 -32 12
5904 12 90 -150 -209 123 -213 210 101 69 10 -236 -6 19 -198 142 -79 -145 120 -16 -204 219 -74 -239
5926 -239 -27 128 83 184 201 -87 -130 -127 135 -286 5 -26 35 6 -73 124 -168 44 79 -25 141 54 15 -31
5950 -31 238 -231 50 139 150 -76 -146 73 89 -4 64 51 -43 5 119 -81 29 199 -173 -64 162 18 -148
5973 -148 180 69 -284 -96 169 72 -239 -104 -202 195 13 67 -91 32 -8 57 199 40 102 190 -289 74
5995 74 -40 -21 292 197 18 -34 10 -230 290 131 189 159 -46 68 110 30 107 46 -161 -171 12 -103 142 -43
6019 -43 69 0 149 1 273 -158 -55 15 -64 119 69 88 5 202 -84 89 176 15 61 -69 -28 -81 -5 -88
6043 -88 -262 37 -89 -59 87 201 -194 -19 -32 -13 -315 98 -33 57 -43 113 65 170 28 220 -73 114
6065 114 259 -16 278 191 162 -198 121 -164 151 -31 292 86 -273 -41 81 43 71 79 -160 -68 34 83 -130
6088 -130 54 0 -71 -68 71 57 -44 44 178 -69 45 106 22 -356 71 249 146 -83 46 18 76 169 24 -131
6112 -131 108 94 -46 99 14 47 -338 -119 51 -1 -44 -68 41 -98 127 -92 -224 109 -200 160 336 7
6134 7 52 -103 25 59 70 18 55 87 -7 203 25 27 -55 114 79 195 57 83 -160 74 -63 103 167 97 195 -185
6160 -185 -71 181 -7 80 -13 -12 214 217 37 -26 -323 116 -74 207 -27 -28 -57 -96 154 -36 -14 150 -219 139
6184 139 168 -120 83 217 -82 44 28 49 6 -38 82 -388 26 -155 147 254 61 -112 -143 97 299 -136
6206 -136 -23 33 124 -225 -46 22 -119 -25 -31 35 -82 77 -21 77 -133 138 -32 164 139 -29 -9 -171 63 -325
6230 -325 -66 78 -31 -43 127 14 38 131 217 -123 103 16 -12 -268 -22 93 -288 99 175 126 -15 216 132
6253 132 287 33 93 133 -125 -207 198 -5 92 150 -117 103 -67 -80 1 -22 -206 165 -74 92 43 64 210
6276 210 -183 -58 -35 -56 234 -233 167 8 -70 -67 38 66 28 -94 -88 74 128 -190 -247 -89 25 -61 -9 -102 3
6301 3 -56 -156 106 120 105 -223 97 43 89 256 144 -78 131 109 -48 -209 -76 191 73 -2 128 -12 -16 42
6325 42 247 -215 73 47 26 -85 -20 -27 -136 -230 104 60 168 164 0 171 210 182 -210 37 -59 -19 -109 -203 42
6350 42 -163 99 91 -171 146 248 -80 -257 -143 43 -135 -7 -1 -81 71 91 52 -182 85 68 155 29 23 71
6374 71 195 126 15 53 121 146 -248 43 -178 -23 -145 -182 -109 -104 -11 -53 145 24 -350 -64 98 -122 -91 -21
6398 -21 107 -6 -25 -157 132 -50 -107 13 123 18 -37 318 -209 144 -69 4 157 -229 -7 -19 -38 -145
6420 -145 -232 126 46 61 178 -71 -45 -91 57 -175 -72 328 -204 115 -26 -139 -22 124 -285 101 -7 -84
6442 -84 289 131 99 61 30 124 48 109 42 142 -82 -106 27 139 67 -162 8 -151 23 4 122 85 -60 139
6466 139 -14 -69 -180 9 194 -127 334 -118 -81 106 96 -210 56 -97 -130 61 -43 -31 94 191 -143 -210
6488 -210 -62 12 90 85 -76 -104 10 82 131 28 -36 -23 -15 -211 58 -2 137 174 167 55 407 29 -315 16 50
6513 50 -34 83 120 -88 27 30 176 22 139 19 27 99 -142 29 -74 -88 30 -56 14 -175 3 17 168 -166
6537 -166 139 110 -79 -89 17 231 -161 145 12 -279 62 39 -160 -19 -27 -144 236 -132 7 -84 60 -50
6559 -50 -170 -87 -74 -63 -83 229 44 207 -84 44 -12 -101 -118 27 64 -83 -106 -9 -59 -44 123 23 196 -43
6583 -43 34 -220 -157 191 -114 -110 229 2 20 -57 -72 -21 77 82 101 -15 150 9 54 275 -306 25 149 321 26
6608 26 -61 58 18 27 181 201 -92 23 130 104 91 -112 37 53 170 -81 -140 -94 138 -115 28 -37 35 92 55
6633 55 121 -97 1 -54 60 135 118 90 -13 114 8 12 92 58 95 -7 -81 -30 -310 -89 95 186 -55 40 -166
6658 -166 66 56 -97 105 -6 -146 -139 -119 -57 -4 -141 -105 -66 -54 -247 -177 -265 -276 164 58 70 91 -54 -133 28
6683 28 122 113 -6 198 333 64 -54 -62 300 -115 -175 -4 55 -64 -120 143 -53 -50 -16 -101 27 -41 -158 219 38
6708 38 -210 1 -2 134 -9 -158 -30 -83 59 46 -115 -48 238 105 7 -357 -115 78 -98 -151 66 -275 25
6731 25 106 -273 -95 -105 0 168 -124 72 184 -84 -67 37 52 77 122 -23 97 10 98 137 -336 75 -135
6754 -135 154 -78 -3 54 -157 -90 25 48 -307 191 -198 4 -23 92 65 -9 97 -50 55 50 154 -225 193
6777 193 30 65 -129 53 61 -188 -69 156 109 42 87 -145 -60 -250 -68 166 18 75 32 -10 121 39 -201 137
6801 137 7 -93 -70 38 -207 76 -195 14 -47 21 155 104 -37 -27 135 -359 110 -144 -87 186 -103 44
6823 44 -51 82 -45 -118 113 33 199 -45 -36 -173 -215 64 121 -144 -42 55 67 23 -195 -65 265 -106 139 -220
6847 -220 27 -163 245 -291 81 -107 35 -55 -110 157 -40 -82 -85 255 0 45 -25 239 -42 59 -311 -58
6869 -58 25 135 -161 3 342 43 105 -135 50 -214 -289 -136 -129 4 136 63 1 -43 223 -126 -37 39 -24 68
6893 68 121 -141 -40 -94 -20 160 -31 -295 179 -60 33 -209 103 -124 26 130 75 57 -134 36 193 -74
6915 -74 -123 54 -118 -90 178 -368 91 -133 113 -3 -155 158 -1 -68 -61 62 9 60 205 28 133 -48 -61
6938 -61 115 174 -22 -27 111 -42 29 41 -55 128 -31 -36 269 84 108 69 -199 5 -30 66 39 -40 35 -57 -34 90
6964 90 -68 -189 1 158 136 99 -175 5 -147 124 -128 20 60 -126 -49 -349 103 -185 -125 -59 52 87 23
6987 23 32 -208 -173 134 -253 -59 55 -36 -156 -235 -296 -84 -81 145 165 -120 128 -97 139 -181 -168 -27 69 54
7011 54 -127 19 -55 -78 -165 113 77 -182 89 -189 -9 -174 199 195 -148 298 290 185 -108 184 59 17 -34 -113
7035 -113 199 50 171 -155 -320 110 118 -184 -73 -142 85 -116 -28 -58 -87 -123 -79 121 153 -25 62 -182 194
7058 194 -87 -117 -136 252 -195 132 -50 -22 -97 -122 83 108 178 -96 -73 35 33 -151 38 23 -161 -100 -81 -135 -108
7083 -108 174 -4 104 12 186 293 92 162 -196 -21 -118 -144 56 104 6 56 121 18 -145 63 -6 -221 -229 -68
7107 -68 201 125 91 -19 -256 -96 -148 -183 -159 -112 -36 -13 -125 131 82 49 254 127 -251 29 135 -153 194 -206
7131 -206 95 -26 91 -132 -105 -76 -168 -128 -250 -80 114 33 160 -182 -297 -213 -37 256 260 427 -101 73 9
7154 9 133 56 122 -105 92 182 -203 -18 -263 37 61 156 -94 178 43 117 -32 -244 191 43 -134 -72 -11
7177 -11 14 77 -104 262 84 -467 -7 -116 -7 84 -46 -40 285 45 47 100 -274 83 -221 50 -48 -118 76 -12
7201 -12 63 48 -7 69 -139 166 66 157 -27 -154 -225 -41 118 -19 -15 -194 -115 86 9 115 133 -134 72 113
7225 113 -19 -188 218 127 161 7 32 25 -137 -126 3 -140 -44 75 6 -87 -185 102 70 -62 -271 132 325 16
7249 16 -43 -9 1 32 -198 9 -133 158 -19 71 146 35 131 -12 -87 120 -48 65 34 -14 151 52 -245 -36
7273 -36 44 -94 25 202 -24 -128 -3 99 -180 -80 -176 -144 117 -95 31 -306 -13 -15 -156 -4 138 -97
7295 -97 78 -66 -10 -76 166 -116 114 16 -92 99 153 42 16 246 -173 185 53 57 32 71 -14 246 250 -93
7319 -93 -43 142 -5 28 -143 170 -17 86 -42 224 -35 134 -176 -369 31 -243 150 126 164 -149 158 163
7341 163 -73 0 34 6 81 54 -8 32 -166 240 -82 143 -210 39 89 57 -78 270 -111 32 16 -131 193
7364 193 85 -196 -35 219 47 237 86 186 112 -172 109 -180 -35 -21 46 -160 189 -69 78 -113 109
7385 109 55 -180 152 -50 -137 -66 139 -50 228 -279 97 7 -70 48 -27 34 -23 6 19 -101 -34 38 121 -30
7409 -30 -161 82 -30 2 309 85 -289 -29 9 76 121 -46 14 9 -118 -91 -71 164 212 198 -28 -17 51 -92 48
7434 48 -146 -27 10 30 25 74 41 296 -152 66 78 82 -25 98 16 -253 67 3 -76 6 -84 -59 235 168 -97 118
7460 118 -56 84 -236 45 -38 39 15 -8 166 13 -19 19 -285 -137 -124 -75 -14 174 -145 203 130 -325 200
7483 200 172 -87 -62 -158 -105 -220 14 125 -32 -77 -53 -74 88 55 127 118 -80 -185 -46 -26 26 68 143 128 113 130
7509 130 122 33 -72 -160 105 -111 -15 -156 194 120 38 190 33 70 4 118 177 -35 145 167 -57 -175 75 49
7533 49 -185 120 73 -44 -9 112 76 68 -34 -90 31 126 106 192 -62 -55 -9 13 69 -236 179 -204 68 21 -50 -100
7559 -100 131 -142 0 18 -53 313 -147 -204 89 -133 -67 73 -86 95 -29 7 223 -43 225 -18 -194 245
7581 245 -148 125 -2 16 -21 64 146 -129 -24 -114 301 68 -253 13 -78 255 -37 -37 49 82 -7 276 15 34
7605 34 92 -112 -109 -159 -68 -48 335 -116 19 -158 -155 -37 66 -68 -117 188 36 -99 -230 -204 -44 -65 36 -123
7629 -123 32 56 23 -60 -47 -186 -88 6 -178 -68 -174 129 -135 5 47 76 117 -187 81 130 -114 90 121 -224
7653 -224 -37 -43 41 -243 40 -154 127 155 -7 62 209 28 -35 -67 -48 141 96 125 40 -13 -106 -28 -82 50 -2
7678 -2 41 -39 -105 -218 34 -138 104 -34 -160 151 13 117 -349 -7 162 -31 21 95 -2 286 155 84 45
7701 45 -53 -15 176 -81 -174 -118 3 283 -33 165 21 -24 168 -175 1 -182 203 62 -217 106 104 -67 -109
7724 -109 -28 222 -2 -356 36 79 159 56 89 -50 428 -24 -66 32 143 -44 -41 -77 -42 215 70 -338 109
7747 109 -54 120 14 -118 -145 -11 -151 -132 83 13 -173 26 -229 -3 309 -164 -67 -160 -39 50 130 75 36
7770 36 72 -2 58 -92 7 -7 -20 151 232 -115 72 -98 -50 58 -96 -182 -155 16 -89 92 -1 124 -203 18
7794 18 -121 118 -219 -4 7 -307 244 -68 -22 -138 -12 28 -97 -233 69 161 112 -36 148 -107 -24 -36 79
7817 79 38 -103 -56 73 -111 67 213 -130 -50 -33 321 64 -18 -52 -59 -98 183 88 -67 91 -184 -28 -41 143
7841 143 -314 -23 -245 -202 11 20 237 20 -65 71 97 -51 175 78 -108 -10 -11 -51 39 58 70 204 119 -14 23
7866 23 132 -11 -118 -136 -193 193 64 -357 -78 -155 14 -75 -25 8 -209 51 82 125 28 20 152 -48 13 -22 9
7891 9 21 -163 69 68 2 -93 43 92 105 -149 -126 324 81 94 -212 -49 -107 211 81 73 176 -5 -46 -48 -335 233
7917 233 -11 34 171 -52 -42 256 -210 63 -239 290 -41 -62 46 129 -65 -26 -94 -179 -139 72 -160 -85 -89 32
7941 32 -298 -122 114 -129 -163 17 142 368 -18 -174 241 -67 227 -104 -26 -85 -77 36 93 -142 -59 -60 -271
7964 -271 -93 -24 7 187 -73 -178 120 197 103 -75 -74 -39 -38 64 111 -40 39 24 98 84 -140 -13 197 81 -7
7989 -7 30 12 98 181 -2 46 -37 -216 -3 12 -24 35 143 -186 4 252 -26 238 22 88 -35 -159 -22 56
8013 56 11 -13 -3 -57 -68 39 -50 -49 58 96 134 211 113 85 88 -191 -333 9 -16 -132 -180 -193 56 -188 -28 -10 -83
8040 -83 282 91 67 57 219 7 -237 -24 -17 147 -52 187 98 -162 -94 -134 92 -25 10 10 -46 164 -236 -243 -195
8065 -195 99 244 175 9 209 117 28 -26 22 -3 0 -44 -162 12 -22 153 42 51 208 155 -64 -369 24 -127
8089 -127 7 2 54 177 57 -175 -123 230 111 -52 -226 105 -57 78 -100 -66 -115 -268 111 51 206 141 67
8112 67 206 17 -6 4 110 -64 134 -337 -80 -130 -150 159 -236 -209 -179 -53 138 -69 5 18 -184 -172 56
8135 56 -113 -225 186 -100 21 -199 -172 -102 -58 -51 -164 -46 -31 -106 154 -75 34 82 8 67 49 -194 -108 -33 27
8160 27 -39 -113 -133 87 41 -101 -182 68 33 -118 -188 25 102 48 22 56 146 -121 -86 63 151 295 58 152 67 11
8186 11 235 -3 -123 -70 248
8191B48
$$ Imaginary data points
##PAGE= N=2
##DATA TABLE= (X++(I..I)), XYDATA
0 0 0 0 0 0 0 0 0 0 0 0 8 -8 8 -8 16 -16 24 -24 32 -38 46 -56 64 -72 85 -101 117 -133 151 -174 200 -229
32 -229 257 -290 326 -369 412 -460 512 -570 634 -703 777 -860 950 -1050 1156 -1273 1403
49 1403 -1545 1704 -1876 2070 -2287 2533 -2810 3128 -3495 3930 -4452 5088 -5882 6908 -8290
64 -8290 10245 -13223 18255 -28297 55732 -280378 -761126 236429 338819 -226045 130261
75 130261 348032 -317216 -133522 581644 147087 -389516 135019 171116 -358238 15124
85 15124 387563 -175586 -192909 358824 44872 -306655 318923 403240 -377035 -249846 346654
96 346654 -46584 -280992 248060 61328 -464580 39071 457441 -104364 -248826 221971
106 221971 24957 -254459 185999 164796 -377702 -124152 245492 -177405 -255587 205254
116 205254 -7469 -366590 83186 263942 -255994 -154738 285802 -74277 -287828 207419
126 207419 131494 -362232 -90409 229596 -156132 -227843 165340 -15310 -272509 136439
136 136439 223832 -192326 -32670 263725 -55867 -130128 245950 92849 -246128 46318
146 46318 209582 -148731 -52611 276709 -49344 -249730 184732 220801 -149162 -32123
156 -32123 132358 -154221 -126064 234254 28861 -296836 -9386 140476 -113987 -486
166 -486 174879 -119863 -167801 186312 101480 -187305 19777 129608 -197997 -131922 182627
177 182627 -40300 -224836 55852 29226 -227295 3284 205221 -116612 -202912 103509
187 103509 40678 -130501 92980 78561 -228311 -60515 204329 -30147 -139991 99265
197 99265 28461 -152570 92688 191068 -125354 -84395 185937 -203 -131123 137100 97926
208 97926 -167842 -3597 174225 -55404 -78197 164406 21103 -156880 107409 154850
218 154850 -127975 -34864 146643 -68015 -112463 142903 37162 -196110 18513 143659
228 143659 -120234 -79283 148023 -51456 -165679 113326 84741 -174423 -28139 123349
238 123349 -107492 -110457 140857 -15016 -210091 48832 109077 -151823 -46182 132450
248 132450 -93361 -140101 138814 63508 -171546 13555 128503 -114180 -52794 179895
258 179895 -22036 -153219 111048 106615 -116147 31520 163268 -83760 -93239 179684 62500
269 62500 -135620 75756 115777 -128294 -7341 188935 -36595 -133913 108500 67937 -127731
280 -127731 47949 137237 -128980 -88916 160934 315 -137455 83742 61283 -162193
290 -162193 -6044 156848 -80948 -134323 107770 12592 -158681 60768 105909 -157227
300 -157227 -74530 132149 -40752 -125378 89676 32470 -169279 10626 137825 -100823
310 -100823 -94281 121230 -17303 -130701 96373 95775 -132047 -22704 144056 -35345 -79362
321 -79362 132198 39625 -133949 63053 138601 -81764 -33289 133699 -19110 -93229 116505
332 116505 83936 -120711 6289 130209 -62038 -57375 133343 768 -131707 65225
342 65225 96554 -98680 -26986 106356 -58148 -98448 108782 38522 -138120 15549 87803
353 87803 -97504 -46557 110136 -37862 -128903 60402 57853 -115773 -10075 92458 -88029
364 -88029 -84530 106153 9517 -116175 35715 60775 -94557 -13208 112680 -43622 -98547
375 -98547 84971 44952 -96128 33043 84773 -84867 -37352 116439 1245 -85523 66747
386 66747 63528 -82665 19010 117581 -42271 -52659 102364 19835 -73837 70434 77704
397 77704 -85705 -18777 110239 -15112 -67387 77053 20043 -101675 39352 90775 -83412
408 -83412 -60032 75226 -19417 -84574 50918 26988 -113436 -7618 86783 -62449 -63397
419 -63397 81834 -6188 -95540 46246 61725 -84314 -25078 78392 -47975 -79495 77736
430 77736 23143 -107545 10942 69001 -60928 -21137 84894 -27100 -78796 73409 59748
441 59748 -81553 3520 81729 -53480 -37616 103610 9787 -81645 56136 76725 -56934
452 -56934 5742 105422 -23594 -63211 86246 41922 -76339 30702 63963 -72348 -20469
463 -20469 98601 -15838 -83239 57390 46467 -81687 10636 78969 -74614 -66728 78922
474 78922 -10458 -105519 27513 43661 -97432 -35208 80628 -30998 -69600 66600 15776
485 15776 -87796 40901 81256 -74652 -48373 73346 -11855 -67244 52782 21076 -103184
496 -103184 12488 102285 -51296 -63955 78229 14502 -67704 51028 59726 -75353 -13453
507 -13453 97636 -18839 -63107 80534 47932 -65356 34438 82885 -38180 -5115 95238
518 95238 -12874 -77590 63709 57795 -87364 -21095 62181 -55468 -49106 79940 -7305
529 -7305 -102698 34939 78475 -59606 -32096 71229 -26686 -68819 62277 22960 -95552
540 -95552 1838 58452 -63488 -44641 66891 -11500 -76746 41487 40531 -77861 -1456 75517
552 75517 -56261 -66381 71352 16375 -80514 21077 56899 -56917 -14472 92897 -5387
563 -5387 -62680 61256 46995 -57050 20434 65872 -48314 -35223 70338 4109 -58451
574 -58451 46677 45414 -65902 10744 95104 -26760 -52196 68769 25009 -62202 26008
585 26008 50496 -68720 -37443 70210 -13663 -73713 34667 25024 -66447 8029 55080 -47460
597 -47460 -36491 59085 -8712 -73291 31877 41249 -72156 -21805 56338 -36839 -47254 58391
609 58391 6429 -78620 16743 62953 -45082 -38128 47131 -16724 -50653 50287 22499 -73989
621 -73989 5206 66750 -24711 -24977 61524 7711 -46162 49517 53352 -53386 -2134 71466
633 71466 -24834 -45889 56389 20356 -57468 18300 50182 -43185 -15778 70683 -9569 -58557
645 -58557 44464 35452 -53157 5368 45053 -46992 -35453 58752 -61 -68726 18666 34255
657 34255 -58360 -10503 54011 -39199 -55949 44075 9034 -66239 6983 37825 -54965 -30944
669 -30944 57456 -12446 -58332 36999 26530 -55224 9976 55253 -36312 -35005 54380 7283
681 7283 -52730 31408 40553 -54268 -5841 65775 -18370 -38024 52951 18835 -50978 25571
693 25571 59457 -37458 -24546 60838 -874 -43670 45210 29042 -57005 5523 59656 -25368
705 -25368 -33717 46967 3515 -54073 29858 41991 -57057 -21099 51944 -23372 -47798 38581
717 38581 9477 -65638 1554 43400 -42812 -35600 44630 -13851 -59658 31270 29379 -55608
729 -55608 -8664 43597 -29452 -33673 49240 8143 -59674 17556 46506 -39454 -12250 54181
741 54181 -17078 -42700 46067 30460 -46331 6260 48295 -28659 -21843 58801 4085 -49946
753 -49946 31768 38041 -39266 2575 53503 -20924 -35320 48511 21607 -46774 15392 41311
765 41311 -41117 -16780 52726 -11013 -47385 28078 20857 -45317 2108 42293 -34046 -36018
777 -36018 43006 2433 -50200 17626 23229 -49204 -13175 41366 -21598 -44514 27141 10087
789 10087 -48315 9546 36865 -39305 -23638 43728 -4403 -36841 27765 20082 -41904 2954
801 2954 47962 -19317 -27739 41893 8540 -35502 29006 35706 -34572 -6696 45428 -6109 -27027
814 -27027 34783 15145 -40688 13172 41633 -26406 -15376 39972 -5541 -31048 32074 24980
826 24980 -37233 -3368 37586 -18047 -23211 35452 -873 -43979 15443 26901 -32756 -11961
838 -11961 28483 -18237 -31629 27742 9598 -43650 1243 25104 -33049 -17167 32505 -13215
850 -13215 -39465 17861 17098 -33172 -770 30303 -24128 -23220 37800 6458 -33845 17132 22673
863 22673 -26573 1941 38394 -11542 -25287 32746 17342 -28122 16641 33120 -25758 -7514
875 -7514 40822 -1905 -24939 25559 16901 -30584 5814 36573 -18854 -21266 32098 1468 -28833
888 -28833 22112 19397 -34480 -5277 34004 -12161 -27004 23184 4375 -36716 10165 24996
900 24996 -33548 -17389 27783 -12976 -31136 19924 9792 -38765 -3377 27626 -23537 -21394
912 -21394 29571 -6701 -37292 19898 23707 -29834 -6655 30032 -11387 -18540 33922 10908
924 10908 -34243 14273 34485 -21023 -6431 35360 -6331 -24516 28612 19439 -29775 4687
936 4687 34758 -18811 -17611 37831 6334 -30477 17126 22157 -24986 83 33447 -14835 -28876
949 -28876 27509 14524 -31904 5968 21933 -29057 -10638 33419 -10748 -36165 16328 15536
961 15536 -33246 -4959 26115 -23971 -26251 27661 274 -34497 12788 19566 -29903 -9418
973 -9418 30266 -8237 -25066 21871 7581 -32694 11672 29689 -26509 -16041 31918 509
985 509 -22965 21257 18228 -27424 3292 38230 -10643 -19652 29599 7732 -24836 16909 24104
998 24104 -22426 -7235 29208 -4655 -20206 24653 11770 -30291 6686 28396 -19181 -14070
1010 -14070 25130 -4443 -26596 16722 16883 -28739 -6825 26755 -12859 -21286 22578 2197
1022 2197 -29863 7142 17183 -23294 -11092 20793 -12096 -28077 17107 11153 -28630 263
1034 263 18535 -20284 -9899 26888 -3080 -27175 13394 19381 -19631 -3204 23202 -12302
1046 -12302 -14769 27598 7337 -23982 10381 22510 -13071 -3352 25793 -1724 -16745 20554
1058 20554 12831 -21266 7775 24233 -15501 -11086 23158 1788 -17992 13139 12424 -23044 -1140
1071 -1140 26004 -12337 -21422 16850 3386 -21551 7202 12031 -22537 -8718 21898 -5565
1083 -5565 -21636 13169 5997 -24270 4603 17404 -20469 -13409 18380 -5831 -22718 11832
1095 11832 11148 -24793 -4287 21473 -12050 -14788 20749 1295 -21410 11731 18244 -15609 -4370
1108 -4370 22310 -4040 -13246 22895 11102 -21235 8826 23534 -11783 -4421 24653 -1122
1120 -1122 -19163 15892 17157 -18556 -1529 21331 -11974 -13454 22291 2365 -23655 7867
1132 7867 15320 -17902 -6987 19642 -9913 -21516 17480 7412 -26198 2395 17406 -19662
1144 -19662 -12039 20946 -3327 -23350 10271 11087 -23337 -1706 22380 -15354 -18806 19545 1817
1157 1817 -22513 9370 14542 -21161 -6066 24829 -5149 -20647 17619 10741 -20622 8014
1169 8014 22111 -15371 -8771 24408 2620 -17285 14822 16305 -19129 690 25820 -8800
1181 -8800 -13922 22011 4485 -21023 10786 19128 -17325 -8729 21559 -4217 -19261 16464 8576
1194 8576 -24848 1504 19362 -15052 -12987 17242 -3215 -22415 10558 13609 -23312 -6578
1206 -6578 19998 -11728 -17032 18193 2311 -24109 5131 16605 -16216 -9138 19510 -5151
1218 -5151 -20150 15308 10723 -21534 1349 18137 -13378 -10418 19894 1224 -19940 10384
1230 10384 16698 -15761 -1789 22674 -7205 -13585 20299 9032 -16279 7279 17032 -11785
1242 -11785 -5427 21838 -1119 -17806 13822 11365 -17743 2245 17483 -11982 -12310 16739 2269
1255 2269 -18921 5829 11700 -17907 -5406 17904 -8718 -16817 12552 3084 -18381 3488 12781
1268 12781 -15241 -10845 16218 -3092 -18461 10344 7591 -19481 -67 16414 -10116 -11961
1280 -11961 14346 2013 -16002 7967 13247 -15075 -4035 18380 -4812 -11495 14996 5301
1292 5301 -15405 5844 17005 -9141 -6382 18205 639 -13339 14287 11968 -14272 1569
1304 1569 17051 -6426 -7660 15458 2504 -15826 6858 13097 -14176 -4734 14796 -8128 -13549
1317 -13549 13143 3637 -18085 822 11739 -12459 -9433 14205 -3662 -17554 9208 7906
1329 7906 -16546 -559 13123 -10318 -10628 13460 1729 -16715 5572 10877 -15156 -3442 16801
1342 16801 -6760 -13741 12697 5917 -14120 3866 13617 -10593 -6319 17781 377 -13478 11341
1355 11341 9940 -13241 3331 17001 -7029 -8325 15586 4547 -13585 8398 13681 -13521
1367 -13521 -3724 17661 -4412 -11456 11638 3984 -15207 3433 13248 -11571 -10058 13717 -2431
1380 -2431 -15918 9201 6490 -17782 -1262 13785 -9310 -12057 11542 1284 -16833 4761
1392 4761 11509 -13846 -5323 14572 -5781 -12164 12524 5374 -15384 1580 13478 -8893 -7393
1405 -7393 14747 -1494 -14928 10522 10335 -13799 -997 14424 -5616 -8438 13596 4725 -13735
1418 -13735 5985 13937 -10208 -2815 16354 -2843 -10596 11991 7379 -11932 2517 13343 -8595
1431 -8595 -7716 15152 848 -14665 6664 7814 -12694 -1449 11624 -8148 -11583 9978 2605
1444 2605 -15108 2340 9445 -13000 -5889 12531 -4768 -12758 8010 4363 -13217 158 12046
1457 12046 -8311 -9216 11258 1236 -11596 7231 7174 -12062 -737 12756 -4062 -9105 9830
1470 9830 4036 -11341 4720 11235 -9624 -3829 13523 -1090 -8997 8785 6955 -9190 1341
1483 1341 12095 -4635 -5345 11983 1048 -10263 8145 8531 -9697 -1265 10306 -4123 -6892
1496 -6892 9599 2031 -13144 2636 9512 -9604 -5654 8980 -4348 -10126 6145 2749 -11697
1509 -11697 -863 8203 -7483 -7322 8963 -1411 -11275 5461 5585 -9820 -699 9373 -5298
1522 -5298 -7893 9330 4237 -9895 3096 8591 -7851 -2059 11480 -1940 -8162 7684 5716
1535 5716 -8057 1611 9853 -5679 -5007 11718 1219 -9269 6798 7147 -8597 380 11044
1548 11044 -3649 -7487 9074 3585 -9711 4427 8395 -9692 -3478 10784 -3241 -9025 6893
1561 6893 3315 -11253 255 9058 -8510 -7662 9033 -1708 -11559 5344 4735 -11049 -2156 9088
1575 9088 -5246 -7704 8207 1149 -11913 4171 9261 -9304 -3490 10623 -3137 -7748 8948
1588 8948 5033 -10255 1581 11261 -5493 -5414 11085 85 -9311 7382 6969 -8962 -46 10790
1602 10790 -3984 -6837 10509 3776 -10960 4352 9732 -8416 -2501 11480 -2749 -9527 7867
1615 7867 5701 -9692 119 9307 -6988 -6320 10536 -667 -11712 5019 5761 -10587 -1973 8829
1629 8829 -6108 -9648 8308 2649 -12232 1711 8110 -9473 -4272 10324 -2271 -9461 6098
1642 6098 4753 -9289 297 10108 -5995 -6533 10422 1341 -9172 6185 7460 -8190 -1212 10865
1656 10865 -2214 -7757 7986 4420 -9436 3108 9525 -6964 -3973 10209 -6 -7499 6433
1669 6433 5493 -8610 -1 10584 -4461 -6549 8853 985 -9562 4485 6473 -7974 -3347
1682 -3347 8351 -2708 -7996 6242 2619 -10262 845 7242 -7824 -5203 7093 -2710 -9168
1695 -9168 4430 4613 -8819 -2264 8372 -4236 -6184 7935 1176 -8838 3051 6425 -5774
1708 -5774 -2120 8043 -1810 -6441 7266 4789 -7664 2162 8185 -4817 -2645 8816 -13 -7165
1722 -7165 4899 5859 -6523 -613 8274 -3540 -5317 7950 2117 -7101 3612 5549 -6012 -1527
1736 -1527 7623 -2035 -6956 5618 3201 -8194 1444 6350 -6513 -4061 6995 -1077 -7513 3058
1750 3058 3420 -7953 -1490 6417 -5013 -6159 5960 -455 -7919 2885 4397 -7260 -2024 7544
1764 7544 -1841 -5983 6098 3084 -7697 2857 7125 -5181 -2533 7587 -526 -5037 5592
1777 5592 4674 -6405 1020 8329 -3571 -3885 8228 491 -6964 4291 5580 -6337 -1665 7175
1791 7175 -2448 -5729 6518 2955 -7737 2333 6328 -5640 -2401 6955 -2031 -7067 4691 3910
1805 3910 -7730 -607 6990 -5114 -5096 7371 -171 -8210 2772 4347 -6981 -2482 6441 -3544
1819 -3544 -6835 5475 1840 -8292 1739 6150 -6422 -2702 7949 -764 -6696 4794 4986 -6812
1833 -6812 368 8657 -3887 -4640 8256 1680 -6515 3869 5764 -5563 -980 8267 -1296 -6018
1847 -6018 6270 3188 -7879 2093 7053 -5916 -3751 7171 -561 -6837 4150 4855 -7151 -922
1861 -922 7828 -3734 -5846 6405 1117 -7421 2710 5301 -6339 -3272 6933 -1649 -7328 4850
1875 4850 3013 -8659 367 6317 -5587 -4592 6183 -357 -7501 2856 4873 -6636 -1938 7235
1889 7235 -3013 -5242 6858 2279 -6979 2725 6991 -4341 -2896 7646 -127 -6110 5523 4787
1903 4787 -6482 661 7380 -3331 -3665 6751 1344 -6237 2899 5571 -5578 -1720 6903 -2833
1917 -2833 -5929 5493 2314 -6805 1035 5288 -4536 -3478 6151 -407 -7180 3307 3747 -6785
1931 -6785 -491 4972 -4139 -4247 4728 381 -6434 1608 4428 -5946 -2336 5754 -2444 -5549 4239
1946 4239 1816 -5541 972 4994 -3634 -3176 5768 455 -4992 3767 3689 -4819 871 6292 -2436 -2982
1962 -2982 5541 1714 -4719 2786 5011 -4324 -1275 6273 -1185 -3998 4517 1844 -4868 1002 4387
1977 4387 -3461 -3079 4910 -557 -5213 3404 2722 -5719 -138 4827 -3100 -3411 4261 537 -5350 1575
1993 1575 3898 -4836 -1550 4753 -2333 -4483 3975 1056 -5068 1097 3630 -3823 -2573 4798 -921
2008 -921 -5447 3712 2952 -4964 539 4535 -2690 -2464 4836 1223 -4378 2458 4326 -3911 -388 5916
2024 5916 -1742 -3060 4812 2048 -4603 1690 4772 -3505 -2138 5019 -377 -5083 3580 2611 -5372
2039 -5372 144 4768 -3375 -3658 3987 307 -4977 2151 3482 -5099 -1196 5295 -2772 -4302 4164
2054 4164 1126 -5307 1214 4170 -3961 -3250 4968 -761 -5239 3325 2228 -5621 6 4352 -2945
2069 -2945 -3332 4171 495 -5239 2522 4371 -4414 -1044 5503 -1599 -3318 4914 2200 -4558 1358
2084 1358 4810 -2606 -2345 5717 272 -4421 3968 3177 -4603 591 5047 -2471 -3057 4508 974 -5274
2100 -5274 1571 4058 -4354 -1873 4791 -2129 -4297 3274 1653 -4713 190 3726 -3483 -3211 4546
2115 4546 -302 -4987 2523 2491 -4679 -290 4236 -2222 -3333 3632 1380 -4705 1165 3692 -3856
2130 -3856 -1614 4716 -1426 -3868 2931 1757 -3787 694 4190 -2432 -2442 4810 833 -3962 3211
2145 3211 3499 -3659 155 4574 -847 -2577 3607 1818 -4052 1467 3805 -3381 -1435 4362 -1247
2160 -1247 -3494 2636 1370 -4323 -435 3580 -2526 -3161 3386 -203 -4631 1893 2430 -3819 -1032
2175 -1032 3283 -1746 -2774 2646 881 -4405 1132 3133 -3698 -1309 3920 -1174 -2888 2941 1754
2190 1754 -3574 -170 3250 -1928 -2556 3681 -58 -3844 1967 2135 -3333 64 3380 -1065 -2295
2205 -2295 3279 1603 -3218 1839 3997 -2559 -876 4357 -668 -2699 2796 1983 -2944 458 3508
2220 3508 -2124 -2433 3732 -310 -4010 1946 1593 -3842 -545 2843 -2215 -3164 2673 810 -3865 1138
2236 1138 3174 -3262 -1338 3767 -1386 -3075 2395 1348 -3509 -46 3084 -2460 -2411 3901 -349
2251 -349 -3939 2507 2418 -3536 -479 3599 -1165 -2558 2899 1173 -4051 1344 3551 -3050 -1103 4058
2267 4058 -758 -2689 3634 1902 -3206 1037 3903 -2088 -2106 4224 112 -4058 2452 2487 -3396 -548
2283 -548 3358 -1364 -3044 2619 840 -4395 749 2854 -3611 -1624 3403 -1562 -3608 2194 1574
2298 1574 -3924 -57 3580 -2261 -2452 3882 485 -3999 1716 2134 -3234 -627 3431 -1304 -3070
2313 -3070 2714 1415 -3770 1095 3278 -3108 -1555 4105 -486 -3160 2324 2055 -3031 35 3930
2328 3930 -1325 -2585 3820 896 -3316 2279 2714 -2538 -335 3637 -716 -2888 2507 1380 -3995
2343 -3995 939 3282 -2906 -1987 3274 -480 -3196 1559 1698 -3275 -1029 2982 -1945 -2826 2786 244
2359 244 -3462 1392 2302 -2774 -798 2957 -694 -2847 2395 1561 -3688 376 3069 -2177 -1407 2693
2375 2693 -151 -2714 1747 1964 -2489 -351 2961 -1237 -2163 3280 505 -2971 1503 2420 -1884 -539
2391 -539 3027 -242 -2444 2306 1866 -2859 451 2974 -1781 -1356 2862 -242 -2130 1522 1423 -2532
2407 -2532 -727 2436 -1580 -2573 2613 331 -3280 1025 1543 -2278 -1101 2194 -736 -2545 1471
2422 1471 1064 -2908 436 2421 -2201 -928 2881 119 -1984 1616 1884 -2305 -320 3133 -940
2437 -940 -1967 2840 407 -2503 1369 1876 -2364 -698 2639 -297 -2330 2190 1408 -2921 966 2815
2453 2815 -1832 -1142 3090 -74 -2524 1541 2067 -2303 -301 2802 -1167 -1842 2890 152 -2765 1237
2469 1237 1675 -2229 -764 2355 -1040 -2896 1889 1175 -3522 138 2410 -2461 -1644 2385 -611 -2626
2485 -2626 1278 1768 -2663 -559 2966 -1374 -1980 3049 477 -2873 1612 2171 -2360 -585 3192 -236
2501 -236 -2537 2509 1859 -2743 515 2696 -1988 -1255 2805 103 -2526 1646 1983 -2745 -194 3236
2517 3236 -1063 -2052 3112 676 -2853 1083 2441 -2157 -1088 2805 -354 -2927 1861 1472 -3202
2532 -3202 164 2742 -2203 -1887 2392 -113 -2511 1036 1639 -2815 -950 2613 -1453 -2426 2284 577
2548 577 -3058 586 2299 -1562 -1087 2769 243 -2639 1886 2006 -2522 304 2817 -1557 -1366 2524
2564 2524 555 -2139 1080 2267 -2058 -1017 2676 -819 -2336 2288 866 -2509 501 2192 -1516
2579 -1516 -1432 2685 253 -2325 1667 1649 -2583 4 2505 -1084 -1572 1926 450 -2467 546 1888
2595 1888 -2010 -1185 1953 -870 -2507 1174 626 -2112 200 1580 -1656 -1543 1760 170 -2185 1161
2611 1161 1539 -2008 -107 2238 -608 -1229 1799 905 -1803 457 2186 -1397 -686 2670 -351 -1666
2627 -1666 1482 941 -1744 422 1955 -1060 -1435 1631 291 -2274 932 1392 -2131 -188 1659 -761
2643 -761 -1258 1765 439 -1616 576 1733 -1501 -647 2093 -575 -1729 1262 555 -2019 62 1331
2659 1331 -1198 -1499 1586 -125 -2122 872 843 -2103 -199 1636 -1303 -1339 1455 542 -1581 674
2675 674 1671 -1629 -366 2449 -601 -1221 1887 823 -1610 717 1673 -883 -819 1784 299 -1848
2691 -1848 1366 1118 -1756 430 1995 -1149 -874 1928 440 -1799 537 1573 -1917 -616 1922
2706 1922 -688 -1597 1701 483 -1666 569 1471 -1151 -997 1747 -261 -2067 1249 746 -2511 247
2722 247 1600 -1572 -1365 1496 -93 -2274 676 1583 -1936 -585 1900 -852 -1738 1891 541 -1754
2738 -1754 624 1899 -1129 -806 2464 402 -1750 1558 1603 -2128 213 1959 -1029 -1308 1762 602
2754 602 -1796 751 1698 -1757 -575 2096 -756 -1729 1524 721 -2108 244 1978 -1500 -1399 1787
2770 1787 186 -2173 1259 1554 -2015 -111 2065 -738 -1376 1309 486 -1980 241 1856 -1848 -1006
2786 -1006 2193 -536 -1962 1119 622 -2048 -204 1767 -1028 -1528 1693 239 -2170 1142 1582 -1704
2802 -1704 -52 1822 -631 -917 1405 1049 -1402 312 1982 -1148 -823 2236 -255 -1534 1146 1177
2818 1177 -1579 -404 1635 -690 -1502 1465 468 -1710 894 1271 -1678 -427 1464 -665 -1418 891
2834 891 1027 -1682 272 1864 -1272 -961 1933 -17 -1463 957 701 -1571 -286 1678 -680 -1361
2850 -1361 1411 303 -1954 703 1130 -1528 -620 1755 -461 -1461 990 660 -1427 -11 1947 -604
2866 -604 -398 1456 184 -963 1163 959 -967 121 1601 -479 -1114 1436 286 -1598 679 1124
2882 1124 -1297 -200 1215 -482 -943 856 607 -1554 96 1212 -1372 -890 1474 -495 -1084 971
2898 971 870 -1319 -25 1386 -725 -998 1327 7 -1798 772 860 -1401 -201 1327 -680 -1046
2914 -1046 764 442 -1624 388 1149 -1491 -385 1551 -662 -1152 1219 635 -1306 225 1502 -391
2930 -391 -837 1639 270 -1588 1160 1287 -1285 -19 1446 -776 -1068 1268 489 -1883 37 1452
2946 1452 -1549 -622 1569 -547 -1397 760 817 -1565 -389 1264 -768 -1169 1226 61 -1449 1050
2962 1050 1071 -1468 -262 1420 -573 -1394 1255 429 -1768 202 1551 -1201 -688 1348 -397 -1314
2978 -1314 667 840 -1456 -146 1486 -883 -1230 1716 492 -1722 800 1395 -1348 -312 1616 -25
2994 -25 -1209 1060 1274 -1677 108 1810 -1080 -648 1475 49 -1245 700 810 -1524 -363 1376
3010 1376 -858 -1541 1239 429 -1853 522 959 -1245 -586 1368 -52 -1462 604 752 -1337 -164
3026 -164 1522 -1015 -816 1219 64 -1236 642 880 -1130 -581 1376 -216 -1356 1057 507 -1494
3042 -1494 150 1082 -740 -635 987 154 -1148 644 1002 -1220 62 1706 -891 -536 1351 374
3058 374 -1289 596 1146 -785 -473 1661 -209 -969 1180 431 -1230 130 730 -837 -660 1006 -32
3075 -32 -1309 369 688 -1354 -94 1417 -626 -785 936 3 -923 471 1075 -614 -449 1375 -408
3092 -408 -1099 937 337 -1263 266 942 -797 -371 965 162 -1118 569 1012 -1125 97 1337 -402
3109 -402 -552 1456 128 -935 266 782 -516 -402 1534 -103 -1174 1295 412 -990 438 1061
3125 1061 -946 -461 963 -15 -969 434 647 -1292 -194 1020 -927 -568 1117 58 -1186 251
3141 251 735 -1095 -315 1028 -465 -1089 1199 193 -1038 502 963 -675 -582 897 -59 -938 679
3158 679 722 -1307 14 1211 -997 -840 1148 52 -1217 450 1028 -1074 -250 1494 -368 -1004 1190
3175 1190 549 -1160 430 1124 -774 -364 1205 -94 -1232 597 1108 -1354 209 1362 -865 -680
3191 -680 1316 140 -1278 257 769 -960 -527 1241 -459 -1161 889 184 -1382 110 891 -650
3207 -650 -653 955 -56 -1402 804 1009 -1247 -136 1423 -560 -628 866 470 -1169 67 1164 -736
3224 -736 -540 1328 -176 -1208 836 438 -994 363 902 -609 -806 1079 300 -1173 959 1247 -1005
3241 -1005 -132 1405 -383 -621 940 767 -680 -4 951 -747 -839 1152 -422 -1077 794 515 -1173
3258 -1173 -49 725 -466 -753 1006 301 -1449 368 915 -860 -266 887 -89 -548 784 571 -811
3275 -811 106 1141 -520 -484 1118 74 -706 675 573 -774 -56 848 -316 -750 754 262 -632 191
3293 191 853 -1032 -141 1017 -451 -818 648 166 -585 210 1067 -585 -685 1060 31 -777 702
3310 702 495 -894 -60 661 -223 -651 512 -93 -984 498 550 -814 -142 749 -695 -590 382 350 -646
3329 -646 72 846 -567 -644 744 -53 -883 588 192 -678 353 547 -503 -205 731 86 -833 495
3347 495 987 -858 -33 918 -259 -514 741 392 -673 163 531 -618 -188 1085 -189 -572 831
3364 831 107 -498 204 1079 -285 -449 838 320 -1003 333 896 -782 -273 798 -561 -545 408 108
3382 108 -841 -75 468 -1013 -556 934 -281 -945 718 91 -918 384 691 -419 -533 811 123
3399 123 -745 740 625 -697 193 841 -444 -521 841 412 -840 74 725 -683 -369 1251 -317 -966
3417 -966 852 549 -797 -158 748 -457 -397 778 85 -885 710 728 -951 -18 766 -221 -612 889
3435 889 343 -1012 59 770 -756 -852 797 -51 -913 554 190 -654 -234 589 -438 -812 953 196
3453 196 -1219 290 725 -872 -302 924 -147 -601 765 579 -665 230 911 -256 -624 985 -5
3470 -5 -823 513 280 -583 64 930 -271 -596 596 369 -1165 433 518 -630 -185 820 -81 -611 574
3489 574 648 -581 -117 923 -219 -235 763 4 -717 439 475 -383 -215 593 -116 -848 603 295 -1174
3508 -1174 -88 470 -654 -395 402 -12 -803 0 601 -608 -231 919 -277 -379 728 226 -394 419
3526 419 668 -373 -265 911 268 -504 330 383 -661 190 648 -422 -208 470 -137 -296 363 313 -759
3545 -759 97 657 -404 -718 791 -52 -482 367 426 -288 -143 556 -36 -495 458 246 -590 225 602 -452
3565 -452 -127 488 -128 -400 171 191 -515 -100 692 -422 -383 311 -242 -611 195 291 -176 104 645 53 -582
3586 -582 650 375 -653 486 586 -420 -24 795 -158 -504 257 401 -476 -138 622 -573 -375 471
3604 471 -129 -531 581 62 -631 169 695 -399 -578 586 115 -764 608 613 -654 7 504 -238 -340
3623 -340 182 304 -671 -95 502 -648 -255 683 -217 -942 405 116 -742 63 754 -402 -640 945 49
3642 49 -1132 233 552 -463 -322 871 -316 -471 428 485 -601 191 807 -596 -429 825 133 -685
3660 -685 304 248 -612 -211 690 -174 -517 767 -25 -853 463 561 -368 -191 695 -149 -688 355 503 -850
3680 -850 -106 920 -468 -536 925 -60 -620 480 495 -502 -426 408 -122 -911 674 389 -449 229 409
3699 409 -540 -310 416 42 -714 202 640 -889 45 812 -412 -475 704 6 -438 89 546 -333 -285 692
3719 692 136 -404 543 250 -795 362 555 -274 -294 592 329 -775 302 503 -691 -238 472 -544
3737 -544 -616 230 161 -211 249 307 -536 -151 564 89 -500 591 329 -566 -35 668 -331 -262 417 -27 -610
3758 -610 30 453 -383 -576 427 -393 -499 524 19 -163 14 396 -364 -324 727 -122 -490 492 292
3777 292 -496 209 627 -277 -446 241 267 -297 224 393 -547 -36 574 -180 -421 393 303 -435 8 607 -335
3798 -335 -216 483 -2 -480 349 201 -542 546 347 -420 -8 374 -6 -618 471 299 -998 72 401
3817 401 -439 -310 463 13 -381 -1 383 -445 -466 299 -65 -451 515 245 -463 58 540 -91 5 547 -149
3838 -149 -488 225 339 -394 103 696 -205 -152 484 -52 -401 83 567 -286 -139 531 -100 -449 552 166
3858 166 -548 214 245 -562 -45 611 248 -535 311 428 -774 -110 491 -396 -112 435 -193 -467 252 504
3878 504 -541 -318 728 -160 -603 356 -93 -657 112 194 -632 -272 518 358 -369 404 602 -671 17
3897 17 641 -474 -364 597 163 -463 72 496 -375 -384 643 -90 -337 407 290 -454 -24 256 -349 -278 333
3918 333 -185 -452 197 685 -557 -21 362 -469 -421 360 9 -695 141 267 -178 -212 666 -71 -531 302
3938 302 152 -538 21 206 -117 -398 305 413 -546 263 293 -467 -242 271 -301 -379 105 147 -462 -1 162
3959 162 -434 -327 292 176 -298 279 219 -376 86 607 3 -312 415 221 -910 130 370 -720 -113
3978 -113 268 -17 -131 187 202 -341 78 209 -401 -332 260 -52 -294 330 142 -443 -11 312 81 62 150
3999 150 274 -280 85 421 -417 -24 336 -190 -217 451 37 -352 -105 331 -449 -296 158 -243 -504 292
4019 292 -100 -397 89 487 108 -250 324 -28 -509 307 412 -519 348 611 -245 -404 425 233 -439 84
4039 84 354 -572 -196 309 -125 -597 367 209 -505 -119 268 -297 -243 353 41 -434 377 561 -322 55 801
4060 801 -279 -377 556 -94 -503 -17 311 -644 -154 528 -145 -365 484 -35 -550 6 348 -306 -277 464
4080 464 58 -425 206 445 -263 149 599 -91 -384 387 208 -469 15 521 -200 42 523 -243 -527 101
4100 101 199 -342 -50 282 -186 -660 147 -73 -452 215 217 -674 -269 278 123 -297 263 220 -217 -30 764
4121 764 -357 -386 456 28 -480 279 223 -349 422 265 85 -392 195 237 -362 -4 285 -496 -70 398 -52
4142 -52 -418 288 260 -284 -89 701 -121 -338 506 171 -399 221 342 -386 -230 381 81 -329 287 -87 -284
4163 -284 217 183 -472 -235 496 -177 -284 -34 260 -383 -441 611 -137 -451 265 -18 -346 141 197 -169 -284
4184 -284 360 174 -286 241 225 -224 -117 265 -128 -170 452 -65 -353 256 117 -423 -75 215 -92 -201 218
4205 218 -16 -282 3 182 -124 12 121 74 -220 388 252 -463 23 266 -396 86 216 -109 -300 173
4225 173 301 -141 -54 234 -387 -218 270 -158 -638 345 15 -359 -266 210 180 -112 296 142 -511 141 339
4246 339 -355 88 205 -64 -193 192 190 -142 -196 370 -415 70 287 -134 -378 154 -152 -71 -168 95 -383 -258
4268 -258 308 44 -390 452 455 -537 -220 425 -146 -127 123 218 -563 182 281 -76 33 418 -131 -321 157 239
4290 239 -515 -71 328 -282 -343 116 57 -600 168 365 -209 -16 254 59 -236 -32 547 -277 51 423 -269
4311 -269 -322 505 161 -224 175 352 -489 -113 355 -229 -353 298 78 -468 25 109 -486 -13 253 -110 -90
4332 -90 184 524 -421 -213 315 -127 -129 471 -121 -127 80 375 -263 -256 219 -213 -323 286 26 -582 53 255
4354 255 -227 -286 319 47 -711 69 297 -166 -153 299 -409 -348 404 -20 -430 99 367 -242 -177 442 121
4375 121 -666 464 268 -281 -4 347 58 -101 -39 -225 -238 -3 100 -298 -103 383 -95 -363 240 -172
4395 -172 -204 64 209 -122 -406 148 167 -385 334 313 -165 -221 169 -143 82 137 121 -200 196 204 -397 -113 442
4418 442 -326 -92 247 -27 -248 -190 306 -404 -274 307 -32 -400 241 187 -438 72 317 -85 -241 170 61
4439 61 -240 257 367 -322 -82 263 87 -95 290 2 -218 -101 20 -53 -187 398 -103 -324 322 123 -252
4460 -252 89 168 -125 50 314 52 -289 -21 24 -197 -159 296 -105 -113 129 -16 -333 39 52 -247 -29 340
4482 340 -93 -311 413 -243 -265 88 112 -93 -136 69 53 -268 65 106 -306 133 273 -258 -162 268 -32 -233
4504 -233 28 -63 28 -87 222 -94 -456 331 152 -346 1 169 -151 40 129 11 -173 39 300 -206 101
4525 101 333 -212 -118 240 -339 -41 -86 225 -182 -390 288 -64 -249 211 -29 -361 269 278 -370 -19 129
4546 129 -6 -463 175 179 -303 -73 417 -209 -150 499 141 46 184 137 -302 -178 318 27 -155 247 274 -265
4568 -265 144 9 -160 -289 329 101 -501 -161 113 -403 -144 232 -25 -201 -49 312 -466 -47 -88 -56 -387
4589 -387 219 23 -215 140 155 -208 -127 338 -52 -318 126 256 -214 -39 341 -397 -94 348 -162 -391 85
4610 85 94 -239 138 227 -109 -55 321 -97 -234 196 89 -117 115 354 -52 -346 163 394 -159 -7 414 -392
4632 -392 -54 283 -32 -61 110 -7 -158 -157 276 -155 -539 246 -89 -280 212 98 -287 -39 126 77 -324
4653 -324 -57 270 -520 -92 320 -221 -84 280 21 -226 36 462 -159 -151 200 -51 -109 176 -67 -170 41
4674 41 -12 -211 64 -109 125 -54 -125 -62 -369 86 224 -138 210 238 -119 -192 33 189 -234 71 104 -138
4696 -138 -82 6 -203 -299 -143 -88 -21 -153 135 -112 -206 98 93 -139 155 200 -308 -102 337 -284 -278 115 -75 -214
4720 -214 132 209 -152 -241 362 53 -283 106 349 -16 11 -71 -208 -464 91 151 -207 211 241 -244 -124 256
4742 256 -68 -209 127 90 -218 -147 369 -322 -355 407 131 -172 205 -9 -147 -5 21 67 -161 168 266 -218
4764 -218 86 269 -267 -88 435 -95 -189 10 91 -214 -44 301 -130 -143 442 -66 -473 247 -33 -211 -56
4785 -56 4 68 -304 15 53 -264 66 261 -498 -237 284 -14 19 178 -12 -143 -263 293 35 -124 104 -13
4807 -13 -69 271 78 -359 -61 -3 3 -334 45 14 -166 38 162 -155 -78 228 -3 -94 219 111 -207 -189 332
4830 332 -122 -89 210 82 128 357 251 -17 -30 132 -28 -135 33 336 -159 121 318 -125 34 252 17
4851 17 -230 263 122 -188 114 189 147 -257 249 -56 -30 222 -36 156 -265 305 -1 -175 76 245 -99
4872 -99 -37 -125 -323 9 65 146 -118 137 252 -418 -143 83 -181 -102 270 -39 -302 92 131 -83 28 -2 124
4895 124 -15 126 137 -67 124 227 -182 -132 200 -140 -240 208 188 -68 -84 214 -115 -244 111 -67 -228
4916 -228 301 -109 -169 -141 -195 26 -15 229 1 -46 70 -44 -145 -262 57 -43 -246 -89 90 -98 107 392
4938 392 -140 -118 6 -106 58 468 -175 86 69 24 50 -527 111 -40 -313 23 265 -224 -230 84 -51 -238
4960 -238 -23 109 -255 42 235 -164 -77 181 -62 -86 383 87 80 -97 289 -68 -257 241 -39 -228 26
4981 26 318 53 75 125 11 -53 119 133 -214 -70 166 -64 -37 309 191 -139 8 76 -30 -82 18 238 -330
5004 -330 86 56 2 244 365 -18 -83 29 -13 -79 153 184 -242 152 300 -31 136 142 -69 -344 306 -40 -304
5027 -304 147 96 10 -98 41 53 -143 -34 112 74 -44 24 -11 -142 0 182 -124 -151 149 -128 -85 60 196
5050 196 195 40 88 236 -138 -32 -44 105 173 244 38 -47 147 37 -142 104 17 11 -138 309 -17 -204 232
5073 232 76 -173 217 45 -70 -102 196 -10 -350 130 202 -85 44 42 -19 91 149 145 -210 49 -27 -117 43
5096 43 213 20 123 309 -60 -117 15 35 -171 98 -132 -130 -106 10 -59 -245 176 84 93 72 66 0 88 -164 85
5121 85 -19 -13 -67 -122 -182 -55 -165 -138 61 -245 -66 -20 -119 -149 -58 -55 -50 -156 -69 -90 -255 232 -97 -97 -241 103
5147 103 -5 39 182 77 -399 23 220 -183 -67 82 39 98 119 156 156 -326 381 -89 -267 333 -162 -76 98
5170 98 -42 7 -130 39 -90 -42 -164 -3 0 -304 239 -20 -137 185 -217 -116 241 -7 -76 40 71 33 -155
5193 -155 55 58 -256 105 61 134 208 168 -174 -60 -47 209 34 -22 -30 -154 -134 128 -17 -94 -29 -120 -145 224 113
5218 113 267 -293 307 181 -57 114 254 -19 -227 -20 -234 55 -80 252 -280 138 128 -81 -60 152 -135
5239 -135 69 -235 -185 -120 -40 123 52 27 356 -83 -38 -124 190 162 -32 178 -75 -329 121 104 -243 -277 185
5262 185 -132 -135 -123 -310 -197 -385 -66 26 -118 137 251 -200 104 12 -42 154 163 -434 0 -2 67 -203 -50 139
5286 139 -198 64 29 -74 -117 218 -120 -75 51 19 -63 -120 -54 -18 -33 5 0 -117 32 93 -68 -239 -147 182 35
5311 35 69 112 -40 38 79 -83 68 213 -41 -55 -26 143 49 -190 34 2 -425 51 30 93 42 -87 -31 8 -68
5336 -68 -107 -79 -223 6 -75 26 176 -57 -13 121 -231 169 -189 -84 -184 -36 220 135 97 182 194 -18 -6
5359 -6 -16 -139 -194 -188 3 -202 -254 93 -307 30 -66 -73 3 -35 -108 14 -129 163 50 -331 28 -143 -19 98
5383 98 -135 -136 68 42 46 -141 -25 -187 -94 92 -38 -247 -137 2 -35 2 259 -42 -45 -255 334 -48 -184 99
5407 99 -97 -118 -89 100 -299 151 -20 -92 -169 73 0 -95 -92 199 -384 76 75 -159 -48 126 127 36 3 -75 54
5432 54 -30 25 -165 -348 404 159 87 202 81 -100 -113 227 -141 -281 -120 39 -56 -304 159 -243 -109 -54
5454 -54 35 141 -234 154 -121 191 20 -46 -281 47 -48 91 -34 63 114 -185 226 -57 -113 139 157 -200 89
5477 89 323 117 -137 -53 -86 -158 -189 -27 49 2 -66 1 -28 40 -76 -82 -197 -37 2 -130 -84 122 -5 -120 240
5502 240 -28 -71 157 26 75 -128 144 -64 -180 -18 116 -240 120 34 -185 19 -154 22 1 6 -80 -28 -12
5525 -12 78 -40 -152 82 4 -132 53 50 112 3 210 -193 -3 69 95 -387 160 55 62 201 126 -123 -186 -137
5549 -137 93 -283 138 -73 129 -51 54 -25 50 70 -182 -53 108 -4 -141 -213 310 15 -11 -56 -193 307
5571 307 113 304 -158 -99 331 246 -313 104 103 0 10 -98 67 -20 20 135 -235 -160 54 -109 4 -56 -126
5594 -126 112 150 -28 36 311 -177 -29 -119 -12 168 -164 -12 50 -37 -133 74 36 205 30 -23 -62 105 -190
5617 -190 -81 37 -148 98 -104 -242 159 -212 -21 47 -252 -31 56 56 -213 73 -197 -164 -84 150 -60 -105
5639 -105 -132 7 -10 -128 -103 -81 100 64 3 -86 -26 150 -40 161 -203 66 123 -10 128 -119 319 172 -110
5662 -110 164 -134 -66 -364 64 -65 71 -53 83 -35 19 -105 -108 -43 -1 -93 86 -21 145 -103 144 -42
5684 -42 21 112 -72 -60 -81 146 -149 -41 -335 188 -29 127 104 326 21 -156 -47 -84 -42 -57 161 -70 -127
5707 -127 75 -86 -23 169 88 -271 184 174 -77 163 47 -203 -6 226 61 -329 -67 212 -44 -153 92
5728 92 -14 86 -82 -1 -29 -234 -201 -193 -64 -39 -95 -171 90 130 -244 90 16 -242 -146 150 56 -158 183 64
5752 64 -73 -192 -6 67 -210 156 -109 -9 92 -195 -13 -106 3 151 -105 68 26 -76 -43 85 9 -139
5774 -139 -97 41 -104 -26 121 164 -59 -67 -152 -92 50 -39 43 44 49 -160 -162 -25 -78 -79 26 -179 -33 -3 -170 -171 56
5801 56 -160 106 -110 -203 108 106 -207 77 -192 81 112 -82 -28 123 101 -88 210 81 212 65 156 13 73
5824 73 -124 92 165 146 -201 156 151 -210 -30 -67 -60 59 -156 -28 66 142 81 40 -276 -19 140 103 -87 -4 66
5849 66 -54 -189 -167 8 -358 -5 124 -35 -2 -42 -29 -159 52 -94 6 -15 3 -158 -80 -29 81 74 -10 266
5873 266 -26 -67 9 167 -26 -68 72 87 78 -18 -90 -103 287 196 -141 154 -81 20 -91 129 296 148 -280
5896 -280 169 0 -136 -123 45 -70 217 -81 -265 77 92 120 24 129 189 -232 144 32 -253 92 -6 -38
5918 -38 -6 125 85 3 -21 74 -121 80 -179 150 -284 145 -79 -107 -80 -68 51 0 -245 -48 78 -146 257
5941 257 75 -69 163 64 120 30 -41 -79 288 331 -165 -202 -72 -12 -240 81 -47 -149 73 75 -4 -171 -232 -134
5965 -134 -168 91 -18 52 131 -3 -5 143 -164 -64 185 118 60 -14 -132 94 -110 102 -35 106 -53 97 41
5988 41 186 130 -115 -112 -134 79 -191 -65 -135 136 -71 -76 -34 -125 -38 -168 -37 92 16 87 66 -30 -140 142 -197
6013 -197 214 -110 216 -24 -7 0 -6 -125 117 70 -68 -57 75 62 -72 -10 -114 -243 -147 -125 -142 226 -143 -124
6037 -124 45 -152 210 -127 -44 -234 45 310 -10 -4 295 21 -11 -59 114 97 107 187 193 -172 52 -182 -73
6060 -73 -114 9 122 -12 44 70 68 -169 92 65 162 60 -101 128 -176 -49 -52 32 -303 216 -98 188 272 -109
6084 -109 -16 281 -65 -220 -109 -158 -123 -91 -82 -112 30 154 79 -15 -7 247 -82 -118 -131 -79 -183 -211 -206 34 -283 115
6110 115 -1 334 -19 -243 -81 185 69 -66 -128 -104 114 -181 75 -246 -155 -74 -198 -1 71 21 -98 64
6132 64 170 101 17 35 98 -127 46 163 89 -3 47 217 -159 218 -180 -185 47 103 290 179 149 51 -48 -93 110
6157 110 -65 169 -131 -162 -116 127 146 -64 189 -45 175 93 297 -87 184 121 -198 -130 -80 132 -53 79
6179 79 -153 93 29 -305 -34 81 98 51 128 -13 116 -10 133 26 108 -154 -27 -42 -73 -12 6 -127 -39 196
6203 196 -49 -78 -23 59 -155 26 -46 10 -47 -67 -97 112 -116 -219 -137 -222 -14 6 -73 -246 5 -72 -115 0 24
6228 24 64 87 8 176 49 2 108 86 45 127 35 4 25 8 18 -75 -88 32 239 75 -52 -70 46 -144 75
6253 75 -266 71 147 199 91 -257 -3 227 -7 29 -30 58 149 112 -171 -46 196 80 -370 -28 -51 30 -14 -9
6277 -9 78 -300 97 -323 151 261 31 102 -34 121 -127 -11 16 33 19 -74 378 -49 -161 -20 129 -23 -118
6300 -118 -173 11 127 -81 297 112 56 -227 -100 17 -152 -30 72 -281 21 88 101 -64 110 7 -113
6321 -113 141 2 29 -71 -6 -33 10 -132 251 -21 252 -32 10 -167 -215 56 -17 82 89 -123 -146 184 172 -98
6345 -98 256 28 40 67 83 157 -99 -8 215 -158 149 85 -44 -221 -78 8 -164 245 -199 -69 141 132 72 -90
6369 -90 44 -10 -56 -10 95 128 109 167 -13 -109 130 112 -34 2 -41 -136 -61 91 -253 -42 -104 122 51 137 -83
6394 -83 -34 -76 24 21 213 66 52 -197 19 -76 -45 -40 -13 -135 -47 182 29 -30 68 2 211 -90 -20 129 -75
6419 -75 -11 102 -122 -5 81 -35 -63 -228 -174 81 158 -109 54 -87 18 -2 -169 21 -106 36 -38 -215 -147
6442 -147 -19 100 163 21 -139 -27 -168 -89 120 -11 122 -107 -100 35 39 -32 117 -174 19 -187 -93 -51 -76
6465 -76 -20 179 93 70 -105 267 32 3 125 -114 -67 151 78 166 48 82 -56 -29 266 -61 -44 -47 -64 83 62
6490 62 -69 236 15 221 295 -128 119 -90 73 60 7 56 71 19 37 63 -150 114 -23 20 8 -73 56 -172
6514 -172 35 108 -99 288 -91 39 -71 155 64 56 -191 117 -136 -129 177 16 -69 171 187 7 88 64 92 -153
6538 -153 -127 -78 118 181 -310 51 -14 -135 90 223 85 211 189 -136 89 34 310 196 -134 200 -79 14
6560 14 40 116 333 76 71 -67 -71 92 150 -147 158 -35 -18 29 4 -72 -191 205 -53 -51 108 41 -275 -148 -244
6585 -244 101 -92 121 -59 64 -101 -197 -222 -85 -36 87 -133 -30 -65 -25 233 -41 -157 175 179 -227 33
6607 33 60 70 63 -77 -59 37 78 -53 -18 116 125 -173 4 -252 20 69 24 -102 -56 -46 0 -67 39 141 30 110
6633 110 -319 130 51 43 -83 -341 19 68 178 -81 37 58 66 -77 -21 -60 100 159 -19 -50 37 -264 178 175 -50
6658 -50 38 69 256 47 37 127 150 99 73 -148 -55 -96 61 -85 -147 -82 -169 163 -64 -61 -213 -70 -136 -107 197 -88
6684 -88 76 -107 -22 82 -105 -52 57 -126 81 -8 64 162 34 182 -220 -99 8 -95 145 209 163 -98 -359
6707 -359 49 19 -64 -18 61 37 15 94 -97 -128 214 -310 21 -120 -135 -51 37 7 -224 167 -214 359 268 -22
6731 -22 101 -59 26 -143 -178 36 227 -164 103 -61 -71 -240 136 51 87 206 -7 209 -78 -15 -52 130 -84
6754 -84 23 -45 -38 -58 48 -31 67 174 -10 -20 18 42 19 194 -223 101 -180 23 -120 -87 51 75 3 30 202
6779 202 -117 -229 -87 -1 64 220 7 15 -285 47 -314 -35 -104 39 79 121 -117 145 71 -96 25 27 112 49
6803 49 -20 21 -200 6 -78 44 -27 288 277 -51 140 -49 -119 -99 90 -104 -89 -152 63 -26 180 -95 -45 -168
6827 -168 48 78 -56 -84 197 141 -36 105 68 -91 -176 154 78 -32 -193 -226 70 111 94 -106 -205 116 -7
6850 -7 8 -63 -220 -131 286 71 -32 273 238 30 120 -70 109 -165 142 -147 27 22 -192 74 -17 -274 -49
6873 -49 35 -171 -144 78 117 -70 68 -5 168 33 -60 -105 135 204 123 41 -31 -47 217 72 4 68 -33 51 25
6898 25 68 -28 190 -23 -146 86 -62 86 -18 -62 74 -5 -97 168 192 12 -97 -21 128 151 -34 46 23 122
6922 122 31 10 -44 -84 108 2 5 33 39 -87 -219 3 176 -43 -38 -27 64 152 29 13 116 252 -74 72 -16
6947 -16 23 -107 -254 69 -157 -92 261 -33 163 -282 -18 -99 135 -294 -59 216 62 -54 -110 10 303 8
6969 8 -80 355 -57 -23 85 -17 -44 -80 67 101 -87 -138 -209 150 33 -219 45 108 -6 -110 -33 109 -68 -36
6993 -36 33 14 89 -22 -225 -65 46 -36 125 -311 30 47 26 -170 86 -27 230 -172 85 -73 -129 -306 -76
7016 -76 542 82 232 83 4 271 86 -14 69 -12 -2 371 -65 -148 79 -30 -53 -52 -282 -39 56 15 -235 28
7040 28 46 -132 -120 -60 -171 -132 -67 177 -123 -237 -1 71 11 -94 187 -133 -144 115 -19 11 -207 70 -200
7063 -200 -79 -19 -63 279 41 -17 -16 153 -99 132 -145 -109 -69 35 -29 -47 142 -186 -53 -113 -10 -50 -21 -22 200
7088 200 -119 19 29 -193 77 -99 -208 0 77 -8 -86 -314 111 46 -39 201 145 -69 127 247 -103 178
7110 178 79 -66 123 -4 -140 -173 216 -53 -80 -34 159 42 104 -32 8 61 157 -29 19 242 192 -111 102
7133 102 -6 -89 -138 67 30 -251 -38 231 1 -229 86 -268 -73 141 -138 -325 68 -35 -116 161 -18
7154 -18 24 -221 -90 -145 -75 190 96 -23 222 -4 64 128 -171 35 147 150 -60 84 72 -70 91 110 -174 7
7178 7 17 23 -51 117 -135 54 -77 -87 53 -6 -52 21 -143 37 -22 25 -76 -3 114 -144 -336 -189 117 54 86
7203 86 178 -58 -31 -182 36 98 -145 21 -99 150 -51 -18 8 -6 -165 71 -107 147 119 22 64 214 -152
7226 -152 -19 -157 -3 -102 143 -32 -161 -21 -130 -3 -62 -80 165 -55 -60 65 49 -136 -142 291 -77 -166 136
7249 136 174 228 -100 104 198 -76 108 7 203 145 56 25 -217 282 16 -27 369 -41 219 213 -23 119 -62
7272 -62 -73 -66 135 5 -40 95 91 -161 184 9 -23 -89 -174 -165 36 -7 187 197 -104 100 -46 -96 331 -86 -29
7297 -29 -54 -6 181 -50 132 73 -109 37 229 -130 110 -71 -100 11 23 176 61 -17 -24 139 -137 139 191
7320 191 -7 190 277 240 -37 -54 104 -33 70 -89 -15 47 -95 289 -17 -73 -54 -120 -115 21 37 55 69 13 -151
7345 -151 96 68 186 -130 40 50 -135 -16 89 -161 -11 -146 64 98 134 -61 124 -122 51 2 -3 -29 -276
7368 -276 174 72 145 -42 102 4 -270 -105 0 58 -250 0 -200 -145 -6 -94 50 -41 -18 55 112 -145 -47
7391 -47 3 132 76 -153 48 47 -6 -46 19 -20 -143 -282 5 52 137 -142 5 259 227 -62 -15 -171 -9 -139
7415 -139 31 256 -120 61 -91 47 -243 73 -209 -125 30 -206 5 141 -143 -30 -57 -16 70 -248 -201 67
7437 67 189 51 -79 -21 -23 62 -51 -86 -177 51 -37 48 125 -207 17 45 -213 -47 6 -59 -69 -276 90 -71 -38
7462 -38 -144 141 4 112 58 -35 2 39 -42 -27 79 33 -150 -134 -59 -90 69 111 0 99 101 27 28 138 161 -353
7488 -353 191 100 33 -38 9 -3 39 -128 -189 -183 -86 102 -159 6 -160 63 -156 199 72 -75 55 279 -314
7511 -314 -85 -17 -77 272 -122 -4 -36 123 67 43 -40 -24 55 77 -59 56 -68 -72 165 -122 41 -3 -20 45 185
7536 185 150 -48 -120 91 42 -158 -210 -36 207 129 -105 160 15 -103 32 -104 245 -19 -154 28 12 81
7558 81 -22 117 60 204 70 -79 6 99 -155 64 -360 -14 -30 41 -230 -112 -154 -24 102 139 -42 -3 41
7581 41 47 49 -186 48 44 141 120 36 -95 -79 80 -64 6 -49 50 47 -62 -111 85 -44 -11 -258 -47 -54 262 167 -23
7608 -23 -36 146 -16 -3 -176 102 171 -210 214 96 96 20 -5 -111 106 66 -100 34 -49 -104 135 171 -51 -23
7632 -23 -218 79 233 190 53 -37 -140 -33 -58 -181 -181 52 -115 84 13 -242 -139 201 104 66 -41 185 -45
7655 -45 -64 24 107 268 -72 57 45 53 101 -117 164 89 103 -32 -19 -35 91 32 158 -2 -70 40 99 -143 82
7680 82 -105 146 72 -56 -284 90 -12 -287 143 -66 94 156 -22 194 -178 106 88 -94 298 -192 149
7701 149 80 227 -101 11 -100 -53 -61 -233 94 215 -212 -28 -162 106 70 -180 -144 29 -184 -119 -108 132 -33
7724 -33 -39 231 28 -110 -65 243 225 76 23 98 146 69 59 128 -69 133 16 -33 -112 -84 248 -9 -48 179 96
7749 96 6 -60 -185 -180 149 -48 -33 85 -51 -33 -149 -4 -156 50 72 -97 145 -155 -311 104 194 -216 113
7772 113 78 -115 -63 121 -328 32 -85 -20 -132 -173 101 202 -8 236 117 -129 15 62 35 -42 57 79 -3
7795 -3 -115 117 23 -4 -63 -132 -102 -122 -185 -12 -98 -150 132 -228 186 -37 116 -85 74 163 22 -291 118 27
7819 27 11 -65 28 6 13 -376 57 -8 97 -139 44 237 -23 -86 -4 -62 -5 12 -193 -34 -56 44 118 167 -186
7844 -186 76 119 -47 -180 -307 -4 321 -123 -167 -60 -29 89 -277 -43 116 -55 -27 -258 -132 -190 -26 130
7866 130 15 105 -6 86 -115 68 -56 91 -32 -17 -12 -185 -7 -222 -49 -128 125 -213 111 -218 222 -200
7888 -200 76 -176 -35 53 260 -34 154 60 29 42 -107 -84 19 84 -73 70 46 -193 -149 65 34 -35 266
7911 266 -38 130 -208 238 -16 105 164 -270 250 -230 58 134 -11 112 -335 238 29 -26 -33 100 32 -71
7933 -71 -36 25 95 -88 138 99 -14 -31 -185 -83 204 222 10 92 115 -3 315 -152 87 109 -84 -136 -92 -35
7957 -35 305 -20 -70 -31 26 -47 63 21 -339 32 -14 72 -63 -8 357 -123 -25 72 -153 183 -213 -148 -120 277
7981 277 -215 -92 -28 195 -53 128 54 189 -296 -244 -233 -143 -197 66 -310 100 -41 170 -148 320 -114 115
8003 115 260 14 215 100 131 -82 85 110 -43 -103 -78 207 2 -154 164 -72 99 23 -81 -16 -47 1 -259
8026 -259 90 84 -7 -117 113 321 -67 83 23 131 82 70 17 -71 -104 13 69 23 96 5 137 -195 41 200
8050 200 -135 78 26 13 -3 11 -24 207 -101 39 287 -140 163 104 103 -114 -189 95 38 -120 305 -103 49
8073 49 207 -94 70 -11 -296 -75 130 -140 -18 183 -163 -106 -104 -51 -53 321 -205 -55 -340 117 -107 -33 -77
8096 -77 -55 304 72 210 3 28 41 209 94 100 -507 62 -350 124 -83 106 -157 49 94 152 -129 -97 195
8119 195 -54 100 145 67 103 88 148 -70 -157 -38 -104 -14 -292 -93 -55 -139 -41 -61 77 -131 -35 -124 21 -79 -134
8144 -134 109 -62 -154 -175 -16 -234 4 228 -57 -79 135 47 34 -106 202 23 -52 60 -136 20 226 72
8166 72 -223 2 -75 -90 -142 -225 -73 96 203 -121 -2 -162 -3 126 55 301 -40 -151 -105 213 118 -117 -81
8189 -81 -201 -109
8191a09
##END NTUPLES=NMR FID
##END=
