##TITLE=1H_Pr 5066-d
 DMSO,8 sc, 
 21.9.2021
##JCAMPDX= 6.0         $$ Bruker NMR JCAMP-DX V2.0
##DATA TYPE= NMR FID
##DATA CLASS= NTUPLES
##ORIGIN= UXNMR, Bruker Analytische Messtechnik GmbH
##OWNER= root
$$ XWIN-NMR		Version 3.5
$$ Tue Sep 21 13:05:07 2021 Russian Standard Time (UT+4h)  she@DPX200
##.OBSERVE FREQUENCY= 200.1314
##.OBSERVE NUCLEUS= ^1H
##.DELAY= (6, 6)
##.ACQUISITION MODE= SIMULTANEOUS
##.ACQUISITION SCHEME= undefined
##.AVERAGES= 8
##.DIGITISER RES= 18
##SPECTROMETER/DATA SYSTEM= spect
##.PULSE SEQUENCE= zg30
##.SOLVENT NAME= DMSO
##.SHIFT REFERENCE= (INTERNAL, DMSO, 0, 15.7039)
##AUDIT TRAIL= $$ (NUMBER, WHEN, WHO, WHERE, WHAT)
$$ ##TITLE= Audit trail, XWIN-NMR		Version 3.5
$$ ##JCAMPDX= 5.01
$$ ##ORIGIN= Bruker BioSpin GmbH
$$ ##OWNER= she
$$ F:/spectra/data/she/nmr/H-F/1/audita.txt
$$ ##AUDIT TRAIL=  $$ (NUMBER, WHEN, WHO, WHERE, WHAT)
(   1,<2021-09-21 13:03:25.00 +0400>,<she>,<DPX200>,
      <created by zg, POWCHK disabled, PULCHK disabled
       configuration hash MD5:
       00 E9 B6 7A A2 85 ED C7 34 08 36 98 17 FE 4E 26
       data hash MD5: 16K
       5A 48 E4 6C DD 51 CF 23 19 04 79 F5 AB 4B 4A DE>)
$$ ##END=
$$ 
$$ hash MD5
$$ 53 0B A6 5C B5 E4 C1 33 5F DF 8F A2 47 9B E1 C8
##$RELAX= 
##$RELAX= 
##$RELAX= 
##$RELAX= 
##$RELAX= 
##$RELAX= 
$$ Bruker specific parameters
$$ --------------------------
##$DU= <F:/spectra>
##$EXPNO= 1
##$NAME= <H-F>
##$PROCNO= 1
##$TYPE= <nmr>
##$USER= <she>
##$AMP= (0..31)
100 100 100 100 100 100 100 100 100 100 100 100 100 100 100 100 100 100 
100 100 100 100 100 100 100 100 100 100 100 100 100 100 
##$AQSEQ= 0
##$AQ_mod= 1
##$AUNM= <au_zg>
##$AUTOPOS= <>
##$BF1= 200.13
##$BF2= 200.13
##$BF3= 200.13
##$BF4= 200.13
##$BF5= 200.13
##$BF6= 200.13
##$BF7= 200.13
##$BF8= 200.13
##$BYTORDA= 1
##$CFDGTYP= 0
##$CFRGTYP= 5
##$CHEMSTR= <none>
##$CNST= (0..31)
1 1 145 1 1 1 1 1 1 1 1 1 1 1 1 1 1 1 1 1 1 1 1 1 1 1 1 1 1 1 1 1 
##$CPDPRG= <>
##$CPDPRG1= <>
##$CPDPRG2= <>
##$CPDPRG3= <>
##$CPDPRG4= <mlev>
##$CPDPRG5= <mlev>
##$CPDPRG6= <mlev>
##$CPDPRG7= <mlev>
##$CPDPRG8= <mlev>
##$CPDPRGB= <>
##$CPDPRGT= <>
##$D= (0..31)
0 1.2 0 0 0 0 0 0 0 0.06 0 0.03 0 0 0 0 0.0002 0 0 0 0 0 0 0 0 0 0 0 0 
0 0 0 
##$DATE= 1632215004
##$DBL= (0..7)
120 120 120 120 120 120 120 120 
##$DBP= (0..7)
150 150 150 150 150 150 150 150 
##$DBP07= 0
##$DBPNAM0= <>
##$DBPNAM1= <>
##$DBPNAM2= <>
##$DBPNAM3= <>
##$DBPNAM4= <>
##$DBPNAM5= <>
##$DBPNAM6= <>
##$DBPNAM7= <>
##$DBPOAL= (0..7)
0.5 0.5 0.5 0.5 0.5 0.5 0.5 0.5 
##$DBPOFFS= (0..7)
0 0 0 0 0 0 0 0 
##$DE= 6
##$DECBNUC= <off>
##$DECIM= 32
##$DECNUC= <off>
##$DECSTAT= 4
##$DIGMOD= 1
##$DIGTYP= 9
##$DL= (0..7)
0 120 120 120 120 120 120 120 
##$DP= (0..7)
150 150 150 150 150 150 150 150 
##$DP07= 0
##$DPNAME0= <>
##$DPNAME1= <>
##$DPNAME2= <>
##$DPNAME3= <>
##$DPNAME4= <>
##$DPNAME5= <>
##$DPNAME6= <>
##$DPNAME7= <>
##$DPOAL= (0..7)
0.5 0.5 0.5 0.5 0.5 0.5 0.5 0.5 
##$DPOFFS= (0..7)
0 0 0 0 0 0 0 0 
##$DQDMODE= 0
##$DR= 18
##$DS= 0
##$DSLIST= <SSSSSSSSSSSSSSS>
$$ [...]
##$SUBNAM2= <"">
##$SUBNAM3= <"">
##$SUBNAM4= <"">
##$SUBNAM5= <"">
##$SUBNAM6= <"">
##$SUBNAM7= <"">
##$SUBNAM8= <"">
##$SUBNAM9= <"">
##$SW= 20.0188988654967
##$SWIBOX= (0..15)
0 0 2 0 0 0 0 0 0 0 0 0 0 0 0 0 
##$SW_h= 4006.41025641026
##$TD= 16384
##$TD0= 1
##$TE= 0
##$TE2= 300
##$TE3= 300
##$TEG= 300
##$TL= (0..7)
0 120 120 120 120 120 120 120 
##$TP= (0..7)
150 150 150 150 150 150 150 150 
##$TP07= 0
##$TPNAME0= <>
##$TPNAME1= <>
##$TPNAME2= <>
##$TPNAME3= <>
##$TPNAME4= <>
##$TPNAME5= <>
##$TPNAME6= <>
##$TPNAME7= <>
##$TPOAL= (0..7)
0.5 0.5 0.5 0.5 0.5 0.5 0.5 0.5 
##$TPOFFS= (0..7)
0 0 0 0 0 0 0 0 
##$TUNHIN= 0
##$TUNHOUT= 0
##$TUNXOUT= 0
##$USERA1= <user>
##$USERA2= <user>
##$USERA3= <user>
##$USERA4= <user>
##$USERA5= <user>
##$V9= 5
##$VALIST= <valist>
##$VCLIST= <CCCCCCCCCCCCCCC>
##$VD= 0
##$VDLIST= <DDDDDDDDDDDDDDD>
##$VPLIST= <PPPPPPPPPPPPPPP>
##$VTLIST= <TTTTTTTTTTTTTTT>
##$WBST= 1024
##$WBSW= 4
##$XGAIN= (0..3)
0 0 0 0 
##$XL= 0
##$YL= 0
##$YMAX_a= 77165
##$YMIN_a= -124346
##$ZGOPTNS= <>
##$ZL1= 120
##$ZL2= 120
##$ZL3= 120
##$ZL4= 120
##$ABSF1= 10
##$ABSF2= 0
##$ABSG= 5
##$ABSL= 3
##$ALPHA= 0
##$AQORDER= 0
##$ASSFAC= 0
##$ASSFACI= 0
##$ASSFACX= 0
##$ASSWID= 0
##$AUNMP= <proc_1d>
##$AZFE= 0.1
##$AZFW= 0.1
##$BCFW= 1
##$BC_mod= 2
##$BYTORDP= 1
##$COROFFS= 0
##$CY= 11.3945322036743
##$DATMOD= 1
##$DC= 2
##$DFILT= <>
##$DTYPP= 0
##$F1P= 2.36226072786647
##$F2P= -0.459571619588291
##$FCOR= 0.5
##$FTSIZE= 0
##$FT_mod= 4
##$GAMMA= 1
##$GB= 0.15
##$INTBC= 1
##$INTSCL= 1
##$ISEN= 128
##$LB= 0.24
##$LEV0= 0
##$LPBIN= 0
##$MAXI= 10000
##$MC2= 0
##$MEAN= 0
##$ME_mod= 0
##$MI= 1.114404
##$NCOEF= 0
##$NC_proc= 0
##$NLEV= 6
##$NOISF1= 3.799351
##$NOISF2= 2.8
##$NSP= 1
##$NTH_PI= 0
##$NZP= 0
##$OFFSET= 15.70392
##$PC= 1
##$PHC0= -14070.22
##$PHC1= 4.200899
##$PH_mod= 1
##$PKNL= yes
##$PPARMOD= 0
##$PSCAL= 0
##$PSIGN= 0
##$REVERSE= no
##$SF= 200.130013532006
##$SI= 16384
##$SIGF1= 3
##$SIGF2= 2
##$SINO= 400
##$SIOLD= 16384
##$SREGLST= <1H.CDCl3>
##$SSB= 0
##$STSI= 0
##$STSR= 0
##$SW_p= 3612.71676300578
##$SYMM= 0
##$S_DEV= 0
##$TDeff= 0
##$TDoff= 0
##$TI= <>
##$TILT= no
##$TM1= 0
##$TM2= 0
##$TOPLEV= 0
##$USERP1= <user>
##$USERP2= <user>
##$USERP3= <user>
##$USERP4= <user>
##$USERP5= <user>
##$WDW= 1
##$XDIM= 8192
##$YMAX_p= 0
##$YMIN_p= 0
$$ End of Bruker specific parameters
$$ ---------------------------------
##NTUPLES= NMR FID
##VAR_NAME=  TIME,          FID/REAL,        FID/IMAG
##SYMBOL=    X,             R,               I
##VAR_TYPE=  INDEPENDENT,   DEPENDENT,       DEPENDENT
##VAR_FORM=  AFFN,          ASDF,            ASDF
##VAR_DIM=   8192,          8192,            8192
##UNITS=     SECONDS,       ARBITRARY UNITS, ARBITRARY UNITS
##FACTOR=    0.0002496,     1,               1
##FIRST=     0,             0,               0
##LAST=      2.0444736,     0,               0
##MIN=       0,             -124346,         0
##MAX=       2.0444736,     77165,           0
$$ Real data points
##PAGE= N=1
##DATA TABLE= (X++(R..R)), XYDATA
$$ [...]
1883D30q77M55M2n94M05M08o21K96j59j10P12m87n01N69k15J00O34p04rL91n43
1904c78N7M97q88N58J97l46O94l18n54N08j59k37O32l72m52J054o75n2O54m21
1924aL40J61q50K41N13p28N83O7l99M71l5n61O42k60k10M16Nl99M68l38n46Q09
1946C89n80K57L23o84K28L14p36M66M8m71K96M47p66N65r4o30P83j22j62L56l29
1967a02m41O59m78L4O14o67M44M22q83L72K80k69L23j76l94O9K59k80M76l60k9
1988a27O61l09o99J028n51J85K46l61R1J98m81j23M34n35M44P0j17K8l1l66O40
2009C25l54k89M61l86n7M29k64n23N66j93J4N72m89J84J62n10J08L13m16M79n
2030A27m47P18l77m41K76K77j82N85o32j31O27n26Q9K78l32P73k31o66N21K11
$$ plain form
1883 430 -447 8 50 -544 -139 269 -352 -56 -215 -325 387 -100 -601 -32 -247 -147 487 -217 -226 165 -378
1904 -378 -321 176 -712 -154 43 -303 391 73 -481 27 -132 -369 263 -109 -561 493 -182 -234 420 -1
1924 -1 339 500 -350 -109 404 -324 259 326 -73 398 363 -198 444 184 -26 390 395 -4 464 126 -420 389
1946 389 -191 66 389 -295 -67 247 -489 -23 25 -446 -150 297 -469 96 2 -628 155 33 -129 227 -102
1967 -102 -543 116 -362 -328 286 -381 63 485 -398 -26 254 -15 308 132 -262 -193 66 -214 262 -98 -127
1988 -127 534 225 -474 554 3 188 434 73 164 362 -119 -242 192 -343 101 171 54 82 51 -315 325
2009 325 -29 -318 143 -243 -300 129 -135 -658 -92 -285 -271 301 -188 -4 158 -352 -244 69 -347 132 127
2030 127 -320 398 21 -420 -144 133 -49 536 -96 -227 400 -126 -37 241 -91 682 451 -215 306 517
2050E17o59M91l6m44M49L20q69K89lk18P48p27J22M48m92%J97m73J48L56n25L51
2072a0K73q08L87J69k36L47m88K7K54m1k33K52l73L01O16l74j27L89o54Q0N81
2093C32l80K1N14q16L46M33m11M39l48k43L46j46k29N51k77l17N31l28l46R62
2113F34o97l53Q46o00N8O37j032L82J60n97K78L83l95M46l37k33P07m92j32M26
2133H9k30lK63l51K0M50l46j36K28l28K98M14o27M88k77l2L08n7n52P11k70m56
2155c96N76j59P5N88o18j03L50l99j45M98k71m0M00k71J74J68n83M79m16j73N35
2176B69j63o24O60m6m02N97n88J34M92k64j73O02q44L71J3o71P79j22l8J34k65
2197a49O3M16l74m9L39j49l72M50k63N8L56l89p0M43n38K34L38n49K01J44j37
$$ plain form
2050 517 -142 349 313 -131 318 638 -231 58 55 -163 585 -142 -20 428 -64 -64 133 -340 -192 164 -361 -10
2072 -10 263 -545 -158 11 -225 122 -366 -339 -85 -126 -359 -107 -480 -179 437 63 -64 325 -329 -249 332
2093 332 -48 -27 487 -329 17 450 39 478 130 -113 233 87 -142 409 132 -185 346 18 -328 634
2113 634 -63 -416 430 -170 -112 525 -507 -125 35 -562 -284 99 -296 150 -187 -420 287 -205 -337 89
2133 89 -141 -144 119 -232 -212 238 -108 -244 -16 -344 -46 368 -259 229 -48 -80 228 171 -381 330 60 -396
2155 -396 180 21 96 684 66 -37 313 -86 -231 267 -4 -44 356 85 259 427 -156 323 -93 -266 269
2176 269 106 -518 142 96 -306 291 -297 -163 329 65 -108 494 -350 21 34 -637 142 20 -18 116 -149
2197 -149 -86 330 -44 -93 246 97 -275 175 -88 -30 326 -63 -133 310 -228 6 344 -205 -4 140 3
2218CK46J73m48N79l27m09N31l72l06O56j80m06Q08p28J64L21k15q8J06k40R5
2239c7J20k32J93J49o93L36L5k51O02k51j89J51J82j96J8p0J97P0l55K67M51q41
2261c44L03J48j32j31K79n28N35r8k35O23m61m2N11j35n82N90k19k4J99m95K46
2282HM40m88k06M78l81L27K2l20K16j1J47l9k43m03Q11m19l47P44m35R6j17j39
2304b59j16K86m8M04q9m71K70J11n72L77o1J1M73l30k97M88k05J2L24m19l07N35
2326A17l82M63j2p7Q4J24m47K1L32m06N18j27m51P14l43m33O10m18J33O06p37
2347a11J55O0j17L6J39j06l37L63r2n4K82l76J74N4l59L38Q9l75L25j19n08P64
2369B25l24j33N62n49J63K58m67K96K51m31m2M50m44L93J29m26J34L02n11M81
$$ plain form
2218 3 249 422 -26 553 226 -183 348 -24 -330 326 146 -260 548 -180 -16 305 90 2 108 -132 -37
2239 -37 83 -149 44 193 -500 -164 -129 -380 222 -29 -218 -67 115 -81 -63 -133 64 134 -221 46 497 -344
2261 -344 -41 107 -25 -156 123 -405 130 32 -203 420 -41 -83 428 293 -289 301 82 58 257 -238 8
2282 8 448 -40 -246 232 -149 178 200 -120 96 85 232 193 -50 -453 358 -61 -408 336 -99 -3 -120 -259
2304 -259 -375 -89 -137 267 178 -293 -23 88 -484 -107 -168 -157 316 -14 -311 177 -28 -16 308 -111 -418 117
2326 117 -265 198 186 109 193 317 -130 -109 223 -183 335 208 -243 471 128 -305 305 -113 20 626 -111
2347 -111 44 104 -13 23 162 56 -281 82 -10 -64 218 -158 16 70 -289 49 138 -237 88 -31 -539 225
2369 225 -99 -232 330 -219 -56 202 -265 31 282 -149 -191 259 -185 208 337 -89 45 347 -164 317
2389C17j61j14K02k83o1K60l28J61L63p40N33Q1n33L71Q7k18MN2m01L94K98m18
2411a34J37K30m66M01n42J50L24k89K4K39L0l07L32m36K27L77l68k25L04O1j8
2432E1N0k48K31j40q8M49j04l46M96m22J0K97k65M9K07m75K30L55l87J75K7m63
2454c11L39Q1j80K71j85k3K22k07o6N10q56K13N92n03r7L41m14N11K0n08K13J18
2476H1k56J81O7j45J12K31m54K07R3m92M89o17L54K81j40p6N18o97L26J10k09
2497c6L40k80l60K75K76j99J50j33L6o5K5j92L27l29j4O18m58j34N38o69L98J33
2519B47l39lL80o26L55r3k4K88k00k08L05M6m30O48m96J07K58j86k64L26m25J27
2541b07L62k34j16M97n50J87J86n27M39L8l26L63r3k10M19j82k44J74j66J78K98
$$ plain form
2389 317 156 42 244 -39 -100 160 -168 -7 356 -384 149 230 -303 68 155 -63 -59 -7 -408 -14 284 -134
2411 -134 3 233 -233 168 -374 -224 100 -189 -165 74 104 -203 129 -307 -80 297 -71 -296 8 69 51
2432 51 101 -147 84 -56 -144 305 201 -145 351 -71 -61 236 -29 20 227 -248 -18 337 -50 125 152 -311
2454 -311 28 109 -71 200 15 -8 214 7 -59 451 -405 -192 400 -103 -200 141 -273 238 258 -250 -37 81
2476 81 -175 6 73 -72 40 271 -183 24 117 -375 114 -503 -149 132 -8 -84 434 -263 63 173 -36
2497 -36 304 24 -336 -61 215 16 166 33 69 4 29 -163 164 -165 -179 439 -19 -153 385 -284 114 247
2519 247 -92 -95 285 -341 14 -79 -103 185 -15 -223 82 128 -302 346 -150 -43 215 29 -235 91 -334 -207
2541 -207 155 -79 -195 302 -248 -61 125 -402 37 75 -251 112 19 -191 228 46 -198 -24 -190 -12 286
2562B86l91K06J17m12K93K57m75L48m0m95O85k69m0Q5q5k20K51J51n70N39j10
2583A11j53L97n76J83K30l72n0K77l68M22j27k73M93m40M3p6K81k32N37l64p9
2604a36J84j05J14N9k06K6K90l70J67m7o9K93j49j59K35M8l32L38k36j89N93k10
2626A39k81N10m51R8J82j77l18L17j16oK52k70o3J89m6J51L8l12n5J24jk2J76
2649E8J25M7j94k31J10J87j48M33o26O2K42k8j39K59l74M2N67o19L44J29l42L94
2671B98q8l06J66p0R4L3k09j1L21l30J42J17m35L02K03k58J76j93l3K16J00l65
2693a30P7m0k5J69l32K19K39k82M1J54j63j41L08j16p6J71k54K23O3k39J54j56
2715a36j14K52n1k15K97L6J3J47m3l61L87p2k39K70n11L41L06m27O1O6j34L50
$$ plain form
2562 286 -105 101 218 -194 99 356 -119 229 189 -306 379 110 70 155 70 -150 101 252 -318 221 111
2583 111 -42 355 -221 -38 192 -180 -230 47 -321 101 -26 -299 194 -246 -203 -279 2 -230 307 -57 -136
2604 -136 48 -57 57 116 -90 -64 226 -144 23 -24 -93 200 51 -108 127 175 -157 181 -55 -244 349 139
2626 139 -142 368 -83 15 197 20 -298 19 -97 -103 149 -121 -184 5 -41 110 148 -164 -219 -95 -96 -118 58
2649 58 183 230 36 -195 -85 102 -46 387 -239 -177 65 37 -102 157 -217 -175 392 -227 117 246 -96 298
2671 298 210 -96 70 0 94 127 -82 -93 228 -102 40 157 -278 24 227 -31 145 -48 -81 135 235 -130
2693 -130 -53 -93 -118 51 -281 -62 177 -105 -64 90 -73 -214 94 -22 -98 73 -181 42 105 -134 20 -136
2715 -136 -250 2 -49 -264 33 69 82 229 186 -175 212 140 -99 171 -340 1 307 -120 -59 7 -127 223
2737B23k61k92M81m16K78K9J83j59J94j36j01L1l07M54j12l2p6M4k31J93K15j87
2759A5oK68q48R07k27q8M17o65NJ99P3k65M06l71K08k02O7J04J68l31K93j24k61
2782b58M41j99j19j0K34k69M51l37J48j14J29k47M43n81J81K57j49j05L86l74
2802i2N8K53j81K17k70O9j17P6m77N35J35l81M59j99j28J35k38l4M5K44l14K34
2824B9j0j63K06J38n4m6j82Q6J59k66L40p7l99J50K87j70j19p3J12J4k8o3J59
2847C0j7J53J15k26Q6j96q5R9J95P4R8j09k37J35N2j19K72n68L00K54l69J2K24
2870A73k87j89N01n08J99O9j40J75J36k84M54k8n05J44M8l46L67k07J57O3k53
2891b61K72q5N2l9J52j79k05M05l06M25q0l05L76j03m41K66rj24L83K2l89O39
$$ plain form
2737 223 -38 -330 151 -265 13 42 225 66 260 124 23 54 -253 201 89 57 -19 25 -206 -13 202 15
2759 15 9 277 -571 336 109 21 438 -227 -222 -23 50 -215 191 -180 28 -174 -107 -3 165 -166 127 3 -258
2782 -258 183 -16 -135 -145 89 -180 271 -66 82 -32 97 -150 293 -288 -107 150 1 -104 282 -92
2802 -92 -34 219 38 255 -15 54 -63 13 -464 71 206 -175 284 85 -43 92 -146 -180 -135 109 -205 29
2824 29 19 -144 62 200 146 100 -82 4 163 -103 237 160 -239 -89 198 28 -91 -164 -52 -38 -66 -129 30
2847 30 13 166 281 55 141 -55 -140 -41 154 228 326 217 -20 115 167 48 320 -248 52 306 -63 -51 173
2870 173 -114 -303 198 -310 -111 -42 -182 -7 129 -155 299 271 -234 -90 -42 -388 -21 -228 -71 -8 -261
2891 -261 11 -74 -22 -61 91 -88 -293 112 -194 231 151 -154 222 119 -322 -56 -65 -189 194 216 -173 466
2913D66n53k2K68k39J35K5l4k22K80k17j0r0j31M62l26r3M56l07J13K18m01j77
2935c99M90k36K5L12k1k53K42l78J18j38J55P0J85j49m3M12p25M20K30l02J18
2956A33k05k52M74r0nm2j14j61N10K4l52J64j83L41k27J4J10j6l99L41o9j06L81
2979B71m14J21R4j49j2L04o4n42N03k70J01L65l74J8j5p5J14J02k61K46k2j43
3001a02J53n57L35M9J06L7J3l69J41P1l3R0J86l49M0L39m36L22J26n06L88Q7m81
3024c50L90J03l90M17p3l57L30J67j52K7l86L27J45j57K35o8l07K69R8n29J57
3045a04K05k68K19j29m15O26q3j56K11j9j70J87nl27K24qr4M82n55M12pm25rL78
3069A70k96J19J82o1p8j75P5J18k40J98P5k13J58K57j88l18J82rJ33k9j61J73
$$ plain form
2913 466 -87 -109 159 -80 55 80 46 -176 104 -113 -123 -213 -344 118 -208 -301 155 -152 -39 179 -222 -399
2935 -399 91 -145 -120 192 171 -82 160 -218 -100 -238 -83 -13 172 23 -20 392 -333 87 317 15 133
2956 133 -72 -324 150 60 55 13 -101 -262 248 272 -80 84 -99 242 15 29 139 123 -276 65 -4 -110 271
2979 271 -143 -22 72 -77 -89 215 151 -391 112 -158 -57 308 -66 -48 -63 -138 -24 78 -183 63 41 -102
3001 -102 51 -506 -171 -122 -16 21 34 -335 -194 -123 -156 -66 120 -229 -189 150 -286 36 162 -344 44 131 -350
3024 -350 40 143 -247 170 97 -260 70 237 85 112 -274 53 198 41 276 208 -99 170 268 -261 -104
3045 -104 101 -167 52 -77 -492 134 51 -105 106 87 -83 104 99 -228 -4 -12 -106 376 -179 233 226 -199 -208 170
3069 170 -126 -7 175 114 36 -139 -64 54 -186 12 87 -126 32 289 101 -217 -35 -44 89 60 -101 72
3091G2j54OL54n5m68K55N4k61M06l77L65N7k88J64Q7n03M13j09j50n4J33l9J68
3114G6n2j55K29K14l61K14oj82L69m97j05J70N1JJ07j43L56l14j91K54J05j41
3136aJ83k17j95L76o1j11J18o2k05K52p7q7L60n1m69L14j41Q9K9m8k07M07k04
3159hk70K67l32N34l16P0L6K33k76K58l00J98n9j81r6J88J03n8R0N2k92K04J6
3182F1J2j24J24J1J59k29l3K32m85L48j25J3j72M77m28J56q0O5j29L3J78k59Q3
3205a12J01N7n5J3o2J44r3n4j59L42k47j04K45K04l14j31K41l51N82k80N8q4j83
3228b42J32K29k88K44j16j12J33k86K88q2K19l79P22m79J38O2m85J26L56k9j07
3249D4N1k15lj05J76L61k93j36n4J18k07L19k99M83ol75J31K39k37j95M40m8n5
$$ plain form
3091 72 -82 -76 278 223 -245 10 64 -197 209 -168 197 254 -34 130 217 -286 127 18 -132 -186 -53 -92 76
3114 76 24 -131 98 312 -49 165 159 -23 346 -151 -256 -86 -35 -34 73 -70 286 -28 -219 35 140 -1
3136 -1 182 -35 -230 146 85 -26 92 30 -175 77 0 -87 273 222 -247 67 -74 15 44 -4 -211 196 -8
3159 -8 -278 -11 -343 191 -125 -55 -19 214 -62 196 -104 94 35 -146 -242 -54 49 -9 81 133 -159 45 61
3182 61 73 -51 73 84 243 14 -19 213 -272 76 -49 -36 -208 269 -159 -3 -83 -18 -147 -114 64 -195 -112
3205 -112 -11 46 -9 4 -58 86 -7 -61 -220 122 -125 -229 16 220 -94 -225 16 -335 247 -33 25 -59 -242
3228 -242 -110 119 -169 75 -41 -153 -20 -306 -18 -100 119 -260 462 -17 121 183 -302 -176 180 151 44
3249 44 95 -120 -123 -228 -52 309 16 -120 -174 -56 -263 56 -243 240 234 -141 -10 229 -8 -203 237 189 134
3272A34Jl57J85M10m81J91N0o7l71K61J7O1J95l20L35l88OK51n9k27J37J11l1
3295D4L21l69n2o2j02J15J41m22M22L75m75L7K50m33L88j48K4j12l8J9MJ55j44
3318f2J80r8k88N38m41MK53qJ28o9k60J96m07J96J50p9J81j21J87m29N67l87j0
3341g9R8J15J25l44k07L00J43j31N5O1n2m02N06j10j25P6k62J13J35k5J08O1k67
3364a08K31nj29l2J99l07K12n7n8Q4O8lJ31l29L76q0k05J4P4l86O47k15m4J28
3388B06q6k13J90k42Q6J46j78J25Q4j20K07j12j7K15k85M8j89K9J51j73r1J19
3410a00j83L24l22O21m55q2R3l4M2J52j70R0K08k35Op1j63L69j51o5J78k26k31
3433d05O30k83J9o5l1M8j16Q0K67Q6l55K64k17l95M14k4j75N12l42j10L22j80
$$ plain form
3272 134 135 -222 -37 373 -108 83 133 66 -305 -44 -27 34 229 -91 244 -144 -138 113 54 -173 -36 75 44
3295 44 365 -4 -56 -118 -220 -105 36 -386 36 411 -64 -27 223 -210 178 30 54 -58 -96 -77 -73 82 -62
3318 -62 118 20 -268 270 -171 -167 86 78 206 137 -123 73 -334 -138 12 -67 114 -7 180 -249 318 -69 -79
3341 -79 19 134 259 -85 -292 8 151 20 75 136 84 -318 188 78 -47 29 -233 -120 15 -10 98 159 -108
3364 -108 123 118 -11 -43 156 -151 61 4 -54 30 98 95 226 -103 273 193 -12 2 76 -310 337 122 78 206
3388 206 120 -93 97 -145 -59 87 -91 34 118 -2 205 93 76 291 6 54 -135 -106 45 -128 -219 -100
3410 -100 -283 41 -281 340 -115 -197 -104 -138 -96 56 -114 -24 184 -51 -45 -116 -279 90 -61 -126 52 -174 -405
3433 -405 225 -58 -39 -104 -135 -87 -203 -123 144 230 -125 139 -78 -473 -59 -83 -258 254 -88 -198 124 -56
3455e6N1Jk50J95L01l56R6J50l85L15K65l19k1K2n6k6J45j41L71p5k79K24m4m11
3479b83M15l48K35K21l90O8L23l09J39K33m25L15q2N0j63J50l54M14k42n6K30
3500A41p5j58L08m14J86L3J4j20J35j28N5P5k35K96J82l70l7K4l69N11L2j14K21
3523A93k07P7J4k02L62j22j14j79L40N4k35o7k08L77P2j86K47j65k66M53l62K25
3545A01J69l68J09O1k2K03l40j70L49j8j42K03o5J5j95N43n53L4K29k18j49K13
3567a1k65O70m91j2L86k33j22K08r9k42L22j07k2K09m91M48R4l79L52q0l3n2o
3590D4j67J52N4r6j79K3NM33l74j49M45p8j37K4o2Q6N5n9P9r6k82N09m56J78q
3615e6lm91N98n5j86J85k11K65j08L1J21p1N8j59k47M26j57j15j0K98J6m94O62
$$ plain form
3455 -56 -5 -4 -254 -59 242 -114 -18 132 -253 62 327 8 -13 9 -47 -73 72 -69 302 227 -52 172 128 -283
3479 -283 132 -216 19 240 -150 -82 241 -68 71 304 -121 194 112 162 -1 149 -205 209 -33 -89 141
3500 141 66 -92 216 -198 -12 21 35 -85 50 -78 -23 52 -183 113 295 -75 -112 -88 -457 54 86 -28 193
3523 193 -14 63 77 -125 237 115 1 -178 162 216 -19 -86 -294 83 155 -31 216 51 -215 238 -124 101
3545 101 270 -98 11 72 50 253 -87 -257 92 74 -68 135 70 85 -110 433 -120 -86 143 -75 -224 -11
3567 -11 -276 394 -97 -109 277 44 -78 130 31 -211 111 4 -18 191 -300 148 242 -137 215 135 102 50 44
3590 44 -123 29 83 -13 -192 -169 -164 269 -105 -254 191 113 -24 0 -62 24 79 20 99 3 -279 230 -226 -48 -56
3615 -56 -59 -550 48 -7 -193 -8 -219 46 -62 -31 90 19 77 -82 -329 97 -60 -175 -185 113 129 -365 297
3638B97n06K83J40k62J83j36J1k20L44k6k7J6r7r1N2o8K1L88m10K7J99j72k9o2
3662a45N4J81J49l11K03p4n7J00j10K31m38o3P9J69J4j12L05j59q6K02o1M2K2
3685A35j31J86m14r2K27M5qK46l43J3M4j0J18j40o2M2K28j64J38Q3l58Q2K27j78
3709h6Jo6j07K79k3L1j08j36J94q8l03M81l60K96J81j58j08K57k48o6M9K61n96
3732d23P09n3l54M7J02j77J27k13K66P6l07J2K69o1l4K68l59J83k00r5J77L69
3754C29p63P31l46n6J94P3j46L23m04r3J69P0k18J47J24r4j63K7K75p5K31k11
3776A24j30p4J5j26L79l62j5L86j76J6k1j96N0L2M04m54M06N5m66R6J73p9j55
3799a18K53j48O3K06j14j63p9k63M40P3m16J77J51j22K50l87L84q6j72K66l35
$$ plain form
3638 297 -209 74 214 -48 135 -1 10 -210 134 108 81 97 0 -91 -39 -107 -86 302 -108 -81 118 -54 -83 -145
3662 -145 -91 90 239 -72 131 57 0 100 -10 221 -217 -280 -201 -32 -18 -130 175 16 -70 132 71 113 135
3685 135 4 190 -224 -316 -89 -44 -52 194 -149 -136 -92 -102 16 -124 -186 -144 84 -80 58 141 -217 -135 92 -86
3709 -86 -85 -151 -258 21 -2 29 -79 -215 -21 -109 -412 69 -291 5 186 28 -80 177 -71 -137 -88 173 -423
3732 -423 286 233 -121 -74 28 -149 -22 -235 31 107 -200 -188 81 20 -14 254 -105 78 -122 -217 -40 329
3754 329 -434 297 -49 -105 89 162 16 339 -65 -158 11 81 -137 10 134 40 -123 -96 179 104 335 124
3776 124 -6 -80 -65 -191 188 -174 -189 197 21 37 16 -180 -130 -98 306 -148 258 313 -153 -57 116 37 -118
3799 -118 135 -13 50 256 142 -21 -100 -363 77 150 -266 -89 62 -60 190 -197 187 101 -71 195 -140
3820a40j61L01Rj63K4J90J25p2r5j40j45R5O7K42l50K31J43k47L30j35k07j62
3842b60K08J50j59Q4j51N02j73j35L29m79j78L72j15k1J61J24j12j06j82L00k53
3863i4l0J00J1QJ60m69J88P4P3j52M01j02m06K37j39M2mm1J98Q0l52M22k68r5
3887a58M9M68m29J02k45K81k52K70J6j31o5r0K22j31PJ93Q4l67M78m57J94L08
3909C47n12L3K16J19j59mj32j1K76l87M41m58J43o8R7q3O8K14j78J58j79m6J9
3932h6K21j73J71o7K6J71l88P2O2k63K55J42k88L2L70k81K47l66Q7K41k11k47
3954b73K63LP3p5j22K28o9m24J83M18l43o1K71p6R5q0k3j13J33j52K70j76O5J00
3978A15Q2k46K70l16J1j62J84l3M1J2K29l67J08K15K0l09J82M5J7k6l26K70q8
$$ plain form
3820 -140 -301 0 9 -154 -130 60 185 113 18 -122 -267 -172 -105 137 -213 18 161 -86 244 109 -98 -260
3842 -260 -52 98 -61 23 -128 374 201 66 395 -84 -262 110 -5 -26 135 259 147 41 -141 159 -94
3863 -94 -124 -24 -13 -5 155 -314 -126 -52 21 -131 270 168 -238 -1 -140 -98 -102 -143 55 135 -217 205 -63 -158
3887 -158 -109 359 -70 32 -213 68 -184 86 102 -29 -94 -184 38 -93 -86 107 191 -176 302 -155 39 347
3909 347 -165 -132 84 203 44 40 -92 -103 173 -214 227 -231 -88 -156 -59 -142 -74 140 -38 120 -59 -105 -86
3932 -86 135 -38 133 66 92 263 -125 -53 9 -254 1 143 -145 -113 257 -24 223 -143 -56 185 -26 -273
3954 -273 -10 -7 66 -9 -131 97 28 -396 -213 205 -138 -199 72 -4 91 11 -12 -125 8 -144 126 -50 15 115
3978 115 197 -49 221 -95 -84 -246 -62 -95 -54 -42 187 -180 -72 143 163 -146 36 81 98 72 -254 16 -72
4001g2L57l38QK72j09l39L27L58l31j59J25l2l13L59j78j96L67k26l9K54n9j75
4023a39L89j34m2l1j82N48m33n0K37k7l62L35q2Rj46L3K6j12J34Q7j37K60k49
4046f8J23j22j17L50Q0m30K56r4k75N25j45K19l61j43J84J34q2j33J21K7j94L88
4068B43j29q2L7k22N30p94L15K06j48K3L7J75m65L34q5j43K09mJ13j97K56j97
4090A2k17L83kj71LJ46k2k57J66n7MJ51j67M1j1oj19K45l37K60j6K2N3j84oK25
4116A39j47j2J99q4L5k64J3N90l98j62Q0J85k49K60k61M7M6M8j43J70K91o17M22
4139A88j70l32Q7K69j49R2L1m0P6n9R1j32k6Q6J14j3M7k55J47k40L79n66O32l98
4163a41k1J61j08j03L37j84k3Q0j36j64L58j96L66k39r1J8o7J34p9K94m42J20
$$ plain form
4001 -72 285 -53 -45 227 118 -221 106 464 133 -26 99 67 -246 113 -65 -261 106 -120 -159 95 36 -139
4023 -139 250 116 74 43 -139 409 -24 -74 163 136 -226 109 27 36 -110 -77 -51 -163 -29 58 -79 181 -68
4046 -68 55 -67 -184 166 246 -184 72 -22 -297 228 83 302 -59 -202 -18 116 34 -99 22 49 -145 243
4068 243 114 32 69 -153 377 -417 -102 104 -44 -21 16 191 -274 60 -25 -168 41 37 150 -47 209 12
4090 12 -205 178 176 5 8 154 132 -125 41 -16 -12 139 -28 13 2 -4 -123 122 -215 45 29 51 104 -80 -86 139
4116 139 -8 -20 179 95 130 -134 -121 469 71 -91 -11 174 -75 185 -76 -29 17 65 -78 92 383 -234 188
4139 188 18 -314 -227 42 -107 -15 16 -24 52 -7 84 -48 -74 12 126 113 160 -95 52 -188 191 -375 257 -141
4163 -141 -162 -1 -109 -212 125 -59 -82 -2 -138 -302 56 -140 226 -13 -104 -86 -153 -19 -98 196 -246 -126
4185a26k7O1M2o8L1M62n53R8P4J03J52n78o2K40M18l85K34M8j05K4k79J23J48
4208G5J76j13o7r8M1K24l39Q9P3k13L97m7j85K14k09k71N15l70J05K06l78r9M30
4231A56o5j98J39j23j9J65p3M5k78J34J0P8m5J28n8q0J35K49o55L75j81M6L47
4254B32m29k9L41q3j13R9k46L87l4j62J43m8r4p8J88r5k67K80p0P0P2k10Q0K77
4278B11n9J37o92M20j18o7j6P8K93j46J5j2p3J98l06k5K34k48L42j03K9J60k5
4301B27k44L16j60j29J82l21J99r0nR9m7m2L33k30n7nj28N6J67q1K21m03r2L36
4325A02j22R4M3p1j87M17m23m6o0J62Q0m2K40l59M4J40k3k04M06l28J47n8r3N
4349a36m4K68l49K20M7j34J18j40K02j31K50j87n2m5K72j30P6N1j09J56j99k08
$$ plain form
4185 -126 -153 -92 -50 -118 -87 375 -178 -80 -6 97 249 -329 -391 -151 267 -118 116 164 59 83 -196 -73 75
4208 75 251 138 71 -27 14 238 -101 -12 61 -152 245 198 13 227 18 -253 262 -108 -3 203 -175 -274 156
4231 156 91 -107 32 -91 -110 55 -18 27 -251 -117 -107 -29 -74 54 -4 -84 51 300 -355 20 -161 -115 232
4254 232 -197 -226 115 32 -81 18 -228 159 125 -37 106 58 -36 -114 74 -21 -288 -8 -78 -8 64 -146 -66 211
4278 211 152 289 -403 17 -101 -168 -184 -106 187 41 56 44 -29 169 -137 -162 72 -176 166 63 92 252 227
4301 227 -17 299 139 10 192 -129 70 -20 -25 74 27 -15 318 88 31 26 -102 -46 121 40 261 -142 -234 102
4325 102 -20 74 117 46 -141 276 -147 -193 -253 -91 -11 -53 187 -172 -128 12 -11 -215 191 -137 10 -48 -141 -136
4349 -136 -180 88 -261 -41 6 -128 -10 -150 52 -79 171 -16 -68 -113 159 29 105 156 47 203 4 -204
4371b04K91p9o7L84l79M47j99l46J71K44k39k94K60q1J1J11j13Q9k3O6m6K33l14
4394g7P2J67j58J70j67%K01k92k08K89n1K24j99M2oL16j26j99J87m22M19L8j56
4417F4j03j19k5K11j66j08K51L7n7O9k37L87n4k58J52J39l53J07N8j21J28P0k78
4440b06P6K25l51K58M3j64Q7J63p4q1r1k1K29j18j34Q3J19k28K60P5J74j12k58
4463d6J46O5p4J26O3k40K23l19JK92l41L30q9N6j59J2j81J58l12K74O8J76k91
4486f2r6J97j50K49q2k22J98J64m21K01j19O2L28k93O2k6J74j47J36j2j53K8j49
4509a33M90l16k24J74J44k02J37j08P2J39j99o5K49l10N3M41q50L17K37k40K19
4530B5k94K20J37j22j07L04r3m1j3k53M9M45l28k11N08l18K29L5l09l21N26m6
$$ plain form
4371 -204 87 8 -59 325 -54 393 194 -152 19 263 24 -270 -10 -91 -80 31 -82 7 -16 50 4 237 -77
4394 -77 -5 162 4 174 7 7 208 -84 -292 -3 -54 170 -29 13 7 323 197 -2 185 -237 182 220 64
4417 64 -39 -158 -183 28 -138 -246 5 42 -15 54 -183 204 150 -108 44 183 -170 -63 -5 -126 2 72 -206
4440 -206 -130 95 -256 2 45 -119 -32 131 57 -24 -115 -136 93 -25 -159 -76 43 -185 75 150 324 212 -46
4463 -46 100 165 91 217 280 40 263 -56 -55 237 -104 226 137 193 34 46 -135 23 -289 -15 53 229 -62
4486 -62 -158 39 -111 138 56 -166 32 196 -225 -24 -143 -81 247 -46 16 -10 164 17 153 141 -12 16 -133
4509 -133 357 41 -183 -9 135 -67 70 -38 34 173 -26 -91 158 -152 -99 342 -508 -191 46 -194 25
4530 25 -269 -49 88 -34 -141 163 70 29 16 -237 -188 257 -71 -282 226 -92 137 172 -137 -458 68 22
4552B2o1K94j3l05qNK31l26L43P2m58M2K13J33j71r9N4K07J4m02N06k98k7k04
4576b36K34P0j21j27J0K04L3K4j8K5r1K56l58j12K63r2J62l13J95RK57j71j45
4599d2j04L50k02R0k17K51J59p10O52m7k90J71j84J41m8J24Q3p1ml72O17m13J55
4622H9j77m2K60j79J35j86L03l47J61J46l78L14o9OJ75l52J87L8k93J49j7j7J25
4645C1J19l06K82k52r5K26N1l98L28K42k91K31l38K33M3l52L18n5j47J40L5j60
4667a15J93J01j3k04l0M6K0K27m20L17k84P4R4j56O5K88k07k17J99j47K38j03
4689c4j38K98p3j22L51k02l64K86o7M11j21m61L04J91k44kL6p5JL19l42o3L98
4712B87j81o1R3k59L18k49J1j9k2J28L7o6l73O87l02J67m8q8l8n6j64K79o4j27
$$ plain form
4552 22 -39 255 242 -63 -71 -66 165 -161 182 254 -204 -162 51 184 13 -86 -32 175 189 -213 293 -5 -32 -236
4576 -236 -2 68 -53 -180 -170 34 67 91 73 98 7 263 -95 -207 56 -36 126 -187 8 17 274 103 -42
4599 -42 -146 204 2 92 -125 126 285 -425 227 180 -110 61 -123 18 -30 94 177 106 102 -270 347 -66 89
4622 89 -88 -130 130 -49 86 -100 203 -144 17 163 -215 99 30 36 211 -141 46 84 -209 -60 -77 -94 31
4645 31 150 -156 126 -126 -221 5 56 -342 -14 228 -63 168 -170 63 106 -246 72 17 -130 10 45 -115
4667 -115 78 179 166 -38 -68 -22 -2 225 -195 122 -162 -88 6 -150 -85 203 -4 -221 -22 -169 69 -34
4689 -34 -172 126 53 -69 282 80 -284 2 -65 346 225 -236 68 259 15 13 49 -26 -25 294 -48 -111 287
4712 287 106 45 138 -121 197 -52 -41 -60 -82 46 83 17 -356 331 29 196 148 60 22 -34 -198 81 17 -110
4736a10J68K5q7J70L5l03L35k57k4J13K36m79K28J31n4R6q8K5k38j30M26r6k26
4759a04NK95l63K95n2j41L36m87K83k8k14K93pk10l8j27L79j40J35K18l92K13
4781A49j55j94L73J35k24K6m91M76l41n3M45m38M51L4l41K21k2k9J33k09K26l35
4803a63K39P7r7M1k44l1M04k27J96q0j94K0O8O8M6J55l94J30m2J40j61L2q1O9
4827b9p5J37q8N2J90j6j76j11j72J48M09k10Q7n8J18j91J54j94j58J79l51K66
4849h9K74l40L6J67j61J55j18m7j0K94j22p4K26j82P2k8m3L23l61p8M06j81J3
4872A32k06P5j64K77k45L51l10j47J83J34k44J62K55l41%J68k00K42O0l27L75
4893B30j20k74M4j6K36j67j22K33k03J19oK3l22J46K05j78J22M1N1k01J68l60
$$ plain form
4736 -110 58 83 -4 166 201 -102 233 -24 -48 65 301 -178 50 181 127 223 135 160 -78 -208 218 122 -104
4759 -104 -99 196 -167 128 76 -65 271 -216 67 39 -175 118 111 -99 -137 -264 115 -25 110 328 -64 149
4781 149 -6 -200 173 308 84 110 -381 95 -246 -299 146 -292 159 193 -148 73 51 22 155 -54 172 -163
4803 -163 76 153 56 97 -147 -178 226 -1 195 115 -79 -59 9 77 123 278 -116 14 -28 112 -49 -17 -98 -29
4827 -29 -104 33 -55 -3 187 171 -5 -116 -288 -140 269 59 146 88 206 15 169 -25 -183 -4 -355 -89
4849 -89 185 -155 -119 48 -113 42 -76 -123 -133 161 39 -35 191 9 81 53 10 333 -28 -106 300 119 132
4872 132 -74 1 -163 114 -131 220 -90 -237 -54 80 -164 -2 253 -88 -88 80 -120 122 182 -145 230
4893 230 110 -164 -120 -136 100 -67 -189 44 -159 -40 -46 -23 -345 -199 6 -172 -50 -9 42 -159 9 -351
4915c51M03j48j29K23R3P1j11m5L62l88J5M2l5m0Q7M0j60L72j29k46J10P9j17
4938bK29l56J08J18N0l06R7O4K17n8o5l54K72p3K8m3j47M02j39j50N4M0J36Kj7
4963A07n9p0m3J53k05M5K0K30j31J7J76l93L6J32NL2J62k22J26j31k17L23p9j97
4987a83L36j69Q3k34J80Ol02K30L48l74J41j73P2r6O5K25j38J06p0j0J3k96K75
5010C5Q1j32j49L74l11k19L74j70K12N1l62N9J56J06J4M8l39K95J0j48j62J00
5032g7J44j69J09mm4j48J87J10k93J02K28l72K96N1l30J1M57k89K14j63J48k59
5054i1J52l13L59m16K27M6J18L4k09K62j82K23k45p7J29o1J6J77p4K2p0L3J85
5077B45k68k64J35K28j47N1r2O9lJ24l27M21l39J49J39j69J38q6k94O33j40k29
$$ plain form
4915 -351 52 -96 -225 -2 91 162 51 6 368 -20 -5 37 2 -38 49 89 -71 301 172 -74 36 115 -2
4938 -2 227 -129 -21 97 147 -159 -62 2 219 161 96 -258 14 -59 -31 -74 -221 181 42 -108 -54 -14 122 124 107
4963 107 48 -22 -65 88 -117 -72 -52 178 47 64 240 -153 -117 15 20 52 214 -8 118 -13 -230 93 14 -183
4987 -183 153 -16 67 -167 13 19 -283 -53 295 -79 62 -111 -39 -135 -70 155 17 123 53 43 56 -240 35
5010 35 116 -16 -165 209 -102 -321 53 -117 95 146 -216 -157 -1 105 119 167 -172 123 133 -15 -177 -77
5032 -77 67 -102 7 3 -41 -189 -2 108 -185 -83 145 -227 69 120 -210 -199 258 -31 183 20 168 -91
5054 -91 61 -252 107 -309 -82 -36 82 116 -93 169 -13 210 -35 -112 17 -44 -28 149 75 97 27 60 245
5077 245 -23 -287 -152 76 -71 -20 -112 -43 -46 78 -249 172 -167 -18 121 -48 90 4 -290 343 203 -26
5099b6J87r2j25m5J47p0J8J67LJ5J10l97q7M2L05j46o2J23n3q3Q5q2J97j19j32
5124a20j13N55k27J22j84J35k33K85k25j41j20K46lJ68k69J04j65L12k26R4N7
5145E2j12N6j87K10j24N4J02j45L3L85m74Q3L2j50K3M45j74k53K90k32J27J31
5167A72m82n2K11J09J71j36k89N82l95K48k06M8L3N4j1o9j50P5M7j3Q8j74p2K94
5191H3m0J89j88N4l65K60K71k59MO3J97k60k06K44P3O1m20K26q6K16k5P5jl94
5215b28K84p4k48L93k64L38q8j42kq0J00j12R0K8P8j78K60r2k01L00L7j82j37
5238a20M1j17L6J44M5r0P9R5n5j10k53L49k78PK74j46Q4J3j04K24j32q0L17n42
5262c19K29M40k62l14M55m80L8K04j21J29Q9j10l01M26j52L08k81k20M22l38N1
$$ plain form
5099 -26 161 69 -56 -101 46 -24 -6 161 164 179 289 -108 -195 -153 152 6 -56 67 14 -69 16 -66 131 12 -120
5124 -120 -233 322 95 217 33 168 -65 220 -5 -146 -266 -20 -23 145 -124 -20 -185 127 -99 -5 52
5145 52 -60 -4 -191 19 -105 -51 51 -94 -61 324 -150 -67 -35 -185 -162 283 109 -144 146 -86 41 172
5167 172 -310 -362 -151 -42 129 -7 -296 286 -109 139 -67 -19 14 68 57 -12 -162 -87 -40 -53 35 -139 -211 83
5191 83 43 232 44 98 -267 -7 264 5 9 72 269 9 -197 47 120 181 -239 -13 -99 117 92 167 166 -228
5215 -228 56 -18 -266 127 -137 201 113 -29 -31 -111 -11 -123 -33 -5 73 -105 155 63 -138 162 199 17 -120
5238 -120 -79 -196 -160 -16 29 -61 18 113 58 -52 -305 44 -234 -227 47 -99 -15 -2 -106 118 -14 -94 223 -319
5262 -319 -90 350 88 -226 229 -251 -213 -9 -130 -1 88 -22 -323 103 -49 259 -22 -242 180 -158 -107
5283a07J54O9l21K03l2j07L23k89J75L1r0K54m48L62r8J36j78j24K01m4J52O3
5305B85m23J86n1l8p0L22m28L48k01k1K06j99Q1Q6k10J70j5j97J48J77m25L00
5327C1k09l4K17L65k18j63O5m05K99R1j2o6o9m4L15o0r6J27P1k2m5j21J72k9l06
5352a46J18q1k64M38m0L1n8J03j86K84k65n8L6K62j10m9J97k53P3J66k28Q3k42
5375a89M05m08J64kJ43j72r9K28J06k87K78m17J79J03R1j43k09M64k51l1l2K4
5397e5p7J42J38j56J39j67l1P4j89K10n1R6k90L91j99l9J33k92L1N59o11M2M13
5420B11l76kJ96L38n52J85L0J58p4j75Q4l4j50J22J26k89m3L29j31J58l37j8M93
5443B49l81J69K27k17k07K73k14J21L9Q8k07J81j34l3J96k18N5J38k85J63j45
$$ plain form
5283 -107 47 116 -205 -2 -34 -141 182 -107 68 99 9 263 -185 177 79 215 37 -87 114 70 222 285
5305 285 -138 48 -3 -41 -111 211 -217 131 -70 -91 115 -84 -3 83 -127 43 28 -169 -21 156 -269 31
5327 31 -178 -212 5 370 152 -11 54 -351 -52 39 27 -39 -108 -152 163 103 7 134 205 183 138 17 189 160 -146
5352 -146 -28 -109 -373 65 25 56 -2 101 -85 199 -66 -124 -88 174 64 15 212 -41 32 198 -30 53 -189
5375 -189 216 -192 -28 -30 113 -59 -158 70 176 -111 167 -250 -71 32 123 -20 -229 235 -16 -47 -79 -55
5397 -55 -132 10 148 -8 131 -36 -67 7 -182 28 -23 73 -217 174 -25 -64 69 -223 -192 367 -244 -202 211
5420 211 -165 -167 29 367 -185 0 30 188 114 -61 23 -11 -161 -39 87 -202 -245 84 -47 111 -226 -244 249
5443 249 -132 37 264 47 -160 113 -101 20 59 147 -60 121 -13 -46 150 -68 -13 125 -160 3 -142
5464a42NJ58J08N3n1k47j1J92m7K2kj41J54l35J83j51K60k0J19j18r5K79l20M58
5488C11l53j88j7Q4J65Q2j85K8K27k66K66N1k51j10j30K89j28J49O6k57L27k34
5510g4J25M33p26J37J57j38o2J18K84r7j51qJ30l30M10l38J06M0k26P3J07n7o7
5533a54K49J07K5j40K9o8l9M14m85J3J85j09J41k68Q5j7P5m0L02M8l97Q2j12p7
5557a51K01k30j58O60k82q3K37m84K88K17l19L57l41K04j88J88k80M22j51l55
5577b48J93J47p1R0l36J75P2j68L27k20K08J6l3l70K50k3k19K55j50P0K89m64
5599b10K97j9k44L81k25o3P0N0k72K87J60q6K1j95l58M22j81m6M6J54O1j46K99
5622B03n3k25Q8j88L07l56J57J05k67k4M37k13K20K9j72k35K10L0L2j30J73K2
$$ plain form
5464 -142 -137 21 129 182 131 -116 -127 65 18 40 38 -103 51 -284 -101 -252 8 -12 107 -11 -106 173 -147 311
5488 311 -42 -230 -247 -163 2 84 -101 -73 154 -112 154 205 -46 -156 -286 3 -125 24 90 -167 160 -74
5510 -74 51 484 -242 -105 52 -86 -148 -30 254 157 6 -2 128 -202 208 -130 -24 16 -210 -137 -30 -87 -154
5533 -154 95 202 227 87 116 48 9 423 -62 -49 136 27 168 -100 -15 -32 43 3 305 353 -44 38 -74 -151
5557 -151 50 -180 -338 322 40 -43 194 -290 -2 215 -104 253 -88 116 -72 116 -164 258 107 -248
5577 -248 -55 92 21 111 -225 -50 22 -146 181 -39 169 185 152 -218 32 9 -210 45 -105 -35 254 -210
5599 -210 87 68 -176 205 -20 -83 -13 37 -235 52 212 126 147 -48 -406 16 -165 -211 -165 -11 50 -96 203
5622 203 150 -75 13 -175 132 -224 -67 38 -229 -253 184 -29 191 220 48 -187 23 53 85 -45 128 150
5644A50k25J83j28lJ20o5J04l19J85rJ77j57j9j06K63m29L88N5k65M5K40m28L68
5667A25o3M00l83j95R0O3j2m9k02J63K14%l57J48k00L67N5l06m0QK55l3p9J49
5691A18R5q8k01K38n3j51K46j57m3l9J39k4K20l36R9P5m0j83j14n3K18m8Q9k0
5715a3N3N4J73k08N2m26N40m32K63L3m67N06p5p3J77j22j11R9O2j87L32k83j78
5738b31L15j69j14O9J38k50J88j40M80l43O0k05K02J78j99N4p2M55o5k94k01J63
5760A9J9L79l47j50K59k47K45k08J6J51p1k24J46Q3n8j64J55m0j60M8K74J8j50
5783gJ22j09n1J52J87k54j16L99n22L65m3j28oJ53l45K99j95R1j62J66N8q6J56
5806A24j81L18j21j46J00n8q8Q7ok10J1K28J3r5k12K11K54j97lJ22l8Rk46L3l2
$$ plain form
5644 150 -75 108 -20 -23 97 32 136 -183 2 -7 170 13 -6 -112 151 -278 110 165 -100 -55 185 -243 125
5667 125 62 462 79 -116 -26 37 25 -24 -226 -63 151 151 -206 -58 -258 109 164 -142 -182 -174 81 48 -31 118
5691 118 213 125 -76 162 109 -42 204 47 4 -35 104 80 300 -36 63 138 98 -85 -199 -252 -34 -82 7 -13
5715 -13 40 94 267 59 111 -315 225 -207 56 89 -378 128 53 -20 157 35 -76 23 85 -102 230 -53 -231
5738 -231 84 -85 -199 -130 8 -242 -54 -194 286 -57 3 -202 0 178 -21 33 -39 416 351 57 -144 19
5760 19 38 417 70 -80 179 -68 177 -31 -15 136 65 -159 -13 70 12 -152 3 -37 -197 -149 125 143 -7
5783 -7 115 6 -45 107 294 40 -76 323 -199 166 123 -5 -11 142 -203 96 -99 -8 -170 -4 54 -32 124
5806 124 -57 261 140 -6 94 36 -52 35 29 -181 -170 58 71 -24 -236 -25 229 32 29 151 113 122 -124 -91 -123
5831a23n7R1J81o2j2J3l80L30L8r9J60M8j21j68p0J97O1P5k60K34l30K3O8K14
5855E1J01j14k54N00r2m35J57K84n4p9Nl16J69o6p0K73J0o4p8K56k52L47l21k33
5879b75L59rl1j06m4p3J18J50j20j35qJ47K2r5q1M46j41j86o8k27M61o2o4M5k
5904B1o1J66m8k10M32m67R4K9p5L96l22P3J88k23L22m19J87k08K7J90k69L63q9
5927I7p6p1J32r1L31o08L15q1P1O0K45k14k43L80k51Q2Kk00K15l1J00k66J13N9
5951G0J0j11N3L0j48J6q7K74r9L9k72L01N6j90j74J7J98K6p2j45M65l16j39J82
5975a6J36l48L65j92L4O8J08p2R3r6k45K35p9J67k68L6M10m07n6K65p6j13M11
5998C60q61L13K28K37l31N0Q4r3J41j19M7P7K7j33l8n4P3l3j12p7J1K78K32k41
$$ plain form
5831 -123 -180 -89 92 30 18 31 -349 -19 19 -80 80 128 7 -161 -231 -34 27 102 -158 76 -254 -231 -163 51
5855 51 152 38 -216 284 192 -243 -86 198 144 65 70 -246 -77 -143 -213 60 70 6 -72 184 -68 279 -42 -275
5879 -275 84 75 44 -62 -106 -179 -61 89 -31 -166 -174 -27 -5 -100 -181 265 124 -62 -130 -357 104 42 -22 23 21
5904 21 -40 126 78 -132 300 -167 -73 -44 -119 277 -45 28 216 -7 315 -104 83 -125 -98 92 -177 186 97
5927 97 21 -50 82 -9 322 -286 29 -52 19 79 324 110 -133 247 -4 78 80 -120 95 64 164 -102 11 70
5951 70 80 -31 22 52 -96 -80 -167 107 8 47 -225 76 132 -58 -232 -215 -17 9 -63 -208 257 -59 -198 -16
5975 -16 120 -228 137 -55 -21 47 155 83 176 80 -165 70 -9 158 -110 -74 336 -71 -127 138 62 -51 360
5998 360 -501 -188 40 277 -54 -4 80 -13 128 9 56 133 160 27 -11 -65 8 -25 -137 -214 -203 75 307 66
6022F6q4K12l41L43k69l2J80k60J45L17m25J12j01M44m62K51r3J36Q4m35N34k80
6044D2P9l05P6P9P2j43L1J98k95nO5J15j1l7r7L51j89L44l24nj18K61j46r2r1
6069a45L41r9J52j78J6n3k38m6M39J07m20K61j85M2J16J20k83r7J9p8K73j51L26
6092B39j96m0M5k69K08Jm8k5J73j2j29P5k04m8K60J72m66L7L63j45Rj72J48K47
6116B23m35K22j46r8M24k55P0OJ27m64M73L0l48j50L83j00NL27l63l83N18J07
6138A73J08j64n1k36O6J74j63j42K22J58k50q5K11N0k79K20l20J83J94l29L97
6159A37j36M0l2p5K8K03k60K78l93J04M1m1L22j73k6qp3M2o6L74j15k01J12L7
6183A19r5J45n53N77q8J6K1k92J07J14p0m5l5J14m28L54R1P1L2k24L5J48j83L1
$$ plain form
6022 66 -18 194 -147 196 -73 -105 75 -185 -40 277 -148 -36 -137 307 -155 96 3 139 223 -212 322 42
6044 42 121 -184 -108 -29 43 -100 -69 129 -166 -171 -106 9 -2 -39 -136 215 26 370 46 41 -77 184 38 -54 -145
6069 -145 196 97 249 71 87 34 -204 -250 189 296 -124 137 -48 -6 110 230 -53 -150 -131 -209 64 -87 239
6092 239 43 3 48 -221 -13 -12 -60 -85 88 76 -53 22 -182 -230 30 202 -264 -227 136 -9 0 -172 -24 223
6116 223 -212 10 -136 -234 190 -65 5 11 138 -326 147 177 -171 -321 62 -38 -33 294 -69 -452 66 173
6138 173 281 117 66 -170 -104 70 -93 -235 -13 145 -105 -190 21 71 -208 12 -308 -125 69 -260 137
6159 137 1 41 9 -66 -38 165 -95 183 -210 -106 -65 -106 216 43 17 9 -64 -22 -88 286 171 -30 82 119
6183 119 24 169 -384 193 105 121 142 -150 -43 71 1 -44 -79 35 -393 -39 52 123 155 -69 -34 114 -69 -38
6207c8l5j01J53J21Jo7j4q7L10m02K3J34J59k95N2M1l2j87L73l32K40pm9K69q0
6232A50j52m5J02J62l1j4k55K16l27K35J25j80K37p6j14qr2J53j69J65j34n4L1
6255g5J40L32j92l86J07J17o2K19l58Q2j06M32n27L03pJ6M4l22L59R7j85K18m20
6278a74L48R9k78J25j71P5p1M6J74J1k20L4j16J16j63j6J11m9L01k98J57k44J89
6301a4q2J94j66J60Q2j38r6k9K02j45J39l11J65K22k64q9J62J22j78qk1K64j87
6324a6L98k65J04j19Q0k20R9J9K3l2K08po3j87k67N69l47pJ3n9J03J93j75J08
6348A53j09K4m6P8j60k1L8p1j39J15K33m2Rk42J66j71J11j89M62q2j28J43j39
6371gk32J00P5K16n6k36m1r0M09k09R0k3L63l99j56J13K25j25j85k6L14k57K7
$$ plain form
6207 -38 -73 -174 -21 100 101 34 20 -67 243 -159 -136 -2 157 -138 -86 -45 -77 -264 109 -223 17 10 -39 230 150
6232 150 -2 -47 55 217 186 172 -83 133 -194 41 166 -14 223 147 33 25 -67 86 -83 82 -52 -106 -75
6255 -75 65 397 205 -181 -74 43 -19 200 -158 -76 -182 250 -277 26 19 35 79 -243 116 213 28 246 -174
6278 -174 174 273 -5 120 -51 24 -47 -1 173 184 -36 -2 -118 -2 -165 -181 -70 -119 182 -116 41 -203 -14
6301 -14 -96 98 -68 92 174 36 -60 -89 113 -32 107 -204 -39 183 -81 -170 -8 114 -64 -72 -93 171 -16
6324 -16 382 117 221 102 182 -38 61 80 103 71 279 272 209 22 -245 324 -23 -30 -17 -76 27 220 45 153
6348 153 44 68 22 100 -60 -81 -43 -114 -253 -138 95 53 62 -180 -14 -185 -74 -263 199 117 -11 132 -7
6371 -7 -239 -139 -64 152 96 -140 -181 -271 138 -71 19 -4 359 -40 -196 -83 142 17 -168 -194 120 -137 -110
6394a10L02l46K85l59R8K88n5j66j76M51k57m2J95J0k02K04n3k12JO6J20K50o76
6417c84J65m4K35R2j09m1K44l53J98K00m43L66k05J42q5J19l9k30R1RR7J21j84
6440c8M8j7L05j83k46K17l2k4n4K8n8J45P6n31L57M70m30j23KM6k0l47J23M08
6464A22j67J37q5P3j47O9j36L84m27L64m67n2L56j37L7Q2Q8j98K89l28M7J0L51
6487B65k64j90M39l80K26j50J70k24P6j90J35J50k21L17j33K2R1j71j44K80j48
6508d4j39O6J95q0J30j47l4J90l22l1L08k06J77j19L4L04r5l18j3M23l03j02P4
6531e2K40r9k30R3K3K89k48j22J71l18N63l68k13K47K85l53K91j47j66P8n8j9
6553a13Q8J8m2J50k6L8n9Q8p8P7k04J0J95Q9L6J4n66L68R6k94K48m53K68n4M0
$$ plain form
6394 -110 192 -154 131 -228 -130 158 103 -63 -239 212 -45 -87 108 118 -84 120 67 -145 -144 -78 42 292 -384
6417 -384 -219 -263 -28 64 -45 -86 158 -195 3 203 -240 126 -79 63 -22 97 58 -172 -81 -72 25 146 -38
6440 -38 10 -7 298 115 -131 86 54 30 -24 4 -54 91 167 -364 -7 463 33 -90 -88 -42 -62 -409 -286 122
6464 122 -45 92 7 80 -67 2 -134 250 -177 187 -280 -332 24 -113 -76 6 94 -104 185 -143 -96 -86 265
6487 265 1 -189 250 -130 96 -54 116 -108 -32 -222 -87 63 -158 159 26 48 139 -32 -176 104 -44
6508 -44 -183 -117 78 -2 128 -19 -53 137 -185 -216 92 -114 63 -56 -22 282 187 -131 -144 279 -24 -126 -52
6531 -52 188 89 -141 -48 -25 264 16 -106 65 -253 310 -58 -271 -24 261 -92 199 52 -114 -36 -94 -113
6553 -113 -25 -7 -49 101 75 113 54 142 64 141 -63 -53 142 231 267 281 -285 83 179 -115 133 -320 -52 -106 -66
6578f6J5J36k26L35k10Q2j21j94J90N7rk02P6J85k70K37N0r1l9J14J6k12J39J75
6602A67k36m5MM0j32L08K14l17R9k29O4J72j88J45r4n1J87J6J03k74r3K11k8n7
6626a4J04L4k05K48j46M8m49K88o0J7L09m60L36o0k9J64j87p1J74L1j99J21pj96
6650b09K47p4m5m7K19j23Jp6J89L2O6L0Qo0j60J25p0o5K6J07M5K59k32k95J52
6675E0K05l1k51j97J52J3P0J22l14M11qm01l7L62j65k6j9J85j58j3LJ33j50J72
6699A08m9m9j05J56l7k04M31j60j84K71o10L65M0KJ31j81r0M00k56p6J41p5j7
6722d8J26o3K5k70N09j20j09n8L2M1N7k34m1J62J94n5j6J19l53O5K5k54L79k98
6746a85K28k7j04J4K93k58k8J00p4r8L40N6k90J11j94m2K53Kl24L75j88K60m34
$$ plain form
6578 -66 -51 85 -141 194 -16 66 -55 -249 -59 -2 -11 -213 -137 48 -222 15 65 -26 -65 49 65 -147 -8 167
6602 167 -69 -114 -110 -70 -202 106 320 3 102 -127 -63 109 -79 66 -28 -79 108 124 227 -47 -140 71 43 -14
6626 -14 90 124 -81 167 21 69 -380 -92 -152 -135 174 -286 50 -10 -39 125 -62 -133 41 72 -127 -6 -13 -209
6650 -209 38 -36 -81 -128 91 -32 -31 -107 82 114 180 210 218 158 -2 123 53 -12 14 121 166 425 193 -102 50
6675 50 255 224 -27 -224 -72 -59 11 133 -181 230 222 -179 -216 146 -19 -45 -64 121 -37 -50 -47 86 -64 108
6699 108 59 10 -95 61 24 -180 251 91 -93 178 -432 -67 -27 -25 106 -75 -165 235 -21 -97 44 -31 -48
6722 -48 78 15 40 -230 279 159 50 -8 24 65 122 -112 -153 9 203 148 132 251 -102 -37 -12 -266 113 -185
6746 -185 43 16 -88 -74 219 -39 -67 33 -41 -139 201 257 -33 78 -116 -158 95 97 -227 148 -40 220 -214
6769b14K87k45oJ85P2J8l56L0N23m88M26j75M8j06m0j08L22l50L08j05k1k2K72
6792B55n1l62rK34k65K20q9N1J89l22R0J64j11O4m4k28K78p4j18K1K94k87K47
6815A47n5l67L52j92L62k60n7K41m31J01L5K5j73J41L47m00J23J03j11J33j59
6836i5M83m32j53K96K16m80R0J82p2k25L40k39j9M64l62J2J67k24qq9K90m4K34
6859C32o09J31J02MM0Q9l30L74l1l26K15k26L37o1l28L42J67k22KJ23j44Q1K50
6882C12n1m3k9k22K46n1j11j53J83K7n2k32K37K27l57J87j54Q0j15P1j06O9N0
6905A3m4Q7No8K41j38k4n8j13J59J9j02M9M5j19p1J31LR1O8l95L24j49k42K14
6930g4M3j90K77n0J21j56j3L1N0p1J89j43l1o1J96j8k06J1k33L62RQ6j72K57j23
$$ plain form
6769 -214 73 -172 -178 7 79 97 -259 -229 294 -194 232 57 105 -1 -41 -149 173 -177 131 26 5 -17 255
6792 255 204 -158 -167 67 -198 22 -67 -16 173 -149 -59 105 -6 58 14 -214 64 -10 -128 -107 187 -100 147
6815 147 92 -275 77 -115 247 -13 -70 171 -260 -159 -124 -99 -272 -131 216 -184 -61 42 -69 64 -95
6836 -95 388 -44 -197 99 315 -165 -75 107 35 -190 150 -89 -108 356 -6 6 173 -51 -59 -148 142 98 332
6859 332 -277 -146 -44 -40 0 89 -241 133 102 -224 -9 -235 102 41 -287 55 222 0 2 125 -19 62 312
6882 312 261 218 189 -33 213 162 51 -102 81 108 56 -176 61 288 -69 118 -36 44 -71 0 -106 -37 13
6905 13 -31 56 61 -7 234 96 72 14 -99 60 79 -23 26 71 -48 -119 12 15 106 174 -221 103 -46 -288 -74
6930 -74 -31 -221 56 6 127 -29 -42 -11 39 -32 157 14 -17 -78 118 100 -106 -95 -328 34 43 129 -43 214 91
6955I1j84R9j02J04k10L29m03L45k9j8J11n9j48O7r9J36j88K26j55O9k09K27j45
6978a45M28k59j21N15n19K72j44m2R1K3jj52J28Q1L9q5m0J43l04J32j31m8N2K37
7002A50J07J88l85n6J90q9O6j06j39nn3n0J31M4K49k36J29l49L57o6k7J9O7j09
7026B7P3k30O7M73l64%J68j51k25J51k0K17j7m11J06M87n28J91L7j99J51qO2j
7050E6j63J75l04J43L02l76j40L59r1k9j27J87J19j43J0k21K39k0J07j13M54o27
7072b03K64j71J35J7j13K38j49m0M8L9j7R1l87K57R3j40J40Q9k02k14J60j91L18
7095F2p8m4l2J59k25R1K61r4k15Q1N7K17r1j64l8P4K57l09l8L57k76m8O3R9m9
7120G7n4J5J93l20j40J83K01k37J96n6k11L36l64J90J42l01K4j02J31j1J0r0K05
$$ plain form
6955 91 -93 6 -96 8 -202 127 -276 69 40 22 133 74 -74 -7 -106 30 -158 68 -87 -18 -227 0 -145
6978 -145 283 24 -97 418 -101 171 27 -15 76 99 98 -54 74 155 194 109 69 212 -92 40 -91 -139 -87 150
7002 150 257 445 60 4 194 105 171 65 -74 -79 -132 -182 -51 -7 242 6 135 -214 143 77 50 69 136 27
7026 27 100 -130 -63 410 46 46 214 63 -162 -11 -31 186 169 -242 -136 351 -177 14 51 -148 3 -5 57 56
7050 56 -107 68 -236 -93 209 -167 -307 52 -39 -68 -195 -8 111 -32 -22 -243 -4 -24 83 -30 424 -203
7072 -203 61 -110 25 42 -71 167 18 -22 26 65 48 139 -248 9 102 -38 102 191 -11 -225 -65 -256 62
7095 62 -16 -60 -92 67 -158 -67 194 100 -115 -34 23 240 149 -15 -53 21 278 -31 -69 288 12 -36 27 126 77
7120 77 23 38 231 -89 -229 -46 155 -82 114 58 -153 183 -181 9 151 -150 -126 -228 -97 -108 -98 -188 17
7143A7p2m8L82o11M27Rj50P6m5j90L56R8l13j02J14J20J78k88Km8L5J32n0j92
7167a63M8J20L8j41K08j07k18K50j89L2L08m29K79l0j8j51K95m34K33o5k2K25
7189F9j48J42q3J20j53J22j7lp2K12l68J00j1K14r2p7Q2r6K30%l52R6L70k76j53
7214a44K61j55J44j06q9r2J95j50K68j88N2j45L10O9p2j19j72nM53l49j47K01
7236B0qj89J47J7N1J35j37p4J08J10j99K79m76K92j78N7J1J38j43J04k44L67m87
7259b99K33J74j01J94j24j86k19K54j1J99j94jN8J2K0j03j37J50m1K07O4j29j91
7282a71L82k30P5o6P5n0J46j50J4r2M9R9k6J22J59m67m8J75K05q6j34J44r6K13
7306B42l01L8n6J21O4j5j18K50k64j78J26O3K54j72p9Q3J26j04j42J05K63m10
$$ plain form
7143 17 -55 -103 279 -332 95 104 -46 30 -15 -205 151 249 -64 -166 -52 68 246 -42 -40 -88 -53 79 29 -163
7167 -163 -115 5 43 -98 110 3 -215 35 -154 -122 186 -243 36 6 -12 -163 132 -302 -69 -134 -156 69
7189 69 -79 63 -20 100 -53 69 52 49 -23 189 -179 -79 -90 124 32 -45 37 -59 171 171 -181 -85 285 9 -144
7214 -144 117 -38 106 0 -89 -181 14 -136 132 -56 -4 -149 161 230 158 39 -133 -138 315 -34 -181 20
7236 20 12 -177 -30 -13 38 173 36 -38 70 180 -19 260 -216 76 -102 -45 -34 104 -39 65 -179 188 -299
7259 -299 -66 108 7 201 77 -109 -328 -74 -85 114 -80 -81 -23 -11 9 -94 -231 -81 -122 85 149 20 -171
7282 -171 211 -19 56 -10 65 15 161 11 25 -67 -18 81 55 177 336 -131 -179 -4 201 115 -19 125 29 242
7306 242 -59 -21 -77 44 108 93 -25 225 -39 -217 -91 -28 226 54 -25 58 184 80 -62 43 306 -104
7328a04Q1p1J83j99o5K1J31N7j56K16Lj35j54J41O3k01K01Kk46K69L8k24Q2P6
7352Ir4M0k5J83p0R0k30K31k3p5j50L20l4k92J08nJ38o4o9L15k40j42pO7P1j53
7378a01L3M6p8J90n50M21Q5K4q7k59J25j54M46o5P6j12m9J54K59k98l19L95k58
7401g6M4r3K58o9K05k94PpJ42j25p7J38L19m43L4J85j78p9O0k11J01L03m2q1m5
7426b4p1n8P1PK49%O7l05J69j01L9q6j0L33j59k86K0N49n16N24m79L45l68K55
7450A65j49m6M18n05J99j4j88L61n9l17M4j51K59r2J95k95J93k31K92j05K2r1
7472i5J50J03k18K19k42J61j11q7J38l7J72k0j97K12k27p1K68r7j48J47j1LKk47
7496b33L86L1o3r0j58M30j61l24K77o5j21L77l69k2j48K85m9oK22k73J07r7N5
$$ plain form
7328 -104 -23 -94 89 -110 -175 -154 -23 34 -122 94 97 -38 -192 -51 12 -189 12 14 -232 37 75 -149 -67 9
7352 9 -85 -45 -70 113 43 133 -97 134 111 36 -114 206 172 -120 -12 -17 121 57 -12 303 63 -79 -86 -19 52 -101
7378 -101 -68 -22 -100 90 -460 -39 46 70 -17 -276 -151 -305 141 76 152 40 -9 145 404 106 -213 182 -76
7401 -76 -32 -125 133 64 269 -25 -18 -25 117 -8 -85 53 372 -71 -37 148 -30 -109 -49 -260 -159 144 102 21 -24
7426 -24 -95 -153 -82 -75 174 174 241 -64 105 4 43 -43 -53 280 121 -165 -145 404 -112 412 -67 278 -90 165
7450 165 16 -30 388 -117 82 68 -120 241 182 -135 -91 -242 17 -75 120 -175 18 -213 79 -26 -4 -95
7472 -95 55 158 -60 159 -83 78 -33 -120 18 -19 153 133 -64 148 -79 -150 118 21 -127 20 9 12 14 -233
7496 -233 153 184 121 31 -127 303 142 -182 95 30 -91 286 -83 -105 -253 32 -17 -23 199 -74 33 -64 -9
7519iMj46q2K15J9n3j16K90P7k78P6o1L1K22l39L12m07LJ26p2M16k08mQ7j37J44
7545A10j48M6K11j02k55k42O05m0l53Q5K08r2Q3Q3k99K56r9K2m7m68J89J01m0
7568a86J88L28k57j74R8N7j11J49j91k9L12k42J46Q6k86L50rk87j62R1K24N8j22
7591C1m2p2k19L49N1l41N09m05J50o4j76K03J42k81L96q8l85L69j07k0R4J2o3
7614D3N3k39J84j07J93l11Jj5J73k85J78J81j04J7J02j24L09m36J41J77o0k4L5
7637H2r5J04j21Q0j37QP5J52l7k6m7M6K3j99L74k15O3J46j27l50M21j39o5k85
7661b69L20q9O2N8NQ3j10j75L1J45J45k87J60k78K28k3J77k91r1J33R2j30j9L27
7685B04k83J36p1j64J5J97j76J95n7P6O2j2r6J25q2R1j02n8J85k74K34l90Q3L55
$$ plain form
7519 -9 -5 -151 -233 -18 1 -52 -168 122 199 -79 -3 -64 -33 189 -150 162 -245 -242 -116 -188 228 20 16 103 -34 110
7545 110 -38 8 219 117 -138 -380 225 185 -168 -83 125 33 116 199 -100 156 57 79 32 -436 -247 -146 -186
7568 -186 2 330 73 -101 -3 54 -57 92 -99 -128 184 -58 88 174 -112 238 229 -58 -220 -129 95 153 31
7591 31 -11 -83 -302 47 98 -243 266 -139 11 -53 -229 -26 116 -165 231 143 -242 127 20 0 94 106 43
7614 43 96 -143 41 -66 127 -184 -183 -198 -25 -310 -132 49 -55 -38 64 -60 249 -187 -46 131 71 47 82
7637 82 -13 91 -30 50 -87 -79 -4 148 111 85 38 84 107 -92 282 67 130 276 149 -201 220 81 16 -269
7661 -269 51 -38 24 82 87 170 60 -115 -84 61 206 -81 79 -199 29 6 183 -108 -199 -66 26 -104 -123 204
7685 204 -79 57 -14 -178 -163 34 -142 53 -4 72 134 122 26 151 69 160 58 0 185 -89 145 -245 -162 193
7709A93k30O9l6J53k19K21k4j12l8o5O9L4K66l89K30L8l47L31NOk63Q8j94K61
7733D7j78pL54k10J79k44o2J05K84l01o9j08L20o9J00j91lK24J00l63K99j65L1
7756G3j04J11j40k3J06j61L7M53l75M3Q6k40L6J76l1l8k4K00k11O9j24P1K09l45
7780a46n1K11j79K47J06p1k64M87j06m92K12P3J34k60M12m09J17k03K52O1m5l1
7802E5j95K10J0j73k2L05p9j03J33o0q5k06K94J07k05nk9m9n9q1K44J74pk70K38
7827A42m7l04K98k33J36q1L27k06P6j40j81J72j26O5J86l61R2L46j27p1J40j86
7849h3k5l1K01j4O6j5k13L13l39K37K19l99R7j24p9j1L97k31L1l01K93k1J57j80
7873e5N5J16l91N16n3k00j03l8O2n9J96N8m4P1n0J11j60o4j53K47j92P6o7N0l
$$ plain form
7709 193 -37 32 -4 149 -70 151 127 15 -23 -88 -19 15 281 -108 122 160 -187 144 149 155 -108 -20 -214 47
7733 47 -131 -138 216 6 185 -59 -121 -16 268 -33 -102 -210 110 41 141 -50 -53 171 271 -92 207 42 73
7756 73 -31 80 -60 -83 23 -138 -101 352 -23 20 106 -134 -98 78 47 9 -15 185 -26 43 -81 -10 199 -146
7780 -146 -197 14 -165 82 188 117 -147 340 234 -258 -46 27 161 -99 313 -96 21 -182 70 131 86 55
7802 55 -140 70 80 -93 -115 190 111 8 141 81 -4 -210 84 191 -14 -19 -48 -97 -156 -237 7 181 174 -96 142
7827 142 95 -209 89 -144 -8 -89 238 32 108 -32 -213 -41 -167 -102 84 -277 -185 161 34 -37 103 -83
7849 -83 -108 -139 62 48 114 99 -114 199 -140 97 316 -83 14 -110 -189 -200 197 -34 -3 -304 -11 -32 125 -55
7873 -55 0 116 -275 241 188 -12 -115 -153 -91 -150 46 104 60 131 81 192 32 -32 -185 62 -130 -54 -121 -71 -74
7898g4J81k5j67K16k38J64q7K29j60P9L5p5J44j14j64J14j58J32m5j93J86J21
7920A01r5j50M2p7J95k77J99r4K1J80j1R1O1l16Q4kj26J91Q1Q9l64P2J70J68m36
7945b03K60j01O7p6j49K22j32Q2K37n19L25n4o2J82J3K8q0Q2k01J15kK56l11K9
7969HK13j87L0K97k18J88k61r6m8J0M7l9K22Qj29k83J69J63m6m6J54q2o1k07K52
7994E8p9l75L52J6k73K71k31K63K17k93j20L03k94L76N1k90J82j90K16j65R0k22
8016a37n8L32K9k66K9j7J71q7K3K00k68J70j32m7L52l66L5MJ17K46l78J92j55
8039a1o2j01K70m23L53Q8Q2P3j30n8k45J84m9OJ94k03l1jm4k0R1O9J3NJ3k0P6
8066A19m07L55M3J04j46j4Q0k10J64J75l64J51l5J20j30L35o00L26J27j46m0r3
$$ plain form
7898 -74 107 82 -85 131 -107 57 -30 199 39 118 153 78 222 108 -56 58 -100 32 -13 -206 -20 101
7920 101 6 -144 -102 -179 16 -261 -62 -156 -135 45 34 125 186 -130 -46 -48 -174 17 98 187 -177 -105 65 233 -203
7945 -203 57 -44 23 -53 -202 20 -112 -30 207 -312 13 -41 -103 79 92 120 40 122 -79 36 34 290 -21 8
7969 8 221 34 64 361 143 331 70 -26 -74 -64 -17 -56 166 174 45 -238 -69 94 48 2 156 74 13 -194 58
7994 58 -21 -396 -44 -28 -301 -30 -261 2 219 -74 -194 109 -185 191 242 -48 134 -56 160 -5 85 -137
8016 -137 -195 137 166 -100 -71 -88 83 -4 19 219 -49 121 -11 -58 294 -72 -37 -33 84 330 -48 144 -11
8039 -11 -73 -174 96 -327 26 114 196 269 139 81 -164 20 -29 -23 171 -32 -63 -64 -108 -128 -37 32 45 50 63 43 119
8066 119 -288 67 110 214 68 54 134 -76 88 263 -101 50 15 135 5 340 -260 66 193 47 7 -86
8088h6L35k17j49L97l78O1J92j63j30K53j7p8k0k2J32j31K96j04lr1lr1j17k6
8112a60j84L72J25k29j66K60L8M0R7O1k77N1k18K66j20K70l72M10J9m12L30k62
8134f1J72j73J44P2J9k97J25m5kJ98k57O5l6P6Q7R1j55nm9j12L4l2R2N6P3j05
8160b5K5L8j25K14j49N4j33R4O1J33J39o60L60L8M8R5q9k84M9P7J41r8o0J19l45
8185b83K76O0r6j1Po7
$$ plain form
8088 -86 249 32 -117 280 -98 -37 155 -8 -138 115 98 20 0 -22 110 -21 275 171 168 77 74 -17 -134 -160
8112 -160 -344 28 153 -76 -242 18 56 96 193 254 -23 28 -190 76 -44 226 -146 264 283 -129 201 -61
8134 -61 111 -62 82 154 173 -124 1 -44 -46 152 -105 -40 -76 0 87 178 23 18 -31 -143 -109 -141 -49 7 80 -25
8160 -25 0 38 -87 127 -22 32 -101 -7 54 187 326 -334 26 64 112 207 118 -166 -117 -40 101 3 -57 62 -283
8185 -283 -7 53 -43 -54 -47 -114
8191a14
$$ Imaginary data points
##PAGE= N=2
##DATA TABLE= (X++(I..I)), XYDATA
0@%%%%%%%%%%%%%%%%%qJ6j6J6j6J6k3L1l2L4m2M8n6O5p3Q3r2J05j19J34j51J68
39H8j86K07k30K56k83L11l42L80m19M59n07N59o15O77p50Q30r17J018j134J270
59F72j430J622j861K163k557L098l889N160p526J3360n4013p9145J21533P9978
73G7165m6658p5441J7235N9461J080m1206J5796J7961k2974p943J7195R761Q013
86B9445n420p437n618r761J5486K3779k5805k4745J2862R728M460J0249p582k1748
100b107k2082J4288M7206j1207o5064j054N1747J4299k8974k4660J3362J8484
112D238k2338q612K6238m524k2683N423J5234Q220o972j5167P095N925r668R063
126h528Q031r406K928M325l008J1634O213r826j2383p239K5673K7788k9932l0321
$$ plain form
0 0 0 0 0 0 0 0 0 0 0 0 0 0 0 0 0 0 0 -8 8 -8 8 -8 8 -15 16 -16 18 -24 24 -32 33 -40 43 -49 56 -63 71 -80 88
39 88 -98 109 -121 135 -148 163 -179 201 -218 241 -266 293 -322 355 -395 435 -482 536 -598 672
59 672 -758 864 -997 1166 -1391 1707 -2182 2978 -4548 8812 -45201 -124346 -2813 77165
73 77165 30507 -44934 -27699 31762 32842 -8364 7432 25393 2419 -5524 11671 21432 29445
86 29445 24025 16588 10970 1209 16695 40474 14669 -10076 2786 12514 16974 27223 19641 -2107
100 -2107 -24189 -9901 37305 26098 -38966 -40020 11727 26026 -2948 -27608 -14246 4238
112 4238 -18100 -26712 -474 -4998 -27681 -22258 -7024 1196 -5776 -20943 -13848 -7923 -17591 -8528
126 -8528 -497 -9903 -6975 -2650 -5658 5976 12189 2363 -10020 -17259 8414 36202 6270 -24051
140b4051K7256L1204q560k8740p083K7256M448k7536P320K3811j0371j7234K425
153A45J5736P484k3298j5684J8725P006q728L40k346J89L114r013J452P651r272
168f499p724l21M554J7837j340k6044n74J9795N073j0127j4806M650J8783o863
182c606r749J7244N283j5642p571P712J8266r31k5700M47K4085M840o465o473
196A740l166R540o47r816P315N767n865j820j715O720J2846j2262j7390N614Q899
211E760M347m219j2065N482R601q284n08N699q491o483rO053J0709q211j3777
226a4396R547Q044m483l400n577J015O725n188j33R733k482l940K34k243Q096
241A552K173j2287p15Q874L150M486m216o282P030K26m153N787j944n832L088
$$ plain form
140 -24051 3205 34409 25849 -2891 -9974 17282 21730 -5806 1514 25325 14954 -2280 145
153 145 15881 23365 67 -15617 3108 10114 1386 1726 -620 -431 2683 -6330 -4878 2773 -6499
168 -6499 -14223 -14544 -9990 7847 6507 -19537 -20111 -316 4757 -5370 -20176 -15526 3257 -3606
182 -3606 -13355 3889 9172 -6470 -14041 -6329 11937 11006 -14694 -14247 9838 14678 8213 1740
196 1740 -1426 8114 7467 -2349 4966 10733 4868 3048 1333 8053 20899 8637 -8753 -3139 5760
211 5760 10107 5888 -6177 -695 8906 622 114 5813 -2678 -9161 -9170 -3117 7592 -619 -14396
226 -14396 -4849 3195 -1288 -4688 -10265 -9250 -2525 -7713 -7846 1887 -595 -4535 -4301 -6544 1552
241 1552 3725 -8562 -9277 -403 2747 7233 3017 -3265 3765 3991 -162 5625 3681 -2151 937
256I37K719O112L188j2691k358R772j996l008o51k624N349Q06o053O234K187q911
272i88j697n57J646O628o333o506P382J494j342O48o304l18L732n008K758N843
288A078n271j459K028M33N840m367r733N905N855k935J753j585Q03O185m930k412
304b812O331k514l072J933n30O274L359r086M25N288j669J060k846m218O572R40
320E435m177M695q8m046R81k879R46M853o364l564N975j2K80N17o626J815K809
337E50m963J664J504l628L271J11k862N223j984n254K880o78j01M116l428q44
353d423N118k594P66K775m808O83K785k948L947J582m310L350J417k937L408j570
369B241l602L978r8j465M446k773j665M202k896n29J684l814Q82K942l561K259
$$ plain form
256 937 3656 9768 12956 265 -2093 7679 5683 2675 2024 -600 4749 5555 -498 5736 7923 -988
272 -988 -2685 -3242 -1596 5032 -1301 -7807 -425 1069 -273 375 -5929 -6247 -2515 -7523 -4765 1078
288 1078 -4193 -5652 -3624 -3191 2649 -1718 -11451 -5546 309 -2626 -873 -2458 -1655 4530 -400 -2812
304 -2812 3519 1005 -2067 -134 -664 5610 8969 -117 308 5596 3927 4987 2141 -2077 4495 5435
320 5435 1258 5953 5865 1819 2800 -79 867 5720 -644 -4208 1767 1755 2035 2552 -4074 -2259 550
337 550 -4413 -2749 -1245 -4873 -1602 -1491 -4353 870 -1114 -6368 -3488 -4166 -4267 -151 -3579 -4423
353 -4423 695 -1899 -1133 1642 -3166 -2483 302 -2646 1301 2883 -1427 1923 3340 403 3811 2241
369 2241 -1361 2617 2519 1054 5500 2727 1062 5264 2368 1839 3523 -291 591 3533 -28 2231
385B231J366l939K008n18l655L691p56m650L311j78q41L786l980k164M062k566
401b792q22K624l396J442K906l767K141K661m219J236R24k704L860q15k705M577
417A151k46j768L025k066p74L674l689l80M336k044L68K035l262J949J843m673
433e21J647J613k411K456n24k693M173p00l155K006j502j237L015l223m93L992
449B443l285NK069l222R37J041l794K492J447l657K418O38k748L186j580k719
465d329M254j403j864L241j934K49L520l298J04K878k876N31J970k916K885J576
481B588l681K588O22k329L297j063l006L462r48q23L261k361j067K968k463m12
497F33K401l199M76K179l104J778J217l533K196k22k860K420m30k212K722j300
$$ plain form
385 2231 3597 -342 1666 1148 -2507 1184 428 -4222 -911 -1089 -1930 1856 -2124 -4288 -226 -2792
401 -2792 -3614 -990 -4386 -2944 -38 -3805 -1664 997 -3222 -1986 -1062 -3766 94 -721 -3426 1151
417 1151 905 -863 2162 96 -678 2996 -693 -1073 3263 1219 1587 3622 360 2309 4152 -521
433 -521 1126 2739 328 2784 2260 -433 3740 3040 -115 1891 389 -848 2167 -1056 -1549 2443
449 2443 -842 -837 1232 -1990 -1053 -12 -3806 -1314 133 -3524 -1106 -468 -3216 -30 -1610 -4329
465 -4329 -75 -1478 -3342 -101 -2035 -1786 1734 -1564 -1460 1418 -1458 -927 1043 -1873 1012 2588
481 2588 -1093 1495 2117 -212 3085 2022 -984 2478 1530 707 3968 1607 540 3508 1045 633
497 633 3034 -165 311 2490 -614 1164 2381 -1152 1044 822 -2038 382 -48 -2260 462 -838
513h38j726L291j949j048K195l033P8L380k691K37J532k122K372J013m626K295
529a640J976k356J861r00j089M278j967j941L716j240j748K706j768M00K557k856
545a1Q36K539k970J269J219l087K176P01k764K260K55k114K269j885j115L720
561C298k686k555L368j349j90J285l249J421K243l986P94J691k635J165P20k160
577b825J938J17k210K791j393j755K879j177j039K875j842l38K682k192N72J479
593E62k607K047J774l441J690J911j654J531q41j613L663q73k368L020n22j661
609F18K417j390j66J833l176P88K335l063L76J609k176J412o8k802K577j76k486
626a538J659p71j288K909j884j868K646j174o98J083k330J317J905l383R90K084
$$ plain form
513 -838 -2564 727 -1222 -2270 -75 -3108 -3030 350 -2341 -2104 -572 -2694 -322 691 -3935 -1640
529 -1640 336 -2020 -159 -1059 -2148 2130 163 -1778 1938 698 -1050 1656 -112 288 2845 -11
545 -11 825 3364 394 1663 2882 -205 1971 2672 -92 2168 2423 309 2578 693 -422 3298
561 3298 612 -1943 1425 76 -114 1171 -2078 -657 1586 -2400 -1606 85 -2550 -1385 -665 -2825
577 -2825 -887 -770 -2980 -189 -1582 -3337 -458 -1635 -2674 201 -1641 -1979 703 -1489 -917 562
593 562 -2045 2 1776 -1665 25 1936 282 1813 972 -641 3022 2149 -219 2801 2279 618
609 618 3035 1645 1479 3312 136 924 3259 196 572 2181 5 1417 1349 -1453 1124 948 -1538
626 -1538 121 -650 -1938 971 -913 -2781 -135 -1309 -2007 -924 -3254 -1937 -32 -3415 -2425 -341
642c41j868P61M15j546K241k61k578L171L69k170K291p44k07K578k576m25L343
659B453j611l28J681j805J268J641k881R68J590k010J088l42j820L046k46l036
675c44K051k61j023J228j888j27K306k896k96K729j927p45Q27j651J705m6l008
692c366K103J175k380J172p0j326K137j073j143K451j092j132K112j342P70K174
708A170k630R4K411j790J061P66k052K104L81k511K531R79k159Q71l64R9K535
725C496k415j312K888p32j023J266j631L80R95k554J333J772k718L56P56j850
741i93K124q44k157J619o6j420J908j463o46K002k000n01K522j613q09J265j212
758b284J601J001l113J262J776j732J129J68j392K083p68j136K938o40j537J862
$$ plain form
642 -341 -2209 -1448 -1033 -2579 -338 -599 -3177 -6 363 -1807 484 -260 -467 2111 -465 -890 2453
659 2453 842 514 2195 390 1658 3299 418 1386 2976 966 2054 1712 -108 2938 2692 -344
675 -344 1707 1446 423 1651 -237 -364 1942 -954 -1250 1479 -448 -1193 -366 -2017 -312 -358 -3366
692 -3366 -1263 -88 -2468 -1296 -1366 -2692 -555 -1628 -2771 -320 -1412 -2544 -432 -1774 -1004 1170
708 1170 -1460 -1366 1045 -745 316 1082 -970 1134 1515 -996 1535 2514 355 1226 862 961 3496
725 3496 1081 -231 2657 1925 902 2168 537 917 1912 -642 691 2463 -255 101 857 -993
741 -993 1131 287 -1870 -251 -317 -1737 171 -1292 -1938 64 -1936 -2437 85 -1528 -2337 -1072 -2284
758 -2284 -683 318 -2795 -1533 243 -1489 -360 -192 -1584 499 -269 -1405 1533 893 -644 1218
774A218j141M62K144k384r3J935j173L44J103k359J362N72k154J753R17k335J063
791A234m39p84K212j529j995K324j004m15J330j798J62J133k304N92K037k347
807a591K4O20j210J814r8k141J759K43j606J669p53n35J961j370l06K326j429
824f23o39J519j288J198J227k526J021J311j305J161M00j530J551l13j375K285
840B074k78j485J210q34K63J775j948p07J718j543J92J111j775P32N02k240J566
857C33P90j992O57J9j429K003q74j608J862n55r77K047k065J8J667j929Q04J493
875B64k076O00P16j288J647K65j763J544L66j364J722n67o76J464n42n91K413
892B134j661l97J532j323N99J536k023N72J023j577R02M29k062J568J04j628K135
$$ plain form
774 1218 77 539 2683 299 206 2141 968 1312 2415 56 1418 1990 -164 1589 2506 171 1234
791 1234 795 11 2223 694 -1301 1023 19 -396 934 -864 -702 431 -1873 -1281 756 -1591
807 -1591 -1567 -947 -2157 -343 -441 -2582 -823 -580 -2186 -517 -1270 -1805 156 -1214 -1520 806 -623
824 -623 -1262 257 -1031 167 1394 -1132 -111 1200 -105 1056 1456 -74 1477 1164 -211 2074
840 2074 1796 311 1521 687 950 2725 777 70 1788 245 437 1548 -227 505 1007 -1233 333
857 333 1123 -869 -212 -193 -1622 381 -493 -2101 -239 -794 -1771 276 -1789 -1771 -104 -2033 -1229 264
875 264 -1812 -1212 -496 -1784 -137 128 -1635 -91 275 -1089 633 66 -610 854 312 -279 2134
892 2134 473 76 1608 285 884 2420 397 969 1992 415 1317 1746 -316 1252 1356 -272 1863
909A863o90j442J326p71n68J827j673j005J710j237L26P73j832M72Q97j888J112
926h00J033j994P19L01j129J775n04j516J809p08j64J694j297k80J732j499J26
943g02J616j462K96J245j682J463O91k001J378O20j724J989l63j225J269p31o06
960G1K054j316r11J639j222K23J287j913J80J160j700J196L18j891P51L50j462
977a186J551Q8j552P49m05l69J437j011r01J719r99k57J581j612j07J105j278
994a447Q91R53j646P92J69p92J821l41j329J610l75q61K167j159p57J547j087
1011A56J15J601j753K43J159j551Q76Q10j694O20N04j378R55M02j616J317k6j365
1029f25J728j026r12J479j306rJ444j645l86J476j562N40J091j986R18P16j688
$$ plain form
909 1863 1173 -269 1057 286 -282 1545 -128 -1133 577 -660 -334 439 -1393 -921 -24 -1912 -800
926 -800 233 -1761 -1042 -741 -1870 -95 -599 -2115 -306 -1014 -1178 516 -781 -1061 671 -828 -702
943 -702 914 -548 -252 993 -689 774 1465 -536 842 1462 -262 1727 1364 139 1408 677 71
960 71 2125 809 -102 1537 315 538 1825 -88 92 1252 -448 748 1066 -825 -74 276 -1186
977 -1186 365 453 -1099 -350 -755 -1124 313 -698 -1599 120 -879 -1136 445 -1167 -1274 -169 -1447
994 -1447 -556 397 -1249 -457 -288 -1080 741 400 -929 681 306 -555 1612 453 -304 1243 156
1011 156 271 1872 119 362 1521 -30 846 1656 -38 582 1086 -292 663 1065 -551 766 740 -625
1029 -625 1103 77 -835 644 -662 -671 773 -872 -1258 218 -1344 -804 287 -1699 -781 -65 -1753
1046a753J632Q3j288J143l35q10J882p32j073J495q11MJ413j378L0J442j382M30
1064hJ106j367N28Q36j448J108M56j639J520j46j091J619o17j159J558r70m07
1081a21J479j367K14Q90j294J79R80j609O73N56j446Q59J54j355J297l41j048
1098a300J202m97o49J120p18m75J904j493k50J536j422N46Q70j426Q49N93j923
1115a533J312P41j364J159l9q66J449m19r78J312l87n15J415j267N4J596j561
1132A09K28R98j249O59M06j226Q01M52j626Q71K66r75J212n09j021J508r24o13
1150f33R98p18j41J196j677M03J189j640N60N68j468J169L98j728J543J31j456
1167a306J388n25r13J575p54n11J421m53p08J356j005K98R56j113M86P21j143
$$ plain form
1046 -1753 -121 -38 -1326 -183 -518 -1328 554 -178 -1251 244 -567 -563 850 -528 -498 944 -438 -8
1064 -8 1098 -269 259 1095 -353 755 1211 -428 1092 946 -145 1474 857 -302 1256 286 -121
1081 -121 1358 -9 205 1095 -199 -20 960 -649 24 580 -866 -7 147 -1208 89 -252 -1300
1098 -1300 -98 -595 -1244 -124 -842 -1317 587 -906 -1156 380 -1042 -496 374 -1052 -203 390 -1533
1115 -1533 -221 520 -844 315 276 -590 859 440 -538 774 387 -128 1287 20 74 1670 109
1132 109 337 1335 86 745 1151 -75 726 1178 -448 423 689 -286 926 417 -604 904 -20 -633
1150 -633 365 -353 -494 702 -975 -572 617 -1023 -463 105 -1363 -194 204 -1524 19 150 -1306
1167 -1306 82 -443 -1356 219 -535 -1046 375 -78 -786 570 -435 -137 819 -294 192 913 -230
1184b30P78N78j488J138J96j150J420k82j275J274j56q28J220j102OQ02j011M3
1202f7Q53j360M93P74j400Q30L05j305O64M64j485J203m08j055J531q4j069R78
1220a38o43l35J063j007K14J038j059L01J293j682O66M59j211J275M42j544J217
1237C49J84p64R53k00r00J361o04o43J398o73l50J156j426M70Q94j588Q98N89
1255A104j094O39J56j141Q80j05j277J479m35j006J329r66m72J321q88k44R25
1272B05j137M16P82j464O50O40j139Q05M51j148O89Q8p88J125k01o83J170m94
1290c3o39J141m09n44J343r59n0R76r68K64N58q02N03O19j250J069M9j032J015
1309H51j20r61J223o17n92J051p52k35J010r25j42R00j094K61P49j229R45l4j228
$$ plain form
1184 -230 548 1126 -362 776 972 -178 1242 960 -315 959 803 -25 1195 93 99 901 -110 -67
1202 -67 786 -574 -81 693 -707 123 428 -877 -213 251 -1234 -31 -439 -1494 37 -47 -1116 -138
1220 -138 -781 -1116 -53 -1060 -846 192 -867 -566 727 -955 -289 170 -1041 234 676 -868 349
1237 349 533 -231 722 522 -378 983 379 -264 1134 461 111 1267 -159 311 1205 -383 515 1104
1255 1104 10 649 805 -336 544 439 -838 641 206 -800 529 -437 -909 412 -476 -720 205
1272 205 -932 -516 266 -1198 -548 92 -1047 -242 209 -939 -250 -162 -950 175 -26 -709 461 -33
1290 -33 -672 469 60 -484 859 -100 -150 826 -142 122 680 -122 381 1000 -250 819 868 -164 851
1309 851 731 -230 993 376 -216 835 83 -152 858 -67 -209 691 -403 -142 607 -622 323 289 -939
1328i39P37L13j236J228l13q94J078l72o50J248o03o24J323r61J9J072j085M12
1346b47K94r99Q52P14j186O20L26r32J150j01q70J143m36m24J191p73l80J205
1364A147j332J36R40q26N78J95j084N14N04j118M20N49j286J122j06r31R43m88
1382a23n60J116m54n23N50p26rJ016j083J5J089j192M78L46r23N63M10j047J094
1401C7N5j019J189m48m68J156m57o38J313p95j47J402j045j39R93j200N54N74
1419I17j245Q58L12j070J101r5j291J542n80p04P85j02o45J090p54n65J300j310
1437d56J32Q79j351Q72K39j091O46J23j112J067J01j065J163m55p24Q92k84m1
1455d65O79p37K5J065j088K35M78p73K15R14j041O37J47p12J066j26p28O62J5
$$ plain form
1328 -939 -202 111 -1125 103 -210 -1104 -26 -398 -1048 200 -403 -1027 296 -665 -646 426 -659 -247
1346 -247 47 -952 -100 614 -572 48 374 -558 592 491 -379 764 328 -96 1095 322 -58 1147
1364 1147 -185 -49 891 65 643 838 -246 268 772 -346 74 623 -663 459 353 -578 365 -123
1382 -123 -683 433 -21 -544 6 -720 -729 287 -796 -781 308 -884 -406 -60 -983 -420 -10 -1057 37
1401 37 92 -927 262 -186 -654 502 45 -593 720 -75 -222 1180 135 -4 989 -211 343 917
1419 917 -328 530 842 -228 873 778 -513 1029 449 -255 530 428 -217 873 119 -446 854 -456
1437 -456 -324 555 -796 76 315 -776 -130 -7 -1119 -52 49 -1016 147 -308 -1032 -140 -424 -465
1455 -465 214 -523 -498 567 -521 -286 192 -581 -366 548 -493 144 291 -421 645 519 -209 453 468
1474D68p10J111n24n23R90n45l33J120j079m7Q13p20K94O23j315N91J95o82N89
1493C16K76r56N92l37n11R79j17o76N88n77j48Q42q29r0J069j295M59N12q77L64
1513d16N23q22P84j42p39P05K38n30N88q3q18J557q60l18R98r42rR81q96K64P81
1534H44j020K90L82o47M77K68o71Q19m89q63J416n84n83P39k57k91Q12o59k19
1553b36R86j296K04P14q82M73N95p78J99k00m79K77M10q03R59k62p02Q75n12j72
1573f30P92l73l39O85l88j79Q09p98L40O12j077P09L1o34P72K11j003R16j25o56
1593c25J172o24l55Q32n58k14P60n57j64N86o57K43M99j071L20O85j256J004J45
1612D65j022R11m28n00Q71l57n20J052r73j60R57o11j3O60o50m4O52p34J60M15
$$ plain form
1474 468 -242 869 345 -178 812 267 -66 1054 -25 -72 741 21 315 938 -377 214 409 -273 316
1493 316 592 -364 228 -109 -620 359 242 -434 154 -423 -571 271 -558 -648 421 -874 -415 97 -780 -416
1513 -416 107 -715 69 -73 -812 -107 131 -399 189 106 -712 845 -15 -333 665 -277 -286 695 -201 63 844
1534 844 -176 114 496 -151 326 594 -77 742 253 -610 806 222 -361 378 121 -170 642 -17 -236
1553 -236 750 -546 -342 372 -510 -37 558 -220 -21 -221 -700 -423 -13 -816 143 -119 -821 54 -458 -630
1573 -630 162 -211 -550 135 -253 -432 377 -421 -81 531 -546 163 194 -440 332 543 -460 456 331 -325
1593 -325 847 223 -132 700 142 -72 688 131 -33 553 -104 139 638 -433 -113 572 -684 320 465
1612 465 -557 354 -74 -574 297 -60 -580 472 -501 -661 296 -315 -328 332 -318 -362 290 -444 -284 131
1632A31p63M70J52n15M03J29o70J113n34l38J112q54K64L93m82P2N80n73oN20
1652F04p75M93K92p64L99R9m51N55k72m79P30l00n12R92p10r0P81p95P6M57n86
1673b56j77M69o55M93N81r05J82M66o56M93j76m36P35p1m33N67l57l39O28m54
1693c01k44J096q71O3P02q32K25O08o38L69L00q75Q78k11n89P12M2p07O43l51
1713A9r5N96l10j91L00m18j6N42n32K68L93q76K13O28p87K86K71n89N13j37n23
1734d45R13o41l86R02o22k51Q55o58j62O14m47rN53n34K9K09p30P18J86k28N27
1755C93k69o75R94m67l17N16l86L5P89r24K76O57m44k84N12n59K00L00n88K77
1775C6K20l99N01m5q19R38m68k08O88n16j52M95n44k43P12l84mJ75m25L33R3l35
$$ plain form
1632 131 -632 -162 -10 -525 -122 7 -663 450 -84 -422 690 -164 100 493 11 83 663 90 84 604
1652 604 -171 322 614 -150 249 348 -103 452 180 -299 431 131 -381 611 -99 -189 592 -203 -127 330 -256
1673 -256 -433 36 -619 -126 455 -450 -268 198 -458 35 -141 -577 158 87 -346 221 -136 -475 153 -301
1693 -301 -545 551 -320 -257 445 -387 -162 446 -192 177 477 -398 480 269 -320 392 434 -273 370 19
1713 19 -76 520 210 19 319 -99 -115 427 -105 163 556 -320 -107 521 -266 20 291 -298 215 78 -445
1734 -445 468 -173 -559 343 -279 -530 325 -333 -495 119 -328 -337 216 -318 -289 -80 -810 -92 94 -134 393
1755 393 124 -551 443 -24 -341 175 -211 -176 613 -311 -35 622 178 -106 406 -153 47 347 -241 36
1775 36 256 -143 358 313 -506 432 -36 -244 444 -72 -224 271 -273 -516 196 -188 -192 -17 -442 -109 -16 -351
1797c51M46K1o69M15J54l89L75J26p37R26n80q3N31n71K62L45l83m4O86n07J80
1818A53J79o07M80M3o08K76K01l30O09k65n04P93l84k89O58k87j87L34l85J18
1838bM53n12j05M46k19jQ0m37N08j15p76O99o5k39L61j62m10P64m10q5L75n69
1860d21J34O31p30J85M96m74L0Q1l49M95J23n45L87J93m75O46k46m92O84m93M3
1881i7O88n66J79J76n30M15K92p68K89M35q40N02J48p37O17L1m08L59j95j91P33
1902E32p93n6N93n62J29K11m47K65L72n51O0M20o74L57n3l80M86J41o00R66l90
1923B6m93P44n09m8M66k83j65P71o24j09O60r37Q19m3o60M91J35l68N29l16l75
1944b89M12p3j19M90n79P6K07j22k19O90n16q3O85p34k0N30q66O66Q3o04K89K00
$$ plain form
1797 -351 95 116 -553 -138 16 -373 2 128 -609 317 -263 -346 185 -386 -124 221 -162 -206 480 -27 153
1818 153 332 -275 205 248 -360 -84 117 -213 396 131 -373 420 36 -253 405 118 -69 265 -120 -2
1838 -2 451 -61 -166 280 61 60 140 -297 211 96 -680 19 -46 -285 76 -86 -496 268 -142 -227 148 -421
1860 -421 -287 344 -386 -201 295 -179 -149 -68 -417 78 201 -344 43 236 -239 407 161 -331 353 -140 -97
1881 -97 591 25 204 380 -150 265 557 -211 78 513 -327 175 323 -414 203 234 -174 185 -10 -201 532
1902 532 -261 -317 276 -286 -157 54 -393 -128 244 -307 -247 173 -501 -144 -197 -577 -91 50 -550 416 26
1923 26 -467 277 -232 -280 186 -97 -262 509 -115 -224 436 -501 318 275 -385 106 241 -127 402 86 -289
1944 -289 123 50 -69 421 -158 -82 125 3 -216 474 -42 -125 560 -174 -194 336 -530 136 219 -385 -96 104
1966A04n75N00J70p59O83l04j73N62l25m37P36o21K66K15m73L34L21p02N73j05
1986a0l35K07N8l03O02k22l30P04J40o08J58j40K7N98k80k34J87k45K70J04m74
2007a26K97K86r28N27K13n95N90j04j55O20m74m80M20l85K74L47q41M24L7l76
2027d29M42J12m26L60J00p53P90j56m14O24l40k51M00j1m14L83j50%K10m40L24
2048c9K03j40K6L64o34K24J42n66P20j48l17N64m04l3L67J53o28O67k34k81M41
2069D47o01J09M05o30O4N41n29J44L55p83N36o4j72L04j17o66P55J14p16N31k7
2090@l99O44l55j9K37n00l5N64k40l87M33m54O53J6n86N78J09m79M81n53q5Q28
2112D51l57k07K93m52K29K39l66K40L52n91J54L76m53J51K73o86N10K01o18N74
$$ plain form
1966 104 -471 29 199 -560 123 -181 -354 208 -117 -554 182 -439 -173 42 -431 -97 224 -478 95 -10
1986 -10 -345 -138 -80 -383 219 -3 -333 371 511 -97 61 -79 -52 546 266 32 219 -26 244 348 -126
2007 -126 171 457 -471 56 269 -326 264 160 5 625 151 -329 91 -294 -20 327 -514 -90 -53 -429
2027 -429 13 125 -301 59 159 -594 196 40 -374 250 -90 -341 59 48 -366 17 -133 -133 77 -363 -39
2048 -39 164 24 50 414 -220 4 146 -420 300 152 -165 399 -5 -38 329 482 -146 521 287 6 447
2069 447 -154 -45 360 -270 -206 335 -194 -50 305 -478 58 -6 -178 126 9 -657 98 212 -504 27 0
2090 0 -399 245 -110 -129 108 -392 -427 137 -103 -490 -57 -511 142 158 -428 150 259 -220 261 -292 -377 451
2112 451 94 -113 180 -272 -43 196 -170 70 422 -169 -15 361 -92 59 332 -354 156 357 -261 313
2132C13k40j0L90k39o04K85O2q8J73k02j60P44o58K25K11k20j17M59p01P53k13
2153A63l96J50K36l31K86k47k39N36m6l88M56k20k16O76m75K1K05l68L40K41n88
2174b04L28J76m66J84J39k60N63m27j21M57l01j60K33o8m15N88m72M70J4m27K3
2195a46M64j69r2J05q55Q69J70p84M21r4k58P56m54l11O96k97o6J03l14J57N38
2216D39r23M24J42n58M85J60l37k7L12k99N63m88n8N79m96J5K88o9j75J79j92
2237c6J21J75n08K35L51q11M92J40l61M94q9o72P52p7n21L53J4l03N24n22J63
2258h6L33l21j42K07k48L20J30o36M15J55k09J30J96o45N22j79l06K94J49J4J15
2279B08l31N3M93m54r4K83k89K31J61m93J21K66n85O19j41j21K16n8k59M21on95
$$ plain form
2132 313 73 63 453 214 -390 -105 -43 -131 42 -160 -320 424 -234 -9 202 -18 -135 324 -377 376 163
2153 163 -233 -83 153 -178 108 -139 -378 158 112 -276 180 -40 -256 420 -55 -34 171 -197 143 384 -204
2174 -204 124 300 -166 18 157 -103 460 33 -88 369 68 -92 141 73 -342 246 -226 244 258 -169 -146
2195 -146 318 149 57 162 -693 176 346 -438 -17 -111 -369 387 -67 -378 318 21 -45 58 -256 -99 439
2216 439 -484 -60 82 -476 9 169 -168 -195 117 -182 381 -107 -165 414 -82 -67 221 152 -23 156 -36
2237 -36 85 260 -248 -13 338 -473 19 159 -202 292 203 -469 283 206 -315 38 52 -251 273 -249 -86
2258 -86 247 -74 -216 -9 -257 63 193 -443 -28 127 -82 48 244 -401 121 -58 -364 -70 79 93 208
2279 208 -123 -70 423 -31 -125 158 -131 100 261 -232 -111 155 -430 189 48 -73 143 85 -174 247 241 -354
2301c54N17k49q1N65n18K14L24l70n7m1l04M65J13m50K57R4l27K14J60m57N04
2322B19l21l65O10m00J38J64m75L98K79m95J40K63l73L10J64l33K73n2l10M42
2342B76l97k45O25J6l15J80j99j69M78r5l81N39k33r4O40r73K73K41m58N37Q4
2363C30o59M36j5l94M21o0l37M52J29m70K30k65j11L55j6p2K56m12L9N00n02N6
2385a09Q1l14L03J9m12O05j27n66N81k08O1J42k11N4N10n96J31M88k95r3K43m21
2407a34R9M11p07L04J20k60J91j70J28j48K07k2p1L59k38j19j34m2N43n96q7L22
2429d4j63K05M1j02j19M30m78J64J33l18M29l88j98O53l57j85M24k56Q5J93j71
2450b2r9N91l81o7K87m43j34M14n89O03L22l54K28k31k70M44n9k86L36k66r7L48
$$ plain form
2301 -354 163 -86 -167 398 -120 94 418 48 -9 -50 -354 111 224 -226 31 125 -202 12 172 -285 219
2322 219 -102 -467 143 -257 -119 45 -430 -32 247 -248 -108 155 -218 92 256 -77 196 144 -166 276
2342 276 -121 -366 259 275 -40 140 -59 -228 250 155 -226 313 80 -14 626 -347 -74 167 -291 246 330
2363 330 -329 107 92 -302 119 59 -278 174 303 -167 63 -202 -313 42 26 -46 210 -202 -163 337 -165 -109
2385 -109 -28 -342 -39 -20 -432 173 46 -520 61 -147 -86 56 -155 -101 409 -187 -56 432 137 44 287 -134
2407 -134 -35 376 -331 -27 93 -167 24 -146 -18 -166 41 19 -52 307 69 -50 -184 -226 317 -279 -366 -44
2429 -44 -207 -2 39 -63 -182 248 -230 -66 67 -251 178 -210 -408 245 -112 -297 127 -129 -44 149 -22
2450 -22 -121 470 89 22 309 -134 -268 146 -443 160 482 128 356 125 -145 299 240 -46 290 24 -73 275
2472B75l88J20J31l21J39K56l62J45J77k31r6J76l86L49R8l64L13Qn05P27o15
2493c54l48O90k15M07Qn2k75M34o44M04J60m35O12j23n85K46L12l81L04q7k16
2514a38L82j90m35N15k21K89L3o05M39J93l43N1L46l79J69J74l72K91K54p22N21
2535B52k90l10L44M2k0L97n68j2K79k59M17Q3m42o0J63j12R9J99m68K70R4k83
2557a85K93j12k46M09N1k14J96o06K16M52o94K29N16o00K60J16k24K23J42m12
2577a90J6M43l42L15j51l95N49J8n86N66k57k37L72M4r2K67o50K06N57q29L18
2598e8k4J56QJ90m92O87l10m35L93l10qL76k09j83J65O1j36L99k29L50j9n87K08
2621gJ80l51J8K52o00O43J81m56L22k83k26N40j97oK28j91l79N58m40J37N64l52
$$ plain form
2472 275 -113 7 138 -183 -44 212 -150 -5 172 -59 -155 21 -365 -16 82 -282 31 39 -466 261 -354
2493 -354 -702 -12 -227 180 188 136 -139 295 -349 55 215 -220 392 269 -316 -70 242 -139 165 78 -138
2514 -138 244 54 -381 134 -87 202 235 -370 69 262 -81 -30 316 -63 106 280 -92 199 453 -269 252
2535 252 -38 -348 -4 38 18 415 -153 -165 114 -145 272 355 -87 -147 16 -96 3 202 -266 4 98 -185
2557 -185 108 -4 -250 159 210 -4 192 -414 -198 254 -440 -211 305 -295 -35 81 -143 80 222 -190
2577 -190 -174 269 -73 242 91 -304 245 263 -323 243 -14 -251 121 165 73 340 -310 -104 453 -376 -58
2598 -58 -82 74 82 272 -220 467 157 -278 115 -195 -203 173 -36 -219 -54 7 -129 270 41 391 372 -215 -7
2621 -7 173 -178 -160 92 -508 135 316 -140 182 -101 -327 213 16 10 238 47 -332 226 -214 -77 487 135
2643A35j48K63k80K67j21M1J04j16r1P9L8l52M77l92R4L69n18K12L07l40j69L08
2665A67m90L40K22n67L55J55m32L43j05j03L62k37k91K11RR0k4pj70L07m10M9
2687b26K45K44j74q1q5O4M84n99L43k23j74K28o0l11O71m43m0L42k03l89O65j33
2709A45k91L82k58O2L03m34N7O1k33J64L32m51K00O0j24J45k71J59M0n1j0L22
2731C09k90j85M22k65J8p3j63K72L22l90K70j57p8J78J24o67O17j23j57L44l72
2752d4Qj15J36J71o0k6N5r1k60N78k82P3r3K16l68J39Q8k80L7Q1J48L2lk54L0
2777h4l18L95K48j16m64L71j44O9M0l62N48l20o1N5R9N6L47m42r5Q8k41J65M8
2800a18M5l4L91m89j28L35l53L40q4k2J23M0k7N8K5r6LJ11k21J21R5l51N03o06
$$ plain form
2643 135 -13 250 -30 237 116 157 261 145 54 133 171 -181 296 -96 -2 367 -151 61 368 28 -141 167
2665 167 -323 17 239 -328 27 182 -250 93 -12 -115 247 10 -281 -70 -61 29 5 -2 -172 135 -275 -226
2687 -226 19 263 89 8 -77 -13 471 -128 215 -8 -182 46 -14 -325 346 -97 -137 205 2 -387 278 145
2709 145 -146 236 -22 40 343 -91 -34 27 -206 -42 290 -161 39 99 -25 120 -151 8 48 -3 -13 309
2731 309 19 -166 256 -9 9 -64 -227 45 367 -23 247 90 12 190 314 -353 264 141 -16 328 -44
2752 -44 -36 -151 -15 156 96 70 125 34 -226 352 70 143 50 266 -102 37 125 -155 -118 -37 111 143 140 -114 -84
2777 -84 -402 -7 241 125 -339 32 -112 -43 -3 -365 183 -137 -198 -143 -44 12 359 -83 -178 -90 -331 -166 -118
2800 -118 -73 -107 284 -205 -333 2 -351 -11 -95 -117 6 46 19 77 102 6 9 120 -101 20 115 -236 267 -339
2824c39K35L99l25k15N15k13J38j04J7j42J20l12J18K25l55O9J99k6j05J74j33
2845f0L38m33K7J56n03L58L43k62n5K13k27q7L30j86K95R1n37K29K02m85L94M2
2867A83l73M45k18p1M8k4R2j30j38J73Q0j68M5J33j96L38J17n04J80m8k70M25
2889A19q0r2N6N5k12J34Q3l04J28O6n7Q3J1Q4N9k94J58K97m74k6J63k50L08j96
2913a81L2P1Q8r5K30m08J27J29k25K40m5J0J85J1N7l09R4k66M30k2m10L92k12
2936g7J90j43K94m12L87j63j12J70l71J49J15l69J84M04m15N10n1m80J53J61j04
2957B0L97o23L07Kj39j35K65L8k51K72l22j32L95l68K76J40m87K37K29K9j84J14
2979H0l25M80k27k02J51K0j05L82k29m7J75j1kn6j39L1O7m8O7L6k75K15q7k12
$$ plain form
2824 -339 -104 295 -30 -245 270 57 195 91 108 -34 86 -226 -108 117 -238 -169 30 4 -101 73 -60
2845 -60 278 -155 -128 28 -475 -117 226 -36 -91 122 -105 -192 138 -48 247 338 -199 30 232 -253 141 183
2867 183 -190 255 37 -34 14 -10 82 -48 -186 -13 67 -101 -56 77 -119 219 336 -168 12 -36 -306 119
2889 119 39 -53 3 58 -154 -20 63 -241 -113 -47 -104 -21 -10 74 133 -161 -3 294 -180 -206 -43 -293 15 -181
2913 -181 -149 -78 10 -85 145 -263 -136 -7 -232 8 -37 -27 158 169 226 -83 11 -255 175 153 -257 135 -77
2936 -77 113 -30 264 -148 239 76 -36 134 -237 -88 27 -342 -158 246 -169 341 290 -190 -37 124 20
2957 20 417 -206 101 103 -36 -171 94 132 -119 153 -169 -301 94 -274 2 142 -345 -108 121 150 -34 80
2979 80 -245 235 8 -194 -43 -23 -128 254 25 -22 153 142 140 84 -55 -24 43 -5 62 98 -177 38 -49 -261
3003b61M46k15j68K62Q5n95L86N3n5K37m33J22J47L8N3J48m28J91j1j94M70j17
3025A61n07M62K4l5k8j17J07j33Q8l39O87m33j14L52p5l19L89m12L13o0J7PL01
3048C36o18L50n0j37J81j68J45K28m14PK16r9k95K26k08K81J71k57K8K81k10j63
3070a69K07J64l32L95o12K46J52j85L43m75J23J75j56J44L83o46J89K01j91K2
3090b2J97k18PK85l02K49k35JJ77K60m33J23r5kK51K36n64K84n92M77j24k20m7
3113c07M29k38J48J4j56L61l79J9j83L96j30J79j15m01N81m17L4K74m38L49K1
3134D1l19K19L19o31J92J99k78K00k8M2J8q1nJ83l96J85K92n73K40K75r9l24L34
3157EJ25n7J91l78K39N8l15K51p0q6r0L22k14J08K5k75K38n2J14n3k87R3L40l65
$$ plain form
3003 -261 185 -30 -198 64 149 -446 -60 -7 -62 175 -258 -136 11 49 102 250 -178 13 2 -192 278 161
3025 161 -346 116 140 105 77 -40 67 -66 22 -317 370 -63 -177 175 100 -219 170 -242 71 11 28 35 336
3048 336 -282 68 18 -119 62 -106 39 267 -147 -140 76 -23 -318 -92 -300 -19 152 -105 -77 204 -6 -169
3070 -169 38 202 -130 265 -347 -101 51 -134 209 -266 -143 32 -124 20 403 -243 -54 147 -44 -22
3090 -22 175 -43 -36 249 -53 196 -39 -38 139 399 -34 89 -6 -8 243 479 -85 199 -393 84 -40 -260 -307
3113 -307 122 -116 32 46 -110 251 -128 -109 -292 104 -26 153 38 -363 218 -199 -165 109 -329 20 41
3134 41 -278 -59 260 -371 -179 20 -258 -58 -86 -44 -26 -107 -112 71 -325 -140 152 -421 -181 94 -5 -329 5
3157 5 130 73 264 -114 125 183 -132 119 49 -37 -127 195 -19 89 114 -161 77 25 139 86 -201 -108 232 -133
3181a33L23l28K0j37J82j5K4J02Q1qj49r5L56r4j42l0p0K28K02l76j07M71m78
3204a73J95J85j91k20L23l77j8K22N9J87m5k63P5N9j32K48N4l2N8l61J93j68l20
3227d42L24L21k57J7K24l61J46K95m26J39K97q9kl92K00L84m33k11M22k9j85K39
3249A81k40K3N8P1J2q3q8J59Q1l08Oj47O6J06R4R7k23J25k59K85j2R5p1J20k71
3274a23N76n60J2J50n2O4J12l87N70n17j98L91M2r7J94jl51K46K3n9j70j33L34
3297F6J84l08L3J16j04j94M02r3m6K7r0k15J46R9k2j28K10K4l50J00R0K45m40
3320b48O95m24q9J34p4R2j42l8J62P9k41k2J37k45M63n1m65L90p6p8n3L00m14
3343b08N03l46J02J85k34k5J33l36K32K10m17L95M9m02N4j9J03J90m5n18M31J0
$$ plain form
3181 -133 190 -138 -118 -255 -73 -88 -64 38 119 111 -38 -133 223 129 -13 -43 -113 115 317 -59 -166 305 -173
3204 -173 22 207 16 -204 119 -258 -276 -54 5 192 147 -116 -41 18 -114 134 188 156 214 -147 46 -122 -442
3227 -442 -118 203 -54 -37 187 -174 -28 267 -159 -20 277 188 186 -206 -6 378 -55 -266 156 127 -58 181
3249 181 -59 -36 22 93 105 22 -66 93 174 -134 -128 -275 -209 -103 -9 88 -135 -10 -269 16 4 99 28 148 -123
3274 -123 453 -107 -95 55 3 67 179 -208 362 -155 -353 38 80 -17 177 176 -175 71 94 35 -135 -268 66
3297 66 250 -58 -25 91 -13 -207 195 102 56 83 -7 -222 -76 23 1 -127 83 107 -243 -143 -53 192 -248
3320 -248 447 23 -66 68 -6 86 -56 -94 68 147 -94 -116 21 -224 239 188 -277 113 37 -41 -94 206 -208
3343 -208 295 -51 51 236 2 -23 110 -226 6 216 -201 194 243 -159 -105 -124 -21 169 124 -394 37 47
3365D7j1P2k92J84J12k04R0J17j43Q9m8L9m8N2q8j95M02j38O1J80l17L00j16l81
3389b36L19j08j14j4j61O9K08m4m7L69l61J16l8J9R5J51j68j31o9r8K19K19l14
3412a19K35j46j68J99j48p5R7r7j7L93m08J81m3J03J72k82K3K11k67L2K35k52
3434a41K97j04n2k4J80j80j55J83J4K6o4m3R9j36N2J24J14q3p8l0m4J54k42K43
3458A10K0k32J28k4o9J8J30j30k34J88J49J6j74J97L7j89J94j70J8k61L40l11
3480b49J30L13n11K02K47k12k8Q2k07J10R8j73P1M61l69J19m8l38K08J98j12j06
3502a14n0j9J76K36j58j13k0K34N6k46K20Qj08j09J11r5P4J25l20J75rk06K08
3525E6r0n0K06r9k03K81Nj57K38j45j71J10k72L36q7K18j05k9j79K76k28K04K9
$$ plain form
3365 47 36 108 -184 0 112 -92 -2 115 -28 61 13 52 4 56 -32 -227 175 37 98 278 -39 261 145 -236
3389 -236 83 -25 -139 -153 -314 -245 -37 -81 -128 241 -120 -4 -42 -23 72 223 55 -76 -145 -243 -24 195 -119
3412 -119 116 -30 -198 1 -147 -222 -125 -222 -239 154 -254 -73 -116 -13 159 -123 -100 111 -156 -124 111 -141
3434 -141 156 52 0 -24 156 -24 -179 4 18 44 -20 -63 36 -100 -48 76 190 107 29 -1 -45 109 -133 110
3458 110 130 -102 26 2 -67 -49 81 -49 -283 -95 54 70 -104 93 130 -59 135 -35 -17 -278 62 -249
3480 -249 -119 194 -317 -115 132 -80 -108 -26 -233 -123 -25 -198 -127 334 -35 84 36 -302 -94 104 -8 -114
3502 -114 -164 -183 -7 229 71 -42 -62 172 228 -18 202 210 102 -7 104 9 83 208 -112 63 54 -152 56
3525 56 -34 -84 122 23 -180 101 106 -51 187 42 -129 -19 -291 45 -42 176 71 42 -137 139 -89 115 144
3548A44rp9n0N9k2M48n77K54j58l35M57j06K3J35k03j25P9P2o6J21J75l97P3J86
3572I9k33Q1K83j85n6J62k68K35k5j36N1O9k97L52l7k73K31j94N3Q6j68J89r2
3595g3%M06k28j99J84q9o5J37k40P8J55J01m22N63n46L33j55J15o9L89l35M2q9
3618gJ0K43j05l44P7J58J62P1l01J50j07O2o2J17j34P3K96l16J19J15l67L4K02
3641A46m44N15j32j70P4O4j56J81l20J08P8q1J71L32n00K12n5K50k27l8j21K97
3663A84J21k50K9M3j84K8Q6mm5k36L74Nk29N0l5K53l3j92j02K81j1l15L46j20
3687D4K57j56O7j22j7k13j03L04j4k48Q3J06K44l61J11j65J20k0L03q9q0J18l4
3710A35k23J2M6j46L22k32N8J57j44j91L81j99q5J50j75K21k15o1M32k66J45l
$$ plain form
3548 144 135 56 6 65 43 491 -86 168 10 -325 132 26 49 184 -19 -144 -65 7 -59 62 237 -160 -87 99
3572 99 -134 -53 230 45 -11 151 -117 118 93 -43 8 77 -220 132 95 -178 53 -141 -88 -2 -170 19 -73
3595 -73 -73 333 105 -94 90 1 -64 73 -167 -89 66 167 -255 308 -238 95 -60 55 -14 375 40 82 -7
3618 -7 3 246 141 -203 -126 32 194 265 -36 114 7 69 7 124 -10 63 359 43 162 277 -90 -56 146
3641 146 -298 217 85 -85 -11 53 -103 78 -242 -134 -56 -137 34 366 -134 78 23 273 46 8 -113 184
3663 184 305 55 84 127 -57 -29 57 53 8 -228 146 151 -78 -28 -63 190 157 -35 -137 144 133 -182 164 44
3687 44 301 145 212 90 73 -140 -243 61 47 -201 -118 -12 232 -129 -18 -183 -63 -83 220 131 51 169 135
3710 135 -88 -76 -30 -176 146 -86 -28 129 -15 -206 175 -24 -109 41 -134 87 -128 -189 243 -23 122 119
3732A19J15k87L08l26k4J30J07l97K38R3k58L90l28o5j01J79K49k29n1j20M3J32
3754h3L31m51J96L7j95L00j23K7P4k52K46k15K12R0m53J57O0O3rj84K04J3j7Q8
3778A16k0j85L43r1k85P8m2k63K86nj05K55k31O4K99j87M9r7q8J17J00j69J18
3801E7j13j94M40Ol26J09k26M26l5m32L64L6N8k66M19l73j08J83M4%r7P1j81J49
3825A1l51N47k37p5K86j66j91K26K70m47M14j88k03J12j85J50K88j81j94L18m09
3846b05K40lj01L22k40l7Q1k59P4J73j95L82l13M48n42L81k72O9K78n33K04k2
3868g0j00P6L18k94J6J96l89L57n6k81K22j43J76J57k30K16rj83j32K89k21k08
3890b93M71k17M8p8J75NMR0q5n4q5J17l02p1L55j88j2M98m99K24J91j05JP1k80
$$ plain form
3732 119 234 -53 255 -71 -95 35 142 -255 -17 76 -182 208 -120 -185 -286 -107 142 -87 -138 -258 -215 -83
3754 -83 248 -203 -7 30 -165 135 12 39 113 -139 107 -108 104 194 -259 -102 -42 21 12 -172 32 45 28 116
3778 116 96 -89 254 163 -122 -44 -86 -349 -63 -68 -173 82 -149 -85 214 27 76 -21 -109 8 108 -61 57
3801 57 -56 -250 190 196 -130 -21 -247 179 144 -288 76 112 170 -96 323 -50 -158 25 69 69 -28 43 -138 11
3825 11 -340 207 -30 -105 181 15 -176 50 320 -127 287 99 -104 8 -177 -27 261 80 -114 204 -205
3846 -205 35 32 -69 253 13 -24 57 -202 -128 45 -150 232 -81 367 -175 206 -66 3 281 -252 -48 -70
3868 -70 -170 -94 224 -70 -54 142 -247 110 54 -227 -5 -148 28 185 -45 171 162 -21 -153 136 -85 -293
3890 -293 178 -39 9 -69 106 111 115 205 120 66 -19 98 -204 -275 80 -108 -120 378 -121 103 294 189 190 261 -19
3915a9J42j03P3q1J85m4k81J70j88J15j40J10L21l44k77K38J87l54K75n5Q4J35
3937A49n6k2j41O5j03J56l75L67J41j50j09J39m57M52o1O3K2k91J9J33K32j35
3959C8J82l44L17J8o3ol2j29J35J55l30jMM1qj34K23mj08M0k12O5M9K50k89L81
3985B38k64n0J36J48j57j65L7l1Q7l8l0J31J73k98N63m30j27J65L6k87Q9k2j3
4008a09L95j76q7N1o0J23j6l49K84m8q2Q2Ok21K33K2m4j58mJ19K47k35j70K43
4032D6J66k08J39N4j03%J23k64J25j69J69k59L5L52l7k81O22o61J89Q6j86P6J40
4055A54j53k91L29j39q8M75j24j11k2M6J95j29o1j0j57j72K94rO8j72j01J94J4
4078C0K28p5O6k96k2K56j51n4p5M6O1k32J29J72j98M5K10j20K1K44m59K10m4k27
$$ plain form
3915 -19 123 20 93 12 197 153 -128 42 -146 -31 -171 -61 260 -84 -361 -123 64 -290 -15 -70 14 149
3937 149 93 71 -70 -5 -108 48 -327 40 181 31 -78 61 -396 56 -5 58 80 -211 -192 -59 173 38
3959 38 220 -124 193 211 148 142 110 -19 116 271 -59 -60 -56 -15 -23 -157 66 62 -46 -6 -218 -153 -104 146 -143 238
3985 238 -26 -76 60 208 51 -114 -77 -108 -21 -59 -89 42 215 -83 480 50 -77 88 124 -163 -74 -96 -109
4008 -109 286 110 23 74 14 137 121 -228 56 8 -74 8 14 -207 26 48 4 -154 -158 -39 208 -27 -197 46
4032 46 212 4 143 197 94 94 217 -47 78 -91 78 -181 -146 206 169 -112 510 -151 38 124 -62 14 154
4055 154 1 -290 39 -100 -188 287 163 52 30 76 271 142 81 71 -86 -258 36 27 95 -77 -178 16 30
4078 30 258 183 249 -47 -69 187 36 -18 -93 -47 14 -218 -89 83 -115 -70 140 20 41 285 -174 36 -8 -235
4102b35K84k7M6M2j27j70K07O4K21o01M01j15M1j88J95r2j60J94J36j9j82M04
4124C19o17M15j3j60L18k96P6p4R3j69P2J94Jj69K0k28J55l7K96j54Lj46K32k41
4148a10j4L56k93M23jl79K9K11l35J7p7K7O6j51LN6L24l07J46k84L78q9N0l09
4172b63J69J17k13K83l04L34Q0k49Ol1m44O09k14k1J66J3m25M37j68Q9N9j25R
4195h6J96l40L38r0k79J43K74j76j18J36N7K03k03K0nj37K64jm09j48N95j63k13
4218a42K21j33k8Mq0l7L28l3N1j14p5K54k48l00K88K08j14J11oL9l98L9K61q6
4242A0R5k95K23n4j17L50o1j18j65J22L5L48m65N4K81j29j41j6L07l64J57l9R6
4265A14P4l91K60l2J34J26l60m6L43j73K42j44k78J40R8k77L11l44J19L49k88
$$ plain form
4102 -235 49 22 68 110 -17 -187 20 84 305 -296 105 -10 31 -157 38 -54 -214 -20 116 97 -85 319
4124 319 -298 117 104 -56 262 -34 42 -32 61 -108 -36 158 159 -10 10 -218 -63 -100 196 42 45 -101 131 -110
4148 -110 -124 232 -61 362 361 -18 11 222 -113 -96 -173 -146 -80 -231 -228 -172 152 -155 -9 -293 85 -4 46 -263
4172 -263 -94 23 -190 93 -211 123 203 -46 -40 -71 -515 94 -120 -141 25 38 -387 50 -118 -29 30 -95 -86
4195 -86 110 -230 108 18 -261 -118 156 -20 -138 -2 55 258 55 75 70 -67 197 196 -213 -361 234 71 -142
4218 -142 79 -54 -82 -78 -158 -195 133 100 151 37 -38 216 -32 -332 -44 164 50 161 155 194 -204 -165 96 10
4242 10 105 -190 33 -21 -138 212 151 33 -132 -10 25 373 -92 -38 243 114 -27 -43 264 -100 57 18 114
4265 114 188 -203 57 25 159 285 -75 -121 222 49 291 147 -131 9 107 -170 141 -203 -84 265 -23
4286b3o9M24m31J33L75m07K90k08j38O9m6j03J94j35R2J11j33j61R7J93l11K87
4308A00o7r2M1p8K4J62l49K21J95k61%J57l79L17J04k92L16J2l05J36J54l03L25
4331A38q9r5n6P0O2R6j89j26K28Q1On9k00O9k08K94J97l28M3J13J4q2K62m12K0
4356a51K43j18l2K07q6k80L31l85M40l65L37J6j59k42K24K19k37L69r2k92k7k1
4378a01r8J31P3k33M71j84Q1J12o39N78j20j9k18J15O9M3r0J40n9l13J28K07l5
4401C9j79J26J57l16K16j21j46J29N8J9k29j75N40j82q5k1K29j61J8J67kJ24j33
4424G2k41L13k37P6M7j90K93JQ2k04j24j9J25J77k52k2K47l63J17K81m06L73j51
4447em01M42j10J97q7N2j89J81m9j71K03j17K40K9j22k64Q7j47M11j11m15L92
$$ plain form
4286 -23 -92 332 -99 34 409 2 292 84 -54 15 -31 -134 60 -75 17 128 -5 -166 -69 124 -187 100
4308 100 33 -59 -18 -96 -72 90 -259 -38 157 -104 -104 53 -326 -9 95 -197 119 131 -174 -38 116 -187 138
4331 138 49 -46 -102 -32 30 126 -63 -189 39 120 126 67 -133 -64 -272 22 219 -109 -66 47 61 -21 241 -171 -151
4356 -151 92 -26 -58 149 63 -217 114 -271 169 -196 141 157 -2 -244 -20 199 -38 331 239 -53 -80 -101
4378 -101 -199 -68 5 -228 243 59 140 252 -387 191 71 52 -166 -51 18 61 -29 111 52 -261 -133 74 39
4401 39 -140 -14 143 -173 43 -78 -224 -95 -37 -18 -247 -422 118 -64 -149 -170 59 -102 -84 83 81 205 72
4424 72 -169 144 -93 -17 30 -160 133 134 216 12 -112 -131 -6 171 -81 -103 144 -219 -102 179 -227 146 -5
4447 -5 -406 36 -74 123 36 88 -101 80 31 -140 63 -54 186 215 93 -171 -84 -231 180 69 -346 46
4469D6J74l74M36k57j26r5O3K74k08j40K33k15J30k7L18j97k40L32j22L1K72m38
4491a30R7R7k08K40k07k43L64r4r3K42K14k70L45l46k68K95p8J01k32J98j05K45
4513A64k27k20K81q4M4J37J40l09R4k3j21r1K34l8k32K74L6k6K46j41k67K44q7
4536B8q2J58j52J90J52k40o1K22n39L11K29k80k4J57j19j22J33k09P5M26o35L71
4558a1K5m1n2j74K40J0J26j66L1j44K45j54J7LR9j83K20r0o5M36n42K29J12j07
4582F4j07K25q0k60J87k14L2M38j83j4J0j89mJ67k36K8Q23o80Q9O7j38L39j36
4605B28l23J27j1J57o5R7l72K34j12j37K96r4J38O6l84P0J40l22J83K53k07j63
4627b01M27l39K81k09K75K4k26k40P5L64l35lo9O7J73k06M7q9nK79k02K92l84
$$ plain form
4469 46 220 -154 282 25 -101 -196 -133 141 -67 -207 26 -189 -59 -86 232 35 -205 127 5 36 308 -130
4491 -130 -33 64 -144 96 -111 -354 10 -84 -177 65 279 9 354 8 -260 35 -43 58 -174 24 -81 164
4513 164 -63 -283 -2 -86 -42 95 235 -74 20 -3 -124 -215 19 -19 -251 23 59 33 279 138 -129 115 28
4536 28 -54 104 -48 142 294 54 -7 215 -324 -13 216 -64 -88 69 -50 -172 -39 -248 -173 253 -382 -11
4558 -11 14 -27 -79 -253 -13 -3 123 -43 -12 -156 89 -65 -48 -45 54 -129 91 1 -64 372 -170 59 171 64
4582 64 -43 182 102 -158 29 -185 -153 285 102 88 98 -91 -95 72 -164 -136 687 7 96 163 25 364 228
4605 228 -95 32 21 178 113 210 -162 72 -40 -177 119 25 163 229 -155 -85 55 -267 -84 169 -38 -201
4627 -201 226 -113 168 -41 234 258 32 -208 -133 231 -104 -107 -176 -109 64 -142 -95 -184 -189 90 -112 180 -204
4650b04K57k80N29l07l1J51M2k17j7K23k44J03k57L39K05m21k20J45L07L1j35
4671aq9K53K04o41K29K51L9l1l62j46J41L18k91K06K4j56mJ12m2M4l8J63K45m32
4695dn0L87l77Q3J56k12J68j58q3r9K11N3q9O3J19j47j0R3k80J81q8J34L0K1k37
4720a35j03M68o4m4rj29m4k3J04l04L18kl9J80J9l37K81k70J81j78J23K50n7o69
4744d83M87J11j49J37j65nJ09R3n16K74J27r8R5k5q6J45j20L00j07l48R2L50l80
4767a62J42P2l78M32m7j75J29K15l43K12k36p7K69K2j69O7j18n2N66m85J89r4
4789b1K4q5mJ13K34k16k7j27P5J06O0l3j25j31N8n4K01j8j65N9J66l2P4r0P2J01
4815B15k12j58J87L51m09K45k58K34l37L32k55J99n5m7k35K00K99o28K39O7R8
$$ plain form
4650 -204 53 -227 302 -5 -36 115 157 -60 -77 146 -98 5 -252 87 292 -129 -349 -204 103 134 -1
4671 -1 -90 163 367 -274 -45 206 245 214 -148 -294 -153 165 -126 80 104 -52 -56 56 14 58 20 183 428 -4
4695 -4 -54 333 -44 39 195 -17 151 -7 -90 -189 22 75 -14 49 168 21 11 104 -176 5 -83 51 81 102 -135
4720 -135 -238 230 166 122 113 -16 -60 -83 21 -283 35 33 -6 174 193 -144 137 -133 48 -130 -7 243 186 -483
4744 -483 4 115 -34 103 -62 -67 42 135 -381 -107 20 -78 17 -8 -94 51 -69 231 124 -224 -132 218 -162
4767 -162 -20 52 -326 106 59 -116 13 228 -115 97 -139 -216 53 75 -94 -27 -145 -197 369 -116 73 -21
4789 -21 3 -82 -86 27 261 45 18 -109 -34 72 132 99 -26 -157 -99 -153 48 30 -135 -76 90 58 132 42 114 215
4815 215 3 -155 32 383 -26 219 -39 195 -142 190 -65 134 79 32 -203 -3 296 -332 -93 -26 72
4836G2n3J22l4l3N7l15L79q8l1l1m3L7l9L0r0O3J29k74K21K65k84j42k2k29L58
4861B5O2j1k02J28n2J46j45L18n3l02J50m0l2R8k6m47L19j73J32J65J09j58q0
4884f9j1N8J43k33K07m3o5J42k37l2R6j0j99K95j35J95j2j28P5j5k3k42K8K25
4908A0l9l5J25k12K71P8r6R5q9m6n2j56L40J48k39l26R1k2L4Pj07M78k44P2M7
4933A33k47L96j95k28J9L25k44R2r5q3N6Q0J28r9L2J96j75k47L01q4k14J96n2
4956ij56K71k70K52l0K39k09mJ25k7K8j88P3K7n85N74K1ol86L76l45K07J98k09
4980c3K20l52J24o1K69j97L04r3l14J24j06j29K28J49j16L3n7k76J93n6j48K68
5002b6j12J52O6n7J44k94J50PJ46l70O5K25r6L08p15L64R1j36m4K25j37j17J83
$$ plain form
4836 72 19 141 107 74 131 -184 195 107 76 45 2 39 0 30 -60 3 132 -142 79 344 60 -82 -104 -333 25
4861 25 87 76 -126 2 -50 96 -49 269 216 -86 64 24 -8 90 64 -383 -64 -237 -105 60 169 11 -69
4884 -69 -80 -22 121 -112 95 52 -13 129 -108 -140 -44 -54 -253 42 -93 102 90 -38 37 22 -1 -243 -215 10
4908 10 -29 -64 61 -151 120 198 102 197 108 62 10 -146 194 342 103 -223 -132 -154 -120 -113 -220 258 14 86 133
4933 133 -114 282 87 -141 -122 203 -41 51 -44 -127 -71 9 137 38 70 266 91 -156 145 61 -153 43 -9
4956 -9 -165 106 -164 88 58 297 88 84 209 182 210 22 95 122 -463 111 132 126 -260 116 -229 -22 176 -33
4980 -33 187 -165 -41 -102 167 -30 274 181 -133 -9 -115 -244 -16 133 17 50 -7 -283 -90 -146 -294 -26
5002 -26 -138 14 80 23 167 -127 23 30 176 -194 -129 96 0 308 -407 -43 48 -88 -132 93 -44 -161 22
5025B2j0J70l55K40j64J64j82J94P9Rl36J5P1J15J58l91K93m68J11L95l20J55
5047c5J09l07R0K82j03MK16l54K53q5k49n3M70j21j27J69j03l8j88k3M48l49l7
5070a31K51l61J49m9j31L73K28k43J07N5n02L62p5l21K44k29K38NO6P1R3j56j48
5093a04pJ14l40M03q6J19o8j5j84L30j40q4q0K24K42k92j51J87k01J35J33j09
5115B6K01j41j50J00K14l84K02k87K07J24k53KK35kk67J81o6p0K6J8K64l50K45
5138G5j98J92q1pJ63j04k18N26m60Q5O4L9QQ0q0R5J33n80L76q4j8J38p6k85L07
5163I0p0K6O1l84L95J25q3j37j06j2J73k68K31Mo9j95o9L87m9K9n2K2j52q6r5
5188b84M93k08j79K83k49K78n2k59L43j94JJ70k51j7M00l55j29M00j95Q5lk04
$$ plain form
5025 22 12 182 -173 67 -97 67 -115 79 158 167 -169 -154 -83 32 190 -201 92 -376 -265 130 -190 -35
5047 -35 74 -233 -143 139 36 40 256 -98 155 70 -179 -232 238 117 -10 159 56 18 -170 -193 255 -94 -131
5070 -131 120 -241 -92 -141 -272 101 329 86 193 248 -254 108 33 -288 -44 -273 -35 -30 36 107 200 44 -104
5093 -104 -111 3 -337 66 -20 99 31 16 -168 162 22 -62 -142 82 324 32 -119 68 -133 2 135 26
5115 26 227 86 -64 36 250 -134 68 -219 -12 112 -141 -139 96 94 -173 8 -58 -128 -102 -84 180 -170 75
5138 75 -123 69 -12 -19 144 40 -178 348 -112 -27 37 76 84 164 84 179 312 -268 108 24 6 144 68 -217 90
5163 90 20 46 107 -277 118 243 160 23 -83 -95 78 -190 41 45 -24 -219 -288 99 50 79 27 49 -103 -189 -284
5188 -284 209 1 -178 105 -144 134 82 -177 166 -28 -27 143 -108 -125 275 -80 -209 191 -4 81 78 -126
5210a26Q9j51O4K17j84j3K8l6r3K24m3l3J93j9j10l7M5M1O4j20P7O4j73K06n5
5235A19m45L46K44k72J6q4LP1Qk3Q2m11K70J80j06J52J9l10J47P4k91j3M08j91
5259gK13L0l68O6k10p2M18k90M24j73M0o2j91K63J00j03k28l0J84L9M7l6k11K39
5283H2Q5l41J43p9J03k9Q6l8J66j52j12J65j09J03j9j90K82j17o0Q4o4J4m4P5
5307C4N8j15J12O6p7Rm68L37K38l36K05j41O1K70l98K68j72M4L9p3N2j78K83k23
5331a05J82M3k34L87l10Q9mm5M7lK31l07j20r5N1J28J60m9M67m70m18L38J63k37
5355a11qN4J47l75P7L28J62m16K74j06N1J2l19J62J39l15L81j99Q4J6J2p2k7J05
5379E6O3k28k9O2l2j07R7J41l22J41Q0Q6j66K01r7mJ11k2j87K67l07K31mO1k40
$$ plain form
5210 -126 -37 -188 -124 93 -91 -104 -76 -112 -205 19 -24 -57 136 117 7 -30 15 56 120 0 77 141 -32 174 119
5235 119 -326 20 264 -8 8 -76 -73 -2 6 -17 65 -346 -76 104 -2 150 169 -141 6 80 -211 -224 184 -7
5259 -7 206 236 -132 -66 -276 -348 70 -220 204 31 71 9 -182 81 181 78 -150 -180 4 43 90 54 -157 82
5283 82 167 -174 -31 -110 -7 -36 50 12 178 26 -86 79 -30 73 54 -136 146 29 -31 53 -11 3 -41 34
5307 34 92 -23 89 155 78 87 -381 -44 194 -142 63 -78 -17 253 -145 123 -49 -5 34 -39 13 -165 118 -105
5331 -105 77 120 -114 273 -37 52 48 3 50 47 278 -29 -149 -244 -193 -65 95 46 513 43 -375 -37 126 -111
5355 -111 -119 -65 82 -293 -216 112 274 -142 132 26 77 89 -230 -68 71 -244 137 -62 22 38 50 -22 -49 56
5379 56 119 -109 -138 -76 -108 -215 -118 23 -299 -158 -78 8 -158 43 -54 -58 53 31 -156 111 -196 35 31 92 -148
5404a48J33qN6J40k34J0NO6k73K61k63J66O5J09n0K2J8j58QL7MM3Q5oO9p7p6j
5432CJ31o8k12J24l1J3J85j97l2K19k50K7J48k05O3n7L61j09j02j32K76j28r0
5455f3Lk3O1qJ61l64K16J75l50J96j28l4K43k57L96l66J48J7n3k96N34l57P6O7
5479fn5M9K82j18m60K68J42m4j07j69K79q4m9Q5Q3l36N6L58l11O2p6J58MJ44l68
5504b13K06j72J29nR1k31K47j4P3J04j15L6k97J76O7j19J10K37o21J65J03J34
5526I1r5L5J27k75K89j38J49k32j59J91k1k14K80R5o0o0K83k79K3p8N1K35l77
5549a39J16J70k14m8J44j53J1J3J44N5O1m33M14j66L21n79L85k69K59R1l5k00
5571e2K96lJ00k40o3M1l65L21j38j28J15K85m07K95Q7m06K46j35jJ35P6r2j23
$$ plain form
5404 -148 -15 -23 33 173 -61 -51 -46 20 -253 8 -255 -89 -24 85 35 57 75 -83 -75 -38 -34 9 94 88 157 80 4 3
5432 3 134 66 -146 -22 -53 -40 145 -52 -84 135 -115 -88 60 -145 -82 -139 222 113 11 -121 155 27 -63
5455 -63 -60 -83 -22 -30 131 -233 -17 158 -192 4 -124 -158 85 -172 224 -142 6 23 -30 -326 208 -149 -73 -6
5479 -6 -61 -12 270 152 -308 -40 102 58 -49 -218 61 -23 -72 13 96 -240 -184 174 -137 -75 -151 7 11 155 -213
5504 -213 -7 -179 -50 -55 36 -195 52 38 111 215 100 136 -161 15 82 -37 73 310 -311 -146 -43 91
5526 91 -4 31 158 -117 172 34 183 -49 -208 -17 -38 -252 28 123 63 3 286 7 30 -48 3 238 -139
5549 -139 -23 147 -67 -115 29 -124 -113 -100 44 99 160 -273 141 -25 296 -283 102 -167 92 183 148 -52
5571 -52 244 241 341 101 38 79 -286 35 -103 -231 -116 169 -238 57 144 -262 -16 -151 -152 -17 59 -33 -156
5594a56M41m37M36l54Pr9MJ50j7K85k37j19K16k48K54k92K19j6L1j44n0J18K8
5617B0K33l02K31Q9k18l6q8K11J60j48P6n7n0j34K16l38L17K1j29k58JJ11k0K63
5641A71J48k62j35Q5J28k26j01K88k07M5J69j80q3L38k2k77l4J69J33n5K38mj92
5664A34k86j05O00k99Oj3j71K93j10m94L75l2K2q4j53M51J14k01L9k18J38p0R4
5687C0M7n6N0o6P6rJ01l3j30k64P0L20j97J78k46L1J74k26J47K81j55l89M62k84
5711h8R6K18k76J34k51J51J31o4l2j18J92o4j28J75j71L13j94L5j07J0j14M34
5733B82l40P3Nj9k2K39q6n7J23m91K79j05R0J08o8Q8p1l05L18J23j84j70L62k
5757A70j00M1k09K74j48p2J61k46j4J28k2j51M07l84q6L49J3n9j34k05K80O4J95
$$ plain form
5594 -156 285 -152 284 -70 -63 -162 -158 -8 -25 260 23 -96 120 -128 126 -166 53 37 68 -76 -126 -8 20
5617 20 253 -49 182 271 53 17 -71 140 300 152 228 171 121 -13 203 -135 182 203 74 -184 -183 -72 -92 171
5641 171 319 57 -78 7 135 -91 -192 96 -111 -66 103 -77 -160 178 156 -121 -155 14 147 92 330 326 134
5664 134 -152 -257 343 44 50 37 -134 159 49 -445 -70 -102 -80 -164 -317 134 248 47 86 -132 6 -64 30
5687 30 77 21 71 5 81 72 173 140 10 -254 -184 136 -61 117 -129 -98 76 -150 -3 278 123 -266 196 -88
5711 -88 8 226 -50 84 -167 -16 115 51 19 -99 93 29 -99 76 -95 218 24 59 -48 -38 -152 282
5733 282 -58 15 20 1 -21 218 132 75 198 -293 -14 -119 -29 79 11 99 28 -277 41 164 -20 -190 172 170
5757 170 70 111 -98 176 28 -44 117 -129 -143 -15 -37 -188 219 -165 -251 98 111 52 -82 -287 -7 57 252
5780B52k41J83l11P2J57j17K52l29p6p8K40l5J20m8r9K24j93p1NK32k04J69j28
5803b4l1o1J4M36n11L54r3j06J2J16o2k58J95j56J92m4j49L69l88K67J53m70K62
5826A7qp6m8N11l72r8op6L30N2o26M21j8om7n6m2J1k4R4L0L62n36K9J79j46L63
5853B14m05K56K25m57J75L55j1l94Q2o7j02J17o6Q6L0j7m0o7L3L2j18L6J78N3
5877A28l12M76k46q4Q4j43J51k72L18j25j55K26k01J73J5J64k20j62J14J21j60
5898a10J14j00j00N4K18k29L23K04l11k0K17k13j42J96J13j10j86Q3%K0r0K07
5920A38j39n5K44j24R9j82o6J57O7j46n8K08O6o3j20r9K6%j35K45o1M7Qj99J70
5945B8o4R1N5O2k36J27K21m39L31l05J06K9l37J93J60o8K0j32K06K8j28l1J48
$$ plain form
5780 252 11 194 -117 -45 112 -5 247 -82 -158 -236 4 -31 89 41 -58 166 -27 -98 -93 139 -65 104 -24
5803 -24 -55 -116 -102 334 -177 177 84 -22 -10 106 44 -214 -19 -175 17 -27 -176 193 -195 72 225 -245 17
5826 17 9 -67 -115 396 24 -74 -80 -156 174 226 -400 21 3 -3 -50 -106 -148 -137 -161 -67 -37 325 -211 -182 -3 -149 214
5853 214 -191 65 290 -167 8 363 352 -42 40 -27 -129 -12 -78 8 38 21 -19 -86 -53 -21 -139 -103 75 128
5877 128 -184 292 46 -38 46 -97 54 -218 100 -25 -180 46 -155 18 33 197 -23 -185 -71 50 -110
5898 -110 4 -96 -196 -142 76 -153 170 374 63 43 260 47 -95 101 214 104 -82 1 1 21 -69 138
5920 138 -1 -56 188 64 163 -19 -85 72 139 -7 -65 143 209 146 26 -73 -47 -47 -182 63 2 49 57 -142 28
5945 28 -36 55 110 172 -64 63 284 -155 176 -129 -23 6 -331 -138 22 -46 -26 -158 48 76 -52 -83 65
5968F5j03J0J71j30p9j33K06k27L14j76L28K9l4k37j19q6j1N02k71q3K0l90L85
$$ plain form
5968 65 -38 -28 143 13 -66 -199 7 -220 94 -82 246 275 241 4 -115 -201 -212 290 19 -64 -44 -434 -49
$$ [...]
8191d9
##END NTUPLES=NMR FID
##END=
