##TITLE=1H_Pr 5066-d-4
 DMSO,8 sc, 
 24.9.2021
##JCAMPDX= 6.0         $$ Bruker NMR JCAMP-DX V2.0
##DATA TYPE= NMR FID
##DATA CLASS= NTUPLES
##ORIGIN= UXNMR, Bruker Analytische Messtechnik GmbH
##OWNER= root
$$ XWIN-NMR		Version 3.5
$$ Fri Sep 24 11:45:03 2021 Russian Standard Time (UT+4h)  she@DPX200
##.OBSERVE FREQUENCY= 200.1314
##.OBSERVE NUCLEUS= ^1H
##.DELAY= (6, 6)
##.ACQUISITION MODE= SIMULTANEOUS
##.ACQUISITION SCHEME= undefined
##.AVERAGES= 8
##.DIGITISER RES= 18
##SPECTROMETER/DATA SYSTEM= spect
##.PULSE SEQUENCE= zg30
##.SOLVENT NAME= DMSO
##.SHIFT REFERENCE= (INTERNAL, DMSO, 0, 15.7039)
##AUDIT TRAIL= $$ (NUMBER, WHEN, WHO, WHERE, WHAT)
$$ ##TITLE= Audit trail, XWIN-NMR		Version 3.5
$$ ##JCAMPDX= 5.01
$$ ##ORIGIN= Bruker BioSpin GmbH
$$ ##OWNER= she
$$ F:/spectra/data/she/nmr/H-F/1/audita.txt
$$ ##AUDIT TRAIL=  $$ (NUMBER, WHEN, WHO, WHERE, WHAT)
(   1,<2021-09-24 11:43:44.98 +0400>,<she>,<DPX200>,
      <created by zg, POWCHK disabled, PULCHK disabled
       configuration hash MD5:
       00 E9 B6 7A A2 85 ED C7 34 08 36 98 17 FE 4E 26
       data hash MD5: 16K
       A5 17 77 5F 52 6E 3B 7A E0 EA DF 69 B3 E4 32 4D>)
$$ ##END=
$$ 
$$ hash MD5
$$ 7C 90 0E 7A 34 A8 6A E3 AF EC B2 5F A6 B9 22 E8
##$RELAX= 
##$RELAX= 
##$RELAX= 
##$RELAX= 
##$RELAX= 
##$RELAX= 
$$ Bruker specific parameters
$$ --------------------------
##$DU= <F:/spectra>
##$EXPNO= 1
##$NAME= <H-F>
##$PROCNO= 1
##$TYPE= <nmr>
##$USER= <she>
##$AMP= (0..31)
100 100 100 100 100 100 100 100 100 100 100 100 100 100 100 100 100 100 
100 100 100 100 100 100 100 100 100 100 100 100 100 100 
##$AQSEQ= 0
##$AQ_mod= 1
##$AUNM= <au_zg>
##$AUTOPOS= <>
##$BF1= 200.13
##$BF2= 200.13
##$BF3= 200.13
##$BF4= 200.13
##$BF5= 200.13
##$BF6= 200.13
##$BF7= 200.13
##$BF8= 200.13
##$BYTORDA= 1
##$CFDGTYP= 0
##$CFRGTYP= 5
##$CHEMSTR= <none>
##$CNST= (0..31)
1 1 145 1 1 1 1 1 1 1 1 1 1 1 1 1 1 1 1 1 1 1 1 1 1 1 1 1 1 1 1 1 
##$CPDPRG= <>
##$CPDPRG1= <>
##$CPDPRG2= <>
##$CPDPRG3= <>
##$CPDPRG4= <mlev>
##$CPDPRG5= <mlev>
##$CPDPRG6= <mlev>
##$CPDPRG7= <mlev>
##$CPDPRG8= <mlev>
##$CPDPRGB= <>
##$CPDPRGT= <>
##$D= (0..31)
0 1.2 0 0 0 0 0 0 0 0.06 0 0.03 0 0 0 0 0.0002 0 0 0 0 0 0 0 0 0 0 0 0 
0 0 0 
##$DATE= 1632469424
##$DBL= (0..7)
120 120 120 120 120 120 120 120 
##$DBP= (0..7)
150 150 150 150 150 150 150 150 
##$DBP07= 0
##$DBPNAM0= <>
##$DBPNAM1= <>
##$DBPNAM2= <>
##$DBPNAM3= <>
##$DBPNAM4= <>
##$DBPNAM5= <>
##$DBPNAM6= <>
##$DBPNAM7= <>
##$DBPOAL= (0..7)
0.5 0.5 0.5 0.5 0.5 0.5 0.5 0.5 
##$DBPOFFS= (0..7)
0 0 0 0 0 0 0 0 
##$DE= 6
##$DECBNUC= <off>
##$DECIM= 32
##$DECNUC= <off>
##$DECSTAT= 4
##$DIGMOD= 1
##$DIGTYP= 9
##$DL= (0..7)
0 120 120 120 120 120 120 120 
##$DP= (0..7)
150 150 150 150 150 150 150 150 
##$DP07= 0
##$DPNAME0= <>
##$DPNAME1= <>
##$DPNAME2= <>
##$DPNAME3= <>
##$DPNAME4= <>
##$DPNAME5= <>
##$DPNAME6= <>
##$DPNAME7= <>
##$DPOAL= (0..7)
0.5 0.5 0.5 0.5 0.5 0.5 0.5 0.5 
##$DPOFFS= (0..7)
0 0 0 0 0 0 0 0 
##$DQDMODE= 0
##$DR= 18
##$DS= 0
##$DSLIST= <SSSSSSSSSSSSSSS>
$$ [...]
##$SUBNAM2= <"">
##$SUBNAM3= <"">
##$SUBNAM4= <"">
##$SUBNAM5= <"">
##$SUBNAM6= <"">
##$SUBNAM7= <"">
##$SUBNAM8= <"">
##$SUBNAM9= <"">
##$SW= 20.0188988654967
##$SWIBOX= (0..15)
0 0 2 0 0 0 0 0 0 0 0 0 0 0 0 0 
##$SW_h= 4006.41025641026
##$TD= 16384
##$TD0= 1
##$TE= 0
##$TE2= 300
##$TE3= 300
##$TEG= 300
##$TL= (0..7)
0 120 120 120 120 120 120 120 
##$TP= (0..7)
150 150 150 150 150 150 150 150 
##$TP07= 0
##$TPNAME0= <>
##$TPNAME1= <>
##$TPNAME2= <>
##$TPNAME3= <>
##$TPNAME4= <>
##$TPNAME5= <>
##$TPNAME6= <>
##$TPNAME7= <>
##$TPOAL= (0..7)
0.5 0.5 0.5 0.5 0.5 0.5 0.5 0.5 
##$TPOFFS= (0..7)
0 0 0 0 0 0 0 0 
##$TUNHIN= 0
##$TUNHOUT= 0
##$TUNXOUT= 0
##$USERA1= <user>
##$USERA2= <user>
##$USERA3= <user>
##$USERA4= <user>
##$USERA5= <user>
##$V9= 5
##$VALIST= <valist>
##$VCLIST= <CCCCCCCCCCCCCCC>
##$VD= 0
##$VDLIST= <DDDDDDDDDDDDDDD>
##$VPLIST= <PPPPPPPPPPPPPPP>
##$VTLIST= <TTTTTTTTTTTTTTT>
##$WBST= 1024
##$WBSW= 4
##$XGAIN= (0..3)
0 0 0 0 
##$XL= 0
##$YL= 0
##$YMAX_a= 60881
##$YMIN_a= -117551
##$ZGOPTNS= <>
##$ZL1= 120
##$ZL2= 120
##$ZL3= 120
##$ZL4= 120
##$ABSF1= 10
##$ABSF2= 0
##$ABSG= 5
##$ABSL= 3
##$ALPHA= 0
##$AQORDER= 0
##$ASSFAC= 0
##$ASSFACI= 0
##$ASSFACX= 0
##$ASSWID= 0
##$AUNMP= <proc_1d>
##$AZFE= 0.1
##$AZFW= 0.1
##$BCFW= 1
##$BC_mod= 2
##$BYTORDP= 1
##$COROFFS= 0
##$CY= 11.3945322036743
##$DATMOD= 1
##$DC= 2
##$DFILT= <>
##$DTYPP= 0
##$F1P= 2.36226072786647
##$F2P= -0.459571619588291
##$FCOR= 0.5
##$FTSIZE= 0
##$FT_mod= 4
##$GAMMA= 1
##$GB= 0.15
##$INTBC= 1
##$INTSCL= 1
##$ISEN= 128
##$LB= 0.24
##$LEV0= 0
##$LPBIN= 0
##$MAXI= 10000
##$MC2= 0
##$MEAN= 0
##$ME_mod= 0
##$MI= 1.114404
##$NCOEF= 0
##$NC_proc= 0
##$NLEV= 6
##$NOISF1= 3.799351
##$NOISF2= 2.8
##$NSP= 1
##$NTH_PI= 0
##$NZP= 0
##$OFFSET= 15.70392
##$PC= 1
##$PHC0= -14064.89
##$PHC1= -7.199122
##$PH_mod= 1
##$PKNL= yes
##$PPARMOD= 0
##$PSCAL= 0
##$PSIGN= 0
##$REVERSE= no
##$SF= 200.130013532006
##$SI= 16384
##$SIGF1= 3
##$SIGF2= 2
##$SINO= 400
##$SIOLD= 16384
##$SREGLST= <1H.CDCl3>
##$SSB= 0
##$STSI= 0
##$STSR= 0
##$SW_p= 3612.71676300578
##$SYMM= 0
##$S_DEV= 0
##$TDeff= 0
##$TDoff= 0
##$TI= <>
##$TILT= no
##$TM1= 0
##$TM2= 0
##$TOPLEV= 0
##$USERP1= <user>
##$USERP2= <user>
##$USERP3= <user>
##$USERP4= <user>
##$USERP5= <user>
##$WDW= 1
##$XDIM= 8192
##$YMAX_p= 0
##$YMIN_p= 0
$$ End of Bruker specific parameters
$$ ---------------------------------
##NTUPLES= NMR FID
##VAR_NAME=  TIME,          FID/REAL,        FID/IMAG
##SYMBOL=    X,             R,               I
##VAR_TYPE=  INDEPENDENT,   DEPENDENT,       DEPENDENT
##VAR_FORM=  AFFN,          ASDF,            ASDF
##VAR_DIM=   8192,          8192,            8192
##UNITS=     SECONDS,       ARBITRARY UNITS, ARBITRARY UNITS
##FACTOR=    0.0002496,     1,               1
##FIRST=     0,             0,               0
##LAST=      2.0444736,     0,               0
##MIN=       0,             -117551,         0
##MAX=       2.0444736,     60881,           0
$$ Real data points
##PAGE= N=1
##DATA TABLE= (X++(R..R)), XYDATA
0 0 0 0 0 0 0 0 0 0 0 0 0 0 0 0 -8 8 -8 8 -8 10 -16 16 -20 24 -28 32 -40 44 -49 56 -66 76 -87 98 -110 124
36 124 -140 156 -175 196 -217 241 -269 296 -327 364 -401 442 -486 536 -590 652 -716 791 -875
55 -875 969 -1074 1196 -1338 1504 -1704 1947 -2257 2653 -3195 3981 -5222 7500 -13070 60881
70 60881 24547 -76445 -5662 52364 53110 -3176 -10610 16543 25132 9511 18594 7777 118
83 118 13248 13594 -14133 -24525 -4127 38100 28628 -31633 -44145 1226 22295 8375 -20017
96 -20017 -33357 -17206 -4299 -5223 -1082 -11658 -19022 -6763 -9231 -19784 -10397 -3602 -3584 -8528
110 -8528 -19247 -9395 7871 6236 5068 -2876 -20962 -9965 14054 14630 3389 -6687 108 17269
124 17269 9865 67 15682 15555 -1419 -2904 7119 18016 17716 3412 6251 11732 -2473 552
138 552 15861 9023 -4383 -9460 -3279 11098 5987 -5292 1799 -319 -11431 -6281 -3008 -4871
152 -4871 -4682 -9591 -7089 -2004 -8397 -3323 4594 -8705 -15727 -7737 -1962 2660 -2330 -9262 804
167 804 3427 -4240 177 1127 -1581 2184 -1866 -3925 4782 6119 6428 5734 -3512 1216 11932 5140
183 5140 1099 3039 1591 5973 5602 1721 8587 6623 -3056 -370 127 -1808 3079 -74 -2956 1199
199 1199 -2247 -1197 4134 -2910 -5412 -2614 -6787 -4110 947 -2267 -1500 -3714 -8136 -798 26 -6773
215 -6773 -3226 -2156 -4799 -935 -2033 -922 5814 278 -2237 2470 -400 1083 4366 -662 538
230 538 3723 1226 5508 6472 -117 2699 2581 -1177 3901 3635 820 4176 2215 1391 5799 538
246 538 -789 3858 -1607 -3480 331 -826 1855 1721 -5509 -2357 739 -3073 -1182 -3166 -6541 -976
262 -976 -1799 -4861 -185 -1399 -2566 8 -5320 -4904 1202 -1808 -3076 -531 -2903 1118 3881 -1750
278 -1750 1362 2219 -2099 1050 1748 113 4758 2813 6 4419 2642 897 4073 417 111 4044
294 4044 -218 892 4782 901 2177 2396 -1992 2290 2870 -2589 -762 -277 -1818 1470 -827 -3472
310 -3472 1589 -1455 -4331 -764 -2946 -2511 995 -3592 -2768 1223 -2059 -622 207 -4746 -1503 -701
326 -701 -4097 -61 896 -1866 1106 -438 -1959 2979 575 -1182 2213 243 177 3926 268 2240
342 2240 4716 -336 345 3018 -361 2142 2185 -1627 2315 2732 -412 2731 1375 -833 2551 -939
358 -939 -2261 2090 -81 -868 1099 -2315 -660 1452 -3190 -2278 -129 -3275 -1048 -549 -3316 597
374 597 180 -3340 146 -820 -2665 509 -1551 -2365 1847 -1171 -1435 1515 -1039 30 1906 -2068
390 -2068 462 2512 -933 1007 1998 -180 3192 1975 -1145 2101 1596 -969 1931 -53 -207 3194
406 3194 -24 -501 2497 -428 538 1779 -1944 561 1823 -1499 666 1362 -1683 772 -446 -3049
422 -3049 868 -603 -3101 148 -1168 -1453 1201 -1848 -1620 1648 -1405 -1356 469 -2190 301 1185
438 1185 -1946 610 1615 -1559 685 -228 -2426 1300 361 -1302 2015 437 134 2565 79 86 2741
455 2741 -633 -84 2281 -541 904 2027 -1145 983 1551 -1718 1057 931 -1059 1513 -397 -1745
471 -1745 1767 325 -1054 1576 -849 -898 1300 -2255 -1549 1104 -1683 -176 489 -2418 449 659
487 659 -2335 260 -205 -1978 1108 -177 -1262 1594 -200 -1372 1092 -988 -811 1427 -1047 -91
503 -91 1956 -1145 395 1588 -966 898 1254 -1551 1047 762 -877 1654 180 -847 2169 -246
519 -246 -920 1723 -366 -276 1515 -630 167 2543 -641 486 1629 -1522 565 428 -1679 751 251
536 251 -2139 705 -190 -1702 1028 -1166 -1856 1216 -788 -918 1058 -1140 60 1051 -1849 -377
552 -377 1101 -1517 283 -264 -2044 882 614 -1515 1057 29 -797 1963 -236 -793 2073 53
568 53 -149 1927 -117 564 2010 -857 302 1088 -1937 340 917 -824 1534 379 -1368 1727 671
585 671 -1184 1257 106 -750 1921 -628 -704 1650 -658 -376 550 -2018 -251 1022 -1606 -103 97
602 97 -1637 553 470 -1515 686 -26 -1302 1017 -815 -1540 1037 -987 -791 1234 -1209 -707 1172
619 1172 -1069 576 1298 -1288 1097 1656 -682 1577 802 -652 1932 405 -764 1861 23 -206
635 -206 1887 -422 -324 1354 -509 76 1212 -1274 54 893 -1205 511 260 -1508 555 -228 -1749
652 -1749 374 -886 -1411 659 -675 -1120 1206 -845 -628 1049 -1287 -427 874 -1157 -15 502
668 502 -1436 256 822 -1643 521 118 -1046 1215 -11 -688 1705 296 -293 1866 2 162 1619
685 1619 -564 381 1564 -689 713 1532 -1144 687 789 -707 1036 292 -732 1395 331 -639
701 -639 1530 -546 -694 695 -990 -593 546 -1548 -1244 219 -1776 -522 296 -1598 -24 276 -1651
718 -1651 708 24 -1289 815 -300 -1095 1469 -96 -693 1353 -687 -575 1033 -704 403 1547
734 1547 -600 602 1306 -671 1188 1252 -879 1188 567 -899 1639 296 -664 1323 -461 -725 1062
751 1062 -393 -582 1160 -921 -393 921 -1106 310 520 -1415 -16 -85 -1826 357 -145 -1560 174
768 174 -354 -1303 610 -999 -1176 996 -1064 -386 1063 -978 -104 1167 -974 192 727 -1184 558
785 558 577 -778 843 417 -558 1429 496 -415 1621 235 -57 1905 -1 121 1581 -691 -49 1086
803 1086 -826 133 754 -1253 500 323 -1111 711 170 -1042 1051 -295 -1208 705 -620 -809 709
820 709 -1004 -608 495 -1438 -587 368 -1350 -68 259 -1309 175 487 -812 916 217 -1031 1326
837 1326 194 -487 1082 -160 -275 1616 -341 -30 1185 -299 319 1170 -608 531 1139 -403 544
854 544 809 -495 1071 377 -870 647 -480 -1073 624 -655 -660 843 -979 -472 704 -1070 -310
871 -310 582 -1014 -103 292 -1592 362 86 -1144 337 -204 -1398 676 -79 -913 1113 -310 -450
888 -450 1066 -601 376 1248 -335 438 1165 -574 591 1079 -622 1201 737 -809 813 502 -476
905 -476 1251 36 -416 1296 109 -269 1070 -529 -246 927 -1212 -389 351 -1119 -226 76 -1436
922 -1436 -177 1 -1408 421 -398 -1344 466 -214 -1111 899 -676 -854 264 -871 -327 621 -1113
939 -1113 -130 883 -852 551 833 -286 943 726 -557 1363 784 -214 1568 290 -347 1131 -96
956 -96 109 1478 -631 322 1132 -623 372 776 -738 446 457 -1109 654 234 -1313 653 -141 -1227
974 -1227 486 -851 -1143 597 -704 -932 298 -1082 -490 728 -1005 -354 420 -940 225 299 -1008
991 -1008 135 14 -1082 421 156 -647 1055 -117 -385 1236 -328 89 1443 20 482 1206 -307
1008 -307 489 1158 -567 740 796 -777 644 362 -635 869 142 -773 923 -17 -523 806 -515 -550
1026 -550 743 -947 -325 596 -1018 -423 194 -1450 -64 -35 -1177 156 30 -927 469 -12 -769 914
1044 914 -64 -643 776 -302 -526 956 -461 -9 588 -695 296 979 -878 383 392 -454 818 757
1062 757 -235 1023 328 -572 1172 -175 -173 952 -358 -291 816 -656 -359 490 -864 97 695 -770
1080 -770 348 101 -912 10 53 -1000 722 -307 -913 236 -533 -819 247 -750 -671 917 -733 -171
1098 -171 790 -628 -25 817 -647 631 546 -752 496 653 -243 557 156 -427 774 -254 -297 1025
1116 1025 -98 -65 868 -391 -14 741 -676 236 607 -683 164 359 -874 154 145 -1020 340 -499
1134 -499 -901 570 -422 -735 622 -823 -254 414 -860 -129 664 -990 82 313 -834 466 365
1151 365 -1095 297 274 -334 651 173 -376 923 194 -262 876 -62 -63 716 -225 156 1001 -639 253
1170 253 673 -479 509 382 -396 658 252 -508 621 8 -648 876 -461 -354 484 -727 -151 326
1188 326 -697 -333 163 -778 -184 247 -852 389 107 -912 363 147 -773 489 -68 -998 476 -637
1206 -637 -674 610 -529 77 575 -393 392 932 -466 598 690 -335 575 419 -667 545 254 -501
1224 -501 602 -103 -440 931 -314 -256 702 -447 -260 886 -421 -76 789 -725 -60 259 -857 198
1242 198 115 -765 170 -208 -673 83 -236 -449 666 -546 -603 389 -547 -618 709 -599 -300 261 -689 281
1262 281 286 -793 164 164 -807 644 310 -429 469 275 -120 789 -177 -150 887 -247 36 780 -230 -81
1282 -81 635 -567 355 498 -606 422 605 -358 655 53 -621 699 -429 -383 362 -348 -645 704
1300 704 -550 -52 185 -709 2 305 -871 66 427 -850 131 111 -750 147 -194 -399 603 -241 -297
1319 -297 605 -124 -452 627 -420 53 640 -229 148 574 -582 612 549 -182 701 192 -449 542 172
1338 172 -362 797 -8 -309 531 -290 -367 601 -355 -245 529 -664 113 348 -701 114 348 -698 162
1357 162 323 -957 311 22 -763 497 -14 -317 534 -388 -261 523 -344 -130 788 -651 107 440 -722
1376 -722 207 286 -491 242 210 -374 568 325 -420 658 4 -178 870 -299 -239 750 -233 78 873 -613
1396 -613 11 468 -588 263 245 -586 223 291 -521 477 103 -541 573 -204 -453 442 -367 -445 425 -452
1416 -452 -303 238 -763 -104 482 -521 31 133 -523 350 134 -512 627 15 -411 490 -365 -383 835
1435 835 -345 -324 267 -523 180 625 -394 192 499 -525 435 653 -612 498 68 -617 591 24
1453 24 -403 205 -125 -295 553 -253 -47 533 -441 -147 632 -291 -55 274 -629 109 81 -695 185 9 -474
1474 -474 369 -150 -545 654 -99 -298 417 -257 -147 282 -170 -168 373 -477 -76 364 -666 153 261 -677
1494 -677 440 -70 -472 375 -115 -259 514 -20 -133 690 -180 -80 379 -367 136 422 -466 37 189 -387
1514 -387 69 323 -641 474 -27 -421 493 17 -511 504 -269 -304 309 -466 -315 276 -745 -294 272
1533 272 -588 136 139 -628 131 103 -482 341 178 -499 465 25 -766 425 -301 -454 365 15 -339 513 -428
1554 -428 335 623 -316 296 534 -177 402 338 -509 578 248 -488 189 -299 -506 410 -200 -302 657 -462
1574 -462 -173 437 -395 -37 526 -258 7 -58 -459 47 -37 -670 23 -148 -445 403 -346 -631 339 -204 -61
1595 -61 522 -247 -81 554 -455 180 379 -468 191 116 -504 138 286 -483 87 244 -224 582 172 -196
1615 -196 450 -119 46 618 -192 -70 735 -428 -45 468 -525 79 312 -625 238 -76 -363 405 114 -414
1635 -414 348 -60 -265 268 -430 -199 250 -382 -266 539 -516 -129 53 -628 104 384 -276 319 -11 -469
1655 -469 338 113 -193 271 50 -322 458 -307 -116 672 -55 -132 260 -386 6 234 -369 270 58 -213
1675 -213 206 415 -110 642 -58 -457 391 -68 -301 419 -120 -135 341 -269 86 363 -385 13 -110 -356
1695 -356 335 150 -462 306 -194 -475 346 37 -405 346 -148 -415 317 -159 -246 194 -313 33 241 -444
1715 -444 -149 273 -338 352 62 -320 142 154 -305 174 157 -144 457 -217 -351 471 9 -125 527 -370 -120
1736 -120 450 -522 118 504 -415 -37 88 -323 280 354 -417 223 -89 -214 324 -143 -163 108 -287 -252 298
1757 298 -173 -71 415 -477 -290 269 -128 438 95 -222 384 104 -492 301 56 -295 379 -318 -243 352
1777 352 -252 -141 245 -341 124 521 -384 108 561 -251 48 115 -253 411 192 -314 504 134 -264 224
1797 224 -371 -159 290 -8 -142 467 -248 1 340 -492 76 168 -483 90 -1 -625 104 191 -249 280 -297
1818 -297 -205 184 112 -260 200 -157 -15 676 -457 10 393 -130 20 167 -341 40 362 -365 279 35
1838 35 -254 484 165 -251 117 110 -112 664 -188 37 362 -116 -67 253 -349 228 117 -308 510 41 -298
1859 -298 93 -24 -181 224 124 -223 321 -68 -24 135 -76 -275 222 -549 -279 156 -268 -55 8 -311 233
1880 233 338 -214 352 -56 -328 339 -461 -187 459 20 59 385 -130 -152 447 -256 17 264 -366 -36 616
1901 616 -268 249 268 -398 346 160 -166 293 -13 -93 309 -253 -250 383 -216 -316 -63 -194 -10 419 -460
1922 -460 -148 -33 -314 187 -9 -475 37 -151 -193 231 -204 -127 269 -265 -196 493 41 -230 297 -21 -108
1943 -108 363 -370 256 322 -140 301 390 -295 412 156 -492 614 168 -48 336 166 -36 536 -83 134
1963 134 281 -412 -250 218 -269 215 101 -589 161 -169 -409 182 10 -272 84 -61 -193 397 -278 -186
1983 -186 393 -296 -218 155 -164 -177 311 -435 57 246 -402 166 47 -246 142 137 -117 230 56 -137 343
2004 343 60 -314 83 -137 206 610 -325 91 314 -510 41 297 -318 381 265 -226 -73 -336 -384 174
2024 174 -256 -187 145 -226 -45 33 -302 -50 98 -255 80 194 -369 303 63 -415 -42 396 -214 23 46
2045 46 -272 282 -82 -433 276 -73 -161 537 135 138 244 -92 -351 136 -458 107 -44 -330 115 37 -384 228
2067 228 -7 -557 49 -56 45 515 -121 -209 110 -230 -323 384 -496 -16 129 -582 137 205 40 426 -86
2088 -86 131 376 -27 -320 472 -60 -84 333 -112 -270 217 -202 -293 258 -237 200 143 -515 240 258 -261 109
2110 109 18 -91 322 136 -513 248 -26 -430 57 -419 -169 388 -198 -145 73 -363 150 217 -235 -16 285
2131 285 -245 220 53 -42 347 184 -504 239 -47 -134 185 1 179 100 -55 -92 306 -230 119 84 -178 280
2153 280 253 -620 -116 142 -396 293 -53 -273 269 -220 -89 338 -237 -178 245 -328 -4 664 -318 78 86
2174 86 -421 176 103 -557 46 -76 -263 498 -75 -93 488 -161 -227 487 -204 81 47 -352 207 249 -289 -151
2196 -151 110 -127 118 191 -612 95 84 -366 27 -205 -273 419 -186 -233 365 -167 5 -1 -542 124 319 -233
2218 -233 25 12 -242 -217 100 -217 379 60 -25 509 26 -47 34 -27 -24 245 -2 -264 373 -243 33 128 -199
2241 -199 -23 154 -414 441 213 -328 227 287 -214 130 162 -161 156 102 -181 275 -221 -313 314 -447 -87
2262 -87 105 -190 -62 380 -576 71 202 107 302 155 -277 360 -218 -355 -92 -241 -74 161 -311 -69 124
2283 124 -109 83 291 -158 26 278 -248 -59 -193 -417 133 33 -235 351 -93 -330 332 -195 -304 50
2303 50 -5 -50 403 -53 133 437 -233 -21 -198 -430 -169 168 -243 117 2 -231 154 99 -194 303 4
2324 4 -167 130 -169 -90 507 -89 -170 71 -274 -78 -165 -131 208 57 13 137 -72 -54 111 406 -230 255 240
2347 240 -305 250 -166 217 233 -437 -31 59 -83 -235 155 -212 104 -12 -49 242 19 -261 253 -325 -236
2368 -236 292 45 -277 -16 -427 -20 -49 -101 233 459 -102 -120 397 31 83 -12 -406 -45 -118 -605 -40 148
2390 148 -457 206 -106 -176 292 28 -246 203 20 15 260 -261 -69 97 48 -27 60 -97 41 19 -353 176
2412 176 43 19 165 -413 31 274 -193 -15 142 -54 153 29 -3 125 119 -380 88 -45 -16 194 30 -301
2434 -301 96 -74 -58 -5 -222 -172 248 -102 100 243 -281 -106 76 -163 52 -198 214 276 7 -242 -17
2455 -17 122 -364 519 247 -167 233 -24 -187 -2 24 -81 92 -228 -201 -68 65 -11 -62 -160 0 -2 -253 2
2478 2 -78 -194 146 -59 -369 359 -11 -47 -284 -314 -57 6 -528 -57 48 -81 -93 41 -366 463 -68 -154 418
2501 418 224 -266 233 -139 -23 304 -402 -217 193 -8 257 256 -169 85 155 -90 87 -147 -39 165 -210
2522 -210 -200 -89 139 46 131 -192 -100 420 -147 325 378 -118 20 115 -203 135 24 -265 273 60 -401 23
2544 23 -140 -340 439 206 -155 119 156 -410 -19 -54 -102 67 120 100 183 -154 -41 110 -159 150 -137 -130 180
2567 180 -165 -140 57 58 -43 14 -36 -268 88 -309 181 205 -466 -122 107 -245 97 53 -210 56 246 -217
2589 -217 -229 111 -383 246 291 -324 38 -129 -242 272 -259 27 84 -257 228 380 60 -81 4 -256 66
2610 66 25 -405 -165 56 -201 303 -265 -267 -77 43 -69 77 -87 -116 -29 -24 -98 38 -271 182 -206 -342 222
2633 222 -77 -180 26 -66 -142 180 -150 -178 -23 -133 -92 13 -220 185 188 -186 -285 121 -153 40 -6 -169 86
2656 86 89 -223 186 -14 56 147 -27 -179 207 144 -151 275 -164 -67 227 7 -80 -121 -236 -39 127 -27 -63
2679 -63 -214 -244 -53 -42 -139 158 -229 -224 -37 12 -149 56 -91 -80 370 -495 -224 -35 19 106 60 -37 62 470
2703 470 -153 233 301 -224 482 61 -171 301 -79 -57 233 -91 -60 82 -215 176 213 -226 188 113 -267 -174
2725 -174 331 -132 220 146 -347 90 23 -157 29 -95 -75 -202 -189 -41 51 39 -102 106 -229 64 167 37
2747 37 14 354 -163 256 129 -230 61 -116 -371 136 -68 322 405 -253 -120 235 -311 -184 -9 -158 134
2768 134 185 193 244 167 -326 293 58 72 226 -31 -262 183 -308 4 430 -159 -62 -276 -141 75 281 -350
2790 -350 5 64 -120 94 120 -299 236 12 6 260 -302 172 -60 -12 -144 46 163 56 138 -166 317 71
2812 71 -350 185 45 -174 34 284 10 -81 26 -50 33 -59 2 290 -141 -391 234 -234 -40 -5 -211 -273 50
2835 50 84 -26 74 -410 39 108 11 99 -29 -287 -102 -119 -171 33 -168 -150 180 55 42 119 -396 83 118 -52
2859 -52 179 244 -206 -142 76 46 -117 -90 -49 82 -26 40 166 3 97 346 -121 -45 342 -77 204 120 196 192
2883 192 56 5 -15 -23 -146 121 105 -209 98 -85 -23 278 -176 -119 -80 50 -245 97 51 -36 180 -200 -179 -50
2907 -50 -141 95 -135 -313 72 -26 -102 -19 -86 -131 -39 -189 -52 146 -211 6 168 -211 59 8 -200 125 221
2930 221 -119 254 14 -42 -20 321 -51 125 -73 -108 -3 129 -138 225 -324 -81 -129 -104 63 353 -127 128
2952 128 207 -286 -197 51 67 29 107 -184 -85 -68 188 200 -58 43 206 70 -155 316 -66 174 48 -205 409
2975 409 184 -147 260 198 15 -60 56 130 93 -228 -215 261 -207 258 -247 -78 61 -25 -81 -153 220 -114 -149
2998 -149 80 -1 100 -17 37 11 9 232 89 69 -15 118 -151 215 -27 -93 6 344 36 -157 37 -317 -105
3021 -105 -37 66 -42 -64 -89 245 -120 -62 120 -4 -205 106 -79 25 -7 17 -15 209 -198 10 102 55 -57
3044 -57 7 65 138 137 -139 -51 -109 -53 50 252 -130 -183 -188 -62 -266 -6 32 -157 123 -58 414 60 -66 301
3068 301 -148 -244 -211 60 191 -45 -120 150 -215 -85 163 -27 34 149 -157 64 -269 -16 -59 -244 -298 -77
3090 -77 91 13 -141 71 140 4 -46 -140 334 -135 76 -16 1 -9 134 -75 -31 214 -385 126 -88 190 -32
3113 -32 -12 -19 191 -177 129 194 -123 -37 191 228 83 -213 -171 56 245 -232 279 15 -183 78 -5 -127 278
3136 278 -15 -65 234 -161 -8 176 86 -122 193 -215 81 344 -47 -119 -73 68 -210 119 -327 51 209
3157 209 163 99 60 -441 131 23 -86 -21 -103 -162 -4 -199 -294 -29 -80 134 151 -91 3 21 -32 223 6 42
3181 42 -113 41 -136 343 -55 -113 69 -152 -56 184 -201 -368 112 -29 25 158 97 183 143 15 -242 196
3203 196 39 29 85 -160 118 -186 -266 -107 20 -19 -9 -13 -34 10 70 -29 -106 -305 54 -87 -116 -84 28 -102 122
3228 122 -77 -178 55 -252 19 302 70 -1 43 -188 -203 136 -223 -104 42 -325 44 -84 136 154 67 -103
3250 -103 -18 -107 -147 -145 140 -73 134 -15 -126 65 -65 -9 163 -55 -184 -86 -87 -44 123 -103 161 -46 -1 -151
3274 -151 145 -174 -59 -5 -166 103 31 196 43 124 -210 -159 -61 -6 239 -260 39 42 -9 -9 262 111 -17 104
3298 104 72 -185 145 160 141 -22 -227 56 -376 208 83 -90 -150 184 -138 -98 -41 -294 240 55 87 325
3320 325 -202 112 261 -92 -124 28 -119 -41 10 -76 28 -145 141 -68 104 -44 47 215 -56 222 -54 -26
3342 -26 86 -155 -57 82 159 -65 73 -448 -77 115 -39 -80 264 -140 74 24 -130 241 114 50 -137 148
3364 148 -193 301 -56 -165 -285 99 198 -5 -301 -150 225 230 -68 -208 60 -86 -137 -183 -72 273 155 -18
3386 -18 204 -151 -246 174 203 53 285 -208 -19 202 -98 11 -197 -71 -15 -19 -43 155 161 -19 -89 -205 190
3409 190 -45 -18 123 -42 -88 178 10 -167 103 -217 -271 -56 114 156 106 -8 1 -97 36 -53 3 -96 38 152
3433 152 -207 -11 0 -52 55 20 105 238 -18 46 -88 -14 50 -181 65 195 139 10 80 1 25 -143 181 -165
3457 -165 -245 102 0 27 86 -289 -306 324 -85 -78 -29 -105 258 -293 57 -65 -200 -280 108 97 158 -118 -50 -16
3481 -16 -17 42 180 -8 -92 140 161 -310 -3 138 13 44 -256 19 137 -207 -78 -119 93 139 139 36 -57 117
3505 117 4 123 96 -270 82 -55 -239 -168 -129 95 -91 -75 -173 -31 137 147 -98 -295 223 82 -223 -191
3527 -191 -197 13 57 42 242 -29 59 -34 -6 -246 144 24 -49 -86 -22 -65 -50 169 -187 -25 -127 179 -224 71
3551 71 -243 -98 -86 -318 351 64 -119 133 78 17 106 -53 44 -177 31 21 -134 -102 40 151 223 16 -3
3574 -3 -223 20 -103 3 360 147 -4 88 303 117 -52 -39 43 85 -69 270 495 -185 175 -209 -184 218
3596 218 -118 -227 87 -315 -268 198 -142 -20 -117 -240 -59 217 -22 -75 122 -143 27 -93 -97 37 165 -142
3618 -142 -146 155 24 81 127 65 -138 104 196 149 -181 -155 -113 18 -63 -170 263 314 163 188 -49 4 205 226 -239
3643 -239 6 67 -49 -23 383 127 -96 113 249 -50 192 88 32 -53 -34 97 -264 -163 -90 -267 -278 116
3665 116 225 -111 115 -92 120 -280 197 -52 -28 -155 181 -264 22 334 -50 -89 151 -121 35 70 132
3686 132 -83 180 1 17 11 79 214 325 -88 -57 179 62 62 23 99 -110 232 -149 160 -96 -199 30 -326
3709 -326 -335 141 43 -254 105 -242 9 321 154 6 -160 -106 149 218 -112 -198 -257 -111 -100 100 28 -4 -147
3732 -147 241 113 110 -142 -173 191 11 142 -87 11 165 -121 61 29 -359 115 215 54 -167 151 8 126
3754 126 86 -94 7 140 53 -203 25 -188 206 -170 -90 215 -478 -123 42 32 -127 -251 -4 16 143 194
3776 194 183 -73 91 149 -82 36 -26 -169 -33 -161 15 -169 53 15 -38 -39 -206 108 24 -32 52 -42 43 14
3800 14 -1 177 352 69 -233 116 49 26 81 342 98 156 114 318 -119 12 -35 -21 -17 70 -142 -115 54 53 -195
3825 -195 184 -134 -117 278 -74 279 -148 -34 53 176 128 70 115 -168 27 15 119 214 91 52 78 -171 -188
3848 -188 198 -259 68 131 -1 -243 -133 -145 -73 -139 48 141 80 -67 -69 109 -100 -25 -76 -220 80 247 -101
3871 -101 89 -51 -21 243 -122 -278 125 152 -86 -129 -221 128 -151 -248 -107 -192 -162 136 -19 110 -80 89
3893 89 -16 220 -172 -65 27 148 107 301 -242 -319 55 30 34 136 169 150 -99 -165 71 -193 -308 -36 83
3916 83 -88 291 -30 -52 163 29 -54 86 -32 224 229 -8 151 83 -44 -46 25 -123 -2 117 189 63 190
3939 190 -87 -199 -174 8 -67 -68 61 -238 108 -53 125 -240 93 237 83 200 -234 -120 -24 151 -124 -158
3961 -158 -321 -167 -3 -49 -240 -5 -80 -246 -57 -154 58 85 75 12 350 127 85 6 108 159 63 -2 29 41
3985 41 -110 109 40 395 -27 -11 -129 76 -314 90 -224 -166 -30 2 -32 20 69 -98 -32 342 40 77 127 67
4009 67 0 61 -103 82 80 -146 11 90 145 -55 189 63 17 -188 -101 -97 116 141 -50 95 110 359 2 -13 -152
4034 -152 193 -62 0 -117 198 149 -25 17 -100 160 126 196 28 -147 -236 232 -60 26 174 -160 89 159 -71
4057 -71 67 -186 -112 10 73 -141 151 -216 70 2 -7 -44 -36 102 4 40 182 -58 -35 245 191 5 -222 124
4081 124 77 167 195 52 -305 90 -152 -32 -202 150 21 61 -277 53 151 148 53 -103 -136 -140 -55 -31 2 -106 -56
4106 -56 66 -115 -9 224 81 5 81 -49 165 -84 -17 31 -82 -154 -171 58 -70 192 -172 -116 -26 30 84 16
4130 16 190 109 -106 97 50 -13 146 -31 -19 113 -297 -175 230 248 -148 43 60 51 175 -280 108 -132 41
4153 41 -214 -96 17 -210 78 -118 -14 84 152 53 338 219 -113 46 -138 3 67 21 -122 -97 -101 -103 -40 -89
4177 -89 6 218 -139 329 51 -288 -99 -79 21 51 171 278 -107 108 -202 35 -2 103 -221 -137 232 51
4199 51 141 -146 73 -12 84 341 -59 119 79 -201 -70 59 148 -66 2 83 -41 187 311 -115 -29 -215 31
4222 31 10 -33 54 45 123 -142 64 -179 -44 171 -177 10 103 38 -125 106 24 -114 -90 -9 45 51 -81 58 437
4247 437 -13 -149 67 -136 134 -99 -86 91 2 -59 -167 -158 -77 256 29 210 -54 -90 164 91 -70 -65 -39 -113
4271 -113 56 -53 16 -265 -235 36 128 -212 -40 78 -14 -91 -318 87 125 72 -186 87 94 -38 110 131 13
4294 13 -237 -133 -258 45 -205 34 42 -259 -62 112 146 -8 -114 -77 140 -145 98 74 -266 224 -144 -284
4316 -284 92 86 77 48 167 87 64 23 101 99 -32 69 -190 49 -62 56 -114 124 164 -139 142 169 204 47 58
4341 58 -134 -4 -77 -124 -38 -358 25 3 -129 -164 26 -58 111 105 243 -80 -77 10 -25 217 108 -22 149 -118
4365 -118 -82 -135 -138 40 43 -3 -96 -112 71 -36 -105 64 -108 58 81 50 -19 96 -64 -20 -11 183 -232 8 -7 -40
4391 -40 142 70 46 -55 270 -122 -362 34 -29 160 63 -266 -49 -106 -14 -24 64 58 -67 227 -166 -103 201 -17
4415 -17 -285 10 286 31 111 148 153 -58 53 127 75 2 41 72 303 -262 -23 154 125 -4 -47 149 -3 -152
4439 -152 70 137 -166 112 -68 254 202 113 -21 -91 -74 -161 -175 -26 95 153 -55 146 -75 -106 -316 19 180
4462 180 -61 -1 -130 -168 136 -22 175 47 -229 -84 325 -78 26 193 -18 -190 -271 -269 36 -129 -192 -7
4484 -7 95 -178 -145 17 23 65 -186 -12 -76 198 238 -173 1 -19 -163 -89 -218 -2 -162 -89 -56 -42 -173 -73
4508 -73 207 61 -137 104 166 -70 47 -24 389 -59 -117 115 190 144 -262 -84 -22 -229 -256 -263 21 44 -24 211
4532 211 -169 -38 145 55 152 -8 -51 -257 -64 -18 -132 -136 113 113 -72 166 118 146 260 5 205 -223 28
4555 28 -313 -220 -228 -154 -190 -80 -220 -311 152 -206 -104 55 -302 -172 111 -261 70 -4 29 -44 40 -4 -87 22
4579 22 -81 66 56 20 177 42 -253 -23 -315 -124 -155 57 145 32 -15 -200 -66 88 218 -119 -117 -76 -118
4602 -118 -74 35 45 69 2 -237 -93 92 -39 342 79 190 -23 145 156 17 200 18 175 -17 165 269
4624 269 -25 54 -137 40 109 -105 173 -56 -7 109 135 -88 -111 50 291 -176 10 131 -50 -6 -128 178
4646 178 104 130 178 109 207 224 -203 -125 -205 -53 -189 -234 58 -481 -202 106 57 54 94 35 -221 -34 73 -340 -54
4671 -54 -64 -144 88 -130 -411 -69 21 -5 120 32 -7 91 -23 37 307 -93 26 114 -19 41 189 -83 151 87
4695 87 -55 -165 -79 -175 136 4 247 -111 -104 -150 -51 17 168 75 155 69 -89 -255 74 124 105 -13 -109 -157 248
4720 248 86 -44 -213 39 50 -1 98 -43 -101 162 111 16 -99 134 22 74 88 -3 -40 48 194 -57 72 -57
4744 -57 153 -14 110 -36 -53 -104 25 14 -96 -116 39 98 250 -48 107 -2 -28 354 98 48 63 105 95 141
4768 141 -162 -33 -297 -136 -401 -117 10 84 124 11 77 -47 -196 -127 243 -144 -107 -71 32 152 6 -42
4790 -42 -65 -19 41 -101 153 351 323 -169 -131 129 -183 -113 -100 222 208 182 -177 61 -123 -6 -164 17 53 3
4814 3 -85 -87 -203 197 -44 -42 178 -99 -13 -223 -178 193 -120 51 -18 -137 236 -4 -112 -325 -168 62 43 -159
4838 -159 -269 -113 86 -120 -62 65 -130 159 -111 -139 7 57 -10 -223 -190 93 117 94 154 97 -101 -112 264
4861 264 249 47 -219 82 118 -52 44 -271 21 134 -113 72 176 -20 -272 171 -56 36 -134 -30 195
4882 195 -91 103 136 112 -73 -210 -1 94 -64 109 16 -192 -68 -89 -193 -262 329 108 -154 126 131 -327 37
4905 37 -101 -58 146 54 -10 177 -123 -53 99 155 -210 -128 39 57 190 -105 -100 -3 10 -78 114 117 -53 96 -228
4930 -228 -20 10 -28 -83 66 -111 -41 16 122 -155 -181 91 -99 32 -182 104 -107 156 -271 78 64 -231
4952 -231 -34 -243 -163 -211 -50 -76 -20 -82 65 -259 343 75 -217 -22 5 -69 154 -12 77 -267 -12 -34 -2
4975 -2 -288 -188 -178 -181 37 174 -375 -167 30 35 28 95 -84 204 175 -135 -79 33 40 -53 376 46 -7 -129 187
5000 187 -96 -95 73 -201 -181 70 -122 140 16 -135 -71 87 -159 -186 -38 183 -97 5 -49 -42 -195 -231 -17
5023 -17 -214 59 16 244 -90 -174 -58 -164 -90 135 -137 116 260 44 104 -81 -134 58 120 -108 -32 211 7
5046 7 -32 -86 122 -46 -160 -288 -38 -40 84 390 37 -28 26 307 -94 -107 -160 62 102 -365 -155 209 121 -226
5070 -226 -3 10 -114 -286 -334 -85 27 -140 28 74 37 -166 116 -20 -17 89 132 129 -146 -19 90 -199 179
5093 179 206 -94 2 -47 92 -2 -91 87 74 58 145 42 323 -112 -218 -132 275 4 -220 -16 -2 -65 80 -106
5117 -106 304 -160 -26 -101 -209 39 -73 -8 120 -240 -211 73 -24 108 35 33 -79 -100 -140 -17 -5 -89 28 -76
5141 -76 -67 -84 109 58 97 -37 47 -172 217 -90 -58 199 -335 -133 48 -177 -141 53 84 70 133 191 -186 -49
5165 -49 6 258 -233 17 -54 116 -77 131 -14 36 26 109 -9 140 -307 55 37 6 -107 -14 189 -73 275
5188 275 -102 -96 -180 -256 -84 -15 -23 -211 144 -173 196 -94 -76 20 131 -43 -24 191 93 -289 292 56 41 -137
5212 -137 147 49 -134 132 325 63 51 -24 172 -50 -440 -12 66 219 -47 -22 -159 72 11 59 175 37
5234 37 34 59 93 -75 6 98 38 -7 62 163 -168 106 -115 -143 215 113 254 -101 109 -2 -87 -90 224 84 -84
5259 -84 271 26 -304 22 -44 89 58 -5 -101 -16 -66 -104 7 -64 195 62 224 175 -207 98 44 -8 34 304
5283 304 60 -126 -65 108 -56 82 208 125 63 -89 184 11 277 46 319 77 71 173 107 12 74 -141 -105
5306 -105 170 126 116 -35 62 -54 7 34 -75 123 13 134 -93 -67 -69 -140 -28 -106 -166 19 113 -113 82 -126
5330 -126 10 151 108 -158 314 -130 75 -8 -36 -81 163 234 -164 -232 -138 -71 -223 169 352 -189 108 -68 110
5353 110 82 85 -205 -235 97 177 104 -174 -108 4 -40 -22 -14 -171 269 -187 -117 174 -22 2 157 -282 73 -58
5377 -58 15 56 -327 -279 -155 209 -207 -200 -42 122 -54 -111 -384 -106 191 -75 120 136 -26 79 -50 -148 -150 -180
5401 -180 -218 -165 30 137 -18 -195 -170 -241 -192 -143 195 125 -263 187 33 193 -167 101 -200 -105 79 -4 157
5424 157 -288 134 71 2 -110 -112 69 -186 119 289 293 -99 186 -105 -6 207 -128 164 -59 66 -379 -189
5446 -189 -36 -14 -45 275 200 131 -55 182 49 -5 3 87 -89 30 -100 -466 3 -22 -105 -254 197 82 6 -91
5470 -91 232 426 -26 -54 80 -151 59 32 -94 111 -207 -66 -172 -116 12 28 -18 -34 -132 -103 -148 -202 151 156
5494 156 43 -49 -163 -103 -99 107 -8 83 176 -200 37 49 108 158 392 147 -74 136 -44 160 119 -208 -141 174
5518 174 108 -43 43 151 352 -11 19 -259 -61 108 -46 -41 -41 -126 133 162 72 39 -173 32 -192 -122 217 -104
5542 -104 -47 68 49 84 32 43 93 -222 55 -169 61 27 -38 -115 -59 225 64 272 -86 -45 -104 102 39 -42 224
5567 224 -71 157 -53 -26 67 111 -120 -74 26 -385 130 -113 11 -71 112 -84 -71 -348 55 13 -104 71
5589 71 116 -103 86 98 55 -37 69 107 -120 -71 84 18 -58 -2 302 219 -154 16 -40 318 -46 -87 274 269 204
5614 204 38 298 351 -19 -100 -163 153 -272 -121 -155 -189 130 -135 29 88 207 -173 -280 -282 -250 -63 14 50 -110
5638 -110 264 115 -90 118 -163 286 -126 220 -94 -92 22 -62 33 -16 -30 -11 -105 -78 195 107 120 54 71 -26 -64
5663 -64 116 86 40 27 -230 155 63 43 148 258 -224 17 110 -89 149 -142 -17 -55 5 84 69 -232 133 -84
5687 -84 84 -145 -92 -120 -98 -89 20 -113 230 95 -81 -185 -496 8 148 76 -149 95 -142 306 -110 38
5709 38 151 -184 -105 183 75 -132 -100 148 -205 -49 23 -180 255 108 -212 60 -42 -44 54 -123 -71 42 -28
5732 -28 26 44 -34 -101 -53 -226 61 258 -162 -45 -88 -176 60 233 18 41 33 60 14 -36 -41 238 48 93 -89 98
5758 98 201 331 198 22 -231 -59 -1 -5 18 -43 -29 -95 -21 -128 -5 288 336 48 -29 293 75 -123 108 228
5782 228 42 -185 66 140 -167 -348 35 -305 -116 58 133 -342 264 -154 3 240 -91 -45 110 96 168 -119
5804 -119 -279 -327 44 196 0 -69 -357 53 342 119 -127 50 297 -10 237 143 -5 -185 -219 -150 17 -98
5826 -98 156 -25 -139 -91 225 -82 88 -331 -45 -246 -84 18 115 -255 172 -106 -179 3 -194 24 62 -69
5848 -69 -89 -147 92 171 56 -79 285 -155 176 225 -201 125 -148 58 -140 -79 170 36 -119 -137 -35 -237
5870 -237 12 10 373 244 -188 188 -56 -61 53 -35 -366 96 76 220 61 45 97 374 -137 41 -174 -28 -120
5893 -120 -61 46 266 2 93 -141 -83 -236 -118 -157 118 -55 -35 207 -169 -25 -54 9 -19 116 126 -81 151
5916 151 4 -25 150 -46 -278 7 126 246 227 -338 118 -212 -82 -25 122 -80 -18 17 3 104 142 163 -136
5939 -136 -66 94 -167 69 -210 -160 -237 -24 -15 -114 129 264 133 72 -144 45 187 -73 -124 -39 60 -195 136
5962 136 179 107 -106 -122 -117 -77 76 49 -50 -155 -35 -226 91 -41 150 50 59 184 158 -42 145 137 -90 -70 -80
5987 -80 -104 140 134 -22 78 -29 159 -41 189 100 -103 39 -32 -86 -234 21 -43 97 121 93 7 -77 64 137
6011 137 85 -100 -52 -284 25 103 16 247 97 57 -288 12 -83 81 56 -147 23 225 -98 84 -179 14
6033 14 -172 272 87 183 12 134 276 86 -125 121 175 134 183 -174 -92 -103 157 258 156 54 -259 -185 -318
6056 -318 -115 145 -93 84 -53 -68 58 -80 225 39 -65 267 43 29 93 58 91 64 -26 -186 -122 -80 -308
6079 -308 24 82 -237 102 146 -44 99 125 -124 90 -101 -401 -131 191 75 133 64 -106 53 48 32 154 98
6102 98 -87 39 -200 -20 73 -75 -1 -41 -128 98 -98 170 296 -227 -88 203 -120 119 -114 -41 -129 -145 84
6125 84 48 -73 203 -183 -5 -114 -60 232 179 76 -36 64 -228 78 298 84 296 -16 -21 42 105 15 -76
6148 -76 -174 69 -240 182 127 2 35 -239 -192 -77 30 -71 15 301 77 4 -185 -124 94 164 -8 -16 323 -19
6172 -19 -45 -192 120 -86 78 -161 73 27 -160 -225 -225 3 13 2 -68 -151 -5 1 -38 -133 86 -250 -109 -138 -152
6197 -152 -42 -146 -126 -281 12 -54 114 257 21 -68 32 199 38 -190 77 26 122 -45 -373 108 0 146
6219 146 163 108 307 165 -311 233 83 -164 11 -379 86 -33 41 -27 135 138 -41 152 -36 -201 -205 -136 72
6242 72 54 113 -25 31 -87 -276 103 26 -164 23 -96 -74 -3 1 -116 40 247 -67 -217 -80 -8 -26 31 -17
6266 -17 81 -62 144 229 -189 186 253 -160 -64 182 122 101 130 -80 27 158 -108 -162 276 257 -164 215 83
6289 83 54 -32 -31 -168 32 71 153 -108 315 -138 25 -8 97 145 -188 -107 7 86 -196 -42 12 -122 32 -10
6313 -10 55 -16 -80 347 -255 -13 16 4 67 -63 118 63 59 100 -141 -132 40 -112 -118 -77 -26 77 104 263 -159 -177
6339 -177 -250 -28 96 -155 34 -44 -131 -220 -13 202 35 -377 147 -45 141 -2 -114 31 220 61 376
6360 376 120 87 74 201 -27 107 87 15 13 -152 -524 -81 225 -96 59 -227 115 2 42 263 114 -58
6382 -58 111 206 -80 152 289 -85 -68 24 -88 -154 -75 -100 -89 84 -22 -204 -116 -2 53 -106 200 -162 -242 -9
6406 -9 33 207 -171 105 81 79 -48 -126 86 -79 79 -61 36 303 22 -182 -150 143 279 230 -116 -1 -32 12
6430 12 -85 165 -75 -167 48 89 124 -164 -268 245 223 -152 -6 42 -90 -251 206 222 92 -124 -112 -11 -158
6453 -158 72 42 -66 -38 114 69 152 18 -2 209 74 61 -22 -102 104 208 178 -103 77 108 -86 -22 -64 -131
6477 -131 -121 47 -190 57 -108 34 -207 75 13 203 -377 -74 22 -14 163 18 -35 63 98 2 28 -125 60
6500 60 -52 -3 9 51 61 -235 70 -243 -45 54 -241 -46 97 113 -127 51 280 69 -41 167 84 42 -214
6523 -214 -66 -123 -65 -64 48 263 179 197 -167 114 -365 -63 -236 5 -8 -66 -102 -79 -281 -159 19 -204 -224 224
6547 224 -128 333 22 84 161 -305 -70 -24 -73 84 -135 116 -16 -126 -161 -152 19 -220 -142 226 -80 123 99
6570 99 -68 85 -51 62 -14 112 -275 50 -204 300 9 154 -180 -262 -52 -51 -61 57 -69 4 91 353 -117
6593 -117 23 -60 49 60 -1 -28 2 -114 -180 85 -413 63 208 -146 -49 -102 -162 105 139 -141 150 70 53 82
6617 82 -22 300 -60 -13 -167 2 332 -22 -271 -196 75 -126 58 406 186 -135 -14 -34 208 416 134
6638 134 -183 19 -193 -88 -216 -324 -73 -21 -19 75 -76 -78 -123 -241 149 -266 -60 398 129 332 136 282
6660 282 56 31 -166 -205 -113 -68 -8 64 -46 -124 7 -5 87 105 65 159 245 -11 198 108 -115 -72 70 -144 -112
6685 -112 -145 40 27 67 97 53 59 -82 -169 155 -248 254 -110 18 152 -21 -104 -14 33 129 -158 7 54 119 113
6710 113 295 21 77 17 -116 -250 188 16 137 157 -191 -85 -217 166 138 -23 -68 24 -158 148 335 -46
6732 -46 72 154 51 281 76 -151 114 13 59 -83 61 115 -119 -45 -22 8 127 -47 -29 -42 171 353 -129
6755 -129 71 127 53 140 85 224 -68 226 113 -142 -113 148 -158 -35 164 87 -11 -143 181 96 57 24 107 -163
6779 -163 -1 52 -52 -42 -27 -105 96 238 -145 -78 -194 136 -89 -35 -131 -85 -131 54 -84 256 -48 187 -145
6802 -145 64 114 25 -88 -4 5 -16 -17 -156 93 -128 14 -75 499 90 -26 -207 -5 1 -32 -12 17 59 200 -4
6827 -4 4 -131 122 -72 -51 255 -58 178 359 -46 238 -297 13 32 277 -115 -11 -35 25 79 92 82 -99 40
6851 40 -81 71 -305 -63 138 -112 -108 -23 59 271 127 -43 43 -90 -86 -213 23 301 -35 212 49 -114 42
6874 42 -180 -271 -6 -147 21 -67 -129 -2 -114 -54 -129 -188 63 -8 24 -222 -66 -174 125 -138 14 -206 -70
6897 -70 -36 311 126 159 -2 -43 -34 26 -90 -171 91 -117 123 -176 62 -285 -92 -208 154 -37 105 40 29
6920 29 67 -93 -119 -3 -16 -100 37 -138 -99 -42 62 90 -8 64 44 286 63 -215 59 -13 -314 43 10 33 -17
6945 -17 -104 323 16 -24 -46 -111 130 -33 137 -42 -44 -69 103 -178 33 -32 124 -153 180 -77 -95 14 -107
6968 -107 -107 -11 192 -96 72 151 250 216 12 12 84 -42 -152 -84 15 -198 217 -12 -72 -156 8 -29 32 195 -55
6993 -55 75 159 174 -169 150 61 -83 -90 14 -156 192 79 5 -80 -173 28 -224 -182 207 16 221 120 32 -75
7017 -75 23 -137 -155 37 81 -164 -149 64 -51 -171 -47 49 -53 154 -351 -22 -122 -80 233 164 -212 71 286
7040 286 73 -50 -93 -8 -320 86 -58 0 14 -43 -16 -33 142 -168 -67 48 -14 192 100 -335 -289 27 104 116
7064 116 139 57 69 157 -119 -67 -17 136 228 348 110 209 191 -335 4 19 7 7 -35 204 57 -233 -69 167 259
7089 259 153 309 81 -1 100 -50 23 5 179 48 221 287 148 54 -34 9 -273 117 -11 31 -50 -146 -27
7112 -27 86 13 -97 -130 -30 62 -16 -60 81 -77 136 4 -132 -65 58 -10 -144 -44 195 13 146 -112 -42
7135 -42 -322 -125 -11 -29 -75 57 177 163 168 -25 117 184 80 99 -502 -97 -160 -84 165 32 120 88 291 -103
7159 -103 -98 143 -152 -234 -96 71 -248 -96 38 126 50 -110 83 -3 -52 -102 -98 -94 216 55 -58 -262 24 113
7183 113 -57 -139 42 -143 -21 170 -171 489 -108 -11 124 -27 145 -6 175 270 -112 237 142 -152 -146 166
7205 166 37 10 69 22 -136 12 -122 17 -22 203 127 -120 158 117 -200 -87 -163 -64 61 -13 -242 -132 -44
7228 -44 46 -30 -160 101 38 213 227 -182 110 237 -16 -29 -55 -113 -80 -79 -27 7 -329 97 -369 8 12 -22 179
7253 179 -27 99 97 225 113 -153 -270 60 94 116 354 102 -144 -19 75 -127 154 60 311 23 92 36 -96
7276 -96 199 242 160 70 96 30 64 -199 -41 -140 -194 -50 23 128 -104 260 34 5 -7 -24 -15 101 43 -97 72
7301 72 -87 117 67 -182 178 157 -35 1 45 -121 129 65 -187 -21 189 63 67 -16 -122 -121 70 74 -75 7 -157
7326 -157 103 268 -200 -7 84 67 171 -46 -150 10 47 -99 143 -286 144 56 -79 19 -132 -111 351 4
7348 4 -222 -92 -70 -123 142 -135 94 -168 51 344 4 80 56 48 -90 118 -222 90 12 92 -78 144 82 110
7372 110 194 123 -186 -181 24 119 -60 153 78 138 -177 -64 -247 -70 -124 -44 -265 -181 14 10 0 373 43 -172
7396 -172 38 75 211 -107 -100 -129 -36 -156 -252 221 306 -180 -31 0 93 -177 -40 -42 5 10 228 -151 -29 -127 -290
7421 -290 66 -192 283 -77 -103 178 -130 -166 -177 153 -250 11 32 -52 99 45 38 -103 -140 -125 186 -55 9 120
7445 120 124 88 -121 -157 93 -8 110 0 55 33 30 -229 -31 74 -65 218 78 -105 -114 -63 249 46 -28 32
7469 32 186 -204 -88 -88 228 138 57 146 19 234 -63 45 27 90 -214 59 28 -4 -58 -28 -2 -61 -82 -96 66
7494 66 -238 -36 120 125 20 81 37 -70 210 -7 198 71 50 -62 38 -119 -219 30 -3 -8 -128 278 -21
7517 -21 298 -16 64 1 48 29 -177 -192 -36 -54 109 9 -59 96 -190 61 19 -10 -41 232 -61 65 73 -137
7541 -137 -82 82 -60 -372 110 -47 -10 -145 -41 -198 72 22 60 22 43 -154 54 -95 147 153 28 -184 -182
7564 -182 -26 -3 212 23 81 -69 134 -119 -24 -37 62 67 -291 245 -28 16 -178 -160 -335 -102 118 29 -110
7587 -110 105 139 -197 119 -57 -16 178 377 -229 36 -173 -281 120 224 305 -96 15 59 172 -23 -105 -147
7609 -147 -103 213 276 -58 15 -124 -17 -30 -59 135 543 163 -152 183 138 83 -7 -19 222 -262 128 18 120
7632 120 14 -118 -128 -168 239 -135 -52 54 52 83 185 -50 -103 133 -156 60 -86 -14 217 125 34 64 117 24
7656 24 239 -146 -139 -40 206 41 -8 -62 38 -34 -15 115 203 82 -282 -109 -2 140 -7 -30 -85 87 -15 6
7680 6 36 -43 -14 -150 -134 330 -20 66 -336 -106 42 -65 73 -7 217 286 -174 127 88 275 146 -58 -160
7703 -160 -75 -163 12 -28 60 -238 -35 -95 173 56 155 109 -12 195 -66 -71 32 -20 -8 -310 239 -103 86 -265
7727 -265 -253 -88 80 233 -25 65 -115 -210 -150 -215 -199 407 -13 64 219 215 126 24 -37 -18 -117 -92 68 293 145
7752 145 -148 -228 -141 95 -396 28 -109 -175 98 108 -297 48 -300 -79 -36 58 103 82 -143 -291 73 -51 70
7775 70 59 -48 -117 98 -10 -81 170 52 -133 -87 -88 -403 -197 133 117 -3 293 -16 -136 195 -359 -264 -55
7798 -55 193 -104 -9 -59 -17 -156 146 309 -19 208 -42 -176 -112 104 -98 -315 -99 139 -225 -181 192 -52
7820 -52 96 -112 81 12 37 29 -135 -25 -59 -17 -153 -124 12 -251 -156 12 -312 182 -15 105 -71 -124 321
7843 321 37 -240 26 357 -8 -155 -74 -54 48 173 -122 -6 -38 61 -20 -21 -87 -97 -87 8 87 4 44 -100 31
7868 31 134 68 45 70 -151 202 69 -202 28 -96 -19 -6 -91 -21 -210 -293 70 -96 218 -181 142 136 359 141
7892 141 -102 36 -99 0 59 -5 111 -24 130 -16 -43 174 -9 31 74 15 42 31 72 126 -145 -64 -106 -315
7916 -315 -5 29 -107 72 -107 -15 8 274 -66 -80 58 35 -142 -283 144 -224 63 -14 -1 309 74 -35
7938 -35 142 -151 23 140 72 10 -167 -101 237 215 -177 -51 -28 -85 233 -87 342 194 -191 12 3 -235 82
7961 82 179 100 -96 -100 18 118 -2 -26 -140 -98 -43 119 239 -306 27 -120 -243 206 260 -77 64 -66 -76
7984 -76 -30 2 51 -117 -138 -62 -42 22 89 -14 -88 -27 -72 -167 41 150 -143 -99 -89 56 48 349 -210 96 22 50
8010 50 -32 -12 121 73 85 -196 -41 93 68 -57 26 -58 -15 -69 -156 49 218 -42 26 99 -29 9 272 192 -76
8035 -76 393 259 80 71 -332 -140 83 265 -201 164 10 -9 -37 -259 -169 56 -146 -3 261 -312 -65 129
8057 129 83 -216 24 -90 96 231 -53 -210 -96 -200 216 -23 -115 284 -96 45 86 52 36 279 -145 -50
8079 -50 -116 11 -27 -229 -36 157 -147 -48 -10 206 53 281 48 -12 -120 7 349 142 -103 111 64 223
8101 223 -130 -64 135 -21 216 -33 178 -121 5 -219 -36 34 -68 -28 27 -63 -200 -113 1 102 -89 -1
8123 -1 168 50 -120 0 292 51 63 -147 33 -142 -106 168 71 -57 182 95 127 -140 -94 200 -167 -153 78
8146 78 79 -28 -117 -338 -188 -222 -92 238 171 -208 109 181 156 -6 -143 -212 -104 120 -100 378 114 178 -59
8169 -59 23 108 194 -25 -260 166 93 163 213 -38 -75 -51 224 -123 81 -200 22 -92 61 -101 -59 -195
8191a95
$$ Imaginary data points
##PAGE= N=2
##DATA TABLE= (X++(I..I)), XYDATA
0 0 0 0 0 0 0 0 0 0 0 0 0 0 0 0 0 0 0 -8 8 -8 8 -8 8 -16 16 -16 22 -24 28 -32 37 -40 47 -53 60 -68 76 -85 93
39 93 -103 117 -129 142 -157 174 -192 212 -234 258 -285 313 -344 381 -421 465 -516 573 -640 717
59 717 -809 921 -1059 1237 -1471 1795 -2285 3096 -4677 8937 -46351 -117551 -12236 60472
73 60472 38414 -23398 -26557 13465 28481 6485 10468 10780 1862 13803 19245 -2083 -2619 22340
87 22340 48809 31256 -23155 -25969 30513 46555 14997 -12205 -15006 7944 23879 14158 8260
100 8260 -246 -10371 185 2018 -10858 -4793 2239 -4752 -10106 -15637 -8293 7091 -823 -12793
114 -12793 -17160 -26652 -15301 9452 3794 -14356 -19751 -12011 3624 -1351 -15528 -3407 1751
127 1751 -14844 -12312 3429 11378 8961 -4139 -3335 7944 168 496 16723 10405 -4322 -1699
141 -1699 8065 19481 14688 -184 5438 9057 -1644 3161 10767 5667 4349 2007 1133 6496 1045
156 1045 -415 5848 -5559 -13608 -2085 3350 2304 -2770 -10099 -3245 1977 -8521 -7276 -2377
170 -2377 -6719 -4210 -4937 -8114 -5 1521 -3334 -3779 -8794 -6344 5656 14 -7229 -979 916
185 916 3202 5374 460 4378 6012 -3557 -262 5651 3122 5918 5520 696 5335 4684 1760 6773
201 6773 1643 -3399 2772 1421 1143 6888 2645 -288 401 -3517 930 3378 -5627 -4428 -138 -4475
217 -4475 -1954 -1334 -4075 635 -3628 -8682 -2750 -2544 -4225 94 -3755 -4948 1314 -604 134 1921
233 1921 -4515 -3192 726 -2685 939 3628 -844 1788 2971 436 4464 2185 -1223 4832 2262
248 2262 -646 5155 5105 4771 4978 -1286 0 5934 1508 855 1528 -2442 1938 3703 -1640 1585 1845
265 1845 -2411 -640 -3221 -4396 2011 -460 -4984 -1701 -3117 -1864 882 -4544 -4650 -977 -5458
280 -5458 -3932 -6 -2305 475 546 -3728 -194 668 -2600 874 -217 -2133 2802 607 -664 3878
296 3878 1673 39 2453 -362 1598 5400 27 909 4544 1741 3642 3157 -631 3228 2708 -2107
312 -2107 945 1242 -718 2861 -47 -1938 2803 9 -1795 568 -3250 -2097 1225 -2772 -1391
327 -1391 1097 -2992 -1706 -1159 -4276 -700 -1129 -4969 -927 -757 -2807 677 -954 -1607 1780 -1930
343 -1930 -2162 2223 -264 -144 1985 -1271 890 3538 -511 1126 2083 -910 1936 1551 -1268 3964
359 3964 3204 369 2785 1341 496 3236 -428 -1421 2569 -98 142 2260 -1290 147 1691 -2814
375 -2814 -489 994 -2578 22 -149 -2684 1010 172 -2646 489 -1240 -2817 139 -2445 -2481 1164
391 1164 -2139 -2191 968 -1512 76 1014 -2792 -35 1267 -2047 1022 1319 -344 2898 738 -1690
407 -1690 2122 747 -1094 1674 -354 -256 3240 145 730 3014 -26 630 1800 -1232 1607 2408
423 2408 -1435 1365 1179 -1128 1200 -96 -2119 1566 -548 -2584 356 -1060 -439 1864 -1626 -823
439 -823 1689 -1955 -1073 47 -2645 -5 570 -2606 11 269 -2101 612 -670 -2082 1383 -663
455 -663 -1531 1855 -129 -364 1966 -942 -149 2395 -1327 -93 1596 -1040 967 1346 -1491 2113
471 2113 1629 -1338 1174 542 -924 2090 -163 -1130 2276 162 -612 1653 -1165 -409 1378 -2142
487 -2142 -632 1255 -1534 258 680 -1705 717 501 -2158 611 -482 -1997 906 -595 -1190 1448
503 1448 -1295 -1580 869 -1425 -570 1053 -2227 -59 1390 -1275 539 1152 -1153 1348 328 -2118
519 -2118 1135 583 -900 1535 -388 -967 2052 -461 -465 2053 -473 -182 1842 -836 1174 2179 -873
536 -873 882 1102 -1470 928 354 -1530 1254 213 -1421 1253 -38 -910 1518 -1136 -1123 1479 -1090
553 -1090 -605 835 -1479 68 1345 -2135 -417 76 -1743 183 -373 -2331 635 10 -1191 1397
569 1397 -160 -1086 1438 -416 -447 1248 -819 -92 1597 -872 141 816 -1605 752 1259 -1673 589
586 589 749 -636 1702 329 -783 1795 599 -914 1472 -486 -69 1848 -657 -160 1657 -1008
602 -1008 222 1108 -1580 315 685 -1329 459 322 -1395 1131 -92 -1419 747 -856 -2160 559
618 559 -1281 -1195 764 -1772 -761 1114 -1345 -378 864 -1159 970 1057 -1440 1009 748 -606 1280
635 1280 226 -981 1325 275 -365 1559 -409 -152 1783 -324 310 1699 -543 665 1169 -1342
651 -1342 320 809 -998 993 431 -1366 553 -154 -1181 852 -381 -1003 1132 -577 -756 1148
667 1148 -964 -297 1048 -1736 -791 209 -1709 296 98 -2319 309 -90 -1776 833 -1 -1237
683 -1237 1004 -550 -927 1786 -187 -96 1777 -825 118 1399 -787 249 932 -1053 810 1232 -775
700 -775 1235 953 -487 1447 353 -202 1740 -18 -435 1585 -605 -706 1185 -966 -531 337 -1708
717 -1708 -313 600 -1709 -207 176 -1735 512 33 -1571 619 -228 -1298 576 -613 -1229 1010
733 1010 -981 -1126 691 -1139 -239 964 -1075 326 1008 -865 744 1003 -596 1142 851 -748
749 -748 1381 508 -514 1770 123 -697 1692 -26 104 1398 -459 99 1418 -583 361 1098 -1185
766 -1185 430 941 -1269 253 -178 -1392 543 -647 -1263 695 -927 -1282 687 -805 -808 794 -1370
783 -1370 -636 488 -1205 -13 384 -1051 -111 161 -1329 584 92 -723 1141 361 -417 1265 302
800 302 -357 1554 -272 -210 1470 -647 208 1229 -638 386 994 -817 886 1020 -798 981 215
817 215 -788 1053 466 -735 991 -300 -987 958 -1013 -693 745 -1049 -704 390 -1278 -353 173
834 173 -1602 152 290 -1266 578 -200 -1306 680 -221 -798 742 -593 -712 617 -903 -6 1309
851 1309 -606 265 1387 -536 490 1001 -644 884 1005 -625 1048 547 -599 1040 195 -579 974
868 974 -213 -672 1126 -646 -157 1316 -1061 -77 1103 -1013 -154 472 -1296 75 79 -1753 189
885 189 -287 -1327 252 -344 -1200 492 -555 -809 869 -921 -343 1020 -722 113 967 -430 441
902 441 550 -838 849 729 -818 936 618 -422 1153 539 -315 1472 100 -50 1508 -355 171
919 171 1185 -688 220 1120 -739 56 566 -1003 448 356 -1176 165 108 -882 834 -248 -1109 456
937 456 -876 -832 703 -935 -712 87 -1561 -386 599 -1422 -290 178 -1031 406 542 -1009 645
954 645 341 -729 1145 211 -599 1291 308 -127 1123 177 -61 1469 -3 542 1433 -474 903 1098
972 1098 -271 680 533 -547 842 239 -988 521 3 -409 1024 -882 -622 508 -789 -333 621
989 621 -747 -258 426 -1406 -119 242 -1354 -194 -287 -1293 250 -317 -1442 444 -425 -658 711
1006 711 -349 -348 685 -594 -55 1405 -676 222 1050 -683 393 669 -467 836 252 -690 908
1023 908 396 -202 1201 321 -207 1181 92 -102 997 -369 -229 568 -710 -340 346 -1013 -167 99
1041 99 -1182 18 347 -1084 309 -256 -1075 508 -419 -582 666 -320 -699 390 -894 -372 863
1058 863 -902 -55 754 -845 183 342 -549 718 686 -520 949 190 -376 1085 73 -448 870
1075 870 -220 -187 1077 -413 -176 1081 -507 -62 728 -350 609 771 -728 506 307 -1044 456
1092 456 -179 -918 569 -362 -709 273 -850 -530 511 -447 -58 654 -776 41 803 -975 140 583
1110 583 -1088 161 -62 -1026 475 211 -691 871 -54 -490 1042 -4 -89 1197 134 341 1133 -405
1128 -405 193 749 -560 55 413 -712 634 276 -657 617 92 -596 680 -387 -506 603 -354 -480
1146 -480 774 -669 -187 575 -1216 -399 178 -1232 36 200 -1043 407 135 -892 451 -106 -714
1163 -714 728 -93 -513 1057 -318 -372 677 -363 -13 512 -431 553 713 -675 635 428 -441 759
1181 759 701 -192 1178 491 -474 553 -269 -558 764 -458 -360 699 -537 -276 371 -396 232 381 -1023
1200 -1023 84 314 -1013 404 -14 -916 270 -397 -998 211 -450 -852 380 -455 -240 629 -616
1217 -616 -331 545 -724 26 701 -583 252 495 -484 800 570 -679 663 22 -550 1036 82 -20
1235 -20 1125 -292 -184 927 -310 184 681 -731 253 679 -690 154 254 -865 200 -93 -721 547
1253 547 -346 -727 469 -81 -579 375 -308 -250 420 -812 -160 345 -1235 69 22 -901 154 448 -775
1272 -775 307 140 -664 577 -226 -414 780 161 -89 758 -17 -119 602 -422 139 803 -464 347
1290 347 763 -625 411 315 -445 796 324 -485 822 -79 -512 577 -159 -436 544 -550 -321 492
1308 492 -466 -105 630 -746 -153 342 -779 103 322 -634 70 100 -794 379 -79 -563 409 -390 -508
1327 -508 279 -376 18 589 -284 -200 696 -641 -20 548 -606 369 23 -665 913 -106 -492 586 58
1346 58 -474 577 -123 -91 1007 -193 72 699 -389 -5 540 -420 164 398 -572 333 61 -809 409
1365 409 -201 -880 315 -36 -332 516 -352 -351 553 -192 -325 529 -591 31 449 -561 95 170 -697 366
1385 366 42 -678 426 209 -544 410 74 -88 479 -228 -229 697 -299 -222 573 -590 165 382 -569 266
1405 266 331 -332 542 639 -473 675 119 -719 440 9 -622 613 -284 -213 753 -465 -269 207 -715
1424 -715 -124 -6 -653 211 335 -648 268 302 -599 310 -120 -668 293 -735 -455 349 -545 -232 230 -417
1444 -417 -238 358 -543 280 482 -467 320 347 -625 383 -23 -364 744 -137 -449 588 -109 -219 583
1463 583 -31 64 621 -313 132 709 -355 337 126 -672 185 177 -451 153 85 -559 193 136 -603 433 -18
1484 -18 -438 164 -418 -349 466 -301 76 323 -487 -5 84 -544 -65 191 -736 136 68 -473 251 -283 -451
1505 -451 522 -202 -92 571 -173 -19 637 -400 31 592 -398 -157 598 -524 503 404 -271 250 195 -21
1525 -21 356 95 -65 476 -69 -594 201 -467 -157 345 -323 -89 280 -711 -105 213 -488 116 209 -333 157
1546 157 -3 -737 284 -105 -496 255 -421 -505 143 -516 -357 482 -559 17 449 -563 25 11 -308 541
1566 541 138 -519 451 98 -576 410 -329 -230 580 -577 -103 475 -47 -81 370 -184 -200 444 -463 -53 363
1587 363 -131 215 65 -570 585 56 -371 153 -469 -399 489 -227 -225 767 -205 107 330 -653 102 511 -502
1608 -502 -75 410 -555 19 174 -673 354 251 -398 499 93 -391 764 197 -63 571 -142 -200 454 -460
1628 -460 -37 336 -353 325 281 -351 204 374 -156 335 160 -214 502 354 -203 525 30 -74 473 -126
1648 -126 -151 600 -371 163 181 -339 -81 173 -611 440 282 -441 373 64 -335 517 53 -195 358 -349
1668 -349 -216 283 -344 -70 253 -349 65 486 -209 254 646 -360 582 156 -424 363 -89 -358 623 31
1688 31 -177 246 -101 -193 616 -122 119 649 -97 22 228 -388 106 366 -587 80 256 -597 220 4 -568
1709 -568 468 71 -555 369 -146 -366 341 -409 18 316 -413 -280 556 -416 -210 6 -375 171 131 -522
1729 -522 472 43 -180 636 -243 -178 441 -292 -137 676 -115 -141 344 -367 157 184 -364 -170 292 -360 353
1750 353 185 -410 553 163 -144 254 0 51 612 -254 -266 283 -412 25 456 -322 -91 361 -407 -38 259
1771 259 -315 291 102 -180 531 162 -376 210 -122 -136 372 -354 -105 544 -149 -124 95 4 -101 165 -297
1792 -297 470 89 -353 188 314 -585 330 208 -255 406 -54 -228 556 132 -200 350 -308 -148 413 -205
1812 -205 -115 482 -497 225 275 -614 215 -125 -448 431 -364 -275 153 -160 -66 343 67 -128 338 -341 143
1833 143 415 -261 -83 208 -475 76 303 -561 241 17 -439 473 96 -339 379 137 -230 260 -91 -98 390
1854 390 -221 -78 317 -210 -10 262 -437 300 114 -498 149 52 -299 285 -116 -513 385 -214 -121 137 -219
1875 -219 -45 477 -158 -7 402 -516 -238 137 -385 -131 145 -471 389 183 -422 174 161 -282 339 -353
1895 -353 -350 499 -219 -100 356 -223 -14 227 -289 191 508 -304 94 145 -227 496 164 -298 449 30 -299
1916 -299 218 -403 -23 244 -9 -38 536 131 12 314 -97 89 74 -247 124 117 -338 170 -194 -187 238 143
1938 143 -178 131 -146 -148 358 -243 -117 367 -64 -120 396 -417 9 64 -715 56 53 -644 120 -62 -278 555
1960 555 -174 -373 318 -102 -10 571 -201 87 320 -119 -190 276 -299 -182 13 -71 113 72 -389 -2 287
1981 287 55 247 -148 -292 461 -248 -130 268 -239 -123 482 -409 -61 -102 -191 -13 87 -74 266 220 -199
2002 -199 204 -36 -140 232 103 -176 413 -77 -234 174 -228 -69 243 -411 77 351 -413 -57 182 -156
2022 -156 28 200 -258 516 115 -202 257 -179 42 531 -281 -104 443 -137 -109 237 -251 94 147 -494 84
2043 84 198 -448 152 -22 -505 100 -174 -384 137 34 -348 408 -353 -76 155 -252 53 301 -351 -27
2063 -27 -13 -231 -84 202 -245 197 -126 -90 273 128 -383 220 144 -194 532 92 112 495 -230 3 421 -113
2085 -113 33 166 -619 264 53 -272 -64 11 -289 115 -95 -195 577 154 -130 368 -305 -122 311 -286
2105 -286 -122 276 -253 -370 101 -315 370 96 -340 184 15 14 119 -121 -77 385 -129 -454 203 20 -340
2126 -340 85 -271 -88 464 -336 57 265 -245 193 236 -344 112 50 -191 303 -10 -121 190 -47 -290 41
2147 41 -128 -243 227 -88 -60 490 -344 -63 304 -196 -79 127 -17 192 177 -606 229 207 -122 358 20
2168 20 30 512 -118 -1 155 162 67 294 -420 -81 396 -319 247 137 -353 226 343 -520 375 115 -185 48
2190 48 127 -83 287 -300 -148 167 -83 112 164 -310 288 29 -250 -196 32 -287 -117 -276 -168 376 71
2211 71 -45 307 -5 34 358 -413 52 163 -258 -36 234 -303 -56 21 -330 436 325 -328 217 -57 -47
2232 -47 349 32 -198 337 -56 -25 77 -534 -49 260 -331 -216 240 -176 -124 173 -247 262 255 -362 230 31
2254 31 21 49 -86 -138 94 52 -16 349 -197 -115 665 -103 -67 72 -149 185 338 -267 111 -45 -179 -120 19
2277 19 -135 184 -68 -265 418 327 -257 253 -54 -62 380 -79 -118 -60 45 216 111 -362 110 235 -99 -2
2299 -2 91 -115 279 61 -108 246 -281 -192 286 -108 156 105 -21 -135 261 -93 -90 -231 -16 41 -31 -112 151
2322 151 30 -240 161 -178 -72 172 29 -275 242 174 39 188 -185 76 290 -187 64 163 -233 228 77
2343 77 -97 124 -45 -320 282 204 15 235 105 -6 196 -168 -322 205 -338 -152 195 -199 124 108 -472
2364 -472 24 -178 -182 238 153 -309 484 126 -40 270 -272 -197 154 -263 -425 142 -32 -168 93 -234 87
2385 87 515 -144 58 57 -209 -3 155 -121 69 91 -32 277 0 -46 231 -142 -205 -1 -264 37 -51 -275
2407 -275 92 -33 -328 71 147 -238 206 17 -73 282 -41 -207 142 13 -196 250 -393 -44 304 -117 -136
2428 -136 343 -184 208 9 -335 -143 125 -254 457 -60 -359 221 -101 -147 255 197 -13 190 -65 -150 97
2449 97 -319 -228 216 -252 -87 281 -78 65 15 -312 139 171 -73 -63 -187 -143 172 -106 -430 292 -240 -365
2471 -365 151 -273 -49 269 -265 161 244 -201 141 177 -355 188 156 -122 235 -9 22 19 -145 -239 209 -287
2493 -287 -262 120 -61 74 281 -122 251 -32 -370 323 134 -244 142 386 -282 241 -251 83 395 4
2513 4 -176 293 -259 74 -47 -167 234 336 -385 269 79 -331 147 -45 -184 550 -38 -154 96 -47 111
2534 111 299 -74 -92 310 -141 71 -23 -190 296 157 -55 -107 75 -384 -63 -39 -238 208 -111 -45 375 64
2556 64 -98 238 41 -8 36 -222 -51 211 -281 -69 175 -333 185 30 -51 277 30 -87 -71 -75 -164 381 58
2579 58 70 288 -8 198 291 -153 -218 -4 -439 -131 206 -228 170 -70 -174 383 342 -144 22 -61 -261 -216
2601 -216 -103 -266 142 -464 -132 0 -154 -72 116 -51 -9 305 92 10 441 -71 -42 -50 -200 169 -259 -94
2623 -94 -18 69 41 251 -17 -127 138 -70 125 125 -308 414 -3 -205 474 130 -199 139 -297 -217 26 40 109
2646 109 -4 -90 -53 329 -41 -166 334 54 87 -29 -397 -79 -98 -197 140 197 -27 33 -55 -123 140 195 -132
2669 -132 103 -19 28 43 -132 -281 117 -84 -154 61 -8 -132 -114 -98 135 -1 -87 151 -110 251 48 66 -30
2692 -30 128 -357 -209 146 -258 215 177 -359 -37 45 53 54 80 -331 25 209 178 240 186 242 145 39 117 207 49
2717 49 -291 141 -237 -106 -177 -91 155 125 -67 116 15 -138 -58 334 -154 92 29 -383 44 35 -110 71 -231
2740 -231 -95 28 86 -185 -24 183 11 79 88 26 -71 -55 164 -52 -89 -225 -85 99 -38 -300 -126 439 63
2763 63 -49 26 -154 261 216 -204 19 -10 2 -66 151 -280 85 190 201 2 -267 -291 19 -56 90 -274 -200
2786 -200 -73 244 -232 49 -27 -241 91 86 -148 36 7 65 130 163 42 97 -42 -223 298 -5 -69 204 -150
2809 -150 -206 -44 -347 -35 -17 -263 263 -201 -211 121 217 -80 154 -69 -159 13 -140 -229 379 365 -53 2 -148
2832 -148 -191 332 -78 -69 -15 -45 274 15 -69 -38 -1 -176 111 -161 -275 325 8 -202 -42 -75 14 -47 96 -20
2856 -20 39 -271 38 166 -34 344 204 -229 -63 -23 -216 53 -248 -179 152 182 -314 206 -130 -83 246 -23
2878 -23 -2 191 -132 313 57 -6 41 214 -37 343 279 -13 79 132 308 -72 -37 -132 84 -13 84 134 -110 -27
2902 -27 55 -120 -105 182 -56 6 -145 -193 -155 213 -148 2 297 0 190 62 -203 92 1 -201 97 -86
2924 -86 -8 7 -221 -211 91 -215 72 26 -78 -89 -20 -303 134 341 -24 57 -113 -260 -175 -12 -162 -113 -173 -165
2948 -165 72 -210 -61 130 -46 -88 121 77 -51 112 -287 107 51 -70 -25 88 66 -6 -76 14 276 -96 -68
2971 -68 -34 -87 -34 54 -111 66 308 -314 16 116 -144 170 88 -18 263 -64 -109 446 -33 92 159 -33 -31
2994 -31 227 52 133 392 -201 22 76 11 256 194 -125 -77 176 -230 -68 196 108 50 -165 -119 128 150 0
3017 0 14 -251 -48 89 193 -37 349 -214 54 -156 -43 279 68 -228 -74 24 -186 84 -62 -15 50 -195
3039 -195 32 -37 -305 -114 270 -168 48 -93 -137 -78 11 261 23 -93 101 27 1 -170 187 300 -74 -89
3061 -89 -121 100 280 -76 -9 -60 35 -27 185 -201 0 38 159 48 -51 -175 208 38 114 -69 -29 -89 204 -64
3085 -64 -62 219 -172 -228 -72 47 75 25 -121 -49 38 -180 78 124 148 142 -26 69 -27 -14 -307 74 92 199 219 -45
3111 -45 225 154 -193 11 -142 -84 7 23 -297 -125 57 -10 -218 61 -198 232 -131 155 270 108 -144 76
3133 76 125 -142 145 -110 301 -214 -55 -91 -10 104 -129 -151 -288 -98 180 44 103 -80 -160 170 -109 189
3155 189 180 16 -148 27 -209 -12 -5 -190 -100 -149 -205 27 -143 30 134 22 -140 193 -90 178 47 -321
3177 -321 -157 95 -154 -346 -204 201 53 13 -367 -4 364 -238 25 -67 -34 24 -39 -170 -265 -12 -147 -21
3199 -21 -81 196 -90 59 -297 253 -101 -271 100 -157 30 68 149 53 84 -49 -165 -155 35 35 91 -198 161
3222 161 28 155 465 -211 231 -160 32 118 140 -133 26 50 -100 119 39 41 100 159 71 -40 -21 -65 331 -66
3246 -66 -109 236 107 -52 -22 -211 -85 255 -24 23 65 -157 16 1 -64 179 -56 2 187 248 -50 80 -14
3269 -14 -110 44 -72 -167 -208 -230 -82 229 64 -16 -24 139 241 8 244 84 -114 79 -78 26 -13 30 -294
3292 -294 151 121 245 -246 -10 -12 -55 7 -196 249 -99 17 193 -75 -71 160 -66 238 59 -63 15 -32 -170
3315 -170 15 35 -21 -39 192 -93 191 224 55 56 -199 57 94 -68 -14 220 -82 -152 82 55 -89 -26 -187 65
3339 65 116 2 117 46 -162 -117 125 -95 -86 11 -105 70 -229 42 3 -159 122 62 115 -315 -32 -202 140
3362 140 361 167 -54 107 270 24 -167 -189 117 -62 -226 48 -30 -202 142 103 65 83 56 112 -82 -22 -289
3385 -289 -123 -107 103 -44 87 -33 7 155 -14 90 -163 310 46 280 127 -49 -49 -109 29 -126 2 -355
3407 -355 42 -121 -349 49 212 -419 -104 55 -138 71 232 78 -59 126 66 240 -136 -3 -116 -153 27
3428 27 9 49 -52 -21 -7 -96 -24 -240 228 -31 -129 13 165 41 -301 -20 22 76 -85 103 178 21 60 142
3452 142 76 10 169 -131 -160 58 -40 164 -47 -23 62 -81 -21 203 -60 -181 109 39 -125 219 -18 -248 330
3475 330 133 114 -62 -29 67 -26 -297 -109 -17 -157 191 160 164 24 76 -195 266 180 -67 117 71 -325 86 -105
3499 -105 -112 55 60 248 150 163 178 37 220 272 -288 176 240 -43 14 -79 25 -239 390 -90 -261 -24 -33 -194
3523 -194 137 159 158 91 129 51 34 -18 403 13 -29 40 167 129 224 -68 45 146 -16 75 -80 3 -145 224 119
3548 119 134 -26 -163 352 -47 -78 -153 -28 -73 95 365 -99 118 92 11 -49 -117 -28 47 -91 -65 11 89 -35
3572 -35 0 293 -32 -199 -60 -72 93 -76 136 85 63 315 160 163 -397 -132 219 -125 72 -205 70 45 -116
3595 -116 269 -11 180 -119 141 -72 63 -42 14 74 -61 42 -132 4 168 95 245 67 -159 -72 365
3616 365 -133 -131 107 13 -106 154 49 222 98 -63 -42 -267 -140 -128 70 -55 227 16 -306 175 -211 -137
3638 -137 -73 -276 234 -82 -112 78 4 -143 129 -10 -208 -304 -48 -15 77 14 76 114 132 -123 -170 -29 2 140
3662 140 -70 2 4 30 -27 -389 -59 82 16 83 -261 -83 -54 -112 -108 140 -189 8 -14 66 66 269 113 -93 61
3687 61 -236 -126 11 -21 -325 -26 -156 -61 112 55 266 89 -35 -95 274 78 -69 2 127 113 134 -52 71
3710 71 85 -59 -48 -1 45 -56 185 -10 236 -69 29 -8 -152 148 268 -75 173 147 63 10 -68 -10 182 5
3734 5 -310 62 51 98 239 -135 -33 394 -12 -55 11 120 -165 -100 -27 126 -161 97 47 83 -30 168 43
3757 43 -129 -172 -118 -572 157 115 -126 55 -192 -50 -98 -205 43 25 -248 73 18 -37 20 -116 66 129 180 195
3781 195 129 -19 96 109 -12 -56 46 -25 129 -54 34 -180 -24 -200 -13 168 -327 371 -277 -288 -14 16
3803 16 61 -106 -23 -33 21 0 153 -43 64 99 229 -43 18 211 -44 25 204 45 -270 226 -67 -231 -37
3826 -37 -35 246 -81 -109 125 -122 114 293 55 119 195 259 -43 -114 -144 72 -173 22 -57 -149 -50 104 -320 -11
3850 -11 56 -32 -56 -332 -96 59 -16 -176 61 -205 62 -63 333 83 -140 116 -221 -68 -190 -64 -34 226
3872 226 -68 223 -239 -246 -239 44 -16 -120 -3 103 51 -89 163 207 -98 -102 -57 400 168 -113 -20 165 58 63
3896 63 251 -179 125 -172 19 -44 71 92 40 387 26 -80 285 356 37 155 -5 221 -121 -330 -5 -34
3918 -34 -46 78 109 -140 -9 101 49 10 176 -48 -23 -1 20 -144 125 104 -296 -89 50 159 -96 -114 -45 120
3942 120 93 31 78 -182 173 -5 -139 47 26 -128 8 168 -169 -102 162 -215 -34 175 -74 -164 -35 -46
3964 -46 -110 140 65 66 -88 -111 109 190 -281 70 185 -108 -156 -95 -160 -41 31 -100 -18 -89 145 -47 90 61 82
3989 82 71 -185 -196 11 -16 -13 -311 -18 -31 -40 -161 83 -236 -234 -76 86 199 -217 98 55 -29 24 51 -119 182
4014 182 48 -65 458 18 -200 144 91 28 152 -4 -157 -79 -12 -222 -219 -102 -376 121 236 122 43 -95
4036 -95 113 21 -70 -123 -112 117 307 -9 -146 88 320 -90 320 106 -362 -130 -79 31 -87 60 130 43 211
4059 211 136 -225 -15 -108 -199 113 129 -84 -34 -97 217 -85 -219 -6 -67 -225 -147 -25 218 279 -142 122 -190
4082 -190 -68 5 89 -105 405 -124 -240 167 -151 -39 -281 -124 -122 -228 -17 -20 46 72 36 -48 -40 -120 -140 77 -147
4107 -147 23 -238 61 -119 -7 -78 -35 -24 141 -90 93 41 -90 215 -351 77 -186 132 -126 -127 148 281
4129 281 -69 -274 -13 210 -100 -17 11 -33 -55 -49 219 -116 -62 -77 5 -78 -167 93 -133 119 -265 -381 -1 -392
4153 -392 -24 -154 -74 -137 33 139 -68 -56 90 117 77 -98 -216 -74 -66 -28 -272 100 -253 -6 9 0 0 -176
4177 -176 -59 312 17 117 -160 173 -249 -15 -9 -151 30 -2 -96 -59 -102 -39 -148 75 41 100 -76 16 119
4200 119 -114 28 -120 123 -40 73 -72 49 -192 20 -71 183 105 -27 -6 143 -208 131 64 405 33
4221 33 -49 -138 -72 36 -306 -70 -17 -224 7 -164 -124 -74 272 -72 -108 -349 -40 149 139 -131 -105 48 37 -116
4245 -116 44 132 122 -17 198 -19 87 134 -153 27 -71 -121 -5 108 -177 -55 222 -75 -68 -222 -55 -241
4267 -241 205 -131 -175 -33 79 70 -171 -105 -25 238 9 111 -123 -69 7 -84 33 -110 76 317 -97 179 -212
4290 -212 95 56 -12 115 66 61 53 -260 96 220 -38 43 248 -39 -25 -145 -154 142 -272 45 53 -241 10 -121
4314 -121 -115 169 -67 -43 -32 177 -171 -86 -184 245 48 186 -119 -182 -27 -82 73 349 39 139 56 -121 33
4337 33 -46 -15 -20 203 201 106 -59 117 182 155 -37 73 -25 -105 27 -136 -136 141 93 35 155 -48 -203 -47 -5 344
4363 344 -141 -81 -394 -187 55 222 103 89 0 -41 -118 -340 48 48 187 -66 47 96 -35 40 -60 120 -165
4386 -165 219 66 -45 -24 94 91 115 76 -126 -163 -154 -25 -94 56 94 -151 -105 -138 -115 134 177 -12 18 115 105 -102
4412 -102 -77 -208 10 -39 -112 -178 -338 53 0 144 33 159 -71 -244 -131 -65 214 -14 79 3 88 280 2
4435 2 21 62 228 -246 101 -232 79 131 -1 -61 -177 94 127 250 7 190 43 -157 -132 146 -19 -99 -194
4458 -194 -19 -162 -106 162 -40 -32 173 316 92 -114 123 -55 -11 -223 -90 123 46 -52 -44 67 100 -10 131
4481 131 306 259 -152 -33 -28 -157 -218 -35 26 178 -241 -32 101 164 92 228 91 -64 170 -90 147 -134
4503 -134 -262 58 33 -78 -211 -231 -96 -117 129 -125 50 159 -82 -66 -103 113 -278 -85 -123 159 -18 194
4525 194 39 -150 -110 -141 12 103 -107 269 135 28 212 25 -18 -77 136 -299 158 -95 -103 -88 -69 -190 58
4548 58 -105 -242 -124 -58 -157 22 16 26 15 42 -257 -96 -24 141 -189 13 -121 86 -35 54 209 -150 -96 27
4572 27 131 374 -30 -148 -90 94 252 24 -38 54 108 -113 -8 -150 -9 -51 -3 -178 16 118 -168 183
4594 183 192 31 171 76 16 -340 -23 89 -131 -90 122 8 -179 77 65 -136 -40 -109 8 97 -13 26 -84
4617 -84 33 163 123 -239 -266 -232 -146 -86 57 65 -255 -47 -114 190 -184 204 130 -159 103 173 48 -108 61 29
4641 29 -124 5 -65 -119 -355 -284 273 31 -186 -117 -27 -51 91 -36 -179 8 6 -10 -6 -44 -56 -173 -55 46 -44
4666 -44 -7 -6 -134 -9 -27 -123 -84 56 44 -62 290 409 75 64 82 -27 -157 7 -16 -42 51 59 60 47 262 158
4692 158 137 122 255 33 -27 194 -19 -87 50 67 -252 -121 22 -45 -16 -104 -259 -152 58 58 -16 -272 54 -254
4716 -254 -99 -48 23 -86 -151 92 -243 34 -107 -114 246 130 -78 332 -206 182 -21 1 60 -205 -78 -31 55
4739 55 -21 -55 -258 -211 -18 106 -203 -1 8 45 177 -226 -185 72 20 -172 9 90 -78 -165 33 -17 221 -146
4763 -146 -10 223 271 64 212 -5 255 -217 -66 -147 -42 -45 -173 70 226 -51 7 -85 -114 186 67 -92
4785 -92 61 83 173 225 53 -29 -15 -149 -236 -188 -108 310 -33 230 70 -76 -136 -25 -249 136 -147 62 30 25
4809 25 -83 -16 10 48 88 -86 -13 -87 -271 137 71 -75 48 -60 112 102 -69 -123 111 11 222 134 103 -98
4833 -98 77 -155 -104 -108 -93 -11 -95 -87 66 147 -50 -171 -188 111 -49 219 58 5 202 29 -60 45 133 54 -89
4858 -89 46 19 93 171 -30 -96 -12 151 24 -85 -156 77 133 -77 -235 -217 -9 -79 -141 -3 -220 -216 -50 79
4882 79 -154 60 112 -137 -260 12 -7 -59 87 -167 -92 1 189 65 -144 -300 -110 160 56 64 -202 280 135
4905 135 115 -31 123 121 -97 -173 -127 83 149 -312 32 126 77 230 -261 -89 -47 167 17 32 -200 -215 -60 -200
4929 -200 -52 -113 188 -79 6 215 -191 272 -146 6 48 -91 124 -1 -129 -200 176 -113 -145 44 22 -212
4951 -212 160 213 23 323 -88 -127 -49 -53 -75 -210 144 64 -187 -176 -20 279 -147 150 -82 -20 83 -92 -47
4974 -47 -198 -231 50 118 47 46 144 76 54 100 196 10 344 -43 20 90 -41 124 250 50 -54 46 -266 85
4998 85 -26 -135 -126 55 125 -52 -48 -166 -67 -56 64 27 -199 -190 -37 41 34 -33 186 -161 -82 182 -67 -81 -94 18
5024 18 -136 -58 24 -220 10 111 -103 -264 5 -42 -118 1 154 -58 83 -62 26 21 162 82 -12 154 -42
5047 -42 -148 39 -135 -65 -45 -246 -82 28 225 29 -208 -22 -126 78 14 130 304 -91 67 59 8 41 28
5070 28 -24 -45 -154 -20 18 -11 -142 -58 253 -231 76 -129 -252 45 116 -87 -121 -156 -186 102 -146 -72 113 -170
5094 -170 -232 -71 70 92 -46 25 -283 -195 26 -11 -142 175 -84 -9 287 -49 32 393 20 207 159 -68 -119
5117 -119 -65 -11 -160 122 -37 -200 73 -67 274 -150 -229 -79 -196 150 122 248 -197 126 75 -34 -113 -63
5139 -63 -115 -2 32 -54 194 12 -59 -42 -203 -222 -106 121 197 75 -47 204 74 -337 -103 -101 114 -50 -87 -242
5163 -242 304 -81 -105 -187 -364 34 58 -142 -101 163 -35 140 -3 107 65 8 125 64 -52 202 236 1 -33
5186 -33 -253 -57 -110 81 -56 -69 -133 -142 -10 -41 -13 -116 -132 -22 73 -79 -22 67 -152 -14 239 -131 -47 6 -163
5211 -163 207 -31 -95 -74 -190 80 -109 71 -6 -35 -150 -39 75 -75 16 67 48 -102 380 6 -93 204 -92
5234 -92 72 173 117 78 -7 2 23 -91 71 -14 -116 -122 17 -238 32 25 -334 43 -76 -73 -106 -210 149 82 -155
5259 -155 86 -214 206 196 -115 175 -187 -89 19 -189 40 -256 -61 -33 41 -271 121 77 -169 -26 104 18
5281 18 -124 198 5 -150 96 -87 191 38 -15 38 -14 -41 35 199 146 178 -83 -77 -61 -95 -91 -77 -84 -148 59 85
5307 85 133 17 139 147 -66 -274 122 171 -18 -272 -308 -17 -13 68 255 -34 62 71 15 -50 -226 -72 133 83 23
5332 23 210 -12 -223 -221 0 -237 115 -91 -83 -63 43 -142 -209 289 -57 272 281 -78 30 -224 131 276 12
5355 12 44 -23 -184 -213 122 6 51 54 -54 168 -131 17 116 -55 21 175 54 81 48 -30 -68 87 110 98 261
5380 261 100 -134 -165 -5 27 46 -102 103 145 -80 104 76 -115 -133 9 42 104 -103 -194 -89 89 61 -55
5403 -55 -125 -180 -132 -90 97 -256 -227 171 -263 -186 -108 -148 -113 271 -122 -206 -109 260 136 104 54 -254 -88 -44 -147
5428 -147 198 176 2 -136 -42 -129 -88 -45 -141 208 -231 -122 -94 -134 50 -10 81 36 -268 -38 -20 -38 17 -427 83
5453 83 -81 34 -139 82 23 82 -146 72 95 -59 -137 -46 -118 209 132 125 -13 -5 68 -94 -371 143 122 -173 72
5478 72 -120 251 47 21 102 -167 63 217 -193 54 -22 201 -98 -84 5 -124 -84 -247 -26 70 182 177 -63
5501 -63 -29 -78 80 -228 229 122 129 -91 -17 135 78 76 -163 -38 32 -124 251 7 82 176 3 -262 -102 -421
5525 -421 -16 129 -27 157 -90 19 -109 -130 -206 88 -17 94 -158 56 48 43 -195 37 24 109 254 312 5
5548 5 -127 26 -31 147 33 -127 -108 35 -67 -206 31 -57 79 -56 -276 -53 -334 -205 -5 -18 166 -205
5570 -205 -32 134 -45 4 100 116 209 202 -168 19 -135 -64 10 140 -113 10 -373 45 -119 -86 259 110 -51
5593 -51 -24 -75 -28 -141 364 117 23 140 -49 71 185 -109 -74 1 -91 -83 -83 -169 48 18 10 -17 55 -144 -189 -56
5619 -56 -167 276 -129 43 -145 -53 -222 -17 -168 -220 247 82 54 42 96 38 19 -125 -51 -159 -177 112 34 -222
5643 -222 132 321 47 -121 -114 -84 121 92 -86 -339 139 -86 55 -181 -46 185 7 129 11 200 -34
5664 -34 -216 6 88 273 182 39 -75 -66 34 37 -19 -68 -273 -5 -23 101 -157 -147 164 45 -31 -84 205 348
5688 348 2 96 7 -116 -173 229 -144 115 -121 -98 86 86 36 113 118 -51 16 157 -34 47 264 44 -205 -22
5712 -22 -128 -156 7 35 76 -108 158 24 -131 -48 67 -234 59 12 191 -147 0 -293 -47 -82 -96 145 -16
5735 -16 413 147 30 85 160 -33 2 173 142 199 -31 152 -208 -87 -13 -16 63 300 68 125 -21 226 -299 192
5759 192 97 177 337 -77 -6 -53 76 -235 163 67 -91 -215 89 -36 -52 -115 159 77 30 291 39 -192 59
5782 59 -118 -86 80 -161 -44 119 -236 53 87 36 -19 -194 42 -254 108 69 218 -146 -89 -339 -99 -51 44
5805 44 28 -51 -33 -11 326 85 -152 -89 73 5 -85 -89 34 206 -189 -70 -76 10 182 -198 -114 -74 147 -212 116
5830 116 -52 -319 -199 107 144 45 -56 -24 16 -124 -29 -49 -4 -26 -233 162 -60 -94 -122 70 -19 -6 287 -24
5854 -24 -9 -60 -161 -340 82 -73 -248 146 327 -185 66 287 94 -85 -2 -102 -100 -142 -9 256 143 -102
5876 -102 -95 -74 -24 -80 -169 359 -75 -143 -33 -175 177 66 125 86 121 210 164 111 31 -176 117 70 102 178 -93 44
5902 44 326 -295 103 -68 -112 250 182 -81 -32 137 199 69 72 42 60 126 15 84 -227 -171 73 22 -3 -180 -260
5927 -260 242 -131 -28 -8 -35 -170 148 113 -220 -55 -39 30 15 -18 -164 -98 -73 32 12 -98 214 -71 177
5950 177 -83 -64 -83 183 -69 -62 -55 -152 -48 206 -13 49 23 146 152 -139 164 -66 92 -21 -39 -60 88 -48
5974 -48 -12 129 -250 201 -153 28 143 -57 173 -63 57 212 -123 -79 29 -309 -158 109 36 -86 75
5995 75 0 41 -110 -239 -69 125 112 -111 -26 181 -34 93 -138 -274 84 168 -2 -157 -230 -50 141 -13
6017 -13 21 -158 -66 -4 -10 26 49 -78 -40 311 -71 13 -16 -185 -269 -6 -85 42 -100 213 -257 142 -73 73
6041 73 156 -100 63 -174 -334 73 -200 100 -53 -254 19 -96 -212 -4 127 -56 267 -68 45 -47 -116
6062 -116 144 -144 258 167 -109 -215 27 40 110 96 -3 22 -163 10 108 85 -145 141 298 80 90 98 130 116
6086 116 114 126 -57 -272 -44 61 222 36 179 115 204 52 106 151 -27 66 75 80 -209 208 -19 -25 -39 -91 -331
6111 -331 -23 11 -13 -38 115 229 -137 86 -56 -142 -104 52 -162 -252 95 -53 63 -210 321 -258 9 27
6133 27 -330 24 99 -11 -75 156 -376 18 -227 -115 46 -47 2 319 156 -66 151 -234 -80 230 27 -26
6155 -26 141 -23 -67 -24 -77 -83 53 -184 14 42 37 157 -32 265 -146 -188 -30 -55 24 -206 -196 76 79 74 24 -267
6181 -267 90 -39 49 -11 -88 12 -106 199 -62 23 42 -105 75 -135 201 122 38 -74 -132 217 63 34 -16
6204 -16 203 64 -17 123 -140 46 12 21 112 -118 -142 33 -112 -71 -90 96 118 97 174 -18 244 44 196 114
6228 114 -285 -19 -74 97 318 -228 -98 61 -102 -81 275 -226 -220 301 225 -137 -76 -292 19 -46 -59 84 87
6251 87 -72 120 -124 37 104 25 274 -35 -86 -85 -150 -71 49 36 219 206 23 15 102 -138 112 -24 -60 -136 318
6276 318 15 141 149 -165 -7 -36 -58 88 98 -87 148 188 -141 -142 -247 -113 -127 -82 41 72 -31 -128 -138 34
6300 34 -209 106 -104 -79 149 -174 -129 151 -115 -123 -80 -205 254 219 -68 2 101 70 65 -154 152 -134 46 215
6324 215 -530 162 201 -64 -45 3 -183 10 32 199 -294 -172 -35 34 254 -135 -201 -70 -89 -19 -183 -142 -79
6347 -79 165 -91 -104 -194 104 -60 -4 -102 83 -226 135 -44 62 20 142 43 -165 110 65 -149 107 34 78
6370 78 -147 171 232 -4 -25 -21 26 -143 -45 -25 86 7 158 -39 71 24 22 -95 14 15 178 -56 -227 -184 103
6395 103 123 -137 366 106 -233 -114 385 38 175 -69 43 36 1 -31 -3 -49 -13 212 -220 -429 -115 -81 25
6418 25 -67 35 -49 295 -16 -84 69 -74 -179 -116 -197 8 -82 194 -43 167 169 -219 -255 -59 106 32 -108 -67
6442 -67 -12 131 -97 -40 -164 -104 28 -39 -43 -4 -167 317 120 72 145 52 -37 231 132 64 20 -235 -192 -131 98 -14
6468 -14 -147 -38 -312 181 -17 -118 10 -296 -38 -13 4 -68 -52 -18 -45 71 99 5 -198 -271 -74 10 106 195
6492 195 21 42 -12 -157 66 -28 181 -7 -38 -3 -9 113 7 263 -132 -2 -1 -139 -50 -133 -204 219 113 -84
6516 -84 489 -96 -270 -143 -113 52 163 78 -205 172 80 -90 -22 -215 -104 -27 220 -267 -15 26 5 -162 114
6539 114 -152 -28 -27 -108 236 -144 -103 19 35 -37 -123 -87 -22 -80 -78 -32 -18 -52 -61 229 -143 112 48 -115 67 -102
6565 -102 -277 153 93 36 -124 -97 -32 -202 -206 -71 -93 13 36 -201 97 98 237 165 19 -256 -144 -95 10 -51
6589 -51 -157 -158 175 -84 58 -12 -172 209 271 81 -52 -57 -127 -34 51 95 324 0 -283 341 312 -124 -212 -199 38
6614 38 -59 -84 55 -170 184 -226 -70 -86 89 222 -418 33 -152 9 -53 31 -180 190 26 145 -176 -137
6636 -137 161 30 81 -282 -24 438 -203 -259 -191 105 89 -27 16 -335 -229 95 14 11 119 -35 -83 -246 -134
6659 -134 -18 -70 121 -118 108 -126 -101 -36 -63 38 181 236 -26 -66 -54 191 -122 -144 -176 -15 -334 29 3
6682 3 -316 -118 108 249 -139 -226 -227 -85 -87 -67 326 -95 -76 -214 158 -342 -35 -27 -116 252 22 -57 163 58
6706 58 -336 46 -229 2 77 66 126 -118 -88 128 -281 -27 -38 7 -109 -83 -258 -246 -231 -91 168 -90 -174 22
6730 22 -179 151 -42 -189 -13 149 -13 -323 -222 0 -139 62 -89 -55 32 -158 283 210 113 -89 223 49
6752 49 -63 -315 44 -101 -73 -159 59 -203 28 201 123 34 -55 -254 375 117 125 6 136 80 104 -29 -283
6775 -283 99 -58 -16 162 181 -40 51 208 116 219 62 -21 135 -45 223 -15 -217 91 -198 -182 32 -83
6797 -83 -280 0 12 -184 -214 -23 143 -40 192 116 53 -55 -57 -179 92 99 20 29 -133 -62 -7 -186 64 34 -172
6822 -172 220 -31 -166 48 -104 95 58 -142 40 -39 -117 112 -67 -141 24 -276 384 238 -310 -160 -134 -13
6844 -13 -198 242 -135 67 35 92 -81 1 162 -95 -11 -125 -53 -19 -114 45 184 -35 -40 -105 286 10 92 -199
6868 -199 -37 124 -336 -276 -134 283 130 92 106 41 93 -48 -122 -77 -163 -44 194 -115 -34 72 179 -40 -264
6891 -264 62 73 80 -74 -93 199 88 11 -108 -86 -56 -166 -89 -112 116 102 -431 -33 85 -107 89 157 30 9
6915 9 82 180 311 -197 -217 -32 -224 -1 120 -109 16 216 -32 232 85 109 220 52 -123 63 -221 117
6937 117 82 99 35 -92 -88 19 306 -50 60 -134 -17 -153 90 105 -24 -27 -173 -152 45 109 -253 85 -249
6960 -249 -104 -344 125 -126 29 61 -131 97 14 -54 54 -4 -195 69 105 -117 26 -309 141 -128 -153 -21
6982 -21 -71 62 -200 463 -139 -219 30 12 90 -67 -89 -31 6 -34 97 54 25 -3 -97 -105 222 -63 -88 -84 67 44
7008 44 11 212 -55 -118 89 235 147 -25 277 241 200 100 -110 -26 233 -70 76 137 38 114 43 21 -63 -25 -129
7033 -129 16 -104 -201 177 108 63 106 246 129 -87 -98 -135 302 237 139 -147 33 95 -25 -108 94 3 109 25
7057 25 115 -70 163 -293 98 73 5 127 -13 14 -83 45 22 -33 90 273 118 -330 91 16 -141 -54 124
7080 124 -236 -189 -216 -298 8 75 130 -56 100 54 -12 122 -171 -199 -64 140 -141 -126 -104 -122 62 202 -46 -203
7104 -203 -9 -117 186 122 -40 8 118 -94 -215 -222 60 85 -2 -109 -159 -66 -192 -18 -193 -80 246 33 190
7127 190 27 35 226 100 -95 50 44 -11 109 3 -62 -177 -17 -195 139 154 -69 90 -42 145 101 -149 -133
7150 -133 21 -173 -85 -119 18 -17 -29 163 -77 -125 81 -63 -154 143 19 153 -103 -232 -19 130 -122 -77
7172 -77 13 25 -163 3 50 -70 -48 -166 -289 13 194 -191 75 -290 -178 -63 46 -153 37 30 -179 -150 102
7195 102 4 -185 98 39 -101 104 136 198 29 -21 -211 79 143 43 -160 -98 139 -177 -86 44 -115 -192 -117
7218 -117 -41 -126 73 -307 263 -78 -74 145 85 87 138 46 85 -106 80 6 50 30 64 -33 -127 -46 57 -70 -323 -122
7244 -122 -23 76 -114 185 -27 -104 44 -155 -15 52 -57 26 18 -43 -216 196 -93 -125 114 -163 -145 117 5
7267 5 42 108 139 206 -39 -173 4 96 34 -31 -47 -92 20 -7 266 -117 -77 32 34 33 -33 115 192 -147 -29 31 -59
7294 -59 -70 -245 -181 243 -132 156 -159 -11 -55 -55 -196 95 -30 87 -127 160 134 -120 13 -60 124 0 96
7317 96 171 -195 153 270 -264 47 -87 140 -247 151 -10 -99 -59 -315 110 27 -41 -61 155 51 -180 52
7339 52 -173 -208 -231 18 38 66 199 -6 33 257 -290 23 118 -1 288 -9 152 -133 87 113 113 -57 76
7362 76 -78 3 -19 -16 18 -208 39 -117 162 -152 -157 117 23 -14 -60 -209 -249 105 -242 72 227 -104 -159 -232 215
7387 215 216 -70 -180 -107 98 60 44 -12 12 -97 107 -14 -80 217 222 36 167 -79 271 -31 -60 -17 57 13 -242
7412 -242 -136 -55 116 -26 97 241 127 -1 -71 374 221 -36 234 -21 140 96 -441 -106 -218 -157 -54
7433 -54 -61 322 -52 -173 -196 -73 -80 -137 -126 355 88 164 -39 145 -28 -58 -15 -138 118 261 -71 -22 88 169
7457 169 214 189 75 131 -165 -29 40 -24 -144 -41 -330 -225 -16 191 125 -51 -80 -17 -156 73 59 147 -117
7480 -117 63 -21 -10 51 -83 -152 138 1 382 -30 -168 107 -273 39 6 83 -435 -160 30 -138 -90 -31 -21
7503 -21 -147 -175 -99 -69 125 25 256 -44 -163 -64 154 -77 -26 -124 -192 -196 -6 -4 -273 64 -231 -66 -16 114
7527 114 73 -130 -70 226 -332 -159 3 64 24 27 131 -83 -354 -102 13 53 104 -50 43 -35 -37 146 -110 40
7551 40 43 -157 -29 -59 -75 -205 -271 -35 309 -2 65 -139 112 -9 -140 48 -190 -49 -206 117 -17 -121
7573 -121 164 -145 -47 87 -98 56 33 -114 -139 -63 206 -2 -233 23 60 78 118 -46 -150 -28 120 -70
7595 -70 -3 -6 -268 14 48 -18 115 60 -7 -76 -77 149 175 -111 -237 -27 21 142 -94 -73 157 -64 67 165 206
7620 206 102 11 69 -69 -10 -74 161 -189 -4 -159 -97 -127 42 -2 -109 -261 174 65 -171 -3 -70 134 22
7643 22 -63 129 -151 -46 7 85 88 -41 -95 -25 178 142 95 -186 70 163 106 -31 -161 96 -68 90 125 179 -18
7668 -18 -83 -100 107 72 -22 228 -77 -242 -238 28 -78 -93 107 -138 200 -134 -112 -85 -349 -134 52 31 -90 104
7692 104 -300 -140 -24 -151 -118 -84 -67 -68 -41 191 118 261 39 329 -240 -118 44 -212 -57 -330 1 45 234
7715 234 -32 218 -183 -228 -139 -222 283 -73 -37 -52 232 251 0 -57 -127 -48 15 211 117 -323 -80 219 -48 191
7739 191 -72 92 -169 223 -69 5 -11 -235 240 101 284 2 -63 188 -101 -37 7 -56 -128 68 19 -5 -107
7762 -107 -254 420 86 -280 210 -83 -63 -9 236 19 117 72 -76 82 70 -140 -284 -34 -18 32 -106 80
7784 80 224 114 -77 12 94 -28 -118 -173 -55 -198 35 -254 12 -150 -92 206 -21 -9 289 -196 57 -25 -116
7807 -116 -22 167 -67 204 175 -163 16 -123 66 187 16 -312 11 188 -39 36 -60 69 -164 2 110
7828 110 304 79 -168 98 174 -336 -112 169 85 -35 8 185 34 -254 -214 136 -104 -187 -170 209 -90 142
7850 142 -61 122 150 -11 201 0 67 -182 80 157 230 205 11 191 -25 158 -47 48 -88 231 119 -336
7872 -336 22 -48 -24 -336 -109 146 -120 -235 61 5 20 -148 -278 126 -235 36 17 -189 7 133 228 -300
7894 -300 149 -176 129 257 -12 -87 281 147 -57 52 -36 -41 -168 299 -28 25 56 85 -66 -82 191 112 -34
7917 -34 110 -134 160 70 165 -7 162 17 -17 23 161 38 -32 -75 -56 -4 -141 -53 72 -25 194 -146 99 -4
7941 -4 58 -149 4 -11 7 -75 -194 -168 -79 -45 -161 -20 -114 -64 258 77 165 -60 -177 92 -468 -213 -227 59
7965 59 6 -5 384 223 -56 -67 166 10 116 214 3 133 -151 45 -49 -18 99 201 131 0 18 -73 -49 -130
7989 -130 -114 124 -88 -117 54 -212 148 -12 -98 -27 20 -61 -169 -261 38 35 150 8 131 60 -104 -37 264 -24
8013 -24 343 205 -15 174 87 -62 -68 101 -2 201 -191 -170 -140 267 219 87 26 -49 19 60 24 420 -23 -343
8037 -343 -59 -185 -173 -157 -64 -99 -103 155 267 135 283 -2 69 115 47 167 214 175 68 88 -68 21 -203 118
8061 118 78 -26 -22 -270 159 39 -213 219 23 241 44 266 176 -57 62 -112 -72 -7 85 149 -60 -206 70
8084 70 148 72 -85 50 -93 142 -17 -130 39 232 76 137 -166 -115 72 34 207 167 13 52 -189 -4 7
8107 7 -64 39 179 -14 -261 -200 28 97 21 251 -39 -122 -47 -98 48 196 -26 74 -16 -246 -25 116 126 117
8131 117 -100 73 148 114 320 265 295 -301 385 29 -6 100 155 -63 118 -62 -337 100 -123 92 -1 -306
8153 -306 -66 164 -50 -107 75 -35 95 -110 132 -198 -76 -105 171 18 20 60 137 5 -132 150 -168 -72
8175 -72 -135 -146 63 -68 -83 -276 197 82 -136 7 16 -117 13 -70 -260 -68
8191f8
##END NTUPLES=NMR FID
##END=
