##TITLE=1H_Pr 5065-2
 CDCl3,8 sc, 
 3.9.2021
##JCAMPDX= 6.0         $$ Bruker NMR JCAMP-DX V2.0
##DATA TYPE= NMR FID
##DATA CLASS= NTUPLES
##ORIGIN= UXNMR, Bruker Analytische Messtechnik GmbH
##OWNER= root
$$ XWIN-NMR		Version 3.5
$$ Fri Sep  3 08:57:06 2021 Russian Standard Time (UT+4h)  she@DPX200
##.OBSERVE FREQUENCY= 200.1313
##.OBSERVE NUCLEUS= ^1H
##.DELAY= (6, 6)
##.ACQUISITION MODE= SIMULTANEOUS
##.ACQUISITION SCHEME= undefined
##.AVERAGES= 8
##.DIGITISER RES= 18
##SPECTROMETER/DATA SYSTEM= spect
##.PULSE SEQUENCE= zg30
##.SOLVENT NAME= CDCl3
##.SHIFT REFERENCE= (INTERNAL, CDCl3, 0, 15.7039)
##AUDIT TRAIL= $$ (NUMBER, WHEN, WHO, WHERE, WHAT)
$$ ##TITLE= Audit trail, XWIN-NMR		Version 3.5
$$ ##JCAMPDX= 5.01
$$ ##ORIGIN= Bruker BioSpin GmbH
$$ ##OWNER= she
$$ F:/spectra/data/she/nmr/H-F/1/audita.txt
$$ ##AUDIT TRAIL=  $$ (NUMBER, WHEN, WHO, WHERE, WHAT)
(   1,<2021-09-03 08:55:37.03 +0400>,<she>,<DPX200>,
      <created by zg, POWCHK disabled, PULCHK disabled
       configuration hash MD5:
       00 E9 B6 7A A2 85 ED C7 34 08 36 98 17 FE 4E 26
       data hash MD5: 16K
       5D 41 09 4A CB 97 58 4E E8 EF 24 F7 B8 F3 7F 9E>)
$$ ##END=
$$ 
$$ hash MD5
$$ B0 A8 DA C9 CC 79 9B AC 3A 82 9E 46 AD EE 40 C8
##$RELAX= 
##$RELAX= 
##$RELAX= 
##$RELAX= 
##$RELAX= 
##$RELAX= 
$$ Bruker specific parameters
$$ --------------------------
##$DU= <F:/spectra>
##$EXPNO= 1
##$NAME= <H-F>
##$PROCNO= 1
##$TYPE= <nmr>
##$USER= <she>
##$AMP= (0..31)
100 100 100 100 100 100 100 100 100 100 100 100 100 100 100 100 100 100 
100 100 100 100 100 100 100 100 100 100 100 100 100 100 
##$AQSEQ= 0
##$AQ_mod= 1
##$AUNM= <au_zg>
##$AUTOPOS= <>
##$BF1= 200.13
##$BF2= 200.13
##$BF3= 200.13
##$BF4= 200.13
##$BF5= 200.13
##$BF6= 200.13
##$BF7= 200.13
##$BF8= 200.13
##$BYTORDA= 1
##$CFDGTYP= 0
##$CFRGTYP= 5
##$CHEMSTR= <none>
##$CNST= (0..31)
1 1 145 1 1 1 1 1 1 1 1 1 1 1 1 1 1 1 1 1 1 1 1 1 1 1 1 1 1 1 1 1 
##$CPDPRG= <>
##$CPDPRG1= <>
##$CPDPRG2= <>
##$CPDPRG3= <>
##$CPDPRG4= <mlev>
##$CPDPRG5= <mlev>
##$CPDPRG6= <mlev>
##$CPDPRG7= <mlev>
##$CPDPRG8= <mlev>
##$CPDPRGB= <>
##$CPDPRGT= <>
##$D= (0..31)
0 1.2 0 0 0 0 0 0 0 0.06 0 0.03 0 0 0 0 0.0002 0 0 0 0 0 0 0 0 0 0 0 0 
0 0 0 
##$DATE= 1630644936
##$DBL= (0..7)
120 120 120 120 120 120 120 120 
##$DBP= (0..7)
150 150 150 150 150 150 150 150 
##$DBP07= 0
##$DBPNAM0= <>
##$DBPNAM1= <>
##$DBPNAM2= <>
##$DBPNAM3= <>
##$DBPNAM4= <>
##$DBPNAM5= <>
##$DBPNAM6= <>
##$DBPNAM7= <>
##$DBPOAL= (0..7)
0.5 0.5 0.5 0.5 0.5 0.5 0.5 0.5 
##$DBPOFFS= (0..7)
0 0 0 0 0 0 0 0 
##$DE= 6
##$DECBNUC= <off>
##$DECIM= 32
##$DECNUC= <off>
##$DECSTAT= 4
##$DIGMOD= 1
##$DIGTYP= 9
##$DL= (0..7)
0 120 120 120 120 120 120 120 
##$DP= (0..7)
150 150 150 150 150 150 150 150 
##$DP07= 0
##$DPNAME0= <>
##$DPNAME1= <>
##$DPNAME2= <>
##$DPNAME3= <>
##$DPNAME4= <>
##$DPNAME5= <>
##$DPNAME6= <>
##$DPNAME7= <>
##$DPOAL= (0..7)
0.5 0.5 0.5 0.5 0.5 0.5 0.5 0.5 
##$DPOFFS= (0..7)
0 0 0 0 0 0 0 0 
##$DQDMODE= 0
##$DR= 18
##$DS= 0
##$DSLIST= <SSSSSSSSSSSSSSS>
$$ [...]
##$SUBNAM2= <"">
##$SUBNAM3= <"">
##$SUBNAM4= <"">
##$SUBNAM5= <"">
##$SUBNAM6= <"">
##$SUBNAM7= <"">
##$SUBNAM8= <"">
##$SUBNAM9= <"">
##$SW= 20.0189088683792
##$SWIBOX= (0..15)
0 0 2 0 0 0 0 0 0 0 0 0 0 0 0 0 
##$SW_h= 4006.41025641026
##$TD= 16384
##$TD0= 1
##$TE= 0
##$TE2= 300
##$TE3= 300
##$TEG= 300
##$TL= (0..7)
0 120 120 120 120 120 120 120 
##$TP= (0..7)
150 150 150 150 150 150 150 150 
##$TP07= 0
##$TPNAME0= <>
##$TPNAME1= <>
##$TPNAME2= <>
##$TPNAME3= <>
##$TPNAME4= <>
##$TPNAME5= <>
##$TPNAME6= <>
##$TPNAME7= <>
##$TPOAL= (0..7)
0.5 0.5 0.5 0.5 0.5 0.5 0.5 0.5 
##$TPOFFS= (0..7)
0 0 0 0 0 0 0 0 
##$TUNHIN= 0
##$TUNHOUT= 0
##$TUNXOUT= 0
##$USERA1= <user>
##$USERA2= <user>
##$USERA3= <user>
##$USERA4= <user>
##$USERA5= <user>
##$V9= 5
##$VALIST= <valist>
##$VCLIST= <CCCCCCCCCCCCCCC>
##$VD= 0
##$VDLIST= <DDDDDDDDDDDDDDD>
##$VPLIST= <PPPPPPPPPPPPPPP>
##$VTLIST= <TTTTTTTTTTTTTTT>
##$WBST= 1024
##$WBSW= 4
##$XGAIN= (0..3)
0 0 0 0 
##$XL= 0
##$YL= 0
##$YMAX_a= 147954
##$YMIN_a= -225885
##$ZGOPTNS= <>
##$ZL1= 120
##$ZL2= 120
##$ZL3= 120
##$ZL4= 120
##$ABSF1= 10
##$ABSF2= 0
##$ABSG= 5
##$ABSL= 3
##$ALPHA= 0
##$AQORDER= 0
##$ASSFAC= 0
##$ASSFACI= 0
##$ASSFACX= 0
##$ASSWID= 0
##$AUNMP= <proc_1d>
##$AZFE= 0.1
##$AZFW= 0.1
##$BCFW= 1
##$BC_mod= 2
##$BYTORDP= 1
##$COROFFS= 0
##$CY= 11.3945322036743
##$DATMOD= 1
##$DC= 2
##$DFILT= <>
##$DTYPP= 0
##$F1P= 2.36226072786647
##$F2P= -0.459571619588291
##$FCOR= 0.5
##$FTSIZE= 0
##$FT_mod= 4
##$GAMMA= 1
##$GB= 0.15
##$INTBC= 1
##$INTSCL= 1
##$ISEN= 128
##$LB= 0.24
##$LEV0= 0
##$LPBIN= 0
##$MAXI= 10000
##$MC2= 0
##$MEAN= 0
##$ME_mod= 0
##$MI= 1.114404
##$NCOEF= 0
##$NC_proc= 0
##$NLEV= 6
##$NOISF1= 3.799351
##$NOISF2= 2.8
##$NSP= 1
##$NTH_PI= 0
##$NZP= 0
##$OFFSET= 15.70392
##$PC= 1
##$PHC0= -13355
##$PHC1= 10.80097
##$PH_mod= 1
##$PKNL= yes
##$PPARMOD= 0
##$PSCAL= 0
##$PSIGN= 0
##$REVERSE= no
##$SF= 200.130013532006
##$SI= 16384
##$SIGF1= 3
##$SIGF2= 2
##$SINO= 400
##$SIOLD= 16384
##$SREGLST= <1H.CDCl3>
##$SSB= 0
##$STSI= 0
##$STSR= 0
##$SW_p= 3612.71676300578
##$SYMM= 0
##$S_DEV= 0
##$TDeff= 0
##$TDoff= 0
##$TI= <>
##$TILT= no
##$TM1= 0
##$TM2= 0
##$TOPLEV= 0
##$USERP1= <user>
##$USERP2= <user>
##$USERP3= <user>
##$USERP4= <user>
##$USERP5= <user>
##$WDW= 1
##$XDIM= 8192
##$YMAX_p= 0
##$YMIN_p= 0
$$ End of Bruker specific parameters
$$ ---------------------------------
##NTUPLES= NMR FID
##VAR_NAME=  TIME,          FID/REAL,        FID/IMAG
##SYMBOL=    X,             R,               I
##VAR_TYPE=  INDEPENDENT,   DEPENDENT,       DEPENDENT
##VAR_FORM=  AFFN,          ASDF,            ASDF
##VAR_DIM=   8192,          8192,            8192
##UNITS=     SECONDS,       ARBITRARY UNITS, ARBITRARY UNITS
##FACTOR=    0.0002496,     1,               1
##FIRST=     0,             0,               0
##LAST=      2.0444736,     0,               0
##MIN=       0,             -225885,         0
##MAX=       2.0444736,     147954,          0
$$ Real data points
##PAGE= N=1
##DATA TABLE= (X++(R..R)), XYDATA
$$ [...]
1869c21o2L5J55O4M2j07m4M65L2J38j10k1K4J65k16R1m55K22J94k45J12k69l41
$$ -321 -383 -348 -193 -129 -87 -194 -238 227 259 397 287 266 290 455 239 330 -125 97 291 46 158 -111 -452
1892d52N1J95l67L26k12L14J22n8M8P8M7Q2L2J11PJ82k91K23n25J5oJ50l09N2
$$ -452 -401 -206 -573 -247 -459 -145 -23 -81 -33 45 92 174 206 317 324 506 215 438 -87 -72 -78 72 -237 -185
1916a85j8M28n15L6j70J79J03J44Q5k78M27k13K17j15L29l99J51R1j94K1M6j69
$$ -185 -203 225 -290 -254 -424 -245 -142 2 87 -191 236 23 240 125 454 55 206 297 103 124 170 1
1938An1k24P5j70m8K86j71K10j66%N1k2J47r7L15j06J88K7P8j47M36n78k03L64
$$ 1 -50 -274 -199 -369 -417 -131 -302 -92 -258 -258 -207 -229 -82 -179 136 30 218 245 323 176 612 34 -169 195
1962A95r4l43K09J45m00N8J17j70J63o3K39j44P5m6L48k82p5L51J72L8j0j28j14
$$ 195 101 -242 -33 112 -288 -230 -113 -283 -120 -183 56 -88 -13 -59 289 7 -68 283 455 493 483 355 241
1985B41J28k38l99J47J5k40J11K2k1j60K4J3K24L2PR5L96q7n6Rm5J54k94P5j17
$$ 241 369 131 -268 -121 -106 -346 -235 -213 -234 -394 -370 -357 -133 -101 -94 1 397 310 254 263 218 372 78 153 36
2010C6l18M6P9Q9K6m24K28p7p4K37M7K1j49K50r6j7J28k2J08P5J72J37j68n1m03
$$ 36 -282 -236 -157 -68 -42 -466 -238 -315 -389 -152 -105 -84 -233 17 -79 -96 32 10 118 193 365 502 334 283 -120
2035a20L37l71L06J1l07J16j58j07j15J52K35l46L08R8K60m8j22M6K32J62j51
$$ -120 217 -154 152 163 -144 -28 -186 -293 -408 -256 -21 -367 -59 39 299 251 129 175 407 569 418
2056D18n9j62P6l09K07k80K04j46k74j89K66j2l30M95l38L60K3J65j47J02j42
$$ 418 359 197 273 -36 171 -109 95 -51 -325 -514 -248 -260 -590 -95 -433 -73 -50 115 -32 70 -72
2077g2L77j00q5j47L01mk09O9lN9p3k68O8j33J74L7p4J00l42L40o1Q9k10J61j61
$$ -72 305 205 120 -27 274 270 61 130 127 186 113 -155 -87 -220 -46 -9 -83 17 -325 15 -46 43 -167 -6 -167
2102a67K54J37n3L61k24k2J42j20l80L3k7q0J2R2k98J44j50K1N0L67k70K56k95
$$ -167 87 224 171 532 308 286 428 308 -72 -39 -66 -146 -134 -42 -340 -196 -346 -325 -275 92 -178 78 -217
2125b17K58J53k8K04K5j54k95O00n95J61j35j27q2k41P6L31k95j14L59J47P3k00
$$ -217 41 194 166 370 395 241 -54 546 -49 112 -23 -150 -232 -473 -397 -66 -361 -475 -116 31 104 -96
2147i6K98l3j97M1J6J17QJ72j81P1J55k3k36R4k21M2j58K8m9J67j83r9p3R1K23
$$ -96 202 169 -28 13 29 146 154 326 145 216 371 348 112 206 -15 27 -131 -103 -152 15 -168 -267 -340 -249 -26
2172b6j87O0O7J74N3oK85o6o1P5m94K74n4J49l58r3M9l8Q5L1k15J9N5K7N3K08
$$ -26 -213 -153 -86 88 141 135 420 354 293 368 -126 148 94 243 -115 -208 -159 -197 -112 -81 -296 -277 -222 -195 -142 66
2198F6%J87p7k1N34n58K15k41p6j6L96p50L85l56J47Q6R5j05p2K9k46K86O1O13
$$ 66 66 253 176 155 689 131 346 105 29 13 409 -341 44 -312 -165 -79 16 -89 -161 -132 -378 -92 -31 582
2222E82n04k53L86l3j04p1Oq5K82k20L57j58Q5k12k7j1k39K05k75o8K65L9l19
$$ 582 78 -175 211 178 74 3 9 -76 206 -14 343 185 270 58 31 20 -219 -14 -289 -357 -92 -53 -372
2245c72r4K42K23Q9J73j57RL27k02O8K87m54j74K77j47k10r0r6J08O7j52l0K1
$$ -372 -466 -224 -1 88 261 104 113 440 238 306 593 139 -35 242 95 -115 -205 -301 -193 -126 -278 -308 -287
2268b87Q1k62M52J42j09K3J72J6k8L31j33l66m0J88r3j4q5lj88KJ80k04R1k36
$$ -287 -206 -468 -16 126 17 40 212 228 200 531 398 32 -8 180 87 73 -12 -15 -203 -201 -21 -225 -134 -370
2292c70J39m0Q2K06L7K08j07k21J83K65l3j59K37m04K87m16P54p36n8q3m5L9j69
$$ -370 -231 -271 -189 17 54 262 155 -66 117 382 349 190 427 23 310 -106 648 -88 -146 -229 -274 -235 -404
2315d04O3J8K41o4%J47l02M97j24o5L29j75J12j24J36j36j95R0K4j1j50j62j86
$$ -404 -341 -323 -82 -146 -146 1 -301 196 72 7 336 161 273 149 285 149 -46 44 68 57 -93 -255 -441
2338d41J44K22j10K21p9j77K44j68o9K40N6N1J80n1j57j3J99l83N7J89M2l18N1
$$ -441 -297 -75 -185 36 -43 -220 24 -144 -213 27 83 134 314 263 106 93 292 -91 -34 155 197 -121 -70
2361g0J07j75k19o5K27O5j5K40m4l7P3L6q8j97M81j95K48j99J16n8k42q5K83j55
$$ -70 37 -138 -357 -422 -195 -130 -145 95 51 14 87 123 35 -162 319 124 372 173 289 231 -11 -96 187 32
2385C2j04P4k75J44k13J16q1P5RJ27N1K46J02l50K97l43L55l19M15j39r2J61Q6
$$ 32 -72 2 -273 -129 -342 -226 -307 -232 -223 -96 -45 201 303 -47 250 -93 262 -57 358 219 127 288 374
2408C74l72J50m52L17k46k15K05k9R8k25N08j30j00o6K81L3J10O3lj07n4l5k0
$$ 374 2 152 -300 17 -229 -444 -239 -268 -170 -395 113 -17 -117 -183 98 131 241 304 301 194 140 105 85
2431H5J43l31J03O4j43k31L11k76m4P0K01j71K58K20j84k6N8j31J71K72m54L20
$$ 85 228 -103 0 64 -79 -310 1 -275 -319 -249 -48 -219 39 259 75 49 107 -24 147 419 -35 285
2453B85K92m46L2q0j4l10o2m6O22n46N0k03J36J73j06j2M5R6J40p8O6J3J36r3
$$ 285 577 131 163 83 69 -241 -303 -349 273 -273 -223 -426 -290 -117 -223 -235 -190 -94 46 -32 34 47 183 90
2477I0J84o0Qj39J60j58Oj22j37j45J83k20o8M34j5j44j03K76k31J89J94L6n0
$$ 90 274 214 222 83 243 85 91 -31 -168 -313 -130 -350 -418 16 1 -143 -246 30 -201 -12 182 218 168
2500A68j32N13l48L0l08J61ml07J83l20L77j66K61m29J74j42L4O7O7p0K71l80
$$ 168 36 549 201 231 -77 84 80 -227 -44 -364 13 -153 108 -321 -147 -289 -255 -188 -121 -191 80 -300
2522c00K76O8J56J7j22L40k28M9m3l56R2K08k50l10M77j66RJ30L0j13j53K10j84
$$ -300 -24 44 200 217 95 435 207 256 213 -143 -51 157 -93 -403 74 -92 -83 47 77 -36 -189 21 -163
2545a63M20j40p3K85m2R7P3l55J04j01pj37K66k32j37q5K82k08j07p4O9L06r7
$$ -163 257 117 44 329 287 384 457 102 206 105 98 -39 227 -5 -142 -227 55 -153 -260 -334 -265 41 -56
2568e6o6P7N0R4k83K73q0K33P0n2j82P1j58P6m9m17K27j56N8K28j04N0jj56m3
$$ -56 -122 -45 5 99 -184 89 9 242 312 260 78 149 -9 67 18 -399 -172 -328 -270 -42 -146 -96 -97 -253 -296
2593b96M13r1K9r8J71J95l02J43J5K32p12K34m5K55k20j41M7j76J77J31J09M0
$$ -296 117 26 55 -43 128 323 21 164 179 411 -301 -67 -112 143 -77 -218 -171 -347 -170 -39 70 110
2615A10r9k50O7j8N2J93k01K23K41k45J16o5J78Q6j42k09J09n1N2l59K69l38J58
$$ 110 11 -239 -172 -190 -138 55 -146 77 318 73 189 124 302 388 246 37 146 95 147 -212 57 -281 -123
2638a23r6K12k96K86R6k3K6J63K3J32k93K44k4j81J9P4j65j40j72K98k82m7K82
$$ -123 -219 -7 -303 -17 79 56 82 245 268 400 107 351 327 146 165 239 74 -66 -238 60 -222 -269 13
2661A3k59j0J27N7N0Q5r9JJ76J34j06p9J18k4K4l77K19j07P8J58j07p9R8L0j93
$$ 13 -246 -256 -129 -72 -22 63 -36 -35 141 275 169 90 208 184 208 -169 50 -57 21 179 72 -7 91 121 -72
2686g2j4J32k43K18J7k11j41L57k96L83O6q1K82j86K36l96K54j22k84K14l29K41
$$ -72 -86 46 -197 21 38 -173 -314 43 -253 130 196 115 397 211 447 51 305 183 -101 113 -216 25
2708B5k29J28j54J76l94O6J30N0J18M3j25L60K44m98K85k32K14P6k17J43k01l7
$$ 25 -204 -76 -230 -54 -448 -382 -252 -202 -84 -41 -166 194 438 -60 225 -7 207 283 66 209 8 -29
2730b9j03J18M6l4K1r6k5L3j27J0K24N1j55L42k36K40k77J08J29j6k93J53J18
$$ -29 -132 -14 32 -2 19 -77 -102 -69 -196 -186 38 89 -66 276 40 280 3 111 240 224 -69 84 202
2753B02j69l02M11J97k34j42j72J21n0q1n1J30K4K80K1j90J54J8j53K44o3J79
$$ 202 33 -269 142 339 105 -37 -209 -88 -138 -219 -270 -140 -116 164 185 -5 149 167 14 258 195 374
2775C74j91N4l0j48K52k54l34M1K14j12J50l2k32J04k02L16K16k1l27K73k07L55
$$ 374 183 237 207 59 311 57 -277 -236 -22 -134 16 -16 -248 -144 -346 -30 186 165 -162 111 -96 259
2797B59j71J41q2k43n5J44Q1J6m2j54j94Q5L79k34k23J79J19L29n17P7K6J49j50
$$ 259 88 229 147 -96 -151 -7 74 90 48 -106 -300 -215 164 -70 -293 -114 5 334 -183 -106 -80 69 -81
2820h1J6J41Q0j52K74l55K36K18m58M25m90J99k60J44op5Q7k66M02m08M56m71
$$ -81 -65 76 156 4 278 -77 159 377 -81 344 -146 53 -207 -63 -69 -144 -57 -323 79 -329 127 -344
2842c44L94j87Q8K29k2O5k98P0Q6J21r8j68m0L99m20M2k94L99k97K89k74M2l58
$$ -344 50 -137 -49 180 158 223 -75 -5 81 202 104 -64 -104 295 -125 -83 -377 22 -275 14 -260 -218 -576
2865e76M04J36J6J32o3J40q0L23k28J18r1Q2k07J56l57L3j31L26Km55OJ40l8K30
$$ -576 -172 -36 -20 112 49 189 109 432 204 322 231 313 106 262 -95 -62 -193 133 135 -320 -314 -174 -212 18
2889A8p4j3J88j94N3J99K11m06J67k38L18k06R6L2k27R2K5j84m9J23LM5j85O0
$$ 18 -56 -69 119 -75 -22 177 388 -18 149 -89 229 23 119 151 -76 16 41 -143 -192 -69 -66 -21 -206 -146
2913a46l9K50j14j5j02M75k7l8j68K46k00q8l5J31L0J06l05l99O40m09L6q1O3
$$ -146 -185 65 -49 -64 -166 309 282 244 76 322 122 34 -1 130 160 266 -39 -438 202 -207 -171 -252 -189
2936a89J08L1l39L37j64J70J87q8k2L7J10l2J48k14J0j30nO3k45j22L02J02l07
$$ -189 -81 -50 -389 -52 -216 -46 141 53 31 68 178 146 294 80 90 -40 -45 18 -227 -349 -47 55 -252
2959b52J64j9j17J85j01j24J94K36O2n6j89K65k92J95J40k9m9Rm8l80L83k80l
$$ -252 -88 -107 -224 -39 -140 -264 -70 166 228 172 -17 248 -44 151 291 262 213 222 174 -206 177 -103 -106
2982a06Q4l64L12l5J5J16k09N3J00QJ14O4l65K95O0L4O6J0N6m25J00K48j27l20
$$ -106 -22 -386 -74 -109 -94 22 -187 -134 -34 -26 88 152 -213 82 142 176 242 252 308 -117 -17 231 104 -216
3006b16o6J8K98l33O5J74J17k82Q9J38K45j04j68R8J11j67K56j3k94L63j47j89
$$ -216 -282 -264 34 -299 -234 -60 57 -225 -136 2 247 143 -25 73 184 17 273 260 -34 329 182 -7
3028gPk64K97j76l27J46M85l44j54J23J07K4J01J32k74N11l29P4o4K7J13q7J19
$$ -7 0 -264 33 -143 -470 -324 161 -183 -337 -214 -107 -83 18 150 -124 387 58 132 68 95 208 121 240
3051B40j10j58R7Q1k54m3pN9J94l28L13l43K72j03J52j78K84J73k58j79Q2L35
$$ 240 130 -28 69 150 -104 -147 -154 -95 99 -229 84 -259 13 -90 62 -116 168 341 83 -96 -14 321
3073C21l90K55j37P1k1j76j40J84k71J21J45n7k00J20q4K10n5N9M8J99j77J51
$$ 321 -69 186 49 120 99 -77 -217 -33 -304 -183 -38 -95 -295 -175 -259 -49 -104 -45 3 202 25 176
3095A76j7J16j26K19j54k23J21j23J64k41K6r0k42J35m9J89k8p3J0L9J14N2K68
$$ 176 159 275 149 368 214 -9 112 -11 153 -88 -62 -152 -394 -259 -308 -119 -147 -220 -210 -171 -57 -5 263
3118B63k20kK05J0k95N6q2K28k75O2L8O3k79J38K0k14K75J23q8k90L67k09J61
$$ 263 43 41 246 256 -39 17 -65 163 -112 -50 -12 51 -228 -90 -70 -284 -9 114 26 -264 103 -106 55
3141E5R8j58l9P4K82l58J90j17J00j80J7o8j77K39j04K41l17J01j48M21j66j76
$$ 55 153 -5 -44 30 312 -46 144 27 127 -53 -36 -104 -281 -42 -146 95 -222 -121 -269 152 -14 -190
3163a90K12j52J98J25O0j78oj37L55L4n90M32k39p2R9k2L19l90J45j61n0K5K0
$$ -190 22 -130 68 193 253 75 69 -68 287 321 -269 163 -76 -148 -49 -71 248 -142 3 -158 -208 -183 -163
3186a63K12j37J11J12J40l11J78J00m89N97k45R8J20k09n4O3J5j93m6J2J72j00
$$ -163 49 -88 23 135 275 -36 142 242 -247 350 105 203 323 114 60 123 138 -55 -101 -89 83 -17
3208a7M8RJ64K3k77j99L24Q6K8k2j14J75K2k11J10K00k40l4j5J35o1j40n6O5l31
$$ -17 31 40 204 227 -50 -249 75 161 189 167 53 228 250 39 149 349 109 75 60 195 134 -6 -62 3 -328
3233c28J27J37J82l39M13J64k28O8n8j15N2J7J22n7m4j04K40k3l9j70j44N4J15
$$ -328 -201 -64 118 -221 192 356 128 196 138 23 75 92 214 157 113 9 249 226 187 17 -127 -73 42
3256D2j74p6J33%j11j60O8K62o5K76M8j57k19J92j64J83M6J00k77N1l0j48K2P9
$$ 42 -132 -208 -75 -75 -186 -346 -278 -16 -81 195 243 86 -133 59 -105 78 124 224 -53 -2 -32 -180 -158 -79
3280g9J22j00j40J95M9k37Q9o9K23j63M67l14L12l60J5K7n4K25l78K81Nk12j05
$$ -79 43 -57 -197 -2 47 -190 -101 -170 53 -110 357 43 355 -5 10 37 -17 208 -170 111 116 -96 -201
3303b01J60j73K20Ol5k71J33Q1O3r6k7O9K67M9j15k21K77j6J96M8l40j14j6J17
$$ -201 -41 -214 6 12 -23 -294 -161 -80 -17 -113 -140 -71 196 245 130 -91 186 170 366 414 74 -40 -56 61
3327F1j58Q2J81r8M7j17l25N59j76r1j94J08q8M30j02N9O6j92N7r9r5K27j91P8
$$ 61 -97 -15 166 68 115 -2 -327 232 56 -35 -229 -121 -209 221 119 178 244 52 109 10 -85 142 -49 29
3351B9J19k97O5m4l6J2K83l6j20k4jP4L8o2N1N4M1o3O9k23J94j38j3j34Q7o9J82
$$ 29 148 -149 -84 -128 -164 -152 131 95 -25 -49 -50 24 62 0 51 105 146 83 152 -71 123 -15 -28 -162 -75 -144 38
3378C8Rk39J01Jj32P5R6p8J92p4L2j5J81j32J59m4O2m9m3q3J45j04o9p3K1k39
$$ 38 47 -192 -91 -90 -222 -147 -51 -129 63 -11 21 6 187 55 214 170 232 183 140 57 202 98 29 -44 -23 -262
3404b62K40l0j48K8J22J53M6k02K40k57J40n5J28J3R1j44r3k9j0Q6Q0j99j31N29
$$ -262 -22 -52 -200 -172 -50 103 149 -53 187 -70 70 15 143 156 247 103 10 -19 -29 57 137 -62 -193 336
3428C36m37j37K99l93J65M0J88j80J60k37J55L3N1P0j46r4K24R9j44J3J53k67
$$ 336 -101 -238 61 -332 -167 -127 61 -119 41 -196 -41 -8 43 113 -33 -127 97 196 52 65 218 -49
3450d9o1m0J07j36N7J11k62J1R2K23q6j01J96J99j96J03mj43K25j96j07m5k25
$$ -49 -110 -150 -43 -179 -122 -11 -273 -262 -170 53 -33 -134 62 261 65 168 164 21 246 50 -57 -102 -327
3473c27M39o3m5j26K98m22J72j90J49p9J45q2q1L20j98K45K9J86p6j64j61K56
$$ -327 112 49 4 -122 176 -246 -74 -264 -115 -194 -49 -131 -212 108 -90 155 184 370 294 130 -31 225
3495B25k07L2K34J4k39K1j29K55m06k6K60K96k22l67R4J83n4J23O4m11J57L28
$$ 225 18 50 284 298 59 80 -49 206 -200 -226 34 330 108 -259 -165 18 -36 87 151 -260 -103 225
3517B25r3O6Q0j16J85l29j23K42P1j32j97R2M2J11j05Q3j98K17k9r6K0J34j06
$$ 225 132 198 278 162 347 18 -105 137 208 76 -121 -29 13 124 19 102 -96 121 92 -4 16 150 44
3540D4M2pK49k47j32J82K12j4j03l93K21p8r7L7m4N8J63j75K00k21k11N68l71
$$ 44 86 79 328 81 -51 131 343 329 226 -167 54 -24 -121 -84 -128 -70 93 -82 118 -103 -314 254 -117
3563a17K45k98J67j87K23J2K26k16K73j05l91J93r0R6m19K96J23M2m0r3O1Q0j14
$$ -117 128 -170 -3 -190 33 45 271 55 328 223 -168 25 -65 31 -388 -92 31 73 33 -60 1 81 -33
3586c3J56L4j02j22N7j56K5O4K4K99k73J06k0j90M2p3o5J06N3n4J13Qj18J46K3
$$ -33 123 157 55 -67 -10 -166 -141 -77 -53 246 -27 79 59 -131 -89 -162 -227 -121 -68 -122 -9 -1 -119 27 50
3611E0j28L6N2P1p4L7N5q6K73n60M36p3j98P6J7J03l18K96j71l1j36J15J64O0
$$ 50 -78 -42 10 81 7 44 99 13 286 -274 162 89 -109 -33 -16 87 -231 65 -106 -137 -273 -158 6 66
3635F6O9J1k1p6k0LPK07k30K14j27l31O7J37R5l49J11J7K76k55PO4l1n0mQ9P9
$$ 66 135 146 125 49 29 32 39 246 16 230 103 -228 -161 -24 71 -278 -167 -150 126 -129 -122 -58 -89 -139 -143 -54 25
3662B5j8q1J27j74L99l4k02mL5J94q4K9l67p8L0O2L38m55J56J66m0q2J25k78K03
$$ 25 7 -74 53 -121 278 244 42 38 73 267 183 212 -155 -233 -203 -141 197 -258 -102 64 24 -58 67 -211 -8
3687hK6J58k07K82o6J6L5l07l5K73j85j14J75j23J25j52J0j32M9n2L39N5n51L93
$$ -8 18 176 -31 251 185 201 236 -71 -106 167 -18 -132 43 -80 45 -107 -97 -229 -180 -232 107 162 -389 4
3711Dj09R7L58k76J53j54N6l02M44r1P6k51L7j53J16q6k07K93k41N68m03K18o6
$$ 4 -105 -8 350 74 227 73 129 -173 271 180 256 5 42 -111 5 -81 -288 5 -236 332 -71 147 81
3734H1k10R1j05K65j25J34j76O1K23j5k26k6R7%k00J59l6nj79J97k67J22R4M9
$$ 81 -129 -38 -143 122 -3 131 -45 16 239 224 -2 -28 69 69 -131 28 -8 -13 -192 5 -262 -140 -46 3
3758Cq0Q6j93J3L77k47rR3m4m6J70j08k2j14j33J32j25K55j47J34L8j6j08k21
$$ 3 -77 9 -184 -171 206 -41 -50 43 -1 -47 123 15 -7 -121 -254 -122 -247 8 -139 -5 33 17 -91 -312
3782c12M14j31K25j25J12r8j26O3M9L5O3k0j02O2j65o7K09r7r5N5j23J75l24L08
$$ -312 102 -29 196 71 183 85 -41 22 71 106 169 149 47 109 -56 -123 86 -11 -106 -51 -174 1 -323 -15
3806a5l18J95J72k31L14Qr0O9n0o1K76r1m6M5j99j03M11j27j73k76K83Q0k83R9
$$ -15 -333 -138 34 -197 117 125 35 104 54 -7 269 178 132 177 -22 -125 286 159 -14 -290 -7 73 -210 -111
3830a11k3J61k32J84k17K94J59M1j44j70J80J19j80r5J17k66L72K4j61pk8j43
$$ -111 -134 27 -205 -21 -238 56 215 256 112 -58 122 241 61 -34 83 -183 189 213 52 45 17 -126
3852a26J81j26jj5M60m69Q3K54m09L37KJ81k85j03J95l75M27j08k25K61j17l51
$$ -126 55 -71 -72 -87 373 -96 -13 241 -168 169 171 352 67 -36 159 -216 211 103 -122 139 22 -329
3874c29M58l09J97k76p5K14J64j71j71M1L74k41K37L7m3p2j3K11j35R4k0k46m7
$$ -329 129 -180 17 -259 -334 -120 44 -127 -298 -257 117 -124 113 150 107 35 22 233 98 192 172 -74 -121
3897a21O0L5pr8J70J3k05M2j66L63j00j62J13L16n8k73L31j54r3j36L75q9j10
$$ -121 -61 -26 -33 -131 39 52 -153 -111 -277 86 -14 -176 -63 253 195 -78 253 99 6 -130 245 156 46
3920D6l34J53J13J0j48n1n0L25P4k0K3o6J53l90K64j0k14K88l0j22q2J56M2k21
$$ 46 -288 -135 -22 -12 -160 -211 -261 64 138 118 141 75 228 -162 102 92 -122 166 136 14 -68 88 130 -91
3944i1J8n1M38m69M58j41k53M56m16J15%j91J75k09L69k77K11o8q0M2kR0l4j15
$$ -91 -73 -124 314 -155 303 162 -91 365 -51 64 64 -127 48 -161 208 -69 142 74 -6 36 34 124 90 -25
3968b5L51j74k1l48J42LK7k77L37l0k3j42NJ8K00o2J46j13m8J30k16J57R3j49
$$ -25 326 152 131 -217 -75 -72 -45 -322 15 -15 -38 -180 -175 -157 43 -19 127 14 -34 96 -120 37 130 -19
3992a9o7j37M02k70K35j02R5k01l1j36J51M1J90j22j85K03J44k17K03K6m38K62
$$ -19 -86 -223 179 -91 144 42 137 -64 -95 -231 -80 -39 151 29 -156 47 191 -26 177 203 -235 27
4014B7K24j99j61J37LJ92l95p9K40k5k63L13j31J30j71K4M19k98p4M11j82M8l54
$$ 27 251 52 -109 28 31 223 -172 -251 -11 -36 -299 14 -117 13 -158 -134 285 -13 -87 324 142 190 -164
4037a64J46L57k83J8j5j48J19j22O6n9J12r0J24k79R3J98j78n6Q2K09J18k43J01
$$ -164 -18 339 56 74 59 -89 30 -92 -26 -85 27 -63 61 -218 -125 73 -105 -161 -79 130 248 5 106
4060A06J92m52L41k37q4J86k44K30m4j14Lj26K20J8m8k96M74j73M6l5J15l54J48
$$ 106 298 -154 187 -50 -134 52 -192 38 -6 -120 -117 -243 -23 -5 -53 -349 125 -48 -2 -37 78 -276 -128
4083a28qK2L54j02j10K30k69j51p9L29j54j16Q2J84r5n0O8j34q3J68qn0j65J53
$$ -128 -136 -114 240 138 28 258 -11 -162 -241 88 -66 -182 -100 84 -11 -61 7 -127 -210 -42 -50 -100 -265 -112
4107a12K48k93K74k88J35K11J33k16l4m7J83j78k4K4Q0P3j78m1r4J12j41L75r9
$$ -112 136 -157 117 -171 -36 175 308 92 58 11 194 16 -8 16 96 169 -9 -50 -144 -32 -173 202 103
4130A03l33M74l61J69O1Q9l8j58J43j36K08j63P6m49M40k54J9L3j51l9K21n6k2
$$ 103 -230 244 -117 52 113 202 164 6 149 13 221 58 134 -315 125 -129 -110 -77 -228 -267 -46 -102 -124
4153a24P2j30M3L10n09J76K13L3l12L09k47k0L86k33P5R3j83J0j00K58k9j43Q5
$$ -124 -52 -182 -139 171 -338 -162 51 84 -228 81 -166 -186 200 -33 42 135 -48 -38 -138 120 91 -52 33
4176C3J73k41L5rJ06j42J77j06J33jn4j09K84p2J0j38J15Om01KK28N1j41O0J0
$$ 33 206 -35 0 -9 97 -45 132 26 159 158 104 -5 279 207 217 79 194 200 -201 -199 29 80 -61 -1 9
4201IJ84k19k23K77j16J18M5J55k66R0n3o7k1J59j89O4M20m52N7j74L07J0j13
$$ 9 193 -26 -249 28 -88 30 75 230 -36 54 1 -66 -87 72 -117 -53 367 -85 -28 -202 105 115 2
4224Bk11K35k34OL44j98j18J93j1j5j53R7K74J67m09K84k79L34n02J66O3j07K
$$ 2 -209 26 -208 -202 142 -56 -174 19 8 -7 -160 -63 211 378 -31 253 -26 308 -194 -28 35 -72 -70
4247g0l04J38K52p0j91J60J35J33l16L9R4j68K88L0L6j53r0L77j74k03K06j58
$$ -70 -374 -236 16 -54 -245 -85 50 183 -133 -94 0 -168 120 150 186 33 -57 320 146 -57 149 -9
4269ij35o4L72o9k06K2k15J95k08M25j51k9J09j22K02j74J65pk28O3P2M3R8l42
$$ -9 -144 -208 164 95 -111 -89 -304 -109 -317 108 -43 -72 37 -85 117 -57 108 101 -127 -64 8 51 149 -193
4293a93J69K2j20J84j85J23o1K26l32K40p6k08L08KR1K55Q7n33P3k10J3L69k68
$$ -193 -24 -2 -122 62 -123 0 -61 165 -167 73 -3 -211 97 99 190 445 532 -1 72 -138 -125 244 -24
4316b4K0J38k37R0M9m6j02M1J44k34J51N1n5J76k56K09j3P2j82J36J53O8j21j02
$$ -24 -4 134 -103 -13 36 -10 -112 -71 73 -161 -10 41 -14 162 -94 115 102 174 -8 128 281 349 228 126
4340A26j19JP7p1J09l72K99k57RK11Jo0J89j98M6j5n8M1J20O8j15R5j26m4n8p4
$$ 126 7 8 85 14 123 -249 50 -207 -198 13 14 -46 143 -55 -9 -24 -82 -41 79 147 32 127 1 -43 -101 -175
4366a75K01o3p6n6J48j9Q3o4P2K0l51M21k55R0K20l10J40k7j0L03j58K1j98J23
$$ -175 26 -37 -113 -169 -21 -40 43 -21 51 71 -280 141 -114 -24 196 -114 26 -1 -11 292 134 155 -43 80
4390H0k76K11k30R3J41j55K55q0j20k80O15k94r2J47j90K28O5L0k41L49k82%N3
$$ 80 -196 15 -215 -122 19 -136 119 39 -81 -361 254 -40 -132 15 -175 53 118 148 -93 256 -26 -26 27
4413B7j24Q9L4J0K70l38K84j64k18O4J00J69j00K1j31j31J38o0J2K47j81J48q9
$$ 27 -97 -8 26 36 306 -32 252 88 -130 -66 34 203 103 124 -7 -138 0 -60 -48 199 18 166 77
4436G7k33N54l87k02l0O0L55j22k75J98J36l74L97j70j00J19J09j00j90OK54k29
$$ 77 -156 398 11 -191 -221 -161 194 72 -203 -5 131 -243 154 -16 -116 3 112 12 -178 -172 82 -147
4458a47J2L34k67L17r2k42J72k3k53J73j58Q9K31m14Q3K5J58pj7N4j20L07n9J18
$$ -147 -135 199 -68 249 157 -85 87 64 -189 -16 -174 -85 146 -268 -185 -160 -2 -9 -26 28 -92 215 156 274
4482B74j24l26J84j31K50j37k05M87q6l54K4r3J76J52j38O1j74J99k02K37j89
$$ 274 150 -176 8 -123 127 -10 -215 272 186 -168 -144 -237 -61 91 -47 14 -160 39 -163 74 -115
4503a15J37J65m6k4Kk88p4L71j62J29L8j22J00o9n1o6kj49K37K45l67N4j13K97
$$ -115 22 187 141 117 119 -169 -243 128 -34 95 133 11 111 42 -9 -75 -77 -226 11 256 -111 -57 -170 127
4527A27j24p8J09p1K17j53jK49j23jJ08j94J99m22J85k7k70J79n3P9j36N8M6J50
$$ 127 3 -75 34 -37 180 27 26 275 152 151 259 65 264 -158 27 0 -270 -91 -144 -65 -201 -143 -97 53
4551E3K21j34j99J88n9K12l65J35oP3k41J52m0P7j08k58K36J42l72J40J15k6J55
$$ 53 274 140 -59 129 70 282 -83 52 46 119 -122 30 -10 67 -41 -299 -63 79 -293 -153 -38 -64 91
4574I1L3J90l44J63q8p2J63j84J29J11k31K34J00m84L12k31l06O04k50J63j90
$$ 91 124 314 -30 133 45 -27 136 -48 81 192 -39 195 295 -189 123 -108 -414 190 -60 103 -87
4595h7K46k36qQ7P9J56l78PL9R7M7O8o6m8K4j42K32On0j75J10j06k14M47k78j91
$$ -87 159 -77 -85 2 81 237 -141 -134 -95 2 49 117 51 3 27 -115 117 123 73 -102 8 -98 -312 135 -143 -334
4621c34N31%j88k40K69M6k62J13K03l27L26j45J24j47L52m04K3k76K86P9j15j7
$$ -334 197 197 9 -231 38 84 -178 -65 138 -189 137 -8 116 -31 321 -83 -60 -336 -50 29 -86 -103
4643a03o4Q5J99k36j0M5j75L65k36m3N8J06J13J01j12j22J27j11r2L1m5p7J65
$$ -103 -167 -82 117 -119 -129 -84 -259 106 -130 -173 -115 -9 104 205 93 -29 98 -13 -105 -74 -119 -196 -31
4666c1K63l85K2q9j00L76k39J87r4J18R4K4j79M1P3j61J49o9QL87k31qk86J55
$$ -31 232 -153 -131 -220 -320 56 -183 4 -90 28 122 146 -33 8 81 -80 69 0 8 395 164 156 -130 25
4690B5k05J95j03J11j28j2n6J92K7Q6R9l75K17Q3j62q1M2P3N3k80K05N7J85P6
$$ 25 -180 15 -88 23 -105 -117 -173 19 46 132 231 -144 73 156 -6 -87 -45 28 81 -199 6 63 248 324
4714C24k75j28jj0L1KK68k40k5n5j42J43K65k16NK26J77k83j45K75k41Q0k03J48
$$ 324 49 -79 -80 -90 -59 -57 211 -29 -54 -109 -251 -108 157 -59 -54 172 349 66 -79 196 -45 35 -168 -20
4738b0M8Jk5n7j42J07L79m35J18k8J69l3p0N8rk94L86O1l2o0l12K63l16L62n5
$$ -20 28 29 4 -53 -195 -88 291 -144 -26 -54 115 82 12 70 61 -233 153 214 182 122 -190 73 -243 119 64
4763F4j3j19J8k02J5L61k00j5k7q5K32J28M3l29K64K3j55Q8o4M3r4M00l34o1j66
$$ 64 51 -68 -50 -252 -237 124 -76 -91 -118 -203 29 157 200 -129 135 158 3 91 27 70 -24 376 42 -19 -185
4788a85O8P3Oj41J65J08r4j7J19Q5m2k35l7K11J55l00J15k25K98r2K1N9q8l1L5
$$ -185 -117 -44 -38 -179 -14 94 0 -17 102 187 145 -90 -127 84 239 -61 54 -171 127 35 56 115 27 -4 31
4813C1r0j68Q8J51P1k44J25o5J17j64J23r6J22J10O0j03q3K73j68J05j98J69j21
$$ 31 -59 -227 -139 12 83 -161 -36 -101 16 -148 -25 -121 1 111 171 68 -15 258 90 195 -3 166 45
4836D5j50P4q1L1n3P3J94j24j5J34j7j63L22J1m9j17L8k60K72k28j29K4K08J65
$$ 45 -105 -31 -112 -81 -134 -61 133 9 -6 128 111 -52 270 281 232 115 153 -107 165 -63 -192 -168 40 205
4860B05J11l51j2M7j38K92l73K81q3P3P0l99K59Q2m8J97j80j07K73j10j22J95
$$ 205 316 -35 -47 0 -138 154 -219 62 -21 52 122 -277 -18 64 16 213 33 -74 199 89 -33 162
4882A62O3k9q3M2k73R3k3p0J37j24J42O8o8j27L0o7L76l26k68L87k0m7k5J9J35
$$ 162 225 196 113 155 -118 -25 -48 -118 19 -105 37 105 37 -90 -60 -127 249 -77 -345 42 22 -25 -50 -31 104
4907A04j00J74r6J11l27RpO3J17j24k3K62m91J26L33k53K99k59Q5N4P2l3J53j80
$$ 104 4 178 82 193 -134 -125 -132 -69 48 -76 -99 163 -328 -202 131 -122 177 -82 3 57 129 96 249 69
4931F9J64q1O5j52k87N60k64j31J11n9K0l40J93J94q8j46J9L18l82K74r7mN9O3
$$ 69 233 152 217 65 -222 338 74 -57 54 -5 15 -325 -132 62 -26 -172 -153 165 -217 57 -40 -44 15 78
4955G8j16j22M33j95J45l44K88k42l0k1R5j54r5R4P6K1j03J38J87K18j65j91j12
$$ 78 -38 -160 273 78 223 -121 167 -75 -105 -126 -31 -185 -280 -186 -110 -89 -192 -54 133 351 186 -5 -117
4978a17K60M3m02Q2J65N5j15J62l03K85k01k3j59M04k53K37j92K43j85J7m2j95
$$ -117 143 186 -216 -134 31 86 -29 133 -170 115 -86 -109 -268 136 -117 120 -72 171 -14 3 -39 -234
5000b34L45k1K4q1K31j60O0k05RJ79Kk6k1k78j46O4J36J96k80K67k11R4J46l17
$$ -234 111 90 114 33 264 104 164 -41 -32 147 149 123 102 -176 -322 -258 -122 74 -206 61 -150 -56 90 -227
5024b27L38r3j57K56l13J91J54j66J32j67j86M94k14q3k74K55K57n14L42jr2j83
$$ -227 111 18 -139 117 -196 -5 149 -17 115 -52 -238 256 42 -41 -315 -60 197 -317 25 24 -68 -251
5046b51P4L54k71P7j7J89k9K09k89K72k37j62K13j6k74L10j50K15j48J51k15J10
$$ -251 -177 177 -94 -17 -34 155 126 335 46 318 81 -81 132 116 -158 152 2 217 69 220 5 115
5068A15j32p7J36K6m7Q4o5J9k4M03l08j94pM4Q8r4j08q9K15q5l%J46j00M0j98
$$ 115 -17 -94 42 68 21 105 40 59 35 438 130 -64 -71 -27 61 -33 -141 -230 -15 -100 -103 -103 43 -57 -17 -215
5094b15N9L64l77K14k7M05o03K62K10m11K77j69n6J02k27J40nlJ23k22j4J16Q2
$$ -215 -156 208 -169 45 18 423 -180 82 292 -119 158 -11 -67 35 -192 -52 -57 -60 63 -159 -173 -57 25
5117B5kr5M7m6J29L1l0J08P3j31k51J63L53j61m11K52K30l98k10L65k3P2k48J43
$$ 25 23 -72 -25 -71 58 89 59 167 240 109 -142 21 374 213 -198 54 284 -114 -324 41 18 90 -158 -15
5141a5N2o9K8k56L82Qq6o9R7r1j95N6J25K91j82j15J47l25L6L04k4P6p5K0l26
$$ -15 37 -32 -4 -260 122 130 44 -25 72 -19 -214 -158 -33 258 76 -39 108 -217 -181 123 99 175 100 120 -206
5166b06K08k12J37L30j16m76J32P1L22j28j3Kn1m8p0K52j74J7J15j66k20N71l05
$$ -206 2 -210 -73 257 141 -335 -203 -132 190 62 49 51 0 -48 -118 134 -40 -23 92 -74 -294 277 -28
5189b8Kj88J45o5K76k71J79k33K83j34n0K58j29m0p0J24j82o0L14J97m70K34m2
$$ -28 -26 -214 -69 -134 142 -129 50 -183 100 -34 -84 174 45 5 -65 59 -123 -183 131 328 -142 92 50
5212E0k69K56o2Q4j10N8J75j91m0j45K38L2n3J45o5K50m25J17q6l6J56j31k47
$$ 50 -219 37 -25 59 -51 7 182 -9 -49 -194 44 76 23 168 103 353 -72 45 -41 -77 79 -52 -299
5235b99n0L62k81J99J44j48K0m5qL98k12k59P9P8j97M00n8j05j6K92l95J35K75
$$ -299 -349 13 -268 -69 75 -73 -53 -98 -106 292 80 -179 -100 -22 -219 181 123 18 2 294 -101 34 309
5258C09l23K5K5j83L1L4l2J63jq5q3m5N3K53j63O8J25k54J25Q4j58p5L61k11r8
$$ 309 -14 11 36 -147 -116 -82 -114 49 48 -37 -120 -165 -112 141 -22 46 171 -83 42 126 -32 -107 254 43 -55
5283e5K58k39P0j96q7K27J57l07N1J35j15J46NP0j21k7M4j04n8L20j90K99k30
$$ -55 203 -36 34 -162 -249 -22 135 -172 -121 14 -101 45 50 120 -1 -28 16 -88 -146 174 -16 283 53
5306E3J34j70J24k13J86n9P4n7j29q7K08l02M15j00j1j00K87j12j22K02k93J07
$$ 53 187 17 141 -72 114 55 129 72 -57 -144 64 -238 177 77 66 -34 253 141 19 221 -72 35
5328C5l1R2j76K16o5q1O3k2k73L59k15q8L51q0N7k8J01j64k63K91K7J47n1mj98
$$ 35 4 96 -80 136 71 -10 53 31 -242 117 -98 -186 165 85 142 114 215 51 -212 79 106 253 202 198 0
5353@j00M27k87J38j16K4j72Q5j73K74k5l96L83l08M33k51J64j29J90%Kk46n9
$$ 0 -100 327 40 178 62 86 -86 -1 -174 100 75 -321 62 -246 187 -64 100 -29 161 161 163 -83 -142
5376a42J2j6J27k27K82J24l37P0p7N2q6m7J33M5J44n8J0j3k71M06oL45k02k88
$$ -142 -130 -146 -19 -246 36 160 -177 -107 -184 -132 -218 -265 -132 -87 57 -1 9 -4 -275 131 125 470 268 -20
5400b0R2k28J15J7J02k42K33j23Q6k84J9L20p3j16K16k63m1J41j45J66K07j91
$$ -20 72 -156 -41 -24 78 -164 69 -54 32 -252 -233 87 14 -102 114 -149 -190 -49 -194 -28 179 -12
5422a2J17j65L4J55k13K1K1J17j73j01K12j43O8N7J8k1j60J21J67l05L49j30J04
$$ -12 105 -60 -26 129 -84 -63 -42 75 -98 -199 13 -130 -62 -5 13 -8 -168 -47 120 -185 164 34 138
5445A38J15j00J51j20k0r9j65J07O7K8k57K00j13J63j45K22j15l19K81J10k45
$$ 138 253 153 304 184 164 65 -100 7 74 102 -155 45 -68 95 -50 172 57 -262 19 129 -116
5466a16P5Q7Jj85J9j23L24k87R5q6L10K29l82J53l8j53L9j43L1K06K0l06K36j01
$$ -116 -41 46 47 -138 -119 -242 82 -205 -110 -196 114 343 -39 114 76 -77 -38 -181 -150 56 76 -230 6 -95
5490i5j12Q7L52n4j50J20j56K6k10K41P2O4k69K04m8L55m98Q2r5J7k20J83n0o
$$ -95 -207 -120 232 178 28 148 -8 18 -192 49 121 185 -84 120 72 427 -71 11 -84 -67 -287 -104 -154 -160
5514a60Q7K40l23o0J14k7%J82j00j50J22J79J2K5j63J60P1j10p1J32l49L15k06
$$ -160 -73 167 -156 -216 -102 -129 -129 53 -47 -197 -75 104 116 141 -22 138 209 99 28 160 -189 126 -80
5537h0Q0J12k54J27J07j5k3l22M51r0m3R5k40K49k79K56Q7k27K43n55L94j09K51
$$ -80 0 112 -142 -15 92 77 54 -268 183 93 50 145 -95 154 -125 131 218 -9 234 -321 73 -36 215
5560B15j70M7J15l21L58m31nK86j20m0L3rQ7R9n2j21P0r4J54J40k87P4n1J5m8
$$ 215 45 92 207 -114 244 -187 -192 94 -26 -66 -33 -42 45 144 92 -29 41 -53 101 241 -46 28 -23 -8 -56
5585e6m0ln1j46K90n2J59J31n1l46K03j35K05k22J17l0L58k9j87M4j35qP1j17
$$ -56 -96 -99 -150 -296 -6 -58 101 232 181 -165 38 -97 108 -114 3 -27 331 302 115 159 24 16 87 -30
5609c0l2P0k2J2r7k4LL55l64J39J18k42K52o9J17j73qK3Q2M8j40j30J69j64J0
$$ -30 -62 8 -14 -2 -99 -123 -120 235 -129 10 128 -114 138 69 186 13 5 28 110 158 18 -112 57 -107 -97
5634i7M5J08k71K06J13O9k7k89J96K1l9J10k61J75m8J35J95l04p1J18L1P1n15
$$ -97 -52 56 -215 -9 104 173 146 -143 53 74 35 145 -116 59 11 146 341 37 -34 84 115 186 -329
5657c29J71R9k16K10J13j47m0O4q6J19J05n9J53k16K04l2J01k05P7j41j0M8K01
$$ -329 -158 -59 -275 -65 48 -99 -139 -75 -161 -42 63 4 157 -59 145 113 214 9 86 -55 -65 -17 184
5680A84j14j03o6l4K80k33K5j80L06r9M2r9j91L93j83J94lm9M4q5J75j48j19n7
$$ 184 70 -33 -99 -133 147 -86 -61 -241 65 -34 8 -91 -282 111 -72 122 119 70 114 29 204 56 -63 -120
5704a20K06k50l0L5%J03J64k00o7l1J37l0P8O2k12J37J45j75J72k12K39j97K25
$$ -120 86 -164 -194 -159 -159 -56 108 -92 -159 -190 -53 -83 -5 57 -155 -18 127 -48 124 -88 151 -46 179
5727A79k04N0J22k18K42l45L31j51o2K6q2l0K63k12J59k92K51j59K73j66J21k
$$ 179 -25 25 147 -71 171 -174 157 6 -56 -30 -112 -142 121 -91 68 -224 27 -132 141 -25 96 94
5749I4l5l8l2q0K22k77rK06J00j92R0J47j09J20l77l7j16L24J62n19L54P6Q8k39
$$ 94 59 21 -11 -91 131 -146 -155 51 151 -41 49 196 87 207 -170 -207 -323 1 163 -356 -2 74 162 -77
5773g7K57o6M5k93K65L0k43L04j88qM2J41o4p8j05n8R8j66J19K76o43O04j74L19
$$ -77 180 114 159 -134 131 161 -82 222 34 26 68 209 145 67 -38 -96 2 -164 -45 231 -412 192 18 337
5797C37L0l86Q5n4J46j50R6O9k5k17J8j56J51k1r2K50j84M93l00J6k88J85j62
$$ 337 367 -19 66 12 158 8 104 173 148 -69 -51 -207 -56 -77 -169 81 -103 390 90 106 -182 3 -159
5820a59L82l27k6K97N8k50K10j64l23L97j34K5J01Q8j30o7j96L60j61k35Q7L55
$$ -159 223 -104 -130 167 225 -25 185 21 -302 95 -39 -14 87 175 45 -22 -218 142 -19 -254 -167 188
5842A88Ll28K35J3n1J13l30K40Q3j11r9j02K6L30m08K61J7k78L20p3j84M88m20
$$ 188 191 -137 98 111 60 173 -157 83 166 55 -44 -146 -120 210 -198 63 80 -198 122 49 -135 353 -67
5865f7K3O7k33K51N0k9k71J95J09R7m02K44Q2j30J92m3j75j05J19j66J98r0K56
$$ -67 -44 23 -210 41 91 62 -209 -14 95 192 -210 34 116 -14 178 135 -40 -145 -26 -192 6 -84 172
5888A72l13O1P6L75l06M%j8J39k32L2k5K84l49J70m6j12l0L67l08j35K50L4j66
$$ 172 -141 -80 -4 371 65 69 69 51 190 -42 -10 -35 249 -100 70 24 -88 -118 249 -59 -194 56 90 -76
5912g6k07L50J90j48j74L5r5J52J3k10K21j30J66m02L08O0k00J66j15N4o9p6P8
$$ -76 -283 67 257 109 -65 -30 -125 27 40 -170 51 -79 87 -315 -7 53 -147 19 -96 -42 -111 -187 -109
5935a09K34k94J75r5Q2Q8k06K46o4j04L1J3L5M7j13j53J54N4l60N73n06L63J8
$$ -109 125 -169 6 -89 -7 81 -125 121 57 -47 -16 -3 32 79 -34 -187 -33 21 -339 234 -272 91 109
5958A09jk88K00J34j89K60m32M34J85l82q8N07m34J64k59P5J90o7k09K46j28J52
$$ 109 108 -180 20 154 -35 225 -207 227 412 30 -58 449 15 179 -80 -5 185 118 -91 155 27 179
5980A79j98k32N04j88l50K47q0K81p8l21K01J32q0K36m45N7K19r7PO8m0o4J40
$$ 179 -19 -251 253 65 -285 -38 -118 163 85 -236 -35 97 17 253 -192 -135 84 -13 -6 62 22 -42 98
6003I8k55K70n5n7j56L86k69O5J28j95O5l38M88k17o3O1j04K7K52q8K3Kj19J76
$$ 98 -157 113 58 1 -155 231 -38 27 155 -40 25 -313 175 -42 -105 -44 -148 -121 131 43 66 68 -51 125
6027A25l45K45m04M23q5J71m2P1q1q3l1J04k54L25m2J2q1k09P8K16j27j58J95
$$ 125 -220 25 -379 44 -41 130 88 159 78 -5 -36 68 -186 139 97 109 28 -181 -103 113 -14 -172 23
6050B3Q2O7k25K56r7L0l43K03k2r4J32j51L46rl37J8J42j15K7J81j58R8l03L31
$$ 23 105 172 -53 203 106 136 -207 -4 -26 -120 12 -139 207 198 -139 -121 21 -94 -67 114 -44 54 -249 82
6074H2j09J5J30K0r6LK6k74K29K13l81K03J55m60L37K27k41J29k42O4L4P6k02
$$ 82 -27 -12 118 138 42 45 71 -203 26 239 -142 61 216 -244 93 320 79 208 -34 30 64 140 -62
6097f2K0R3k8J44j66j1Mj24j10J91p9J51J39l13J41j1k9J52J6k08K19r8k5L9p8
$$ -62 -42 51 23 167 1 -10 -6 -130 -240 -49 -128 23 162 -151 -10 -21 -50 102 118 -90 129 31 6 45 -33
6122c3R3j53k36M49m88O42m10K72n5l41K77q4O0L9K00J35l95J07oj70J68J70m01
$$ -33 60 -93 -329 120 -368 274 -136 136 81 -260 17 -67 -7 32 232 367 -28 79 73 -97 71 241 -160
6145a60K99j16j8j72m0J15J73L9q1j19J66J0o5J2n1M9n0j09J92j43L2k20J88j08
$$ -160 139 23 5 -167 -207 -92 81 120 39 -80 86 96 31 43 -8 41 -9 -118 74 -69 -37 -257 -69 -177
6169a77J26J55j30l9K31j41l03K55R8m3J49j79L3m1p9P1M8O2k27M81j97j61o1
$$ -177 -51 104 -26 -65 166 25 -278 -23 75 32 181 2 35 -6 -85 -14 34 96 -131 350 153 -8 -69
6192f9K26J06k04k29M7O1Q2J53J97m51N9j21L01j5j09j1R9j55K3l15L24j5J61
$$ -69 157 263 59 -170 -123 -62 20 173 370 -81 -22 -143 158 143 34 23 122 -33 -10 -325 -1 -16 145
6215A45l64L41O9k39J11j23j90K74l85L75Q8j77K3k35J70r0K34K7K3n8P2k04K13
$$ 145 -219 122 191 -48 63 -60 -250 24 -361 14 102 -75 -52 -287 -117 -207 27 54 77 19 91 -113 100
6238A00j37L64j29r3J13l1j80K8K95l66Q7l35L26M3k37J77M5k33K35Q0l13K58
$$ 100 -37 327 198 105 218 187 7 35 330 -36 51 -284 42 85 -152 25 70 -163 72 152 -161 97
6260I7O6r3n19K29K99J01J08Lj55N1m21K71jo0K12l2l23R8j20P8R6K7J69o0j07
$$ 97 163 70 -449 -220 79 180 288 291 136 187 -234 37 36 -24 188 156 -167 -69 -189 -111 -15 12 181 121 14
6285A4o5J48j96K90Kk41l7K28j98Q0k45M42k64K58j48k01K65N3k07J30j61j00
$$ 14 -51 97 -99 191 193 -48 -85 143 -55 25 -220 222 -42 216 68 -133 132 185 -22 108 -53 -153
6307a53J56j44M80m87Q4J03K4J5J1m2M0L4q8K21l43k7O3j45J15J78k50L16k18
$$ -153 3 -141 339 -148 -64 39 63 78 89 47 87 121 33 254 -89 -116 -53 -198 -83 95 -155 161 -57
6330e7n0L56l53J48O3l24K12k05J15M82m37L32l54P4J62L7k90j4L48l37K48n18
$$ -57 -107 249 -104 44 107 -217 -5 -210 -95 387 -50 282 -72 2 164 201 -89 -103 245 -92 156 -362
6352c62K51K88k32L9r1L11k26J58k86Q0Q3R1k7O6j89k1K13l38Q3L68m11J35K12
$$ -362 -111 177 -55 -16 -107 204 -22 136 -150 -70 13 104 77 143 -46 -67 146 -192 -109 259 -152 -17 195
6375A95j2m72J52R6Q8m9n6r2J25lJ95O1j1k1j32J89l65L05j77j33L71l35K0J99
$$ 195 183 -289 -137 -41 47 -2 -58 -150 -25 -28 167 228 217 196 64 253 -112 193 16 -117 254 -81 -61 138
6399A38j19M2Ql42K05j76K26J4k23K46J4K30l13k4J92q7n8J17j5l1Q2j58n8J63
$$ 138 19 61 69 -273 -68 -244 -18 -4 -227 19 33 263 -50 -74 118 31 -27 90 75 44 126 -32 -90 73
6423G3k08K32R2n10K47o7l9J43k06L30l30K69J25j94n3K62rl0P1p6k90J61J38
$$ 73 -135 97 189 -321 -74 -141 -180 -37 -243 87 -243 26 151 -43 -96 166 157 127 198 122 -168 -7 131
6446A31K02k94j77PJRjK5J88o3R5j98J76l83L83k41M5M5K65j87r8P7M8K51j93
$$ 131 333 39 -138 -131 -130 -121 -122 -97 91 28 123 -75 101 -282 101 -140 -95 -50 215 28 -70 7 55 306 113
6471A13j72N4q0K03k1l31K79p8J3J15j74K60l02Q6N0lK26k20p5n5j5J26K77o1
$$ 113 -59 -5 -85 118 97 -234 45 -33 -20 95 -79 181 -121 -35 15 12 238 18 -57 -112 -127 -1 276 215
6495B15j80j27K24j15k8j12Q4J07K34m48L44k61r6R4Q7l8l6NK15k50k17M43jq
$$ 215 35 -92 132 17 -11 -123 -39 68 302 -146 198 -63 -159 -65 22 -16 -52 -47 168 -82 -299 144 143 135
6519A35q5M8r9J64K7k39K32k79j41L26J0j69J31j1j42P8J00j50J63j62K85l61
$$ 135 50 98 -1 163 190 -49 183 -96 -237 89 99 -70 61 50 -92 -14 86 -64 99 -63 222 -139
6541a39L12r8r3K15m00J53J69j15j46K26k90L3J43J37j08L05l45K03l05K40j7
$$ -139 173 75 -18 197 -203 -50 119 4 -142 84 -206 -173 -30 107 -1 304 -41 162 -143 97 80
6562H0m2l03N10j47LJ54r6m9j94Q6K3L29n18K52J0k55k6L74k40J57j23Oj93P6
$$ 80 38 -265 245 98 101 255 159 110 -84 2 25 354 -164 88 98 -157 -183 191 -49 108 -15 -9 -202 -126
6586a26K67k31J46J0j15J41K9J17k25j22M02m17K90l38J1j82L42%J16j48J49j77
$$ -126 141 -90 56 66 -49 92 121 238 13 -109 293 -124 166 -172 -161 -343 -1 -1 115 -33 116 -61
6608f1K6J97R7k79J73p9r8P0L1J54j06j22m7L05l60j89Q0J97O1k54K43l1Jj25
$$ -61 -35 162 259 -20 153 74 -24 46 77 231 125 3 -44 261 -99 -288 -208 -11 50 -204 39 8 9 -116
6632a16M1J54k1J7p0O6j39K92k40k02J53n0qP2K76n17L13l60J96O7j72J09L9K51
$$ -116 -75 79 58 75 5 71 -68 224 -16 -218 -65 -115 -123 -51 225 -292 21 -339 -143 -76 -248 -139 -100 151
6656A51l19J88l0j27K65l55M40j43J3j38Op8J43j16J19n1k31K25k13J28J41l9
$$ 151 -168 20 -10 -137 128 -227 213 70 83 -55 -49 -127 16 -100 19 -32 -263 -38 -251 -123 18 -21
6678b1m9J44j9j32rJ67l34N54q3k33p2p8R6L85m2k71P7j78RK3J17j54R8l29J34
$$ -21 -70 74 55 -77 -86 81 -253 301 218 -15 -87 -165 -69 316 274 3 80 -98 -89 -66 51 -103 -5 -334 -200
6703b00K74l36M9P9M8J64j24J41R7p9k94J26J42J9R9j25l09M17k30J1k96M57j01
$$ -200 74 -262 -213 -134 -86 78 -46 95 192 113 -181 -55 87 106 205 80 -229 188 -42 -31 -327 130 29
6726B9o0k37L18J7j76J29j1L4O2k2L7O9M5J98o05L05j84N2j06J76k09O03n25K0
$$ 29 -31 -268 50 67 -109 20 9 43 105 83 120 189 234 432 -173 132 -52 0 -106 70 -139 464 -61 -41
6750d1l4k12K69j59O9m0K97r5Pk43L09j84J42l54K64J5o2P7J04n9p9J87j4l89
$$ -41 -75 -287 -18 -177 -108 -148 149 54 61 -182 127 -57 85 -269 -5 10 -52 25 129 70 -9 178 164 -225
6774b25K54k5Q5l20L06m50J40K21J9J10j93pJ50o8r9K44o0M1j79O4j26J17j9j46
$$ -225 29 4 89 -231 75 -375 -235 -14 5 115 -78 -85 65 -3 -102 142 82 123 -56 8 -118 -1 -20 -166
6798a66K51K2k05J72R4l71K91J1k55J20J94l12J22J6j0M46k67M1m45M14j88K61
$$ -166 85 107 -98 74 168 -203 88 99 -156 -36 158 -154 -32 -16 -26 420 153 194 -251 163 -25 236
6820B36l71J83j02j29J41p0j41P6Q5j07N0J01Q8j82K28K22k98k03L39k13J79l19
$$ 236 -135 48 -54 -183 -42 -112 -253 -177 -92 -199 -149 -48 40 -142 86 308 10 -193 146 -67 112 -207
6842b07N37j87j86J63k19J50m8j71P5o3K27j10j10K9J01K02r5r8J52k4lJ69l93
$$ -207 330 143 -43 120 -99 51 3 -168 -93 -156 71 -39 -149 -120 -19 183 88 -10 142 118 115 284 -109
6865a09J99m8K3j08L1m7j1R1k15j25L11k93K36q7oK97k8j75J66j75J74J01l37
$$ -109 90 42 65 -43 -12 -59 -70 21 -194 -319 -8 -301 -65 -152 -158 139 111 -64 102 -73 101 202 -135
6888a35J21K1P7J63N0J50n03J2Q1l27L34k28K07J10r2n7m9J47qJ4m1j9k14J69
$$ -135 -14 7 84 247 297 447 -56 -44 37 -290 44 -184 23 133 41 -16 -65 82 74 88 47 28 -186 -17
6912a7J79p3l24L80k78K38j01J08p8L4j85q0J50K05l18J52J32k96K62l47L21j73
$$ -17 162 89 -235 145 -133 105 4 112 34 68 -117 -197 -47 158 -160 -8 124 -172 90 -257 64 -109
6934a09J36J49k85J95j44J26l54K64J35p6j9j05K28j58J09O9j33j84k7L16k49
$$ -109 27 176 -109 86 -58 68 -286 -22 113 37 18 -87 141 -17 92 161 28 -156 -183 133 -116
6955a16K8L3O5q8KQJ52l6j01J65j97K08k36J47J39j41q2L5k23K63j43j46J09J74
$$ -116 -88 -55 10 -78 -76 -68 84 48 -53 112 -85 123 -113 34 173 32 -50 -15 -238 25 -118 -264 -155 19
6979A9j01OK1J98k02K04q2n3j66M8J23N6q0j46K59j11j0J98k03K03j26j43P6k54
$$ 19 -82 -76 -55 143 -59 145 63 10 -156 -108 15 71 -9 -155 104 -7 -17 181 -22 181 55 -88 -12 -266
7003b66K68R2l14K18J7k46L26k67O1m8L00p5M0p3K8j58Kk25L35j17l4k8L40j38
$$ -266 2 94 -220 -2 15 -231 95 -172 -111 -159 141 66 106 33 61 -97 -95 -320 15 -102 -136 -164 176 38
7027C8j14J02r1j30P7J63p9j35J30J3J07L3k01j82K18K1n5K4r7K39k10J43l3J2
$$ 38 -76 26 -65 -195 -118 45 -34 -169 -39 -26 81 114 -87 -269 -51 -30 -85 -61 -158 81 -129 14 -19 -7
7051gm5K15j35o2rj31J91Qq1LJ32m4R6k50R4q9K73l07K79k34K3Q0Q3J65k89Q9
$$ -7 -52 163 28 -34 -43 -174 17 25 -56 -53 79 35 131 -119 -25 -114 159 -148 131 -103 -80 0 83 248 -41 48
7077D8l08L94k9j40jJ49K1j15K89m92J26K0jN8J50k53M7L9J03P4rj11j31J76K
$$ 48 -260 134 105 -35 -36 113 134 19 308 -184 -58 -38 -39 19 169 -84 -37 2 105 179 170 59 -72 104 106
7102A06k38J56j88j74N26j71J57M0k3p6k24J51q0J2L07k12P1m66K17J56p5n7J10
$$ 106 -132 24 -164 -338 188 17 174 214 191 115 -109 42 -38 -26 281 69 140 -326 -109 47 -28 -85 25
7125B5j82N5K9m1L18m12L33j16m0Q1q6j5K86j30p0j21K91k47l4l3Q3m9K05j85
$$ 25 -157 -102 -73 -114 204 -208 125 9 -31 50 -36 -51 235 105 35 -86 205 -42 -76 -109 -26 -75 130 -55
7149e5J72k26j69M49l59J57j56j58M29m33K16J88j84L29k70K00J24k45K07k14
$$ -55 117 -109 -278 171 -188 -31 -187 -345 84 -349 -133 55 -129 200 -70 130 254 9 216 2
7169BN3p8o8o4M6P8j51L22j59o9o4N3N5j8j8R7l5J90J53l65N5O4R0K3j70Oo5j9
$$ 2 55 -23 -91 -155 -109 -31 -182 140 -19 -88 -152 -99 -44 -62 -80 17 -18 172 325 -40 15 79 169 192 22 28 -37 -56
7197e6k0Q8o7O2P7K9j69K07k92J61m3L8o3J90J0k13M2P2l27L95j99J29j29K2M5
$$ -56 -76 12 -55 7 84 113 -56 151 -141 20 -23 15 -48 142 152 -61 -19 53 -274 121 -78 51 -78 -56 -11
7222a1k1L56%l96O4n4J1J9j83M28n8j04J72m27L77L9m7k18L23k65m0j6j40l8L12
$$ -11 -32 324 324 -72 -8 -62 -51 -32 -215 213 155 51 223 -204 173 212 165 -53 270 5 -35 -51 -191 -229 83
7247H3n9J04J28k19k66R2J43k07RM08j77J81l47L33l25K78j65O6n3J01j78K17
$$ 83 24 128 256 37 -229 -137 6 -201 -192 216 39 220 -127 206 -119 159 -6 60 7 108 -70 147
7269A47k56j32J82Q6o4l07N92k33Rj35j98L71l01L32k4k16J40k20L14p6j59K01
$$ 147 -109 -241 -59 27 -37 -344 248 15 24 -111 -309 62 -239 93 69 -147 -7 -227 87 11 -148 53
7291E3j1J00k16k1J58j01K35k30J1o2K38o1p3J6J06j51J11j13J9j48J77J03j00
$$ 53 42 142 -74 -95 63 -38 197 -33 -22 -84 154 93 20 36 142 -9 102 -11 8 -140 37 140 40
7314D0j42N0Q5j81M0Q3J02P1M8l06K67N4j97M3k59L98l9jM2j4n0k36J38j17J06
$$ 40 -102 -52 33 -148 -108 -25 77 148 196 -110 157 211 14 57 -202 196 157 156 198 184 134 -102 36 -81 25
7339B5m4L2Jj87M45k60j06l3m9k0J65k74L31j16L1K20j49O5K04j32r5j06R2j50
$$ 25 -19 13 14 -173 272 12 -94 -127 -176 -196 -31 -305 26 -90 -59 161 12 77 281 149 54 -52 40 -110
7363a10n2Q9K91k41J84l8k36q7p7M24k28K0J19j52P8O9k18rK69j59Q9J75k59J6
$$ -110 -162 -73 218 -23 161 123 -113 -200 -277 147 -81 -61 58 -94 -16 53 -165 -174 95 -64 25 200 -59 -43
7387d3K60m3k83N7Q9K9l4J61j04j4p6O6j92j1J36n3J7L8k2J43L9j11q0J58k06
$$ -43 217 174 -109 -52 37 66 32 193 89 75 -1 65 -127 -138 -2 -55 -38 0 -22 121 160 49 -31 127 -79
7412g9J02mK0k79R5J74R9m4m50N07j47N6k35J26K23j23j68P2j49K46J98j0l00
$$ -79 23 19 39 -240 -145 29 128 84 -366 141 -6 50 -185 -59 164 41 -127 -55 -204 42 240 230 -70
7435g0K27k96J01P6l1o1J13N5q5j75Q4l2r9J10R6q8j3LL08k01%j2J02j52L8O4
$$ -70 157 -139 -38 38 7 -54 59 114 29 -146 -62 -94 -193 -83 13 -75 -88 -85 223 22 22 10 112 -40 -2 62
7461F2k57K12J8j34J61q9n1mK0K67k68J24q7Q2j22L0J28k10K63N6k25J95j64j62
$$ 62 -195 17 35 -99 62 -27 -78 -82 -62 205 -63 61 -26 56 -66 -36 92 -118 145 201 -24 171 7 -155
7485a55J46j13J90j73K15k32M2J08J69k23n3J56k44L45m34K03n0k2K54k30L14
$$ -155 -9 -122 68 -105 110 -122 -80 28 197 -26 -79 77 -167 178 -256 -53 -103 -125 129 -101 213
7506B13k70J42O2j30K83k76O2j5K00l38k32K14J98k76K20j25j18K74j17r8O3J61
$$ 213 -57 85 147 17 300 24 86 71 271 -67 -299 -85 113 -163 57 -68 -186 88 -29 -127 -64 97
7528I7k28J08l9P7N5q7J21j03n3K10m28l3K70L6O6j29j43K12j09J66j01j41K78
$$ 97 -131 -23 -62 15 70 -17 104 1 -52 158 -270 -303 -33 3 69 -60 -203 9 -100 66 -35 -176 102
7551A02m42L66J55j49K63j23Q8r1j84J16K4K24p36M51j39R3q4j06J90k15L71j86
$$ 102 -340 26 181 32 295 172 260 169 -15 101 125 349 -387 64 -75 18 -66 -172 18 -197 174 -12
7573a2J88k41r3K00R4k61n2J90j92K13j02R4R8o4K8l3Qj30n1J91p1n8k22L06M8
$$ -12 176 -65 -158 42 136 -125 -177 13 -179 34 -68 26 124 60 88 55 63 -67 -118 73 2 -56 -278 28 76
7598G6k28L36j24oJ50k6l36J36J44q2p2Q5o8Q5J79m42R0k77M38l01K57p9j15L19
$$ 76 -152 184 60 54 204 178 -158 -22 122 40 -32 53 -15 70 249 -193 -103 -380 58 -243 14 -65 -180 139
7622A39n4Q9J55o95L23l6O3R7n5j56J49J16O1l34J57J05j09o0k57J09M40l49k5
$$ 139 85 174 329 -366 -43 -79 -16 81 26 -130 19 135 196 -138 19 124 15 -45 -302 -193 247 -102 -127
7645a27p4K9J21lk17M30m0k16R2j78N0l2L05j11J20P9k22j5M7j55J77R9l46J79
$$ -127 -201 -172 -51 -54 -271 159 119 -97 -5 -183 -133 -165 140 29 149 228 6 -9 38 -117 60 159 -187 -8
7669hj67J38J78K8j02j44J29k1j78J46m5L9Q9J15j54j01J23K49k26k83J75L7J93
$$ -8 -175 -37 141 169 67 -77 52 31 -147 -1 -46 -7 82 197 43 -58 65 314 88 -195 -20 17 210
7692B10l84J22j05J20p9Q2J81n4p0j32L18k63J8J01LJ96k96P0M0l5pk39K75j20
$$ 210 -174 -52 -157 -37 -116 -34 147 93 23 -109 209 -54 -36 65 68 264 -32 38 78 43 36 -203 72 -48
7716d8j06J91K21l58K68q0l74J88L32k68J56k1m4j99no3K82P9N2j6l05L68l29
$$ -48 -154 37 258 -100 168 88 -286 -98 234 -34 122 101 57 -142 -147 -210 72 151 203 187 -118 250 -79
7739g9L5j36R4J26j26J95q9o5J79k25RJ53n2J20k2j84k11L56m9N1P5o8J8j57K13
$$ -79 -44 -180 -86 40 -86 109 20 -45 134 -91 -82 71 19 139 117 -67 -278 78 29 80 155 87 105 -52 161
7764A61j64M1o2N7m29L40K3o3J2K42j16L7q7k4K25o2pk15J45P8j64l1K18j90j14
$$ 161 -3 38 -24 33 -396 -56 -33 -96 -84 158 42 79 -8 -32 193 131 124 -91 54 132 -32 -63 155 -35 -149
7789a49K36j12M33l41o0J02K7j41j16N3K6j43K99m0n2Nj48L66k18N7%k50J81j78
$$ -149 87 -25 408 67 7 109 136 -5 -121 -68 -42 -185 114 74 22 27 -121 245 27 84 84 -166 15 -163
7813a63J43l17K33Q1J45P8k97k2PP1J29J41l32M60n18o1J40N5j5Q6j04J80j24
$$ -163 -20 -337 -104 -23 122 200 -97 -119 -112 -41 88 229 -103 357 -161 -222 -82 -27 -42 44 -60 120 -4
7836dL1P0k29J24k91K17J21k99K94j95J71l0J04j8k66J16J13p1j56L72k38K15
$$ -4 27 97 -132 -8 -299 -82 39 -260 34 -161 10 -20 84 66 -200 -84 29 -42 -198 174 -64 151
7858A51M6l54K02j36JL42l65K26k02j9O9m2J82J91m80L51K7k25k85L15k9J51O
$$ 151 197 -157 45 -91 -90 252 -113 113 -89 -108 -39 -81 101 292 -188 163 190 -35 -320 -5 -34 117 123
7881A23j32O0J07m7k74J77j72J60J85k90L31j94loN2O9k13J2J95q0J1k4J29Qr5
$$ 123 -9 51 158 111 -163 14 -158 2 187 -103 228 34 31 25 77 146 -67 -55 140 60 71 47 176 184 89
7906H9M3k49k7K14j14m6J06k53m1K16j4K1R8J0k19L16j17p9l78N32qj22K2k34
$$ 89 132 -117 -144 70 -44 -90 16 -237 -278 -62 -76 -55 43 53 -166 150 33 -46 -424 108 100 -22 0 -234
7930b34L85j87J27l35M53j92RMj54j2J80M7m93L37L1k41K29j5R6J27n4k81K74
$$ -234 151 -36 91 -244 209 17 26 30 -124 -136 44 91 -402 -65 -34 -275 -46 -61 35 162 108 -173 101
7953A01n6j59K20j56O8n3j44J9J93j68J19J44l3o7L7j17r9J32n7J32j9j9J23J9
$$ 101 45 -114 106 -50 18 -35 -179 -160 33 -135 -16 128 95 28 65 -52 -151 -19 -76 56 37 18 141 160
7977A60j49J87q1j16j69L62j91K23l11R1J19l28L85P1k74KJ53k05p9M02m74K27
$$ 160 11 198 117 1 -168 194 3 226 -85 6 125 -203 182 253 -21 -19 134 -71 -150 252 -222 5
7999EJ38j80O4m6K32l62J65O1O0k97J19J11q6o9K5J92n8J0J09l09L16m2j64j24
$$ 5 143 -37 27 -19 213 -149 16 77 137 -160 -41 70 -16 -85 -60 132 74 84 193 -116 200 158 -6 -130
8023a30n4K53J15j72M9k80N05k45M3O7n0k07j18J70k9j62K47j67j4K52R2L3k16
$$ -130 -184 69 184 12 61 -219 286 41 84 151 101 -106 -224 -54 -83 -245 2 -165 -179 73 165 198 -18
8046a8K77o0p5j14J69j07j13Q2j55K13l9N7j89J42k4k9J72L3k10J18l79K20O1
$$ -18 259 199 124 10 179 72 -41 41 -114 99 60 117 -72 70 46 17 189 222 12 130 -249 -29 32
8069C2nm8R7p8Q7J5o4N5l04P0K47k97K24k08L33j83K65k12j11P1q1M9q3P3l9K02
$$ 32 27 -21 76 -2 85 100 36 91 -213 -143 104 -193 31 -177 156 -27 238 26 -85 -14 -95 -46 -129 -56 -95 107
8095A07j39J95j22m7j64K53k48L38j85j00L51k36j27J01J27m14J68K87j43K6k
$$ 107 -32 163 41 -6 -170 83 -165 173 -12 -112 239 3 -124 -23 104 -310 -142 145 2 28 26
8116B6j22on0L4K00j69J9J95j24j6L22k58R3K5o0l01j99J52JJ74q3Q2J08J74l24
$$ 26 -96 -102 -152 -118 82 -87 -68 127 3 -13 309 51 144 169 109 -192 -391 -239 -238 -64 -147 -65 43 217 -107
8141a07pM6J16p3k60O07l90l6j86J27J87o9P3j09L7M11l15j82O9J13k98l6K04
$$ -107 -114 -68 48 -25 -285 322 -68 -104 -290 -163 24 -45 28 -81 -44 367 52 -130 -61 52 -246 -282 -78
8164g8J62k74R7L5J89j86j63J21J54K30l94J17K06l39n2J50O3J03Mj73n4J05k12
$$ -78 84 -190 -93 -58 131 -55 -218 -97 57 287 -107 10 216 -123 -175 -25 38 141 145 -28 -82 23 -189
8187a89K10j49p3L26
$$ -189 21 -128 -201 125
8191A25
$$ Imaginary data points
##PAGE= N=2
##DATA TABLE= (X++(I..I)), XYDATA
0@%%%%%%%%%%%%%%Pj5J6j6J6j7K5l2L7m5N0n8P0p8Q8j04J20j36J56j78J99k23
$$ 0 0 0 0 0 0 0 0 0 0 0 0 0 0 0 7 -8 8 -8 8 -9 16 -16 21 -24 26 -32 38 -40 48 -56 64 -72 84 -94 105 -118
36a18K51k82L14l53L94m35M83n37N96o57P24p98Q81r72J069j177J297j431J583
$$ -118 133 -149 165 -188 206 -229 254 -283 313 -344 380 -418 463 -509 560 -617 680 -751 832
55H32j752J942k163K421k724L088l534M095m827N824p274R585j3845K4283r7296
$$ 832 -920 1022 -1141 1280 -1444 1644 -1890 2205 -2622 3202 -4072 5513 -8332 15951 -81345
70h1345j44540J89367J84472n176j38463l9628N4219M0366k2361r777j667k5794
$$ -81345 -225885 -36518 147954 142778 4315 -35313 18906 59272 36911 27134 25467 -327
82c27l0936L2597M6577k9031r7659l7304P5168R5080M48n9882j9684L2345J0986
$$ -327 -31263 1334 47911 18880 -78779 -116083 -40915 54165 54613 -5269 -24953 7392 18378
95A8378k3928j6239P153J375m815K1180M0317k433n3316l1901L1949M0209k392
$$ 18378 -5550 -21789 -14636 -13261 -18076 3104 43421 40988 -12328 -44229 -12280 27929 25537
108B5537j8689J898N230j2932p016J4716j204m0616k4838L9164N1612n159l7738
$$ 25537 6848 8746 13976 1044 -5972 8744 7540 -33076 -57914 -18750 32862 27703 -10035
121a0035m538K9970J4153j9167j8327L021K815p237N575K0939J461l1863k7489
$$ -10035 -14573 15397 29550 10383 -7944 -4923 -2108 -9345 -3770 17169 18630 -13233 -40722
134d0722J3070L3815M814k3660l143L0562J9000j6005k2017l609K035n013J996
$$ -40722 -27652 6163 10977 -12683 -15826 14736 33736 17731 -4286 -7895 -5860 -10873 -8877
147h877K1799J7298j4118k4660K76J4329j141j2819j058J2599N828q754q411j947
$$ -8877 12922 30220 16102 -8558 -8282 6047 4906 -7913 -8971 3628 9456 702 -7709 -9656
161i656o625r626O888K1181J1893n278n737O511R553m303j7315p978P358P653
$$ -9656 -16281 -25907 -19019 2162 14055 8777 3040 9551 19104 14801 -2514 -10492 -3134 4519
175D519l562o076L47O526L429k857l191j087o04K277O645K472o189o269j41j060
$$ 4519 957 -5119 -4772 1754 5183 2326 -865 -1952 -2556 -279 6366 8838 2649 -3620 -3761 -4821
191d821o806p593L713J5577J3474J384n494m674j368j46k582n303n97O454P353
$$ -4821 -11627 -19220 -15507 70 13544 14928 9434 4760 3392 3246 664 -4639 -5236 1218 8571
206H571l85r060j0401r01P069M796m18m8M309M360j16o823p451j658L332M091
$$ 8571 8186 -874 -11275 -12176 -5107 -311 -729 -777 3532 7892 7776 953 -6498 -8156 -4824 -733
222g33K834Q26O9K092J397l034n586m408J458O466L501l504l092K526K952j929
$$ -733 2101 2927 2996 5088 6485 3451 -2135 -6543 -5085 1381 4882 1378 -1714 812 3764 1835
238A835o259m971J696N871M463J338j514l128j178K473M19k805j927K471P112
$$ 1835 -4424 -9395 -7699 -1828 2635 3973 2459 -669 -1847 626 1045 -1760 -3687 -1216 5896
253E896O216j820o804n687k416k07J014J289J195K383J732r90k519l225l710l63
$$ 5896 12112 10292 3488 -2199 -4615 -4822 -3808 -2519 -1324 1059 2791 1801 -718 -3943 -7653 -8016
269h016M914N476L762p51l472j922j62p05J54J126M14J109L576J342l220n533
$$ -8016 -3102 2374 6136 5385 1913 -9 -171 -876 -722 404 818 1927 5503 6845 3625 -1908
285a908l734N14L325N62j990R74K578J609l27k272l663n29K812L483K870J205
$$ -1908 -5642 -5128 -1803 -1241 -3231 -2257 321 1930 1603 -669 -4332 -4861 -2049 1434 4304 5509
301E509j087q12j41k935k521j781L80K871K865n09k693j137q71j691O47J730K594
$$ 5509 4422 3610 3469 534 -1987 -3768 -3388 -517 2348 1839 -854 -1991 -2862 -4553 -3906 -2176 418
318D18K355M02m00q2j580k729n12L79R58K047K448J79n62j713j261j342j974j666
$$ 418 2773 3175 2775 2693 1113 -1616 -2128 -1749 -791 1256 3704 3883 3321 1608 347 -995 -2969 -4635
336d635J064K430J522q7n36j631o68P22M51Q03K384K540L88o81j653k402j403
$$ -4635 -3571 -1141 381 294 -242 -1873 -2541 -1819 -1368 -565 1819 4359 4747 4066 2413 11 -1392
353a392j379L38J486J074m32J039R83j158j554p63l96L86R64R15J208O32j312
$$ -1392 -2771 -2433 -947 127 -305 734 1717 559 -995 -1758 -2154 -1768 -804 111 1319 1951 639
370F39n02K65r04m39J414J518M70O53r55j696j976j690m25J581J078M12J080L33
$$ 639 137 402 -502 -941 473 1991 2461 3114 2159 463 -1513 -3203 -3628 -2047 -969 -557 523 856
388H56j040m40q12j403J139K234Q83P21L89M65J3j347j685k51J5j53L52J658p27
$$ 856 -184 -624 -1436 -2839 -1700 534 1417 2138 2527 2992 3005 1658 -27 -278 -263 -416 -64 1594 867
407H67j939p83r47j177k44J007K169K368J034n89J8j499j664Q02N73L10J184P75
$$ 867 -1072 -1855 -2802 -3979 -4223 -3216 -1047 1321 2355 1766 1784 285 -1379 -577 -4 306 1490 2265
425B265K63n84l53j281j25J20n3K66L00r93p5r04k577j161J031Q94L87J042J881
$$ 2265 2528 1944 1591 310 185 305 252 518 818 -175 -250 -1154 -3731 -4892 -3861 -2967 -2580 -1538 343
444C43K475R04j104j781K11P2O88J057k16j326l11J55j525j994j140J76J667J980
$$ 343 2818 3722 2618 837 1048 1120 1808 2865 2649 1323 1012 1167 -358 -2352 -3492 -3316 -1649 331
462C31N67j121j484j090J836J572j757j910J020L040K057k41j124j056N31N18
$$ 331 898 -223 -1707 -2797 -961 611 -1146 -3056 -2036 1004 3061 2820 1696 640 1171 1689
478A689J54o06j505p08J375P43j090j273j388p68K084K091M55r47l75Q14L84j384
$$ 1689 1843 1237 -268 -976 399 1142 52 -1221 -2609 -3377 -1293 798 1253 306 -69 745 1129 -255
496b55j613J084Q91p58l27J883L66q03p54J82M38O15l2J70q20j59m1L32q49j759
$$ -255 -1868 -784 107 -651 -978 905 1271 468 -286 -104 334 949 917 1087 267 108 67 399 -450 -2209
516b209m54L1J560L725J156j937j514J032J819n03l853k097J503K417J0k100j621
$$ -2209 -2663 -2632 -1072 2653 3809 1872 358 1390 3209 2706 -1147 -3244 -1741 676 686 -1414 -3035
533c035j281J172J491J154K29R33l4J116J837M85k171l044q28L572K266k449l874
$$ -3035 -4316 -3144 -1653 -499 -270 663 629 1745 3582 4067 1896 -1148 -1976 1596 3862 1413 -2461
550b461R45L350J05k674j810M93J626M65L41P54m51k527j843R92J533M94j518
$$ -2461 -1516 1834 1939 -735 -2545 -2052 -426 39 380 1134 683 -1844 -3687 -2695 -1162 -668 -2186
567b186k44L404L316j829k882M59L268O85k174j666K038J581j780k994o81k72
$$ -2186 -2430 974 4290 2461 -421 38 3306 3991 1817 151 2189 3770 1990 -1004 -1685 -1957
583a957p75r2M81P21O42m49q8J192K85r17o51J113J993R91m85r35J217J328k023
$$ -1957 -2732 -2824 -2343 -1622 -980 -1429 -1517 -325 -40 -957 -1608 -495 1498 2489 2004 1069 2286 3614 1591
602A591k483K45J616J178j790j812K4R38j17j123j025o01J133K033O70m81K96
$$ 1591 -892 -647 969 2147 357 -1455 -1431 -493 -610 -1733 -2758 -3359 -2226 -193 477 -4 292
619B92N43l74M21K64q99k40J772K108J64l648k975J792K146n36k403n76J094J508
$$ 292 835 461 882 1146 247 7 1779 3887 4051 403 -2572 -780 1366 830 -1573 -2149 -1055 453
637D53l44k498j159J302J536Q39J09k71M45J098K69R87k76j568j250J742J800
$$ 453 109 -2389 -3548 -2246 -710 129 238 -33 412 1510 1779 2766 2490 922 -328 1414 3214
654C214j022l329j001J697Q29j950k590O48J545Q13Q07J537O11k8j129j171O83
$$ 3214 2192 -1137 -2138 -441 388 -1562 -4152 -3504 -1959 -1146 -339 1198 1809 1781 652 -519 164
671A64J336L13q31m74K49l48q68j565p0Q36L03K87J748L60j595j195J76K78N40
$$ 164 1500 1813 982 508 757 409 -459 -2024 -2094 -1258 -955 -668 1080 1440 -155 -1350 -1174 -896 -356
690c56k7K26J078J288J35j037q97o26L28J184k55k20q02j253p48N20L39m71n54
$$ -356 -383 -157 921 2209 2344 1307 410 -216 112 1296 1041 821 19 -1234 -1982 -1462 -1123 -1594 -2148
709b148l24J206J531M72m11mL2L26J146K82o96n57P78Q99O47q94k421j557k62
$$ -2148 -2472 -1266 265 737 326 322 354 680 1826 2108 1412 855 1633 2532 3179 2285 -136 -1693 -1955
728a955N04P89n42q04L84J171m75j495l88N61J695K027J004j34o43j224o04K59
$$ -1955 -1451 -662 -1204 -2008 -1624 -453 -928 -2423 -2811 -2250 -555 1472 2476 2342 1699 475 -129 130
746A30N04P39R67l77j011m70l35m78m29j72m83J18O83N42o17r97k61J259J722
$$ 130 634 1373 2340 1963 952 482 147 -331 -760 -932 -1415 -1297 -614 -72 -689 -1686 -1947 -688 1034
765A034l31j156j065R66J678R87q25j351k41M87N72j03j153L99N81M67K4p78j368
$$ 1034 703 -453 -1518 -552 1126 2113 1288 -63 -304 183 755 652 -501 -102 479 946 970 192 -1176
784a176j208N38J304R04L5j29l97K8J35j53O8M20K02M18O92m11r60j335o89P20
$$ -1176 -2384 -1846 -542 362 397 268 -129 -101 34 -119 -51 369 571 989 1681 1270 310 -1025 -1714 -994
804i94Q52N04k98m54l72M84L91n61l16o16R00R39J305m05j403j22J243j7J96r91
$$ -994 -142 362 64 -390 -762 -278 113 -448 -764 -1380 -480 459 1764 1359 -44 -166 1077 1060 1256 265
824B65m28L16M27j2k99n15o16k85J02Qj38J17L82Q95M51k73m68m43J43P41Q92
$$ 265 -163 153 580 568 269 -246 -862 -1147 -1045 -1037 -1175 -1058 -676 219 670 397 -71 -514 -371 370 1262
845A262K95J59N9j401m81K02j68m71K89K23R8k32q36n03l05L27O45J404J10n24
$$ 1262 1557 1716 1775 374 -107 95 -73 -544 -255 -32 66 -166 -1002 -1505 -1810 -1483 -838 566 676 152
865A52j21L96j10K65K17k21K38M29l77n50l97j23k32j75k62l21N95j21j26N20
$$ 152 31 427 317 582 799 578 816 1245 868 318 -79 -202 -434 -609 -871 -1192 -597 -718 -844 -324
885c24K18m37K94J75j72L97N46L95J15qn69m7R0p13n4K91m89J07J94l04p02j27
$$ -324 -106 -543 -249 -74 -246 151 697 1092 1207 1199 630 583 673 -40 -94 197 -292 -185 9 -295 -997 -1124
907a124k80K21P99k5K61P81j64j6K41j86k76M84j33K25J94q8q25l06l21m37M34
$$ -1124 -1404 -1183 -384 -409 -148 633 469 453 694 508 232 716 583 808 1002 914 89 -217 -538 -975 -541
928e41L09k63J47Lk25K43Pj46j0M11M92J52K08l11J86J40l90k02L27o05k00J65
$$ -541 -232 -495 -348 -345 -570 -327 -320 -466 -476 -65 427 579 787 476 662 802 412 210 537 -68 -268 -103
950a03k1L42j26m06p85O12j38Q0J24L17N4j17K49l33K20nN1K86N85o8K4n82j5
$$ -103 -124 218 92 -314 -1099 -487 -625 -545 -421 -104 -50 -167 82 -251 -31 -36 15 301 886 818 842 260 245
973B45j25L54m25l24K81k42k85M71k53l89j94K2M57J96J86k79N09j26k39J63k35
$$ 245 120 474 49 -275 6 -236 -521 -50 -303 -692 -886 -864 -407 -211 -25 -304 205 79 -160 3 -232
994b32L08K72K86L96k16K34j039K14j69M23k06k64j50m2O4k45k64r9L04n5R4O56
$$ -232 76 348 634 1030 814 1048 9 223 54 477 271 7 -143 -185 -121 -366 -630 -729 -425 -480 -386 270
1016B70n91Q7K70J35K83K08k19j61M2R3N81n40q82J91K21l8l93l21K15Q3L40j03
$$ 270 -321 -234 36 171 454 662 443 282 324 417 998 458 -424 -233 -12 -50 -443 -764 -549 -466 -126 -229
1038b29j06J00J35K02M35P1J58pj94j07P7k20o56r1K80j91j74m78j25N11j17l30
$$ -229 -335 -235 -100 102 537 608 766 759 565 458 535 315 -341 -432 -152 -343 -517 -995 -1120 -609 -726 -1056
1060a056M38M34Q1M17O4L2L93L10j93r9L32j51q8o00k27K26k84r14J62M35l83
$$ -1056 -618 -184 -103 314 378 410 803 1113 920 821 1153 1002 914 314 87 313 29 -885 -723 -288 -671
1081f71m70lL11m5L1RL13P24N1n4M58K31R1K85n1j44K48m87q46k20L91k40n43
$$ -671 -1141 -1144 -833 -878 -847 -838 -525 199 250 196 654 885 976 1261 1210 1066 1314 827 -19 -239 152 -88 -631
1104f31k19N7M41j153p6L84J197r0m30J78L28K27N96j77K91K64j25n78k6J53k81
$$ -631 -850 -793 -352 -1505 -1581 -1197 0 -90 -520 -342 -14 213 809 632 923 1187 1062 484 458 611 330
1125C30n24k43kO44j82j312l7J029K15k86k24K30Q56r0k51L07L47j57N2Ok24J78
$$ 330 -194 -437 -439 205 23 -1289 -1326 -297 -82 -368 -592 -362 494 404 153 460 807 650 702 708 484 662
1147F62k98o32j14M29q3r06l4L65M02Q8o23L24O00j76m93P72O82l41j26k79J30
$$ 662 364 -268 -382 47 -36 -942 -976 -611 -209 -121 -744 -420 180 4 -489 283 965 624 498 219 349
1168C49K29M2k74l28K29k03J11l99p5Oj71l13L84j6O9j16M24L88j26k43m62P73
$$ 349 578 620 346 18 247 44 155 -244 -319 -313 -484 -797 -413 -429 -360 -476 -52 336 210 -33 -495 278
1190B78N65j15n42J79K35m36K89l50l19k01j7J13m6L32l27k64J05n3L80R0j94
$$ 278 843 728 186 365 600 164 453 103 -216 -417 -434 -321 -367 -35 -362 -626 -521 -574 -194 -104 -298
1211b98K84O89m58l50P32K37j42k90n7O2J08o8n91p3K9k93J36m82r9P65L89n61
$$ -298 -14 675 217 -133 599 836 694 404 347 409 517 449 -142 -215 -186 -479 -343 -825 -924 -159 230 -331
1233c31k89M29N1j99L95K72L63j94q2K01J02l63J71o28L20l91O29n51l9l04q8
$$ -331 -620 -191 -140 -339 56 328 691 497 415 616 718 355 526 -102 218 -173 456 -95 -134 -438 -526
1254e26k75k91L88K82J97m31M71K78k4J54j10L30Ql00K77J75K93l13n12j80n4
$$ -526 -801 -1092 -704 -422 -225 -656 -185 93 69 223 113 443 451 151 428 603 896 583 71 -109 -163
1275a63j04J51n4m99J44M1j25R4K19Q6J01r1L08L12Jk47K19M33l32p50L67M39
$$ -163 -267 -116 -170 -669 -525 -484 -609 -515 -296 -210 -109 -200 108 420 421 174 393 826 494 -256 111 550
1297E50k44r7p6k69l37j13J46q9L11l15J70K07q2J56K51k69M9M86J13r7j8J94
$$ 550 306 209 133 -136 -473 -586 -440 -529 -218 -533 -363 -156 -238 -82 169 -100 -51 435 548 451 433 627
1319F27j91P3m16J7j10k90L1J91r3l96L9J53k35M10op4K3K73J06N38q1l36j3M
$$ 627 436 509 93 110 0 -290 -259 -68 -161 -557 -518 -365 -600 -190 -196 -270 -247 26 132 670 589 253 240 244
1343B44K22l38O08l61m73J80k33J81o38J49l08N14l41l0M40o02M26K38K55R8J92
$$ 244 466 128 736 375 -98 82 -151 30 -608 -459 -767 -253 -594 -624 -184 -786 -360 -122 133 231 423
1364D23R6j62K97j00k77l5r0q1N2m8j28o5j34l93j39M00n56K72L22L12N0m8q7
$$ 423 519 357 654 554 277 242 152 71 123 75 -53 -118 -252 -645 -784 -384 -940 -668 -346 -34 16 -32 -119
1387a19j59M28n2L00K1L99m89lK02l17j48r1n14J68ON7j39K7p8K49O1l20N62R8
$$ -119 -278 150 98 398 419 818 329 326 528 211 63 -28 -542 -374 -368 -311 -450 -423 -501 -252 -191 -511 51 149
1411A49k54M58N22j59M6l97n4j22nK53J9q5o45j07J89k93m28k1N37K80J37l11
$$ 149 -105 353 875 716 762 365 311 189 184 437 456 371 -274 -381 -192 -485 -913 -934 -397 -117 20 -291
1433b91j36J25L36j54N03l0j21J95M13j0k45p6n69Q2K59o09j31M8K7r8O3K08l74
$$ -291 -427 -302 34 -120 383 353 232 427 840 830 585 509 -60 22 281 -328 -459 -411 -384 -482 -419 -211 -585
1456e85K25l51O12L84J23k07K08L08l54p4l8l4J33M4j87r0o1k45l5m85J83j29
$$ -585 -360 -711 -99 285 408 201 409 717 363 289 251 217 350 394 207 117 56 -189 -224 -709 -526 -655
1478f55K27k30M30N5m2j36J16L78r5K58LM56k9k47n68M23j21k03J13m77j17K17
$$ -655 -428 -658 -228 -173 -215 -351 -235 143 48 306 309 765 736 489 -79 344 223 20 133 -344 -461 -244
1500b44l0N4l45K33j26J00j6J71K31K74k6k12J84k42K68r5J74k34L14J38m54J40
$$ -244 -274 -220 -565 -332 -458 -358 -374 -203 28 302 276 64 248 6 274 179 353 119 433 571 117 257
1522B57l68j34j14n8R2J94K0m20L72n17K82J80K45K01K93L1j74K64l82q0l7q5
$$ 257 -111 -245 -359 -417 -325 -131 -111 -531 -159 -676 -394 -214 31 232 525 556 382 646 264 184 147 62
1544F2j44J76j53n0m86K88k25J72K44j57o8M67J08k09M53k56r1k07M04N5k33n9
$$ 62 -82 94 -59 -109 -595 -307 -532 -360 -116 -273 -341 126 234 25 478 222 131 -76 328 383 150 91
1566I1K37K13j52k35k68K12l44J30J84J6k07j94j59M8L61k85q2J95L57lL16j96
$$ 91 328 541 389 154 -114 98 -246 -116 68 84 -123 -317 -476 -428 -67 -352 -434 -239 118 115 431 235
1588B35k21M20l08j48N63l3p1j3j83l92J30l19p2r4J44M1l8p7J62J34P4j05lN09
$$ 235 14 434 126 -22 541 508 437 424 241 -151 -21 -340 -412 -506 -362 -321 -359 -436 -274 -140 -66 -171 -174 335
1612C35J79j40K71k07j78O6n17L03j14j13r8M4J09k43J04J19m33M46o4j43J06
$$ 335 514 374 645 438 260 326 -191 112 -2 -115 -213 -169 -60 -303 -199 -80 -513 -67 -131 -274 -168
1633a68K39o3pj96J24J72J80l06M88K65k42q4k3k95k67L4L77m35m0J67k74n7m22
$$ -168 71 8 1 -195 -71 101 281 -25 463 728 486 402 379 84 -183 -149 228 -207 -247 -80 -354 -411 -833
1656h33K58Q0qL16O85J14j79rl1K45j84l92J73J68M7m87j79J18m90j48J80j7J35
$$ -833 -575 -495 -503 -187 498 612 433 424 393 638 454 62 235 403 450 -37 -216 -98 -588 -736 -556 -573 -438
1679d38K43J70k4J68K34j32j19P2L00j46J03j87L44m79k85K23n2j30k55J70J72
$$ -438 -195 -25 -49 119 353 221 102 174 474 328 431 244 588 109 -176 47 -5 -135 -390 -220 -48
1700d8k60J97l05n2j05n7J40J13J74N28K10j52KrJ88l09j02P8K47l04j9l05o8
$$ -48 -308 -111 -416 -468 -573 -630 -490 -377 -203 325 535 383 385 376 564 255 153 231 478 174 155 -150 -218
1723b18j77l60L87k69K57J24l1j85M81M8j42Q1M56J4N8k06R2j00j37j14K8j06
$$ -218 -395 -755 -368 -637 -380 -256 -287 -472 9 57 -85 -4 452 466 524 318 410 310 173 59 87 -19
1745a9j96K2%n5j62N6l1O3L09l34K89J86j85j4M81j18j38J25R8L2k78J27OJ60
$$ -19 -215 -193 -193 -248 -410 -354 -385 -322 -13 -347 -58 128 -57 -71 410 292 154 279 377 409 131 258 264 424
1769D24m73l03K77j84l20J49K29M6j08K30o20O7M15K89j0R7J66o3R4j73J07K6
$$ 424 -49 -352 -75 -259 -579 -430 -201 -155 -263 -33 -653 -586 -171 118 108 205 371 308 402 229 336 362
1791C62j86j11N07j25l20l07J73j91k90J16R3J09k39L65j77K19K2P6Qp6J43K68
$$ 362 176 65 572 447 127 -180 -7 -198 -488 -372 -279 -170 -409 -44 -221 -2 20 96 104 28 171 439
1813D39j16j17O3O4ml07l50P6L24r0k36J59j51l4k23J90j5M4Q1O28k20J97p9l0
$$ 439 323 206 269 333 329 22 -328 -252 72 -18 -254 -95 -246 -280 -503 -313 -328 -284 -203 425 205 402 323 293
1837B93J19k96J62M20n57RK64k87k84r0O2l60K95RK4K7j29J23q2j48J05N62l83
$$ 293 412 116 278 698 141 150 414 127 -157 -247 -185 -545 -250 -241 -217 -190 -319 -196 -278 -426 -321 241 -142
1860a42L24J67l8j13m5o2P4j91J72l34R1J21k42J79m52j53O26j99p8J35K23L00
$$ -142 182 349 311 198 153 91 165 -26 146 -188 -97 24 -218 -39 -491 -644 -18 -217 -295 -160 63 363
1882C63j37K42j72L7J7j47J09O4j76K50k34j44j77r5j58Q4l7K35k37J38q6J1N
$$ 363 226 468 296 333 350 203 312 376 200 450 216 72 -105 -200 -358 -274 -311 -76 -313 -175 -261 -250 -245
1905b45p5J70M16J51k52J26Q9k37K68k23m2J19o6l6o7j62j68j53J36PPj13L04
$$ -245 -320 -150 266 417 165 291 380 143 411 188 146 265 199 163 96 -66 -234 -387 -251 -244 -237 -350 -46
1928d6n4J28M0j65K3J06oL74j55L4J68p6j23j22j94K02k85PJ38l90K39k83L9l4
$$ -46 -100 28 68 -97 -74 32 26 400 245 279 447 371 248 126 -68 134 -151 -144 -6 -396 -157 -440 -401 -435
1952d35J05r1J73K98J3L52l18L6oPK57k85J81k8Q7k46q7n9p8l18L75l98J21j1
$$ -435 -330 -421 -248 50 63 415 97 133 127 134 391 106 287 259 346 100 13 -46 -124 -442 -67 -465 -344 -355
1976c55K39j39K8L5j05K60K81K5J58J14m70K86j07j12J99j20l4l17J50j98j9j28
$$ -355 -116 -255 -227 -192 -297 -37 244 269 427 541 71 357 250 138 337 217 183 -134 16 -182 -201 -329
1998c29p2K9L09k50n0L24J35O0M0M9o6NP1k7r1K40j77o4J96l26n6Kk00L9Q8N2
$$ -329 -401 -372 -63 -313 -363 -39 96 156 196 245 179 184 255 228 137 377 200 136 332 6 -50 -48 -248 -209 -121 -69
2024f9K8l76K28K0Q7L1mJ16Q2L5j88N37k82J30k1k1o0j72pj87J6k77j8k93L43
$$ -69 -41 -417 -189 -169 -82 -51 -55 61 143 178 -10 527 245 375 354 333 273 101 94 -93 -77 -354 -372 -665 -322
2049c22r6K12o8J87q8jJ15J47n2J72k0K01j24K12l3k61k34k10K37J11j82L8m3
$$ -322 -418 -206 -274 -87 -175 -176 -61 86 34 206 186 387 263 475 442 181 -53 -263 -26 85 -97 -59 -102
2072a02m7r5j44J42J13j12L7J29n1M53j74K29j70j57K74j65o1j13k41K75n1j66
$$ -102 -149 -244 -388 -246 -133 -245 -208 -79 -130 323 149 378 208 51 325 160 99 -14 -255 20 -31 -197
2094a97K51l07Q4m07L23J1J97q0j27J7K12K1j34J04K70M1j19K33l01M8L8L1Qk18
$$ -197 54 -253 -169 -576 -253 -242 -45 -125 -252 -235 -23 -2 -136 -32 238 279 160 393 92 140 178 209 217 -1
2118ar1j53Oj92q1ql8Q2O4L29J1L07j70J18r0L30j09j86Q3M6k24p6Pj66L46k78
$$ -1 -92 -245 -239 -431 -512 -520 -558 -476 -412 -83 -72 235 65 183 93 423 314 128 211 257 33 -43 -36 -202 144 -134
2144a34l50N71j54r7K19k86L59q1J22l20l2K51Q0k03p5L17j29K0q2K33J08j69
$$ -134 -484 87 -67 -164 55 -231 128 47 169 -151 -183 68 148 -55 -130 187 58 78 -4 229 337 168
2166A68ok03L1N6m33J44j88J10K48m59K68J45L1K5J52L8j59J18L70J6l82K75j90
$$ 168 162 -41 -10 46 -387 -243 -431 -321 -73 -532 -264 -119 -88 -63 89 127 -32 86 456 472 90 365 175
2189A75Pl85l7R5Ql47J48J25q3L0M7N0O5k4J47K16k47Q1L23P0j18j46Q3j58q4
$$ 175 182 -203 -240 -145 -137 -484 -336 -211 -294 -264 -217 -167 -102 -126 21 237 -10 71 394 464 346 200 283 125 41
2214D1j8q7j52M76n35L49j07l67K53J1Q4k50L27l3j00p9r5J73R5O8m3J11J99k28
$$ 41 23 -64 -216 260 -275 74 -33 -400 -147 -136 -52 -302 25 -8 -108 -187 -282 -109 -14 54 11 122 321 93
2238I3K70l76N8j61K10j82k57L33k79pO4L12j24j33j03L73J57k72J40J73K29k10
$$ 93 363 -13 45 -116 94 -88 -345 -12 -291 -298 -234 78 -46 -179 -282 91 248 -24 116 289 518 308
2260C08P8j34O2l79P7n1k17N7m3m4J9P5n6NJ05k60L57n3j37O0L13J30l6j21J40
$$ 308 386 252 314 -65 12 -39 -256 -199 -242 -286 -267 -192 -248 -243 -138 -398 -41 -94 -231 -171 142 272 236 115 255
2285B55j84K51k78L46l75J9J34k66l09K89K7q2l75J78Q2L18k14l5K12L01k17J94
$$ 255 71 322 44 390 15 34 168 -98 -407 -118 -91 -173 -548 -370 -288 30 -184 -219 -7 294 77 271
2307B71Qj38j19qR1j95M78l26k15k6L2nJ3k5l46L65K1j67Q3K36l7J02k19K17J30
$$ 271 279 141 22 14 105 -90 388 62 -153 -179 -147 -152 -139 -164 -510 -145 -124 -291 -208 28 -9 93 -126 91 221
2332B21n0o1L72k93j69k45N33m47m3k5J38k80K28p7j47j00J73J93J9l31N68J37
$$ 221 171 110 482 189 20 -225 308 -139 -182 -207 -69 -349 -121 -198 -345 -445 -272 -79 -60 -391 177 314
2354C14k32l23O81k16L2n0P0m2j11j81j13q0P3L6N0Pk08J54j62J45q6P2%J35M4
$$ 314 82 -241 440 224 256 206 276 234 123 -58 -171 -251 -178 -142 -92 -85 -293 -139 -301 -156 -242 -170 -170 -35 9
2379IO4n7L63l63M59k76o4j3R5l17Q6nk7J6O5k01Q7l5n1j59J81L40k93K26l9k85
$$ 9 73 16 379 16 475 199 135 122 217 -100 -14 -19 -46 -30 35 -166 -79 -114 -165 -324 -143 197 -96 130 91 -194
2405a94J77L4K70Q5k63j5K39j83k12O5q6k10K40m0k51J16o9J83k48N3J88n2J07
$$ -194 -17 17 287 372 109 94 333 150 -62 3 -83 -293 -53 -93 -344 -228 -297 -114 -362 -309 -121 -173 -66
2428f6J70j26J52K6L59j80q6l9o4Q6k33L5J42m45j6J36j17M7O4k37L36J0k25P4
$$ -66 104 -22 130 156 515 335 249 210 146 232 -1 34 176 -269 -285 -149 -266 -219 -155 -392 -56 -46 -271 -197
2452a97L05k83J96K43K0o1%r9J73l45J78k0j77k9j44M6j36J98K8j54NL02l47N1
$$ -197 108 -175 21 264 284 223 223 124 297 -48 130 110 -67 -96 -240 -194 -330 -132 -104 -258 -253 49 -298 -247
2476b47K6J60J91p7J37L4J49N6k68o7L6n20K62K57k88k50K45J03k12J23J23o9
$$ -247 -221 -61 130 53 190 224 373 429 161 94 130 -390 -128 129 -159 -409 -164 -61 -273 -150 -27 -96
2498i6n4L23l40L21k48J34r6K45j59L92j99r6L7k46N8Q8K8j60Q6k93J23j18Q1
$$ -96 -150 173 -167 154 -94 40 -56 189 30 422 223 127 164 -82 -24 64 92 -68 18 -275 -152 -270 -189
2521a89jJ0J00j63O4J57l76O29m6L8m14N83k06k34K01po7mq9j13j00j24r4M70
$$ -189 -190 -180 -80 -243 -179 -22 -398 231 185 223 -191 392 186 -48 153 146 79 75 -14 -127 -227 -351 -445 25
2545B5k11M1Q7k08K26J30J70l27K72k1j35J46O5n7j35L53k85J1j1n8j37l21J99
$$ 25 -186 -145 -58 -266 -40 90 260 -67 205 184 49 195 260 203 68 421 136 147 136 78 -59 -380 -181
2568a81j53J95j01Q0K57m31J36K9L97r2J65Mk03K39k16J37k29K61l63J31J42l00
$$ -181 -334 -139 -240 -160 97 -334 -198 -169 228 136 301 305 102 341 125 262 33 294 -69 62 204 -96
2590i6K12n7l00P3M8L4O1j64K91j1j0R4j09L47k86J6j8R3l6J01l13J05J4r6m8
$$ -96 116 59 -241 -168 -120 -86 -25 -189 102 91 81 175 66 413 127 143 125 218 182 283 -30 75 89 -7 -55
2615e5K93j65k53J13k24L3j24J70P6j29L95Q2k53J40j70L27p3o5o7K7L9j05J60
$$ -55 238 73 -180 -67 -291 -258 -382 -212 -136 -265 130 212 -41 99 -71 256 183 118 51 78 117 12 172
2638A72j1l51K35n39M43j17J07l82K2O13M3m06J92k45J23K32r8J39J52k6j72j10
$$ 172 161 -190 45 -494 -51 -168 -61 -443 -421 192 235 -171 21 -224 -101 131 33 172 324 298 126 16
2660A6r6k1K20j33N5Jj70J99m05L20j73j1K63j35j3K74k52J29j07K63q3j64L6
$$ 16 -80 -101 119 -14 41 42 -128 71 -334 -14 -187 -198 65 -70 -83 191 -61 68 -39 224 141 -23 13
2683A3K57N3l04K00j50j78K78J61n84Q3j23k18N7K36jq5K02J45N4kM32l20o5J78
$$ 13 270 323 19 219 69 -109 169 330 -254 -171 -294 -512 -455 -219 -220 -305 -103 42 96 94 526 206 141 319
2707C19j14j13l8j1Q9j55l5q0q8P4k80L70Nl77L76O4J41r1LJ43o6j55J76J27O6
$$ 319 205 92 54 43 132 -23 -58 -138 -226 -152 -432 -62 -57 -434 -58 6 147 56 59 202 136 -19 157 284 350
2732C50k42m0Jo6o6P3K1pm6j83J8K77k94o7q5K55j4rK69J1m7n27L62J33K00R0
$$ 350 108 68 69 3 -63 10 31 24 -22 -205 -187 90 -204 -271 -356 -101 -115 -124 145 156 109 -418 -56 77 277 367
2758C67k81K10j64j65k0q2j12J44j47J88l12M78j42p0qp2P2K86l41L25M2O1Mk8
$$ 367 86 296 132 -33 -53 -135 -247 -103 -250 -62 -374 104 -38 -108 -116 -188 -116 170 -171 154 196 257 261 233
2782B33j33M85p33J96q3l36L35Q6p9o9K90n58L93j44k14J17K64O3m2j37K43j42
$$ 233 100 585 -148 48 -35 -371 -36 50 -29 -98 192 -366 27 -117 -331 -214 50 113 71 -66 177 35
2804C5K50p3M1k61Q6J98j45j21J2M9j25K84k66J01l85K00R9k2oj00Q0m5O8L57
$$ 35 285 212 253 -8 78 276 131 10 22 71 -54 230 -36 65 -320 -120 -21 -43 -49 -149 -69 -114 -46 311
2828C11k00J80j19J08p4l1K20k60j64J45l1l56L22m62K15j17P1j3J03J94j38o6
$$ 311 111 291 172 280 206 175 395 135 -29 116 85 -271 51 -411 -196 -313 -242 -255 -152 42 -96 -162
2850a62K34J5J46k20j34J23N1J33N5j59M4j95K52k03n4n6J49j15k16J52J20K6
$$ -162 72 87 233 13 -121 2 53 186 241 82 126 -69 183 -20 -74 -130 19 -96 -312 -160 -40 -14
2872a4j31K99k63J34k1K08K27j36k51l7R5j36N9J4j53r8q9J69k8M7j77M03l07
$$ -14 -145 154 -109 25 4 212 439 303 52 15 110 -26 33 47 -106 -204 -293 -124 -152 -105 -282 121 -186
2895a86J08k4j11M1K89r3K35m5j55o8J05q9r7J33M2k57Q5p2K88k21k13K31Q2p6
$$ -186 -78 -102 -213 -172 117 24 259 214 59 -9 96 7 -90 43 85 -172 -87 -159 129 -92 -305 -74 8 -68
2919f8J42p8o1J12M6L3k60R9k8K60j17O1j68J18J78r5k69j43K59n5j31n0n6L14
$$ -68 74 -4 -65 47 93 126 -134 -35 -63 197 80 141 -27 91 269 174 -95 -238 21 -34 -165 -215 -271 43
2943D3j59j4l49L82J61l0J50K3P6l03J45jJ82q3l31L16j83j60J6J3p2N5J14k19
$$ 43 -116 -130 -479 -97 64 34 184 207 283 -20 125 124 306 223 -108 208 25 -135 -119 -106 -178 -123 -9 -228
2967b28l2P8J2K85j02K61m8l19M99l86J51M4O4k15N9k22J61J16l19M5n3K15j01
$$ -228 -260 -182 -170 115 13 274 226 -93 406 20 171 215 279 64 123 -99 62 178 -141 -96 -149 66 -35
2990c5q9Q3O7j53K4K3n1J64J32m6J79m91K64J13o4P5N2Pk50j05J47r0J46k12L27
$$ -35 -124 -41 26 -127 -103 -80 -131 33 165 119 298 -193 71 184 120 195 247 254 4 -101 46 -44 102 -110 217
3015B17m52J3M13k60l4q1L13j02l31N41j14k2Jk70N85m02k7j16mr0J37j59K91
$$ 217 -235 -222 191 -69 -103 -184 129 27 -304 237 123 101 102 -168 417 15 -12 -128 -132 -222 -85 -244 47
3038D7l10Pl7K14q8J58j22K23j24Qj40K64pK14k41k9J21k40J50Q1j03R6r9r9k0
$$ 47 -263 -256 -293 -79 -167 -9 -131 92 -32 -24 -164 100 93 307 66 37 158 -82 68 149 46 142 43 -56 -76
3063g6j63J00j20J8Q7kJ23J39Q6j86K25Q3k96O8N6q7J5j91j69L4M5P4K1K86m26
$$ -76 -239 -139 -259 -241 -154 -156 -33 106 192 6 231 314 18 86 142 55 70 -121 -290 -256 -211 -137 -116 170 -256
3088b56K63j8m37L79j0J43j66M1j93K59K57l07L94k03K6R1j63J18l69K24L6l13
$$ -256 7 -11 -448 -69 -79 64 -102 -61 -254 5 262 -45 349 146 172 263 100 218 -151 73 109 -204
3110b04J77k15J41J13j32J0j70J59p4mK59m02M14mo3J71J28j60p3j17L55q0l4
$$ -204 -27 -242 -101 12 -120 -110 -280 -121 -195 -199 60 -342 72 68 5 176 304 144 71 -46 309 229 195
3133A95J86l54k19K55q4j01N9j24j27K26K95j41k81L09j2l6p8L77l12j05K94j16
$$ 195 381 27 -192 63 -21 -122 -63 -187 -314 -88 207 66 -215 94 82 46 -32 345 33 -72 222 106
3155A06j42J92K0k05j06m6k3n9M01n39J65K36j38l0pK34J03l62M06k4j48j44K08
$$ 106 -36 156 176 -29 -135 -181 -204 -263 138 -401 -236 0 -138 -168 -175 59 162 -200 206 182 34 -110 98
3178I8l8m2L47m80K01k67J96k8n6m8j63J49J08k49K67K44j81k33J24kK59l47J14
$$ 98 60 18 365 -115 86 -181 15 -13 -69 -117 -280 -131 -23 -272 -5 239 58 -175 -51 -53 206 -141 -27
3201b7l2M05j04k13J81j3l19M65l73j90M16l50k7J23N8M9j57J74k95J77J19j18
$$ -27 -59 346 242 29 210 197 -122 343 -30 -220 196 -154 -181 -58 0 49 -108 66 -229 -52 67 -51
3223e1J33Q0k67K19P4j61l8l3Q7r2R6L4l69K18j62J09J01m2J36l4q0M7J9L54m19
$$ -51 82 162 -105 114 188 27 -11 -44 43 -49 47 81 -288 -70 -232 -123 -22 -64 72 38 -42 5 24 378 -41
3248d1L1L38j72O4k22j73J81L1K8l9j31m1K28j49K8k61k30N70L5l21J80O2R2m8
$$ -41 -10 328 156 220 -2 -175 6 37 65 26 -105 -146 82 -67 -39 -300 -530 40 75 -246 -66 -4 88 40
3272D0r1M11r1k43J30j24P7lj88n2J35L6O5j66j60L5r3J08J70k32R0M76m73K35
$$ 40 -51 360 269 26 156 32 109 106 -82 -134 1 37 102 -64 -224 -189 -282 -174 -4 -236 -146 330 -143 92
3296I2j22K8J4M17j82J09k99PO2n8k18K35nj70j64L7j48J35j0Q8K79l18K53k25
$$ 92 -30 -2 12 429 247 356 57 64 126 68 -150 85 80 -90 -254 -217 -365 -230 -240 -152 127 -191 62 -163
3320a63k1R4L82j70R5q2Mj89L15k11K5l64K95N0N6K4k29R6k99J97NM37k31J48
$$ -163 -184 -90 292 122 217 135 139 -50 265 54 79 -285 10 60 116 140 -89 7 -292 -95 -90 347 116 264
3344B64n97N38J78n88p7K82M94l16q8Q3o3K37k31j19j64J04O5k18m8J25K62l31
$$ 264 -333 205 383 -205 -282 0 494 178 90 173 110 347 116 -3 -167 -63 2 -216 -264 -139 123 -208
3366b08J88m1k27M59k9J89l46M18k83j00J02k28K65m4l4j84L97k68j61J0P6J07
$$ -208 -20 -61 -288 171 142 331 -15 403 120 20 122 -106 159 115 81 -103 294 26 -135 -125 -49 58
3388E8k2l13L02j50L10j40j36j09K23KQ6j1nK0j7J33k37O6Kp8Kj08K46l03J00
$$ 58 36 -277 25 -125 185 45 -91 -200 23 25 111 100 95 115 98 231 -6 60 62 -16 -14 -122 124 -179 -79
3413g9j11R1L12k75m8k51M99j39J31j02o9K65j40o1j09J78l90J32J60j17J15p0
$$ -79 -190 -99 213 -62 -110 -361 138 -1 130 28 -41 224 84 23 -86 92 -298 -166 -6 -123 -8 -78
3435g8M5J53m77L86q1lj03J16N7j38L40r3j5j93K12J14l4l03K11J4j46j02K21
$$ -78 -33 120 -357 29 -52 -55 -158 -42 15 -123 217 124 109 -84 128 242 208 -95 116 130 -16 -118 103
3458A03k66J58j50J34J4k6J01q5r0J83j11K00j79J07L1j31Q3l2o8q2j57J54J06
$$ 103 -163 -5 -155 -21 -7 -33 68 -17 -107 76 -35 165 -14 93 124 -7 76 44 -24 -106 -263 -109 -3
3481cj16L4k90M91j36q5p6J44k73L91k65j06K15J35Q6n2j5j37J65k17K1K64k49
$$ -3 -119 -85 -375 116 -20 -105 -181 -37 -310 81 -184 -290 -75 60 146 94 79 -58 107 -110 -89 175 -74
3504g4q3J11p5L8J2rq6J30k33L35k29N2K22q6l3J65j85q4K44P7j38r1n0j1O8R
$$ -74 -157 -46 -121 -83 -71 -80 -166 -36 -269 66 -163 -111 111 25 -8 157 -28 -112 132 209 71 -20 -70 -81 -13 -4
3530dk7J73j56J04j30J81l62K31l52M60j73J29m4j05r5K13M3K50k13J9q6J37m2
$$ -4 -31 142 -14 90 -40 141 -221 10 -342 118 -55 74 30 -75 -170 43 86 336 123 142 56 193 151
3553A51k35Q6l4p4J52K5o1R3j56M0r4J03L1p2J0nL04q5k66J11K00k5k48K03Q3
$$ 151 -84 2 -32 -106 46 71 10 103 -53 -13 -107 -4 27 -45 -35 -40 264 179 -87 24 224 199 -49 154 237
3578B37j46j83J01m7p0R8k23K13k3jj53O01l46Q1j2J27l58P4J97k08k6J53J15
$$ 237 91 -92 9 -38 -108 -10 -233 -20 -43 -44 -197 404 58 139 127 254 -104 -30 167 -41 -67 86 201
3601B01j91O3n65O24p4j28J03l48L46k9M01p22L69r8L0O7O1O5k86K51q3J25k37
$$ 201 10 73 -492 132 58 -70 33 -315 31 2 403 -319 50 -48 -18 49 110 175 -111 140 57 182 -55
3624e5N5M7n9OK23l7j74r3jK6k05L83qk75J46J4K19k83n9J54J78l9L4k70n7O4
$$ -55 0 47 -12 -6 217 180 6 -87 -88 -62 -267 116 108 -167 -21 -7 212 -71 -130 24 202 163 197 -73 -130 -66
3650f6Q6J93j51L4p8p7j68J62k25P3N04m77m1jL14j73M17k67J21K12k68O0l10
$$ -66 20 213 62 96 18 -59 -227 -65 -290 -217 287 -190 -231 -232 82 -91 326 59 180 392 124 184 -126
3673a26K57k4J13q0j25P0k79N1K41n5j41p9K84m13K38K8k7q8J60j52K32Nn0Q5
$$ -126 131 107 220 140 15 85 -194 -143 98 43 -98 -177 107 -306 -68 -40 -67 -155 5 -147 85 90 40 125
3697A25p3j76K86m03K50p5L47j84K3p0l81K04N8Q2j98J28K44j83J45q5l5k6R6
$$ 125 52 -124 162 -241 9 -66 281 97 120 50 -331 -127 -69 13 -185 -57 187 4 149 64 29 3 99
3720I9M1J1K0k23M4j37M20l87Nq7O3P7k5R8M4k71L49n8k65J02J11j48K09N9j3
$$ 99 140 151 171 -52 -8 -145 275 -112 -107 -194 -131 -54 -79 19 63 -208 141 83 -182 -80 31 -117 92 151 138
3745A38J14q7l10K47j75K33q2M4j95J70k79J83N9J74l56K0j93J29L54k48j93K
$$ 138 252 165 -145 102 -73 160 78 122 -73 97 -182 1 60 234 -122 -102 -295 -166 188 -60 -253 -251
3767b51M60k33q5K88j67Q9l9J22K0j31j81L05p6j92K12j52Jk6L5l7k00L87k21
$$ -251 209 -24 -109 179 12 101 62 184 204 73 -108 197 121 -71 141 -11 -10 -36 -1 -38 -238 149 -72
3790g2q2L0J53J33k71R7M0k5J86j60j07J98p2j34J38j98J10j24K15l62M31l34
$$ -72 -154 -124 29 162 -109 -12 28 3 189 29 -78 120 48 -86 52 -146 -36 -160 55 -307 124 -210
3812b10J77J20o0j0J70J5o4j1K77l11K89m61P0K62k08l30L01l84K27j91R7J07
$$ -210 -33 87 27 17 187 202 138 127 404 93 382 -79 -9 253 45 -285 16 -368 -141 -332 -235 -128
3834a28j37K21K3j53l3P0J09j84J06K29M2J31m04j46L77k33P2J63k34J55j6m5
$$ -128 -265 -44 -21 -174 -207 -137 -28 -212 -106 123 165 296 -108 -254 123 -110 -38 125 -109 46 30 -15
3856a5k95M66j16k27L66j68N7j99M13m24K47j92L65l10O6oJ08p0l9J42l19Q3K36
$$ -15 -310 156 40 -187 179 11 68 -131 282 -142 105 -87 278 -32 34 28 136 66 27 169 -150 -67 169
3879A69j77K48K8n17N7J01j82m9l0M15j7P3k9m0J89j53J00j26P5J72k63k76L60
$$ 169 -8 240 268 -249 -192 -91 -273 -322 -352 63 46 119 90 50 239 86 186 60 135 307 44 -232 128
3902A28K7j78p3j01j66M28j68n5J60j45Lk5L53k70L41o1l7l27M9K30j80L9J66
$$ 128 155 -23 -96 -197 -363 65 -103 -158 2 -143 -140 -165 188 -82 259 198 161 -166 -117 113 -67 -28 138
3925A38J03l73L26k23K55m70l2Q2J15o5O9R6j42L8K84j79j06M20l27J06O9k09
$$ 138 241 -132 194 -29 226 -244 -276 -194 -79 -144 -75 21 -121 -83 201 22 -84 336 9 115 184 -25
3947b5L76k20J49j22j75L7J1j36Q8j37L1J73J02P7k72j12Q3j3M74l94N3p8L3J21
$$ -25 351 131 280 158 -17 20 31 -105 -17 -154 -123 50 152 229 -43 -155 -72 -85 389 -5 48 -30 3 124
3971A24K45O2k82k00N5pJ11l76L83k09nM1N2o4J39P6l62L62r4J17j26K9j71K91
$$ 124 369 431 149 -51 4 -3 108 -268 115 -94 -99 -58 -6 -70 69 145 -217 145 51 168 42 71 -100 191
3995A91j54K15k98J43QL8m68L55j54J35j06J01K4q4K31k30K10j97LO5q1Q4p1L18
$$ 191 37 252 -46 97 105 143 -325 30 -124 11 -95 6 30 -54 177 -53 157 -40 -37 28 -53 31 -40 278
4019B78k12M1J3J42k33n1K4p6k0l8Nl1J16J14N0Q2l89J16J03o6j25K14o2O1j38
$$ 278 66 107 120 262 29 -22 2 -74 -94 -132 -127 -158 -42 72 122 204 -185 -69 34 -32 -157 57 -5 56 -82
4044h2L11P4j05k11Kj85J97j02n1K92n18K59P6j0m17N95J0j19j49J79J57k36J85
$$ -82 229 303 198 -13 -11 -196 1 -101 -152 140 -378 -119 -43 -53 -470 125 135 16 -133 46 203 -33 152
4067A52l8k0M3j33k32K32J87j02j58R6j61K26k29P4K8k66J58Q3r2L21K7m03K03
$$ 152 114 94 137 4 -228 4 191 89 -69 27 -134 92 -137 -63 -35 -301 -143 -60 -152 169 196 -207 -4
4090dK37m5k41K06P3k88L03J84n10Q6J7J94r9r1r0l1m5j99M44j51Orp9Q7k50K92
$$ -4 233 188 -53 153 226 -62 241 425 -85 1 18 212 113 22 -68 -99 -144 -343 101 -50 -44 -53 -132 -45 -295 -3
4116cQJ07r1n3K33j28m9Kj93K41k53K85M4Jq3r9j47r2J19K77l7J08q7L3j0mk26
$$ -3 5 112 21 -32 201 73 24 26 -167 74 -179 106 150 151 68 -31 -178 -270 -151 126 89 197 110 143 133 129 -97
4143i7J21O2o7P7k1j59J62M3j99P8r5J17k41J47O0qL4l6R1n2J01J1k65K34j99
$$ -97 24 86 19 96 75 -84 78 121 -78 0 -95 22 -219 -72 -12 -20 14 -22 69 17 118 129 -136 98 -101
4168a01L31l45K51K1Ol78J27L4j2L19k34k6r4l1L29j95M0K4k79J61q0L61L0n62
$$ -101 230 -115 136 157 163 -215 -88 -54 -66 253 19 -7 -101 -132 197 2 42 66 -213 -52 -132 229 259 -303
4192c03L01K53l45L53j00J4j92n0mJ6m8K85j82J38j88q1N3K36p7k04L30j21l29
$$ -303 -2 251 -94 259 159 173 -19 -69 -73 -57 -105 180 -2 136 -52 -133 -80 156 79 -125 205 84 -245
4215b45O4L70O8j39Ko7j40P2K06o9k68O3k2K1J59j06j84L40k63K09L0k0k7q8N2
$$ -245 -181 189 257 118 120 53 -87 -15 191 122 -146 -83 -105 -84 75 -31 -215 125 -138 71 101 81 54 -34 18
4240A8q4PJ85q8K21o4l61J24J71j95K57m70L61l2j44K28j77L7n1M1OJ06L03m00
$$ 18 -66 -59 126 38 259 195 -166 -42 129 -66 191 -279 82 50 -94 134 -43 -6 -57 -16 -10 96 399 -1
4264aJ72M0k5j66j09R5Q5l47M89l68J21j14Mj23j9J14m7K44k49K28j58J34l0J76
$$ -1 171 211 186 20 -89 6 91 -256 233 -135 -14 -128 -124 -247 -266 -152 -199 45 -204 24 -134 0 -30 146
4288A46j82j00JM9K08j16J69j1l1k15J81J31l72O0j1J93o6k4L0j74J32k4O4J29
$$ 146 -36 -136 -135 -86 122 6 175 164 133 -82 99 230 -142 -82 -93 100 34 10 40 -134 -2 -26 38 167
4312A67k16J66m0J33j12j54J38p7j32K19j54J06j72O0k00J73K69k26m6j62J75
$$ 167 -49 117 77 210 98 -56 82 5 -127 92 -62 44 -128 -68 -268 -95 174 -52 -98 -260 -85
4333h5L8J88j10J8R4p4p8J28j25j74K34J1J16j99O4o7J13j49j09J6J39O8j33l0
$$ -85 -47 141 31 49 143 69 -9 119 -6 -180 54 65 181 -18 46 -21 92 -57 -166 -150 -11 57 -76 -106
4357a06q4L18j10j51K46l39K99Q3p7L5m9n9K9J4J91m81K5J47M4O9k40K48j40j08
$$ -106 -190 128 18 -133 113 -226 73 156 79 114 65 6 35 49 240 -241 -216 -69 -25 44 -196 52 -88 -196
4381a96Q7J87%n8l46K55R7k6K13r6k81K88m5K26l74L9K18k43P6r7L32k89j29Q8
$$ -196 -109 78 78 20 -326 -71 26 0 213 117 -164 124 79 305 -69 -30 188 -55 21 -76 256 -33 -162 -74
4405g4k7J71k33M1L61k84P3J94k32L21n44M37k76M1j36M07j72l47m5L40l2j8j2
$$ -74 -101 70 -163 -122 239 -45 28 222 -10 311 -233 204 -72 -31 -167 240 68 -279 -324 16 -16 -34 -46
4428d6K12o5k66J13o7M5M4J07j04K26l18K32k05K00k64N0K35J17j77JQJ9k34J48
$$ -46 166 101 -165 -52 -119 -74 -30 77 -27 199 -119 113 -92 108 -156 -106 129 246 69 70 78 97 -137 11
4452A1r1j29P0N9K02p0k86L40K7j38M1J16k67K27k40J55J38nj38N4K1Lj03j63
$$ 11 -80 -209 -139 -80 122 52 -234 106 133 -5 36 152 -115 112 -128 27 165 160 22 76 97 100 -3 -166
4476a66J75kj3l09L85j39j90L09n8p3o7K82j44J00L62o22K03j1J61l81J04K4N2
$$ -166 9 7 -6 -315 70 -69 -259 50 -8 -81 -148 134 -10 90 452 -170 33 22 183 -198 -94 -70 -18
4499a8O0l97J90J29J44l53K70P8k7Q0j56k86P43j77l2j6m23L83k03Pm1k61L27
$$ -18 42 -355 -165 -36 108 -245 25 103 76 156 0 -286 457 280 248 232 -191 192 -11 -4 -45 -306 21
4522B1N0j54k39J47N7o6J97M8M3k10J82k23l4K30p9n3J09Q5R0j43j10LK55l26
$$ 21 71 -83 -322 -175 -118 -184 13 61 104 -106 76 -147 -181 49 -30 -83 26 111 201 58 -52 -49 206 -120
4546a20K93n30K26J02Q2p1j43j14M90k21k74L78Pj69J93M2k31m1N2K02j00m9n7
$$ -120 173 -357 -131 -29 53 -18 -161 -275 215 -6 -280 98 105 -64 129 171 -60 -101 -49 153 53 4 -53
4569e3K5K99j69j2rk14j07K91k64M7J7n9J75K7n6J70j47J96jj27J59k12M3J9j78
$$ -53 -28 271 102 90 81 -133 -240 51 -213 -166 -149 -208 -33 -6 -62 108 -39 157 156 29 188 -24 19 38 -140
4594a40p4J50J5K06L3k27R5k9k13l0K45k23K37k34J38J92qq8J49p9J48k70m0L09
$$ -140 -214 -64 -49 157 190 -37 58 29 -184 -214 31 -192 45 -189 -51 141 133 45 194 115 263 -7 -47 262
4618B62k26P1j38K22l16K51l68j1j50K69p9J49q6J07J95j80J59j4j70k27K34R4
$$ 262 36 107 -31 191 -125 126 -242 -253 -403 -134 -213 -64 -150 -43 152 -28 131 117 -53 -280 -46 48
4640D8K41k74k26K3J69n0o9M7mK49j45K4J58l43L49k86N3k07M15k90j4J78j9J47
$$ 48 289 15 -211 -188 -19 -69 -138 -91 -95 154 9 33 191 -152 197 -89 -36 -243 172 -118 -132 46 27 174
4664A74l15J73k20j65K09J36L30q8k44j57N2K01j87O5o8PJ18r4J26J9j28J32K21
$$ 174 -141 32 -188 -353 -144 -8 322 234 -10 -167 -115 86 -101 -36 -104 -97 21 -73 53 72 -56 76 297
4687B97l42J10l9O3M8j15k12L44j14k66Q5j07K57K44n71J61L46k94J75pj19M59
$$ 297 -45 65 26 89 137 22 -190 154 40 -226 -141 -248 9 253 -318 -157 189 -105 70 63 -56 403
4709D03l20j47M6J61j06J0K07l90L97m55J19J04m2k13J33j06K35M1k36L18o2l05
$$ 403 83 -64 -18 143 37 47 254 -136 261 -194 -75 29 -13 -226 -93 -199 36 77 -159 159 97 -208
4731b08P2rJ27N6J86k20M6J59j99j40%J31m4pL5m1l9P7j20K53j10j55Ok6K15J36
$$ -208 -136 -145 -18 38 224 4 50 209 10 -130 -130 1 -43 -50 -15 -56 -95 -18 -138 115 5 -150 -144 -170 45 181
4757A81k93K18pP8l8J13j77m9L63m72L80l98J82k28J05n3j71K68J6n7j43M59m38
$$ 181 -112 106 99 177 139 252 75 26 389 -83 297 -101 81 -147 -42 -95 -266 2 18 -39 -182 277 -161
4780a61J15K29p7j70J85k0K1n7j15L03p5l28J99l69L91o4J31r1j43j08m6J95K10
$$ -161 -46 183 106 -64 121 101 122 65 -50 253 178 -150 49 -320 71 7 138 47 -96 -204 -250 -55 155
4803A55Q7l53j77Q3L00j91J89o8k7o2K41o5J11j72j07P9j30K51L9j79K77k80r2
$$ 155 242 -111 -288 -205 95 -96 93 25 -2 -64 177 112 223 51 -56 23 -107 144 183 4 281 1 -91
4826i1m3J83j96J79J30m19K91L7NL1l1L8KJ8j5p8Q3k82OK9p4M27k60k30K97J40
$$ -91 -134 49 -147 32 162 -257 34 71 76 107 76 114 116 134 119 41 124 -158 -152 -123 -197 230 -30 -260 37 177
4852A77j10k27J69R3j09P2k4nk66L61k31J52k95L69J2m1L5k86N3k70M44k72K27
$$ 177 67 -160 9 102 -7 65 41 36 -230 131 -100 52 -243 126 138 97 132 -154 -101 -371 73 -199 28
4875B8k23J25J90j32j34J59J61k99J98J78k74K45j07P3k95q3J68K3Jj11k43P9
$$ 28 -195 -70 120 -12 -146 13 174 -125 73 251 -23 222 115 188 -107 -190 -22 1 2 -109 -352 -273
4897b73K37j4J44r9qj2k7j62J96P7k37J87K0p8J34k01P5O9J23m6pjk50l7K08L7
$$ -273 -36 -50 94 -5 -13 -25 -52 -214 -18 59 -178 9 29 -49 85 -116 -41 28 151 105 98 97 -153 -190 18 55
4923E5j36K0r3L85M9k04NL8r2n4r6j19L01m3J8N7J12l6l00K16j69M1L12k45k36
$$ 55 -81 -61 -154 231 280 76 81 119 27 -27 -123 -242 59 16 34 91 203 167 -133 83 -86 -45 267 22 -214
4948b14R5p2oL76l71R7K8o1K59J19j39j8k62K6L09j76kq0M9n0j23K81j83K20j51
$$ -214 -119 -191 -197 179 -192 -95 -67 -128 131 250 111 93 -169 -143 166 -10 -12 -92 -43 -93 -216 65 -118 102 -49
4973d9j85J75l8k3O7J93k11J78L7j88j08n5K96K9J02l75RP6J41q3j07R6p2P5j82
$$ -49 -234 -59 -97 -120 -53 140 -71 107 144 -44 -152 -207 89 118 220 -155 -146 -70 71 -12 -119 -23 -95 -20 -202
4998b02K45j48J9R7j8J04J0K6Qn5j29K19l08K52k64J82p1l6K2j55P1J43J31j34
$$ -202 43 -105 -86 11 -7 97 107 133 141 86 -43 176 -132 120 -144 38 -33 -69 -47 -202 -131 12 143 9
5022IN8n7rp4p2k7L32l33%M5Q9J09l3J12N5k73K12j35l0k30L6M09l30R7J7n3j03
$$ 9 67 10 1 -73 -145 -172 160 -173 -173 -128 -39 70 37 149 204 -69 143 8 -22 -252 -216 193 -137 -40 -23 -76 -179
5049a79q8N9J14M1k9K0k2R5k44M17k97N29l63l43K70L6k90K76j07J22l29M64m09
$$ -179 -267 -208 -94 -53 -82 -62 -84 11 -233 184 -113 416 53 -290 -20 16 -274 2 -105 17 -312 152 -257
5072b57M25k48n2J74L6n2j10J1k7M41k56r0J12l3k00J09p3m4L1L06j93J08j49
$$ -257 168 -80 -132 42 78 26 -84 -73 -100 341 85 -5 107 74 -126 -17 -90 -134 -103 203 10 118 -31
5095c1p4J44k13J55k32L13k20L80M2r7N6l44R4K01p0r4J6j23L32j8j36j05j83
$$ -31 -105 39 -174 -19 -251 62 -158 222 264 167 223 -121 -27 174 104 10 26 -97 235 217 81 -24 -207
5118b07P7j4K1Q7K15j51Jj92L14l37J14J88j57N4LR7k92K81L2j62J97J30m36K02
$$ -207 -130 -144 -123 -36 179 28 29 -163 151 -186 -72 116 -41 13 16 113 -179 102 134 -28 169 299 -137 65
5142F5p0K0l0qP8k19K83l09j8L12j82J68l3J64m06J80p9J67k90L58j76m3L60l09
$$ 65 -5 15 -15 -23 55 -164 119 -190 -208 104 -78 90 57 221 -185 -5 -84 83 -207 151 -25 -68 292 -17
5166a7J87j38l04M99l29j11K33j45O2m1Q6j17J61j39J03q0O9L1M9R8j14O8l8K24
$$ -17 170 32 -272 227 -102 -213 20 -125 -63 -104 -18 -135 26 -113 -10 -90 -21 10 59 157 43 111 73 297
5190B97l26J33j52j83L04k59N7M1J88r4j60K9K79q1j80K13m01L07k75K71J21k85
$$ 297 -29 104 -48 -231 73 -186 -129 -88 100 6 -154 -125 154 73 -107 106 -295 12 -263 8 129 -156
5212a56K8L4K29k72J16J52MO6r6l34L3K49q4k0l2P1J17j92O5J66JJ0l8j42oJ62
$$ -156 -128 -94 135 -137 -21 131 135 201 105 -229 -196 53 -31 -51 -83 -12 105 -87 -22 144 145 155 117 -25 -31 131
5238A31k4l63K79j5P8o3j06o2q6J99J76k52J10l4j81K79M1j86K43N0K7j77l8j61
$$ 131 107 -256 23 8 86 23 -83 -145 -231 -32 144 -108 2 -32 -213 66 107 -79 164 214 241 64 26 -135
5262a35M00l31J10j88K31k57J53J00m27P0L24o7J04j11JN8k6LJ54M3j26q1R7j8
$$ -135 265 -66 44 -144 87 -170 -17 83 -344 -274 50 -17 87 -24 -23 35 9 12 166 209 83 2 99 81
5286H1j71J38J26k76K53j77J62j78k69M81M5n27L0J97P6R3j03J21j37J42n8J35
$$ 81 -90 48 174 -102 151 -26 136 -42 -311 170 215 -312 -282 -85 -9 84 -19 102 -35 107 49 184
5308A84k07N9j15K55j52R6l15R9J22l14J75M9j36J96J84l31K0p3K0L45o5R1j85
$$ 184 -23 36 -79 176 24 120 -195 -96 26 -288 -113 -64 -200 -4 180 -151 -131 -204 -184 161 96 187 2
5331Bj9Pk59L33O6Ol7j14J23j92J08j47Q6n5K29j4lj28M5k7P6j11J73j85J43L3
$$ 2 -17 -10 -269 64 130 136 99 -15 108 -84 24 -123 -37 -92 137 123 120 -8 37 10 86 -25 148 -37 106 139
5357A39j08k84K76J98k59K45m71J54K68J35k63n0j17N0K3L9j50k9P5J88j2r7K31
$$ 139 31 -253 23 221 -38 207 -264 -110 158 293 30 -20 -137 -87 -64 -25 -175 -204 -129 59 47 -50 181
5380A81J32k31J84j24j59J62Lj88Oj69j47K63J04j87L65K7k60K74j45m25K16K18
$$ 181 313 82 266 142 -17 145 148 -40 -34 -203 -350 -87 17 -170 195 222 -38 236 91 -334 -118 100
5402A00O8l46O06n69N02p8l98M1k58O35l80P0l4J3k6J34o8j03J10j10J91R7l53
$$ 100 168 -178 428 -141 361 283 -115 -74 -332 303 -77 -7 -41 -28 -54 80 12 -91 19 -91 100 197 -156
5425a56M3j4J37K29j90j07J83p5l8M2j28o5L88l86n5J44J50r5o4n5N0j16L59j86
$$ -156 -113 -127 10 239 49 -58 125 50 12 54 -74 -139 249 -137 -192 -48 102 7 -57 -112 -62 -178 181 -5
5449ek32J05L03j43j37K40J00k36P0l53L89k59M8J04k8R0r5J20j88k41M21O8j78
$$ -5 -237 -132 171 28 -109 131 231 -5 65 -288 101 -158 -110 -6 -34 56 -39 81 -107 -348 73 141 -37
5472c7J0K6p3k90J66K87m2o0J7J32l39L38q4J44k56j38J74J08p3J79j8Jj50m4
$$ -37 -27 -1 -74 -364 -198 89 47 -13 4 136 -203 135 51 195 -61 -199 -25 83 10 189 171 172 22 -22
5496b2j62J51l13Q4M13J8k91K58m1J7J14k42q5J64K4j63J43j90K74k75K9k7P8
$$ -22 -184 -33 -346 -262 151 169 -122 136 95 112 226 -16 -101 63 87 -76 67 -123 151 -124 -95 -122 -44
5519d4M6O6J78k54j2P2OpJ22k4l30K53P4J26l18K57j75k19J22j1P4j98L12q5m9
$$ -44 2 68 246 -8 -20 52 58 51 173 149 -181 72 146 272 -46 211 36 -183 -61 -72 2 -196 116 31 -18
5544a8L23l47R2m5k25J99J3K7L2k3l9j55K79j90M08m21K05K4k66J45m12K39O8
$$ -18 305 -42 50 5 -220 -21 -8 19 51 28 -11 -166 113 -77 331 -90 115 139 -127 18 -394 -155 -87
5567h7K2l55L77K83R1q7l77J09J72l3k44J33O7K69m27K08J48l42K42k65j4J68
$$ -87 -65 -420 -43 240 331 244 -133 -24 148 115 -129 4 71 340 -87 121 269 -73 169 -96 -110 58
5589E8q2J44r8j59J68l4k16J18O5J24j64O4j72M15k14P7K02j89o9j5r4K26L5q8
$$ 58 -24 120 22 -137 31 -3 -219 -101 -36 88 -76 -12 -184 231 17 94 296 107 38 23 -71 155 190 102
5613A02j26j71N0nJ02j86J40k13K97n3K23j50J71j6q4mj8Q4l5j70R6p6K01J59
$$ 102 -24 -195 -145 -150 -48 -234 -94 -307 -10 -63 160 10 181 165 81 77 59 143 108 -62 34 -42 159 318
5637C18l17k56L79j67P0p3J30l43J72o7k6J52j10K02p9k04J27K3J80K4j00Pm4
$$ 318 1 -255 124 -43 27 -46 84 -259 -87 -154 -180 -28 -138 64 -15 -219 -92 -69 111 135 35 42 -2
5660bN4L6J7j07k4O7N0k47J61j55J65Qj10l9K41J13k16J91j02j44J32o2j40K4
$$ -2 52 88 105 -2 -26 41 91 -156 5 -150 15 23 -87 -126 115 228 12 203 101 -43 89 27 -113 -89
5684h9o3L36j08j88pK56k79k41M27j65m3O8Ok7J55l28M23R5j22p4j6N4q5r3K33
$$ -89 -152 184 76 -112 -119 137 -142 -383 44 -121 -164 -96 -90 -117 38 -290 133 228 106 32 16 70 -15 -108 125
5709A25k2N7j42K13N2j55O3k82J57J18r5l10K46l43K40rk1J07K8K87m92K4L04
$$ 125 103 160 18 231 283 128 191 -91 66 184 89 -221 25 -318 -78 -87 -108 -1 27 314 -178 -154 150
5732A50J0M3l13QJ63M0j19J43j4k92R7K51k81J49J2r2L42m24P4J86l9n9j99J02
$$ 150 160 203 -110 -102 61 101 -18 125 111 -181 -84 167 -114 35 47 -45 297 -127 -53 133 94 35 -164 -62
5756f2j59mL95k61l6j05K69l65K44K89l55K17O4pj41K22k15j48M42j83k4j33K02
$$ -62 -221 -225 170 -91 -127 -232 37 -328 -84 205 -150 67 131 124 -17 205 -10 -158 284 101 77 -56 146
5779A46l4l45K10J74Rk55J14J21j51r6L0R3QJ9m9n1q8l7K04O2j9M0J02j92J14
$$ 146 112 -233 -23 151 160 -95 19 140 -11 -107 -77 16 24 43 -6 -57 -145 -182 22 84 65 105 207 15 129
5804A29K31k84j49K75q5q6K35j07k4J75l53J32l92L17R7m37K20K81n43L01m2J32
$$ 129 360 76 -73 202 117 31 266 159 135 310 -43 89 -303 14 111 -326 -106 175 -368 -67 -109 23
5826B3J59k6L0k55j63RN32j18j01j92J46J25k27J08p1J44n5k0j52L5J54p0P1O8
$$ 23 182 156 186 -69 -232 -223 309 191 90 -102 44 169 -58 50 -21 123 68 48 -104 -69 85 15 86 154
5850A54n7L1P5j32q7l5K49j46J41m6p5P3k16Nm3k20J28K85q3m2K11j19m0m4kR4
$$ 154 97 128 203 71 -16 -51 198 52 193 147 72 145 -71 -66 -109 -329 -201 84 1 -41 170 51 11 -33 -35 59
5876E9j0j06JJ95l69K73Mk7J37l01K23p2L87m02k12J02O3nJ75j57n9L2Q6n1J08
$$ 59 49 -57 -56 139 -230 43 47 20 157 -144 79 7 394 -8 -220 -118 -55 -60 115 -42 -101 -69 17 -34 74
5901G4J68j50o5k67M43j00j99P3N4j1J02k36R3j27P7M9q7o6J02j07L98j43j97
$$ 74 242 92 27 -240 203 103 -96 -23 31 20 122 -114 -21 -148 -71 -22 -109 -175 -73 -180 218 75 -122
5924a22L49K8j37j71K12k39pL9M8q5J22k68j12N51N3l05o3J41k40L33l12L04k72
$$ -122 227 255 118 -53 159 -80 -87 -48 0 -85 37 -231 -343 208 261 -44 -107 34 -206 127 -185 119 -153
5947a53K97j41p8J24k22L36j73j25L46k6j16j01m7k6J87j47J52J0j59o4J94q2
$$ -153 144 3 -75 49 -173 163 -10 -135 211 185 69 -32 -79 -105 82 -65 87 97 -62 -126 68 -14
5969a4o6J63o4j19j38J97l5l8J65j8j75K25J8m06k68R53l90j91K22q8j3J56j27
$$ -14 -80 83 19 -100 -238 -41 -76 -114 51 33 -142 83 101 -305 -573 380 -10 -201 21 -67 -80 76 -51
5992e1k22L75Rn05N80l60q5K95o3k13L22Q9j30q3J64m2L1O4j52R3j26r7K6K3j31
$$ -51 -273 102 111 -394 186 -174 -259 36 -27 -240 82 171 41 -42 122 80 111 175 23 116 -10 -107 -81 -58 -189
6017a89J82L9m0r7L77j63j10p0Qj05K86j2J49j18m11K40k55J03M02k10l81K53
$$ -189 -7 32 -8 -105 272 109 -1 -71 -63 -168 118 106 255 137 -274 -34 -289 -186 216 6 -375 -122
6039a22K68j99L3j61K29Q9J00m85L45J86k05P6Q3k12m29Q0M41j11p1J98j37j78
$$ -122 146 -53 -20 -181 48 137 237 -248 97 283 78 154 237 25 -404 -324 117 6 -65 133 -4 -182
6061a82j10L67r9j16J53Q6k69K6M04j52K7J03J3k97L14k78J46j94J8L4k6L5Nk02
$$ -182 -292 75 -24 -140 13 99 -170 -144 260 108 135 238 251 -46 268 -10 136 -58 -40 -6 -32 3 8 -194
6085a94J44Nj70J86j0J04r4nN6Q2k64M40l3J44l84R4O6j76j5K17J59l61j5k3j13
$$ -194 -50 -45 -215 -29 -39 65 -29 -34 22 104 -160 280 247 391 7 101 167 -9 -24 193 352 -9 -24 -47 -160
6110a60J27J35k76J10J44k8k22J32K8J93k37J79q6o9L03k14QR7Q8l08l7K6K13
$$ -160 -33 102 -174 -64 80 52 -170 -38 -10 183 -54 125 39 -30 273 59 67 164 252 -56 -93 -67 146
6133A46j85J32M6l16M7J09j2J17K3K9n9K3j03k45P7J78m8L03k82J74k74p4N1%
$$ 146 -39 93 139 -177 -130 -21 -33 84 107 136 77 100 -3 -248 -171 7 -41 262 -20 154 -120 -194 -143 -143
6157a43J75j19M9m50M1O50k51K86j76r9j6P7n6J84j44P5mp2m7p0K35j89N3j79
$$ -143 32 -87 -38 -488 -447 203 -48 238 62 -37 -53 24 -32 152 8 83 79 7 -40 -110 125 -64 -11 -190
6181a90l6K05k88K64j3P0k9l4q9n7j1n4J58J21J86Mk14L39k08j41O8j46L00K2
$$ -190 -226 -21 -309 -45 -58 12 -17 -51 -140 -197 -208 -262 -104 17 203 207 -7 332 124 -17 51 -95 205 227
6205B27j01J54j20k66J48j47K8j4J31j05Pn7R3k25K95p9J41J66l66K0J73j15M13
$$ 227 126 280 160 -106 42 -105 -77 -91 40 -65 -58 -115 -22 -247 48 -31 110 276 -90 -70 103 -12 401
6228D01m89J63P9m4r1o9J87k34J70J9l9n7K81P9j15m8K8k96J68n3J54M0j86J23
$$ 401 -88 75 154 110 19 -50 137 -97 73 92 53 -4 277 356 241 193 221 -75 93 40 194 234 48 171
6252A71Q6J08l42k09m2L8J57J12P0k13J38k41L60j40j27L2L2P2j81J65L5o9J04
$$ 171 257 365 23 -186 -228 -190 -33 79 149 -64 74 -167 193 53 -74 -42 -10 62 -119 46 81 12 116
$$ [...]
8191c2
##END NTUPLES=NMR FID
##END=
