##TITLE=1H_Pr 5064-Q
 CDCl3,8 sc, 
 3.9.2021
##JCAMPDX= 6.0         $$ Bruker NMR JCAMP-DX V2.0
##DATA TYPE= NMR FID
##DATA CLASS= NTUPLES
##ORIGIN= UXNMR, Bruker Analytische Messtechnik GmbH
##OWNER= root
$$ XWIN-NMR		Version 3.5
$$ Fri Sep  3 08:50:06 2021 Russian Standard Time (UT+4h)  she@DPX200
##.OBSERVE FREQUENCY= 200.1313
##.OBSERVE NUCLEUS= ^1H
##.DELAY= (6, 6)
##.ACQUISITION MODE= SIMULTANEOUS
##.ACQUISITION SCHEME= undefined
##.AVERAGES= 8
##.DIGITISER RES= 18
##SPECTROMETER/DATA SYSTEM= spect
##.PULSE SEQUENCE= zg30
##.SOLVENT NAME= CDCl3
##.SHIFT REFERENCE= (INTERNAL, CDCl3, 0, 15.7039)
##AUDIT TRAIL= $$ (NUMBER, WHEN, WHO, WHERE, WHAT)
$$ ##TITLE= Audit trail, XWIN-NMR		Version 3.5
$$ ##JCAMPDX= 5.01
$$ ##ORIGIN= Bruker BioSpin GmbH
$$ ##OWNER= she
$$ F:/spectra/data/she/nmr/H-F/1/audita.txt
$$ ##AUDIT TRAIL=  $$ (NUMBER, WHEN, WHO, WHERE, WHAT)
(   1,<2021-09-03 08:48:57.23 +0400>,<she>,<DPX200>,
      <created by zg, POWCHK disabled, PULCHK disabled
       configuration hash MD5:
       00 E9 B6 7A A2 85 ED C7 34 08 36 98 17 FE 4E 26
       data hash MD5: 16K
       8A 8B FF E2 89 9F C4 3A EC 48 86 0E 09 FF D1 AA>)
$$ ##END=
$$ 
$$ hash MD5
$$ 42 DA 71 39 0D 31 DB FF E0 95 18 1E 91 43 6C E2
##$RELAX= 
##$RELAX= 
##$RELAX= 
##$RELAX= 
##$RELAX= 
##$RELAX= 
$$ Bruker specific parameters
$$ --------------------------
##$DU= <F:/spectra>
##$EXPNO= 1
##$NAME= <H-F>
##$PROCNO= 1
##$TYPE= <nmr>
##$USER= <she>
##$AMP= (0..31)
100 100 100 100 100 100 100 100 100 100 100 100 100 100 100 100 100 100 
100 100 100 100 100 100 100 100 100 100 100 100 100 100 
##$AQSEQ= 0
##$AQ_mod= 1
##$AUNM= <au_zg>
##$AUTOPOS= <>
##$BF1= 200.13
##$BF2= 200.13
##$BF3= 200.13
##$BF4= 200.13
##$BF5= 200.13
##$BF6= 200.13
##$BF7= 200.13
##$BF8= 200.13
##$BYTORDA= 1
##$CFDGTYP= 0
##$CFRGTYP= 5
##$CHEMSTR= <none>
##$CNST= (0..31)
1 1 145 1 1 1 1 1 1 1 1 1 1 1 1 1 1 1 1 1 1 1 1 1 1 1 1 1 1 1 1 1 
##$CPDPRG= <>
##$CPDPRG1= <>
##$CPDPRG2= <>
##$CPDPRG3= <>
##$CPDPRG4= <mlev>
##$CPDPRG5= <mlev>
##$CPDPRG6= <mlev>
##$CPDPRG7= <mlev>
##$CPDPRG8= <mlev>
##$CPDPRGB= <>
##$CPDPRGT= <>
##$D= (0..31)
0 1.2 0 0 0 0 0 0 0 0.06 0 0.03 0 0 0 0 0.0002 0 0 0 0 0 0 0 0 0 0 0 0 
0 0 0 
##$DATE= 1630644536
##$DBL= (0..7)
120 120 120 120 120 120 120 120 
##$DBP= (0..7)
150 150 150 150 150 150 150 150 
##$DBP07= 0
##$DBPNAM0= <>
##$DBPNAM1= <>
##$DBPNAM2= <>
##$DBPNAM3= <>
##$DBPNAM4= <>
##$DBPNAM5= <>
##$DBPNAM6= <>
##$DBPNAM7= <>
##$DBPOAL= (0..7)
0.5 0.5 0.5 0.5 0.5 0.5 0.5 0.5 
##$DBPOFFS= (0..7)
0 0 0 0 0 0 0 0 
##$DE= 6
##$DECBNUC= <off>
##$DECIM= 32
##$DECNUC= <off>
##$DECSTAT= 4
##$DIGMOD= 1
##$DIGTYP= 9
##$DL= (0..7)
0 120 120 120 120 120 120 120 
##$DP= (0..7)
150 150 150 150 150 150 150 150 
##$DP07= 0
##$DPNAME0= <>
##$DPNAME1= <>
##$DPNAME2= <>
##$DPNAME3= <>
##$DPNAME4= <>
##$DPNAME5= <>
##$DPNAME6= <>
##$DPNAME7= <>
##$DPOAL= (0..7)
0.5 0.5 0.5 0.5 0.5 0.5 0.5 0.5 
##$DPOFFS= (0..7)
0 0 0 0 0 0 0 0 
##$DQDMODE= 0
##$DR= 18
##$DS= 0
##$DSLIST= <SSSSSSSSSSSSSSS>
$$ [...]
##$SUBNAM2= <"">
##$SUBNAM3= <"">
##$SUBNAM4= <"">
##$SUBNAM5= <"">
##$SUBNAM6= <"">
##$SUBNAM7= <"">
##$SUBNAM8= <"">
##$SUBNAM9= <"">
##$SW= 20.0189088683792
##$SWIBOX= (0..15)
0 0 2 0 0 0 0 0 0 0 0 0 0 0 0 0 
##$SW_h= 4006.41025641026
##$TD= 16384
##$TD0= 1
##$TE= 0
##$TE2= 300
##$TE3= 300
##$TEG= 300
##$TL= (0..7)
0 120 120 120 120 120 120 120 
##$TP= (0..7)
150 150 150 150 150 150 150 150 
##$TP07= 0
##$TPNAME0= <>
##$TPNAME1= <>
##$TPNAME2= <>
##$TPNAME3= <>
##$TPNAME4= <>
##$TPNAME5= <>
##$TPNAME6= <>
##$TPNAME7= <>
##$TPOAL= (0..7)
0.5 0.5 0.5 0.5 0.5 0.5 0.5 0.5 
##$TPOFFS= (0..7)
0 0 0 0 0 0 0 0 
##$TUNHIN= 0
##$TUNHOUT= 0
##$TUNXOUT= 0
##$USERA1= <user>
##$USERA2= <user>
##$USERA3= <user>
##$USERA4= <user>
##$USERA5= <user>
##$V9= 5
##$VALIST= <valist>
##$VCLIST= <CCCCCCCCCCCCCCC>
##$VD= 0
##$VDLIST= <DDDDDDDDDDDDDDD>
##$VPLIST= <PPPPPPPPPPPPPPP>
##$VTLIST= <TTTTTTTTTTTTTTT>
##$WBST= 1024
##$WBSW= 4
##$XGAIN= (0..3)
0 0 0 0 
##$XL= 0
##$YL= 0
##$YMAX_a= 653152
##$YMIN_a= -908267
##$ZGOPTNS= <>
##$ZL1= 120
##$ZL2= 120
##$ZL3= 120
##$ZL4= 120
##$ABSF1= 10
##$ABSF2= 0
##$ABSG= 5
##$ABSL= 3
##$ALPHA= 0
##$AQORDER= 0
##$ASSFAC= 0
##$ASSFACI= 0
##$ASSFACX= 0
##$ASSWID= 0
##$AUNMP= <proc_1d>
##$AZFE= 0.1
##$AZFW= 0.1
##$BCFW= 1
##$BC_mod= 2
##$BYTORDP= 1
##$COROFFS= 0
##$CY= 11.3945322036743
##$DATMOD= 1
##$DC= 2
##$DFILT= <>
##$DTYPP= 0
##$F1P= 2.36226072786647
##$F2P= -0.459571619588291
##$FCOR= 0.5
##$FTSIZE= 0
##$FT_mod= 4
##$GAMMA= 1
##$GB= 0.15
##$INTBC= 1
##$INTSCL= 1
##$ISEN= 128
##$LB= 0.24
##$LEV0= 0
##$LPBIN= 0
##$MAXI= 10000
##$MC2= 0
##$MEAN= 0
##$ME_mod= 0
##$MI= 1.114404
##$NCOEF= 0
##$NC_proc= 0
##$NLEV= 6
##$NOISF1= 3.799351
##$NOISF2= 2.8
##$NSP= 1
##$NTH_PI= 0
##$NZP= 0
##$OFFSET= 15.70392
##$PC= 1
##$PHC0= -13355.33
##$PHC1= 11.20097
##$PH_mod= 1
##$PKNL= yes
##$PPARMOD= 0
##$PSCAL= 0
##$PSIGN= 0
##$REVERSE= no
##$SF= 200.130013532006
##$SI= 16384
##$SIGF1= 3
##$SIGF2= 2
##$SINO= 400
##$SIOLD= 16384
##$SREGLST= <1H.CDCl3>
##$SSB= 0
##$STSI= 0
##$STSR= 0
##$SW_p= 3612.71676300578
##$SYMM= 0
##$S_DEV= 0
##$TDeff= 0
##$TDoff= 0
##$TI= <>
##$TILT= no
##$TM1= 0
##$TM2= 0
##$TOPLEV= 0
##$USERP1= <user>
##$USERP2= <user>
##$USERP3= <user>
##$USERP4= <user>
##$USERP5= <user>
##$WDW= 1
##$XDIM= 8192
##$YMAX_p= 0
##$YMIN_p= 0
$$ End of Bruker specific parameters
$$ ---------------------------------
##NTUPLES= NMR FID
##VAR_NAME=  TIME,          FID/REAL,        FID/IMAG
##SYMBOL=    X,             R,               I
##VAR_TYPE=  INDEPENDENT,   DEPENDENT,       DEPENDENT
##VAR_FORM=  AFFN,          ASDF,            ASDF
##VAR_DIM=   8192,          8192,            8192
##UNITS=     SECONDS,       ARBITRARY UNITS, ARBITRARY UNITS
##FACTOR=    0.0002496,     1,               1
##FIRST=     0,             0,               0
##LAST=      2.0444736,     0,               0
##MIN=       0,             -908267,         0
##MAX=       2.0444736,     653152,          0
$$ Real data points
##PAGE= N=1
##DATA TABLE= (X++(R..R)), XYDATA
$$ plain form
0 0 0 0 0 0 0 0 0 8 -8 8 -8 16 -16 24 -32 40 -48 56 -65 80 -96 120 -144 168 -192 226 -264 304 -352 404
30 404 -462 526 -598 678 -766 862 -967 1085 -1214 1351 -1506 1674 -1858 2057 -2275 2513
46 2513 -2773 3059 -3370 3714 -4089 4506 -4967 5480 -6057 6704 -7441 8287 -9271 10432
60 10432 -11821 13526 -15673 18470 -22289 27838 -36673 53005 -93400 413509 330685 -531269
72 -531269 -143122 441103 521311 -13202 -255791 -186496 -40858 -28396 60534 12800 -220727
83 -220727 -351700 17433 437936 296459 -308495 -527384 -130809 276792 158982 -147077
93 -147077 -185583 -29944 -29471 -117944 -82231 28181 9672 -32663 87643 256504 191155 -35595
105 -35595 -115144 25335 156845 169642 137756 77551 -60259 -150568 -28969 170065 138611
$$ packed form
0@%%%%%%%Qj6J6j6K4l2M0n6P2q8J04j21J45j76K16k64L12l60M18m90N68o56P56
30D04q66R88j124J276j444J628j829K052k299K565k857L180l532L915m332M788
46B513n286N832o429P084p803Q595r473J0447j1537J2761j4145J5728j7558J9703
60A0432k2253K5347k9199L4143m0759N0127o4511Q9678j46405N06909q2824q61954
72e31269L88147N84225Q0208n34513k42589O9295J45638J2462Q8930m7734k33527
83b20727j30973L69133M20503j41477o04954k18889L96575M07601j17810l06059
93a47077l8506J55639M73q8473L5713J10412j8509m2335J20306J68861o5349k26750
105c5595p9549J40479J31510J2797l1886o0205j37810r0309J21599J99034l1454
$$ plain form
116 138611 -99471 -202819 -58185 58812 -42148 -195225 -190160 -59042 65411 133933
126 133933 108387 -51225 -215855 -153651 103876 216691 27856 -178259 -103071 111148
136 111148 133809 -27352 -84044 41690 139264 101659 48982 39871 -18093 -110601 -68513 111147
148 111147 180554 23874 -131095 -72835 58973 35816 -77518 -75066 19968 23540 -71993
159 -71993 -106205 -53908 -47973 -95999 -49085 97191 151973 36447 -69759 -11740 112299
170 112299 119469 20707 -32401 3415 25180 -28761 -95332 -97588 -39313 29721 74582 76450
182 76450 32368 -15102 -5639 47533 59864 79 -56312 -41679 3189 -11938 -83936 -116209
194 -116209 -49318 57960 101815 49458 -29320 -42889 19176 73249 47957 -20617 -39340 10940
$$ packed form
116A38611k38082j03348J44634J16997j00960j53077N065J31118J24453O8522
126A33933k5546j59612j64630O2204K57527J12815j88835k06115P5188K14219
136A11148K2661j61161n6692J25734R7574l7605n2677r111n7964r2508M2088J79660
148A11147O9407j56680j54969N8260J31808k3157j13334K452R5034L572r5533
159g1993l4212N2297N935m8026M6914J46276N4782j15526j06206N8019J24039
170A12299P170r8762n3108L5816K1765n3941o6571k256N8275O9034M4861J868
182G6450m4082m7470R463N3172J2331n9785n6391J4633M4868j5127p1998l2273
194a16209O6891J07278M3855n2357p8778j3569O2065N4073k5292o8574j8723N0280
$$ plain form
206 10940 49090 7795 -68959 -86830 -23946 49308 62399 13182 -41230 -46262 -5062 29797
218 29797 20978 -9928 -15107 14221 34154 13491 -21208 -22783 10247 36136 27573 1366 -12203
231 -12203 -13935 -21126 -28159 -11709 22059 39502 22001 -9732 -22431 -8904 8697 10231 -7308
244 -7308 -27248 -26068 -1897 13312 -7469 -38682 -30088 23545 64736 41735 -20723 -49507 -16440
257 -16440 30370 33273 -5100 -33038 -14438 24565 35728 10747 -13038 -4425 27831 46670
269 46670 28195 -12408 -38918 -33574 -11362 -3113 -15106 -25767 -18967 -3547 6073 8130 6512
282 6512 5214 7259 12043 10814 -1799 -18870 -23288 -12462 -602 4582 8747 13251 12683 8272
296 8272 10395 20443 25105 11954 -7216 -11515 -2644 -2102 -16497 -28037 -19492 1557 11100 2638
$$ packed form
206A0940L8150m1295p6754j7871O2884P3254J3091m9217n4412n032M1200L4859
218B9797q819l0906n179K9328J9933k0663l4699j575L3030K5889q563k6207j3569
231a2203j732p191p033J6450L3768J7443j7501l1733j2699J3527J7601J534j7539
244g308j9940J180K4171J5209k0781l1213Q594N3633M1191k3001o2458k8784L3067
257a6440M6810K903l8373k7938J8600L9003J1163k4981k3785Q613L2256J8839
269D6670j8475m0603k6510N344K2212Q249j1993j0661O800J5420R620K057j618
282F512j298K045M784j229j2613j7071m418J0826J1860N184M165M504n68m411
296H272K123J0048M662j3151j9170m299Q871N42j4395j1540Q545K1049R543q462
$$ plain form
310 2638 -7774 -5922 2692 8441 6544 -1319 -6785 -5076 2084 4715 -1104 -5556 2097 13309 13233
325 13233 3073 -2187 319 1310 -1764 -4127 -3989 -4969 -7205 -4884 311 -15 -4920 -3250 5513 7626
341 7626 823 -6307 -4000 4482 5781 -353 -1898 5529 10618 7744 2553 3858 7037 3665 -4916
356 -4916 -7947 -4752 -4217 -7665 -9327 -6265 -1876 1019 1660 -16 -2528 -1021 3064 3088 -3793 -8641
372 -8641 -4474 1581 1705 -1128 2 4669 7406 7285 7293 8320 6353 2191 1946 4203 2756 -3025 -7072
389 -7072 -3422 3579 3923 -2814 -6098 -1080 2117 -2566 -10141 -11180 -7328 -5925 -8373 -9344 -6902 -3330
405 -3330 1016 5772 7832 7473 8035 10090 11572 9515 6696 4635 3378 1989 2546 3354 -1447 -6819
421 -6819 -4807 2671 5160 -2299 -10330 -8961 -399 2652 -5299 -14129 -12651 -4010 437 -3918 -9598
$$ packed form
310B638j0412J852Q614N749j897p863n466J709P160K631n819m452P653J1212p6
325A3233j0160n260K506R91l074k363J38r80k236K321N195l26m905J670Q763K113
341G626o803p130K307Q482J299o134j545P427N089k874n191J305L179l372q581
356d916l031L195N35l448j662L062M389K895O41j676k512J507M085K4o881m848
372h641M167O055J24k833J130M667K737j21QJ027j967m162k45K257j447n781m047
389g072L650P001L44o737l284N018L197m683p575j039L852J403k448r71K442L572
405c330M346M756K060l59N62K055J482k057k819k061j257j389N57Q08m801n372
421f819K012P478K489p459q031J369Q562L051p951q830J478Q641M447m355n680
$$ plain form
436 -9598 -7529 -1374 2730 4921 7160 6399 3699 6158 14379 20320 14768 3811 1837 9056 12635
451 12635 4247 -8881 -14153 -9450 -5361 -9130 -15244 -15352 -11202 -8807 -7105 -1886 3933 2636 -3736
466 -3736 -1937 9742 15396 6636 -4729 -4497 4673 9622 6587 39 -3775 -3249 3865 14062 15848
481 15848 4285 -7099 -2392 14670 21263 4532 -18548 -20540 -2927 8378 -3385 -24553 -31770
494 -31770 -19440 -1806 5123 -2644 -16497 -17709 2653 28014 29080 3866 -14226 514 31086
507 31086 36565 8675 -19122 -14564 12860 26048 9049 -17299 -21559 -1307 15471 11745 -4134
520 -4134 -13750 -11092 288 9206 6305 -11406 -27558 -21005 1990 9124 -13891 -35371 -23242
533 -23242 7897 17735 -682 -12563 5451 28276 26229 11517 12730 26258 24426 6089 -1815
$$ packed form
436i598K069O155M104K191K239p61k700K459Q221N941n552j0957j974P219L579
451A2635q388j3128n272M703M089l769o114j08M150K395J702N219N819j297o372
466c736J799J1679N654q760j1365K32R170M949l035o548l814N26P114J0197J786
481A5848j1563j1384M707J7062O593j6731k3080j992J7613J1305j1763k1168p217
494c1770J2330J7634O929p767j3853j212K0362K5361J066k5214j8092J4740L0572
507C1086N479k7890k7797M558K7424J3188j6999k6348m260K0252J6778l726j5879
520d134r616K658J1380Q918k901j7711j6152O553K2995P134k3015k1480J2129
533b3242L1139R838j8417j1881J8014K2825k047j4712J213J3528j832j8337p904
$$ plain form
546 -1815 9167 11515 -9343 -25196 -14632 981 -6269 -21642 -18134 -2400 -306 -8851 -4148
559 -4148 9921 6449 -12971 -14521 7967 18168 -4112 -27319 -14543 17811 22760 -5462 -22840
572 -22840 -4850 22968 27042 9988 -1449 2549 10920 15172 15521 7129 -8970 -15530 -1484 14181
586 14181 1925 -28496 -37845 -10974 16579 9153 -18997 -28148 -6006 18817 19135 1677 -7406
599 -7406 970 12643 13978 5602 -4551 -12078 -11359 978 15068 10852 -11470 -22926 -2792 24208
613 24208 22383 -2997 -14526 2975 20750 11923 -9231 -15354 -5189 1712 -476 -2407 -4024
626 -4024 -12374 -21368 -12503 10963 19171 -1623 -19878 -5144 22926 24077 -978 -11218 8195
639 8195 25225 14196 -6217 -10879 -4845 -6755 -12116 -6956 1456 -3460 -16571 -15954 536 11669
$$ packed form
546a815J0982K348k0858j5853J0564J5613p250j5373L508J5734K094q545M703
559d148J4069l472j9420j550K2488J0201k2280k3207J2776L2354M949k8222j7378
572b2840J7990K7818M074j7054j1437L998Q371M252L49q392j6099o560J4046J5665
586A4181j2256l0421r349K6871K7553p426k8150r151K2142K4823L18j7458r083
599g406Q376J1673J335q376j0153p527P19J2337J4090m216k2322j1456K0134K7000
613B4208j825k5380j1529J7501J7775q827k1154o123J0165O901k188j931j617
626d024q350q994Q865K3466Q208k0794j8255J4734K8070J151k5055j0240J9413
639H195J7030j1029k0413m662O034j910n361N160Q412m916j3111O17J6490J1133
$$ plain form
653 11669 5546 -1283 4375 12808 9007 -2632 -5531 668 1111 -4704 -2566 7980 9102 -5675
667 -5675 -15495 -1598 21645 25664 7376 -8365 -5507 5297 7160 -2777 -14089 -15804 -7092 1067
681 1067 -537 -13528 -23949 -18004 3450 18435 11500 -7015 -13621 836 17927 16226 1602
694 1602 -2645 9037 18649 11444 -3371 -9070 -2491 6054 8308 5758 -297 -6822 -8336 -4912 -54
709 -54 1687 199 -47 -724 -5312 -11796 -12513 -4813 1215 -1676 -8897 -7103 2391 4832 -4507 -11068
725 -11068 -960 16929 21618 7341 -8411 -7974 5903 16105 13402 4667 385 3457 7816 5767
739 5767 -2188 -8754 -7789 -150 6031 1622 -12431 -23037 -18091 -2181 8474 3859 -6329 -8416
753 -8416 -1502 2209 -29 -2514 -1297 1671 3220 3159 2625 229 -3237 -342 9880 19777 17867 6490
$$ packed form
653A1669o123o829N658Q433l801j1639k899O199M43n815K138J0546J122j4777
667e675r820J3897K3243M019j8288j5741K858J0804J863r937j1312j715Q712Q159
681A067j604j2991j0421N945K1454J4985o935j8515o606J4457J7091j701j4624
694A602m247J1682R612p205j4815n699O579Q545K254k550o055o525j514L424M858
709e4J741j488k46o77m588o484p17P700O028k891p221J794R494K441r339o561
725a1068J0108J7889M689j4277j5752M37J3877J0202k703q735m282L072M359k049
739E767p955o566R65P639O181m409j4053j0606M946J5910J0655m615j0188k087
753h416O914L711k238k485J217K968J549o1n34k396l466K895J0222R897j910j1377
$$ plain form
769 6490 -3910 -3465 3431 6866 3061 -4267 -9513 -8527 -3521 -2658 -9180 -14239 -8195 6079 12632
784 12632 3286 -9912 -11785 -2883 5266 7004 3576 -1166 -4619 -3406 1639 4839 2027 -1332 2795
799 2795 10127 10005 675 -7534 -5420 2363 6889 5657 1778 -2021 -5977 -6539 -2529 2702 3546 -591
815 -591 -2915 -1163 1570 -123 -4040 -5041 -1324 4207 6501 1771 -7078 -11117 -5166 5076 7546
830 7546 1467 -3874 -1188 3494 3678 746 229 2369 4702 4501 2120 -2172 -6561 -6789 -1402 4309
846 4309 4048 -1221 -4155 -1120 1926 1988 -522 372 3312 2627 -1795 -5204 -4705 -2014 -688 40 1712
863 1712 3291 2664 592 -965 -828 1676 4391 3321 -1247 -4807 -4941 -2840 -2152 -2406 -1277 2086
879 2086 3289 1769 180 582 1895 2352 2376 2412 2019 -807 -3350 -3271 -1042 755 474 194 739 665 -803
$$ packed form
769F490j0400M45O896L435l805p328n246R86N006Q63o522n059O044J4274O553
784A2632r346j3198j873Q902Q149J738l428m742l453J213N045L200k812l359M127
799B795P332j22r330q209K114P783M526j232l879l799l956n62M010N231Q44m137
815e91k324J752K733j693l917j001L717N531K294m730q849m039N951J0242K470
830G546o079n341K686M682J84k932n17K140K333k01k381m292m389k28N387N711
846D309k61n269k934L035L046O2k510Q94K940o85m422l409M99K691J326P28J672
863A712J579o27k072j557J37K504K715j070m568l560j34K101O88k54J129L363
879B086J203j520j589M02J313M57K4L6l93k826k543P9K229J797k81k80N45p4j468
$$ plain form
898 -803 -2278 -864 1637 1248 -1196 -2329 -1220 -65 -1274 -2885 -1924 1578 3899 3500 563 -1543
914 -1543 7 2969 3498 1344 -859 -748 426 -356 -2255 -2914 -2003 -1524 -1577 -1231 -307 -364 -1112 -599 1693
933 1693 4177 3679 1134 -318 1367 2684 1773 -320 -718 -21 249 -172 71 474 -758 -1536 -450
950 -450 1110 957 -1591 -3743 -2900 -1004 -628 -1608 -3250 -3398 -425 2245 2349 -263 -703 1339 3762
967 3762 3026 531 177 1451 1888 1227 619 1063 1786 1389 606 1502 2511 1644 -1151 -2601 -882 -9
985 -9 -1330 -3875 -4270 -3190 -2085 -2661 -2295 -1325 -752 -455 -442 67 199 -263 -1042 -394 1894 3417 2268
1004 2268 -625 -525 3677 7173 5346 1355 1748 5256 5832 1897 -1922 -1605 431 -106 -2874 -4752
1020 -4752 -5115 -5759 -6183 -5294 -2015 -1726 -4387 -5252 -1024 3042 973 -2495 -937 4855 6756 2715
$$ packed form
898h03j475J414K501l89k444j133J109J155j209j611R61L502K321l99k937k106
914a543J550K962N29k154k203J11J174p82j899o59R11M79n3L46R24n7p48N13K292
933A693K484m98k545j452J685J317r11k093l98O97K70m21K43M03j232p78J086
950d50J560j53k548k152Q43J896L76r80j642j48K973K670J04k612m40K042K423
967C762p36k495l54J274M37o61o08M44P23l97p83Q96J009q67k795j450J719Q73
985ij321k545l95J080J105n76L66R70N73K97J3N09J32m62p79O48K288J523j149
1004B268k893J00M202L496j827l991L93L508N76l935l819L17K036n37k768j878
1020d752l63o44m24Q89L279K89k661q65M228M066k069l468J558N792J901m041
$$ plain form
1036 2715 -556 1029 4548 4507 3383 3176 3235 2255 1738 2323 2710 1033 -1343 -941 804 291 -3405 -6569
1054 -6569 -5404 -2767 -2016 -3751 -4457 -3253 -2284 -2810 -1756 482 1072 62 -335 2120 3626 1504
1070 1504 -1079 1179 4687 4770 2516 799 2070 2790 1671 542 2137 3814 782 -2604 -2351 1416
1086 1416 1799 -2989 -6205 -2805 2064 85 -5733 -7018 -2467 245 -1169 -3219 -1636 -122 -1380
1101 -1380 -1994 1571 4637 2911 -983 520 6444 8042 2014 -3374 468 7051 6695 -92 -4469
1116 -4469 -1411 2205 516 -2558 -2469 -1089 -2467 -3717 -1648 347 -1666 -5134 -3718 1794 3318
1131 3318 -1377 -4565 -1805 3345 3998 670 -890 1395 3335 2314 965 1528 1978 712 -451 523
1147 523 1992 -193 -2932 -2463 616 1189 -1090 -2200 -1013 33 -905 -1215 563 1376 -552 -2106
$$ packed form
1036B715l271J585L519m1j124k07N9r80n17N85L87j677k376M02J745n13l696l164
1054f569J165K637P51j735p06J204R69n26J054K238N90j010l97K455J506k122
1070A504k583K258L508Q3k254j717J271P20j119j129J595J677l032l386K53L767
1086A416L83m788l216L400M869j979n818j285M551K712j414k050J583J514j258
1101a380o14L565L066j726l894J503N924J598o028n388L842O583l56o787m377
1116d469L058L616j689l074Q9J380j378j250K069J995k013l468J416N512J524
1131C318m695l188K760N150O53l328j560K285J940j021j349N63M50j266j163R74
1147E23J469k185k739M69L079N73k279j110J187J046r38l10J778Q13j928j554
$$ plain form
1163 -2106 -675 2131 1918 -1319 -2858 -247 2276 1556 -1531 -1515 731 1538 643 54 779 464 -1448
1180 -1448 -1105 2053 2838 -526 -3959 -1180 2911 2653 -1745 -3548 -357 2952 1777 -2100 -2654 -118
1196 -118 1196 44 -1104 -272 385 -610 -1227 491 2292 1230 -1237 -379 2466 2992 150 -1994 -353
1213 -353 1892 1233 -1209 -2116 -936 14 -668 -1835 -1535 -452 -307 -1239 -743 563 965 554 -60 827
1231 827 2103 1741 50 144 1262 1676 787 -224 -377 171 -73 -407 -485 -741 -1192 -984 -610 -423 -797
1250 -797 -984 -676 -149 -125 -360 -295 468 336 37 151 1339 974 -10 -217 1062 1947 361 -1268 -254
1269 -254 1311 955 -827 -1446 -284 694 -269 -1219 -424 -80 -382 -861 -34 1035 801 -964 -622 792
1287 792 1648 734 -1062 -1216 348 1450 240 -1564 -1623 -465 921 431 -882 -849 -239 625 873 857
$$ packed form
1163b106J431K806k13l237j539K611K523p20l087J6K246Q07q95n89P25l15j912
1180a448L43L158P85l364l433K779M091k58m398j803L191L309j175l877n54K536
1196a18J314j152j148Q32O57r95o17J718J801j062k467Q58K845N26k842k144J641
1213c53K245o59k442r07J180R50o82j167L00J083J45r32M96J306M02m11o14Q87
1231H27J276l62j691R4J118M14q89j011j53N48k44l34p8k56m51K08L74J87l74
1250g97j87L08N27K4k35O5P63j32k99J14J188l65r84k07J279Q85j586j629J014
1269b54J565l56j782o19J162R78r63r50P95L44l02m79Q27J069k34j765L42J414
1287G92Q56r14j796j54J564J102j210j804n9J158J386m90j313L3O10Q64K48j6
$$ plain form
1305 857 654 83 -219 505 1189 1013 -282 -838 -876 832 1009 -463 -1931 -1142 255 836 -142 -1112 -936
1324 -936 -280 587 311 -37 -1 671 252 225 229 860 632 -566 -368 839 1933 -225 -2026 -1633 843
1343 843 1576 -163 -1736 -952 199 154 -746 -390 109 207 -223 348 1100 676 -368 -868 826 1781 997
1362 997 -531 -1242 -468 55 40 -125 -886 -605 -307 84 -447 -1365 -1079 36 709 328 -461 341 557 -438
1382 -438 -453 1432 2513 919 -1199 -711 854 1179 -298 -1145 -138 729 -356 -1395 -1262 -409 -460 -686
1400 -686 99 842 381 -1016 -996 264 1461 728 -14 -37 245 207 129 -94 -406 -299 544 1015 12 -1556
1420 -1556 -1155 107 394 -545 -347 325 56 -1169 -1639 369 1880 806 -525 -257 1466 1410 -522
1437 -522 -1324 37 1523 743 -614 -613 -110 -665 -1332 -188 949 882 -387 -721 179 856 674 20 376
$$ packed form
1305H57k03n71l02P24O84j76j295n56l8J708J77j472j468P89J397N81r78r70J76
1324i36O56Q67k76l48L6O72m19k7MO31k28j198J98J207J094k158j801L93K476
1343H43P33j739j573P84J151m5r00L56M99R8m30N71P52m24j044n00J694R55p84
1362I97j528p11P74N23j5j65p61K81K98L91n31r18K86J115O73l81p89Q02K16r95
1382d38j5J885J081j594k118M88J565L25j477q47J007Q67j085j039J33Q53n1k26
1400f86P85P43m61j397K0J260J197p33p42k3K82l8p8k23l12J07Q43M71j003j568
1420a556M01J262K87r39J98O72k69j225m70K008J511j074j331K68J723n6j932
1437e22q02J361J486p80j357JN03n55o67J144J137o7j269l34R00O77j82o54L56
$$ plain form
1456 376 899 1072 742 -718 -1266 -1011 145 222 -242 -1256 -1017 -316 -875 -392 -181 690 756 323 -168 472
1476 472 983 -57 -697 242 1547 1124 -439 -1064 -336 754 822 22 15 502 -15 -583 -963 -530 -175 -349
1496 -349 -502 -679 -527 -843 -862 -1210 -354 775 899 10 -243 429 1255 1420 691 1079 1657 1897 448 -481
1516 -481 -331 40 -673 -928 -1261 -690 -791 -1418 -1471 -402 615 1112 704 443 877 1148 808 22 163 425
1536 425 -81 -907 -1682 -1327 -818 -642 -960 -542 469 1358 870 289 535 1068 1740 999 296 320 582 -27
1556 -27 -1238 -1344 -617 -207 -1126 -1346 -691 362 169 -457 -284 993 1390 450 -787 -396 222 263 -1011
1575 -1011 -1577 -907 81 -616 -939 8 1305 1481 727 855 1789 2277 1444 -191 288 330 -22 -1269 -1768
1594 -1768 -1304 -881 -1303 -1966 -1360 -90 106 -44 690 1270 1499 1380 1012 1086 1235 622 51 -531 -736 -814
$$ packed form
1456C76N23J73l30j460n48K55J156P7m64j014K39P01n59M83K11Q71O6m33m91O40
1476D72N11j040o40R39J305m23j563o25P28J090O8q00pM87n17n68l80M33L55j74
1496c49j53j77J52l16j9l48Q56J129J24q89k53O72Q26J65p29L88N78K40j449r29
1516d81J50L71p13k55l33N71j01o27n3J069J017M97m08k61M34K71l40p86J41K62
1536D25n06q26p75L55N09J76l18M18J011Q89m88n81K46N33O72p41p03K4K62o09
1556b7j211j06P27M10r19k20O55J053j93o26J73J277L97r40j237L91O18M1j274
1575a011n66O70R88o97l23R47J297J76p54J28R34M88q33j635M79M2l52j247m99
1594a768M64M23m22o63O06J270J96j50P34N80K29j19l68P4J49o13n71n82k05p8
$$ plain form
1614 -814 -1333 -1445 -1620 -983 -96 295 93 -226 398 1193 1537 1478 1339 943 740 513 -303 -986 -775 -683 -892
1635 -892 -1486 -1051 -302 -267 -464 -65 1200 1971 1238 229 257 724 472 -817 -1189 -506 32 -826 -1867
1654 -1867 -1480 99 552 286 62 1453 2419 1266 -58 70 1560 1127 -463 -998 -363 -629 -2270
1671 -2270 -2790 -1517 -60 25 -919 -284 845 1604 1058 586 1440 2561 1877 419 -500 -561 -494 -1249 -1832
1690 -1832 -1055 -523 -1126 -1560 -1088 56 751 1157 978 1142 1870 1228 446 -44 98 53 169 -425 -820 -1077
1710 -1077 -1352 -1129 -601 201 166 231 205 200 212 258 467 644 -33 -102 270 87 -899 -1414 -647 575 734 -214
1732 -214 -285 18 734 562 317 611 1263 1079 39 -534 -419 -556 -1026 -1269 -806 282 -230 -1613 -1741
1751 -1741 -160 1082 863 106 919 1690 1103 184 -305 342 733 49 -557 -725 -695 -731 -1588 -1415 189
$$ packed form
1614h14n19j12j75O37Q87L91k02l19O24P95L44n9j39l96k03k27q16o83K11R2k09
1635h92n94M35P49L5j97L99J265P71p33j009K8M67k52j289l72O83N38q58j041
1654a867L87J579M53k66k24J391R66j153j324J28J490m33j590n35O35k66j641
1671b270n20J273J457Q5r44O35J129P59n46m72Q54J121o84j458r19o1O7p55n83
1690a832P77N32o03m34M72J144O95M06j79J64P28o42p82m90J42m5J16n94l95k57
1710a077k75K23N28Q02l5O5k6nJ2M6K09J77o77o9L72j83r86n15P67J222J59r48
1732b14p1L03P16j72k45K94O52j84j040n73J15j37m70k43M63J088n12j383j28
1751a741J581J242k19p57Q13P71n87r19m89O47L91o84o06j68L0l6q57J73J604
$$ plain form
1770 189 685 111 -408 -316 702 1115 353 285 1023 1134 532 -465 -706 -487 -304 -539 -329 -506 -24 -589
1790 -589 -960 -359 420 904 709 -68 34 456 528 -220 -189 58 559 145 -197 -566 -462 -177 341 212 385
1811 385 354 72 -377 -653 -46 123 -199 -490 -464 -85 -121 -753 -748 -195 575 801 483 -171 108 219 255 298
1833 298 153 436 414 -217 -616 -382 174 39 -635 -563 276 235 -792 -890 -24 403 495 207 -84 194 449
1854 449 105 27 263 887 424 -233 -305 -216 111 -368 -865 -225 361 106 -343 -774 -433 270 363 88 -92
1875 -92 413 443 59 -176 93 470 340 -16 -591 259 6 -237 -658 -598 7 421 -353 -531 -639 390 486
1896 486 68 84 320 544 483 -313 0 434 505 278 -346 183 256 255 -815 -483 65 -22 -443 -967 -456 146
1918 146 210 -448 -360 180 380 130 73 112 133 412 168 -270 372 514 36 -385 -121 254 330 -273 -526 -167
$$ packed form
1770A89M96n74n19R2J018M13p62o8P38J11o02r97k41K19J83k35K10j77M82n65
1790e89l71O01P79M84j95p77J02M22P2p48L1K47N01m14l42l69J04K85N18j29J73
1811C85l1k82m49k76O07J69l22k91K6L79l6o32NN53P70K26l18o54K79J11L6M3
1833B98j45K83k2o31l99K34N56j35o74P2Q39m1j027r8Q66M27R2k88k91K78K55
1854D49l44p8K36O24m63o57p2Q9L27m79m97O40N86k55m49m31L41P03R3k75j80
1875i2N05L0l84k35K69L77j30l56n75Q50k53k43m21O0O05M14p74j78j08J029R6
1896D86m18J6K36K24o1p96L13M34P1k27o24N29P3jj070L32N48q7m21n24N11O02
1918A46O4o58Q8N40K00k50n7L9K1K79k44m38O42J42m78m21K64L75P6o03k53L59
$$ plain form
1940 -167 -39 -149 -347 -524 148 73 -209 -373 -66 173 345 92 144 224 621 185 -171 101 347 406 173
1961 173 -234 -255 23 -48 -179 -402 -147 0 -256 -424 -281 -88 354 -341 8 74 859 559 238 11 472
1982 472 659 151 -324 190 -60 -97 -521 -347 -136 -152 -465 -623 -226 544 423 227 303 893 925 746 503
2003 503 -94 182 274 -9 -616 -543 -525 -345 -678 -821 -503 271 -85 -347 270 588 740 448 -35 559 901
2024 901 329 -447 -403 -55 84 -478 -699 -122 478 516 -193 39 444 731 248 143 376 347 -72 -563 -388
2045 -388 -594 -485 -592 -585 -560 -53 270 305 318 314 963 1330 484 61 438 521 -230 -725 -766 -462 -543 -1131 -1090 -551
2069 -551 64 101 -288 -36 1038 1392 594 457 651 985 497 -367 -323 -131 -267 -845 -1240 -1160 -771 -685 -525
2090 -525 -67 262 706 763 699 744 891 838 434 -78 -239 -150 -367 -729 -944 -866 -441 -713 -635 -281 387 682
$$ packed form
1940a67J28j10j98j77O72p5k82j64L07K39J72k53N2Q0L97m36l56K72K46N9k33
1961A73m07k1K78p1j31k23K55J47k56j68J43J93M42o95L49O6P85l00l21k27M61
1982D72J87n08m75N14k50l7m24J74K11j6l13j58L97P70j21j96P6N90L2j79k43
2003E03n97K76R2k83o07P3J8J80l33j43L18P74l56k62O17L18J52k92m83N94L42
2024I01n72p76M4L48J39n62k21N77O00L8p09K32M05K87m83j05K33k9m19m91J75
2045c88k06J09j07PK5N07L23L5J3mO49L67q46m23L77Q3p51m95m1L04q1n88M1N39
2069e51O15L7l89K52J074L54p98j37J94L34m88q64M4J92j36n78l95Q0L89Q6J60
2090e25M58L29M44N7o4M5J47n3m04n12j61Q9k17l62k15P8M25k72P8L54O68K95
$$ plain form
2112 682 533 467 736 817 369 -99 -127 -333 -278 -774 -962 -1043 -417 -143 -553 -406 372 1184 877 594 704 1071
2134 1071 912 196 -282 -149 -122 -733 -1441 -1252 -555 -537 -944 -863 314 822 792 621 843 1359 1378 761 463
2155 463 207 -28 -452 -834 -1117 -673 -722 -928 -990 -821 -177 214 474 766 841 1074 887 559 428 398 46
2176 46 -424 -674 -684 -811 -795 -759 -1046 -534 -89 201 103 388 862 1280 593 294 87 422 187 -357 -858 -704
2198 -704 -375 -219 -759 -675 -107 173 177 288 680 1018 848 258 48 211 301 -594 -1064 -1020 -452 -640 -999 -1042
2220 -1042 -199 373 -48 37 541 1045 1463 797 466 745 914 47 -872 -462 -221 -407 -984 -1150 -643 -182
2240 -182 -368 -319 46 759 807 478 440 707 791 574 134 -227 76 -72 -916 -891 -591 -435 -175 -245 -180 302
2262 302 367 447 640 266 389 839 460 20 105 -41 -8 -543 -664 -290 -15 10 -279 -60 16 200 -10 -61
$$ packed form
2112F82j49o6K69Q1m48m68k8k06N5m96j88q1O26K74m10J47P78Q12l07k83J10L67
2134A071j59p16m78J33K7o11p08J89O97J8m07Q1J177N08l0j71K22N16J9o17k98
2155D63k56k35m24l82k83M44m9k06o2J69O44L91K60K92P5K33j87l28j31l0l52
2176D6m70k50j0j27J6L6k87N12M45K90r8K85M74M18o87k99k07L35k35n44n01J54
2198g04L29J56n40Q4N68K80MJ11L92L38j70n90k10J63R0q95m70M4N68j88l59m3
2220a042Q43N72m21Q5N04N04M18o66l31K79J69q67r19M10K41j86n77j66N07M61
2240a82j86M9L65P13M8l29l8K67Q4k17m40l61L03j48q44K5L00J56K60p0O5M82
2262C02O5Q0J93l74J23M50l79m40Q5j46L3n35j21L74K75K5k89K19P6J84k10n1
$$ plain form
2284 -61 88 598 89 -526 -517 -77 11 -349 -433 -626 216 254 99 -50 223 1011 398 193 301 614 533 129
2306 129 -15 33 -10 -179 -682 -739 -403 -102 -518 -530 -34 131 135 -204 -70 124 655 299 144 41 358 74
2328 74 -245 -316 -389 -39 -193 -339 -346 52 65 -59 -334 238 419 400 -185 72 335 463 270 -20 -58 186 26
2351 26 -253 -297 17 -103 -5 -147 -409 -98 35 -334 -279 61 142 218 -154 -407 185 145 68 -169 125 443 458
2374 458 299 -59 34 475 306 -161 -165 11 250 -197 -633 -139 22 110 -428 -597 17 19 -226 20 -46 299
2396 299 207 122 -376 197 429 224 -330 -352 353 22 -85 -278 -169 31 143 -185 -165 32 165 -93 97
2417 97 41 380 333 76 16 133 285 -21 -13 146 205 72 -85 -214 -260 -13 -18 -402 -188 -294 177 -123 -488
2440 -488 -229 171 291 89 302 675 258 139 -141 -23 209 375 -213 -250 -183 108 20 -581 -447 -216 267
$$ packed form
2284f1J49N10n09o15RM40Q8l60q4j93Q42L8j55j49K73P88o13k05J08L13q1m04
2306A29j44M8m3j69n03n7L36L01m16j2M96J65Ml39J34J94N31l56j55j03L17k84
2328G4l19p1p3L50j54j46pL98J3j24k75N72J81j9n85K57K63J28j93k90l8K44j60
2351B6k79m4L14j20R8j42k62L11J33l69N5L40Q1P6l72k53N92m0p7k37K94L18J5
2374D58j59l58R3M41j69m67mJ76K39m47m36M94J61Q8n38j69O14Kk45K46o6L45
2396B99r2q5m98N73K32k05n54k2P05l31j07j93J09K00J12l28K0J97J33k58J90
2417I7n6L39m7k57o0J17J52l06QJ59N9j33j57j29m6K47nl84K14j06M71l00l65
2440d88K59M00J20k02K13L73m17j19k80J18K32J66n88l7O7K91q8o01J34K31M83
$$ plain form
2461 267 -314 -265 -90 25 119 238 -156 400 342 298 -243 351 -19 603 25 -110 31 35 102 -347 -153 32
2483 32 -187 -399 -290 -95 -64 -456 -155 -207 37 388 -7 -395 -302 65 40 -12 -223 -109 512 -146 15 -1
2505 -1 190 145 118 -82 51 -32 87 -91 -223 314 -170 251 -456 -43 -105 160 -120 -173 167 130 198 -217 -238
2528 -238 210 358 -145 -169 -608 158 231 -498 -198 -192 161 83 -181 68 301 232 409 305 319 618 517 -18
2550 -18 -145 185 -57 44 -737 -278 -490 -321 -766 -404 -407 317 -182 -357 1 514 429 158 211 279 377 -103
2572 -103 -365 -149 226 140 -174 -508 -93 224 271 -95 -220 505 294 216 3 -64 -117 -148 -386 -340 -454 -274
2594 -274 -266 -317 -381 40 23 -143 128 129 556 432 201 108 138 298 75 -479 -318 261 -250 -363 -342 47 344
2617 344 312 -61 418 377 821 289 143 75 373 -1 -232 -510 -246 -608 -648 -496 -913 -250 -169 -307 -89 302
$$ packed form
2461B67n81M9J75J15R4J19l94N56n8m4n41N94l70O22n78j35J41MO7m49J94J85
2483C2k19k12J09J95L1l92L01n2K44L51l95l88R3L67k5n2k11J14O21o58J61j6
2505aJ91m5k7k00J33q3J19j78j32N37m84M21p07M13o2K65k80n3L40l7O8m15k1
2528b38M48J48n03k4m39P66P3p29L00OL53p8k64K49K33o9J77j04J4K99j01n35
2550a8j27L30k42J01p81M59k12J69m45L62lP24m99j75L58N13q5k71N3O8R8m80
2572a03k62K16L75q6l14l34M15L17M7l66j25P25k11p8k13o7n3l1k38M6j14J80
2594b74Qn1o4M21j7j66K71JM27j24k31r3L0J60k23n54J61N79n11j13K1L89K97
2617C44l2l73M79m1M44n32j46o8K98l74k31k78K64l62m0J52m17O63Q1j38K18L91
$$ plain form
2639 302 407 685 513 284 701 465 128 184 -61 268 -92 -327 -527 -293 222 52 -295 -394 154 557 -126
2660 -126 -25 158 208 191 -355 -397 -245 24 -483 -685 -276 -18 -90 -429 -55 339 337 173 271 370 527 215 281
2683 281 -184 -38 -23 -294 -337 -274 52 336 -31 -321 -160 198 482 175 416 579 337 278 -221 24 157
2704 157 26 -408 -785 -509 -172 -230 -147 -326 385 312 248 399 362 629 259 291 185 531 113 -48 -250 -132
2726 -132 42 -9 -402 -400 -189 133 325 -164 146 316 323 302 -17 121 -102 -130 -26 -293 -180 -92 -176 -582 -86
2749 -86 -21 230 11 322 114 367 226 -169 -293 87 168 -122 -236 -161 185 -147 -50 -40 -145 276 329 106
2771 106 343 94 131 -69 -273 100 206 -72 -302 -531 -400 -348 -146 -653 -132 224 -41 312 203 567 405
2792 405 -32 166 257 354 221 61 63 -67 64 -78 -496 -153 204 11 -234 -211 95 2 -37 -118 131 71 87
$$ packed form
2639C02J05K78j72k29M17k36l37N6k45L29l60k35k00K34N15j70l47r9N48M03o83
2660a26J01J83N0j7n46m2J52K69n07k02M09K58p2l39L74L94kj64R8R9J57l12O6
2683B81m65J46J5k71m3O3L26K84l67k90J61L58K84l07K41J63k42n9m99K45J33
2704A57j31m34l77K76L37n8Q3j79P11p3o4J51l7K67l70L2j06L46m18j61k02J18
2726a32J74n1l93KK11L22J92m89L10J70Pk1l19J38k23k8J04k67J13Q8q4m06M96
2749h6O5K51k19L11k08K53j41l95j24L80Q1k90j14P5L46l32R7J0j05M21N3k23
2771A06K37k49L7k00k04L73J06k78k30k29J31N2K02n07N21L56k65L53j09L64j62
2792D05m37J98R1R7j33j60Kj30J31j42m18L43L57j93k45K3L06r3l9q1K49o0J6
$$ plain form
2815 87 154 74 -48 149 -11 9 -192 72 182 -284 -214 -139 43 316 -80 -188 31 82 57 42 -166 -104 88
2838 88 97 31 -214 290 143 -264 -18 -36 197 -79 -91 56 69 -47 -261 -271 -21 -124 -179 -634 -380 -74 -42
2861 -42 -115 -2 154 155 216 -48 -6 276 257 25 -121 52 371 -125 -269 -312 -317 232 187 -339 -217 158 82 -40
2885 -40 -169 -32 404 136 -365 -6 432 271 55 -144 310 177 142 102 -256 -89 -34 -61 -257 -332 -207 -149
2907 -149 -311 -243 -26 156 97 -135 138 198 285 249 221 262 68 338 -58 -106 98 161 -149 -36 68 88 -37
2930 -37 -228 -170 -23 127 74 -176 -138 338 71 40 -168 -118 427 45 228 -51 66 337 -217 -49 -40 289 180
2953 180 -25 -102 -149 104 112 -131 -230 -19 106 43 -172 210 81 316 203 -100 168 13 184 -276 -205 -159 24
2976 24 -47 -133 -30 75 53 -16 -19 45 350 -13 -43 77 62 402 151 41 385 72 186 -147 -124 125 -4 -267
$$ packed form
2815H7O7q0j22J97j60K0k01K64J10m66P0P5J82K73l96j08K19N1k5j5k08O2J92
2838H8Ro6k45N04j47m07K46j8K33k76j2J47J3j16k14j0K50j03n5m55K54L06L2
2861d2p3J13J56JO1k64M2K82j9k32j46J73L19m96j44m3nN49m5n26J22L75p6j22
2885d0j29J37M36k68n01L59M38j61k16j99M54j33l5m0l58J67N5k7j96p5J25N8
2907a49j62O8K17J82n9k32K73O0Q7l6k8M1j94K70l96m8K04O3l10J13J04K0j25
2930c7j91N8J47J50n3k50L8M76k67l1k08N0N45l82J83k79J17K71n54J68RL29j09
2953A80k05p7m7K53Qk43r9K11J25o3k15L82j29K35j13l03K68j55J71m60P1M6J83
2976B4p1q6J03J05k2o9lO4L05l63l0J20j5L40k51j10L44l13J14l33K3K49j29k63
$$ plain form
3000 -267 -125 -203 144 -123 162 -210 -44 155 212 -8 -215 254 82 -218 101 -102 379 182 -43 110 104
3021 104 284 -6 -191 -104 75 -69 -212 -244 -423 -112 -227 -279 -55 226 93 98 0 98 238 -37 -145 -176 183
3044 183 209 256 -177 80 208 -35 -108 193 157 158 -187 61 -94 243 68 -247 -142 -101 177 108 -370 24 229
3067 229 -231 -66 57 -18 55 147 157 27 245 162 38 -112 -87 114 -39 -151 -164 -57 188 220 -125 -254 7
3090 7 -43 -95 -139 -18 -78 54 -210 -98 -114 101 60 -233 -256 49 1 -342 -430 -25 129 384 -51 -38 206 119
3114 119 -250 -36 219 452 214 19 111 82 96 222 -264 -50 -50 -302 13 -362 -182 241 135 -78 -13 182
3136 182 86 -13 -231 -52 212 107 -95 -257 327 -20 18 -214 -67 104 -16 -136 -137 211 -11 -53 -49 -151 -155
3159 -155 92 -85 -263 35 341 43 46 -59 235 379 67 -68 280 380 75 63 -123 245 -94 -87 -335 -320
$$ packed form
3000b67J42p8L47k67K85l72J66J99N7k20k07M69j72l00L19k03M81j97k25J53o
3021A04J80k90j85Q7J79j44j43l2j79L11j15n2K24K81j33Nr8R8J40k75j08l1L59
3044A83K6M7m33K57J28k43p3L01l6Jl45K48j55L37j75l15J05M1K78o9m78L94K05
3067B29m60J65J23p5P3R2J0j30K18q3j24j50K5K01j53j12j3J07K45L2l45j29K61
3090Gn0n2m4J21o0J32k64J12j6K15m1k93k3L05m8l43q8M05J54K55m35J3K44q7
3114A19l69K14K55K33k38j95R2k9J4J26m86K14%k52L15l75J80M23j06k13O5J95
3136A82r6r9k18J79K64j05k02j62N84l47L8k32J47J71j20j20jL48k22m2Mj02m
3159a55K47j77j78K98L06k98Lj05K94J44l12j35L48J00l05j2j86L68l39Pk48J5
$$ plain form
3181 -320 -295 78 89 -345 -47 132 298 118 30 368 319 -274 -66 140 -161 45 -147 109 23 207 -22 105
3203 105 26 196 126 -23 -82 87 40 -66 -61 -72 266 301 -127 -244 30 -110 164 -308 -97 -45 95 63 -471
3226 -471 -313 173 35 -7 -189 12 141 234 -161 5 345 169 62 264 45 324 90 136 -93 32 -46
3247 -46 65 -38 -326 81 24 -72 -210 -144 94 -94 -103 -152 102 245 237 15 191 533 263 63 45 73 224 106
3271 106 140 -48 174 216 166 -154 112 299 147 122 21 -199 -199 32 -346 -117 149 111 -245 -32 93 74 -273
3294 -273 -255 -278 57 292 -244 -488 -92 6 57 -179 60 238 82 112 0 -49 334 209 57 -74 87 194
3316 194 -23 -253 -152 41 69 -9 -288 -27 10 -217 -558 -203 193 -102 -192 -101 127 162 -159 -32 115 -57
3338 -57 436 322 62 114 153 104 305 -5 -124 280 -26 -408 10 -76 256 -79 -313 -114 255 23 153 -102
$$ packed form
3181c20K5L73J1m34K98J79J66j80q8L38m9n93K08K06l01K06j92K56q6J84k29J27
3203A05p9J70p0j49n9J69m7j06Nj1L38L5m28j17K74j40K74m72K11N2J40l2n34
3226d71J58M86j38m2j82K01J29R3l95J66L40j76j07K02k19K79k34M6k29J25p8
3247d6J11j03k88M07n7r6j38O6K38j88rm9K54J43qk22J76L42k70k00j8K8J51j18
3271A06L4j88K22M2n0l20K66J87j52k5j01k20%K31l78K29K66l8l56K13J25j9l47
3294b73J8k3L35K35n36k44L96R8N1k36K39J78j56L0j12m9L83j25j52j31J61J07
3316A94k17k30J01J93K8p8k79K61L7k27l41L55L96k95r0R1K28L5l21J27J47j72
3338e7M93j14k60N2L9m9K01l10j19M04l06l82M18q6L32l35k34J99L69k32J30k55
$$ plain form
3360 -102 384 311 141 26 150 130 -199 -9 -253 31 -161 -32 -61 -113 214 72 -253 77 -46 171 296
3381 296 -34 -163 189 -65 -39 -6 393 291 294 -106 92 87 170 -270 -184 90 -54 -255 -70 -176 -259 -165 68
3404 68 -231 -101 -104 60 350 -77 -64 231 193 -54 175 170 168 126 -35 18 -110 -103 -217 -372 68 140 23 -261 -110
3429 -110 -55 -96 394 -242 -145 68 184 44 -234 -56 93 -29 -166 -118 -30 74 6 -201 120 4 89 -166
3451 -166 -46 26 -29 59 14 -139 73 338 25 174 205 172 106 190 -133 57 -28 134 -329 29 103 -176 -557
3474 -557 -206 71 -58 109 -232 -128 174 -123 -39 -160 233 197 152 -89 -47 437 81 -244 -86 -46 112 -369
3496 -369 -203 -223 -20 297 56 59 -29 152 -90 11 -342 140 193 132 -249 63 217 248 -94 55 42 -22 9
3519 9 -236 -137 -39 56 42 -138 -106 -205 -144 -44 -115 -237 184 -86 -62 91 101 196 -107 113 55 26 -9 110 -1
$$ packed form
3360a02M86p3j70j15J24k0l29J90k44K84j92J29k9n2L27j42l25L30j23K17J25
3381B96l30j29L52k54K6L3L99j02Lm00J98nQ3m40Q6K74j44k01J85j06q3R4K33
3404F8k99J30lJ64K90m27J3K95l8k47K29nkm2j61N3j28Pj14j55M40P2j17k84J51
3429a10N5m1M90o36R7K13J16j40k78J78J49j22j37M8Q8J04o8k07L21j16Q5k55
3451a66J20P2n5Q8m5j53K12K65l13J49L1l3o6Q4l23J90q5J62m63L58P4k79l81
3474e57L51K77j29J67l41J04L02k97Q4j21L93l6m5k41M2M84l56l25J58M0J58m81
3496c69J66k0K03L17k41Lq8J81k42J01l53M82N3o1l81L12J54L1l42J49j3o4L1
3519Ik45R9R8R5j4j80L2r9O1J00p1j22M21k70K4J53J0R5l03K20n8k9l5J19j11
$$ plain form
3544 -1 124 2 -130 -151 15 113 -210 -5 -103 -54 -101 443 -154 -54 142 -17 47 -35 -20 188 145 -178 -127 -134 -48
3569 -48 -22 -51 -64 -130 10 168 87 -46 94 150 153 130 152 59 -67 -74 -189 141 -62 167 94 116 -131 -73 -145 -108
3595 -108 -114 -431 -175 -381 -249 145 -270 41 -117 111 213 -4 -91 9 116 -92 96 149 212 271 222 -333
3617 -333 225 52 -99 -146 -199 20 -171 -94 -420 -119 -103 211 15 -72 -82 81 35 -39 218 121 18 -37 -59 -232
3641 -232 -121 211 -68 249 243 88 166 113 -130 116 67 -64 -30 13 81 72 126 -143 -101 162 87 -212 -159 120 -32
3666 -32 -58 57 -52 11 -39 -67 -26 87 -30 -58 -121 -189 -145 25 68 149 284 198 49 43 -243 32 124 106 -70 217
3692 217 147 -79 -26 -204 -95 2 -181 89 -177 242 7 -114 269 52 43 81 -76 -6 156 438 30 -236
3714 -236 47 104 99 -301 -35 -65 1 -104 92 152 -114 90 259 216 138 156 -188 -190 40 -46 249 -229 -463 120
$$ packed form
3544aJ25j22j32k1J66R8l23K05r8M9m7N44n97J00J96j59O4q2J5K08m3l23N1pQ6
3569d8K6k9j3o6J40J58q1j33J40N6Lk3K2r3j26pj15L30k03K29p3K2k47N8p2L7
3595a08ol17K56k06J32L94m15L11j58K28J02k17q7J00J07k08J88N3O3N9m9n55
3617c33N58j73j51m7n3K19j91P7l26L01J6L14j96q7j0J63m6p4K57r7j03n5k2j73
3641b32J11L32k79L17oj55P8n3k43K46m9j31L4M3O8rN4k69M2K63p5k99N3K79j52
3666c2k6J15j09O3n0k8M1J13j17k8o3o8M4J70M3Q1J35q6j49ok86K75R2j8j76K87
3692B17p0k26N3j78J09R7j83K70k66M19k35j21L83k17rL8j57P0J62K82m08k66
3714b36K83N7nm00K66l0O6j05J96O0k66K04J69m3p8J8l44kK30q6K95m78k34N83
$$ plain form
3738 120 -88 64 201 -142 257 309 292 -53 40 -71 -57 -460 -243 31 84 -204 -399 -207 -219 -152 197 305
3760 305 200 -8 3 -13 156 58 18 27 -201 272 -53 -162 -217 -17 12 -64 -184 -212 63 279 117 -54 -203
3783 -203 297 160 142 -37 55 32 129 -280 -384 -33 -102 74 -251 -51 -54 2 45 -33 34 141 291 -124 89 -4
3807 -4 215 109 -141 209 127 308 -132 -194 69 235 76 4 62 -45 -9 -90 -94 -56 145 192 -71 73 318 197
3831 197 34 195 -213 -56 132 162 -43 138 410 282 -456 -160 53 -13 -350 -225 -170 -134 266 -166 9
3852 9 -195 56 -8 -115 8 513 258 -83 -66 164 97 -17 -41 -372 -63 -131 -214 -135 -71 271 -38 -281 41
3875 41 39 86 -71 -122 114 126 77 -131 -51 -167 -12 72 -104 72 364 257 -16 -272 -204 62 51 -85 -274 45
3899 45 335 -110 147 -101 365 52 -240 27 173 119 105 -177 52 3 9 -25 -35 152 -67 -240 -74 -105 176
$$ packed form
3738A20k08J52J37l43L99N2j7l45R3j11J4m03K17K74N3k88j95J92j2O7L49J08
3760C05j05k08J1j6J69r8m0Rk28M73l25j09n5K00K9p6j20k8K75K16j62j71j49
3783b03N00j37j8j79R2k3R7m09j04L51o9J76l25K00lN6M3p8O7J07J50m15K13r3
3807dK19j06k50L50q2J81m40o2K63J66j59p2N8j07L6q1mL8K01M7k63J44K45j21
3831A97j63J61m08J57J88L0k05J81K72j28p38K96K13o6l37J25N5L6M00m32J75
3852Ik04K51o4j07J23N05k55l41J7K30o7j14k4l31L09o8q3P9O4L42l09k43L22
3875D1kM7j57n1K36J2m9k08Q0j16J55Q4j76J76K92j07k73k56O8K66j1j36j89L19
3899D5K90m45K57k48M66l13k92K67J46n4j4k82K29m9Ol4j0J87k19j73J66l1K81
$$ plain form
3922 176 -39 -4 -79 -115 98 449 90 -48 137 380 0 -108 98 87 149 143 -32 22 -51 -43 -78 -200 273 101
3946 101 43 -186 26 74 -91 100 -227 34 347 238 -40 204 -175 294 34 -24 -40 -83 51 -230 -324 -39
3968 -39 -40 -254 -196 -224 -47 -52 -51 24 -8 13 52 -223 -224 -27 -231 -233 105 -49 -26 20 -318 14 -87 -214 -129 -18 -78
3995 -78 -3 76 -28 -179 190 3 -100 -101 3 216 44 -21 -9 153 43 222 -41 7 197 -121 -56 -71 128
4018 128 -105 -63 -185 -268 -357 42 301 -312 -56 -58 64 -6 332 140 257 -19 247 -27 239 46 -291 -51
4040 -51 -280 182 157 -115 -107 93 -85 -126 -142 -160 277 84 -59 -42 69 66 161 -139 -44 80 196 290 -188 -256 -171
4065 -171 -23 -92 -228 193 -19 -285 -170 -119 146 -166 -179 -177 218 112 -58 90 -132 131 293 47 58 -64
4087 -64 -14 -49 -170 167 95 -7 -40 -153 -407 215 1 6 -128 187 317 327 94 -117 -197 163 -144 -11 178
$$ packed form
3922A76k15L5p5l6K13L51l59j38J85K43l80j08K06j1O2oj75N4p3Ql5j22M73j72
3946A01n8k29K12M8j65J91l27K61L13j09k78K44l79M69k60n8j6m3J34k81r4K85
3968c9jk14N8k8J77nJP5l2K1L9k75jJ97k04kL38j54K3M6l38L32j01j27Q5J11o0
3995g8P5P9j04j51L69j87j03jJ04K13j72o5J2J62j10J79k63M8J90l18O5j5J99
4018A28k33M2j22q3q9L99K59o13K56kJ22p0L38j92J17k76K66k74K66j93l37K40
4040e1k29M62k5k72QK00j78m1j6j8M37j93j43J7J11lR5l00R5J24J16R4m78o8Q5
4065a71J48o9j36M21k12k66J15N1K65l12j3KL95j06j70J48k22K63J62k46J1j22
4087f4N0l5j21L37p2j02l3j13k54O22k14Nj34L15J30J0k33k11q0L60l07J33J89
$$ plain form
4110 178 196 376 61 123 -202 66 39 -166 -388 65 27 32 -18 -94 216 -138 260 109 -127 239 -131 -155 22
4133 22 -43 157 1 -88 -8 -115 -101 -141 -138 -44 6 5 -104 11 -55 24 -144 -269 207 199 -51 -204 92 -20 145
4158 145 119 132 218 -39 73 -160 4 125 43 20 120 -112 -36 40 104 157 -5 269 56 -102 319 303 255 40
4182 40 -8 138 -101 -194 -298 -153 80 134 103 -46 200 -95 165 -30 -55 230 -55 221 177 -201 106 177 -127
4205 -127 114 243 33 199 -47 128 254 215 86 -106 -29 151 177 -103 -293 234 8 -85 -2 245 -143 -24
4227 -24 17 -77 4 16 -65 69 38 31 109 14 -224 58 75 297 -162 -133 83 -213 -131 -170 -22 222 -85 91 -11
4252 -11 97 316 122 60 -156 17 -192 -264 -39 -5 -68 -126 -260 -60 -113 100 15 88 158 132 176 94 327 137
4276 137 58 -75 4 45 63 74 -44 33 -208 -112 20 -98 90 156 91 227 -282 -39 -65 11 -67 -187 62 -15
$$ packed form
4110A78J8J80l15O2l25K68k7k05k22M53l8Nn0p6L10l54L98j51k36L66l70k4J77
4133B2o5K00j56q9Q0j07J4m0LR4N0jj09J15o6P9j68j25M76qk50j53K96j12J65
4158A45k6J3Q6k57J12k33J64J21q2k3J00k32P6P6O4N3j62K74k13j58M21j6m8k15
4182D0m8J46k39r3j04J45K33N4l1j49K46k95K60j95k5K85k85K76m4l78L07P1l04
4205a27K41J29k10J66k46J75J26l9j29j92P7J80K6k80j90N27k26r3Q3K47l88J19
4227b4M1r4Q1J2q1J34l1pP8r5k38K82J7K22m59K9K16k96Q2l9J48K44l07J76j02
4252a1J08K19j94o2k16J73k09p2K25L4o3n8j34K00n3K13q5P3P0k6M4q2K33j90
4276A37p9j33P9M1J8J1j18P7k41R6J32j18J88O6o5J36n09K43k6P6p8j20K49p7
$$ plain form
4300 -15 153 -120 3 190 -40 -87 -78 -46 393 64 -60 -109 212 -158 -127 -47 -2 -95 -233 -90 -281 100 69 125
4324 125 12 -24 3 -103 -95 -51 37 -81 203 -70 -53 299 74 36 131 -188 303 168 -1 16 128 164 276 -2
4348 -2 96 6 -8 246 -178 -118 -37 160 -154 -47 -167 -84 -142 -95 -1 160 45 -34 8 -158 143 -144 -138 115 130
4373 130 -31 155 -23 18 111 38 -64 -3 96 60 144 24 -109 109 -10 -36 -268 184 99 -26 -100 -35 88 213
4397 213 192 65 48 14 46 -170 -29 123 263 -36 64 -110 -4 160 -185 156 -283 -133 -71 -223 -150 139
4419 139 77 -128 145 210 251 -18 190 113 173 105 -87 159 16 187 -115 -222 -104 17 -189 -420 -43 186
4441 186 -145 -84 -280 -150 70 212 -73 -102 144 -121 31 32 54 34 -39 79 157 -96 -133 -149 -98 -195 26 -197
4465 -197 77 -63 147 -139 45 175 6 -20 35 8 -73 -131 -488 -66 92 251 -6 -210 82 -281 -150 -120
$$ packed form
4300a5J68k73J23J87k30m7RL2M39l29j24m9L21l70L1Q0M5r3j38J43j91L81l1N6
4324A25j13l6K7j06QM4Q8j18K84k73J7L52k25l8R5l19M91j35j69J7J12L6J12k78
4348bR8r0j4K54m24O0Q1J97l14J07j20Q3n8M7R4J61j15p9M2j66L01k87OK53J5
4373A30j61J86j78M1R3p3j02O1R9l6Q4j20j33K18j19k6k32M52q5j25p4O5J23J25
4397B13k1j27j7l4L2k16J41J52J40k99J00j74J06J64l45L41m39J50O2j52P3K89
4419A39o2k05K73O5M1k69K08p7O0o8j92K46j43J71l02j07J18J21k06k31L77K29
4441A86l31O1j96J30K20J42k85k9K46k65J52JK2k0p3J18P8k53l7j6N1r7K21k23
4465a97K74j40K10k86J84J30j69k6N5k7q1n8l57M22J58J59k57k04K92l63J31L0
$$ plain form
4487 -120 1 6 12 -34 -44 22 -124 259 12 63 252 -22 42 -120 46 141 21 375 98 -278 199 -29 -199
4510 -199 21 63 8 -62 -93 -13 98 -66 22 -220 187 -12 13 -52 29 114 -129 59 -72 -1 -87 -168 124 -10
4534 -10 6 -105 -53 83 73 -143 -295 223 166 -185 72 5 58 59 67 -165 -37 -146 74 -88 -9 58 -62 109
4558 109 235 -287 -76 260 50 -195 162 -67 -148 -231 -148 -5 249 143 -98 -34 73 38 13 38 81 -273 176
4581 176 178 5 91 -133 -92 101 -58 -139 -39 -97 133 -280 128 -34 -34 139 -132 111 224 -136 -37 165 210
4604 210 179 -46 66 181 36 165 -196 -254 113 16 -187 167 12 -135 28 -261 70 118 54 98 -66 19
4626 19 258 149 -79 116 66 193 -69 59 86 60 -59 -130 -89 -85 236 15 121 291 -110 -130 59 -143 51
4649 51 196 -73 109 60 92 -104 -101 -152 140 124 174 47 -89 -80 157 73 139 -239 -15 -102 62 -198 375 184
$$ packed form
4487a20J21NOm6j0O6j46L83k47N1J89k74O4j62J66R5j20L54k77l76M77k28j70
4510a99K20M2n5p0l1Q0J11j64Q8k42M07j99K5o5Q1Q5k43J88j31P1q6q1K92j34
4534a0J6j11N2J36j0k16j52N18n7l51K57o7N3JQk32J28j09K20j62P9O7j20J71
4558A09J26n22K11L36k10k45L57k29q1q3Q3J43K54j06k41O4J07l5k5K5M3l54M49
4581A76Kj73Q6k24M1J93j59q1J00n8K30m13M08j62%J73k71K43J13l60R9K02M5
4604B10l1k25J12J15j45J29l61n8L67r7k03L54j55j47J63k89L31M8o4M4j64Q5
4626A9K39j09k28J95n0J27k62J28K7k6j19p1M1ML21k21J06J70m01k0J89k02J94
4649E1J45k69J82m9L2j96Ln1K92j6N0j27j36RK37q4O6l78K24q7J64k60N73j91
$$ plain form
4673 184 68 -137 23 189 -51 103 -43 159 5 30 -121 -202 11 -5 -28 -63 -179 47 -183 70 -418 378
4695 378 62 197 50 60 -84 -146 53 -12 63 63 66 -79 107 -147 -38 -254 -157 288 63 -122 -26 -142 188
4718 188 37 -114 101 -125 56 -27 71 -39 212 297 -270 64 -3 126 31 -145 24 -102 46 -78 14 -128
4740 -128 81 76 148 98 384 398 -143 40 25 43 -118 82 -160 56 169 68 78 -126 -65 172 136 -209 -120 17
4764 17 -255 -137 -21 -191 -42 -76 -42 225 78 -153 -189 -42 -158 162 16 197 -214 6 306 -215 -100
4785 -100 -202 -212 139 -39 15 -153 41 -287 222 186 -1 3 97 416 -78 117 159 65 -173 9 168 -241 -65
4808 -65 38 -31 -120 -114 -12 -42 -47 170 30 -35 -14 75 124 66 -97 -142 29 109 27 256 -31 -4 116 -107 -127 -101
4834 -101 -365 87 -1 -221 -59 108 120 156 -33 -154 21 170 30 -152 8 -51 126 273 78 230 91
$$ packed form
4673A84j16k05J60J66k40J54j46K02j54K5j51q1K13j6k3l5j16K26k30K53m88P96
4695C78l16J35j47J0j44o2J99o5P5%Lj45J86k54J09k16R7M45k25j85R6j16L30
4718A88j51j51K15k26J81q3R8j10K51Q5n67L34o7J29r5j76J69j26J48j24R2j42
4740a28K09nP2n0K86J4n41J83j5J8j61K00k42K16J13j01J0k04O1K37l6l45Q9J37
4764A7k72J18J16j70J49l4L4K67j47k31l6J47j16L20j46J81m11K20L00n21J15
4785a00j02j0L51j78N4j68J94l28N09l6j87MR4L19m94J95M2r4k38J82J59m09J76
4808f5J03o9q9OJ02l0nK17j40o5K1Q9M9n8j63m5J71Q0q2K29k87K7J20k23k0K6
4834a01k64M52q8k20J62J67J2L6j89j21J75J49j40j82J60n9J77J47j95J52j39
$$ plain form
4855 91 177 191 -50 -128 -44 87 79 -199 -104 74 -19 -14 13 -19 171 341 7 161 179 109 54 -340 163 -36 -94 51
4881 51 -130 -145 44 -146 46 -264 -130 -13 86 126 -176 79 143 12 283 296 43 18 -348 241 137 330
4903 330 137 -145 214 113 -7 -225 -169 -164 -205 137 -99 -99 -75 312 -8 18 253 200 -101 -73 53 185 289
4926 289 -34 25 -47 -24 122 51 -177 269 -80 -38 -169 -88 109 -80 -307 32 -81 97 -18 133 41 237
4948 237 65 25 98 -132 153 -203 -48 69 301 -63 -202 152 -166 75 31 -35 76 143 256 -1 35 77
4970 77 -76 -29 87 476 167 73 -28 20 -160 -69 6 -250 -15 -126 -50 -153 -105 -32 -37 -380 19 46 -43 -69 111
4995 111 -5 -58 193 396 -24 44 -228 -301 110 24 -270 -99 156 64 -403 24 150 91 -37 -160 -151 106 -86
5018 -86 -79 132 -46 58 -163 -79 38 177 -129 40 -88 3 -198 -407 -289 -133 -14 215 59 -90 31 130
$$ packed form
4855I1Q6J4k41p8Q4J31qk78R5J78r3NK7l2J90J70l34J54J8p0n5l94N03j99n8J45
4881E1j81j5J89j90J92l10J34J17R9M0l02K55O4j31K71J3k53k5l66N89j04J93
4903C30j93k82L59j01j20k18N6Nm1L42k36%K4L87l20K6K35n3l01K8J26J32J04
4926B89l23N9p2K3J46p1k28M46l49M2j31Q1J97j89k27L39j13J78j15J51r2J96
4948B37j72m0P3k30K85l56J55J17K32l64j39L54l18K41m4o6J11O7J13k57L6M2
4970G7j53M7J16L89l09r4j01M8j80R1P5k56K35j11P6j03M8P3nl43L99K7q9k6J80
4995A11j16n3K51K03m20O8k72p3M11q6k94J71K55r2m67M27J26n9j28j23RK57j92
5018h6PK11j78J04k21Q4J17J39l06J69j28R1k01k09J18J56J19K29j56j49J21R9
$$ plain form
5040 130 16 -3 64 87 67 -50 170 156 226 44 -84 -134 82 155 126 -45 -131 -253 -153 39 -104 -129 -57 -218
5064 -218 -13 -333 48 140 -26 130 -17 -94 -192 -70 196 -33 49 79 -199 -189 17 117 -108 57 53 -66 7
5087 7 -61 47 -104 27 -62 174 -66 87 141 309 -187 82 222 86 34 45 134 38 278 36 -94 288 -59
5110 -59 -39 8 9 239 68 -198 -7 -45 107 -190 245 -28 -97 260 -255 -151 88 90 35 -141 -31 -186 153
5133 153 -93 83 235 31 125 -215 227 170 -16 51 -17 -187 -77 -73 -48 -38 28 302 124 -136 38 46 325 -95
5157 -95 206 144 -68 39 -189 376 123 82 -237 31 101 112 182 19 176 261 -5 -156 -157 172 -76 -1 47 -203
5181 -203 3 22 -281 -155 -63 102 36 -111 133 -22 8 18 226 -3 194 203 186 -30 -213 -87 -262 -211 -83
5204 -83 122 -56 10 -92 -36 -58 -14 3 52 14 325 -106 188 -102 214 159 104 -120 90 125 -95 -70 -272 169
$$ packed form
5040A30j14j9O7K3k0j17K20j4P0j82j28n0K16P3k9j71q6j22J00J92j43k5P2j61
5064b18K05l20L81R2j66J56j47p7r8J22K66k29Q2L0k78J0K06J00k25J65mj19P3
5087Go8J08j51J31q9K36k40J53N4J68m96K69J40j36n2J1Q9r6K40k42j30L82l47
5110e9K0M7JK30j71k66J91l8J52k97M35k73o9L57n15J04K39Kn5j76J10j55L39
5133A53k46J76J52k04R4l40M42n7j86O7o8j70J10MK5J0O6K74j78k60J74QK79m20
5157i5L01o2k12J07k28N65k53m1l19K68P0J1P0j63J57Q5k66j51jL29k48P5M8k50
5181b03K06J9l03J26R2J65o6j47K44j55L0J0K08k29J97Rj7k16j83J26j75N1J28
5204h3K05j78O6j02N6k2M4J7M9l8L11m31K94k90L16n5n5k24K10L5k20K5k02M41
$$ plain form
5228 169 -1 234 -36 -239 12 -205 72 123 -399 -74 -158 160 -15 86 60 -117 203 -76 9 44 42 -88
5250 -88 98 82 33 -176 -166 -205 -71 -86 -152 -15 -44 61 111 -56 -266 -48 37 -118 165 61 103 -29 -51 215
5274 215 67 -41 291 143 25 8 252 7 252 -90 134 -107 21 -67 -25 -59 153 196 26 157 139 174
5296 174 81 10 -139 330 165 271 -26 6 -155 -104 242 -337 -82 -171 95 43 -261 -29 112 -59 -42 162
5318 162 -133 70 105 -12 42 -195 -149 -12 -145 -140 -168 -89 -118 -141 4 62 -59 -60 68 24 25 187 -288 38 -85
5343 -85 187 149 149 124 150 -35 1 -296 79 80 -399 -55 99 -202 -82 56 109 -175 89 -71 85 -28 -24 143
5367 143 -142 -108 131 76 104 51 181 -9 115 -20 96 -54 257 77 -216 216 149 26 -9 -11 30 -78 -131
5390 -131 -32 -108 66 -109 -150 -33 -145 -108 -56 57 -91 -31 7 -115 -123 -166 -10 -12 -167 95 -188 171 158 -23
$$ packed form
5228A69j70K35k70k03K51k17K77N1n22L25q4L18j75J01k6j77L20k79Q5L5kj30
5250h8J86j6m9k09J0l9J34j5o6J37k9J05N0j67k10K18Q5j55K83j04M2j32k2K66
5274B15j48j08L32j48j18j7K44k45K45l42K24k41J28q8M2l4K12M3j70J31j8L5
5296A74r3p1j49M69j65J06k97L2j61N1L46n79K55q9K66n2l04K32J41j71J7K04
5318A62k95K03L5j17N4k37M6J37j33Nk8P9k9k3J45N8j21jJ28m4JJ62m75L26j23
5343h5K72l8%k5K6j85L6k97L75Jm79L44J54l01J20J38N3k84K64j60J56j13MJ67
5367A43k85L4K39n5K8n3J30j90J24j35J16j50L11j80k93M32o7j23l5kM1j08n3
5390a31R9p6J74j75m1J17j12L7N2J13j48O0L8j22qm3J56kj55K62k83L59j3j81
$$ plain form
5414 -23 -79 98 113 280 -152 -8 282 139 148 -149 46 -282 -59 -35 -159 117 263 -64 -78 -20 151 -218 146
5437 146 -58 80 -121 -102 66 -38 58 5 -38 -94 72 23 96 -56 -314 69 125 -128 -54 191 52 148 32
5460 32 -105 16 226 172 50 -177 379 226 21 329 86 220 101 100 55 278 214 -171 28 87 -301 -121
5482 -121 -248 -154 -182 -91 68 -85 63 -124 13 45 -244 43 79 30 -176 -224 63 -7 -203 -120 121 -67 263
5505 263 105 -79 139 -173 169 -35 -300 49 -73 61 59 90 202 32 -75 50 48 130 73 -59 101 -192
5527 -192 -53 -16 -12 80 86 110 -80 48 81 18 4 -31 223 -10 2 -213 -42 16 -71 346 15 77 157 42 -335
5552 -335 -21 -15 -112 26 -13 -33 -141 -15 203 -54 241 13 -90 -24 364 -201 -30 71 -323 -5 214 38
5574 38 214 11 112 -136 -262 -195 -240 -71 91 -114 181 192 128 -235 120 292 88 187 24 162 343 73
$$ packed form
5414b3n6J77J5J67m32J44K90j43Rk97J95l28K23K4j24K76J46l27j4N8J71l69L64
5437A46k04J38k01J9J68j04R6n3m3n6J66m9P3j52k58L83N6k53P4K45j39R6j16
5460C2j37J21K10n4j22k27N56j53k05L08k43J34j19jm5K23o4l85J99N9l88J80
5482a21j27R4k8R1J59j53J48j87J37L2k89K87L6m9k06m8K87p0j96Q3K41j88L30
5505B63j58j84K18l12L42k04k65L49j22J34kL1J12j70j07J25kQ2n7j32J60k93
5527a92J39L7MR2OK4j90J28L3o3j4l5K54k33J2k15J71N8q7M17l31O2Q0j15l77
5552c35L14Or7J38l9k0j08J26K18k57K95k28j03O6L88n65J71J01l94L18K19j76
5574C8J76k03J01k48j26O7m5J69J62k05K95J1o4l63L55J72k04R9j63J38J81k70
$$ plain form
5596 73 -14 -5 112 -33 -66 -275 -97 -162 -45 -18 -370 -308 -115 -23 183 -8 109 112 122 217 18 45 79 -51 71
5621 71 217 141 182 -88 -5 -112 -120 25 60 24 -203 127 -1 38 164 -245 213 178 -17 -104 223 -231 178 4
5645 4 -66 -7 -92 97 -35 -64 -119 -50 57 147 89 -51 -266 -11 -253 -121 -13 73 -102 103 208 -55 -75 -32
5669 -32 -166 136 -18 31 -45 -139 -19 -259 -134 -30 -16 -43 180 24 81 -47 -161 -127 263 114 -59 107 121
5692 121 -173 -148 182 -120 169 -58 317 -43 56 -30 -60 -132 -2 198 -45 -26 -162 47 -10 148 -20 -211
5714 -211 57 69 -15 217 28 -38 120 -59 -166 -43 106 9 -107 -115 10 131 126 -66 45 -123 -158 21 -13
5737 -13 -33 210 101 -100 -57 54 202 -123 -173 32 -164 36 -298 53 16 -356 -87 89 150 108 -65 -40 166
5760 166 82 159 118 -59 -114 131 238 95 -4 11 238 7 -59 -74 -55 -19 124 -197 -119 185 152 35 -281 -97
$$ packed form
5596G3q7RJ17j45l3k09J78o5J17K7l52O2J93R2K06j91J17LJ0R5j99K7L4j30J22
5621G1J46p6M1k70Q3j07qJ45L5l6k27L30j28L9J26m09M58l5j95q7L27m54M09j74
5645Dp0N9q5J89j32k9n5O9J07R0n8j40k15K55k42J32J08Q6j75K05J05k63k0M3
5669c2j34L02j54M9p6r4J20k40J25J04J4k7K23j56N7j28j14L4L90j49j73J66J4
5692A21k94K5L30l02K89k27L75l60R9q6l0p2J30K00k43J9j36K09n7J58j68j91
5714b11K68J2q4K32j89o6J58j79j07J23J49r7j16qJ25J21nj92J11j68l5J79l4
5737a3k0K43j09k01M3J11J48l25n0K05j96K00l34L51l7l72K69J76O1m2j73K5K06
5760A66q4P7m1j77n5K45J07j43r9J5K27k31o6j5J9L6J43l21P8L04l3j17l16J84
$$ plain form
5784 -97 -124 -251 21 344 -175 65 -58 -49 -87 45 32 -229 153 -224 379 85 20 53 219 148 91 -31 -93 -64
5808 -64 -47 120 -4 84 192 -88 49 -125 286 146 -157 4 121 158 130 -220 -87 5 -37 173 -170 -172 -186
5831 -186 12 37 -132 99 229 -188 -60 26 -27 -100 191 15 -176 -16 17 -148 96 59 -147 -31 118 136
5853 136 -186 173 100 -163 -89 -116 -322 9 28 173 -4 110 -105 34 -75 -211 44 -77 -201 65 -41
5874 -41 -66 188 64 -106 88 -298 -144 -66 14 149 120 34 103 8 56 116 3 -79 -54 35 150 67 -35 25 182
5899 182 -107 -87 5 -13 -42 254 97 -112 100 -1 176 7 -72 -4 218 95 -49 156 159 174 127 119 258 30
5923 30 106 -116 67 198 -113 50 -134 172 49 130 6 146 252 143 154 84 115 352 19 -144 -17 115
5945 115 -121 -125 90 -85 71 -92 123 115 110 -311 126 159 -57 53 109 -38 -131 -374 -30 -9 -97 -109 50 -297
$$ packed form
5784i7k7j27K72L23n19K40j23Rl8J32j3k61L82l77O03k94o5L3J66p1n7j22o2K9
5808f4J7J67j24Q8J08k80J37j74M11j40l03J61J17L7k8l50J33R2m2K10l43kj4
5831a86J98K5j69K31J30m17J28Q6n3p3K91j76j91J60L3j65K44l7k06J16J49J8
5853A36l22L59p3k63P4k7k06L31J9J45j77J14k15J39j09j36K55j21j24K66j06
5874d1k5K54j24j70J94l86J54P8Q0J35k9q6O9r5M8O0j13q2K5Q9J15q3j02O0J57
5899A82k89K0R2j8k9K96j57k09K12j01J77j69p9O8K22j23j44K05LJ5m7qJ39k28
5923C0P6k22J83J31l11J63j84L06j23Q1j24J40J06j09J1p0L1K37l33j63J27J32
5945A15k36mK15j75J56j63K15qnm21M37L3k16J10N6j47r3k43L44K1q8j2J59l47
$$ plain form
5969 -297 54 -190 115 14 115 135 -391 -106 173 132 -9 -107 71 137 4 62 -197 -250 -77 65 -15 -120
5991 -120 78 -102 -94 341 360 76 -2 -54 -10 149 24 -3 -169 167 -183 -135 -371 422 111 101 -88 53 35
6014 35 55 222 118 -104 71 -162 -44 -108 248 -53 -13 47 -129 22 -97 46 25 98 -116 -235 79 -77
6036 -77 -5 -1 152 -40 -84 -21 -105 139 -462 -22 -110 -256 -139 20 134 -301 -292 -359 -142 358 48 148 -114 -94
6060 -94 163 114 -175 -156 277 66 30 215 73 -62 -156 43 63 -20 -15 -53 -119 -144 196 -163 172 80 69 -49 -41
6085 -41 213 189 226 -125 12 -191 32 29 57 168 150 126 104 42 59 195 -39 -136 -109 -150 -8 -176 -112 65 -106
6110 -106 -131 -35 264 -14 21 -61 -189 181 1 145 -72 122 65 111 -329 126 60 107 12 59 -361 -143 -9
6133 -9 147 -159 123 110 -78 156 147 -49 101 112 -50 110 149 31 93 224 194 -215 52 -105 263 31 50
$$ packed form
5969b97L51k44L05j01J01K0n26K85K79m1j41r8J78O6j33N8k59n3J73J42q0j05
5991a20J98j80QM35J9k84p8n2M4J59j25k7j66L36l50M8k36P93l11j0j89J41j8
6014C5K0J67j04k22J75k33J18o4L56l01M0O0j76J51j19J43k1P3k14j19L14j56
6036g7P2MJ53j92m4O3q4K44o01M40q8j46J17J59J14m35Ro7K17N00l10J00k62K0
6060i4K57m9k89J9M33k11l6J85j42j35r4J99K0q3Nl8o6k5L40l59L35r2j1j18Q
6085d1K54k4L7l51J37k03K23lK8J11j8k4k2o2J7J36k34r7K7m1J42j68O4J77j71
6110a06k5R6K99k78L5q2j28L70j80J44k17J94n7M6m40M55o6M7r5M7m20K18J34
6133iJ56l06K82j3j88K34rj96J50J1j62J60L9j18O2J31l0m09K67j57L68k32J9
$$ plain form
6156 50 214 -189 147 -97 131 -16 107 -263 88 38 229 230 -106 49 -40 201 -77 -137 -127 -98 120 236 -168
6179 -168 96 -145 -4 43 -187 -44 -128 113 -195 95 -134 -51 45 -240 130 -243 -112 96 -28 -163 189
6200 189 -133 3 36 62 -96 -153 -37 86 247 -61 -29 -91 -41 30 267 106 -107 308 58 -107 -96 49 120
6223 120 -270 -7 28 40 -136 -269 -139 -26 1 25 93 72 115 108 -32 -175 -120 -133 94 -172 5 21 -334 -239
6247 -239 -8 -145 102 -84 31 -12 130 -134 -180 -39 18 237 154 -212 99 -108 172 31 8 -26 309 58
6269 58 -126 51 169 -61 72 -214 -149 249 -134 234 -83 -11 85 -303 -222 59 -105 4 -63 -150 76 18 116
6292 116 -87 -114 46 -100 132 -195 -243 -263 23 -51 -313 53 191 -229 -83 193 -150 -108 7 -90 -173 -53
6314 -53 172 -67 9 -116 196 -81 197 49 -163 120 5 -105 43 -75 -63 -103 121 57 65 -64 -87 -88 58
$$ packed form
6156E0J64m03L36k44K28j47J23l70L51n0J91Jl36J55q9K41k78o0J0K9K18J16m04
6179a68K64k41J41M7k30J43q4K41l08K90k29Q3R6k85L70l73J31K08j24j35L52
6200A89l22J36L3K6j58n7J16J23J61l08L2o2N0P1K37j61k13M15k50j65J1J45P1
6223A20l90K63L5J2j76j33J30J13K7K4O8k1M3pj40j43N5j3K27k66J77J6l55R5
6247b39K31j37K47j86J15m3J42k64m6J41N7K19q3l66L11k07K80j41k3l4L35k51
6269E8j84J77J18k30J33k86O5L98l83L68l17P2R6l88Q1K81j64J09o7q7K26n8R8
6292A16k03k7J60j46K32l27m8k0K86p4k62L66J38m20J46K76l43M2J15r7q3J20
6314e3K25k39P6j25L12k77K78j48k12K83j15j10J48j18J2m0K24o4Qj29k3jJ46
$$ plain form
6337 58 145 -173 -103 11 -61 137 -156 4 -139 -330 -71 -62 -215 -43 104 82 -5 44 -155 163 29 24 178 -284
6361 -284 265 59 -155 82 64 142 -37 78 -100 -330 196 131 292 -72 -82 -74 -120 -135 107 -346 90 -119 -133
6384 -133 66 -143 -283 180 -296 6 50 134 14 4 -153 -34 98 99 -54 -103 161 -175 -109 65 253 -262
6406 -262 91 -28 5 60 204 -97 -161 392 7 258 -147 4 124 -70 -14 -188 87 -32 -28 -287 -150 42
6428 42 248 -185 98 69 -135 -152 -24 126 195 204 -208 25 -146 -141 289 45 95 39 -106 279 280 -260 110 69
6452 69 218 267 46 200 145 -138 -304 109 -110 92 -99 -6 115 -71 -63 -136 9 210 93 -19 -97 -359 152
6475 152 -158 -69 246 224 -75 -60 -38 -63 84 211 -95 -140 -86 -9 187 106 2 56 -142 -13 -318 -18 26 -67
6499 -67 16 174 -141 148 -61 23 115 -53 5 -145 85 -108 -55 71 1 -130 106 109 -298 -28 -152 152 -145
$$ packed form
6337E8Q7l18P0J14p2J98k93J60j43j91K59Rj53J72J47k2q7M9j99L18j34nJ54m62
6361b84N49k06k14K37j8P8j79J15j78k30N26o5J61l64j0Qm6j5K42m53M36k09j4
6384a33J99k09j40M63m76L02M4Q4j20j0j57J19J32Jj53m9K64l36O6J74J88n15
6406b62L53j19L3N5J44l01o4N53l85K51m05J51J20j94N6j74K75j19Mk59J37J92
6428D2K06m33K83k9k04j7J28J50O9Rm12K33j71NM30k44N0n6j45L85Jn40L70m1
6452F9J49M9k21J54n5k83j66M13k19K02j91R3J21j86Qp3J45K01j17j12p8k62N11
6475A52l10Q9L15k2k99J5K2k5J47J27l06m5N4P7J96q1j04N4j98J29l05L00M4r3
6499f7Q3J58l15K89k09Q4R2j68N8j50K30j93N3J26p0j31K36Lm07K70j24L04k97
$$ plain form
6522 -145 143 19 -277 141 57 -16 73 169 169 -210 -100 -15 -40 -5 93 -84 155 156 -170 -219 190 78 -24 -131
6546 -131 16 -62 -83 -204 -22 -139 -95 52 115 -170 -135 -101 141 -44 77 -21 89 -95 -200 -123 230 -188 -164
6569 -164 49 192 119 -32 45 -152 -2 142 -205 -101 154 127 43 -77 95 88 -92 48 278 -108 -199 330
6591 330 131 -153 75 -182 -191 106 -137 -96 -58 -74 -89 -205 -138 14 -37 -37 131 40 -42 6 -3 48 69 342 166 139
6617 139 51 -119 51 -88 -134 35 -136 44 -143 -90 -6 -47 -190 239 58 -71 184 224 1 -148 -174 -40
6639 -40 -20 -8 197 119 -26 -94 147 95 -117 -19 108 -75 -268 19 -25 -33 196 -299 -100 54 28 11 -90 -173
6663 -173 14 -312 -116 -135 158 119 -164 7 111 90 90 197 -26 6 16 -128 29 44 -5 272 -40 43 75 39
6687 39 -269 82 178 160 124 -68 -143 45 -100 5 -291 -190 -93 -67 -158 51 -32 16 -46 66 195 176 -136 6
$$ packed form
6522a45K88j24k96M18q4p3Q9R6%l79J10Q5k5L5R8j77K39Jl26m9M09j12j02j07
6546a31J47p8k1j21J82j17M4J47O3k85L5L4K42j85J21r8J10j84j05P7L53m18K4
6569a64K13J43p3j51P7j97J50J44l47J04K55k7q4j20J72pj80J40K30l86r1N29
6591C30j99k84K28k57rK97k43M1L8j6j5j16O7J52n1%J68r1q2M8rN1K1K73j76k7
6617A39q8j70J70j39m6J69j71J80j87N3Q4m1j43M29j81j29K55M0k23j49k6J34
6639d0K0J2K05p8j45o8K41n2k12R8J27j83j93K87m4qK29m95J99J54k6j7j01q3
6663a73J87l26J96j9K93l9k83J71J04k1%J07k23L2J0j44J57J5m9K77l12Q3L2l6
6687C9l08L51R6j8l6j92p5J88j45J05k96J01R7K6r1K09q3M8o2J12J29j9l12J42
$$ plain form
6711 6 131 144 101 186 -12 -61 22 -42 183 253 -202 42 -165 26 -58 -11 140 -44 23 258 57 84 126 -132 -85
6736 -85 146 60 -137 -96 96 321 -127 18 -61 -12 -18 -131 82 170 -84 -115 -195 -57 30 -16 12 126 32 -53 80
6761 80 18 -28 -486 -26 -101 -39 346 -95 143 -298 -273 13 275 -121 -74 -130 87 187 -41 -41 -223 -322 93 -4
6785 -4 -141 135 187 -35 96 39 -100 -254 95 -137 -104 -196 200 48 74 -50 169 270 -46 199 -7 62 -53
6808 -53 -38 82 -37 -37 -7 -73 -206 67 -145 145 -26 -190 187 130 189 -186 40 -45 -71 91 110 170 207 -390
6832 -390 6 54 -25 145 -107 -365 28 126 71 16 -321 234 -1 40 127 95 -19 -138 -109 63 -56 138 100
6855 100 159 -165 -3 -21 -22 168 -35 162 -318 44 169 -18 -17 -86 -202 119 -62 -4 -57 163 -177 -77 -102
6878 -102 236 140 -4 166 5 -88 358 121 74 -28 134 186 -156 -75 -53 -81 48 -42 -149 7 -274 -89 -127
$$ packed form
6711FJ25J3m3Q5j98m9Q3o4K25P0m55K44k07J91q4M7J51j84O7K35k01K7M2k58M7
6736h5K31q6j97M1J92K25m48J45p9M9oj13K13Q8k54l1q0J38Q7m6K8J14r4q5J33
6761H0o2m6m58M60p5O2L85m41K38m41K5K86K62l96M7n6K17J00k28%j82r9M15r7
6785dj37K76N2k22J31n7j39j54L49k32L3r2L96j52K6j24K19J01l16K45k06O9j15
6808e3J5J20j19%L0o6j33K73k12K90j71j64L77n7N9l75K26q5k6J62J9O0L7n97
6832c90L96M8p9J70k52k58L93R8n5n5l37N55k35M1Q7l2j14j19K9J72j19J94l8
6855A00N9l24J62j8jJ90k03J97m80L62J25j87Jo9j16L21j81N8n3K20l40J00k5
6878a02L38r6j44J70j61r3M46k37m7j02J62N2l42Q1K2k8J29r0j07J56k81J85l8
$$ plain form
6901 -127 -99 -210 -26 -166 108 -57 -70 79 6 139 114 67 72 116 336 -294 -65 -60 -33 -24 -146 -198 -224 52 27
6926 27 -61 -185 14 124 24 206 104 -130 166 69 -39 -66 -90 -66 -369 -214 -45 54 -83 -140 42 52 178
6949 178 -112 -164 162 131 211 270 102 160 45 -148 357 214 176 -80 -50 250 -37 -19 406 133 10 -110 -171
6972 -171 195 -31 220 113 -35 322 -141 -47 123 294 -173 -177 293 191 76 108 -162 -153 78 -220 -33 -157
6994 -157 -25 96 9 -58 46 -3 -9 30 124 35 161 -222 365 -78 -387 241 58 91 42 -263 -198 -1 121 -97
7018 -97 46 -236 -73 -149 -5 113 85 206 -86 -16 -118 -142 -207 70 -8 13 91 104 74 83 -335 250 -49 320
7042 320 -18 -79 178 -95 64 -12 -35 38 -276 -72 -72 116 118 78 -33 93 127 84 -102 96 -208 64 144 -156
7066 -156 -100 -110 -187 -81 -161 -46 90 -53 19 56 -156 -124 408 21 182 249 -22 -46 188 211 -254 206 -170
$$ packed form
6901a27K8j11J84j40K74j65j3J49p3J33k5m7NM4K20o30K29NK7Rj22n2k6K76k5
6926B7q8j24J99J10j00J82j02k34K96r7j08k7k4K4l03J55J69R9j37n7J82J0J26
6949A78k90n2L26l1Q0N9j68N8j15j93N05j43l8k56L0L00k87J8M25k73j23j20o1
6972a71L66k26K51j07j48L57m63R4J70J71m67mM70j02j15L2k70RK31k98J87j24
6994a57J32J21q7o7J04m9oL9R4q9J26l83N87m43l09O28j83L3m9l05O5J97J22k18
7018i7J43k82J63p6J44J18k8J21k92P0j02k4o5K77p8K1P8J3l0Rm18N85k99L69
7042C20l38o1K57k73J59p6k3P3l14K04%J88Km0j11J26L4m3j86J98l04K72Q0l00
7066a56N6j0p7J06q0J15J36j43P2L7k12L2N32l87J61O7k71k4K34K3m65M60l76
$$ plain form
7089 -170 -22 -117 -215 83 -110 -61 -213 -106 -127 -82 -182 -47 -25 -104 96 38 409 -61 -24 -198 61 51 110 279
7113 279 -2 -18 -150 -129 -114 109 -11 -224 2 -116 55 -136 70 -88 274 -146 -53 43 38 69 -34 79 -311
7136 -311 -150 123 -149 115 -95 -111 44 -11 -133 124 -111 -270 -240 150 135 56 -30 1 317 198 10 299
7158 299 -220 54 142 -75 156 -206 73 -94 -70 62 -12 -164 136 -43 162 114 -203 95 -15 190 46
7179 46 -40 -51 -122 20 -259 -43 -52 3 114 -63 21 -217 36 25 237 -8 -58 189 -110 177 59 -9 -189 -239
7203 -239 15 124 -18 -43 -34 132 18 -253 -1 -400 -123 -107 -210 -133 -53 -13 228 239 179 -109 -32 240 -70
7226 -70 22 -184 76 56 29 -169 -107 49 -37 263 57 82 110 -41 -111 -38 235 28 -240 -71 240 -143 234
7249 234 -46 204 -111 -56 -11 127 74 61 185 28 213 46 165 45 138 -92 15 -75 21 30 -77 171 127
$$ packed form
7089a70J48r5r8K98j93M9j52J07k1M5j00J35K2p9K00n8L71m70L7j74K59j0N9J69
7113B79k81j6j32K1J5K23j20k13K26j18J71j91K06j58L62m20R3R6nL1j03J13l90
7136c11J61K73k72K64k10j6J55n5j22K57k35j59L0L90j5p9q6L1L16j19j88K89
7158B99n19K74Q8k17K31l62K79j67K4J32p4j52L00j79K05m8l17K98j10K05j44
7179D6q6j1p1J42k79K16rN5J11j77Q4k38K53j1K12k45n0K47k99K87j18o8j80n0
7203b39K54J09j42k5RJ66j14k71K52l99K77J6j03P7Q0M0K41J1o0k88P7K72l10
7226g0R2k06K60k0k7j98O2J56q6L00k06K5K8j51p0P3K73k07k68J69L11l83L77
7249B34k80K50l15N5M5J38n3j3J24j57J85j67J19j20R3k30J07r0R6Rj07K48m4
$$ plain form
7272 127 -139 30 7 -190 9 -251 121 204 11 74 -196 148 147 -31 228 89 67 -27 377 5 -47 189 -27
7295 -27 14 23 59 64 33 -34 117 -124 -57 -174 -150 48 -47 -4 -94 413 62 81 103 181 35 -16 120 -139 46 -25
7321 -25 88 -111 -42 19 53 104 126 -29 165 179 173 148 279 98 -2 -236 34 66 34 141 -204 85 -39 22
7345 22 26 125 51 112 -189 60 75 62 -81 172 149 233 -11 -3 -58 -190 -122 -273 163 -243 -103 -36 -3 221 93
7370 93 137 -199 207 -153 -81 68 55 -116 -204 -100 -120 40 -7 -364 263 215 7 -42 60 204 48 -48 -15 -190
7394 -190 162 25 -16 48 -99 -144 13 -167 117 -8 -205 -382 -23 273 258 167 -141 16 -51 -159 120 -69
7416 -69 -123 217 -20 -53 196 -95 -28 -69 -62 -98 101 48 -150 -139 18 -171 3 -173 -296 -15 -84 239 -83 -154
7440 -154 260 159 35 -171 -5 17 -167 -151 78 350 59 -5 21 -141 -238 -35 -38 -18 -66 99 -102 31 -238
$$ packed form
7272A27k66J69k3j97J99k60L72Q3j93O3k70L44jj78K59j39k2r4M04l72n2K36k16
7295b7M1RL6Nl1o7J51k41O7j17K4J98r5M3r0N07l51J9K2P8j46n1J36k59J85p1
7321b5J13j99O9O1L4N1K2j55J94J4ok5J31j81j00k34K70L2l2J07l45K89j24O1
7345B2MR9p4O1l01K49J5j3j43K53k3Q4k44Qn5j32O8j51M36m06J40O7L3K24j28
7370I3M4l36M06l60P2J49j3j71q8J04k0J60m7l57O27m8k08m9J02J44j56r6L3j75
7394a90L52j37m1O4j47m5J57j80K84j25j97j77L59K96j5r1l08J57o7j08K79j89
7416f9n4L40k37l3K49k91O7m1Pl6J99n3j98J1J57j89J74j76j23K81o9L23l22p1
7440a54M14j01j24k06J66K2j84J6K29K72k91o4K6j62r7K03lK0m8J65k01J33k69
$$ plain form
7463 -238 -112 -102 -141 148 171 -12 -175 107 -114 -225 57 -42 -57 54 -79 -35 146 -198 138 201 99 27 -252
7486 -252 57 240 145 -181 -160 52 219 -38 -303 -93 -188 325 -191 -90 43 197 131 14 269 -64 -65 -93
7508 -93 223 72 -183 40 18 38 77 127 226 168 -101 25 -96 121 50 328 328 124 14 261 -243 -135 10
7531 10 45 -273 -137 167 -265 90 -38 -176 -64 9 146 23 -86 -283 158 107 -102 -144 -4 -78 119 -97
7553 -97 46 -238 12 64 103 -145 -93 -149 56 -271 204 -25 -64 170 -50 9 317 -148 10 27 197 -49 17
7576 17 58 51 363 135 91 6 74 271 -23 51 -117 14 120 -73 -198 -224 -238 -56 -113 -131 52 -157 -160 -12 -309
7601 -309 5 67 134 -241 12 196 -21 27 -29 48 -174 -136 -246 267 -330 107 85 170 -154 168 -246 -13 108
7624 108 39 260 -259 259 -2 233 70 -32 -47 26 110 41 -255 -69 97 204 156 129 -9 71 34 -275 71
$$ packed form
7463b38J26J0l9K89K3j83j63K82k21j11K82r9j5J11j33M4J81l44L36O3j02p2k79
7486b52L09J83r5l26K1K12J67k57k65K10r5N13n16J01J33J54o6j17K55l33jk8
7508i3L16j51k55K23k2K0L9N0R9n8k69J26j21K17p1K78%k04j10K47n04J08J45
7531A0L5l18J36L04m32L55j28j38J12P3J37j23j09j97M41n1k09m2J40p4J97k16
7553i7J43k84K50N2L9k48N2n6K05l27M75k29l9K34k20N9L08m65J58J7J70k46O6
7576A7M1pL12k28m4q5O8J97k94P4j68J31J06j93j25k6j4J82n7j8J83k09lJ48k97
7601c09L14O2O7l75K53J84k17M8n6P7k22L8j10N13n97M37k2Q5l24L22m14K33J21
7624A08o9K21n19N18k61K35j63j02j5P3Q4o9k96J86J66J07m8k7j38Q0l7l09L46
$$ plain form
7647 71 228 277 -22 -156 -73 145 48 -81 -135 37 6 -209 10 207 -156 -29 -2 -294 -84 -13 20 -253 110
7670 110 23 113 113 -174 -37 96 39 85 202 -21 -223 -193 -88 -206 -23 66 -58 -30 -22 226 -154 -77 -180 -10
7694 -10 -63 43 -64 -210 384 3 2 82 -69 161 234 20 282 180 15 69 25 96 -129 -180 -112 -5 -236 99
7718 99 -18 121 91 -13 -99 -76 -17 42 -14 49 -145 142 166 -121 -129 66 -140 14 170 -86 70 41 -119 34
7742 34 -96 -232 15 -212 97 91 79 -163 39 95 174 -121 87 -52 -241 -29 110 -215 38 52 164 121 218
7765 218 -12 50 185 118 -32 92 110 125 -201 63 70 128 -347 -63 -242 -84 -63 -83 206 -63 -54 61 -354 124
7789 124 328 3 65 -49 1 239 105 -4 126 141 85 -53 -45 -139 77 162 87 101 -156 -164 34 -106 -117 140
7813 140 101 -250 -68 57 -212 -51 26 58 272 142 10 127 -46 -99 22 124 -49 -116 -39 -12 -13 -145 39
$$ packed form
7647G1J57M9k99j34Q3K18r7j29n4J72l1k15K19J97l63J27K7k92K10P1L3k73L63
7670A10q7R0%k87J37J33n7M6J17k23k02L0J05j18J83Q9j24K8QK48l80P7j03J70
7694a0n3J06j07j46N94l81jQ0j51K30P3k14K62j02j65N4m4P1k25n1O8J07k31L35
7718I9j17J39l0j04q6K3N9N9n6O3j94K87K4k87qJ95k06J54J56k56J56k9j60J53
7742C4j30j36K47k27L09oj2k42K02N6P9k95K08j39j89K12J39l25K53J4J12m3R7
7765B18k30O2J35o7j50J24J8J5l26K64PN8m75K84j79J58K1k0K89k69RJ15m15M78
7789A24K04l25O2j14N0K38j34j09J30J5n6j38Qr4K16Q5p5J4k57qJ98j40j1K57
7813A40l9l51J82J25k69J61P7L2K14j30j32J17j73n3J21J02j73o7P7K7jj32J84
$$ plain form
7836 39 268 255 141 95 -39 275 51 69 61 167 -137 -25 53 66 -10 -213 85 -307 -146 -242 111 212 -52
7859 -52 42 -172 207 -20 -65 160 -11 54 49 -28 3 -127 50 -29 -109 -189 -70 165 145 -62 -217 -23 -80 58
7883 58 37 -82 56 221 137 14 164 -245 -80 -320 -118 71 -122 -238 22 279 6 -208 162 -203 289
7904 289 -190 181 18 -102 431 -158 92 -55 -17 -323 150 -133 64 -174 317 -69 113 73 173 -119 185
7925 185 242 -97 356 -290 28 232 -171 -41 116 6 -98 61 29 244 81 37 125 60 26 109 48 75 96
7948 96 80 144 -139 -41 -142 177 7 46 90 -336 29 -150 146 -232 61 -19 -161 46 33 85 -72 14 -94
7971 -94 -156 -242 274 164 -299 -201 -174 53 -80 -106 -162 56 249 -98 23 425 -318 -144 -165 -211 33 -315 153
7994 153 66 -7 -36 -12 -3 23 247 86 69 25 108 165 -21 108 43 231 -167 -205 48 -206 -224 243 188 -25 157
$$ packed form
7836C9K29j3j14m6j34L14k24J8qJ06l04J12P8J3p6k03K98l92J61r6L53J01k64
7859e2R4k14L79k27m5K25j71O5np7L1j30J77p9q0q0J19K35k0k07j55J94n7J38
7883E8k1j19J38J65q4j23J50m09J65k40K02J89j93j16K60K57k73k14L70l65M92
7904B89m79L71j63j20N33n89K50j47L8l06M73k83J97k38M91l86J82m0J00k92L04
7925A85N7l39M53o46L18K04m03J30J57j10j04J59l2K15j63m4Q8o5l4Q3o1K7K1
7948I6j6O4k83R8j01L19j70L9M4m26L65j79K96l78K93q0j42K07j3N2j57Q6j08
7971i4o2q6N16j10m63R8K7K27j33k6n6K18J93l47J21M02p43J74k1m6K44l48M68
7994A53q7p3k9K4RK6K24j61j7m4Q3N7j86J29o5J88l98l8K53k54j8M67n5k13J82
$$ plain form
8019 157 209 120 -220 -6 138 -18 28 -183 229 60 107 -200 50 -23 125 -91 1 -47 6 318 -132 -113 133
8042 133 285 -231 -69 -82 203 76 -113 17 18 162 -266 -151 -18 225 22 40 101 50 -60 70 -110 -37
8064 -37 311 8 94 106 -13 -127 83 -100 12 35 59 -12 -201 81 -63 -185 -33 -103 -67 87 258 -293 -142
8087 -142 -272 42 -94 -172 64 28 52 55 -163 -155 -90 321 -71 7 168 155 17 -64 49 -79 -273 -104 108 50
8111 50 161 49 77 -174 15 -90 -84 -13 109 200 136 154 128 131 124 227 174 -261 -50 -171 43 159 -88 -23 -23 -186
8137 -186 192 -4 233 179 -204 61 -87 256 22 -100 55 37 -1 -430 -210 -46 -13 58 -171 -327 -217 -125
8159 -125 203 -1 89 -25 -67 -7 -45 5 45 45 -181 84 -132 46 294 -71 5 6 -341 -135 214 65 -164 150
8183 150 -29 3 -36 108 76 -3 23 42
$$ packed form
8019A57N2q9l40K14J44j56M6k11M12j69M7l07K50p3J48k16R2m8N3L12m50J9K46
8042A33J52n16J62j3K85j27j89J30JJ44m28J15J33K43k03J8O1n1j10J30j80P3
8064c7L48l03Q6J2j19j14K10j83J12K3K4p1j89K82j44j22J52p0L6J54J71n51J51
8087a42j30L14j36p8K36l6K4Lk18QO5M11l92P8J61j3j38q1J13j28j94J69K12n8
8111E0J11j12K8k51J89j05OP1J22R1o4J8k6LpJ03n3m35K11j21K14J16k47O5%j63
8137a86L78j96K37n4l83K65j48L43k34j22J55j8l8m29K20J64L3P1k29j56J10R2
8159a25L28k04R0j14m2O0l8N0M0%k26K65k16J78K48l65P6Jl47K06L49j49k29L14
8183A50j79L2l9J44l2p9K6J9
8191D2
$$ Imaginary data points
##PAGE= N=2
##DATA TABLE= (X++(I..I)), XYDATA
$$ plain form
0 0 0 0 0 0 0 0 5 0 0 -8 8 -8 8 -16 16 -17 24 -32 38 -41 48 -64 72 -85 101 -118 134 -157 181 -205 237 -268
32 -268 305 -344 387 -436 487 -547 609 -678 757 -840 931 -1032 1137 -1256 1386 -1528 1684
49 1684 -1856 2043 -2252 2483 -2743 3032 -3363 3737 -4172 4680 -5282 6013 -6919 8077 -9615
64 -9615 11766 -14992 20364 -30942 59720 -305632 -908267 -148534 653152 643553 47664 -148757
76 -148757 65874 228974 139238 68582 -18290 -175100 -187593 168593 449751 171119 -384919
87 -384919 -422523 106173 458341 200632 -181025 -177573 36054 41672 -94690 -107553 -35008
98 -35008 -80320 -155754 -78988 39742 -39312 -210173 -176606 58005 200522 144568 39596
109 39596 -25990 -89007 -81906 85886 262455 196752 -25331 -70471 108302 193862 32902
$$ packed form
0@%%%%%%Nn%qJ6j6J6k4L2l3M1n6P0p9Q9j12J36j57J86k19K52k91L38l86M42n05
32b68N73o49P31q23R23j034J156j287J435j597J771j963K169k393K642k914L212
49A684l540L899m295M735n226N775o395P100p909Q852r962J1295j2932J4996j7692
64i615K1381k6758L5356n1306R0662l65352o02635P59733Q01686r599n95889j96421
76a48757K14631J63100q9736p0656q6872j56810j2493L56186K81158k78632n56038
87c84919l7604N28696L52168k57709l81657L452K13627N618j36362j2863P2545
98c5008m5312p5434P6766J18730p9054j70861L3567K34611J42517n5954j04972
109C9596o5586o3017P101J67792J76569o5703k22083m5140J78773Q5560j60960
$$ plain form
120 32902 -142504 -114116 23836 87392 51579 -37184 -155848 -205557 -57260 182130 205624
131 205624 -45933 -237879 -123549 83556 58907 -126156 -156527 7905 110685 45940
141 45940 -27046 -17575 -19793 -49363 17823 160564 164656 -22556 -146997 -35734 122035 97267
153 97267 -15911 -1537 98231 88683 -23907 -65072 -13674 -11290 -72343 -60652 25056 16535
165 16535 -119571 -188586 -70622 86363 98905 13127 -4667 64265 92822 27977 -42592
176 -42592 -42014 799 22221 3872 -36793 -76059 -79850 -19595 66858 95705 51731 16227 41470
189 41470 70270 26925 -58078 -84275 -21117 46936 30867 -53190 -111950 -77295 16129 70890
201 70890 38925 -17729 -12695 46131 68653 11444 -56904 -49179 22625 69043 38562 -32413
$$ packed form
120C2902j75406K8388J37952O3556l5813q8763j18664m9709J48297K39390K3494
131B05624k51557j91946J14330K07105k4649j85063l0371J64432J02780o4745
141D5940p2986R471k218k9570O7186J42741M092j87212j24441J11263J57769k4768
153I7267j13178J4374R9768r548j12590m1165N1398K384o1053J1691Q5708q521
165A6535j36106o9015J17964J56985J2542q5778j7794O8932K8557o4845p0569
176d2592N78M2813K1422j8349m0665l9266l791O0255Q6453K8847m3974l5504K5243
189D1470K8800m3345q5003k6197O3158O8053j6069q4057n8760L4655R3424N4761
201G0890l1965n6654N034N8826K2522n7209o8348P725P1804M6418l0481p0975
$$ plain form
213 -32413 -72389 -46740 11205 40097 17011 -19189 -21960 4267 13547 -13215 -39663 -23153
225 -23153 20559 44123 27459 -173 -8035 -989 -1722 -6998 3044 20810 18057 -10301 -32954
238 -32954 -22692 10718 34732 32000 11377 -5748 -3751 9787 7511 -22574 -48236 -29481 20195
251 20195 40945 2425 -49084 -47882 7373 50407 34596 -15508 -38891 -15039 16205 9988
263 9988 -22918 -36932 -11535 28569 43947 24133 -3189 -5724 18007 39979 34361 4410 -18847
276 -18847 -20639 -13715 -13586 -17546 -16693 -9938 879 11676 13804 5268 -6124 -6743 1399 4221 -4848
291 -4848 -14055 -17028 -19028 -17743 -7494 9623 19610 14282 6189 11946 24096 22415 4336 -9262
305 -9262 -3627 8087 5256 -11949 -22024 -13543 1110 7283 4695 -1188 -3960 -997 3020 621
$$ packed form
213c2413l9976K5649N7945K8892k3086l6200k771K6227R280k6762k6448J6510
225b3153M3712K3564j6664k7632p862P046p33n276J0042J7766k753k8358k2653
238c2954J0262L3410K4014k732k0623j7125J997J3538k276l0085k5662J8755M9676
251B0195K0750l8520n1509J202N5255M3034j5811n0104k3383K3852L1244o217
263I988l2906j4014K5397M0104J5378j9814k7322k535K3731K1972n618k9951k3257
276a8847j792O924J29l960Q53O755J0817J0797K128q536j1392o19Q142K822r069
291d848r207k973k000J285J0249J7117R987n328q093N757J2150j681j8079j3598
305i262N635J1714k831j7205j0075Q481J4653O173k588n883k772K963M017k399
$$ plain form
319 621 -7828 -11900 -4202 6121 4109 -4337 -4253 5063 9932 7526 4892 4398 2740 -663 -1436 -403
335 -403 -2988 -7905 -5844 1926 3288 -3686 -8201 -3351 4401 2658 -5989 -8881 -2070 2122 -814
350 -814 -3271 1838 9441 9897 5536 5614 9831 8563 1543 -2989 -2634 -1965 -2357 -4054 -5527 -4929 -976
367 -976 3884 3536 -2458 -5882 -1405 2273 -1702 -8067 -9021 -5507 -3668 -4039 -3238 583 2155 2134 4861
384 4861 9037 8060 2489 28 3376 8119 5529 -1674 -2607 4493 9269 5675 666 1737 5474 3922
400 3922 -2950 -8176 -9024 -9495 -10222 -9783 -10328 -10992 -8770 -4089 -233 1106 1784 3941 5878 6830 8119
417 8119 7784 3732 281 3273 9445 9212 1343 -4045 651 10020 10552 757 -6514 -3255 4526 4160
433 4160 -5225 -12573 -10931 -5728 -5009 -7652 -9302 -11403 -11790 -8115 -99 4286 465 -4643 1271 14531
$$ packed form
319F21q449m072P698J0323k012q446Q4R316M869k406k634m94j658l403p73J033
335d03k585m917K061P770J362o974m515M850P752j743q647k892O811M192k936
350h14k457N109P603M56m361P8M217j268p020m532L55O69l92j697j473N98L953
367i76M860l48n994l424M477L678l975o365r54L514J839l71Q01L821J572k1K727
384D861M176r77n571k461L348M743k590p203r33P100M776l594n009J071L737j552
400C922o872n226q48m71p27M39n45o64K222M681L856J339O78K157J937R52J289
417H119l35m052l451K992O172k33p869n388M696R369N32r795p271L259P781l66
433D160r385p348J642N203P19k643j650k101l87L675Q016M385l821n108N914J3260
$$ plain form
449 14531 20646 14082 6334 7266 15010 17575 9864 -30 -3423 -2170 -3778 -7720 -8149 -7084 -10873
464 -10873 -15496 -11410 433 4697 -4596 -11757 -5510 6008 9011 1626 -6225 -7769 -3903 1829
478 1829 7204 4244 -6498 -11002 1144 18896 22306 6450 -7302 1818 23618 29581 11044
491 11044 -10131 -12036 1121 10440 2853 -15576 -29808 -27451 -8456 6687 -1557 -26035 -31984
504 -31984 -5852 24319 22737 -5550 -21680 -3242 26889 31592 6604 -16506 -10896 13206 24290
517 24290 11184 -7206 -10849 325 13703 18378 11024 -3668 -10403 1731 20899 17803 -10502
530 -10502 -29901 -16335 7160 2479 -26123 -38932 -20303 -134 -5263 -19181 -11585 8736 14382
543 14382 4689 6365 24487 30563 13617 1735 14036 25342 11146 -10441 -9712 3280 1317
$$ packed form
449A4531O115o564p748R32P744K565p711r894l393J253j608l942m29J065l789
464a0873m623M086J1843M264r293p161O247J1518L003p385p851j544L866N732
478A829N375k960j0742m504J2146J7752L410j5856j3752R120K1800N963j8537
491A1044k1175j905J3157R319p587j8429j4232K357J8995J5143q244k4478n949
504c1984K6132L0171j582k8287j6130J8438L0131M703k4988k3110N610K4102J1084
517B4290j3106j8390l643J1174J3378M675p354j4692o735J2134J9168l096k8305
530a0502j9399J3566K3495m681k8602j2809J8629K0169n129j3918P596K0321N646
543A4382r693J676J8122O076j6946j1882J2301J1306j4196k1587P29J2992j963
$$ plain form
556 1317 -10956 -9492 2591 -30 -14941 -11597 10891 16310 -7268 -25481 -8417 18120 11716
569 11716 -21494 -34054 -10116 14509 9114 -12950 -19290 -5612 8930 13965 12538 7622 788
582 788 3726 20172 30445 13314 -13645 -14642 12435 27788 5268 -28205 -32186 -6650 11944
595 11944 2423 -17841 -20743 -3976 11130 10446 1569 -4787 -4233 1592 11054 14909 2401 -19460
609 -19460 -23919 -920 19877 10037 -16017 -19055 5412 22837 11311 -7890 -5903 10322 17322
622 17322 10065 2329 -1326 -7359 -12271 -3968 11441 8634 -16068 -30912 -12106 12941 8245 -16540
636 -16540 -19208 6552 24866 12304 -5407 -1579 12589 14212 7559 7592 9315 -1259 -16645 -16378
650 -16378 -2049 3592 -6862 -14204 -6474 4136 2350 -5352 -3551 6315 8449 1820 -123 4643
$$ packed form
556A317j2273J464J2083k621j4911L344K2488N419k3578j8213J7064K6537o404
569A1716l3210j2560K3938K4625n395k2064o340J3678J4542N035j427m916o834
582G88K938J6446J0273j7131k6959r97K7077J5353k2520l3473l981K5536J8594
595A1944r521k0264k902J6767J5106o84q877o356N54N825R462L855j2508k1861
609a9460m459K2999K0797r840k6054l038K4467J7425j1526j9201J987J6225P000
622A7322p257p736l655o033m912Q303J5409k807k4702j4844J8806K5047m696k4785
636a6540k668K5760J8314j2562j7711L828J4168J623o653L3J723j0574j5386K67
650a6378J4329N641j0454p342P730J0610j786p702J801R866K134o629j943M766
$$ plain form
664 4643 576 -13996 -19231 -2919 16581 13798 -5490 -13409 463 17645 19498 8932 1012
677 1012 3794 11202 12942 2774 -12163 -18889 -9759 6471 9910 -6386 -25159 -25017 -5923 9217
691 9217 2865 -11216 -11014 4242 12807 4106 -7634 -6093 6592 15106 13310 6270 -423 -3469
705 -3469 -1820 4206 8241 7652 4477 2619 2023 -463 -3273 -1312 5585 7654 81 -9607 -9405 -2940
721 -2940 -3667 -13171 -16643 -4703 9332 6861 -9874 -20490 -11738 6451 13536 6185 -3595 -3912
735 -3912 3205 9280 8116 3202 2380 7928 15547 16703 7336 -6634 -11731 -3281 9718 11557 -1465
750 -1465 -14460 -13805 -4525 190 -2420 -4613 -2244 355 -591 -4030 -6700 -9402 -10785 -6509 2456
765 2456 8093 3141 -6161 -8063 1609 14021 17525 12434 5315 2038 4505 7107 4129 -3709 -8296
$$ packed form
664D643m067j4572n235J6312J9500k783j9288p919J3872J7182J853j0566p920
677A012K782P408J740j0168j4937o726R130J6230L439j6296j8773J42J9094J5140
691I217o352j4081K02J5256Q565q701j1740J541J2685Q514j796p040o693l046
705c469J649O026M035n89l175j858n96k486k810J961O897K069p573r688K02O465
721b940p27r504l472J1940J4035k471j6735j0616Q752J8189P085p351r780l17
735c912P117O075j164m914q22N548P619J156r367j3970n097Q450J2999J839j3022
750a465j2995O55R280M715k610k193K369K599r46l439k670k702j383M276Q965
765B456N637m952r302j902R672J2412L504n091p119l277K467K602k978p838m587
$$ plain form
780 -8296 -2893 7023 6370 -6626 -16515 -11708 1560 8817 5697 -1353 -6281 -7415 -5020 -295 1121
795 1121 -2383 -4910 -728 5671 3321 -4669 -8379 -1000 8447 10853 5796 -62 -2645 -2894 -1094
810 -1094 3405 6702 4629 -1356 -3659 -960 1473 -502 -3699 -2284 2700 6028 4547 -1993 -8413
825 -8413 -8004 226 7884 5463 -3974 -8998 -5248 308 88 -2900 -1749 2603 5021 4026 1707 -911
841 -911 -1846 -181 4558 6818 2147 -4971 -7197 -3166 1035 1026 -673 1327 4101 3530 -958 -2798 -842
858 -842 1563 1184 -454 -1097 -1346 -2789 -3798 -3167 -241 3573 5821 4651 537 -1386 -132 1960
874 1960 1208 -941 -2160 -1002 -1770 -4394 -5037 -2717 441 2111 2285 2342 2371 329 -1180 -223 1877
891 1877 2313 805 -709 -757 -482 -1268 -1482 722 3335 2701 246 -948 226 738 -1002 -3097 -1723
$$ packed form
780h296N403R916o53j2996r889M807J3268P257l120p050m928j134K395M725J416
795A121l504k527M182O399k350p990l710P379R447K406n057n858k583k49J800
810a094M499L297k073n985k303K699K433j975l197J415M984L328j481o540o420
825h413M09Q230P658k421r437n024L750N556k20k988J151M352K418r95k319k618
841i11r35J665M739K260m671p118k226M031M201rj699K000K774n71m488j840J956
858h42K405l79j638o43k49j443j009O31K926L814K248j170m114j923J254K092
874A960p52k149j219J158p68k624o43K320L158J670J74N7K9k042j509R57K100
891A877M36j508j514m8K75p86k14K204K613o34k455j194J174N12j740k095J374
$$ plain form
908 -1723 502 738 -1172 -3332 -3711 -840 2962 3320 1040 -33 1133 3135 2382 380 459 1275 1045
925 1045 -132 -1055 -1394 -2539 -3460 -3132 -952 734 -564 -2725 -1976 913 2802 1803 376 272 1627
942 1627 1730 772 512 569 42 46 1526 2824 2370 -24 -817 914 2190 1642 -884 -2964 -3179 -1318
960 -1318 17 -1783 -4435 -4216 -1186 1290 566 -1690 -1443 756 1365 -59 -447 88 584 593 435 1316
978 1316 2589 2208 737 1422 3735 4783 2583 541 90 861 982 -1051 -1800 -1693 -1783 -1848 -1995 -1822
996 -1822 -1802 -1904 -2247 -1785 -214 -135 -2385 -5001 -4368 -394 2128 -346 -3122 -1040 3957 5472 2444
1013 2444 1082 4154 7682 7354 4034 2559 2555 1837 938 499 996 -907 -4984 -5879 -3179 -1294 -4120
1030 -4120 -7955 -4983 83 796 -3643 -6301 -2836 1394 1407 -258 -490 426 794 1203 2515 3890 3399
$$ packed form
908a723K225K36j910k160l79K871L802L58k280j073J166K002p53k002P9Q16k30
925A045j177r23l39j145r21L28K180J686j298k161P49K889J889r99j427j04J355
942A627J03r58k60N7n27MJ480J298m54k394p93J731J276n48k526k080k15J861
960a318J335j800k652K19L030K476p24k256K47K199O09j424l88N35M96Rj58Q81
978A316J273l81j471O85K313J048k200k042m51P71J21k033p49J07r0o5j47J73
996a822K0j02l43M62J571P9k250k616O33L974K522k474k776K082M997J515l028
1013B444j362L072L528l28l320j475mp18q99m39M97j903m077q95K700J885k826
1030d120l835K972N066P13m439k658L465M230J3j665k32R16L68M09J312J375m91
$$ plain form
1047 3399 2193 3745 5855 5507 2241 90 1789 4385 3219 -426 -2542 -2063 -2118 -3063 -3610 -2306
1063 -2306 -2262 -3703 -4149 -2056 -883 -3045 -4459 -1996 1839 1663 -1573 -2475 226 1738 1284 917 2658
1080 2658 4057 2124 -241 1656 5258 5000 986 -1318 2458 6022 2318 -3454 -3558 1115 2947
1095 2947 -825 -3490 -3212 -2191 -3675 -4715 -1952 -172 -3084 -6252 -3495 2095 2604 -2749 -5107
1110 -5107 885 7515 6397 -542 -2646 2761 6681 4543 715 709 2306 1176 -346 1116 1965 -599
1126 -599 -3768 -2187 2254 2053 -3737 -6716 -2697 1610 934 -3310 -4442 -1325 957 343 -941 219
1142 219 1386 494 408 2186 2878 1389 -953 -212 2973 2556 -545 -1605 70 845 -296 -946 -50
1159 -50 830 -917 -2060 -281 2128 1102 -2218 -2487 448 2379 297 -2286 -2071 513 1274 -261
$$ packed form
1047C399j206J552K110l48l266k151J699K596j166l645k116M79n5r45n47J304
1063b306M4j441m46K093J173k162j414K463L835j76l236r02K701J512m54l67J741
1080B658J399j933k365J897L602k58m014k304L776L564l704n772j04M673J832
1095B947l772k665K78J021j484j040K763J780k912l168K757N590N09n353k358
1110e107N992O630j118o939k104N407L920k138l828oJ597j130j522J462Q49k564
1126e99l169J581M441k01n790k979M019M307o76m244j132L117K282o14j284J160
1142B19J167q92q6J778O92j489k342P41L185m17l101j060J675P75j141o50Q96
1159e0Q80j747j143J779K409j026l320k69K935J931k082k583K15K584P61j535
$$ plain form
1175 -261 -904 88 170 -977 -398 2255 2415 -1144 -3307 -82 3786 2096 -2415 -3270 748 3615 1327
1192 1327 -2623 -2362 1311 1968 88 -1058 -627 296 -1215 -1611 488 1083 -458 -2557 -1230 1722
1208 1722 2025 -738 -2089 947 3232 2166 -410 -622 1195 2059 865 -795 -908 269 -259 -1393
1224 -1393 -1589 -588 -385 -1337 -1586 -779 552 -77 -1310 -431 865 1442 898 71 641 1468 1202 715
1242 715 1024 863 322 142 381 406 -71 -655 -455 -181 -603 -894 -1065 -512 -511 -1052 -627 35 -365 -981 -979 738
1264 738 1236 -251 -993 498 2327 1488 -605 -879 1090 1782 418 -714 17 355 -422 -775 -348 395
1282 395 -298 -1413 -885 683 1339 58 -1236 -609 1130 1807 423 -1561 -792 975 1154 -76 -1206
1299 -1206 -1323 -513 -57 -56 -135 -551 -715 -301 301 1013 849 281 -621 602 1657 1339 -343 -1232 -160
$$ packed form
1175b61o43R92Q2j147N79K653J60l559k163L225L868j690m511q55M018K867k288
1192A327l950K61L673O57j880j146M31R23j511l96K099N95j541k099J327K952
1208A722L03k763j351L036K285j066k576k12J817Q64j194j660j13J177n28j134
1224a393j96J001K03r52k49Q07J331o29j233Q79J296N77n44q27N70Q27k66m87
1242G15L09j61n41j80K39K5m77n84K00K74m22k91j71N53Jn41M25O62m00o16KJ717
1264G38M98j487p42J491J829q39k093k74J969O92j364j132P31L38p77l53M27P43
1282C95o93j115N28J568O56j281j294O27J739O77j384j984P69J767J79j230j130
1299a206j17Q10M56Jp9m16j64M14O02P12j64n68r02J223J055l18j682q89J072
$$ plain form
1318 -160 1199 1289 -420 -1233 -765 56 360 -387 -847 -726 -148 -396 -477 -266 329 263 -611 -49 1594 1767
1338 1767 -85 -1509 -332 1819 1977 -24 -1249 -431 853 376 -771 -743 -66 -105 -645 -780 -11 88
1356 88 -1092 -908 1030 1837 562 -818 -759 745 1176 931 206 -235 -331 558 225 -232 -818 -768 610
1375 610 596 -462 -1152 -462 -226 -624 -636 674 1188 -547 -1813 -389 1418 1533 282 -270 835 1543
1393 1543 496 -922 -381 291 84 -594 -382 70 -663 -1857 -1384 165 912 -132 -764 -206 -141 -146 127
1412 127 265 316 347 851 930 54 -961 -550 1200 1100 182 -244 261 -28 -1265 -1556 212 1075 -28
1431 -28 -2020 -762 668 682 -871 -1144 858 2315 975 -749 -490 411 244 -446 458 802 329 -1177
1449 -1177 -1694 -566 512 92 -669 230 906 812 449 -193 -166 673 1551 1390 145 -915 -787 -359 -681
$$ packed form
1318a60J359R0j709q13M68Q21L04p47m60J21N78k48q1K11N95o6q74N62J643J73
1338A767j852j424J177K151J58k001j225Q18J284m77j147K8O77l9n40j35P69R9
1356H8j180J84J938Q07j275j380N9J504M31k45p25m41r6Q89l33m57n86N0J378
1375F10j4j058o90O90K36l98j2J310N14j735j266J424J807J15j251n52J105P08
1393A543j047j418N41O72k07o78K12M52p33j194M73J549P47j044o32N58O5nK73
1412A27J38N1L1N04P9q76j015M11J750j00r18m26N05k89j237k91J768Q63j103
1431b8j992J258J430J4j553k73K002J457j340j724K59R01j67o90R04L44m73j506
1449a177n17J128J078m20p61Q99O76r4l63o42K7Q39Q78j61j245j060J28M28l22
$$ plain form
1468 -681 -628 -263 33 -119 -1059 -1123 -237 140 -297 -514 305 1131 393 -876 -1368 146 1364 842 29 340
1488 340 583 365 178 110 611 1234 466 -75 -214 -62 -564 -960 -905 -497 -21 -218 -1682 -1859 -1297 -182
1508 -182 -172 -727 -171 518 1211 437 260 1098 1711 1477 955 522 576 486 -616 -1393 -763 -222 -510 -1005 -1201
1529 -1201 -629 164 299 174 749 1440 1180 679 127 377 547 -299 -1254 -1283 -903 -659 -1306 -1754 -1253 292
1549 292 886 322 136 811 1433 1295 553 785 1301 812 -176 -926 -511 -254 -1010 -1471 -961 415 808 -122
1569 -122 -247 541 1409 1069 -80 -453 176 310 -527 -1607 -1402 -570 -841 -1193 -1118 92 789 474 207
1588 207 1215 2435 1936 1389 550 968 1244 206 -957 -1070 -838 -1025 -1699 -1591 -1176 -634 -975 -579 222
1607 222 1371 900 680 954 1088 1258 727 312 -418 -395 -337 -749 -1554 -1850 -1444 -875 -316 -258 51 450 857
$$ packed form
1468f81N3L65K96j52r40o4Q86L77m37k17Q19Q26p38j269m92J514J218n22q13L11
1488C40K43k18j87o8N01O23p68n41j39J52n02l96N5M08M76j97j464j77N62J115
1508a82J0n55N56O89O93p74j77Q38O13k34n22m33N4r0j102p77O30N41k88m95j96
1529a201N72P93J35j25N75O91k60n01n52K50J70q46r55k9L80K44o47m48N01J545
1549B92N94n64j86O75O22j38p42K32N16m89r88p50M15K57p56m61N10J376L93r30
1569a22j25P88Q68l40j149l73O29J34q37j080K05Q32k71l52P5J210O97l15k67
1588B07J008J220m99n47q39M18K76j038j163j13K32j87o74J08M15N42l41L96Q01
1607B22J149m71k20K74J34J70n31m15p30K3N8m12q05k96M06N69N59N8L09L99M07
$$ plain form
1628 857 1356 962 915 984 1580 716 -217 -605 -452 -772 -1577 -1301 -197 221 -447 -1068 -58 1075 1013 432
1648 432 418 1369 1486 -184 -1433 -1082 -133 -632 -1857 -1809 -682 335 -641 -1193 297 1755 2123 868
1666 868 1026 1861 1830 67 -528 47 633 -544 -1857 -2155 -1394 -723 -1622 -1439 -342 1412 1245 635 356
1685 356 1613 1988 1354 645 876 900 -524 -1593 -1945 -1087 -792 -1213 -1006 -621 -55 2 34 546 1202 1695
1705 1695 1784 774 257 53 26 -139 30 -155 -387 -616 -763 -785 -814 -386 73 385 484 371 390 505 -373
1726 -373 -596 217 773 406 -1113 -1457 -663 115 -578 -648 390 766 976 185 51 775 1356 851 251 629
1746 629 860 -157 -1550 -1716 -608 324 -822 -1309 -856 357 101 -471 174 1231 1727 1113 180 429
1764 429 806 -44 -377 -337 160 117 -713 -1627 -1261 -261 61 -417 -368 733 724 293 -31 386 866 937 486
$$ packed form
1628H57M99l94m7O9N96q64r33l88J53l20q05K76J104M18o68o21J010J133o2n81
1648D32j4R51J17j670j249L51R49m99j225M8J127J017r76n52J490J458L68j255
1666H68J58Q35l1j763n95N75N86j177j313k98P61O71q99J83J097J754j67o10k79
1685C56J257L75o34p09K31K4j424j069l52Q58K95m21K07L85N66N7L2N12O56M93
1705A695Q9j010n17k04k7j65J69j85k32k29j47k2k9M28M59L12R9j13J9J15q78
1726c73k23Q13N56l67j519l44P94P78o93p0J038L76K10p91j34P24N81n05o00L78
1746F29K31j017j393j66J108R32j146m87M53J213k56n72O45J057M96o14r33K49
1764D29L77q50l33M0M97m3q30r14L66J000L22m78M9J101rm31l24M17M80P1m51
$$ plain form
1785 486 310 112 -102 -668 -697 -753 168 508 -194 -762 -446 673 351 -148 -328 364 701 402 -383 -271
1805 -271 -4 300 197 87 90 357 25 -228 145 741 997 374 -189 -428 66 -143 -601 -1003 -429 291 -83
1826 -83 -527 -747 -633 148 78 149 236 847 539 55 -407 428 1261 318 -394 113 349 180 -702 -788 -340 255
1848 255 -88 -381 -636 -370 45 -498 -461 88 629 393 -169 -209 316 464 -258 -193 -12 490 227 -517 -950
1869 -950 -407 223 339 -190 -656 -270 -61 72 -241 190 479 409 -151 71 400 542 144 -290 28 470
1889 470 388 -227 -795 -349 -198 57 -337 -470 -166 162 236 -362 -50 238 423 -164 -140 402 695 571 -160
1910 -160 98 703 841 -288 -641 -365 291 -113 -538 -467 -127 276 -187 -541 -479 287 181 -315 -373 424 543
1931 543 130 -166 -12 804 556 -109 -509 24 314 287 -505 -396 -8 422 -252 -870 -406 445 20 -243
$$ packed form
1785D86j76j98k14n66k9n6R21L40p02n68L16J119l22m99j80O92L37k99p85J12
1805b71K67L04j03j10LK67l32k53L73N96K56o23n63k39M94k09m58m02N74P20l74
1826h3m44k20J14P81p0P1Q7O11l08m84m62Q35Q33r43p12N07K36j69q82q6M48N95
1848B55l43k93k55K66M15n43L7N49N41k36n62m0N25J48p22O5J81N02k63p44m33
1869i50N43O30J16n29m66L86K09J33l13M31K89p0n60K22L29J42l98m34L18M42
1889D70q2o15n68M46J51K55l94j33L04L28P4n98L12K88J85n87K4N42K93j24p31
1910a60K58O05J38j129l53K76O56m04m25P1L40M03m63l54O2P66j06m96n8P97J19
1931E43m13k96J54Q16k48o65m00N33K90k7p92J09L88M30o74o18M64Q51m25k63
$$ plain form
1951 -243 -392 -216 278 37 -258 287 306 175 -96 -102 118 467 297 -109 -181 282 312 -137 -272 -429 26 354
1973 354 -560 -780 -338 96 -320 -543 -467 653 521 182 16 365 891 240 159 75 452 222 -120 -956 -352
1994 -352 -183 -852 -1265 -557 -379 265 238 -254 289 576 547 598 272 424 557 483 -143 -329 -224 -136 -459 -790
2016 -790 -622 -299 82 -598 -340 -41 719 307 -229 -22 748 856 -298 -208 158 266 -347 -635 -399 116
2036 116 175 -94 146 380 592 364 217 261 410 297 59 -536 -571 -200 -528 -377 -908 -640 -128 -114 -7
2057 -7 -36 599 1064 904 520 674 990 612 66 -565 -342 -163 -849 -1494 -1295 -522 -123 -655 -658 487 984
2078 984 917 962 777 1254 1042 483 262 -54 140 -320 -1020 -1075 -735 -727 -715 -615 -561 -70 611 516 389 657 1139
2101 1139 1137 115 -66 294 322 -635 -1083 -778 -447 -462 -542 -670 121 390 420 375 504 710 1032 604 -181 16
$$ packed form
1951b43j49J76M94k41k95N45J9j31k71oK20L49j70m06p2M63L0m49j35j57M55L28
1973C54r14k20M42M34m16k23P6J120j32l39j66L49N26o51q1q4L77k30l42q36O04
1994c52J69o69m13P08J78O44k7m92N43K87k9N1l26J52J33p4o26j86J05Q8l23l31
2016g90J68L23L81o80K58K99P60m12n36K07P70J08j154R0L66J08o13k88K36N15
2036A16N9k69K40K34K12k28j47M4J49j13k38n95l5L71l28J51n31K68N12J4J07
2057gk9O35M65j60l84J54L16l78n46o31K23J79o86o45J99P73L99n32lJ145M97
2078I84o7M5j85M77k12n59k21l16J94m60p00n5L40QJ2J00N4M91O81r5j27K68M82
2101A139kj022j81L60K8r57m48L05L31j5q0j28P91K69L0m5J29K06L22m28p85J97
$$ plain form
2123 16 130 -171 -914 -776 -561 -274 -682 -573 -55 373 468 261 911 1084 1283 635 162 242 287 -122 -902
2144 -902 -1150 -773 -512 -1248 -1010 -808 83 505 173 582 1097 1334 1349 806 797 668 249 -227 -353 -708 -649
2165 -649 -885 -1322 -1029 -701 -257 -245 -120 286 592 860 996 755 749 1024 447 70 -552 -436 -151 -580 -980
2186 -980 -571 -359 28 -287 -261 307 669 894 387 412 635 534 49 -323 -583 -211 -82 -476 -912 -318 -38
2207 -38 247 -9 251 1063 1134 491 506 484 644 52 -233 -570 -482 -583 -1054 -1263 -962 -644 -112 -240 -254 506
2229 506 930 887 441 779 1371 663 336 1 116 165 -471 -1155 -627 -409 -243 -745 -481 -27 487 291 287
2250 287 401 750 967 423 -32 146 139 -422 -677 -764 -471 -556 -750 -499 -498 68 190 296 63 294 542 544 356
2273 356 74 352 271 -43 -403 -212 -130 -88 -82 -92 27 461 155 206 311 364 255 56 -154 -366 -66 -445 -818
$$ packed form
2123A6J14l01p43J38K15K87m08J09N18M28R5k07O50J73J99o48m73Q0M5m09p80
2144i02k48L77K61p36K38K02Q91M22l32M09N15K37J5n43rj29m19m76j26l55N9
2165f49k36m37K93L28M44J2J25M06L06K68J36k41oK75n77l77o22J16K85m29m00
2186i80M09K12L87l15K6N68L62K25n07K5K23j01m85l72k60L72J29l94m36N94K80
2207c8K85k56K60Q12P1o43J5k2J60n92k85l37Q8j01m71k09L01L18N32j28j4P60
2229E06M24m3m46L38N92p08l27l35J15M9o36o84N28K18J66n02K64M54N14j96m
2250B87J14L49K17n44m55J78pn61k55q7K93q5j94K51JN66J22J06k33K31K48Kj88
2273C56k82K78q1l14l60J91Q2M2Oj0J19M34l06N1J05N3j09j99k10k12L00l79l73
$$ plain form
2296 -818 -631 -133 92 -268 -473 -261 290 458 224 556 694 692 384 7 76 307 447 -284 -388 -281 -49
2317 -49 -417 -672 -651 46 141 -11 -192 -92 610 6 -166 228 533 434 154 -346 -444 -98 68 -414 -324 27
2339 27 166 -97 -679 -600 -114 82 128 -117 -35 119 416 27 103 122 610 173 134 -192 -143 160 -45 -524 -174
2362 -174 207 -51 -305 -424 -120 -18 -317 -180 -58 88 -29 142 -101 -285 418 307 128 -161 284 427
2382 427 -121 77 -31 417 387 -93 -203 41 162 -63 -175 -164 -77 -86 -591 -391 -51 190 -54 -435 229 186
2404 186 327 -204 -193 130 340 46 -356 -158 208 -88 -142 -550 127 289 163 -272 -294 -13 90 178 -202
2425 -202 -24 217 147 140 12 168 522 129 -41 -43 180 -34 -457 -362 -257 -132 -22 -151 -585 -2 19 -12 -239
2448 -239 105 371 507 99 -163 232 303 217 -415 -46 456 134 16 -346 -335 110 -129 -376 -241 45 -12
$$ packed form
2296h18J87M98K25l60k05K12N51J68k34L32J38kl08l77O9K31J40p31j04J07K32
2317d9l68k55K1O97R5j52j81J00P02o04j72L94L05r9k80n00r8L46J66m82R0L51
2339B7J39k63n82P9M86J96M6k45Q2J54K97l89P6J9M88m37l9l26M9L03k05m79L50
2362a74L81k58k54j19L04J02k99J37J22J46j17J71k43j84P03j11j79k89M45J43
2382D27n48J98j08M48l0m80j10K44J21k25j12J1Q7rn05K00L40K41k44l81O64m3
2404A86J41n31J1L23K10k94m02J98L66k96n4m08O77J62j26m35k2K81J03Q8l80
2425b02J78K41p0pj28J56L54l93j70kK23k14m23R5J05J25J10j29m34N83K1l1k27
2448b39L44K66J36m08k62L95P1q6o32L69N02l22j18l62J1M45k39k47J35K86n7
$$ plain form
2469 -12 3 -397 -87 429 187 149 153 201 261 78 232 -41 418 180 -134 -133 -276 292 -199 -374 -323 20 -336
2492 -336 -326 -369 -288 159 260 -86 -130 343 -10 -375 -431 -162 33 294 202 -161 212 410 215 33 -209 250
2514 250 187 184 -254 -303 -10 2 -2 -240 -63 82 125 -223 94 390 176 -89 -110 246 315 317 -54 -248 166 103
2538 103 -201 -746 -622 -206 -308 -407 -172 270 430 285 258 393 480 581 402 283 470 321 230 -418 -345 -160
2560 -160 -120 -539 -630 -534 -316 -55 -103 -255 137 591 168 -122 -109 201 186 -92 -286 153 143 88 -131 -197 49
2583 49 168 -29 -22 333 303 296 154 85 166 196 193 -293 -363 23 -173 -171 -394 -508 -71 -7 5 -140 205 356 541
2608 541 -53 213 482 146 -250 -348 -183 -164 -94 -480 -362 94 323 -9 -1 192 749 785 329 685 672 498
2630 498 286 18 -491 -56 -533 -703 -702 -650 -549 -619 -327 -417 -45 168 67 268 403 782 517 249 38 30
$$ packed form
2469a2J5m00L10N16k42l8MM8O0j83J54k73M59k38l14Jj43N68m91j75N1L43l56
2492c36J0m3Q1M47J01l46m4M73l53l65n6K69J95K61r2l63L73J98j95j82k42M59
2514B50o3lm38m9K93J2mk38J77J45M3l48L17K96k14k65k1L56O9Kl71j94M14o3
2538A03l04n45J24M16j02r9K35M42J60j45k7J35Q7J01j79j19J87j49r1o48P3J85
2560a60M0m19r1R6K18K61m8j52L92M54m23k90J3L10j5k78j94M39j0n5k19o6K46
2583D9J19j97PL55l0pj42o9Q1L0lm86p0L86j96Kk23j14M37O4J2j45L45J51J85
2608E41n94K66K69l36l96r8J65J9P0l86J18M56K29l32QJ93N57L6m56L56j3j74
2630D98k12k68n09M35m77j70JN2J01p0K92r0L72K13j01K01J35L79k65k68k11q
$$ plain form
2652 30 220 -188 -601 -258 -11 118 -297 -309 -11 332 304 106 172 316 350 9 -166 10 119 -46 -481 -449
2674 -449 10 -314 -182 -244 -230 382 201 309 1 304 631 174 240 -172 -36 -140 -289 -422 -362 -295 -24 -492
2696 -492 -222 2 419 303 310 457 665 473 168 278 195 48 -535 -427 -372 -294 -479 -500 -470 -206 -50 -102 59
2719 59 328 337 285 175 384 489 432 112 -170 -228 6 -114 -313 -430 -337 106 8 -236 86 228 139 211 154 132
2743 132 -274 3 -136 -228 110 -33 -18 -693 -316 -47 -96 194 -93 69 -37 320 9 90 -19 183 157 -287
2765 -287 -113 30 -40 -224 -65 -89 104 240 -81 91 144 572 319 218 318 368 250 -79 -51 -448 99 -454
2787 -454 -490 -585 -409 -34 -256 -252 248 351 319 -89 -117 209 381 372 160 173 298 75 -154 -59 -221 -128 -40 -349
2811 -349 -39 83 -134 -1 -234 -26 236 233 -167 105 13 119 -36 -322 -233 85 130 13 6 -121 248 35
$$ packed form
2652C0J90m08m13L43K47J29m15j2K98L43k8j98O6J44L4l41j75J76J09j65m35L2
2674d49M59l24J32o2J4O12j81J08l08L03L27m57O6m12J36j04j49j33O0O7K71m68
2696d92K70K24M17j16PJ47K08j92l05J10q3j47n83J08N5P8j85k1L0K64J56n2J61
2719E9K69Rn2j10K09J05n7l20k82n8K34j20j99j17R3M43r8k44L22J42q9P2n7k2
2743A32m06K77j39r2L38j43J5o75L77K69m9K90k87J62j06L57l11Q1j09K02k6m44
2765b87J74J43p0j84J59k4J93J36l21J72N3M28k53j01J00N0j18l29K8l97N47n53
2787d54l6r5J76L75k22MN00J03l2m08k8L26J72rk12J3J25k23k29R5j62R3Q8l09
2811c49L10J22k17J33k33K08K62lm00K72r2J06j55k86Q9L18M5j17pj27L69k13
$$ plain form
2833 35 -91 -260 74 48 -79 -282 -164 33 61 -84 63 74 373 154 -131 53 116 340 302 38 -15 119
2855 119 -25 31 -251 123 -26 -256 -388 -420 85 -96 -351 -84 137 -21 -247 130 133 262 184 184 130 232 131
2878 131 260 -173 -220 -27 23 8 -347 -36 15 -404 -277 -258 30 69 -122 -209 158 226 302 157 301 324 100
2901 100 -70 203 122 50 100 -434 -461 146 111 -80 -190 -482 -75 214 -207 -111 10 174 354 127 -161 310
2923 310 320 425 -68 -254 209 347 -54 152 -30 141 149 14 -170 47 -81 -226 0 -105 -86 100 245
2944 245 -86 177 123 18 21 -65 23 135 -220 38 227 72 125 -198 86 100 -2 -96 -139 -21 -18 -61 -357 -123
2968 -123 106 175 -40 -172 -33 184 227 102 66 75 97 -4 -240 -202 174 0 59 27 -232 -13 -63 66 -283
2991 -283 51 269 136 -210 27 44 276 -50 94 134 357 116 -173 -329 24 168 -203 -55 -82 9 -108
$$ packed form
2833C5j26j69L34k6j27k03J18J97K8j45J47J1K99k19k85J84O3K24l8k64n3J34
2855A19j44N6k82L74j49k30j32l2N05j81k55K67K21j58k26L77LJ29p8%n4J02j01
2878A31J29m33m7J93N0j5l55L11N1m19J27J9K88L9j91q7L67O8P6j45J44K3k24
2901A00j70K73q1p2N0n34k7O07l5j91j10k92M07K89m21R6J21J64J80k27k88M71
2923C10J0J05m93j86M63J38m01K06j82J71Qj35j84K17j28j45K26j05J9J86J45
2944B45l31K63n4j05Lq6Q8J12l55K58J89j55N3l23K84J4j02r4m3J18Lm3k96K34
2968a23K29O9k15j32J39K17M3j25l6RK2j01k36L8L76j74N9l2k59K19n0J29l49
2991b83L34K18j33l46K37J7K32l26J44M0K23k41k89j56L53J44l71J48k7R1j17
$$ plain form
3012 -108 -274 -190 83 83 22 -185 70 351 210 -10 151 140 302 56 53 103 268 154 -83 -172 30 -215 59
3035 59 -127 -176 -21 3 3 -219 -188 -68 70 -153 5 239 209 356 -117 -116 131 141 -15 292 93 152 -25 -243
3059 -243 -123 -166 -41 -76 -128 -244 119 58 63 -93 182 92 -90 291 170 126 274 -55 -84 -79 -81 55 11 39 20
3084 20 212 152 -109 162 61 180 -119 -25 92 116 397 257 -28 216 244 120 -45 -275 32 25 -158 -385
$$ packed form
3012a08j66Q4K73%o1k07K55K81j41k20J61j1J62k46lN0J65j14k37q9K02k45K74
3035E9j86m9J55K4%k22L1J20J38k23J58K34l0J47m73JK47J0j56L07j99N9j77k18
3059b43J20m3J25l5n2j16L63o1Nj56K75r0j82L81j21m4J48l29k9NkJ36m4K8j9
3084B0J92o0k61K71j01J19k99R4J17K4K81j40k85K44K8j24j65k30L07pj83k27
$$ [...]
8191c06
##END NTUPLES=NMR FID
##END=
