##TITLE=1H_Pr 5063
 DMSO,8 sc, 
 23.9.2021
##JCAMPDX= 6.0         $$ Bruker NMR JCAMP-DX V2.0
##DATA TYPE= NMR FID
##DATA CLASS= NTUPLES
##ORIGIN= UXNMR, Bruker Analytische Messtechnik GmbH
##OWNER= root
$$ XWIN-NMR		Version 3.5
$$ Thu Sep 23 12:22:51 2021 Russian Standard Time (UT+4h)  she@DPX200
##.OBSERVE FREQUENCY= 200.1314
##.OBSERVE NUCLEUS= ^1H
##.DELAY= (6, 6)
##.ACQUISITION MODE= SIMULTANEOUS
##.ACQUISITION SCHEME= undefined
##.AVERAGES= 8
##.DIGITISER RES= 18
##SPECTROMETER/DATA SYSTEM= spect
##.PULSE SEQUENCE= zg30
##.SOLVENT NAME= DMSO
##.SHIFT REFERENCE= (INTERNAL, DMSO, 0, 15.7039)
##AUDIT TRAIL= $$ (NUMBER, WHEN, WHO, WHERE, WHAT)
$$ ##TITLE= Audit trail, XWIN-NMR		Version 3.5
$$ ##JCAMPDX= 5.01
$$ ##ORIGIN= Bruker BioSpin GmbH
$$ ##OWNER= she
$$ F:/spectra/data/she/nmr/H-F/1/audita.txt
$$ ##AUDIT TRAIL=  $$ (NUMBER, WHEN, WHO, WHERE, WHAT)
(   1,<2021-09-23 12:21:40.21 +0400>,<she>,<DPX200>,
      <created by zg, POWCHK disabled, PULCHK disabled
       configuration hash MD5:
       00 E9 B6 7A A2 85 ED C7 34 08 36 98 17 FE 4E 26
       data hash MD5: 16K
       91 81 F0 3A B9 3D 43 CA 7E 37 0D 11 F9 0B ED C2>)
$$ ##END=
$$ 
$$ hash MD5
$$ 23 89 B2 AF 75 CA F0 10 8B 17 FB 2C 0A CA 6C 11
##$RELAX= 
##$RELAX= 
##$RELAX= 
##$RELAX= 
##$RELAX= 
##$RELAX= 
$$ Bruker specific parameters
$$ --------------------------
##$DU= <F:/spectra>
##$EXPNO= 1
##$NAME= <H-F>
##$PROCNO= 1
##$TYPE= <nmr>
##$USER= <she>
##$AMP= (0..31)
100 100 100 100 100 100 100 100 100 100 100 100 100 100 100 100 100 100 
100 100 100 100 100 100 100 100 100 100 100 100 100 100 
##$AQSEQ= 0
##$AQ_mod= 1
##$AUNM= <au_zg>
##$AUTOPOS= <>
##$BF1= 200.13
##$BF2= 200.13
##$BF3= 200.13
##$BF4= 200.13
##$BF5= 200.13
##$BF6= 200.13
##$BF7= 200.13
##$BF8= 200.13
##$BYTORDA= 1
##$CFDGTYP= 0
##$CFRGTYP= 5
##$CHEMSTR= <none>
##$CNST= (0..31)
1 1 145 1 1 1 1 1 1 1 1 1 1 1 1 1 1 1 1 1 1 1 1 1 1 1 1 1 1 1 1 1 
##$CPDPRG= <>
##$CPDPRG1= <>
##$CPDPRG2= <>
##$CPDPRG3= <>
##$CPDPRG4= <mlev>
##$CPDPRG5= <mlev>
##$CPDPRG6= <mlev>
##$CPDPRG7= <mlev>
##$CPDPRG8= <mlev>
##$CPDPRGB= <>
##$CPDPRGT= <>
##$D= (0..31)
0 1.2 0 0 0 0 0 0 0 0.06 0 0.03 0 0 0 0 0.0002 0 0 0 0 0 0 0 0 0 0 0 0 
0 0 0 
##$DATE= 1632385299
##$DBL= (0..7)
120 120 120 120 120 120 120 120 
##$DBP= (0..7)
150 150 150 150 150 150 150 150 
##$DBP07= 0
##$DBPNAM0= <>
##$DBPNAM1= <>
##$DBPNAM2= <>
##$DBPNAM3= <>
##$DBPNAM4= <>
##$DBPNAM5= <>
##$DBPNAM6= <>
##$DBPNAM7= <>
##$DBPOAL= (0..7)
0.5 0.5 0.5 0.5 0.5 0.5 0.5 0.5 
##$DBPOFFS= (0..7)
0 0 0 0 0 0 0 0 
##$DE= 6
##$DECBNUC= <off>
##$DECIM= 32
##$DECNUC= <off>
##$DECSTAT= 4
##$DIGMOD= 1
##$DIGTYP= 9
##$DL= (0..7)
0 120 120 120 120 120 120 120 
##$DP= (0..7)
150 150 150 150 150 150 150 150 
##$DP07= 0
##$DPNAME0= <>
##$DPNAME1= <>
##$DPNAME2= <>
##$DPNAME3= <>
##$DPNAME4= <>
##$DPNAME5= <>
##$DPNAME6= <>
##$DPNAME7= <>
##$DPOAL= (0..7)
0.5 0.5 0.5 0.5 0.5 0.5 0.5 0.5 
##$DPOFFS= (0..7)
0 0 0 0 0 0 0 0 
##$DQDMODE= 0
##$DR= 18
##$DS= 0
##$DSLIST= <SSSSSSSSSSSSSSS>
##$DSPFIRM= 0
$$ [...]
##$SUBNAM2= <"">
##$SUBNAM3= <"">
##$SUBNAM4= <"">
##$SUBNAM5= <"">
##$SUBNAM6= <"">
##$SUBNAM7= <"">
##$SUBNAM8= <"">
##$SUBNAM9= <"">
##$SW= 20.0188988654967
##$SWIBOX= (0..15)
0 0 2 0 0 0 0 0 0 0 0 0 0 0 0 0 
##$SW_h= 4006.41025641026
##$TD= 16384
##$TD0= 1
##$TE= 0
##$TE2= 300
##$TE3= 300
##$TEG= 300
##$TL= (0..7)
0 120 120 120 120 120 120 120 
##$TP= (0..7)
150 150 150 150 150 150 150 150 
##$TP07= 0
##$TPNAME0= <>
##$TPNAME1= <>
##$TPNAME2= <>
##$TPNAME3= <>
##$TPNAME4= <>
##$TPNAME5= <>
##$TPNAME6= <>
##$TPNAME7= <>
##$TPOAL= (0..7)
0.5 0.5 0.5 0.5 0.5 0.5 0.5 0.5 
##$TPOFFS= (0..7)
0 0 0 0 0 0 0 0 
##$TUNHIN= 0
##$TUNHOUT= 0
##$TUNXOUT= 0
##$USERA1= <user>
##$USERA2= <user>
##$USERA3= <user>
##$USERA4= <user>
##$USERA5= <user>
##$V9= 5
##$VALIST= <valist>
##$VCLIST= <CCCCCCCCCCCCCCC>
##$VD= 0
##$VDLIST= <DDDDDDDDDDDDDDD>
##$VPLIST= <PPPPPPPPPPPPPPP>
##$VTLIST= <TTTTTTTTTTTTTTT>
##$WBST= 1024
##$WBSW= 4
##$XGAIN= (0..3)
0 0 0 0 
##$XL= 0
##$YL= 0
##$YMAX_a= 150708
##$YMIN_a= -184153
##$ZGOPTNS= <>
##$ZL1= 120
##$ZL2= 120
##$ZL3= 120
##$ZL4= 120
##$ABSF1= 10
##$ABSF2= 0
##$ABSG= 5
##$ABSL= 3
##$ALPHA= 0
##$AQORDER= 0
##$ASSFAC= 0
##$ASSFACI= 0
##$ASSFACX= 0
##$ASSWID= 0
##$AUNMP= <proc_1d>
##$AZFE= 0.1
##$AZFW= 0.1
##$BCFW= 1
##$BC_mod= 2
##$BYTORDP= 1
##$COROFFS= 0
##$CY= 11.3945322036743
##$DATMOD= 1
##$DC= 2
##$DFILT= <>
##$DTYPP= 0
##$F1P= 2.36226072786647
##$F2P= -0.459571619588291
##$FCOR= 0.5
##$FTSIZE= 0
##$FT_mod= 4
##$GAMMA= 1
##$GB= 0.15
##$INTBC= 1
##$INTSCL= 1
##$ISEN= 128
##$LB= 0.24
##$LEV0= 0
##$LPBIN= 0
##$MAXI= 10000
##$MC2= 0
##$MEAN= 0
##$ME_mod= 0
##$MI= 1.114404
##$NCOEF= 0
##$NC_proc= 0
##$NLEV= 6
##$NOISF1= 3.799351
##$NOISF2= 2.8
##$NSP= 1
##$NTH_PI= 0
##$NZP= 0
##$OFFSET= 15.70392
##$PC= 1
##$PHC0= -14076.94
##$PHC1= 14.00088
##$PH_mod= 1
##$PKNL= yes
##$PPARMOD= 0
##$PSCAL= 0
##$PSIGN= 0
##$REVERSE= no
##$SF= 200.130013532006
##$SI= 16384
##$SIGF1= 3
##$SIGF2= 2
##$SINO= 400
##$SIOLD= 16384
##$SREGLST= <1H.CDCl3>
##$SSB= 0
##$STSI= 0
##$STSR= 0
##$SW_p= 3612.71676300578
##$SYMM= 0
##$S_DEV= 0
##$TDeff= 0
##$TDoff= 0
##$TI= <>
##$TILT= no
##$TM1= 0
##$TM2= 0
##$TOPLEV= 0
##$USERP1= <user>
##$USERP2= <user>
##$USERP3= <user>
##$USERP4= <user>
##$USERP5= <user>
##$WDW= 1
##$XDIM= 8192
##$YMAX_p= 0
##$YMIN_p= 0
$$ End of Bruker specific parameters
$$ ---------------------------------
##NTUPLES= NMR FID
##VAR_NAME=  TIME,          FID/REAL,        FID/IMAG
##SYMBOL=    X,             R,               I
##VAR_TYPE=  INDEPENDENT,   DEPENDENT,       DEPENDENT
##VAR_FORM=  AFFN,          ASDF,            ASDF
##VAR_DIM=   8192,          8192,            8192
##UNITS=     SECONDS,       ARBITRARY UNITS, ARBITRARY UNITS
##FACTOR=    0.0002496,     1,               1
##FIRST=     0,             0,               0
##LAST=      2.0444736,     0,               0
##MIN=       0,             -184153,         0
##MAX=       2.0444736,     150708,          0
$$ Real data points
##PAGE= N=1
##DATA TABLE= (X++(R..R)), XYDATA
$$ [...]
1800a02j06K15p3J65j39j27J20P3N7j03K26p6L1k18K40n42M32J53m31N13j89k63
1822a44m0l2L67j54k25k1L97j96L52k03m5Q8M5k07K01j98k73N17k35j52J96O9
1844A07M9m6l19k3L32l14L22Pk04j54L56j46J51j48m1K27k02K38k17q9J97Jj60
1867g6m23N09j48K41k74M1J09n5J68j3N7k22N07k30l49K59J0M7j09m5J30k35N
1890i6O4m2J32j46lp2L14k15J1j49P7R5j04K89K9l08J28k3l7J35N8R4k16k66M72
1915B21l36K39k29n0K88o1L1k87J76L4Q3l6O7Kk16L59j22l54L30J33l69L48Nk56
1939@j99J92Q6l45K45m3M3K4k28K59j13k75M47j01Q7j34K51q4p8k47N34j85k85
1962a49L8K22l27J15L4k83K50K1j13O7J65k57L89Rk64Q2K20j13j21k9k42L71m04
$$ y = [-102, -208, 7, -66, 99, -40, -167, -47, 26, 83, -20, 206, 130, 161, -57, 183, -359, 73, 226, -205, 308, 119, -144, -184, -216, 151, -3, -228, -249, 148, -48, 304, 101, 56, 144, 189, -18, 183, -15, -288, 229, -6, -158, 38, 107, 156, 110, -209, -232, 100, -214, 108, 115, -89, -243, 113, -33, 118, -30, -71, 156, -46, 192, -25, -114, 83, 84, -76, -499, 10, -138, 103, -171, -130, -21, -76, 92, 79, 136, -86, 421, 191, -158, 101, 111, 158, 49, 4, 134, -101, -96, -32, -74, 58, -88, -91, -163, 151, -64, -53, -202, -125, -30, -134, 155, 184, -124, 4, -19, -56, 79, 137, 231, 15, -251, 221, -115, 124, -105, -155, 133, 72, 103, -184, -8, 26, 109, 73, 140, 142, -74, 285, 163, -191, 139, 272, -97, 251, 256, 0, -199, -7, 79, -266, -21, -64, -21, 3, -225, 34, -79, -354, 93, -8, 79, -55, 196, 112, 34, -213, 321, 136, -149, -111, 111, -216, -101, -67, -350, -100, -79, -192, -125, 40, -217, 172, 181, -83, -1, 219, 106, -15, -44, -286, 85, -319]
1985c19K1L67k2L6Q8j64m6o7j45J95J56k4k46L39j73K2K8j75J65l56L12K54k92
2008d6J68l9r2J66J7k75J34o8P1n9j7J28q8O9k67kL85k39o5l6P8L66n23L34J12
2033B12j54N1k0J9j98j1N1K03l1J64l51R9M0j86Q8R3J54j99k13J19L34k53J85
2056A96n6J30j81k7k01P2J68l64J74q6L02m08K21L3R0l3L26l84J82J9k93J18j29
2079a31Q4O7K48n52K20L4J13k11%J05L6l3j68j8J92N4j02K08K8Lj82L4L8M0j4
2104I3O4k77J31J13j40J24k59K86j01O4j61j1J2j41J62Q7j77J67l51K19K37R4
2126B35On5k84J90j80R5j5n2J73l1%k48QQ2l78N64J81l30k66L01p8L38l01k4O9
2151@K49j78Q3k8j90J92j17P0o5j64J93j90J56O0Pk57L1J63J01q3k14J37M9j44
$$ y = [-319, -298, 69, 47, 83, 171, 7, -39, -106, -251, -56, 100, 76, -170, 169, -4, 18, 46, -129, 36, -320, -8, 246, -46, 122, 83, -9, 157, 174, -101, 33, -35, 36, -23, -40, 88, 0, 69, -198, -200, 185, -54, -119, -155, -77, 289, -234, 100, 212, 58, 109, 89, 108, -90, -101, -50, 153, 122, 286, -65, 34, 74, -112, -24, 69, 223, 24, -189, -70, 264, 11, 196, 140, 270, 89, 62, -139, -67, 101, -263, -89, -175, 127, -281, -60, -27, 63, 30, 356, -28, 154, 173, -120, -2, -131, -47, 20, 268, -284, -64, -30, 83, -128, -128, -23, 13, -20, -188, -206, -14, 40, -62, 146, 174, 177, -5, 29, 67, 107, 93, 157, -120, 11, 124, -16, 108, -151, 135, 34, 98, -63, -74, -62, -203, -41, 46, -131, 36, -315, -96, 141, 235, 241, 186, -98, 92, -88, 7, -8, -60, 113, 82, 82, -166, -158, -76, -454, 110, 291, -39, -305, -4, -82, 256, -45, -69, 0, 249, 71, 154, 126, -64, 128, 11, 81, 16, -148, 45, -145, 11, 71, 78, -179, -148, 15, 116, 33, -181, -44, 5, -139]
2175a39L03l6k93K90j24L2J58j57j03L53k59m4K94o6m45Q4j34P01n72J65k02r7
2197b91L47n4k15j7J5J67k1r9K41L21j66m98L76K79l34k28J22P3k16L20l97O2
2219b13J65n5J33Q0J7J64l94J86j88J33l0m5L38k05m3j23j2LJ30j20j58L27k93
2242b03M08k96O4j30N07j34m28M53o5m1k56K04j69O4o9R4M0J05j11n5k4j94K00
2265c6j65K35J87k93J66j32m4J60p4J25j88n8j14L69j69k4J19k5PM0J3k04P0k62
2289b97L39N6P0j09m8j91M09k13O8j52J7j56K31M19n15L72Ok15l43L42j56k04
2311b70J96R3L0M3qj78o4J17m5J73j45J59j43q4nL72k73M0J29j98J00%J04l15
2335a72J49P7ll49L88L53m55N3J4l08mK6N19j77k6J36j70k23L19j45n1J23K81
$$ y = [-139, 164, 128, -165, 125, 1, 33, 191, 34, -69, 284, 25, -19, 275, 209, -236, -152, -286, 415, -157, 8, -194, -291, 56, 2, -213, -230, -215, -48, -69, -168, 73, 394, 228, -270, 106, 385, 51, -177, -55, 18, -198, 122, -275, -213, -48, -103, 30, 110, 127, 291, -103, 83, -105, 28, -2, -47, 291, 86, 43, -80, -92, -89, 41, -79, -237, 90, -203, 205, -91, -27, -157, 350, 216, -212, 241, 176, 135, -121, 83, -86, -22, -91, 3, 43, 148, 37, -18, -42, -236, -36, -201, 34, 221, -72, 94, -38, -82, 78, 4, 129, -59, -117, -231, 138, -31, -55, 64, 39, 46, 86, 99, -105, -35, -297, 42, 98, 168, 59, 11, -180, 229, 16, 84, -68, -51, -207, 24, 443, -72, 300, 306, 91, -252, 90, -66, -270, -74, 19, 49, 92, 84, -94, -158, -41, -86, 87, -58, 101, -42, -126, -131, 241, -32, 8, 137, -61, 39, 39, 143, -172, -23, 54, 51, -298, 90, 443, -12, 41, 55, -253, -257, -231, 288, 111, 85, 221, 51, -172, 147, 2, -49, 74, 355]
2358C55l07J02M2k08J20Lj27l0J90l02K66k54j8J82m22L11L46j27k94K58j98J74
2380F2j9J1l0j34N0L70l01k1j16K32k24J05J9j88N3N8J39J02j52l6J73J23l0N3
2404B99j08l7l58L09K5nk91pJ40N4n9K79k50L3j39O4J55Q0l08K40j63N6J22j60
2428b9l5q2J34K21j46K8j30kJ29k95K07p5K59l73p2J74R4J80l62O0p4J64j11j6
2452a52N9K60Pm27M40o2k10K2J55j36O1J10k24P3r2j3J67L6j8k90P9n6K02J16
2476A07j02r3M05o73L70Q5j06J28j48j5K55j80J04k57k63L58j30Q0N5m4L05m22
2498a81K13k8n7K01l78J19LK28%k0j96j69N25o45L04L5j13J00O9k02R5J11j1J8
2522B1n0m3j5L15k63j56L94k26J98l07K19L7mJ13m02Q4j8K04j89O0j57K03K7o1
$$ y = [355, 48, 150, 192, -16, 104, 107, -20, -50, 140, -162, 104, -150, -168, 14, -408, -97, 249, 122, -172, 86, -112, 62, 43, 54, 24, -110, -60, 310, 9, -12, -128, 104, -120, -15, 4, -184, -131, -73, 66, 168, 16, -20, 153, 276, 246, 299, 191, 154, -204, 105, 130, 125, -166, -173, -33, 21, -38, 241, -9, 24, -115, -51, 104, 184, -124, 116, -47, 9, 131, -29, -64, -146, -12, 209, 63, 91, -39, -41, 88, -207, 0, -75, 184, -189, -261, -87, 7, 187, -175, -115, -189, -25, -136, -152, -93, 167, 174, -253, 187, 125, -85, -63, 92, -44, 17, 127, -97, -24, -116, -129, 38, 74, 56, -234, -155, -211, -9, 107, 5, -88, 317, -356, 14, 99, -7, 121, -27, -42, 213, 33, 137, -120, -383, -25, -155, -75, -20, -64, 241, -181, 32, 4, -53, 148, -230, -111, -108, 120, 120, 100, -96, -265, 260, -385, -81, -46, -159, -59, 10, -192, -97, 14, 3, 21, -29, -72, -87, 228, -35, -191, 203, -23, 175, -132, 87, 124, 120, 233, -169, -85, -103, 101, -88, -28, -185, 18, 45, -16]
2546a6n1K72m32L03k03J20m1K53l28k7J11j16R9J68o1J57k27nj45J61j55lL62
2569A96j16Q8k91L39j90J30k1k05M48l47k38L1P8J59n7n2qL71j42j72r9J81k16
2592a33O9J47j97K24j40j03L44l71L40j25r1L43j57j94j4K19l28J86j38o9L20
2613A32m4l33L26j03n5NP3Q8k18J27l12K08J53Q0Q7j15M2j28q2J96j83k3k03L54
2637G2k62R6j0j19L5L09o2j55J14Q0j10K33k94J13l69J10N33n22J80j37P1J61
2659F7n2k6q7q1R6K25lj65m3LK20k22J9m4J91k46jJ99P4q4l7k68J88k6j31L22
2685H8o4R0l8l05K17jj31O7R6mN8l7L7O9j59K52p7j83j11j87K92P6j61J39j76
2710a53K1M38k45m5K41m49J26Q8j6l14J98k2L99p0n6Pk74Q3J52l73O49m17M1M7
$$ y = [-16, -67, 205, -227, 76, -127, -7, -48, 205, -123, -150, -39, -155, -56, 112, 51, 208, -19, -24, -169, -8, -163, -166, 196, 80, 168, -123, 216, 26, 156, 135, -70, 378, 31, -207, -176, -98, 61, 4, -48, -56, 315, 173, 1, -98, 83, -133, -64, 83, -114, 110, -30, -133, 211, -160, 180, 55, -36, 307, 150, -44, -58, 161, -167, 19, -119, -188, 132, 88, -245, 81, -22, -77, -72, 1, 89, -129, -2, -314, -106, 47, 127, 214, 99, 141, 13, -69, 127, -56, -79, -282, 72, -190, -94, -104, -223, -188, 121, 59, -96, 18, 98, -12, 221, -73, 40, -329, -219, 314, -208, -28, -165, -94, 67, 15, -11, -98, -179, -83, 142, 139, -26, -69, -66, 154, -68, -49, -93, 98, -148, -149, 50, 124, 40, 3, -265, -77, -103, -234, 88, 24, 114, 76, -229, -12, -13, -144, -77, 19, 15, 73, 36, 73, 142, -17, 235, 158, -25, -136, -323, -31, 45, -116, 23, -153, -132, 306, 61, 16, 257, -192, -66, 22, 6, -308, -110, -132, 267, 197, 141, 148, -126, -43, 109, -264, 385, -32, 9, 56]
2734E6r0j1n2K55j49o0K5Q0j09o8K38q7K33k29q7J30r5kj85J62k69M80n3r7j63
2759a47M65m65Mm5J55R3j46J82k71J86Q4k40J94L8J92j15m23N02l14mK52Lq8l42
2783b50K41l38M76O0l3l14L32k86m5J19k46M53j00l17K44j41R5J31N2L9j01J24
2805A95j60j57j0K6J64j90L49o3k26J00R5Kk86J84J52K15j45l41P6N0m5J14lk58
2829a62j28J84L64l59j08J60L6j46m7P1J5J09L6k5J67j83qn7q2K44Lr0O1k8r8
2854g1j01K77R8l0J25o8j50Q0j02R2j12k59J42J19Ro6p1P6j61JK82O7J8r2J27
2879B30l16M33l89j31J30r0j7J18j60J33l39J99J13j38N26o45J53K53R6j5j88
2900d4K54j83j21J75j50J24j69J4rJ5J72p8j20J42m4j1J02n8L2J3q3j47K53n2
$$ y = [56, -34, -45, -97, 158, 9, -51, -26, 54, -55, -123, 115, 28, 261, 32, -55, 75, -20, -22, -207, -45, -314, 166, 113, 16, -147, 318, -147, -143, -188, -33, 60, -86, 96, -175, 11, 95, -145, 49, 87, 279, 164, -259, 243, -71, -75, 177, 180, 92, -250, -9, -347, 129, 189, 156, -158, 174, -112, -157, -38, -284, 169, 69, -248, -4, -145, -50, 81, 133, 172, 71, 195, 35, -122, -132, -106, 58, -132, 217, 154, -72, 28, 123, 125, -161, 23, 175, 390, 245, -96, -20, 30, -15, 99, 96, -162, -290, -106, 258, -101, -209, -49, -13, -159, -206, -135, -120, -11, 25, 0, 167, -16, -24, -81, -163, 81, 84, -6, 55, 27, -71, -172, 105, 203, 173, 298, 230, 80, 160, 58, 150, 38, -221, -79, 40, 49, -17, -88, -12, -173, -172, 110, 177, 195, 103, 230, -86, 347, -42, -173, -43, -133, -150, -32, -192, -59, -398, -199, -86, -224, 302, -343, -190, 63, 159, 144, -44, 210, 27, -94, 81, -69, 55, -114, -100, -109, -94, 78, 0, -120, 22, -22, -33, 69, 11, 43, 56, -27, -174, 79, 27]
2924B7m0L5P8k76pL05j02O1j94j1K64j12Qm1M8J09k38L23l64Mj86L62J45o4k1
2949A13Q6q8J87k89j57J29nl3Nj7j49J54k35L71R6k2k97L53j57k12K96j56LJ72
2973A48J30m78j11L90Q5j12L9Pj16n2J52r7N8K7O8J6j80q1J16o5r0K96k90O0J31
2998E1j80R6J43j78J19o6P0p8j47J57r7lR6k58L21k2j32J66Q8k6J44j58j97K17
3022A26r4j23J97n1j11J85p8kk05J38J82m43J21K80k7k4J15l58J01O4j45N9Mk8
3046a17J85K2j58J8Pj1K00q6l10K61j75n8K06K47k75k3R2n9k74M19J32k08k85
3069b50M12k12Q4Q5Q0n7K14m22j23j4L65K2k3J38m21K53j05J06J02j23J3j18K1
3092B7j04LQ8Q8L0j70l18O01l00K4K09l09J37K30k10M8l01L31N9r1j98M5J06k20
$$ y = [27, -13, 22, 100, -176, -183, 122, 20, 81, -113, -124, 140, 28, 36, -5, 43, 152, -86, 237, -127, -123, -309, 53, 198, 134, 113, 199, 111, 298, 9, -148, -19, -24, -57, -52, -69, -218, -64, -299, 72, 168, 146, -151, 202, 45, -167, 129, -27, -24, 148, 278, -200, -311, 79, 164, 52, 91, 98, -18, -70, 82, -15, 43, 70, 138, 154, -26, -107, 9, -56, -146, 150, -140, -80, 51, -129, -33, 110, -68, 51, -15, 55, -23, -170, -13, -110, -113, -17, -275, 46, 24, -108, 58, 146, 120, 264, 106, -91, 126, 32, -91, 106, 55, -56, 129, 51, 49, -156, -18, 164, -279, -158, 122, 95, 71, 186, -172, -71, -7, -152, -93, -89, -117, 68, 90, -68, -50, -43, -54, 146, 60, -250, 11, -164, -222, -16, 231, -44, -67, 25, -34, -308, 111, 243, 35, -250, 162, -50, 34, 119, 199, 142, 356, -66, -189, -203, 162, 184, 161, 299, -122, 131, 26, 132, 234, 111, 124, 6, 27, -77, -74, 14, 102, 132, -38, -356, 245, -55, -31, 178, -131, 6, 236, 26, 74, -227, 104, 163, 72, -126, -81, 25, -195]
3116a95j0L56j16M5l13j02O92m09j63K04J75R5j78j14j33R1q8M32j56K5l18J71
3138iO4n0j01O8K29n9j9J03o9J44k89KJ24Mj16j63K7OL38j90k09K65k81n2J34
3163i9M4J06K25l85J61j87L55j32Po3k10L41o4j29K23k08j19J39k42M24l00l14
3185d27L66K69l37p6R3N4J60L9N9m11M69k74J45j29m5R3J34r8j93k23M03J0k07
3208a26J6K13K03m16K43k38n4J53l02N69l50Q8J80k04k58L99r2j29J3L61n09J53
3230h7M1J91m4R7l41J66J1J73k78k0om8K22J82l85Q5L%j41L02L4j65K02Q1n3o22
3256d00L18q4K15j36j44Q4J96L1j64j39K92%r6j17J84M2K14k87j27K06k71M04
3278B21l27L0q3J87j80J7J16J2j18j0NO6J22j86K18K14J0j62L4k72J63J34k00
$$ y = [-195, -205, 151, 35, 80, -233, -335, 357, -52, -215, -11, 164, 259, 81, -33, -166, -75, -163, 269, 113, 138, -180, -9, 55, 5, -96, -28, 201, 142, 123, 226, 157, 301, 12, 14, 138, 142, 26, -137, -110, -104, 234, 44, -165, 100, -181, -233, -99, -55, 51, 276, -109, 52, -135, 220, 88, 95, 32, -178, 163, 99, -30, 193, -15, -134, 5, -237, 187, -113, -427, -61, 208, -129, -205, -112, -58, 102, 141, 200, -211, 258, -16, 129, 0, -45, 48, 182, 84, -109, -332, 71, 81, -126, -110, 103, 306, -110, 133, -105, -159, -6, -308, 261, -89, -1, 179, -25, -283, 116, 24, -105, -92, 269, -240, -87, -46, 145, 101, 198, -143, 23, 34, 207, -71, -91, -97, -145, 77, 259, -126, -41, -38, -38, -179, 123, 157, -8, 194, 275, 222, -400, -82, -166, 49, -87, -231, -147, 49, 80, -84, -223, 69, 69, -27, -144, 40, 82, 296, 9, -118, 88, -183, 221, -106, -76, -159, 28, -152, -135, -19, -7, -125, -135, -130, -64, 58, -128, 90, 304, 314, 152, 186, -86, 77, 211, 11]
3301A1j29K57R4k3j47J32k01j33K80j23m5N7j71K46k4k6k70J69oK8K36j39n2r2
3325g1K30j63j91M81l92n1K44m20N78l42J6p5J7R9l37M33K03j79K17l17K1J2K28
3348B41k43L41j08r1j41Mj6k84K30L4pj89K66K07n55N84j59j91M8R7L0K30k97
3371C1k32J45L59m03RL49j83j53r6J72K01k61o4J70l37K75j44Q9p5kl3J18k38
3394c03K05r1J96k9Q7r8L73k03q4K8r3qJ3J23jj00J53r9J1L3j29J23j7k70K65
3419H5j27j9J68J09o5l1m9p1K6k98J54J26J00j91m9j9k8J22O1o0J34k71L17K6
3443A50k71K16J3L1j84J51pKPk51K0J80q2K89l61l6K61j69M8k35M34o0L3l9k5
3468A15m9P2n34O02j9k09L07k51jo7J81k97k91M19k03Q3L04j29j25K13l43K21
$$ y = [11, -118, 139, 233, 210, 63, 195, -6, -139, 141, 18, -27, 30, -141, 105, 81, 55, -215, -46, -52, -24, 212, 73, 21, -71, 159, -4, -195, 286, -106, -157, 87, -333, 245, -97, -81, -156, -139, -40, -377, 56, 259, 80, 297, -20, 1, 13, 241, -2, 339, 231, 140, -1, 3, -13, -297, -67, -33, -40, -229, 37, 244, -311, 273, 114, -77, -29, 68, 98, 328, 31, -201, -56, 303, -100, -91, 258, 75, -78, -174, -2, 199, -62, -126, 44, -293, -18, -162, -73, -148, -150, -183, -65, -303, -98, -189, 7, -22, 65, -33, 340, 137, 53, 81, -12, -20, -7, 116, 115, 15, 168, 69, 80, 113, -16, 107, 90, -180, 85, -42, -61, 107, 216, 151, 120, 71, 0, 26, -272, -118, 8, 108, -83, -132, -151, -179, -57, 4, -56, 78, -193, 124, 150, -121, 95, 108, 139, -45, 106, 99, 101, 108, -143, -123, 57, -25, 264, -97, -133, 128, -41, 7, -228, 206, 146, 179, 140, 115, 66, 138, -396, 206, 187, -22, 285, 34, 33, -34, 147, -150, -441, -22, -225, -142, 162, 33, -92, 121, -222, -1]
3490aj59L11j15L6l6j12R1P6k56K03R8M2k82P3q1J99k16O4qK7J5Q9nj63J71j20
3516e9r8L7N1K35q8pq9k13J35j3J32q1N7om31M27L23k38o6K5p7R7k2l85L52n9
3542f1R1j63O5j05K63J75j01j25j06K19j23q5Q2k6m6J32l4n3o7N8P9J54m43K66
3566D6L02k55l00R2K35k28J36R1j80k56M57L2j45m4Q5j23J73p8m01L90j8J74k91
3589a06R4k03L91k19j14J42rrJ10J08l33Q8J94l35K83j51J40l9k26K77J47j36
3611I4j61K01j33O1m25M58j67K25j35r7K74l00P9L5n9L09l91m8J70n8J74k17J47
3634C6k4k27M67k75o2M07j69j49JJ08q8K86k39O5q7J51j78o2L40l04M5%K7n31
3658d62M42j9K9N1k83K94O5m6j69J40k65j01N96j87q3j68J77J12r6j7OQ1m35L09
$$ y = [-1, -160, 151, 36, 72, 36, -76, 15, 91, -165, 38, 136, 178, -104, -31, -112, 87, -129, -65, -73, -46, -31, 58, 53, -110, 61, -59, -157, -120, -69, 166, 78, 71, -18, -231, -96, -109, 23, -58, -1, -7, -438, -11, 312, 74, 8, 33, -44, 53, 31, -354, -2, -61, 30, -133, -68, -173, 90, 265, 164, 39, -67, 152, 29, -56, 26, 0, -46, 86, 52, -1, -68, -10, 69, 223, -220, 46, 348, 93, -207, -115, 120, -108, 28, 119, -61, -317, 140, 172, 27, -17, 68, -55, 118, 40, -361, 29, 11, 185, -106, -12, -215, 176, -43, -157, -15, -24, -33, 77, 185, -148, -60, 134, -201, 82, -69, 71, 32, -194, 83, 230, 94, -67, 134, 1, 62, -363, 95, -72, 153, 18, -79, 195, -105, -26, 9, -50, 259, -132, -180, -10, -68, 106, -111, 36, 12, -215, 252, -23, -85, 322, 153, 4, 5, 113, 25, 311, 72, 137, 50, 201, 23, -39, 301, -3, 42, 42, 69, -462, -20, -39, -10, 41, -242, 52, 117, 71, -98, 42, -223, -324, 272, 85, 2, -166, 11, 123, 27, 10, 16, 97, -338, -29]
3682b9j19K93O7l75J20j53M9R8O3L15l17M9M2j60r3O3j20J17N0J28L7j0k38l0
3706a53L52q4k3j31J0k08K99j54J86n3r9J50r0n8L2L6k26L22p4j13N3m7M3j45
3730a75m9o8K27J16o7n7P7r9L35Ok93om36M40L7J68k58L54k13L0Ml05L43m69L19
3755c9m3J55j54J64nj22L90l74k45N60l32J36N6j02j32K52l0P8k39j04J41J66
3777A77J9k68K62j19nm9m3K04l56L16j10m0J29l52J60M8l2Oj63L4M16j46k3k06
3801a41q3M18n51J27K85L1L5k03L0lJ02mQ8j78O5P1N0j15N3k29j6J62j74J4K53
3826H7rP5j21J51m51L89n9j29J18K0k30K13j3Pk12P2L54l53J41q4MJ90k01j70
3850b11J32n6K32j49o6O2m5J92o1J46K2k06J28J20J7k59l1P6j9k88L60j5Q5l55
$$ y = [-29, -148, 145, 212, -163, -43, -196, -147, -49, 14, 329, 12, 61, 103, -57, -150, -87, -207, -90, -40, 88, 125, 115, -123, -153, 199, 115, 92, -39, -29, -237, 62, -92, 94, 41, -58, 92, 2, -56, -24, 12, -214, 108, 34, -79, -26, -73, -30, -175, -224, -292, -65, 51, -16, -73, 4, -95, 240, 246, -47, -53, -489, -49, -12, 156, -102, 252, 39, 69, 73, -232, 111, -358, -39, -82, 73, -81, 83, 78, -44, 346, -28, -273, 287, -45, 91, 147, 45, -87, 165, 135, 213, -26, -130, 11, 177, 196, -72, 190, 71, 66, 17, -26, 178, -178, 138, 28, -12, 117, -235, -75, -27, -59, -53, -216, -182, 234, 88, 65, -141, -224, 194, -357, -230, 55, 86, 121, -82, -52, -55, 47, 43, 131, -47, 18, 89, 139, 24, 77, -152, -168, -6, -180, -166, 87, 78, 153, 32, 183, -268, 121, 62, -67, 51, 71, -159, 54, 41, 48, -164, -92, 262, -91, 50, -34, -30, 160, -41, -211, -79, -135, 97, -52, -118, -56, -101, 91, 30, 176, 198, -8, 120, 240, 257, -2, -33, 43, 24, -264, 96, 81, 166, -189]
3874a89K03j26K11j85K47k66l90L80J14J03k39K38J85m7j99O2j25K33k02j36K81
3895A53k3Jm05K74J50q9l24K62j0K8l4N0p6M7J64k47n9R8j5M8j11J26n8J99k65
3920a16K16l09K64J29k65M2J75j8j6Q3k03J23j69k81J27K87q1p6J57n0M5J3k52
3943a75L73m00K32m9M4J08j41j77L26o0m8q7N8r5K90n20K75j23K55N8Q5l30k7
3966a28J22k04K73pK9J4m4J00o3L9k6j01j81J91l3Q9J44l98L47j24J11k88K79
3989A41k5rq3n0k18L68l22K16n7j30K38j58j58J66j23N6k81L86J42j71j08M40
4011B60k46j02K29l00R7L6Q1j38K43j75j62J16J40j79L36k56r6RJ96k26K77j41
4033aK68k36N3j61nk16L27k92N37m80P1L28j80O0o2j23K5O4j20J85j23M6J9K4
$$ y = [-189, 14, -112, 99, -86, 161, -105, -495, -115, -1, 102, -137, 101, 286, 239, 40, 102, -23, 210, 8, -128, 153, 130, 131, -274, 0, 150, 61, -263, -1, -11, 17, -17, 33, -43, 4, 168, -79, -138, -40, -55, -7, -118, 8, -50, 149, -116, 100, -209, 55, 184, -81, -39, 136, 118, 102, 185, -18, 105, -64, -345, -218, 69, -12, -88, 69, 19, 64, 77, -175, 198, -202, 30, -19, 25, 133, -8, -185, 141, 81, 33, -54, 4, -91, 199, -321, -46, -169, 86, 144, 229, -101, -128, -6, -210, 63, 56, 85, 99, 55, 155, 92, 131, 105, 4, -177, 14, -19, 70, 214, -184, 163, 39, 150, -138, 141, 116, 107, 24, -26, -244, 124, -198, 18, -39, -169, 69, -89, -247, -81, -204, -148, -429, -43, 99, -72, -180, 260, 14, -88, 141, -159, -62, -26, 55, -83, 160, -15, -177, -61, 79, -100, 236, -20, -116, -107, 89, -137, 140, -1, 267, 31, 84, -77, -82, -298, 29, -263, 274, -206, -135, 193, 13, 73, 11, -112, -87, -23, -143, 42, -81, -35, -16, 8]
4057Hl97L98j3J70j39k30K96j40jJ13Rj46J16j58J51N9j42J30j77J06M3j62J1
4080i5J44J66l66J64%J9k11K63k64J52K1l3L3j29N6O7K46l11Q2j29N7K00j88q5
4104a41K43j59L3M1l1J86j93o9N9J74k37K10n06L56l9L69p24M87J38l48J06N7
4126A2J39k72j4K01q5j7j48J62J91k15J91l69K00J49o6j56K52k08j23J47K32r9
4148A04l97K77K08j97J79j00k92lp4J55K49l38N24j75m0J91j38j80K03Jj3m49
4170c05N56k52k6J71n3J98j00k27J29r3J29o2m8K4o8j03J2K95o8N3l9j34K37j91
4194C5N5l39L49k46J03K23j30J60l33K59l63J14O7l1J87l76K86j25O0J11j65l13
4216d12M49K64k72j26q2K95J6k3j93o6J54J13j61o6K52k57J94j2K9K4J77j05k91
$$ y = [8, -389, 9, -4, 166, 27, -203, 93, -47, -48, 65, 74, -72, 44, -114, 37, 96, -46, 84, -93, 13, 56, -106, -95, 49, 215, -151, 13, 13, 32, -179, 84, -180, -28, -7, -40, -7, -136, -80, -13, 233, -78, 4, -125, -68, 132, -56, -141, 102, -57, -24, 17, -14, 172, -21, -90, -31, 143, -94, 116, -390, -34, -73, 296, -428, 59, 197, -151, -45, 12, 151, -121, -135, 66, -19, -36, -184, -22, 169, -46, 145, -224, -24, 125, 59, -97, 155, -53, -176, -29, 203, 104, -293, -16, 192, -5, 174, 74, -218, -221, -295, -140, 109, -229, 295, 120, 80, 271, 133, -47, 156, 157, 144, -305, 251, -1, -27, 144, 91, 289, 189, -38, 91, -2, 127, 65, 17, 41, -27, -130, -118, 177, 109, 162, 123, -11, 226, 35, 90, -249, 100, -146, -43, 180, 50, 210, -123, 136, -227, -113, -46, -77, 110, -266, 20, -105, -45, 66, -99, -412, 37, 301, 29, -97, -179, 116, 132, 109, -84, -150, 4, 117, -44, -110, 142, -115, 79, 67, 96, 120, 297, 192, -99]
4239i9K61j64j06K85j10p9n7N3J45j99K6k9R6l1o2N9N3n7j7J08l03J61J11k47
4263b02J33N0k95L63k74K86j82K5j0N3P0K04j30j92L72k77K04l98K06K60j02p3
4285I1k76M3K44q8J52k36l1Q2p9pK8J99k07n5n0L04r9j92J25K53k56q3Lo3K31
4310C3J49j89j61K96m0n9j26j2Q9O9J19k10J36j92K46P9j19j49k74M54k93J77
4332B3JJ25j47k41N57j42m34K50j28K76k11j64K48J09k35j50J33K87P1j85n9R4
4354G8k15J60nJ15J14n54L90j88L87m61o3K97J2K06j51k51K71Pr1k22p2L13j84
4377a07J42L9j38J12K05o81M55ok6l12L51O2k18J80K6L0j95j03L05K6m9j17Nq6
4401a00J63Ol20K46n8j39K91j4k60L98k63K70k62J05q4j43N5K05m7j60K79l05
$$ y = [-99, 162, -2, -108, 177, 67, -12, -69, -16, 129, -70, -44, -73, 23, -8, -70, -11, 42, -15, -32, 76, -227, -66, 45, -202, -69, -19, -314, 49, -225, 61, -121, -96, -106, -53, 17, 221, 91, -101, 271, -6, 198, -200, 6, 266, 164, 91, -185, -142, 102, 14, 166, -70, -101, -19, -98, -105, -77, 122, -85, -140, -190, 114, 15, -177, -52, 201, -55, -138, -135, -198, 33, 182, -7, -168, 128, 88, 29, -97, -109, -20, 49, 168, -42, 94, -98, 148, 227, 108, -41, -315, 139, -154, 23, 24, 149, 2, -239, 318, 176, -258, -8, -136, 140, -71, -235, 13, 122, -113, -263, -130, 157, 228, 43, -16, 78, -137, 23, 18, 133, 247, -307, 83, -105, 282, -179, -242, 55, 67, 273, 122, -129, 142, 149, 58, -164, -236, 77, -107, 35, 74, -64, 48, 253, -428, 27, 21, -5, -317, 34, 96, -122, 58, 84, 114, -81, -184, 121, 147, 98, -19, -14, -100, 63, 69, -251, -5, -63, -202, 89, 75, -185, 213, -50, 220, -42, 63, -21, -164, -109, 96, 49, -111, 168, -137]
4423a37J19j12J72K7j42O7J79l18K55j95r8J90k53J86L03j80Q5l6j72J21o1N1
4445E1M5lj45l6K99n25N14k05n2J85j17Q9j9N5k53J30K5Nr5j38J48J03j3L28l29
4470D7o2o4j86L02%m2r6j71M30j7J3j00p7J2o2J02K08l03mO6m4o9K06M5k21J19
4496C2q2pJ06J24j57J10qo7j76K36k30M98n48L94k3m0k83R4P8j70J15L9J71n1
4520A55j07l91L70p4k09K61r5J50j93L38j01n1j34j17M31k35q2j12L54M9k72q4
4542a49J29k3K54j81k17J49J06m0j56J89l7j15J60nj05m9P4k6P4j38K21j07M6
4565E4p1J76k58m4M00m14J17J82j79N6j61J32n5M9K8K3k3J18j74j07K56k40M19
4588B84l09NJ7m6K31l28JK05j55j44L95m05J96Kk49J75K7J84l73N0J16J09J54
$$ y = [-137, -18, -130, 42, 69, -73, -6, 173, -145, 110, -85, -183, 7, -246, -60, 243, 63, 148, 112, -60, 61, 0, 51, 96, 93, -52, -88, 211, -314, 200, -5, -57, 128, 11, 100, 81, 136, -117, 13, 38, 43, -52, -190, -42, 61, 48, 376, 47, -15, -79, -265, 37, 37, -5, -101, -272, 158, 141, 154, 54, -23, -11, -73, 29, 237, -66, -70, -4, -48, -117, 89, 134, -87, 32, -50, -57, 49, 173, 16, 126, 118, 51, -125, 111, -119, 379, -169, 225, 202, 162, -121, -27, 51, -119, -4, 35, 206, 155, 48, -343, 27, -47, -256, 5, -90, 60, -133, 205, 104, 53, -81, -198, 233, -2, -84, -196, 158, 207, -65, -149, -20, -43, 211, 30, -187, -38, 68, 28, -128, 61, 24, -91, 69, 64, -41, -90, -16, -42, 32, -106, 115, 8, 54, -17, 159, -99, -143, 257, -157, -40, 142, -37, 19, -142, -10, -65, -16, 12, 35, 12, 130, -44, -151, 105, -135, 284, -25, -20, -3, -49, 182, -146, -145, 60, -95, -239, 156, -249, -53, -51, -300, -125, -98, 86, -287, -237, -121, -12, 142]
4611A42m03O8K32J10J31k92q0P6k14K40k24K35J27n8L5k95m6L56q0lj98K97j11
4634D5j04o6J43J67l45J16j12J10J96j30m2o2Q9m9J95k07M9K26k31lk17K62pl1
4658ho3k01L34l43L30Q8p7J90k64J22j68l4K70j71J15j98J99o9J1N0l93J85M39
4681C44o36M49p0k15L06l41J03q6R2L35j77j11j79K39J34l19OK65j84L9J52o1
4703H5j33Q5o8J55j07K29j35o2j58L11m03J59M4M0k05J21R7Q5j33J67j61R3j47
4726d1j28K20K12l16l25M28p9J5j71J88M8p9k8K14k13L4K02n12L95J78l31M0R3
4749D4J45M0j46k05Rqj3J47k4J54j28k15L96j86J22l46L45Nl39J50J35P4J7pk34
4774f8J21r4j02J25K08k93L37k00j14L15l74J99k96O51m15j9j21J85K08m82L97
$$ y = [142, -261, -193, 39, 149, 280, -12, -92, -16, -230, 10, -214, 21, 148, 90, 125, -170, -216, 140, 60, 57, -141, 156, 45, -59, -125, 18, 185, -160, -44, -156, -46, 150, 20, -22, -84, 5, -44, 151, -56, -7, 219, -12, -15, -232, 30, 23, -8, -71, -272, 62, -281, 49, 137, 60, 250, -14, 108, -60, -94, 176, 5, 120, -78, 121, 52, 63, 113, -280, -95, 344, -292, 157, 87, -128, 178, -163, -60, -146, -54, 281, 104, -7, -186, 53, 187, -132, -126, 139, -45, -6, 146, 85, -48, 37, -31, 124, 17, 246, 111, 49, -109, 202, -201, -42, 2, 42, -163, -42, 55, 140, 7, 174, 13, 106, -41, -169, 51, 263, -53, -378, 50, -29, -14, -185, 3, 51, -28, -56, 158, -55, -21, 181, -331, 64, 242, -89, -49, 44, 189, 229, 83, -122, -113, -121, -134, 13, -11, 143, 15, -200, 196, 10, 132, -214, 131, 136, -203, -53, 82, 156, 173, 166, -68, 53, -41, -143, -18, 190, -103, 234, 34, -80, 235, -139, 60, -236, 415, 0, -19, -140, 45, 253, -229, 168]
4795A68j19J20l47R1k25M64k2j65j52J54J7k13K70J4j72J02r6J85j59L3L7N7J55
4818A97l07J92n5k04J62j90K51k37J70o0l4K44p9OJ39qj70j7j56j19R2J67K36
4841B20j58j83j0K00j98M7N7pJ02L1m4k63N57n07L27o9M9Q6K7j68l8J89l63K2
4865i4j13L51k64K86l02J25J04j42q6J1J75l3j71R8Q6m8J38j17J96o2q7p3R6Q3
4889A57j35j50J47l9J38J30l04J61j14lK84l70J0Q4m2k7J00j42j24N04j80K4L7
4912A46m6j6j28j06O5j81p6K73R2k95j27K90o1M65j16k92K03j97LL2J62m9j6J8
4936D3j10J06j73J89j67J62j3M4k20K09l36L16l24M26l03k08N65k41k75K58P1
4957A9k10L07j07O1j00J76j72R3q3o7K67j44J42j76j2M8J88l29P8o8M6K43j37
$$ y = [168, 49, 169, -178, -87, -312, 152, 130, -35, -187, -33, -16, -229, 41, 55, -117, -15, -111, 74, -85, -52, -15, 42, 197, -110, 82, 27, -177, -15, -205, 46, -191, -21, -81, -115, 129, 50, 56, 195, 187, 17, 0, -156, -275, -183, -16, 220, 62, -121, -131, 69, -129, -82, -25, -32, 70, 101, 57, -206, 351, -156, 171, 102, 151, 237, 264, 96, 58, 247, -116, -94, -207, 144, -120, 166, -136, -11, 93, -49, -135, -124, 51, 18, -153, -55, 31, -17, 121, 4, 200, 138, 51, -22, 74, 157, 22, -128, 19, -20, 118, 248, -56, 105, -9, -12, 272, -98, -88, -4, -46, -73, 27, -115, -239, 265, 85, 109, 146, 100, 84, -44, -150, -85, -266, -342, -69, 23, -272, -399, -109, -170, 295, 179, -113, 90, -107, -104, -72, 90, 41, 25, 43, -67, 39, -134, 55, -112, 50, 37, 81, -139, 70, -266, 50, -274, 152, -151, -359, 206, -35, -310, -52, 19, -191, 116, 9, 70, -30, 146, -26, 67, -16, -83, 184, 40, 182, 6, -6, 42, 230, -99, -21, -89, -43, 200, 63]
4980F3j2j28O3k9j02l2j4L61l72K78R4n7r4J5J1o1J93J79m17q7K67j25K9n0J04
5005G7J26r4L9j64m7J0K44k62K80p6j87m6m2Q5J62l90J50j6K82k46Q1k2J22j84
5029a18J03nk7J46j85j10K38j31K52k38J08j54J93q1L5Lm9J69q2N0k66J2Q4R8
5053D5m0j54J76j70r7N76m87L51m43L59k24K08j51K61l15R5j28J82j24K70n7l5
5075I8Q8j05j34J22j13j40L05l72K9K44k55j01J86L39k52N9j70j8J96m5P2J33
5097A66l44K27k10K37J16k55J48P2j91j92J58M1q8O3K25l99J85J67k78L27n7J42
5119B60l56mM7L23r8m40L49j42J40j64m8Q4%L7lJ31k73L74j37k39M4K05j11R5
5143G4K4p8O4j56j18K86k32K39l80J57K35k35P5J28o3k98M20j85O6l7k7l56K47
$$ y = [63, 51, -77, -14, -43, -145, -177, -191, 170, -202, 76, 170, 113, 19, 34, 45, -16, 177, 356, -61, -148, 119, -6, 23, -27, 77, 203, 109, 148, -16, -63, -53, 191, -71, 209, 133, -54, -100, -142, -57, 105, -285, -135, -151, 131, -115, -34, -56, 66, -118, -15, -20, -47, 99, -86, -196, 42, -89, 163, -75, 33, -121, 72, -9, 26, 29, -20, 149, 67, 117, -149, -137, -53, 45, 5, -149, 27, -143, -240, 336, -151, 200, -243, 116, -108, 100, -51, 210, -105, -10, -138, 44, -80, 190, 133, 98, 186, 81, -53, 69, -44, -184, 121, -251, -222, 22, -233, -334, -148, 191, -61, -2, -172, -190, 6, -39, 33, 166, -178, 49, -161, 76, 192, -63, 85, 157, -34, -226, -68, -27, -115, -52, 173, -226, -41, 126, -152, 175, 118, 260, -96, -100, -53, 270, 172, -268, 81, -61, 79, -85, -133, -49, -49, -12, -15, 116, -157, 217, 80, -159, -115, 90, -21, 74, 98, 20, 84, -72, -190, 96, -136, 103, -277, -120, 115, -120, -45, 83, 20, -278, 142, -43, 23, -14, -41, -397, -150]
5166a50p1K18j90j63N28m4k84K31m5n4ql76J23L9L58l83J62J94k61J91J02P9j55
5189D1k7J35m42J73J04m5J47m6j22n9J52P0j31J3j01K40j50M5K28n70N37k99J78
5212G1j41J16k62k29M13j65J45K86k73k40K41P0r3N7O4k28L42k04k11J41J19L5
5234E4J3M2M9j60K67l01l13N57l62K93J26m15K39n3J3K4k41J42J63J1J3k70J38
5257B9K15o95M24j57J48J08J3k73M54m73P8M9L10o2k41L3K8R9j25K05Rk66R8R1
5281I9j60J60k20j44N7N2m1Q1n9K20n9J30l8L5k54P0P9j49q3J95p1J60R4J50n49
5306b45L04Km8O3jJ38m26K29k83J14K10k27%K45Ql5L11l81Lm3L6jO4r9L7P7n2
5333@J49j89Q5k47L73n7o8J29l92k8K79q6Q9Q9J30j66K17k81J10k7r1j24m3L83
$$ y = [-150, -221, -3, -193, -356, 172, 128, -156, 75, 30, -24, -32, -408, -285, -246, 112, -271, -109, 85, -176, 15, 117, 196, 41, 14, 149, -293, -120, -16, -61, 86, 40, -82, -141, 11, 81, -50, -37, -138, 102, -48, -3, 225, -345, 192, -107, 71, -70, 46, -216, -445, -32, -197, -52, 234, -39, -279, -38, 32, -61, -4, 60, -168, 174, -30, -241, -100, 19, 54, 67, 109, 158, -2, 265, -36, -349, 208, -154, 139, 265, -150, 89, 36, 49, 73, -168, -26, 137, 148, 161, -109, 29, 244, -451, -27, -184, -36, 72, 85, -188, 266, -207, -129, -80, 230, 168, -73, -40, -12, 87, -38, 167, 176, -90, 8, 99, -61, 99, -121, -265, -208, -156, -197, -116, -175, 45, -14, 116, 78, 113, -141, -71, 8, -141, -224, -29, -100, 60, 154, 304, -245, 59, 61, 13, 76, 75, 213, -213, 16, -267, -153, 57, -170, -170, 75, 83, 48, 359, -22, -19, -62, -26, -27, 37, -62, -25, 52, 0, 149, -40, 45, -202, 171, 114, 46, 175, -217, -245, 34, -52, 37, 126, 256, 90, 307, 26, 136, 109, 18, -106, -149, 234]
5357B34k99J34j53J48j03J07J1m7J38j60j68J63r7J99o5j07KK12j09J3Q3l04k15
5380c83L62K13l68J71l9J21o9J13m1n9m8K05p0Q9k8k8q4k7r8M14m53L62j09m46
5404c00M43k65M00q1j6o9J01L2l28l9Q4m5K65j90K13J70k94p6J04m48K50J43J1
5427F5j83m9K03j11J4L72m53J33j2k39J34L01k22J37k15N4J92k09O2k06o2K83
5449a1l0mK56l27L35k53k02L49k6J15j77N2j59J9K02J2k01L7M2mJ27m52J66M23
5473B89k91J9j47k63K66j8M29k01j60j21n4K63j88M7L13l54J56J68l41J63j51
5494a76J61J92j38j1j48q2J67M72o01K04p6Q6j98J87o7n0r4J99J24k7m0j97K7
5517h6K75k60J55lk31L94q0J81l59N3O6J91j58Pn2l8q8k5M3L2Ok3l6o3Rp2L90
$$ y = [234, -65, 69, -84, 64, -39, 68, 79, 32, 170, 10, -158, 5, -92, 107, 42, -65, -63, 149, 40, 53, 136, -168, -383, -21, 192, -176, -5, -44, 77, 8, 121, 80, 21, -27, 178, 108, 197, 169, 141, 57, 30, -68, 346, -107, 255, 146, -300, 143, -122, 278, 197, 181, 112, 213, 245, -83, -122, -38, -83, 182, -8, 205, 375, 81, 5, 109, -339, -89, 54, 65, -118, -167, 36, -75, -61, 311, -142, -9, -21, -260, -126, 175, -47, 90, -125, -71, 121, -88, -26, -232, -294, -11, -41, -45, 211, -116, 219, -34, -236, 113, 87, 202, 25, 77, -82, -63, 139, 151, -50, -13, 29, 25, 152, -300, -134, 289, -2, 17, -130, -393, -127, -145, 284, 83, -77, -198, -252, 11, -177, -130, 183, -171, -15, 153, -188, -25, -176, -15, 177, 39, 28, -120, -202, -35, 437, -164, 40, -36, 50, -148, 39, -28, -78, -172, 27, 151, 124, 84, -113, -86, 189, -71, 84, 81, -150, 244, 164, 345, -14, 39, 105, 296, 138, 145, 93, 55, -33, -58, -15, 17, 23, 0, -36, -99, -90, -162, 228]
5544B28%l39J44j49J01R1K9j56j08M2J59Q7k61R2O5j3j33K84k01j94K55j74J21
5567c0j09K16k35L05l92L21j16N1K05k07K1J15n0Q2k07J02j46L5K9J28j80P7j11
5590i6k8J25J64j58j41J00p9J84j98Q0N6k8p9p6R7K59j22o9m3J58k36J45m7j49
5614a81J23O2J74l85N07l81K02K6q4k11L89l63Q7m11M49Pn5k4j0J60j71J93m09
5637c06N81j62k33J65j56j30M24k07L7n0J3o5J01J83n9j48P7j93J54k24R6j67
5659b69M06l99J58J97l10k0L4K09l28L43p4m4l5K78kl49J84J42n7o6J41j77J93
5682A55j59P8j48n0K94k95J67j06J84L1r3K35k23k4j06R6m6J73m7j18J9j23o2
5705a68J76J8j63J58j16K85j29Q2l6P8m4o62L39J44Q3l7k50J30O6j99K10R9q8
$$ y = [228, 228, -111, 33, -116, -15, 76, 105, -51, -159, -117, 42, 129, -132, -40, 25, 12, -121, 163, -38, -232, 23, -151, -30, -139, 77, -158, 147, -245, 76, -40, 11, 216, 9, 30, 145, 95, 177, -30, 72, -74, -39, -10, 118, -62, 15, -96, -124, 1, 165, 7, -134, -34, -113, 71, -127, -47, 9, -19, -98, -174, -77, 182, 60, -9, -52, 106, -130, 15, -32, -181, -58, 4, 178, -207, 300, -81, 121, 147, 63, -148, 241, -122, -35, -446, 3, 10, -45, -69, -79, 81, -90, 103, -306, 275, 113, -120, 45, -111, -241, 183, -24, 13, -37, -24, -89, 12, 195, 136, -12, 65, -128, 26, -198, -102, -269, 137, -262, -104, 93, -217, -237, -203, 6, -322, 21, -53, -97, -132, 146, 144, -205, -21, 121, 64, -2, 139, -38, 155, -4, 74, -74, -124, 170, -125, 42, -64, 120, 151, 58, 293, 70, 46, -60, 36, -10, 163, 116, -2, 17, -106, -168, 8, 26, -137, 21, -95, 190, 61, 143, 107, 185, 141, -521, -182, -38, 45, 8, -242, -112, -46, -245, -35, 64, -24]
5728b4n2K27k73P6J18K4k06j41M39o1l1L7j94J3j23N2p6K42J26j92J4K7k82R5
5752a65K76l28L48M8l37J12J8q1Q9R3Q6P8l46Pl3M5K32k12j6o0M02m42K05R1j03
5777GM0l58K75P8j74m8O2J40m8L44m05J38r0J33j97J82Oo8K09j23k18M0K29k84
5801a30L67j65q3M2Jn1j4j53K10P9l2j66K53l2LL1j88K53k54m3J10k00K14j6Q4
5826A20j51K05k59K3J37J9k3j88P4r3J40J2M7l0n8j30j22K98QR6R7k21L48j48
5850B01j31l41L48L9j06j86R8J4M6n4l64O41l87J60L6j31L65l13J16OJ33J3l57
5873a54L1J70q0n6J44Q0j34j19K55j7j92r1k2J54j29PK66q1%J72l20q5J34M6l
5898b4J53r6j34KO4M8j15L51k86p9L2K9j8k2K87j55j1N2K13Q1m42m2J86j24k1
$$ y = [-24, -76, 151, -122, -46, 72, 96, -110, -251, 188, 127, 96, 133, -61, -48, -171, -119, -195, 47, 173, -19, -5, 22, -260, -165, 111, -217, 131, 179, -158, -46, -28, -109, -20, 73, 159, 237, -109, -102, -135, -90, 142, -70, -86, -146, 256, -186, 19, 110, 7, 47, -311, -36, 42, -132, -180, -118, 22, -26, 318, -87, 51, -39, 94, -103, 79, 85, 17, 226, 103, -115, -75, 154, -130, 237, 72, -11, 31, 32, -19, -33, -186, 24, 103, 71, -95, 158, 126, 129, 160, -28, 225, -29, -72, 38, -162, 52, 36, 120, -31, 174, -85, -62, 75, 94, 71, -117, -43, -136, 4, 16, 63, 33, -25, -155, -277, 21, 29, 125, 222, 1, 349, 201, 70, -271, 77, 116, 10, -176, -78, -64, -18, -72, -436, 205, -182, -22, 14, -117, 248, -65, 51, 57, 190, 203, -154, -123, 47, -33, -89, 55, 135, 1, -118, 137, 120, -72, -163, -185, -31, -160, -153, 113, 32, 32, 204, -116, -201, -67, -21, -24, 129, 33, -101, -99, -35, 13, -102, 249, -37, -116, -84, -55, -73, -95, 192, 37, 26, 78, 291, 372, -70, -112, 74, -50, -71]
5923g1J56p2p3K21n6l20L75k79K78o4k02K27O5j79P5p8K3P5N2k63O1N6n4J34k08
5948a21L26L1k88Q8k65K21j42J8K91j88l3J8N6k71L35j25J23M3K8m9k33O4k0Q6
5972gj05K16q7P9J00j02q0J9j26%M8R6r6M1j96j30M52r6j47L06j60j5J12j84P1
5997IJ17j17Q5k3K71m89J82M6k06L27J3l96J02R0J71k23q7L88j87L5l59L24K74
6020C47n75K83j69p3M9N8J27k10K12J45Jk03l6j3M3Q1j00M3J44k4k29K28k72M2
6044a01R1K6K11j75j07J81j32P5J36k30J31j51r0J37J40l27o4J7N54l42NM4J05
6067A34j88k35L21K8J38k03q4J11n1O2O0pj95P3K4K7mj92K49k47l1L94j45j06
6091f7K05j62J85k11J66N0k93J97j75P1O7j17M8j3k38L73j77j75L34o1l9K24l51
$$ y = [-71, 85, 13, -60, 161, 105, -215, 160, -119, 159, 95, -107, 120, 185, 6, 81, 3, 26, 101, 153, -110, -49, 7, -47, 87, -121, 205, 236, -52, 36, -229, -8, -150, -132, 159, -29, -62, -44, 12, -259, 76, -49, 74, 117, 145, 96, -137, -73, -93, -7, -112, 104, 17, 96, 196, 94, 14, 33, -93, -93, -45, 51, -45, -4, -200, -330, 122, 26, -121, 185, 25, 10, 122, -62, 9, 126, 9, 94, 71, 342, -147, 35, 81, -125, 202, 215, -181, -79, 11, 182, -41, -128, 260, 73, 108, -251, 73, 347, -228, 55, -114, -187, -138, -80, 47, -163, 49, 194, 195, -8, -44, -57, -14, 67, -33, 10, 154, 130, -99, 129, -143, -101, -10, 16, 227, 52, -55, 126, -6, 69, 205, -25, 106, -45, -135, 2, 142, -185, -249, -232, 322, -20, -15, 29, 134, -54, -289, 32, 60, 198, -5, -89, 22, -29, 33, 93, 86, -109, -36, -12, 15, 11, -181, 68, -179, -210, 184, 39, -67, 138, -24, 161, -50, 116, 166, -127, 70, -105, -34, 33, -84, -36, -49, -287, 86, -91, -266, 68, 7, -32, 192, -159]
6114a59Q6J41j55K02J38k85k44L44p1K13k15o1NJ00R3j83o8K29p9J87k68J36o9
6137A7mj33%J86j25K41R3o0j96q7J22l5K05k05j41K22l17N08k14k02L98j69j26
6160b2j27L03m18J57Q0M9m5j2j81L70m00M31k84J63j95L13j38j56P2LK53j82o5
6183c1j4K16j85P6K0j26j00R1p7M2l9K65p6k94K78J39L5k22J43k26K3K42l15K38
6207A03j48K42l9l85K05j27J30J00j45j26J44R3QJ39k26O1j4Lj46L73j36l13m9
6230b53L66O5j53l20K29j13J43p9P3r3l1O3K38l05J71p1R6J7J65n8j14j38K12
6253A10o9q6J20l6k23L8L39j34j25J17J40k18Q6J01p9M9k60M43j95n8p3j94K31
6276B4j48K3J80L5J35k71j4Q4P4p8j35P6R1j65P5L24l68J63j11K16l20K25j11
$$ y = [-159, -73, 68, -87, 115, 253, -32, -276, 68, -3, 210, -5, -66, -61, 39, 132, -51, -119, 110, 31, 218, -50, 86, 17, 13, -120, -120, 66, -59, 182, 275, 215, 19, -68, 54, 19, 224, 19, -122, 100, -217, 291, 77, -125, 273, 104, -22, -149, 154, -264, -107, -27, 22, -23, -35, -216, 154, -246, 185, -99, 64, -131, 182, 44, -112, -40, -37, 216, 34, -31, -45, 171, -14, 62, 82, -44, -144, -53, -130, -88, -127, 138, 62, -232, 46, 185, 220, -2, 141, -85, -62, 180, -135, 103, -45, 197, 158, -227, -22, -149, -19, 81, -64, -190, -46, 47, 55, 194, -32, 29, 15, 18, -128, 245, 109, -204, -253, 113, 178, 25, -295, -66, -179, -36, -115, -42, -135, -166, -103, 135, -170, 1, -70, 26, 43, 208, 150, 36, -102, 110, 41, -45, 75, 39, -184, -146, 193, 59, -66, 51, 191, -27, 59, 160, 81, 130, -130, 313, 118, 60, -13, -207, 24, -124, -101, 79, 114, 249, -22, -36, 48, 122, 44, -91, -15, 76, -89, -14, 310, -58, 105, -6, 210, -110, 115, 4]
6299DK31j21j26L1J56q7J10k34n9J52p1q5J66m12N15l47K01j48P0J5K2q2K71l21
6323a49k2Q5j39K52P5Kk24K4M3j02o4M98k24J24l39K47L4j4m60L59nl03J34K86
6347A18l08L39j87J14K4j68J8K08P7m21L05p5j06J12k47l5K04mk9L6L2m2J00p6
6371a1K3M04m17o0KlL0J08k02J68N6R0j72k03L00j54j06P7K5j18M21m48L08q7
6395C1jm2J0K43m65K32J11J44j51j04N8k54M97j47m5l6p2k5R6l4k52L96j74r6
6419h0K04m96L88k8N9K60l10l2N4j87L37K7m26K2oK95m1r6P9q7K91k68n4N1K21
6444A77k51J27K3J12k43m3J49k33J65j17P5J51R1p8K69l81jK66l11l46L23J91
6466A15l5J28m35J75L05k42j57OJ94k36K17j93K51j59K04j19j65J91N2r7K88q1
$$ y = [4, 235, 114, -12, 19, 175, 88, 198, -36, -95, 57, -14, -99, 67, -345, 170, -177, 24, -124, -54, -39, -17, -99, 172, -149, -171, -86, -225, 27, 102, 104, -120, -96, -53, -155, -219, 279, 55, 179, -160, 87, 121, 107, -353, 6, 1, -302, -168, 118, -190, 149, -38, 76, 100, -68, -50, 158, 235, -186, 119, 44, -62, 50, -197, -232, -28, -32, -61, -25, 7, -35, 65, -11, 12, 416, -1, -61, -59, -62, -32, 76, -126, 42, 98, 188, 16, -187, 113, -41, -147, -70, -45, -163, 258, -190, 118, 31, 30, -12, -2, 241, -224, 8, 119, 263, 112, 8, 66, -188, 309, 162, 117, 81, 9, -16, 80, 46, -206, 190, 16, -80, 124, -372, 16, -12, 47, 307, -3, -35, 19, -168, 169, 196, -230, -208, -214, 81, 40, -56, 23, -64, 227, -41, -95, -44, 177, -74, 53, 76, 188, -55, -98, 51, -182, -17, -134, -59, 92, 183, 105, 374, -7, -8, 258, -53, -399, -76, 115, 80, 208, -227, -52, 253, 11, -146, -140, 54, -182, 35, -158, 93, -66, 138, 19, -146, 45, 97, 0, 288, 207]
6488B07k15J81l16L4J46l61K20K34k8j11N9k11J65q2J42J11o9r2l2j22J02k02
6510b40J37L65j94o6j55J3L37k07N8j61K67j0k5k3M4l79O9Q5K4j11L43n4k60J6
6534a27L28k15j90j6L65j88J62J2j95J96j73q6J81l4rN4j20K54k65j32J42j09
6556a65r7K25M3o1J63j74q3L4L90n46L39n5j24M04l83l2K25j34J94P9k45k7j1
6579d1P4k21M03j39J24j90j18Q5j4O2J35k37R4j89P3J23k1j37K05j36PJ48r8J6
6603Hj55k1j8P5J44m6l2k8K24j23p4J24j76K18j17N9j46J26J60j26L0K5j93Oo6
6628a22O5J44L1l95L34k36J72O3r0j44J58k3O5k4N7J01l5K0l14K42j60J75N9K4
6652A67j29K4j10R7K5m0P4j67P6n1k8J70K3j24m8j9J08j16L2Q1j44K1NJ31p3K66
$$ y = [207, -8, 173, -143, -109, 37, -324, -104, 130, 102, -9, 50, -161, 4, -78, 64, 175, 106, 14, -18, -140, -38, -240, -103, 262, 68, 2, -153, -140, 197, -10, 48, -113, 154, 144, 119, 96, 140, -239, -170, -85, -61, -172, 171, 117, -143, -127, 201, -14, -204, -220, 145, -43, 119, 131, -64, 132, -41, -127, 54, 20, 11, 65, -55, 199, -66, -198, -56, -165, -262, -37, 6, -55, 108, -66, -149, -115, 275, -271, 68, 13, -111, 293, -90, -122, 103, -31, 163, 242, -3, -30, -41, 33, -188, 215, 76, 200, 10, -108, -23, -37, 25, 160, -77, 17, -172, -99, 24, 3, -134, 71, -65, -58, 90, -8, 8, -147, -168, -186, -111, 33, -13, -45, -73, 151, 28, -46, 78, -98, 120, 3, 62, -84, 42, 202, 76, 106, 131, -62, -56, -122, -57, 87, 118, -277, 57, -179, -7, 56, -34, -178, -20, -43, 22, -2, 55, 156, 121, 141, -173, 69, -91, 84, 143, 167, 38, 62, -48, 49, 74, 34, 108, -59, 17, -34, -62, 108, 131, 7, -41, -60, 48, -68, -36, 45, -99, -78, -73, 58, -15, 251]
6678B51l73P3r1J95j96L20j55l79N54l73R6q8L11m8m1j02kJ74j61J50J03j10j2
6701I6K7j17Q3J46j14k61J6K59m64M05k7P2l75k49O55l4j22QK96j58j44l4P9j77
6725a34%K83j14J09j32p8J23k5L9L6J00k73O9j51nQ3J89j19j92K66m6O9j60m7
6749a10J40JL6k47L06j21j30m6J09P5j63J32J70j67P1J37l02L30j55o4j4r9J46
6772C5MK62p4m22K82k17k45K84Q1M4J4j08J23Q0j31j0l3J5K55k33o5J53j39j9
6796f4j6K02j31J38k84K68k18J74r1J02J45j43k11m5R0J4J24k3NL47m40k84L35
6819fQ2k72N7J44j55N3J55j40l5L14k64K2p8L65j49k03J77l10K07Q5K25l05q9
6842a20K41l6n0R4j04K2p3j22K08j49O7K79l10j07L11l52J05P0j92K07r8J00L4
$$ y = [251, -122, -49, -140, 55, -141, 179, 24, -355, 199, -174, -78, -166, 145, 97, 56, -46, -48, 126, -35, 115, 218, 108, 96, 123, 6, 89, 235, 121, -140, -124, 135, -329, 76, 49, 121, -254, -503, 152, 118, -4, 4, 300, 142, -2, -36, 43, -134, -134, 149, 35, 144, 12, -66, 57, 32, 71, 107, 207, -66, 3, -148, -153, -70, 119, 0, -192, 74, 28, 97, -63, -110, 30, 31, 67, -180, 126, 5, -125, -171, -62, 13, -150, -18, 152, -15, 56, 193, -109, 221, 66, 2, -12, -111, 35, 39, 301, 227, -195, 87, -130, -375, -91, -10, 34, 48, -60, 63, 143, 12, 2, -31, -16, 239, 6, -59, 94, -45, -64, -80, 122, -9, 129, -155, 113, -105, 69, -22, 80, 225, 82, -129, -174, -84, -70, 54, 31, 36, 383, -57, -341, -6, 76, -196, -139, 5, -150, -97, 58, -82, -117, 197, -67, -45, -123, 242, 93, -110, 67, -243, -36, 49, 274, -31, -120, 121, 85, 35, 129, 25, 47, -26, -148, 60, -89, -22, 257, -53, -160, 151, -201, -96, -26, -218, -11, -109, -9, 25]
6865B5k2M22n05J36J36m51J31j67L48J59nk72M1J37j86J11M0j85J11jJ2o3p3j79
6889c00K62J38j29J95J7k3m05L08j63p6J97J26j30j90R8J30j81J61K3K2j33J89
6911A36J60l24j1M6K33P5j63k68K0j9K1J94k27K37K22j80m4Ok84J00o7K48L5r8
6935D8k49J72J53m03N16l84J97j51j6M07j78j88J14K26l16k8j64L22n2K4o2j79
6957a91K42k12q1K09O2o7K27j75k9O2K89m36K18P2k66K78l56K35R4k99K00j69
6979i3O9o2K63j66R3j01L9K50m36J86k67o3O3OP1j7j23K74J46J65m1k38j59J29
7003a2K11l27N1j09J61J04k22J3J67N6q5j68K75j9K7j81j41L04m14L03R2k76J19
7026g1K61k62Q9j16Q8K5k51L8J60J00L0J12k88J89j68J78J4O0k22L60k82j34j2
$$ y = [25, 3, 425, -80, 56, 192, -259, -128, -295, 53, 212, 207, -65, -24, 113, -73, 38, 78, -107, 4, 3, 15, -48, -121, -300, -38, 100, -29, 166, 183, 160, -245, 63, -100, -176, 21, 147, 17, -173, -75, 55, -126, 35, 58, 80, -53, 136, 296, -28, -39, 7, 240, 315, 152, -116, -96, -115, -94, 100, -127, 110, 332, 152, 108, 114, -170, -70, -137, 111, 146, 48, -201, -29, 124, -279, 237, -147, 50, -101, -117, 290, 112, -76, 38, 264, -52, -80, -244, 78, 26, 50, -12, -191, 51, -161, -242, -33, 29, -38, 189, 14, -15, 47, 336, -100, 118, 190, -76, 202, -154, 81, 175, -124, 76, -93, -24, -86, 177, 11, 104, 3, 42, 292, -144, 42, -225, -288, -225, -219, -148, -165, -288, -14, 132, 297, 256, 18, -141, -12, 199, -128, -77, -186, -25, 79, -143, -130, 37, 93, 8, -160, 115, 96, 123, -58, -199, 105, -309, -6, 86, -190, -71, 190, -72, 17, -99, -11, 14, -237, -199, -39, 61, 91, 203, -85, 104, -64, 114, 128, 188, -34, 326, 44, -90, -102]
7049a02O3k84M19K88k84l9N0j48j23K93l7O9j28k18M24j41J01l94J06J02K66m69
7071a86M8M8K64p7j02J31j64L67J5m22m1K9J25ok50J39Q2Q6m54N20M0j22n9k13
7095b02K86q9l67P35n38N27j93m9n4j73J47J06k9j46j2M9P7j65k5K06M7k63k43
7118c68K94j0n0K38j7P1l13J65qL7j12N2J60J23m76O9P8K81k80j26J53O9jM7j53
7143g7k1J56k30J79j21k49M75J99k84l34M78j26l0J60J68m43R7J20Np9j19J23
7165D7l53J91n5J3M3K87j4rj89R3j8R7r0Pm2p6O2R5J3p5j30J02l1Jp6r1L10m6
7193F6o3j5k24J41R1K03l54j27M73N8k62J66P5j57K9k57oR2L26l19j36J64k20
7216b56J57J27q4K1j1J98j16j42J7PJ8K07j94K64q4n3Q8k71K50k85L03o7l25L37
$$ y = [-102, -39, -323, 96, 384, 100, 61, 111, -37, -160, 133, 96, 165, 37, -181, 243, 102, 203, -191, -85, 17, 283, -186, -138, -90, 174, 97, -5, 126, -38, 329, 344, -78, -119, -90, 35, 29, -221, -82, 0, 86, -368, 152, 192, 70, 11, -202, 84, -5, -372, 363, -175, 352, 159, 110, 56, -117, 30, 136, 107, -39, -51, -2, 75, -90, -115, 91, 138, -125, -368, -74, -84, -134, 104, 87, 158, -155, 10, 2, 39, -73, -21, 139, 262, -214, -145, -67, 214, -66, -192, -39, 30, 29, 76, -77, -98, 58, -172, 7, -114, -363, 112, 311, 27, -307, 171, 45, 15, 175, 343, -100, -3, 117, 122, 43, -76, 47, -306, -115, -170, -157, -114, 173, 159, 150, -39, 54, 36, 133, 43, 50, 8, -68, -6, 89, 102, 27, -103, -1, -32, -31, -107, -198, 112, 66, 3, -12, -236, -95, -4, 199, -155, -282, 191, 249, -13, 153, 228, 71, 100, -157, -163, -71, 255, -64, -200, -36, -256, -99, 28, -56, -35, -46, 152, 36, -106, -89, -82, -64, 143, -51, 213, 129, 76, 164, -107, 143, -142, 161, 94, -231, 106]
7240A06n3%J07j34K45k51j80K05k03J74r0J97j25j7R4O0k01Q1k33L4K99p5K8J43
7264B11l50O9j68L12k73L61k28J65l40K74N1k8kl2NR0r3k22J44q5K82k66J83j43
7288h3J51k58j33L84J17k43J80k87J23J32k90L18j29K90l87nJ23j0j5kj7L24j43
7311A40n9J05j56l0J35k8j38k7R3Jq1J73m5J4k28J89j67L09k27j46L02k9j24L7
7335A3lL0q4P6m9N7o1J29k73J38j91L75k25J64oj47K85j99j18J57m2J3o9j8J15
7360F7k9j30K3K89l90L28l4K3j07L05l37n4j38j9L98k77J88q9nm6J94k00J58J53
7384B71l47n9K16O8j01j81j1k4K14j47K67J11k15J70l96L8J11J07j15j9o2K43
7406A39l05K56m22K17J37k81K57j79K3K22K13K6l23J02J07k02R5J76m12J75J31
$$ y = [106, 53, 53, 160, 26, 271, 20, -160, 45, -158, 16, -74, 123, -2, -19, 75, 135, -66, 15, -218, -184, 115, 40, 68, 211, -139, -70, -238, 74, -199, 162, -66, 99, -241, 33, 84, 56, 54, 22, 27, 117, 24, -198, -54, -139, 143, -123, 60, -83, 68, -190, -323, 61, 178, -65, 115, -172, -49, 83, -207, 111, -18, 272, -115, -120, 3, -7, -22, -24, -41, 283, 140, 81, 186, 30, 0, 135, 107, -31, -58, 35, 36, -45, 128, 83, 97, -131, 58, -109, 200, -27, -173, 129, 100, -24, 13, 10, 40, -44, 32, -17, 40, -21, 108, -165, -27, -218, 157, -68, 96, 90, -57, 228, 29, -89, 68, 26, 39, -30, -48, 67, 38, -92, -69, 220, -170, 158, 124, 147, 40, 345, 8, -46, -184, -203, 195, -82, 106, 17, 12, -34, 160, -40, 118, 271, -76, -135, 81, 149, 48, -133, -144, -168, 46, -101, 166, 277, 62, 232, -164, -126, -15, 92, -23, -42, -104, 139, -166, 90, -332, -115, 22, -259, -2, -181, -158, 64, 277, 303, -20, 82, 189, -13, 82, 258, -154, 21, 152]
7427A52k71q9J86k89M56r6M3m5k05K27m42L59j99j8K7K61P1j93k17L31j90J46
7449EJ71k11k15M02j81k5J57j50N0j24M3K88k27J20k7j47j38J30K37q0k2j21O2
7472cr5J69m5J51j42P1k52L14l84L27m4O9k95n5L24j62J01j30K55l02P5J76q4
7495C9j42r1Q8NK79j13n8l9J44k95K32r0q9K36j34K40p8l42K75n6j43K01l37L83
7519A15j2j50n3J7J19K31l94K65k91K07l63J55K1Q8M1r1L47o25M71Jj39P6J23
7542A59o3k07n7K40r2M8j32L39l24J37l7k42M01p4j1rj26O6n5k34K43N4Q9q8j81
7567a56P3p9N63m97K54j59L4n8j98L75j16j27j86M24l15lJ95%J53j67J49o1r1
7590GJ51l07O3p5J76J00K3k13R9J54j77K11n8R1l25K9P3l7j78K48R6L2o7l1M6
$$ y = [152, -119, -208, -22, -311, 145, 49, 92, 47, -158, 69, -373, -14, -213, -231, -204, 57, 128, -65, -282, 49, -141, 5, 176, -35, -250, 152, -29, -54, 103, -47, 3, -121, -78, 210, -17, 103, 76, -71, -209, -79, 158, 78, 56, -65, -3, -98, 71, 26, 177, 35, 106, -146, 168, -216, 111, 67, 136, -159, -214, 110, -52, 49, -81, 174, -128, -53, 123, 39, -103, -194, -106, -101, 178, 65, 7, -32, 112, -183, 49, -41, -130, 106, -28, 212, 134, -208, 67, 11, -132, 69, -268, 115, 103, -47, -100, -83, 36, 267, -127, 138, -153, 54, -309, -154, -133, -45, -4, -95, 252, -373, 98, 99, -40, 36, 159, 96, -111, -168, 72, -20, 28, -104, 235, -89, 48, 11, -231, 170, 96, 85, 76, -50, 16, -39, -273, -30, 24, 113, 25, -156, -83, -162, 401, -96, 158, -1, 33, -25, -223, 152, 36, -91, -277, 147, -168, -171, 24, 24, 177, 10, 159, 98, 7, 158, -149, -86, -161, 15, 115, 138, -75, 24, 178, 1, 212, 154, 245, -80, -51, 22, -15, -193, 55, 151, 183, 116, 85, 131]
7615A31n1j93J5J59k27J99R2o3j9o5j5P7k35j51N17l21L46m09K49K20l92L32J38
7638C34l63M0j34n6K47j24j25K96r9m04N64j01j12j45K98O3k58k2N4K9K34l08
7660i2J42j07J00j13j84J61K70m47J68J58j5n0K39m66Q6lK30k60J45q3K26j57
7682e2L56m41K70k74L18m81K17K57k89K78j35j52N9J90j80K98j60l95L51j12L65
7703B88m40O1K94r9q5j66J5K10j9oJ77m39M26m77M18j14k66K24j00NK92l30q1
7726b12J03K63j78R4P2k66j8J13J09R3k63P9j1J12p9J98k27J0k33J57rN9j12p5
7750b21J19K59L1k57L23k08k67L09l5q6j22K75k16r4K25J67k99J27k49N6j54M20
7772A03j38J4J23j76L7n5J48k97K72N3n5m2K78K9l36J3j60J30Q3m6l3M6Q9J3k29
$$ y = [131, 80, -113, -98, 61, -166, 33, 125, 62, 43, -22, -37, 40, -195, -346, 171, -150, 196, -213, 36, 256, -136, 196, 334, -29, 11, -123, -179, 68, -56, -181, 115, 16, -388, 176, 75, -37, -182, 116, 179, -79, -101, -47, -18, 216, -92, 50, -57, 43, -70, -254, -93, 177, -270, -102, 56, 41, -9, 230, -236, -150, -153, 77, -183, -38, -121, 105, -52, 304, -137, 133, -141, 177, -304, -87, 170, -119, 159, 24, -128, -69, 121, -59, 239, 79, -316, 35, -77, 288, -152, -91, 203, 104, 19, -147, -132, 78, 59, 53, 230, -209, 217, -260, 158, 44, -222, 2, -98, -93, 199, -131, -212, -109, 154, -24, 70, 142, -124, -142, -29, 80, 173, -90, -11, -22, 90, 11, 209, -18, -8, -241, -84, -93, -34, -146, -221, -102, 157, 188, -69, 254, 46, -221, 88, 53, -33, -155, 120, -96, -190, 35, 202, -97, 30, -219, -163, -317, 103, -35, -21, 102, -74, -37, -92, 56, -241, 31, 84, 29, -13, 265, 294, -42, -29, -189, -59, 24, -22, -55, -9, 80, 93, -136]
7797a36J80j83N3o6M26k66j49J08K47j54p4j26L07k98K27m3l36K25j74K69j07
7818g0J54k7K4k42K47k61J40R3j57k85K70J72j62J31m3m7J24J30k57K47J36l83
7840f6K15j53J12m4K9j20p0L1nL42n47L24lPN4j50lL4L2J67j86ok5r8J95N3k74
7867a55J99n6Q0j24J62k21K63j15k1n4l8J14N3k0j26n6O8l15J05J17L5K64m2n1
7891F6j27q5K13j19N0m3O6j57pJ55j01J24J81k86j73M15K4k70j00M21k33J03k49
7914a32q1J61j91K7q0K76k26J30Q8K47ml89L15O5l05K51k95n5K73j83L31P4l44
7937d7l33M10l99L17p2K13r5j12K99q3k15J3J28j87R1j4J64k38N07l70j97K86
7959F6j04J38K22m00J22J9n2O2j1K1J2O0k76j08J71Q4k36L00MR0j24r4J55j13
$$ y = [-136, 44, -139, -86, -152, 274, 8, -141, -33, 214, 60, -14, -140, 167, -131, 96, 53, -283, -58, -232, 37, -70, 84, 57, 81, -161, 86, -175, -35, 58, -99, -384, -114, 58, -104, 27, -16, -63, 61, 191, -66, 181, 317, -66, 149, -4, 108, 64, 93, -27, -97, -66, -71, 271, -276, 48, 45, 52, 106, -44, -47, -13, 19, 186, 0, -6, -31, -129, 66, 119, -155, 44, -12, 68, -56, 106, -115, 148, 33, 12, -42, -80, 34, 87, 67, -59, -115, -47, -362, -257, -140, -105, 159, 117, 66, -61, -146, 67, -52, -2, -45, 21, -136, -143, 12, -89, 35, 216, -70, -243, 172, 196, -74, -174, 247, 14, 117, -132, -213, -52, -243, -216, -296, -20, -246, -116, -28, 219, 215, -174, 141, 206, -99, 152, -143, -198, 75, -108, 223, 297, -47, -380, 30, -369, -52, -124, 89, -6, -118, 181, 98, -117, -104, 24, -163, -72, -86, 78, -160, 347, -23, -220, 66, -38, 100, 322, -78, 44, 63, 11, 73, 62, 83, 95, 155, -121, -229, -58, 26, -210, 90, 94, 184, 60, -34, 121, 8]
7983HN7l8o5Pj6J40p9o9O3J8J53k15J25k13L45l34J8K17Lp1K0p2j9K95l28OJ44
8010A00j32L19m63K61r4j21K16q1r3Q0Q8r5k3R4j64M00k02jp0n5J82k55J69J70
8034B30o3j79L12m79j17J66L63Nk07rn5k0Q9j61L3M7L0m3j63J31L82k29LJ08k02
8059b8k30N11j73r5N3k38K28j5J81J63n23N6L9K40j03l2j13K57k00o1j19J78p8
8082a02R8K02k64L8P8R9N8l81K6J78J6j37j1l9J14K34j56j60K71l54M89l10J04
8105I1k16l2L8J99o3R6m06M49K8j63n0L8p3n8J32r7J94j0K10l01J87j55O0k13
8129a15N0O5jO0j38k1J31j21J1K68k32Q1o3L8k1o3l8J34J11m4j96K25j82m7K46
8154A38k48O0j71L28j00j81M85k90k03K28k39K91j73M10l56k80J99j2K01j31k2
$$ y = [8, 65, 27, -38, -31, -47, 93, 14, -55, 8, 26, 179, -36, 89, -124, 221, -113, -95, 122, 125, 54, 74, 2, -17, 278, -50, -44, 100, -32, 287, -176, 85, -9, -130, 86, 5, -88, -8, 80, -15, -38, 56, -108, 292, 90, 89, 19, -36, 146, -109, 60, 230, 167, -12, 300, -179, -296, -130, 233, 238, 31, 22, -33, -53, 36, -125, -92, -45, -15, -58, -221, -90, 292, 63, 66, 174, -28, -258, 253, 80, -15, 38, -200, 28, 13, 194, 357, -166, -110, -71, 169, 66, 34, -79, 178, -22, -83, -202, -24, -102, -4, 198, -66, -28, 50, 149, 207, -174, -148, 30, 46, -91, -102, -141, -27, 207, 51, -109, 162, -192, 297, -13, 91, -125, -157, -119, 80, 17, 113, -293, 156, 184, 21, -29, 9, -64, -122, 10, -87, 107, 97, 307, 6, 193, 38, 98, -115, -65, 0, -1, 59, -79, -100, 31, -90, -79, 189, -43, 38, -25, 13, -8, -71, -109, 25, 136, 92, -104, 121, -61, -108, 138, -110, -50, -221, 107, 7, -174, 311, 21, -182, 46, -193, 98, -75, 335, -21, -301, -102, -114, 87, -44, -66]
8175f6j64L25r4k94J33n4L00n5J79r9k50J99k01P1Q1j30
$$ y = [-66, -230, 95, 1, -293, -160, -214, 86, 31, 210, 111, -139, 60, -141, -70, 11, -119]
8191a19
$$ Imaginary data points
##PAGE= N=2
##DATA TABLE= (X++(I..I)), XYDATA
0@%%%%%%%%%%%%%%%oJ4j6J6j6J6k4L2l2L8m6N2o0O9p7Q8j04J18j32J48j66J88
37A00k10K35k63K91l22L59l98M39m85N35n90O49p15P88q67R56j057J168j295J438
57G56j601J795k023K296k636L066l628M404n541P379j0816J9340p7355j19589
71a84153K15411J19450j31937j09224P3809N1065k8196j941J1222n2884l386Q7245
83D6481J8292r4547j9240Q7563K6718q2291m3528N6498N5518k5992n4009o808
95c5345N0878M4043k3702o0635r466M4373K6040j8115l0202j3697J9700L7656
107C1528Q407l7366k7073K3608K5527j7493j8910Q103J200m999J5181J0127j8961
120a121p835K3612K339l6023l227M2011L541m6495p653M3752J7919k6007j8803
$$ y = [0, 0, 0, 0, 0, 0, 0, 0, 0, 0, 0, 0, 0, 0, 0, 0, -6, 8, -8, 8, -8, 8, -16, 16, -16, 22, -24, 28, -32, 37, -40, 48, -56, 62, -70, 78, -88, 100, -110, 125, -138, 153, -169, 190, -208, 231, -254, 281, -309, 340, -375, 413, -454, 502, -555, 613, -682, 756, -845, 950, -1073, 1223, -1413, 1653, -1975, 2429, -3112, 4267, -6549, 12791, -64564, -184153, 31258, 150708, 18771, -90453, -16644, 34421, 6225, 4284, 15506, -37378, -40764, 46481, 64773, -29774, -49014, 38549, 65267, -17024, -60552, -4054, 51464, 25472, -28537, -35345, 15533, 59576, 35874, -24761, -34227, 10146, 36186, 18071, -12131, -25828, -6128, 31528, 39935, 2569, -24504, -896, 24631, 7138, -11772, -3669, -2469, -7468, 7713, 17840, -1121, -8956, 14656, 16995, -19028, -22255, 19756, 23297, -23198, -30851, 12901, 30820, 4813, -13990]
133a3990O830N422K72P376l029k2860o106L0153K3925j9167l4806N461L9952K930
147B2363m3438j0777M0580J2539l7911q770M0719J0874l7402r038K7586k283j8530
160a3488J3400P702k8790k386M5801R008m9865j5935M6976J8255l9022j7143K4062
173a425J0098r716O31L975m266K620Q902q973j4886J1570J6971j5394k0054J4468
187e479K3138m842j8358m114J0627Q884j888j0908r094P694J5896j063j3690r18
201d115J0841L045o498o224k73N922K795p088p388R116J4577p095j9264M261J9386
216A1998k790j7242r87R954K093j792K005j105n496L927Q243o085j0490M136P111
231C480k963m881K894M225n92l218r91J785J32q62k905q6L159M61r91L507M10
$$ y = [-13990, -7160, -1738, -1466, 5910, 2881, -19979, -26085, 4068, 27993, 8826, -25980, -20519, 19433, 22363, -21075, -31852, 8728, 21267, -16644, -25414, 15305, 26179, -11223, -20261, 7325, 5042, -13488, -88, 7614, -21176, -23562, 22239, 31247, -18618, -34553, 12423, 30678, -8344, -25487, -1425, 8673, -1043, -412, 3563, -703, 1917, 10819, 1846, -13040, -1470, 15501, 107, -19947, -5479, 17659, 12817, -5541, -9655, 972, 9856, 7968, -2940, -12034, -4340, 11556, 10493, -3197, -4115, 6726, 9771, 3273, -2951, -3224, 2698, 5493, -1595, -8983, 133, 14710, 7615, -11649, -7388, 11998, 9208, -8034, -9021, 933, 3026, 1234, 3239, 2134, -3362, 565, 8808, 2723, -7767, -3631, 3480, 517, -4364, -1470, 2755, 2163, -1055, -2046, -261, -129, -991, -3896, -3982, -823, -362, -1353, 2154, 2564]
248B564n781M66P189m34q874k424P321M086m285j982J409o09K187L504n263p276
264h202M219Q834k822r005K597J0415o19p711n06M760O44j898k048k318K530M152
280C022J151m638l868N230N246m593o550Q76M688K035k679l379K602M368j46l098
296B67j906J629K076j606j742O98N84J386J888k211k957K093L028k293m781Q45
312c002M536j60l759J058L157j216O4P08j341j579R79K087r14k697K030L636j738
329A849k867J307R77j447j342l51J141J90n01Q15M25l36M09%n48K04p09j11J184
348B89J47p71R36N03l32m39J11k51r44o61J562J33k355N93L045o04k090k32J970
367F10L77j923n51J619L5L3J066n79q78J578L21j227j564K35J769l68k116N71
$$ y = [2564, -3217, -2751, 4438, 4004, -4870, -7294, 27, 4113, -172, -2154, -745, -1354, 833, 4337, -926, -8202, -3983, 4851, 2029, -6976, -4379, 6036, 5417, -2294, -2800, 1960, 2604, 706, -1342, -3660, -1130, 3022, 4173, -465, -4333, 897, 6143, 1550, -5000, -4124, 564, 2599, -80, -3459, -857, 3511, 3365, 267, -1639, -10, 2066, 460, -1282, -584, 0, 1386, 3274, 1063, -1894, 199, 3227, 934, -3847, -3002, 1534, 1374, -2385, -1327, 1830, 614, 678, 1386, 45, -1534, -555, 1532, 618, -2079, -49, 3587, 1849, -1018, 289, 1266, -181, -1523, -1874, -733, -543, -1044, -229, 196, -140, 269, 269, -279, -75, -784, -895, 289, 436, -335, 601, 1104, 772, 333, 444, 193, -751, -1412, 150, 283, -2072, -1479, 1566, 962, -1128, -1360, 610, 987, -936, -1487, 132, 167, 200, 1266, 687, -191, 1387, 1708, 481, -1083, -848, 921, 553, -1563, -992]
385i92K112l69q16n28M4J068m57r44L11Q29K35j56M44J28J99m48k11oj068J14
405e11Q75j104l9J189L0m64l81L40L07j072o69J454M62p59L44M43N37J56p36o19
425b17P63k84J3j78r19Q53O00m17j45l10m2P90n97j037P14K17m01O90L13k44J31
446B93K95J68p3j218L53J193j188m8K6K54O32j18j123M5J58l00R94n36j671J196
466f68J453P55j611j408J817J724j579j702M89J268Q35m25j740O1J615P4j103
483a45j128J92R57M69m98o10r21J765K423j732l090J172K860N07k748j553J723
500c57L021r58k291j154J787J829n66k777n90J169J930M87k238k344K422L741
516C111j026m104j496M627K670l365l490J649L882P07l104k520J831K335l64k280
$$ y = [-992, 1120, 751, -65, -593, -549, 519, 62, -882, -571, 258, 493, 337, 781, 909, 1108, 660, 449, 443, -625, -511, 364, -740, -779, 410, 440, -24, -405, -65, 242, -830, -1499, -45, 417, -342, 2, 445, 982, 1138, 402, -217, 546, 262, 275, 97, -822, 31, 631, 214, 69, -241, -283, 507, -90, -1127, -413, -196, -597, 93, 406, 162, 293, 588, 756, 683, -535, -182, 1011, -177, -225, -199, 55, 687, 569, -554, -509, -351, -651, 343, -193, -1864, -668, 785, 1540, -71, -1479, 338, 2062, 483, -1219, -730, 538, 1373, 948, -792, -731, 884, 958, -145, -1273, -1081, -124, 345, -153, -763, -1684, 81, 2504, 772, -2318, -1146, 1714, 2221, -527, -2080, -357, 2664, 1706, -585, -1739, 48, 1877, 1311, -1466, -2056, -887, 1043, 1530, -708, -3052, -630, 3111, 2085, -2019, -3515, 1112, 3782, 417, -3073, -1424, 2458, 3165, 61, -2459, -628, 1707, 1343, -937]
532i37j344Q49K714R4k531j461J671K797N23l799j785L034K737l27m110j031L848
549I42K986k806l438P32K649O76j894j204K3J346J087l07k090n33K202J023r66
566D28j755m02J994K692k351l546J807M379J38n366j649M907J940l496j540P49
582a071R24N49R17p09k551k82L462J520l702k487L168L182j319l436J59L620N64
599B508l435q68K446Q43j465q46J8P53O04K98j027j743J058K054l59j830q07J048
617g50K414R3k457j013J906J861j227j783l6J694L74j533j56M49O18o98j031N64
635g11J706r14j394Q87J271r83j54O13L69j306L74J787p39j941N37J626m42q19
653b33j49P70j18p15p80J485O35j761j135J757K037j277k567J441K310j273j155
$$ y = [-937, -2281, -1432, 1282, 1376, -1155, -2616, -945, 1852, 2375, -1424, -3209, -175, 2562, 2235, -1875, -2906, 942, 3928, 1122, -2316, -1584, 1065, 1741, -153, -1357, -1334, 12, 1099, 792, -1298, -1831, 371, 1394, 428, -1327, -1729, 265, 2957, 606, -2940, -1133, 3246, 3384, -1982, -3631, 1276, 3216, -280, -1820, -1071, -147, 402, 1319, 610, -1941, -2223, 1239, 2759, -943, -3430, -262, 2920, 1601, -1835, -1676, 1944, 2508, -927, -1795, 651, 1494, 29, -817, -799, -46, 558, 856, -171, -1914, -856, 1198, 839, -991, -1798, -750, 1664, 1757, -700, -1713, 193, 2054, 827, -956, -992, 702, 1076, -457, -613, -164, 454, -244, -1275, -711, 995, 81, -1313, -426, 845, -138, -292, 321, 690, -616, -242, 1545, 806, -1135, -598, 1028, 586, -233, -382, 388, 270, -445, -1225, 260, 895, -866, -2001, -244, 1793, 516, -2051, -610, 1700, 427, -728]
670g28J333j51j031L47J358m94j777O03K057o43k048L76J069K7q45l59Q43M31
688C68o29r7L73p5K43L36m98n88K00J286L5j319l94J245m4m04J11r63R4R57N99
709H36r99r48L54J570J44j515k87Q77J049l73j593K03J535N08j215k56p9j40J129
728H00j01j735m66J432J632j477k215J242K328m16j704m19P49J639n52j074m47
745g84J145M83j90q36k89O04O28k16r93q12J146J584j562j793J271J425P8j635
763g46j46O98O38r2k31m42Q3J193j84j291L49M01M39k17j087m6Q53L31q78m50
783h25M32L61J49m46K55l95Q5J311n92j306Q70P78l31j70m76K70L86K69m55l40
803a70j59N64J24p22l11O85r8J16P9p13O08M23j92o08K52L71M72o33l35O06l01
$$ y = [-728, 605, 454, -577, -230, 1128, 634, -1143, -540, 1517, 874, -1174, -798, 271, 298, -547, -906, -63, 368, -261, -358, 15, -60, 183, 519, 21, -567, -367, 919, 954, -365, -759, 486, 442, 38, 149, -814, -720, 237, 836, -163, -1111, -757, 813, 957, -558, -845, 32, 1081, 708, -885, -682, 853, 1361, 146, -110, -189, -329, 800, 699, -1036, -1502, -70, 1562, 85, -2130, -888, 1440, 1024, -680, -1099, -350, 1289, 737, -337, -784, 361, 844, 654, -182, -471, 133, 761, 545, -448, -1260, -114, 1470, -92, -1885, -614, 811, 889, -746, -892, -194, 444, 352, 121, -321, -238, 955, 771, -520, -171, 230, 669, 452, -635, -681, 172, 503, -375, -825, -393, -32, 117, -329, -74, -469, -384, 927, 335, -971, -101, 677, 346, 176, -300, -30, 356, 625, 170, -170, -329, 235, 359, -363, -674, 11, -87, 29, 108, -605, 3, 426, 234, -374, -122, 249, 721, 88, -247, 359, 58]
824E8J87K45q28l13R86mm71m39O5Q92o16m20J14O51J16J01n83K2Q85l4n62j94
846a42J34K55K15l85r7K23O1j26k92j75L64K07l76m40L11K73j77K63o57O42O8
867A49k49M30k86K85k13J9j16J07l0P9K0m47oM34m00N3J23k30K63J95j01j53k69
890c43M74K28k34l24O45q4n62N51m60R6M21j75l49J50k70K03l94%L39k37R7L85
912A57l92L94J6o9J22k88J09N3O6K6p0N16r30K58N7m82J63J02k4k7p2R3K35N7
936G0k61J07K62j93j17K90J08j65K0j28k1p3L90j45l01N9J23j23K61q7l93L20
958CM7J44m61K4K13K98j49k70K87L00m66K29k43j26O61m7o46q1N22o0k72l89J87
981b95K75j16K46n48J0N07j4j69K52o1rN34m61l37L32J92Q8l15l97L42L48m73
$$ y = [58, 245, 490, -338, -651, 335, 331, -140, -579, -514, 378, -238, -658, -544, 107, 223, 324, -259, -237, 648, 614, 52, -142, -8, 247, 462, 77, -20, 203, 264, 138, -154, -329, 35, 242, -134, -574, -263, 10, -167, 96, -561, 81, 149, -100, 330, 44, 329, 116, 135, 19, 126, 96, 175, 195, -252, -258, 176, -224, -171, -48, -278, -15, 180, 79, -74, -343, 131, 359, 125, -199, 446, 362, -200, 351, -109, -13, 408, 233, -116, 34, -236, -33, -427, -427, -88, -325, -228, 157, -235, 159, 175, 106, 228, -60, 49, 102, 168, 194, 124, 640, -290, -32, 25, -457, -294, -192, -216, -243, -315, -222, 13, 70, -191, -84, 178, -15, -132, 158, 266, 101, 121, -7, -28, -101, 289, 144, -157, -98, 25, -98, 163, 76, -317, 3, 50, 194, -267, -243, -30, 268, 119, -151, 136, 436, -30, 199, -44, -170, 491, 444, -202, -283, 239, 179, -93, -482, -295, -20, -136, 110, -438, -428, 79, 65, -104, 148, 87, 78, 612, 151, -186, 146, 338, 426, 111, -286, 56, 404, -69]
1003f9j24k17K73J38o9l30K68j53K82R0J24k97K94n3K83j52m33P7N57m53r6j29
1025a89N3N21n06J3k01M52m11Q9k05n2O62k92m3r5l1N51O2k57l05K76J67R9l10
1048D8n20N25L29k02k04k63J62J87k06m25J87M25M6m2k25J04J04J69k1j03k11
1069a36K74N25n32j99J83M6l3P7n61K96J21j81j11j8J85K73m15J60J00m05N12
1090A61L77n05n7j35K24ql43J39J53n0l7J89k83r3K93r4K8J8l03O2L84nk45K88
1114A58j61M08p21M25J62N6l59P1Q9m3J86l26n46P84k53j48K90k64p9L7M44o6
1136A44j30k94O88k26j9M9k31k00M19M32p04J50J45j85j71J71n6Rl57K85K13o68
1158e36L50L86k86j34K49k14m5N21l51J46L74r3k87l94K39K42m29Q5K16k79j27
$$ y = [-69, -193, -410, -137, 1, -68, -398, -130, -283, -1, 89, 213, -84, 210, 157, 440, 288, -145, -68, 489, 36, -60, -189, -136, 385, -121, -108, -309, 143, -268, -179, -384, -436, 226, -66, -109, -204, -235, 316, 378, 121, -184, 92, 259, 358, 48, -472, 53, 382, 180, -24, -287, -125, 62, -144, -569, -382, 43, 89, 47, -178, -74, 30, 199, 178, 75, -136, 138, 663, 131, -68, 115, 161, 128, 205, -356, -60, 61, -120, -231, -249, -64, 209, -206, -46, 54, -351, 161, 538, 33, -24, -159, 65, 57, -286, -147, 6, -44, -81, 108, -175, -268, 25, -69, -41, -23, -326, -264, 120, 115, -130, 158, -3, 405, -316, 109, 271, 327, -32, 39, 128, 85, 271, -55, -601, 183, -70, -218, 72, -192, -271, -234, 210, 144, 14, -280, 408, 182, 163, 212, -19, -219, 200, 632, -72, 78, 223, 38, -133, 38, -18, -9, -366, -81, 132, -536, -186, 200, -86, -220, 29, -185, -230, 291, -60, 86, 460, 367, 80, -314, -75, 167, -262, -177, 39, -240, -367]
1179c67M86J80p21O5L05K57j96k27O6M56Q3k54k19j11Q05j92n42N16k3n81K1K12
1201A9l21L15L72m71j43L0K60k2k78M45l34J53J15L45n44K03K12j75o3k48j69
1222b99K87pK80l01n15P39k89j52M34l16l07O67M5l59j94J47M61k78k27R1L82
1243B89l13p2J57l5j78M63l80l23N13j71j12K7l7K22r0J77l84J01L92j63j97J32
1265A8N37l31j69J30l37j76M45N6k12M7j42J3J66n7m6J26l90M01j54j83J84K44
1287A70j26k80O07l00m8N0M5L3l4RO3l65K06J08l8j89o8k62L48L53l01jM3m4P7
1312E6n6O1K36k40L1L08k54r3K52j35l76J04J53j93p2Q7K71l80K31p6M0k14M35
1335A76J4p60O63M02n66J00K5j96M48l73M11l23j78L3K40l89K17k10P7J63m0k30
$$ y = [-367, 119, 299, -422, -357, -52, 205, 9, -218, -152, 304, 387, 133, -86, -197, 608, 416, -126, 390, 367, -214, -193, 19, -302, 13, 385, -86, -229, -199, 61, 39, -239, 206, -128, 25, 140, 485, -59, 144, 356, 181, 118, -130, -299, -12, -19, 261, -40, -555, 184, -105, -257, 177, -139, -446, 221, 266, -93, -287, -140, 321, 43, -184, -93, 289, -24, -96, 61, 26, -152, 311, -69, -392, 121, -50, -162, -135, -172, 50, -40, 137, -247, -146, 246, 83, -114, 18, 555, 224, 55, 185, -152, -328, 117, 173, -39, 8, -134, -121, 45, -12, -58, 68, -322, 79, -75, -258, -74, 170, 44, -236, 371, 71, 23, 73, 118, 151, 117, 126, 189, -176, 30, 138, 100, -89, -157, -419, -71, 282, -19, -20, 23, -21, 56, 0, 61, 297, 57, 88, 396, 142, 49, 301, 166, -210, -106, 47, -146, -218, -131, 140, -240, -9, -85, -45, -259, 176, 190, -570, 93, 495, -71, 29, 54, -142, 306, -67, 344, 21, -157, -124, 116, -273, -56, -266, -189, -26, -66, -296]
1357b96L08J20k56LK64j89n3J31O3k7k63L00l0k44K40Q1K1N9j23j42q6j18O6Q2
1381h9K3n0J11L1l61J95J0K16Q7p6K0J09R2l66%L49l83P6rj10O1j26K46k74%K99
1407H1Jm61K10J54L9R4J99k49N8J47j99j14J05K19k57k3q8O3n9R9J6n66K58M64
1431A91j89k46M12k8j88o4l4M87j53K7o0m01N37Q2n18M4J04o5l31O24k57j59L34
1454A49m18K25j31rJ83q1Q7J31m51L62R4j43pj09J76j47J51j64K64j87j16n1j4
1477b06R7j26J29j24P3o3O4K68j34J86j46J22m7J79j80J50l97K02rQ2l0m6l31
1500b87J80o6k8J21JL5k46O25m31J59k6J0K13k15J25L24n54NM2L5p6J08K1j30
1524e5R2l74J39K60k49L54k04J68j79J04j32q4M88m08K07J07m72N48j35k96Q8
$$ y = [-296, 12, 132, -124, -121, 143, -46, -99, 32, 95, 68, -195, 105, 75, -169, 71, 152, 173, 232, 109, -33, -119, -237, -171, -89, -66, -116, -5, 26, -335, -140, -130, 86, 173, 97, 117, 226, 318, -48, -48, 301, -82, -6, -15, -125, -64, -190, 56, -218, -218, 81, 82, -379, -169, -15, 24, 118, 317, 68, 126, 273, 74, -40, 65, 284, 27, 4, -84, -21, -80, 19, 35, -531, -273, 191, 2, -244, 168, 140, -48, -112, -146, 341, 188, 215, 155, -246, 291, 373, -145, -101, 3, -62, -393, 231, -26, -185, 149, -269, -44, -175, -184, -1, -82, 5, 136, -315, 47, 141, -2, -9, -118, 58, -89, 62, -102, 162, -25, -141, -192, -206, -109, -235, -106, -230, -157, -220, -156, 112, -22, 164, 18, 140, 93, 272, 92, 242, -155, 47, 38, 120, 90, 44, -287, -107, -173, -201, -80, -79, -44, -290, 335, -96, 63, 37, 47, 260, 45, 170, 494, -60, -55, -13, 22, -54, 54, 75, -55, 37, -337, -198, 62, -187, 167, -37, 131, -48, 56, -76, -160, 328, -80, 127, 234, -238, 310, 175, -121, -33]
1545c3K99k81K14k89JJ67Lm58N71j50j07k1q9N7J27j7J26J90m81N04l50K4m3o5
1569a01M3j01M9J63O6j35m9Q4j6k28J81j75K76j63M0n1L15j29k69N86j65n3l06
1592a38M57j21j09k54J26J05o4K2j02L6j1J2L6J72l69R5j07K78L1J41j82K09j79
1615H4q6L55j87l27LL32j28J34j98P7O9k25N9J29j75N1K33k61J31J60Kk25J98
1638B05k41L7R0j03L6J15p3K2k51L6J85M0r1pk25N3J56k37L05N8l19K32p7K90
1662B36J16l90J36m6J71l15K70m73K24KK68k91j15r5J23J57o2o9k0p1L9K46J06
1685A47p8o4j17J42J35j50J56j65q5o8O1l65J77o3L32j00o8K2K05k27L9K49r2
1708B3j21J33R9k37K45K40m91K41j29k50L67m88L14j91J45J22j66N0r5J08q4J58
$$ y = [-33, 266, -15, 199, -90, -89, 78, 81, -377, 194, 44, -63, -84, -173, -116, 11, -6, 120, 310, -171, 333, -17, 7, -36, -101, -58, -159, -110, 53, 119, -16, -65, 19, 3, -225, -44, -219, 57, -106, -66, -117, 198, 69, -200, 386, 221, 168, -138, 319, 198, 89, -165, -39, 66, 2, 24, -78, -42, -53, -41, -5, 167, -202, -107, -214, 64, 95, 236, 54, 263, 84, -2, 353, 166, -161, -158, 174, 46, 180, -18, 59, 128, -97, -38, 91, -84, -33, 200, -61, 70, 230, 232, 7, 205, -36, 1, 91, -12, 24, 139, 66, 88, -163, -127, 58, 98, 7, 0, -225, -172, -16, -253, 52, 110, -209, 23, -54, 236, 352, -38, 98, 52, 223, -92, 178, -295, -71, -69, 199, -92, -207, -302, -179, -22, -84, -153, -173, -244, -205, 41, 147, 69, 5, -112, 30, 165, 15, 171, 6, -79, -147, -86, -451, -274, -337, -5, -105, -173, -151, 54, -173, -134, 115, 23, -98, 35, 134, -103, 142, 382, -109, 132, 3, -247, 120, -368, -54, -245, -100, 22, -144, -94, -189, -81, -165, -7]
1730gN6k15M8L67j55Ok61K36j9l4J69P6l30K1k6Q5L25k91L7l10K12K1j22p0J65
1755a6j31p7N76l74k08M97j49q8j39K13qk42J1J92k10L46q5N1k65R5L22o24K53
1778f0L04l20J54j19J88j08J11j6j17m5J31k50M05l06J36k48k9M55j65Q0l62N6
1800a25P5k00j2r2L49J04j82L80k30J56k25j5J31J47l83M23m2k42K2L8n4j25J5
1823h7L15j95j72J0O2j31R0K04m41L69l7k14N31k11O7l26P0L7L31j03n04L14j5
1846c6k8j06N4J71R1k10j2k8o1L38L3k14l0k18L05K02n6L9k15J47k38m0L01k03
1870a4J67r9j24K25l31K48n02K06M71l14J24l9K26l23n8M41m10M07n12q1M16J01
1892B25j43k29J83J41j01l86M17j78j69L48l14n2M04J0l94K05J77k84J26J43m0
$$ y = [-7, 49, -166, -118, 249, 94, 100, -161, 75, 56, 22, 191, 267, -63, -42, -68, 17, 342, 51, 88, -222, -10, 11, -111, -181, -16, -147, -224, 352, -22, -230, 267, 118, 30, -109, 104, 96, -146, -135, 57, -153, 193, 108, 159, -106, -11, 311, -313, -60, 244, -76, 78, -41, 147, 39, 150, 134, 17, -28, 103, -147, 258, -48, 88, -160, -189, 266, 101, 181, -181, -125, -50, -250, -262, -354, -5, 99, -83, 297, 67, 223, -2, -17, 114, 261, -122, 301, 259, 17, 39, 77, 23, -102, -87, 228, 33, -139, -129, -67, -198, -108, 96, -345, 24, -13, -227, 304, 93, 160, -166, -96, -59, 272, 169, -335, -21, -36, -64, -170, -116, 55, 146, -64, -76, -104, -165, 173, 206, -8, -38, -256, 49, 251, 195, 234, 19, 166, -72, -112, 189, -14, 153, 54, -70, 155, -176, 72, -430, -224, 247, -67, 57, 18, 244, -79, -137, 304, -106, 301, -211, -292, 124, 225, 82, -147, 36, 177, 76, -310, 107, -71, -240, 108, -206, -258, 146, 156, -238, -33, 144, -140, -14, 129, 89]
1913H9K38k80J10k59k4K37j76j83nJ78j80K80k78M40m08J30M5j28J25K84r2l54
1935b11J63L99l43K6R8j1k09N4p0K15J01k48k78J21J49PN9j74n6N15k90J12J86
1958C15l61P8Q8p7n5l2m5J24m7j01K64k65K70j27m17J68j66M38q3Q1n4j21P1J48
1982I4p8n3K57j6j93J84j7J15k02k09J75Mk09qQ7k19L05j85L25j96k42J50J67
2005C6n0j03M12j69k9k00J3P7L39m31o9N04l42J34k66NK17j34j38J31J83q4k00
2028a64K14o6P4j61J0J06NO4L9j7r3M2n6J91o2l52L71k99r5K81K4j96oQ4J03q1
2054d0J7Q7j72K72k65R5l04N46o1l55J69l6J23m5j00L11L2m66J1m9K91k1o5o0
2078h5j20L33j37K47j33K43k68P3N1M1M9k74R2r6q6J20j16k1q9K17r3Q1J11k41
$$ y = [89, 327, 47, 157, -102, -126, 111, -65, -248, -253, -75, -255, 25, -253, 187, -221, -91, -46, -174, -49, 235, 143, -211, -48, 351, 8, 34, 132, 121, -88, -34, -104, 111, 212, -36, -314, -193, -44, -37, 22, -152, -208, 307, 17, 129, 315, -46, 32, 120, 43, -12, -44, -89, 35, -12, -113, 151, -114, 156, 29, -388, -220, -386, 52, -31, 50, -4, -125, -54, 94, 16, -37, 220, 204, 11, 195, 178, 293, 91, -118, 57, 61, -148, -156, -69, -288, 17, -168, 157, -39, -281, -131, 36, -14, -117, 295, 126, 97, -103, -90, -13, 326, -105, -174, 330, -12, 122, -144, -139, 78, -56, -194, -63, 120, 36, -164, 50, -16, 58, -103, -93, 13, 18, 82, 121, 104, 11, 53, -3, 188, 126, -226, 145, -154, -249, 32, 56, -140, -146, -62, 41, -40, -23, 64, -108, 164, -101, -6, -310, 236, 175, -180, -11, -47, 76, 31, -69, 242, 274, -192, -181, -230, 61, 40, -25, -85, -205, 128, -9, 238, 105, 348, 80, 153, 204, 245, 294, 20, 112, 16, -70, 50, -66, -87, -176, 41, -52, 29, 140, -101]
2102a01l6n4K16M2O2j62N5q2J34R6l74j18N78k89L1M6N3j81R4j12rL03k63Q7N4
2127G0k67J42K02q2j72K08Qk25L33l24J98N1q4P3m32K71J27q5K49l41J75k03R5
2150a3J87j08J72l08l3Q6J15n0k45K23M0K23m0k75J08j42k85K56J57J85n36L53
2172G0J23l05M08k55p4J98j77K56k95L7J72k13J10R7r4k24L20l54K36M2K11n96
2194c07L62q1k35M06j37j78K02J28k93O4L68m46J82p2P0N3J10j27M1O0J17m36
2216a49J34j61K53p4n6j78J93J95l17J61o0J21j89N26m24O9J57m2j52K22J1j45
2238I5P1k13J49k07K33m25N4K99r9l0j41L6M31k16m2o6K19l13M7J21k41K19J0
2261iJ65n1j45L60n45L72j50j13K14k10N6J66l73p9L77K20k36N7j60J20K54m42
$$ y = [-101, -137, -191, 25, 67, 129, -33, 22, -60, 74, 170, -204, -322, 256, -33, -2, 44, 97, -84, 10, -102, -111, 192, -71, 16, 70, -197, -55, 147, 65, -107, 101, 109, -116, 217, -107, 91, 142, 58, 131, -301, -30, 97, 12, 261, -80, 95, -108, -13, 174, 66, 238, -70, -103, -17, 98, 48, -197, 26, 66, 289, 249, -26, 82, -60, -345, -89, 68, 253, -283, 70, 193, -112, 296, 41, -33, 165, -12, 244, -51, -14, 158, -55, 55, 152, 58, -166, 154, -200, 36, 78, 289, -307, 55, -26, -261, 145, 8, -170, 32, 160, -133, -69, 299, -147, 35, -37, 33, 86, 196, 69, 110, 170, 287, -149, -15, -176, 77, 3, -53, -231, -38, 157, -160, 1, -59, 62, -127, 399, -25, 44, 201, 159, 7, 229, 240, 95, 166, -47, 102, -105, 128, -297, -243, 56, -43, -73, -214, -178, 253, 37, -5, -71, 148, -165, -118, 3, -238, -19, -9, 156, 105, -40, 320, -225, 147, -3, -116, 98, -112, -56, 110, -263, -342, 35, 255, 19, 76, -84, 36, 290, -152]
2283a52K38R7K69n65K56j47k16L86k90J9J9j13L70j25m16J93N13m46j1L0L83k39
2305E3j60P7K70m5k34q1J90m7J49M4n0j96J5R4k37N9j49L32m2j43m4j15K73K1
2329C4k12J18J52k29J03L3j31J98l25J60K35k37O2N6j80L43j09j93J61L0j79p4
2351a84O9J75R2J1m64L64%j76L08k67J09N1k0l5K71m74J3L04o7j45PK98k08j45
2375a13L15l9j12P0j05j9l23J65k0L27P4k85J12l8j07J32j38m5K65J36l90J74
2397C6J48j58R7m29N56j80q8k70J61K93j20p0J04M8r3r%m9j78J32Q1l3L4l73L23
2422c7j2J37P8j54j89J60m8L51m32q9L20l0n0p6p9K09kj46J99r7M8j73o9J6K98
2447A33j83K4K19l23N19m01P6k55K64rr7q9O8k20n0M21k31J06J55m2Rj46R1q2
$$ y = [-152, 86, 183, 452, -113, 143, -4, -220, 166, -124, -105, -86, -199, 171, 46, -370, -177, 336, -110, -121, -91, 292, 53, -107, -30, 240, 195, -39, -120, 70, 23, 172, 216, 166, -30, -15, 79, -158, -99, -248, 84, 42, -101, -145, -260, 13, 34, -178, -60, 92, -137, -34, -1, -132, 66, -259, -99, 136, -101, -39, 17, -163, 180, 71, -122, 39, 69, -110, -184, -115, 60, 152, 163, -301, 63, 63, -113, 195, -72, 37, 88, 68, 33, 304, -170, -157, 147, 80, -65, -58, 240, 32, -113, 202, 163, 51, 121, 16, -3, -326, -161, -181, 146, 220, -65, 47, 9, -98, 34, -104, -149, 116, 252, -138, 36, 184, 26, 123, -306, 250, 70, -18, -288, -127, 166, 46, -24, 80, 128, 35, 26, 26, -23, -201, -69, 12, -21, 13, -360, -37, -49, 88, 166, 12, -177, -17, -65, 286, -146, -235, 85, 55, 5, -71, -150, 59, 57, -89, 110, 13, 61, -112, -181, -165, 133, -50, -26, 193, -130, 389, -12, 64, -191, 73, 64, -33, -122, -54, -274, -324, 97, -134, -28, 127, 85, 94, -52, 39, -43]
2471d3kR4L5k12Lj29M1K97j37N4l1K13l33L5K03l56L12k50p8K64P3j75N6j10O6
2496a10K97j57k50K00J8J46j06j26J6j81L43m06K44J30O6j93J05m5L0p0j56L08
2518A03k29M2J43j34M6J5K17m00Q8nN8j06M36j45ko8r2J88k22N3K69m11J05Oj59
2543b04L26k75J64l3J1j28K22k96K9M79k28J18j68N1j20J52k49MR4K85k28K32
2565B38o8k68K60k37K22q4l16L02l47L14J22m01N6L22j78K52l7j25J15j77J1k
2587b6p7pJ40p1K36k28L7P8qk73J94rK18k91r3N1ok0Q3N9L7J31m17J92jj5K83
2614A97j51q8j08J68J42k72K19K04l77k08M18k41K57m7r1r2k0j1n3L87j12o2j5
2637D4l54M67j04p0k24j46L74mJ74k57J73k15O2k31M99m4k27J06k6j74L07j52
$$ y = [-43, -45, 49, 84, -128, -125, -254, -213, 84, -53, 1, -30, 183, -150, -115, 88, -268, 44, -206, -284, -20, 53, -122, -66, -176, -110, 187, 30, -220, -20, -2, 144, 38, -88, -72, -253, 90, -316, -72, 58, 124, -69, 36, -9, 21, -49, -205, 103, -126, -84, 59, -75, -29, -14, 203, -197, -109, -114, -56, -162, 274, 129, 127, 59, -33, 155, -67, -14, 255, -156, -51, -45, -204, 122, -153, 11, -22, -11, -139, 83, -213, -184, 295, 67, 185, 17, 68, -52, 100, -149, -145, -51, 234, 6, 238, 170, -98, 162, -75, 147, 63, -253, 49, -298, 16, 138, -263, -207, 115, -63, 189, 152, 27, 142, -35, -24, -26, -103, -110, 30, -41, 195, -33, 4, 82, 74, -199, -5, -14, 204, -87, -180, -129, -135, -155, -72, -13, 24, 155, -262, -70, -71, -86, 197, 46, -42, -150, 18, 160, -112, 107, 311, -66, -274, 144, -97, 160, 113, 22, -70, -90, -101, -154, 233, 121, 59, 44, -310, 157, 53, -17, -241, -387, -13, -17, 157, -100, 73, -142, -80, -311, 188, 144, -83, 23, -3, -177, 130, -22]
2659b2K61l19J28O1k0L3n2j58p3K12M7k3l10J53J37p2J03rPN7k57P3O0j56J56
2684A7K7j80N3J22n5O7Lm1O6j49j76K90j39p1J21J68j14k17L09k46J84J20j79
2707b0J85j74j76rJ71o7L82k98M0k42J68K3j34P1J8P0j57K33j50J81k86K48j22
2730d5mK35j41m3l4J83n3P2j90K43m05N01l49nj31O5J72k5Q0m89L23P7ok87L13
2755E7J78j15N7k57r3J55q0K43k23o4K45j60k42R9L50m1Mk84K22m1k01K25j31
2778i7K94k45L77l75o1J80P4N9l3k4k12o9mN4J58mJ03l77J81j50j38M44J50k61
2802B4j09qJ11rJ63m15K93J9j00J75l61J97J19m00L89Q7j8j02j4j05j06J11k92
2825c51L41J56J4O8k67M3J21k07j29K62J16k89J35J24q5l7j88N2L11m02K21k31
$$ y = [-22, 239, -80, 48, 109, 89, 122, 70, -88, -161, 51, 98, 75, -235, -82, 55, -17, 86, 77, 84, 141, -116, -43, 17, -139, 17, 44, -136, -83, 39, -16, 51, 54, 13, 79, -70, -246, 44, -95, -166, -45, 123, 9, -208, 101, -145, 39, 159, -20, 165, -9, -185, -194, -23, -90, 292, -6, 34, -208, -40, -17, -151, -80, -62, 8, -149, 84, -66, 115, -171, 77, -45, -49, 186, 45, 2, -32, 151, 98, 170, -20, 223, -182, 319, -30, -35, -166, -101, 71, 46, 126, -363, -40, 37, 31, -256, 57, 235, 120, 177, -80, -173, -18, -98, 145, -78, -142, 103, -57, -299, -200, 150, 109, 113, -171, 51, 10, -191, 34, -97, 197, -48, 329, -46, -107, 73, 147, 206, 173, 149, -63, -132, -136, -82, 76, 72, 175, -202, -21, -171, -309, 135, 285, 24, -85, -93, 18, 9, 172, -243, 50, 69, -31, 144, -217, -20, 99, -301, 88, 175, 157, 55, 41, -64, -170, -59, -351, -10, 146, 160, 228, -39, 4, 125, -82, -211, 51, 167, -122, 13, 137, 52, 15, -173, -121, 190, -212, 9, -222]
2847b22L06M7l51J64L97l24k33P9qR4R1j8Q6j95P6o6L54J4l36j7o0Q3o5P5J21
2872I2K41k93O3Q2l07K3K90k08K22n24K92J90j98J88k00q2K26j0j13J76j93J02
2894E9%l07M35j61k2N8n3K05n01K68K0m0k36J63J94j34M08m39M3J03J38k12nk32
2918b48J68p5K38j21q8K47j56J02k10J72j94L81j1j40N5p6k2o6k0J81l00Q1J94
2941I2l2k61K88Qj0l4j83J06PN2N5N8k81R6J17J5q7k82L21k78J15L4L36l82J03
2966b7J22o7j44K17k05K86k59N5k22N8J75k4o2N7J19p9J77j82mJ3o1j76J50R4
2990A1N5p3J18l12q1L92J45l63J05N9q4J22Mj80J3N0J62q2j1m2n3l8J32L0l89
3015c10L01K5L75m47N5J39k68P5j85L97k70K32m0j4L1k92rJ56L2J24J73j3l54
$$ y = [-222, 84, 131, -220, -56, 341, 17, -216, -137, -145, -51, 40, 22, 108, -87, -11, -77, 277, 291, -45, -62, -122, -39, -104, -29, 92, 333, 40, 103, 185, -122, -99, 191, -17, 205, -319, -27, 163, -35, 153, -47, -129, 97, 87, -26, 150, -43, 59, 59, -248, 187, 26, 4, 62, 9, 214, -287, -19, 1, -39, -275, -112, 82, -52, 356, -83, -40, 63, 201, -11, -16, -248, -80, -155, 83, -38, -126, 121, -35, 67, -143, 29, -165, 216, 205, 65, 120, 44, 22, -44, -64, 117, -183, -102, 92, 60, -201, 87, 95, 85, 51, -132, -26, -19, 33, 88, 146, -135, -39, 78, 93, 6, -276, 45, -233, -118, -84, 252, -130, -27, 95, 28, -116, 101, -104, 182, -77, -22, -244, -186, -11, -35, -97, -40, 79, 0, 177, -5, -9, 4, -57, -233, -83, 11, 66, -7, 111, -201, -282, 110, 255, -108, -3, 56, -28, 94, 98, -82, -69, -19, 143, 61, 50, 8, -45, -83, 49, 79, -310, -9, 16, 391, -56, -1, 138, -130, -55, -240, 157, -113, 119, 79, 65, 96, -196, -205, -49, -17, 107, 280, 267, -87]
3038h7j18J20J08r3j35L38p7m5k73N6K93j71J53k9J17k97J74j06J93k33p8J73
3060a7K16J90l86j43L87k93J34k46J21R9k93J96j55K98j26L10k6k84l4l23M01
3081B6k59J87J65J6n1j00Q8k00Q1jJ98j07j59rK42N0m1k04L3K62o52M73Q0j38
3105b0p4K15l16P8mN7L3q2J60K28m24K90l26KK4JO8J91n5j88L70m07l1J50j32
3130a92J33J02L5L29k26l85K97j81J9o8J37K22l9k41j06L25r7K7l6k7K4J24j19
3153E7P1j18J10K8J89l05j55J2R3J95k60P0l16L66j1q9o3J91J9k34R2J2j0m8O7
3178c7J69n5k4k58J36M3O8k30K19n4J33K9j26k43pL09J00m73K08J64j80p8N4J15
3202a8oJ18l83N15j88j85L0k6K06j93J71J77n8k39j1L25l48J45j30J38Rk7q8L48
$$ y = [-87, -205, -85, 23, -70, -205, 133, 56, 11, -262, -206, 87, -84, 69, 40, 157, -140, 34, -72, 121, -112, -190, -17, 199, 389, 3, -140, 247, -46, 88, -158, -37, 62, -231, -35, -190, 108, -18, 292, 266, -18, -52, -375, 26, -233, -46, 119, 135, 84, -16, 72, -128, -47, -48, 150, 43, -116, -125, 117, 167, 126, -78, -45, 217, -435, 38, 118, -20, -94, 121, -195, -117, -121, -64, -31, -113, 47, 275, -149, 141, -185, -183, -159, -158, -90, 101, 46, -142, 228, -179, -210, -60, -192, -59, 43, 78, 407, 181, -204, 93, -88, -69, -137, 0, 222, 183, -58, -164, 161, 64, 91, 55, 28, 52, 176, 57, 128, 10, 120, 148, 337, 32, -123, -111, -18, 177, -83, -13, -329, 37, 26, -63, -126, 65, 84, -150, -58, -46, -56, -104, -37, 132, 77, 53, -205, -69, -26, 42, -188, 31, -23, 110, 139, 13, -230, -237, 72, 172, -301, -93, 71, -109, -187, -133, -18, -24, 94, -289, 226, 38, -147, -117, -143, 63, -130, 41, 218, 160, -79, -90, 235, -113, 32, -98, 40, 49, 22, -66, 282]
3226B82n2kl48K9q8J21K01P2pj78K6R8j30l7L7J54n46M53j5j69J4K02k28Q0l34
3251c65M29q6q2j62L2M32l54L93m05J67m5k27M18k65J5J58j36J01K1j29L03m25
3273b12KP4J51j28K18K7k32O7n9k23K30k4l8J37k26L47O1j38r7k2J96m3k70K21
3297A9j60l7O7R9J75k32P4O2j02J61j82k60L71K65j58k29%J3j58L37j79O3R4l91
3321b88K46m1k31J91n9L63o5k7k30m6N32l27Q8k77J72L44n22J69o1k4P5j42M15
3344B55k25l8P3j48J4O5j79L7J76j58J65Q2j36P2l1K19k07j05k02l5M56j28M7
3367F9R4K4l33K28j45J11P6n8j36J39q5P2r5J77L8j22p1Q4j37j49M18k62Q7n3
3391b9J0k28L45KJ55k45j20L32k54j16J02J66k39R4L6J5N8Q5j23j29j5O2j33M3
$$ y = [282, 230, 228, -120, -91, -179, -58, 143, 215, 208, 30, 56, 154, 24, -13, 24, 178, -368, 85, 70, -99, -85, 117, -111, -31, -365, 64, -22, -104, -266, -234, 198, -156, 237, -168, -1, -46, -273, 145, -120, -105, 53, -83, 18, 39, -90, 213, -212, -210, -136, 15, -113, 105, 132, -100, -33, -92, -315, -85, -109, -147, -10, -236, 111, 172, 34, -63, -85, 111, 68, -202, 19, -141, -178, -111, -12, 163, -69, 5, 67, -35, 126, -56, -316, 55, 320, 162, -67, -67, -54, -212, 125, -54, 9, 103, -288, -42, -83, -314, -123, -182, 181, 116, 89, -141, -187, 345, 18, 106, -171, 1, 345, -177, -8, -69, -93, -18, -160, 255, 30, -8, 65, -83, -69, -4, -183, -146, 30, -128, 37, 119, -17, 55, 24, 243, 36, -69, -271, -306, 150, 22, 69, 163, 187, -146, 82, -63, 48, 124, 66, -70, 69, -16, 56, -39, 138, 176, 54, -17, 67, -70, -219, 199, -63, 24, -29, -19, -247, 98, 100, 255, 10, -110, 222, -32, -148, -46, 120, -119, -25, 11, 26, 84, 169, 46, -83, -98, -36, -169, -126]
3415a26J17J75l84K61j38J67J75k11J23j92l8J23l20K65J87j24k33L26r4J14M9
3436B22j09p4j49j03L45n0Qp8j62r1J68J18j88L6K41j12P2J7l10L68j00k48N00
3459C21m28J32j91J17O0k15K41j06k02K40L7K04l13J99k01L91k75K4p7j96M46
3480B08j75m6o0J10J19j87L9k06K9L07l63J05Q2K17j95k31J81K79j42j20l12M52
3502I1Q5k00j8R6l9k32K62j77K25j01j07j33N27k64N7k9J62j75k68K52k18M71
3524B67l85L67j33j10J67m05L60N9n69L93J22k38K89l20M7l6j70K37J16p7j29
3545a48L81j64j2Q4r2k7o3J65k32K99j20j05J32K5J8l1O5k47j50M64l97L41m21
3568b35L86L4m4l09J95j4K0K9R8J86l40o6K89j75k53L25p3K41l60O8j57J44M5
$$ y = [-126, -9, 166, -218, 43, -95, 72, 247, 36, 159, -33, -71, 52, -268, -3, 184, 60, -173, 153, 59, 173, 222, 113, 39, -110, -213, 132, 82, 90, 12, -150, -241, -73, 45, -143, -107, 134, 22, 94, 111, -199, 169, 69, -179, 321, -107, 25, -166, -49, 11, -204, 37, -69, -271, -31, 6, 210, -103, 96, -105, 286, 11, 35, -42, -238, 208, 33, -13, -73, 37, 156, -31, 8, -198, -169, 138, -225, -120, -38, 179, -16, -247, -66, 213, 71, -49, -361, 91, 176, -24, -42, 54, 15, -217, 45, -132, 93, -8, -115, -248, 279, 15, 72, 43, 205, 30, -238, 14, -204, 267, -118, 249, 116, 6, 173, -232, 128, 187, -382, 11, 133, -105, 184, -136, -89, -125, -295, -58, 58, -19, -148, 233, 69, 57, 141, 49, 22, -41, 124, -108, 191, 71, -34, 98, 123, 141, 110, 175, -72, -222, 242, -155, 186, -235, 151, 185, 141, -168, 27, 13, 33, 62, 160, 346, 6, -60, 229, 54, -199, 126, 53, 294, -66, 2, -155, -11, 34]
3591C4r0j2J67l4j56J25j27R0k2J81l80K17N1pJ98l68K84k07O7kl4J07K98m31
3615e1L6K50l54L55l21nj28L52ORrl84K15l5J38k92K10j9j46K36n7j10J17J68
3639A81j71P0j15K6p5K09J19m19M1K0m3J0j0J29J53p0K93n44K41l5M9N0j39M02
3663C72m63Q1j75R4j18M12k49p3L07l20L23K3j50o6lq4J7n7QJ14J47l64K10l7
3687e1J7n3m3P2n5J60j1Nj69Nj48M16j15k17R8L41l19q1J20j37MK65J00k25L8
3712A7L31n59J64L2L6K1J10k12L13m17K86o4j23l1l16L96l24M09k95K48l43M89
3734A68k67K3MK35l04R8m8j22o0J91J92J56q5k91K34k30L6n1J33k21N18m00k0
3757a11n9O6J18j00n7o8J99J0J99k4r6j1m3L59p12N3L50j24J76M8O3k07N7j50
$$ y = [34, -56, -68, 99, 65, -91, 34, -93, -3, -25, 156, -224, -7, 44, 37, 235, -133, 151, -56, 11, 9, -25, 82, 380, -51, -15, 235, -119, 236, -85, -90, -218, 134, 140, 149, 140, -244, -29, -64, 74, -218, -8, -27, -173, 63, 6, -104, 13, 181, 10, 80, -35, -9, -84, 125, 244, -175, -134, -114, -157, -147, -157, -28, 125, 55, 348, -196, 45, 10, 59, 109, -30, 372, -91, -10, -185, -91, -209, 203, -46, -119, 188, -132, 191, 214, 64, -2, -5, -89, -72, -129, -121, -7, 140, -224, -14, -51, -34, -87, -130, -58, -113, 47, 36, 41, -128, -123, -271, 145, 30, -187, -89, 252, -67, -148, -28, -165, -161, 104, 204, -21, 17, 348, -211, -47, -15, 21, 42, 152, -60, 253, -164, 122, 58, -65, -96, -412, -16, -340, 69, -226, 22, -321, 168, -99, -76, -72, 163, -141, -43, -91, -213, -273, -82, 110, 266, 181, -110, 124, -106, -70, -121, 12, -209, 309, -91, -111, -170, -104, 14, -86, -143, -211, -12, -2, 197, 173, 77, 66, 23, 382, -330, -277, 73, -51, 125, 173, 236, 29, 86, -64]
3781f4J0k42M57k07J28m7o9J24Q4l84qL56j90J32K6j98Q9K54l01k50L61j66J7
3804h8Q1P6N3k39K16k38m7M4K60k18r0J4K84p7K34k48j21k24K29P9J91J68n45
3827b06L33l31J74K15j95Q4k40J38L5J42j65j86J1j02M52k65K6J95k21k51M06
3848D9o2J82l00J11O4k39J52J35kk03J83l02q6M89j08J24P0l30k46K31k9N9J22
3871F4j16j0P6J70l36K88J15k88R2n7o3Q6r5J14J95j51J27k27J07j69q1L00l55
3894b14J16J4O4J24k01K09j02m6K3L6P8k72L14j38M1n5j82Q8J63L5P3j61m6l20
3918c59L88l03j2L22p5J15LJ88j95n1J7J8m25N60l14r5J13K75j62J17j59j14M54
3941C06n60J9M43j67k04J7K21P3o0O8L7q4j62Oj79K46k64L16K70n08r4L91j74
$$ y = [-64, -54, -296, 161, -46, 82, 35, -34, 90, 174, -210, -218, 138, -52, 80, 106, -92, -3, 251, -50, -300, 61, -105, -88, -7, 69, 122, -117, 99, -139, -186, -142, 118, -100, -190, -176, 108, 31, 265, 17, -104, -328, -99, -20, 171, 339, -206, 127, -204, -30, 185, -10, 74, -166, -28, 7, 149, -16, -202, -191, -293, 159, -106, -80, 115, -106, -357, 49, -13, 169, -131, -20, 44, -195, -43, 92, 90, -113, 70, -232, -318, 171, 63, 187, 257, -73, -319, -88, -117, -58, 64, -52, -62, 14, 184, -152, 136, 251, -37, 55, -2, -65, 21, -74, 40, 235, 84, 211, -16, 91, -78, -159, 141, -214, -98, -84, -20, 104, -97, 112, 10, -36, -13, 23, 101, -171, 143, 5, 46, -9, -191, -103, 60, 95, 168, 7, -39, -359, 29, -274, -286, 36, -39, 76, 79, 267, 72, 21, 38, 56, -369, 191, -123, -218, -105, 170, 8, 125, -34, -148, 306, -254, -235, 208, 41, -163, -146, 75, 148, 88, 156, 193, 109, -53, -47, -226, 20, -244, 72, 342, -166, -260, 131, -43]
3964d3m2j39L16k76J63K61k95j44K20K01j28j56M38j55m5l33L92j91q0J69r1J67
3986B09k73j1K02m9j97J42Q1K1n0j11j3k80L56k04K16J05j1j03k7q7M8q4K6j51
4010b45J50P0L05n24K38J79j64k9m1Q7P4j76K47j48j77M36l86K04J27l71n5L19
4032A20k82L79j98p4L0K76o63M01J25j26K20n09J85M18m27K36k00N3J17p3J16
4053A24j29j73J65lj08j19L97j13K82l66K03j83M4m9K20M9l71J98P2p3Oj53j5
4076i5J86o0o5o2K70k03j13K41O9j72pJ5m6Lpk6R7j71K86k34J79k04O3M9P0q2
4102a9J6m21N05l55K69k17J89J85k74J68j32Q4p4J97l22J07J18P7k06J49p0J19
4124I3j72P7J33k22K42P8j77O2k92J24q9J16q5j06J08m6K1M9J47j29j62K44K67
$$ y = [-43, -85, -224, 92, -184, -21, 240, -55, -199, 21, 222, 94, -62, 376, 221, 176, -157, 235, 44, -36, 133, 42, 209, -64, -75, 127, 78, -119, 23, 104, 125, 75, -36, -49, -329, 27, -177, 39, 144, 133, 30, 3, -84, -36, -120, -94, -245, -95, -25, 280, -244, -6, 173, 9, -20, -61, 26, 100, -76, 171, 23, -154, 282, -104, 100, 227, -144, -199, 120, -162, 217, 19, -55, -25, 251, -412, -11, 114, -12, 208, -301, -116, 302, -125, 111, -89, -36, 81, 8, 124, -5, -178, -13, -16, -124, -243, 154, 41, 323, -43, 160, -23, 21, -28, 192, 241, -130, 68, 140, 67, 73, -80, -95, 91, 31, -34, -96, 174, -29, -142, 99, 168, -4, -11, 4, -42, -39, -46, -72, 25, -146, 140, -94, 85, -119, -56, -7, 63, -19, -3, -424, 81, -274, -5, -222, -33, 152, -122, 46, -86, -2, -76, 121, -201, -94, 24, 101, -105, 44, -26, 93, -79, -2, 131, -91, 151, 229, 52, 114, -178, -54, -143, -27, -112, -218, -110, -156, -135, -86, 61, -68, -230, 14, 281]
4147B81l38J36k34J71j22n4L15Kk21P2O1R2r3P2k24J92j40j23O4L94l01J20j3
4170A09l53N34j73P7o1j5j8j45k70J54J78J36k88q1L54r2J49m28R0K30l32K53
4192HP5k96K55n5k24L73k45K12n9N6j68L01j95k49Q9J04L1qJ35j37N0j53jl4k3
4217a58K20J21P5j38l58J94o5J39l3K7j34J81L2k52L76l20j83M6K0K71J17j47
4239C1k45M34l27Q3j43L47p5J33l3k87l5K6L23j01j08m2J0j18nJ24j66O1J16j9
4263a6M46m06k9n5J08Q7j90K98k68n1P2l2J26m22L33J67l79R1o8K10L3j66l2K62
4287A19m35J55K69j22j78J99L3%J5n8o5K11m6l31K82o2l24M01j64J75j06J90l24
4310a66J61R2k8k2J39l09J12J28k97L83q6k48o6L77k48M03k92J08k63M3J22l76
$$ y = [281, -57, 79, -155, 16, -106, -160, 155, 157, -64, 8, 69, 161, 68, 140, -84, 108, -32, -155, -91, 303, 2, 122, 109, -244, 290, 117, 194, 133, 118, 100, -45, -315, -161, 17, 153, -135, -216, 138, 46, 195, -233, -143, 87, -245, 8, 83, -213, 42, -13, -237, 136, -109, 103, 44, 100, -68, 233, 38, -211, -122, -18, 13, 5, 140, 3, 53, -100, -101, -135, -158, 62, 183, 258, 120, -238, -44, -109, 30, -3, 24, -110, 71, 103, -149, 227, -93, -276, -230, -210, 61, 178, 31, -214, 220, -107, -24, -167, 180, 105, 238, 205, -82, -117, -91, 232, 131, 23, -19, -9, -127, -132, -8, -174, -113, 3, -16, 430, 24, -5, -60, 48, 135, -55, 243, -25, -76, -4, -36, 90, -332, 1, 168, -211, -120, -188, 22, 55, -111, -143, 119, -316, -161, 108, -14, -192, 7, 40, 40, 55, -3, -68, 143, 97, -234, 48, -14, -338, 63, -101, 74, -32, 158, -166, -5, 87, 59, 37, 176, -133, -21, 107, -190, 193, 107, -141, -207, 170, -78, 325, 33, 141, -122, -79, 43, -333]
4332c33L75j06J50k18Q7k3J71m3k02L16l87J46J28m8P5o0P7O1ok58j80K94j11
4355i5N4J30n1j55K22N7l97K80R2m8K0k06O5J20J03j23j82J41j89L79m39K57p0
4378c5M2J16L0k06PK4O6k40J28m5K23p5q1lj22Q2m8n5L35K9j82J47j59j28m9K12
4404A3p3j05J83J04q6J92n18K34J20M2N7k93mN1KMj97K41j64Q5K9J17K40k47Q5
4429A12qk58K72k6j75K08k85k94M51J5J16r9M0j7J10j24J0Q0j37J09j01k45J45
4452a01J15j44O9j06J56K87l32J67j86J49l15L02j97j8L55j07J45k39o8Q3N4l7
4474C2Nj68J51q1j33J16m5M4K45j40j19P2j55J58j44K93k58J94j28K8J82P2k65
4497d4p8l8rM27k60P3K18m30R0n7K97k55m8J69j53K93l88Q2K49l7N3j67k15L45
$$ y = [-333, 42, -64, 86, -132, -45, -68, 103, 60, -142, 174, -213, -67, 61, 13, 88, 28, 105, 166, 160, -98, -278, 16, -95, -41, 89, 38, -117, 105, 162, -235, 45, 137, 89, 109, -97, -32, 88, 191, 68, -114, 27, -162, 217, -222, 35, -35, 7, 123, 153, -53, -46, -22, 44, -196, -68, -113, 110, 35, -46, -49, -171, -89, -137, -192, 143, 172, -10, 137, -22, -150, -199, 13, -60, -165, 18, 122, 36, 228, -290, -56, 64, 106, 163, -130, -134, -83, -81, -77, -274, -33, -197, -112, -83, 34, 274, 27, 112, 104, -154, 118, 92, -83, 125, -160, -454, -3, 12, 128, 29, 69, 52, 162, 38, 48, 128, -9, 100, -1, -246, -101, 14, -130, -61, -167, -11, 276, -56, 111, -75, 74, -241, 61, -136, -154, 201, 94, 239, 0, -68, 15, 69, 32, 37, -131, 20, -61, -194, -78, -123, -79, 166, 26, -93, -21, -176, -18, -162, 131, -127, 67, -61, -33, 149, 221, -44, -122, -160, -169, 258, -2, 71, 289, -141, -51, -108, 189, -66, -114, 55, -98, 195, -193, -111, 138, 101, 154, -13, -228, 117]
4521A17o8m0n5K22k0k13M1k3Nl01K66P0j10K35k50J01n5J05k42L75k14L6j88N6
4545a50K49r5o4k34L40j07q5l0J86J71k52J4L30j27K5k63m0L52k97k6qL50k52
4568a3N2j18Q0l8r7J18o5K14O9j95j76L37k09k2p1k63L48M20m01P1j20J17K13
4591B51k06R9k72P1J82p8N3j99k7J46k31N32l35j2q5L38k76p3p5K5J52J49m07
4614b78O11l54J01j79R5k0q1L08k47P1l0J15m9P6j46N2J06Qk21n5r6K46l58K96
4638b9J53k03j05O8%K74P7k45J49q0oj25q9J97m1j58L78l2l0j60J00k81J15K45
4662A72p5m1k1J31k49L03j18J0j28m9L53m92K84J81j43j59k28L34j60r4N5j16
4684b50J78J73l03l8K36j22R9N4j79K32o4L2j07M8P2j58J24m6K84r9j47J01k58
$$ y = [117, 49, 9, -46, 176, 156, -57, -16, -39, -34, -335, -69, 1, -109, 126, -124, -23, -78, 27, -215, 160, -54, -18, -206, -150, 99, 4, -60, -294, 46, -61, -146, -176, 10, 181, -71, -57, 273, 146, 171, -92, -132, 220, -77, -103, -111, 239, -13, 39, -79, 1, -37, -134, -16, -81, 133, 202, 7, -169, 168, -41, -63, -134, -397, -49, 371, -30, 41, -79, 38, 251, 45, 144, -128, -57, 125, 47, 100, -99, -126, 20, -211, 321, -14, -26, -111, 227, -49, -122, -197, -172, -20, 129, -278, 333, -21, 80, -99, -4, -24, -105, 203, -44, 27, -3, 112, 63, 139, -7, 45, 151, 159, -62, -117, -213, 33, -325, -29, 124, -79, -184, -116, -116, 158, 235, -10, 139, 59, 53, -72, -161, 36, -5, -163, 215, 183, 153, -7, 93, -188, -73, 172, 97, 56, 35, 166, -83, 220, 102, 112, -16, -65, 288, -204, 80, 261, 118, -41, -269, 65, -95, -189, -134, -250, -72, 101, -202, -240, -4, -126, -27, 27, -152, 80, 16, 48, -59, -11, 61, -97, 27, -19, 265, 166, 19, 120, -138]
4707a38J85Q3j01j63m1J84J79l06J16J60j31J86j33o5j35o9J11n7J51j22k8J4
4729a20q2J72J15k03J73q0l6j20r7L95k59J21J29r2J32j01J63J34l83r3j26M97
4751B39r8ln0j49L04k30j07O4K1o3J91k22K26k1N7j16L4j8J41m57L33j10P8N2
4775I6j59J52k21P2K3K9M3J54j29J91k99k29P7J59nn5J68J04Q3k27l3j85J52j0
4799d9K2j7O1K7K09j59n6j63j14K24l4J55jj51R6Qn0Kk42K56J18O6m47L30r8K79
4825B72l73J09K07j29o7J69k59L5k51K65M6j37K4J43K5k77J96J0j77L56k63J01
4847B5LN2O8L2m77K33O1j55NJ80j12o9K08M9j47J78k96K68j43p4j38J32Q3K32
4871A98j43j29k20J18K20l7J22L3j42J09r5k48j41O66j62k91K66k92J54j14J66
$$ y = [-138, 47, 130, 29, -134, -175, 9, 188, -118, -2, 158, 27, 213, 80, 15, -120, -189, -78, -135, 16, -106, -134, -120, -202, -30, 85, -118, 55, -25, -61, -181, -278, 117, -142, -21, 108, 16, 148, 47, 210, 344, -39, -132, -258, 239, 141, 138, 88, -61, 243, 13, -94, -30, -9, -72, 119, -103, 123, 102, 159, 43, 77, 59, 200, -257, 76, -34, 44, 96, -63, 89, -132, -60, -37, -8, 35, 189, 60, 251, -48, -277, -200, -41, -46, -101, 67, 171, 254, 27, -6, -191, -39, -49, -27, -44, 17, 44, 253, 94, 38, -125, -239, -15, -49, 106, 105, -46, 50, 58, 8, 10, -232, 24, 142, 208, -239, 91, -7, 272, -101, 8, 215, 86, 19, 188, -71, -36, -287, -22, 24, -113, -89, 54, 79, -198, -2, 8, -169, 187, -76, 25, 28, 80, 148, 180, -297, -64, -3, -158, -153, 27, -85, -154, 54, 103, -44, 134, -162, 106, -37, -111, -249, -117, -34, 198, 55, -74, -294, -176, 44, 7, 129, 162, 20, 129, 34, -214, -355, 311, 149, -142, 124, -168, -14, -128, 38]
4892C8q4k14K32K67r4j48j33m5J87M3k32j5K02PR5k77J90n0J32o7k63J28J6q3
4916a68J41J58j90K5o3J23n7j30M9K44k61R9J45l00J20K07k25J12M5J70l27J56
4938G3o4p5J23J69j10J8l35K43J53k18J65k94QO0j60L27K52k34k46K00K6J85l66
4961a00J58j37J65R7m7J17l75O7j27J66K03m1m03M7J56p1J72J87j8k91L67j78
4983A14Qj60M7k9n7K45j04m3NJ69k17j26J96j11Q2m9K3k54L58N5m24K28K07j76
5007a3N9k20Q6K13k84J69J87j37j43q2N0L53k24l3p0J38k70M01K7k87L0k41K39
5030e2J71k19q8L3L02k92K9m5J85Rk4j49P8k0lJ23K04j43Q0l20R6k1J04r1K47
5055A94l79o8M41j04p3k9NK9Kj01L64m06j2j8m1m6J96p8J11K40l80n5N9J02K51
$$ y = [38, -46, -260, -28, 239, 145, -3, -136, -181, 6, 49, -183, -198, 4, 11, 106, -171, 19, -31, 101, 34, -229, -101, -85, -168, -27, 131, -59, -34, -97, 26, -31, -161, -112, 132, -129, -30, 115, -185, -65, 142, -83, 29, 74, 244, -83, 73, 9, -66, 57, 226, 116, 134, -201, 42, 195, -23, 142, -152, -144, -84, -244, 83, 335, 101, -145, 55, 81, 266, -100, 58, -79, 86, 183, 136, 253, -122, -55, -182, -16, 187, 146, -257, -210, -54, -125, 47, 234, 216, -75, 292, 114, 122, -38, 9, -20, -77, 168, 64, 21, 26, 195, -22, -148, 48, -63, 19, -30, -7, -261, 97, 152, -272, -44, 163, -13, 46, -174, -88, 125, -159, 10, 197, 60, -83, -165, -115, 238, 14, -19, -89, 49, -221, 180, 207, -80, -50, -291, -52, 119, -100, -188, -155, 147, -145, -116, -161, 24, 33, 9, -140, -62, -82, -85, 38, 242, 99, 179, -141, -45, -66, 38, -53, 194, -185, -253, 188, 84, 11, -18, -13, 16, 18, -83, 281, -125, -137, -155, -196, -242, -46, -124, -13, 227, -153, -208, -149, -47, 204]
5080B04k37J14m5j53L7l5M22l34N3j01J01p2J00K9p0p3K61j46q2j34J78k5o0Q5
5104A7k2R9k61J23M7j44M19j29j17j14K00J49m20R6K55N9l51L0n1P3j20K9J60
5127B7J4k89N58m97J68J05J5j64l0J28n9J18nj14R1oj59K90j82N7mk5L4J32l22
5152a19j22O01o29J59J50j01O7J17JK18l38l1K94j21p7n1J07j13k20M00q4k57
5174a49K45r9M5O4J19k84K54k51Q7J9n7j27J54K3j10KL09q6j41j35N39o12o1K02
5198e0j6j02q5N0L03j48R9O1kj88J89j03L7k80K66n4j84M62k22Lj25QJ18Rn4j24
5224a32J56Q6j6r4J66j42J3r4J58n4K67k12k72R3J59k2k15M98m58J78j11K47q2
5247A17R0r9J09J9l21l8K65p1pr3JL4j54J87K19m15j46K7M82j73J3O6j76O7o3
$$ y = [204, -33, 81, 36, -117, -80, -115, 307, -27, 26, -75, 26, -46, 54, 83, 13, -60, 201, 55, -27, -161, 17, -8, -68, 17, -5, 94, -167, -44, 3, -141, 278, 149, 32, -82, 118, 267, -153, -57, 198, 257, -94, -64, -115, -42, -162, -133, 27, 41, -248, 310, -187, -19, 86, 101, -63, -93, 35, -24, 94, 89, -25, 66, 60, -99, 191, 9, 66, 62, 37, 71, 203, -119, -241, 360, -269, -110, 40, -61, 6, 123, 124, 342, 4, -27, 267, 146, 69, 18, 125, 12, -208, 192, 108, -149, 96, -3, 42, 106, 225, -59, 195, -56, 31, 50, -7, -134, 20, 43, -67, -65, 244, 158, 17, -118, 421, -191, -252, -50, -66, -168, -253, -203, 100, -48, 51, 112, 110, -78, 111, 8, 45, -235, 31, -23, -207, 255, 33, 36, -89, -81, 37, 46, -8, -132, 24, 110, 94, 0, 166, 24, 37, -57, 101, 47, 314, 102, -170, -77, 82, 60, -155, 343, -115, 63, -48, 199, 117, 207, 108, 217, 236, -85, -123, 142, 71, 64, -29, -28, 6, -148, 39, 258, -157, -303, -276, 206, 33, 46, 112, -64, 3, -60]
5272f0o4K77k36J89p0J6j09J00j67n2J23m2J55j86j8J26J27J23k10k11N27l14
5294B4j29J48l60L26M4k03J58N1j37J30J12j28r3O7r1M84m64n2J16K22j08j70
5316e3P2j08J64m0k52l7J84j6L73J37l25pl00K19j3J92q1p2j75k73O68l40Q1R3
5340I1k11j3J98r5J82l39L51l06j03L27j75J97M0j79M1j19L26k25R2q6k05R7J82
5363F8j66m4J06JQ0n0j44M04n21K6M78j97l7k21N07n5k56j31M15n14K03N7k9P0
5387E0J93j36j81L32j72j41M3R2Q4N1l44J53k79K32J98p0l8r4Pj47L66k66J3k3
5411g7j10R3k4P9Q1j64K54j04N3J63j19q7j20J40n0N8J46j14L5P6j60p7j01Q0
5435d9J82J9p8J23j47j6m3J02j58lR7j6J20k08l6J12R5l12rK77j81K66j21j10
$$ y = [-60, -124, 153, -83, 106, 36, 52, -57, 43, -124, -176, -53, -95, 60, -126, -144, -18, 109, 232, 22, -189, 338, 24, -105, 43, -317, 9, 53, -150, 8, 59, -78, 52, 164, 36, -57, 10, -81, 403, -61, -113, 3, 225, 117, -53, 19, -89, 75, 35, -217, -254, -70, -86, 287, 424, 99, 92, -208, 11, -2, 190, 109, 37, -138, -411, 257, -83, -2, 91, -120, -133, 65, -30, 152, -187, 164, -142, -245, 82, -93, 104, 144, -35, 6, -113, 213, -12, 80, -6, -211, -114, 68, -98, -142, -36, -35, 45, -5, -149, 255, -266, -240, 238, 41, 4, -217, 290, 235, -21, -152, 263, -251, -48, 9, -20, 50, 243, 107, -74, 258, 86, -55, -12, 80, 164, 215, -129, 24, -255, -23, 175, 105, 67, -27, -20, -167, 199, -67, -54, -77, -187, -94, -118, -39, 42, -122, 132, 28, 81, 244, 125, 38, -82, 58, 8, 66, 212, 98, 133, 209, 49, -28, -129, -49, 133, 152, 74, 197, 50, 34, -9, 93, -65, -68, 29, 13, 133, -75, -111, 1, 96, -216, -225, 52, -129, 137, 16, -94]
5459i4J43P3k79j89K05K17o4m5j10n7L12q6M2k4k39Q1R9O6k84K54o5j58J9j7J3
5484a87M33k19j05K86l00l5L76k31q4K0K25m30J96KO7k61L11J86k79Q0J26k88
5506a11M0J25J79n01L49R9q0m79K37M67m33MM8J68j10q4r5L0Q5p1q4J34J30J86
5530B33n6k74k52O14m31L63j51j2L8Q0Pp3j59n7J76p1L22l61j58nK03J37k30J86
5554F9R2k81j6K94k96J80l01K05j5J17l8Q1K0j64J01J50k34PJ68n83N71o8j81
5577a22K81j76M2J41k15nl98L65O7l7m1J17j89K62Q6k86R9j1j11R6p9K34k69K25
5601G6j43j84J54L31j51K71j94j13k52J30K64pl69K68R1l30l7q1M68l27j0K79
5623A34k78K35M2m22K50q5J3K55j69j34J51j36l4J30O6J76l14m2J02j56M74J25
$$ y = [-94, 49, 122, -157, -346, -141, 76, 12, -33, -143, -200, 112, 26, 68, 44, -195, -114, -15, 51, -233, 21, -44, -202, -183, -200, -187, 246, 27, -78, 208, -92, -127, 249, 18, -66, -46, 179, -251, -55, -53, 14, -247, 64, 250, -29, 51, 177, -111, -71, 54, 233, -268, 81, 180, 100, -379, -142, 325, -108, -104, -56, 112, 2, -82, -177, -147, -62, -133, -217, -83, 47, 233, 177, -97, -349, 265, -166, 197, 46, 34, 72, 152, 159, 86, -73, -130, 46, -25, 297, -64, -222, -227, -24, 113, -117, 69, 161, -120, -136, 158, -138, 42, -259, -54, -69, 48, 10, 91, 111, -53, 48, 198, -36, -29, 139, -444, 127, 59, -122, 159, -17, 25, 166, -49, -54, -452, -87, -20, -57, -98, 19, -170, 92, 178, -108, -9, -20, -131, -35, -114, 120, -149, 76, -67, -251, -97, 234, 83, 354, 160, 47, -205, -75, 189, 182, -187, 81, 172, -158, -195, -276, 192, -135, -145, 134, -144, 91, 133, -289, -39, -124, -111, 144, -25, -159, -8, -144, -178, -48, 18, 194, -120, -162, -60, -216, 258, 383]
5645C83l97R4n7q8L45j82O4k81J07R2j82K40j64p1O5J08k32j19K15P7o1Q9m14
5668c69M09K7P5j62J94j63j23P2K68k80j66J61J51k64P0J30j98J82j74J92o7J41
5690A06l15K14K2k48J58J19mj93J71O4l40M87k19j19L12n18M95M8l62L29p8Pk89
5713a53L68p2j85K59m30J56K8P9K26l33J14j55M6K34j54k11L81m2m61L62l52K05
5735i0q1L80n5j43k04K6L28j92j30P9J69J98K4l61K62j42k78J55Q0j72j27L89
5757A15N0k54R2K05o6l71M56j65j38K7j4K33j30j56Q0p7J04J63q4J0j8J42q0M
5781A28k36Q1k6M9j7M12m71L15K6N7m43J99k15K91l42k6K41m1J85j39J70k09K25
5804B14j24j91j00K12n7O5n4J74k18K13j95J8P7O2j37P3L5k55M06j78j32K0J40
$$ y = [383, -14, 80, 23, -65, 280, 98, 162, -119, -12, 80, -102, 138, -26, -97, -32, 76, -156, -275, -60, 17, -44, 45, -369, 40, 67, 142, -20, 174, 11, -112, -40, 228, -52, -218, -57, 94, -170, -100, 30, -168, 14, -160, 32, -35, 106, -209, 5, 27, -221, -63, 56, 52, -141, 30, 94, -246, 241, 22, -97, 215, -303, 192, 240, -122, 207, 129, 136, -153, 215, 143, -42, 217, -213, -57, -29, 50, 276, -57, 57, -98, -52, 182, 28, -183, 198, 156, -305, 57, -295, -90, -171, 209, 154, 11, -193, -167, 161, -31, -161, -82, 87, 285, 309, -52, 210, 68, -210, -55, 25, -147, -274, 115, 165, -89, 3, 208, 142, -229, 227, 62, -76, -49, -63, 170, 40, -116, -36, -113, -9, 154, 70, 80, 62, 204, 124, 128, -108, -27, -53, -4, -21, 391, -80, 235, 261, 318, -125, 74, -141, 150, -192, -218, 23, -18, 167, 28, 198, -11, 214, 90, -101, -201, 11, -46, 19, -35, 139, -79, 134, -61, -43, 34, 96, -41, 32, 67, -188, 218, 40, -92, -72, 68]
5827F8J1lk56M69o2l4j09R5L9l71J17J55j23J11j83J9J66n4j59J29j04O5k0k25
5851b59O74k17l05J12k32Q8K06k42K76o2j65L58m39J81k55L24j36j42L72j66J62
5872A33j00j03J59J0l18Q9K28K36j88N8n49L00o3O0J4K1J35k22K42K3q7k39J09
5895e2K11K6M4m9j05k29K60j10K0J22k27J17j47K70j08k52M44j34j50J2K6K16
5917B05j95j27R3k67N26q4k35pJ29k02J22j32J29J80K0m83mL84j40J3j02J14O4
5940Ar3J09J01j92K81j19r8l0NJ28j43Qk1K1j00J32k03O9j61K31j70L34j93J67
5964F4k25M53j34k12Q5k14K05j31J84j22J36k18o1K05q8q2J71j08Jj90L54k05
5986a32P7M4k21K78M4L2j21K15j99O7q3m5j36r1J17K47l08L30j38j3mj22K49j31
$$ y = [68, 79, 76, -180, 289, 227, 193, 84, 179, 218, -153, -36, 119, -4, 107, -76, -57, 109, 55, -104, 25, -79, -14, -34, -259, 415, 198, -107, 5, -227, -139, 67, -175, 101, 39, -126, 232, -207, -26, -281, 43, -93, -235, 137, -29, 133, 33, -70, 89, 99, -219, -130, 98, 334, 146, 204, -345, -45, -108, -48, -34, -13, 122, -100, 142, 165, 78, -161, -52, 159, 185, 229, 180, 75, -154, 106, -4, 16, 138, -89, 28, -119, 151, 43, -209, 235, 101, -49, -37, -11, 205, 10, -117, -24, -291, 235, 151, -84, -91, 38, -164, -42, -174, -45, 135, 155, -328, -332, 52, -88, -75, -177, -63, 1, -92, 17, 118, -74, 207, 88, -10, -40, -35, 93, -50, -42, -63, -42, -142, -10, -213, -144, -305, -74, -244, 90, -103, 64, -161, 292, 158, -54, 31, -183, 22, -109, 75, -47, 89, -129, -190, 15, -73, -155, 16, -92, -91, -281, 73, -132, -55, -11, -232, 46, 90, 122, 1, 216, 17, 84, 1, -44, -180, -271, -154, 93, -215, 115, -23, -36, -40, -162, 87, -44]
6010d4L60l16mJ59j66j67O4K92Mm6j73J59j42Qj17K12j87k1K32j58k6J84j03K64
6034B68l07j61Q9pk7M3J02j21M7K15Q5p5k04j40K59l74M19J43k41%J08j60k29
6057b68L14o6J11J8k33O2q6J56J59qm8j35r8K6J03j5o9J41j78j85K53J79k65r7
6081b29J62K0k14K71P7j5m3j85P4J60R5J4l67K53q9m26N67l5k33J11j9k34L55
6104G0L4J43k79R9k08J17L5P6k3r0K80k80J65k10r6L86l14K9P4j51j04J99J41
6127I3R7k87J89j41m8Q0n8Q4m3J12l30K91l9R6j84K5J89j41J08J30j80j79J14
6150b2o5n2J04j71J19L18j70l16L83m65K27J44l92J71k7L09k61K25n20M05L5R0
6172F9o7K45k42J12k86K17L18n68K33r9J69j51K18l64R9K5J31k8oK35k17M9k43
$$ y = [-44, 316, 0, -4, 155, -11, -178, -114, 178, 182, 136, -37, 122, -20, -12, -129, 83, -104, -125, 107, -51, -77, 107, 4, 268, -39, -200, -111, -118, -145, -102, 0, -121, -74, 141, 226, 151, -53, -193, 66, -308, 111, 254, 13, 13, 121, -39, -268, 46, -20, 91, 109, -124, -62, -148, 8, 167, 159, 111, -24, -122, -96, 7, -8, -77, 64, -114, -299, -46, 133, -132, -229, -67, -47, -261, 10, 87, 72, 29, -156, -82, 78, 173, 187, -180, 73, -16, -442, 125, 90, -143, -32, -51, -285, 70, 104, 247, -32, 67, -141, -24, 11, 87, 64, -26, 254, -26, 139, -71, -167, 219, -95, -66, 8, -143, -247, -48, 93, 190, -97, 92, -49, -97, -17, -75, 9, -34, 78, -252, 39, 0, 96, -88, -63, 126, -15, 93, 223, 43, -136, -22, -87, -139, -35, -206, -87, 231, 61, -255, 128, -337, -110, 34, -358, -187, -214, 95, -166, 59, -461, -56, -21, 69, 2, 247, 5, 117, -169, 48, 366, -202, 31, -68, 101, -50, 168, -196, -97, -72, 59, 31, 25, 260, 43, 92, -151]
6195a51J89r3j53P0J38j3Q8j60j82r8N78j54m2o5M9K17k87J66j35Q3m1L9lJ16
6219A56k50qN2Q0L6J7k04N3K89L6k53J68Q3j48l2p8J71j78n0j96O30m01J66r2
6243D7J44k22nP9j91K57Lq7j22Q2j91N86l02mK23Ll38K18l75K33m6K3j9j08K3
6268h9P8km3L18j38k64J35k0J15j68K82k19k6J03P6k49K80p4j12L5q3lJ84k17
6292a01J44J14J1M4k36k0K0K26m21J3J91M2j6J71k41J28J56l37Q5J62j75j02J67
$$ y = [-151, 38, -55, -208, -138, 0, -13, 75, -85, -267, -365, 213, 59, 17, -48, 1, 218, -69, 97, -38, 45, 4, 43, 40, 156, -94, -102, -50, 30, 66, 83, -121, -68, 221, 257, 4, 172, 255, 107, 75, -3, 168, -10, -60, -256, 374, -27, 139, 47, 191, -31, -36, 43, -148, 109, 112, 25, -97, -15, -206, 380, 78, 74, 297, 300, -38, 180, -195, 38, -8, 15, -4, -112, -89, -11, -13, -56, 262, 124, -140, -5, -25, 90, -78, 204, -15, -41, 62, 138, -111, 169, 95, -17, 18, -65, -68, 116, -101, 43, 157, 168, 212, -24, -44, -24, 202, -219, -206, -15, 27, 11, 182, -59, 69, 225, -112, -27, 135, -40, -142, 25]
$$ [...]
8191a2
##END NTUPLES=NMR FID
##END=
