##TITLE=1H_Pr 5063-st
 CDCl3
 8 sc, 
 14.12.2021
##JCAMPDX= 6.0         $$ Bruker NMR JCAMP-DX V2.0
##DATA TYPE= NMR FID
##DATA CLASS= NTUPLES
##ORIGIN= UXNMR, Bruker Analytische Messtechnik GmbH
##OWNER= root
$$ XWIN-NMR		Version 3.5
$$ Tue Dec 14 11:07:19 2021 Russian Standard Time (UT+4h)  she@DPX200
##.OBSERVE FREQUENCY= 200.131346
##.OBSERVE NUCLEUS= ^1H
##.DELAY= (6, 6)
##.ACQUISITION MODE= SIMULTANEOUS
##.ACQUISITION SCHEME= undefined
##.AVERAGES= 8
##.DIGITISER RES= 18
##SPECTROMETER/DATA SYSTEM= spect
##.PULSE SEQUENCE= zg30
##.SOLVENT NAME= CDCl3
##.SHIFT REFERENCE= (INTERNAL, CDCl3, 0, 15.7039)
##AUDIT TRAIL= $$ (NUMBER, WHEN, WHO, WHERE, WHAT)
$$ ##TITLE= Audit trail, XWIN-NMR		Version 3.5
$$ ##JCAMPDX= 5.01
$$ ##ORIGIN= Bruker BioSpin GmbH
$$ ##OWNER= she
$$ F:/spectra/data/she/nmr/H-F/1/audita.txt
$$ ##AUDIT TRAIL=  $$ (NUMBER, WHEN, WHO, WHERE, WHAT)
(   1,<2021-12-14 11:05:52.25 +0400>,<she>,<DPX200>,
      <created by zg, POWCHK disabled, PULCHK disabled
       configuration hash MD5:
       00 E9 B6 7A A2 85 ED C7 34 08 36 98 17 FE 4E 26
       data hash MD5: 16K
       3C 49 3B 60 03 23 4D 9A 20 97 9E E4 1C 69 7A EA>)
$$ ##END=
$$ 
$$ hash MD5
$$ 72 D6 37 B8 DA 4E FD 56 7B 7B 97 70 00 9E 67 A2
##$RELAX= 
##$RELAX= 
##$RELAX= 
##$RELAX= 
##$RELAX= 
##$RELAX= 
$$ Bruker specific parameters
$$ --------------------------
##$DU= <F:/spectra>
##$EXPNO= 1
##$NAME= <H-F>
##$PROCNO= 1
##$TYPE= <nmr>
##$USER= <she>
##$AMP= (0..31)
100 100 100 100 100 100 100 100 100 100 100 100 100 100 100 100 100 100 
100 100 100 100 100 100 100 100 100 100 100 100 100 100 
##$AQSEQ= 0
##$AQ_mod= 1
##$AUNM= <au_zg>
##$AUTOPOS= <>
##$BF1= 200.13
##$BF2= 200.13
##$BF3= 200.13
##$BF4= 200.13
##$BF5= 200.13
##$BF6= 200.13
##$BF7= 200.13
##$BF8= 200.13
##$BYTORDA= 1
##$CFDGTYP= 0
##$CFRGTYP= 5
##$CHEMSTR= <none>
##$CNST= (0..31)
1 1 145 1 1 1 1 1 1 1 1 1 1 1 1 1 1 1 1 1 1 1 1 1 1 1 1 1 1 1 1 1 
##$CPDPRG= <>
##$CPDPRG1= <>
##$CPDPRG2= <>
##$CPDPRG3= <>
##$CPDPRG4= <mlev>
##$CPDPRG5= <mlev>
##$CPDPRG6= <mlev>
##$CPDPRG7= <mlev>
##$CPDPRG8= <mlev>
##$CPDPRGB= <>
##$CPDPRGT= <>
##$D= (0..31)
0 1.2 0 0 0 0 0 0 0 0.06 0 0.03 0 0 0 0 0.0002 0 0 0 0 0 0 0 0 0 0 0 0 
0 0 0 
##$DATE= 1639465551
##$DBL= (0..7)
120 120 120 120 120 120 120 120 
##$DBP= (0..7)
150 150 150 150 150 150 150 150 
##$DBP07= 0
##$DBPNAM0= <>
##$DBPNAM1= <>
##$DBPNAM2= <>
##$DBPNAM3= <>
##$DBPNAM4= <>
##$DBPNAM5= <>
##$DBPNAM6= <>
##$DBPNAM7= <>
##$DBPOAL= (0..7)
0.5 0.5 0.5 0.5 0.5 0.5 0.5 0.5 
##$DBPOFFS= (0..7)
0 0 0 0 0 0 0 0 
##$DE= 6
##$DECBNUC= <off>
##$DECIM= 32
##$DECNUC= <off>
##$DECSTAT= 4
##$DIGMOD= 1
##$DIGTYP= 9
##$DL= (0..7)
0 120 120 120 120 120 120 120 
##$DP= (0..7)
150 150 150 150 150 150 150 150 
##$DP07= 0
##$DPNAME0= <>
##$DPNAME1= <>
##$DPNAME2= <>
##$DPNAME3= <>
##$DPNAME4= <>
##$DPNAME5= <>
##$DPNAME6= <>
##$DPNAME7= <>
##$DPOAL= (0..7)
0.5 0.5 0.5 0.5 0.5 0.5 0.5 0.5 
##$DPOFFS= (0..7)
0 0 0 0 0 0 0 0 
##$DQDMODE= 0
##$DR= 18
##$DS= 0
##$DSLIST= <SSSSSSSSSSSSSSS>
$$ [...]
##$SUBNAM2= <"">
##$SUBNAM3= <"">
##$SUBNAM4= <"">
##$SUBNAM5= <"">
##$SUBNAM6= <"">
##$SUBNAM7= <"">
##$SUBNAM8= <"">
##$SUBNAM9= <"">
##$SW= 18.0517287032376
##$SWIBOX= (0..15)
0 0 2 0 0 0 0 0 0 0 0 0 0 0 0 0 
##$SW_h= 3612.71676300578
##$TD= 16384
##$TD0= 1
##$TE= 0
##$TE2= 300
##$TE3= 300
##$TEG= 300
##$TL= (0..7)
0 120 120 120 120 120 120 120 
##$TP= (0..7)
150 150 150 150 150 150 150 150 
##$TP07= 0
##$TPNAME0= <>
##$TPNAME1= <>
##$TPNAME2= <>
##$TPNAME3= <>
##$TPNAME4= <>
##$TPNAME5= <>
##$TPNAME6= <>
##$TPNAME7= <>
##$TPOAL= (0..7)
0.5 0.5 0.5 0.5 0.5 0.5 0.5 0.5 
##$TPOFFS= (0..7)
0 0 0 0 0 0 0 0 
##$TUNHIN= 0
##$TUNHOUT= 0
##$TUNXOUT= 0
##$USERA1= <user>
##$USERA2= <user>
##$USERA3= <user>
##$USERA4= <user>
##$USERA5= <user>
##$V9= 5
##$VALIST= <valist>
##$VCLIST= <CCCCCCCCCCCCCCC>
##$VD= 0
##$VDLIST= <DDDDDDDDDDDDDDD>
##$VPLIST= <PPPPPPPPPPPPPPP>
##$VTLIST= <TTTTTTTTTTTTTTT>
##$WBST= 1024
##$WBSW= 4
##$XGAIN= (0..3)
0 0 0 0 
##$XL= 0
##$YL= 0
##$YMAX_a= 269358
##$YMIN_a= -317938
##$ZGOPTNS= <>
##$ZL1= 120
##$ZL2= 120
##$ZL3= 120
##$ZL4= 120
##$ABSF1= 10
##$ABSF2= 0
##$ABSG= 5
##$ABSL= 3
##$ALPHA= 0
##$AQORDER= 0
##$ASSFAC= 0
##$ASSFACI= 0
##$ASSFACX= 0
##$ASSWID= 0
##$AUNMP= <proc_1d>
##$AZFE= 0.1
##$AZFW= 0.1
##$BCFW= 1
##$BC_mod= 2
##$BYTORDP= 1
##$COROFFS= 0
##$CY= 11.3945322036743
##$DATMOD= 1
##$DC= 2
##$DFILT= <>
##$DTYPP= 0
##$F1P= 2.36226072786647
##$F2P= -0.459571619588291
##$FCOR= 0.5
##$FTSIZE= 0
##$FT_mod= 4
##$GAMMA= 1
##$GB= 0.15
##$INTBC= 1
##$INTSCL= 1
##$ISEN= 128
##$LB= 0.24
##$LEV0= 0
##$LPBIN= 0
##$MAXI= 10000
##$MC2= 0
##$MEAN= 0
##$ME_mod= 0
##$MI= 1.114404
##$NCOEF= 0
##$NC_proc= 0
##$NLEV= 6
##$NOISF1= 3.799351
##$NOISF2= 2.8
##$NSP= 1
##$NTH_PI= 0
##$NZP= 0
##$OFFSET= 15.70392
##$PC= 1
##$PHC0= -15874.24
##$PHC1= 12.2008
##$PH_mod= 1
##$PKNL= yes
##$PPARMOD= 0
##$PSCAL= 0
##$PSIGN= 0
##$REVERSE= no
##$SF= 200.130013532006
##$SI= 16384
##$SIGF1= 3
##$SIGF2= 2
##$SINO= 400
##$SIOLD= 16384
##$SREGLST= <1H.CDCl3>
##$SSB= 0
##$STSI= 0
##$STSR= 0
##$SW_p= 3612.71676300578
##$SYMM= 0
##$S_DEV= 0
##$TDeff= 0
##$TDoff= 0
##$TI= <>
##$TILT= no
##$TM1= 0
##$TM2= 0
##$TOPLEV= 0
##$USERP1= <user>
##$USERP2= <user>
##$USERP3= <user>
##$USERP4= <user>
##$USERP5= <user>
##$WDW= 1
##$XDIM= 8192
##$YMAX_p= 0
##$YMIN_p= 0
$$ End of Bruker specific parameters
$$ ---------------------------------
##NTUPLES= NMR FID
##VAR_NAME=  TIME,          FID/REAL,        FID/IMAG
##SYMBOL=    X,             R,               I
##VAR_TYPE=  INDEPENDENT,   DEPENDENT,       DEPENDENT
##VAR_FORM=  AFFN,          ASDF,            ASDF
##VAR_DIM=   8192,          8192,            8192
##UNITS=     SECONDS,       ARBITRARY UNITS, ARBITRARY UNITS
##FACTOR=    0.0002768,     1,               1
##FIRST=     0,             0,               0
##LAST=      2.2672688,     0,               0
##MIN=       0,             -317938,         0
##MAX=       2.2672688,     269358,          0
$$ Real data points
##PAGE= N=1
##DATA TABLE= (X++(R..R)), XYDATA
0@%%%%%%%%%%qJ6j6J6k4L2m0N6o4P2r3J17j36J60j92K24k56K96l44L96m53N18
32B77n90O68p56Q54r62J076j204J347j500J668j851K050k268K507k769L057l368
49a764L711m089M502m961N471o039O679p404Q228r183J0299j1624J3229j5220
63h165J7768k1157K5921l3145M5545p2625K38651j30600k70900L55183M5224j61475
75C0225k25022J65729R0007j09509L6759j716m8864M9873N8398L938j81106M1464
87h9824J55011l3908j16511p010J13640q850m3010M5226m2690L427N7695O6853
99A00049m4631q4944J23374N2788j10070n4510R140M0730o2613l6175K7991m7297
111h6168K8590P3357j4470m2497K9004P7550m7734p2268M3374K8831o3143k2638
$$ y = [0, 0, 0, 0, 0, 0, 0, 0, 0, 0, 0, -8, 8, -8, 8, -16, 16, -24, 32, -32, 40, -53, 64, -72, 88, -104, 120, -136, 160, -184, 212, -241, 277, -313, 355, -401, 453, -509, 567, -637, 710, -790, 878, -973, 1077, -1191, 1316, -1453, 1604, -1764, 1947, -2142, 2360, -2601, 2870, -3169, 3510, -3894, 4334, -4849, 5450, -6174, 7055, -8165, 9603, -11554, 14367, -18778, 26767, -45858, 192793, 62193, -208707, 146476, 191700, 30225, -194797, -29068, 60939, -48570, -11811, -13527, -62391, -12518, 45880, 49818, -131288, -89824, 65187, 31279, -85232, -92242, 21398, 12548, -30462, 14764, -27926, -24499, 33196, 100049, 55418, -29526, 93848, 146636, 36566, -17944, -8804, 31926, -30687, -66862, -38871, -86168, -57578, 15779, 1309, -41188, -12184, 65366, 17632, -54636, -11262, 17569, -45574, -68212]
123f8212R6559K707r3251N0476J21932j7781j33928L3085J52025o4808j34862
134e6058J9357P5196j1198q3935L485L4323j4095J8073j642l3163J9302N8880
146B8525R234o2511q244O5761L342o3243k830M7024r287j9724J6940J3251l778
159A4460N617L4354j3287m4466K4724J3185m2512k8958R521J8335k4900j1241
171d5168L1403l794k675K9557p89j9807J6759L2426k5054m9100K8221N1946l9235
184D690m9092M5209M6326l1619m1887K8965M8565k7925l2522J8985K04j3590n644
197i335n913p801m127J8396J253k6502J7978L2233j0278j1165J4174J4293j3193
210A0013j4475J6193n83k7374R285K4809j2508j7839R404K2778m325k0396J1363
$$ y = [-68212, 28347, 31054, -62197, -11721, 110211, 92430, -41498, -8413, 143612, 78804, -56058, -36701, 38495, 27297, -56638, -53153, -18830, -32925, -14852, -16494, -49657, -30355, 28525, 37759, -24752, -32996, 32765, 36107, -27136, -29966, 17058, 7771, -11953, 4987, 18238, 14460, 20077, 54431, 41144, -3322, 21402, 34587, -7925, -36883, -27362, -9027, -33927, -45168, -13765, -17559, -20234, 9323, 8534, -11273, 5486, 37912, 12858, -36242, -8021, 43925, 4690, -44402, 807, 47133, 15514, -26373, 2592, 51157, 23232, -9290, 9695, 9899, -3691, -9335, -15248, -23049, -27176, -8780, -7527, -34029, -16051, 16182, 5904, -5261, 8913, 23206, 10013, -4462, 11731, 11148, -16226, -6941, 17868, 5360, -12479, -3075, 19703, 15378, -5018, 6345]
223F345Q507j5783k168l032q970K28O022N917j3767k908K5790L97j4533J1330
237C375J2376n619q396O526O442k0078n410K3129m946k1198M783J7722K076j7685
251f903j822K0255k210j0312l1o637J566N285l457o435k204J5320O902j9151K143
266g691K0571m11j0529j968Q518M1j3532L552O309j0768N30Q290k239n367j474
281f168R599K292j0386M505M529o813J454jl180J016K734N365o448o374J3312
296E436K724j0193P69O786K457q020n922Q539j560o465N448j10l231J363N98K184
312H03l636qQ573m427m113N102j601r02R59K86J873m751K119M932q203j319P405
329C092k89l118l373L351M048p311k77N649k541M66J37k004J476r93K343J389
$$ y = [6345, 14852, -931, -3099, -6131, -15101, -14873, -8851, -2934, -16701, -19609, 6181, 6578, -7955, 3375, 15751, 10132, 1736, 8262, 14704, -5374, -10784, 12345, 7399, -13799, -9016, 8706, 10782, -6903, -8725, 11530, 9320, -992, -1023, -7660, -6094, -809, -4266, -10701, -12905, 2415, 9317, -9834, -7691, 12880, 12469, 1940, -28, 8490, 8531, -5001, -1449, 4860, -5908, -5378, 2912, 673, -4694, -6168, 3431, 5723, -4663, -158, 4371, -2442, -988, -989, -4169, -3153, -419, 4946, -1502, -7876, 5436, 8160, -2033, -1264, 5522, 7979, -41, -5963, 2576, 1016, -5449, -1, -111, -3342, -1979, -1381, 803, -2833, -2841, 5732, 1305, -2808, 2294, 693, -209, 750, 1036, 2909, -1842, 277, 5209, -2994, -4313, 3092, 2803, -315, -3688, -337, 3711, -3600, -3877, 1772, -769, -303, -166, -2170, -694, -1687, 656, 2045]
345B045m113M084K019n109J489J708M70l88l520L445n26n772K639J500k196J037
361a188o90K012n52k497L784J28k105L434j856q15M73j843K073p23n66M274k652
378F91j600L876j487m4r41m5L224m552l198K785j041N26O08k245L001Q92n9R06
396A297k804K627L886l393j683p94J41L028l347j153K713j91L163k171m389L706
412F36K741o88k776l850L354J952n096o89R41L096L014l641P8J773M83L639k730
429B237l632L866K93k674j807j216L792m86k072L030j247r80J575k01J680k505
445c47k518L897j35m371n08M77M832N52l968J736J997J810L65l741M18K877n70
462B803j196m676j928N503J184k312l001k85P930N90p960p22N088L774l252p359
$$ y = [2045, -2068, 2016, 4035, -1074, 415, 2123, 2593, 2205, -1315, 2130, 1604, -4168, -1529, -29, -2225, -1188, -1878, 134, -418, -2915, 869, 997, -1108, 2326, 470, -345, 128, -1715, 358, -365, -931, 3343, 691, -909, 2967, 1480, 1436, 495, 450, 3674, -878, -4076, -1291, -2332, -1806, -1198, -3443, -442, 450, 391, 1297, -1507, 1120, 5006, 1613, -70, -864, -723, 2305, -1042, -2195, 518, 327, 3490, 1319, -3070, 636, 3377, 2689, -87, -3937, -583, 1369, -3727, -4416, -3475, -379, 2635, -1006, -928, 845, 1328, 4967, 2237, -1395, 2471, 2764, 90, -1717, -2933, 859, 373, -1699, 1331, 84, -896, 679, 478, 2158, -347, -2865, 1032, 897, -3474, -3982, -3505, 1327, 1879, -2089, -353, 1644, 3454, 3819, 78, 496, 3373, 2803, 1607, -3069, -4997, 506, 1690, -622, -3623, -3908, 4022, 4612, -3348, -4070, 1018, 4792, 1540, -5819]
478e819K180M674l71j432k088J686N462j018j513k089l67O781n26p922p93L698
494E43K206m906m373N261L151k809k97k06J439M75j139K751p04m264J609K124
510H61r93j115j354M246J959k784J29M82L20J409j818n96n89j779K343j096m403
527d778N32L447L977k889o782M806P079k964n308K8N250J776n392j487J103K068
543D66L345k188k888J529K303K139l631n349M833M586m556n515J60N726M29n984
559d595J453L747K69q02j533J304J659j437J175P80l065J34J077J249n00k401
575a486K843J699k454l99O05J11n60j431J526J33l529K27J902M13o21k077K978
592a20L376l766k010K980J897q8l044K34J769p76N71r87k185L420K198k198k564
$$ y = [-5819, -3639, 1035, 664, -768, -2856, -1170, 4292, 3274, 1761, -328, -695, 6086, 5560, -2362, -3155, 543, 2749, -2157, -6530, -1269, 1882, -927, -1224, -1430, 9, 484, -655, 2096, 1392, -2872, -1263, 861, -132, -1247, -2601, 1645, 3604, 820, 949, 1431, 1751, 3160, 1342, 746, 157, -1622, 721, -375, -4778, -4246, -799, 3178, 289, -6493, -1687, 5392, 2428, -2880, -2852, 2398, 4174, -1218, -2705, -1602, 466, 3811, 1623, -1265, 264, 2567, 4706, 1075, -4274, 559, 5145, 589, -4926, -4766, 960, 1389, -4595, -3142, 605, 874, 72, -1461, -157, 1502, 65, 1240, 2020, -1045, -911, 166, 1415, 915, -1486, 1357, 3056, 602, 203, 808, 919, 359, -1072, 454, 587, -2942, -2715, -813, -400, -1021, -3098, -120, 3256, -510, -2520, 460, 2357, 2269, -775, -541, 1228, 452, 1023, 36, -2149, 1271, 3469, 1271, -1293]
609a293p08M128Q35m965n71K715J113k059k979K449K180j731M34M50l05J078q64
626i3m0J206n71O74j9j460N59r57J058J341j838R8O89m79J81q44O4J136j791N68
646e18J221j913k29M19J006J392k114o73J914o9N4r61L24J578m05q02l30j025
664a131K185M15k430K05J191N73o16k526J230K464q12p64j165Q96J207j740J09
681g09M97K4P18m47j085M89K1P52P93j786J046K63q59R50j146L3J728j083l83
700a84j77k96J575o93o18J109l38K13j04j569Q94M70o68M45p98K8L40p49J098
719b2K35n32Q48n73J02N36j142P93P47j152K42l3k08O64q01M37N74j02K37r32
739h2l23J134q82m97M17m09L4l04p70J436l36K82Q37p11O10J67r17J009k31r3
$$ y = [-1293, -2001, 2127, 2962, -2003, -2574, 141, 1254, -805, -3784, -1335, 845, -886, -452, -2, -307, 771, -93, -133, 1073, 502, 1176, 1157, -303, 256, -701, 357, 1698, -140, -42, 647, 168, 349, -495, -431, 705, -1086, -518, 703, -1210, -1439, -1020, -14, 1378, -736, -1409, 505, 436, 490, -471, -147, 1431, 1026, 224, -106, -1131, 1054, 1469, -961, -756, 435, 1008, 392, -2134, -904, 1560, 748, -16, -1181, -285, 922, -818, -709, -212, -188, 530, 83, -1002, -513, -492, 260, 1053, -733, 313, 576, -283, 667, -479, -446, 1282, 199, -184, -361, -657, 918, 225, -393, 716, 378, 591, 487, -1082, -188, 282, -386, 59, -739, -711, -371, -1120, -22, 213, -319, 529, -44, 58, 594, -548, 245, 992, -160, 82, 49, -159, 505, -296, 141, 715, 613, 850, -82, -405, 729, -153, -650, -233, -642, -608, -912, -1682, -246, -582, -300, 537, -174, 436, 603, -314, 695, 464, 371]
759C71O49j159R4o9l18J052J18l43M98p61L75j09j433M56J15n65L82j073M43Q14
779d63o23R27L81k4R72m25l47M15m30K30P4p98L51l54j32P57o01K25Q72p04K56
800E59q78j97P25q13n75L36o01N13k51l8J359R6K22N64q13R43J5r54N60k44k20
821C08L15j296N86L40o31Q45k98j46P14q41n75M46o14M57j96o65O76k93J97M89
841a82j85Q95O04n84P26o70P4K74o60J80j66o26L29j16m64O71k59L06N45j030
861c38M64l93n27N74o65J20N05r06O98J77J9J040MJ12J72o15N45j83q65O05k9
882E14o13L54r94L38O54m09L29q9r9M66n80l49K52k18P55o94k68M00k38L97N63
903D71o17O27M94m89J55o99lP56p23l3q5l04N82k85k15P15n32L06L41p56J51p9
$$ y = [371, 1020, -139, -45, -114, -432, 620, 738, 395, 893, 132, 507, 398, -1035, -579, -464, -1029, -647, -1720, -1277, -463, -1086, -159, 222, 198, 1170, 745, 398, 813, 383, 613, 687, -111, 240, -114, -246, 511, -90, 135, 1007, 303, 559, -319, -516, 209, -604, -1179, -843, -1444, -931, -1182, -1220, 139, 235, 457, 1021, 208, 1151, 1166, 212, 772, 528, 308, 623, -673, -87, 253, -378, 467, 169, 23, 737, -104, -679, -233, -847, -390, -586, -1251, -575, -868, -671, -182, -367, 528, 1132, 548, 1274, 604, 678, 952, 292, 472, 306, -320, 9, -107, -571, 100, -159, 147, 692, -338, 126, -267, -794, -220, -885, -765, -260, -1166, -468, -291, -272, 768, 772, 884, 1056, 441, 986, 803, -62, 543, 514, -99, 255, -739, -401, 253, -156, 173, 84, -15, 451, -129, -478, -226, -444, 311, -383, -651, -251, -489, -92, 471, -146, 481, 975, 486, 641, -58, -61, 695, -28, -61, -146, -450, 132, -153, -368, 347, -185, 121, 462, -294, -143, -222]
925b22j37Q03q03j52M77k43K56j62k30J006j29j38k33m78Q50j90l40J0P6j45L49
946B25q17K54M65n5P92j012l38R04l31M9n58j59J191l80j066O91o1Q0M44l81J29
967F6p2k04L84l34j96Q18k30L62o24l69R60p8l42L21m22l5K37l83J47j41j40P13
989D38m30k02l24m07Q46L4o45L04K82K11j86m38J013L03o03L22j65k49N51l74
1009B81J57m10n78J042M6j187j2N26Q60o37q31J277m16r16K51j39N4O66n97L95
1029a68K0k69Q66M6J61J19j58O53o19q69P30m34o31N47m51J59j22j56P41k10l63
1050d08O04m78L4J99p31J91M13k45K69j50O09O39o87N23O17o35L29n02l58k96
1070f3n07K64J60j045M89O12j39l06k44J131L68r85J82p9m47J91J36k28O04k3
$$ y = [-222, -359, 444, -359, -511, -34, -277, -21, -183, -413, 593, 464, 326, 93, -385, 465, 275, -65, -55, 21, -124, 225, -592, -338, 127, 72, 864, -148, -486, 418, 87, 136, -422, -581, 610, 230, -836, -145, -206, -126, 318, -63, 66, -6, -210, 174, -160, -356, 462, 232, 594, -30, -399, 561, 483, 141, 462, 40, 5, 242, -141, 6, -135, -275, 438, 8, -194, -518, -925, -79, -45, -690, -386, -104, 107, -79, -517, 496, 799, 196, 518, 353, 104, 655, 281, 438, 28, -550, 492, 538, -649, -661, -135, 725, 88, -743, 534, 118, -798, -547, -686, -632, 34, -563, -168, -148, -417, 449, 495, 656, 775, 617, 1270, 651, -218, 512, 78, -553, -6, -457, -298, -420, -576, 165, -45, -408, 196, -282, -248, -49, -780, -589, -176, -421, -152, -302, 307, 946, 259, 782, 1399, 764, 1093, 591, 233, -63, -570, -306, -146, -1191, -702, -90, -229, -535, -779, 352, 720, -265, -83, -162, -609, -418, -282, -510, 94, 71]
1090G1N66r3m70J134M5j31J58q21R8l36j126M93m93L11j48j87K02L93k50Q99M6
1111C61l6J13m47l35J77j13K00N8j56Q28m53N58J91k57L56Q5o29m50m29k26l41
1132i45l75L50M21n71M42J57L37M47l54N10L32l75m8j50o97L77L22J13r4q9O42
1153G52J7m34N85j08l04l78o40j84M7p98K03J82R1O11MM28ML87M54r9j96P1l92
1176C03m86K21n1L33l37K0N13l56L31K59k31j49m11j8n29m14l95K43k65N44K57
1197f18L1P04M03R8O19k39K7m7p32R5j17n48L65j72K62l7l09M34L34o15M37k27
1219A48m10j66o34K02j52q6M40M14j68R43k55N12K10mK35m46l56J59n64l52p0
1240d00n0L2K43j42M98l43j02O33m68j21m3m66J37m31J84K86K12K21P21j73O40
$$ y = [71, 637, 544, 74, 1208, 1253, 1122, 1280, 459, 557, 221, -905, -412, -905, -594, -742, -929, -727, -334, -584, 315, 361, 325, 438, -9, -344, -167, -280, -80, -22, -178, 650, 197, 755, 946, 689, 1045, 1130, 501, 51, -378, -604, -945, -1320, -970, -549, -1120, -678, -521, -184, 263, -91, 419, 751, 376, 328, 178, -519, -142, 180, 293, 199, 110, 752, 769, 335, 920, 812, 508, 130, -510, -694, -647, -1445, -1242, -1060, -969, -358, -354, 74, 78, 465, 919, 820, 624, 695, 303, -183, 38, -13, 320, -17, 3, 516, 160, 491, 750, 519, 370, -41, -59, -588, -1002, -1397, -1154, -1419, -875, -618, -587, 117, 520, 618, 1237, 998, 1025, 978, 246, 341, 224, -324, 41, -131, 131, 94, -215, 219, 553, -62, 375, 148, -262, -428, -1062, -860, -1012, -1098, -658, -244, -412, 531, 276, 788, 998, 994, 1229, 783, 427, 586, 22, -330, -400, -450, -418, -175, -317, 181, -162, -264, 369, -99, -220, -263, -729, -592, -1023, -839, -553, -341, -120, 601, 428, 1068]
1261A068Ko4L36o82jJ4o49m75j40j6K89k31L49J09l96N23m8q4K71l02n2k61k72
1284g12J31M25k64M59L19K7K89P1K70P1n18N7k01o73n6k60j81M2n4N08j11O5K27
1307f9j04K23L09n48j49K44l93O6R5K42L15j67K50N13j82J09J75n70P4j80n31
1328b78R2o24M20m7k24J81O8K15K83l11L16J99m53J81n1m1J73k39J51J71l25P27
1350E84MR2L5j8j74q0m88K17n50l94M65m79L70q8J7M08M2l82O13k67K99L6k29
1373C3j31l3K2J78K7lJ61J03J07j04o6P5J63m60P1n76K54%l66J56J03J67J94j96
1397a21K51k8j10jM50m43R0j41N7k9j02L60p9J41j87J26k24Q3k8r2K18n74K74
1420a09l2j80Q7m9j66N19k81J79K51k10J08qJ97j65k91K08r6l47N40j30j61L95
$$ y = [1068, 1070, 1006, 1342, 660, 659, 673, 24, -451, -591, -607, -318, -549, -200, -91, -487, 36, -12, -96, 175, -127, -179, -440, -712, -581, -156, -420, 39, 358, 385, 674, 745, 1015, 1086, 568, 625, 424, -249, -305, -565, -746, -704, -758, -250, -361, -296, -69, -173, 50, 359, -189, -338, -94, -487, -421, -326, -84, 231, 64, 314, 827, 645, 754, 929, 359, 433, 253, -278, -186, -810, -390, -437, -661, -480, -412, -197, 86, -225, 91, 290, -163, 18, -33, -74, 99, -140, 11, 182, -143, 584, 588, 680, 715, 697, 523, 443, -45, 172, -378, -772, -307, -786, -416, -504, -487, -79, -37, -419, 194, -73, 226, 262, 33, -98, -131, -109, 69, 96, 93, 254, 357, 464, 360, 294, 369, 532, 72, 143, -433, -179, -179, -545, -389, -286, -119, 75, -121, 130, 102, -8, -9, 441, -2, 88, -53, 4, -25, -127, 233, 154, 295, 108, 234, 10, 93, 65, -27, 191, -383, -109, -141, -321, -234, -283, -449, 70, -211, -32, 219, 9, 117, 109, 306, 141, -150, 58, -38, -385, 155, 25, -136, 259]
1442B59J07m59K85k06J30j38J50O1k78Jl1p0PJ65j37N08m04j64L13k31J60O8j35
1465c9J39K30m67N32l74j5N1J43j39O8l18K56k68L75j87k42K72j20N5N3J8o3K75
1488B35m50J95J10m17M12j80J72K14l89R4J04m9j16K80o05M26j71J52L6p1L82
1509C64k71J45L08l80k60K36l63M20j64k46L74m69J83J03l09J53L96j01nR5j29
1530H0J3n2j23K36j81L2O1j86K34J66r9L1r9n6k3j27J25j43o1J97l59J57L3n0
1554a94L08k88K35K84n48L25K5M8Q3l51J03J5k6P2n5J30k16q1R0M07p3l00Q0j64
1578i1n8mk68J12m4o9N08j02P4J18j82K66j87k87L14k6k54K84j11l5N2j59K64
1601A15n9j26L61l42J70j87k22K66k10j68K9p5L34O9k54M41j32K07k73L7N4P3
$$ y = [259, 366, -93, 192, -14, 116, -22, 128, 189, -89, -88, -119, -189, -182, -17, -154, 354, -50, -214, 99, -132, 28, 96, -39, 100, 330, -137, 395, 21, 6, 57, 200, 61, 129, -189, 67, -201, 174, -13, -255, 17, -103, -48, 5, 23, -40, 235, -215, -20, 90, -327, 85, -95, 77, 291, -98, -4, 100, 51, -65, 215, -390, 36, -135, 17, 53, -18, 364, 93, 238, 546, 166, -94, 142, -221, 199, 35, -211, 163, -306, -123, -20, -329, -176, 220, 119, 114, 209, 80, 93, 41, -82, 154, -27, 5, 66, -120, 114, 280, 181, 212, 113, 57, 34, -93, 32, -111, -172, 25, -334, -177, -144, -194, 114, -174, 61, 345, -203, 122, 147, 195, 278, -73, 30, 45, 19, 91, 36, 166, -50, -131, -41, 366, 293, -7, 73, -91, -149, -153, -421, -309, -353, -422, 86, -16, 58, 176, -6, 260, 73, -214, 100, 74, -180, 104, -7, -42, 10, -149, 115, 56, -70, 291, -51, 119, -68, -290, -24, -234, -402, -373, -448, -114, -45, -299, 142, 10, 217, -56, -19, 35, 108]
1623A08k02K14j75Q4j37k8L15Q8j77J51k00qJ57j98j4j54J24j0j45J1J47j44K96
1646A03K63k06J00j58j85K28j23j29J54l16K23J18k84L15lk37Q5m6J12m5n0Q8
1668Gm0o8P9j18j89J18Rk5K51n7M22n01J99L4R2m75J26j12J69J77j32j1j57K10
1692HM9o7Lj3Q2q3r4K27l44P5K01k67K13L4J67l46K76k44K93P8m48M53m74K65
1716D4r2M9l17L82k97J24K24k6j17j45J76p7j1j4J98k12L84n40L80K6j29M8N6
1739A14p5l0m1J41R7m97J43J24k7J27k64J32K90k16K0J40j97Q0J00LJ0m12K25
1762a3J46k29J93R2l29KN0o8L16k22L02j89l47K05J22J32j45k80L40l8j2p8l3
1785h3R8J28j39Qp5r4K71k74K00K2J5k32K80k46O6K37k29J69j35r7J22j18P9n
$$ y = [108, -94, 120, -55, 29, -108, -136, 179, 267, 90, 241, 41, 33, 190, -8, -22, -176, -52, -62, -207, -196, -49, -193, 103, 366, 160, 260, 102, -83, 145, 22, -107, 47, -269, -46, 72, -212, 103, 100, -137, -52, -98, 14, -31, -81, 7, -33, -101, -22, -140, -329, -211, -202, -227, 24, -33, 389, -112, 87, 121, 213, -262, -136, -248, -79, 98, -34, -45, -202, 8, 57, -10, -7, -20, 62, -21, -115, 112, -232, -157, 44, -223, -10, 24, 191, -155, 121, -123, 170, 248, -200, 253, -221, 44, -48, 1, -316, 66, -231, -107, 117, 91, -26, -171, 5, -72, -83, -97, 101, -111, 273, -267, 113, 139, 10, 58, 114, 39, 9, -32, 109, 206, -291, -148, -24, -51, 76, -188, -56, 234, 18, 38, 178, -19, 61, 161, 164, 174, -238, -13, 133, -96, 97, 189, -140, -138, -88, -156, 160, -62, 240, 51, -296, -91, 31, 163, 18, -262, 78, 40, 28, -50, -83, 15, 143, 4, 12, -63, -157, 114, -160, 40, 62, 77, -155, 125, -121, -55, 182, -47, 122, -13, -110, 12, -106, -27, -32]
1809c2j20J85j07k8J33p8j20K79K8j04l09J52K35j50j42K05p2K9O6j60M02k90
1831Bq4M17k59r9J05k03K56M0j56j37K90j62J10N9j59L7o1J26j61j3j31J75O1
1854E3j64k26L75Q8k75K5L84k40q2k20J74J08M2pq0J44j44j34l0K46k99K28j35
1877a69nJ71j57J75J26l13K56M2n37M10m6j29K59j03J73p2j44J43M6j53rJ74N3
1900A91%j43l4k51K43Q0k84J39m7M52m46m5l5J23J58J68k09j36j43K68j59n1J24
1923c7j95L84m8L6k06K3K31j75j22M3o1K08J0k28J73j18J2K26K5k45J15qm9J71
1947A65l01O0N2n8K52j93J8P1j06j80J20J23l5J19p8k02L1J09j25K25J02l66J70
1970b7J98O8k40j92J02L06j86j36J44Q5k72J8K31j31Q3p8m1J35m1j06K62l2m52
$$ y = [-32, -152, 33, -74, -102, 31, -47, -167, 112, 140, 36, -273, -121, 114, -36, -178, 27, -45, -16, 50, -110, 292, 2, -82, 335, 76, -23, 82, -121, 135, 175, 19, -118, 172, 10, 120, 179, 20, 57, -4, 122, -39, -52, -183, -8, 53, -111, -337, 38, 126, -149, -124, 260, 20, -62, -282, -108, 0, 42, 35, -45, 99, -45, -179, -209, 37, -262, -34, -169, -174, -3, -160, 15, 141, -172, 84, 126, -411, -1, -47, -176, 83, -20, 153, 81, -63, 80, 126, -27, -36, 138, 191, 191, 48, 14, -237, 6, 86, -198, -59, -106, 346, -100, -145, -180, -57, 101, 269, 60, -76, -219, 49, -110, -161, -37, -232, 152, 104, 140, -66, -43, 188, 13, -109, -66, -127, 81, 91, -137, 36, -82, -70, 156, 181, -64, 51, 43, -6, 165, -136, -76, -24, -82, 170, -23, -5, 66, -40, -220, -100, 23, -12, 107, 29, -173, -142, -33, -158, 67, 169, -197, -27, 171, 239, -1, -193, -91, 215, 29, -107, 37, 122, -150, -132, 99, -32, 51, -27, -68, 67, 26, -80, 182, 150, -302]
1993c02J36K42l69P9J61m6J07j80L9J15j10K66j02j60o0K33j20K19m7j72J79m8
2015F0m7q4R7K1O3P3Q8l08oN8l08k4N01l19l1K50j62J52j55K29j05J24Ll93K00
2040b3P8j99j84K82K42j20Nj42K24l39K47j32J03k7k03J67M7p2J92q8r6K14j42
2063C4j29K56n09N03j4j95n7J28k36K30J15j44k0j49K78l68k85N26o5J62mj83
2085a26J46K9J10Kj03p7N6N9k61K01Om86N83l44K2L42J1j62J53r1m0O6p8K2j75
2110a35K68j14Q8j56J76k02J55j20J4o9j55K81j33L27k24Ol56M06l3o0J23k3J58
2133B22k7j33O4k10J19jL5j72l1K84J07m36P7n1K53j94k1J76j57rJ18M8k2j38
2157i9L6j65K41J35r6q4P3rN1L3N3j09j28K0J09k29K52J83m07K02m4n7J47j13
$$ y = [-302, -166, 76, -293, -214, -53, -99, 8, -172, -133, -18, -128, 138, 36, -124, -184, 49, -71, 148, 101, -71, 108, 60, 13, -71, 26, 47, 110, 183, 271, -37, -43, 15, -293, -317, 184, -135, -166, 84, -78, 74, -81, 148, 43, 167, 170, -223, -23, 55, -144, -328, -46, 196, 76, 81, -61, 163, -176, 71, -61, 42, 15, -188, -21, 26, -46, 146, 58, -38, 176, 34, -95, 161, -348, 155, 141, -54, -111, 17, -219, 11, 126, -18, -38, -187, 91, -277, -562, -36, -101, 61, 57, -126, 20, 49, 159, 161, 58, -19, 37, 96, -165, 36, 42, -444, 139, -205, -183, 159, 170, 8, 161, 70, 30, 96, 18, 40, -135, 133, 19, 107, -49, 127, -75, 80, -40, -26, -95, -250, 31, -102, 225, 1, 7, -349, 57, 24, -36, 87, 64, 222, 195, 62, 126, -84, 35, 34, 69, -103, -134, 150, 257, -179, -102, -153, 100, -94, -115, 61, -96, -105, 13, 61, 39, -99, -63, -228, 13, 148, 52, -32, 41, 32, 83, 116, 169, 60, -68, -48, 61, -168, 84, 267, -140, 62, 18, -39, 108, -5]
2181eq3J16p5Oj35J27m7l0O6K19k67N3J17K56k09l22K04J08K7k58j8L36l28j05
2205b47L19NJ14k39K23o9Q0J89l18q8K48j28m4qL5K7k17j42M80k59K82j89k14
2228a60L03l28K50r1J05r7o7J03J19q3K01k80k4j11K11j57K30j63K37k48j30K95
2250A15k55J84j7N9l40N12j39j00l8J6l9J09j30J71k74R3J63O5l80L08k11J51
2272B3J51k58P1n6K2j8n8K85j79J83j63J89j27j04J02j50J40n9K07m37K17o9m
2295i2L6Jn0q1J67K24J4k45N7K8l48K99J01k56K35k31Q7J90J22j68o3Nj66K21
2319H7j01m9J45Pj08J77j55J1m3N7o8J13j15l05L99k70K24l9j35J17J9J07O7n7
2343H5P9j82J52j25j50K61n8j35J98k82J67N2j25L8N1k6R6k08J34J70l3k29J20
$$ y = [-5, -88, 28, -47, -41, -176, -49, -96, -126, -60, 159, -108, -55, 62, 318, 109, -213, -9, 99, 126, -132, -150, 186, -142, -247, 72, 77, 191, -48, 175, 106, 186, 375, 57, -31, 217, 89, 45, 37, 72, 99, -118, -260, 220, -39, 243, 54, -160, 143, -185, 65, -26, 79, -18, -85, 18, 137, 54, 255, -25, -49, -160, 51, -106, 124, -39, 198, -50, -180, 115, -140, 44, 27, 86, -254, 258, 119, 19, -19, -3, -42, 67, -63, 108, -166, -73, 90, 155, -225, 83, -128, 23, 174, -84, -13, -69, -47, -65, -123, 162, -17, 166, 3, 192, 65, -39, 63, -87, 53, -6, 201, -236, -19, -88, -92, -56, -55, -105, -186, -19, 205, 219, -26, 31, 59, -289, 10, 111, -145, 90, -141, -54, 136, 258, 90, 27, 32, -134, 87, -14, -63, 82, 89, -19, 158, 3, 14, -29, 28, -40, 73, -42, -347, 52, -218, 6, -33, -168, -51, -32, 75, 142, 85, 164, -18, 134, 9, -141, 120, 62, -73, 125, -157, 10, 62, -63, -25, 26, 0, 96, -112, 22, 192, 159, -70, 50]
2366E0p1k68K89OjL7o8J10j50J21j8k1n5m9K90k47J13j55J00j31K77r0l6r9J15
2391D9J30j85j11K05j39J09L8o8j27K11j40j18K04R2j32J42k90L51m11J16K0L7
2413a7l16L46r8r4J89o8M8j04J25j23K65k12P3m8j58L22j21j90J19R3L1n8j22
2436a18J45qj8J52l36J99j5l86J27M35r3J84k06j78N0qJ1J91j67J85k27j9J43
2459D3ko7L9k83O4J48k00K30J1l9l6j27M6k5J97O3j29p3o1K30m8k26L93J31k65
2484A4m2j99K44J87k24nj48K81j79J84j70p8l4j42K93j2J04K09l55p6K68p2j30
2507h2k9J50j50L08l45L59k44n9J86k00L38Q3m14J67j50n4J71K1J02k29N2L5j22
2530a06j30L00R1k31Q9k33K53J59j80j4n0Mk3J1O4M4P1j78L9l8O1j88K10P1j94
$$ y = [50, -21, -289, 0, 6, 5, 42, -26, 84, -66, 55, 37, 16, -39, -88, 202, -45, 68, -87, 13, -118, 159, 69, 33, -66, 49, 179, -6, -117, 88, -51, 58, 96, 28, -99, 112, -28, -146, 58, 150, 18, 160, -130, 221, -190, -74, -54, -17, -333, 13, -85, -179, 10, -58, -10, -114, 11, -112, 153, -59, 14, -34, -192, 130, 9, -181, -62, 31, 62, 4, -118, 27, 19, 1, 153, -183, 16, 1, -385, -258, 177, 84, 268, 62, -116, -66, -74, -63, 128, -39, 146, -81, -100, 43, 41, -26, 13, -270, -206, -58, -258, -28, -17, -56, -92, -219, -173, -198, -1, 62, -67, -140, -201, 29, -19, -245, 148, 279, 14, -28, -227, 17, 204, -20, -25, -173, 108, -71, 113, -57, -135, -169, -311, -18, -30, 74, 283, -72, -148, 120, 48, -82, -111, 39, -111, 197, -148, 211, -33, -92, 94, -106, 232, 315, -99, 68, -82, -136, 35, 56, 158, -71, -19, 16, -106, -236, 64, 155, -76, 13, -220, 33, 192, 12, -2, -52, -48, -71, -60, 4, 48, 119, -59, -20, -58, 3, -185, 25, 96, -98]
2555i8J98n1p9J44l14L09j23q1L7L24j48p9j15k32K10j93K85l34M93q7j23K8P4
2578D5j1j42J98j16j13k8MJ68M5j16J14L5q1J46n4L5k11P3R0k38J13j2J55j44
2602d5m0K33m25M33J34l19O3j44J25J62j93J24j48K13j60M9k12K16q0Q4o4j48
2624a42J26J92k55J23K0j01K02k82K34J65m24J72j0r6J05K76l09K5M6m2j33l9
2646a47l1L12j09K84j35j68L3J05k02J66k24J20J7J03O9j63j21j09L6J68j63Q1
2668g8P1j96K36Q6j2k9k08NJ86O8j73O6P1j58q3j25L38N1j79J37m5J41k15j64
2692b09K69P3j53r5O7Q7J52n66M50J5k76K97k98J15J07k10L56r6J4J9k33J94k9
2715E0R9j07R9j56k02K19m6n3j55J65R9J88j79k82J06M6Q6J72j70L0j71K12M3
$$ y = [-98, 100, 49, -30, 114, -200, 109, -14, -95, -58, 266, 118, 39, -76, -308, -98, -291, -6, -340, 153, 66, -57, -29, 45, 34, -108, 90, -26, -139, -167, -163, 5, 50, -66, 48, 83, 2, 148, 94, 129, -82, -9, 81, -157, -44, -56, 99, -45, -85, 148, -277, 156, 290, -29, 34, -110, 15, 177, -16, 108, -40, 173, 13, 62, -150, 66, -14, 70, 6, -142, -16, 176, -79, 44, 64, -37, 165, -117, 117, 282, -142, 30, 20, -76, 29, 305, -4, 21, 67, 25, -108, -147, -178, 134, 25, 309, 174, 6, 39, 144, -58, 108, -116, 4, 21, 124, 193, 30, -91, -200, -164, 4, -159, -78, -7, -203, 33, 119, 107, 78, -130, -125, 61, 129, -44, 22, 93, -65, -148, -273, 65, 116, -63, 74, 29, 170, -45, -209, 60, 133, -20, -115, -48, 39, 191, -375, 75, 90, -186, 111, -187, -72, 35, -175, 181, 85, 99, 118, -115, 79, 50, 149, 42, 141, -15, -217, 2, -44, -97, -252, -87, 12, 200, 21, -261, -155, -109, -23, 149, -21, 9, -162, 50, 93]
2738I3k20k1K75mk55m6N06l32j52J46j3Q5O1j75J29k45L16l84N66l04Q7j31M4
2761B6k9L21k34M9j39j80K37j90n6k54M41Jk76K57J23j18K23J26k48j79J37r4
2783e6q0K31j67q0J03J19J49k72r8k8L90j06o2J08j34o1K5p5m8K92k87j81K16
2806a02K63k56J56L5l68M35J18k19l7j06K9j57J15P9j26N7K22j56n4J44k3O2p7
2829C4J54q8k86K6J72j55K40k1O8k85m6K36j55j06K2%J95p2k04M43k55q9J35r8
2853a35J83j9k05M08k7lk14j05J29m1L0N1j66j37J90l4K43j94k4n2K3q4L41j75
2877a7k03K91J9j44K31j72P4j64J32Q7k7j19P1k7k04R6o2rK01P1j43Rj49L67j41
2902F8k73J5K64n9j48p8M35k10l1j44n5K11P1j52K1j60K60j9J0n1q3L46j4k10
$$ y = [93, -127, -148, 127, 123, -132, -178, 328, -4, -156, -10, -23, 62, 123, -52, 77, -168, 148, -236, 330, 26, 113, -18, 26, -3, 318, 84, 133, -6, -186, 51, -139, -195, -449, -8, -7, -283, -26, 97, -21, 202, 328, 80, -99, 38, -56, -136, 95, -72, -152, -49, 70, 219, -53, -151, -179, 211, 105, 43, 151, 17, -44, -19, -94, -142, 150, -137, -318, -102, 161, -95, 61, 96, -272, 163, 281, 62, 25, -81, -52, -209, -94, -15, -141, -84, 138, -18, -72, 72, 49, 111, 34, 188, 100, -186, -160, 12, -143, 97, 76, 144, -141, -187, 49, -106, -212, -190, -190, 5, -67, -271, 172, -83, -172, -37, -135, 48, 29, -176, 232, 205, 202, -12, -117, 12, -29, 1, 52, -114, -251, -61, -95, 148, -46, -70, -122, -99, -183, 158, -17, -220, 71, 90, -54, 177, 5, 79, -85, 47, 134, 107, -12, 59, 32, -172, -76, -138, -147, 54, 125, -18, -9, -158, 209, 68, -205, -190, 74, 15, -133, -211, 224, 14, -17, -161, -216, -5, 66, -86, -65, -225, 35, 16, 26, -25, -108, 238, 224, 14]
2926A4NJ42l36K23k37J61K3k10K94r9J8k0P9N4j58M4K3O7J06j67j30N5J94j67
2950b2j04L15m1k05P8n5n3j6N5L2P3L2k3k60K13j33l1J82q2Q1j61J74j58K60K9
2975A80r4k48L52j41j26R7k20J33J65j30l1J3J16j01%lj55RM06j5Nj88K5o9L6
3000A6K7j25J81p1L35m54J57J8j97L4L9j86Q8K40j29K8o6J79m2Mj03J17j92J06
3024DK41k78o5J83q7j0o2qJ09j17Q4K03k69o5J24k4M3J05j81J53j96P6J23j21
3048c5K52l49L73k74j38J95J8l98L35P2k44L2L18j15O9o1j56M17n23K99l63L18
3070D2k52M79m03L43p1p6J02k32j08J56J7k2K63j93Jj83J65j67K51k33N2R5Q9
3093A15k87J69l5J35J02l43J97N7j6Oo7j60J55j00K81k86L27j84k8J69k31N7j73
$$ y = [14, 19, 161, -175, 48, -189, -28, -5, -215, 79, -20, -2, -22, 57, 111, -47, -3, 20, 87, 193, 26, -104, -49, 145, -22, -126, 189, 148, -57, 21, -34, -87, -103, -48, -16, 57, 89, 66, -194, 19, -114, -145, 37, -45, 36, -125, 49, -109, 151, 180, 86, -162, 190, 49, -77, 20, -200, -67, 98, -32, -63, -50, 66, -35, -35, -38, -193, -184, 222, 207, 212, 24, 49, -20, 16, 43, -82, 99, 28, 363, -91, 66, 84, -113, -79, -40, -226, -138, 102, -27, 1, -65, 114, 72, 76, -27, 90, -102, 4, 245, -33, -98, 85, -2, -12, -74, -82, 27, -90, -6, 197, -72, -137, -13, -37, 6, 111, -70, 83, -113, -37, 86, -35, 217, -132, 241, -33, -171, 24, 42, -356, -21, 51, -193, -161, 157, 42, 111, 50, -106, 311, -212, 87, -276, 42, -210, 269, -134, 209, 138, 62, 164, -68, -176, -20, -3, -25, 238, 45, 46, -137, 28, -139, 112, -121, -69, 26, 115, -172, -3, -38, 97, 199, -144, 53, 110, 94, 100, 33, -127, 28, -72, 209, -77, 250, 66, 38, 207, -24, 33, -140]
3116a40K30O5q0q0J33r3k55K51j99Q4J10m3m5J37M5j23k95K01P3k73M32M2n14
3139c37L22K35l06J44r3m8KK16j49j06K11p9J69k27J65j96oRN4N0j05M9Km8L38
3164B66l88j32K06j21J21J24M2j54M0o2Q8r7J61J10o1o0mN8j44j95M6J40l1j02
3188a49Q2K4J45j87K4R5j19L91k61q5K21k85R7k57L15o2j6j86L24J55k46M8j72
3211a04Q9Q1J9j42P6j54L36l07j05J14O1J93K41k76j98J58j31J27j20j19K31m6
3233B4j45qK57r2j8Pk9j26o8K77j58J53J13j21m2J47q0k52O9K09j34m9l1J79R9
3258A81m30J95r0K40k53j53Q9K53M1k02J13M8k6o8L7Q2j6j43J59J55j16k33J99
3281F2j41K48l04J23N7k8J03j5pj52J11Nj24RQ4K08l30O7j03M8K1L05k09M0J71
$$ y = [-140, 90, 155, 75, -5, 128, 35, -220, 31, -168, -84, 26, -17, -62, 75, 120, -3, -298, -97, -24, -297, 135, 177, -337, -15, 220, -86, 58, -35, -83, -81, 135, -14, -120, 91, 12, 181, -46, 119, -77, -83, -74, -20, 30, -75, -26, -24, -72, 266, -122, -254, -48, -169, -48, 76, 118, -36, 4, -58, 30, -67, 94, 204, 143, 83, 79, 137, -7, -202, -156, -16, -47, -149, -67, -43, 102, -85, -61, 34, -85, 306, 45, -40, 181, -104, -7, -264, 51, -11, -27, -213, 111, 266, 20, 68, -104, -15, 66, 85, -57, 19, -135, 201, -106, -211, -97, -36, 157, 398, 122, -76, 82, -49, 78, -42, -161, 70, 24, -121, -129, 128, 36, 18, 25, -4, -130, -198, 79, -79, 74, 187, 66, 24, 171, 91, -161, -92, 117, -17, -66, -97, 82, 181, -249, -54, -144, 96, -157, -310, -221, 32, 73, -129, -16, 32, 6, -62, -25, 57, 41, -102, 57, 212, 96, -137, 62, -79, 169, -135, -12, 45, 17, 120, 105, 98, -54, 57, 62, -62, -53, 31, 239, -91, -24, -127, -79, -58, 247, 38, 78, 249]
3306B49k70J51k25O5O2Q9j22O1r1j57J11K2o0J87J7j63K81o2l83J04L99j53k42
3329a30P5J02j02J95q7k26J2K67k33J68O8j87K06p0r1P9J91m54J01J52L6j29N
3352e2J21j15J15O8k31J06k12K11R3R8k96m7K33j41J01n0q2l4J80l2j27J12j06
3375h7K14l39K73k75J81j30J25KP5o4k39K09M1J5j27n6K52N6o8P2l10N6%K3J45
3400D4Q1j60Nn8j34K03k2J62k69Q1P9k6J07o2P0k29J77j9lP7k0P8k19J3q2K89
3426A63j09k09L5K14k19J72r1j68J77n9J68j98J52N0k38M32k22L1j34j31R6Q4
3448dM2k25J53J24l5j67K6p0o5J46J06%p8P3k81L39P3j39j95L21j96r6P6O6l22
3473c28K36J76k17P1L08l71P1J00L6j79qJ02r5R3lJ15Q1j71p7N5O7%q0K50j57
$$ y = [249, -21, 130, -95, -30, 32, 121, -1, 60, -31, -188, -77, -55, -115, 72, 89, -74, 207, 145, -238, -134, 265, 112, -130, -55, 47, -55, 140, 53, -173, -161, 106, -127, 41, 109, -78, 128, 58, -33, 46, 237, -217, -116, 36, 72, -57, -52, 69, -46, 69, 137, -94, 12, -200, 11, 104, 202, -94, -141, 92, -49, 52, 2, -80, -114, 66, 34, -93, 19, -87, 127, -212, 61, -214, -33, -163, -38, -36, 39, -25, -264, -55, -14, 1, -126, -182, 70, 126, 58, 130, -180, -124, -124, -101, 44, 125, -35, -30, -88, -222, -19, -41, 121, -148, -67, 12, -14, 93, 31, 101, -128, 49, 30, 27, 104, 84, 162, -57, -44, -126, 163, 54, -155, -120, 94, -125, 47, -44, -212, -35, -94, 74, -124, 28, 78, -160, 272, 50, 81, -53, -184, -88, -4, 38, -187, -34, 90, 55, -112, -86, -156, -221, -75, 31, 31, -47, 26, -255, 84, 157, 18, -177, 144, -52, -148, -72, -6, -328, -92, 84, -133, -62, 246, -125, -54, 46, 82, -97, -105, -3, -98, -5, -8, 107, 188, 17, -60, -5, 62, 62, -18, 232, 75]
3498G5J30J02j83j96j14K13QP3j03m4l0Oj80L34K02l07J96p7l45K30L48l60j26
3521a48J30m5J84k22J16J30j03M8K5l5k94Q0K50j54Q3q3O8p4k4J9J02m0L4n0n3
3546e6J97j83N0l4j33K49j87oJ61j71L6J30J06l92L15M0k19J43Ro7O0Nl9l2K66
3571B48l08J48J67k54J17J46m59L5m3M46j87j62k5qK45Q7k73j39J7L48j67P2m20
3594c69L98L0j70M7rJ19j50K5J57j74L6J80k18J41J08l15J27J82k12J11n4J01
3616I1k24J25K33k35q7j5J47P7k43J45n2k19K38ko8P6M6j50p8L21k56Q8K59k0
3640A97k82J08k26L4K60mJ41j36j60J0J29j90Q3R7j7j08N9k4J71k70J27J67l08
3663a42J58j87Q6k6N6K11l60j10L69J16k62J30J2J41k54Q4m6O9j0J80l03J69j14
$$ y = [75, 205, 307, 124, -72, -186, 27, 35, 108, 5, -39, -69, -63, -243, 91, 293, -14, 182, 105, -240, -10, 338, -22, -148, -18, -63, 121, -101, 15, 145, 42, 90, 115, 80, -214, -134, 116, -38, 45, -38, 30, -44, -68, -49, 53, 13, 47, -3, -56, 141, -42, 8, -26, -159, 90, -97, -103, 58, -113, -77, 53, 159, -233, 82, 122, -97, 46, 55, -12, 48, 53, 14, -18, 248, -60, 88, 255, 1, 118, 264, -195, -160, -203, 243, 56, -106, -131, -139, 106, 193, -80, -219, -202, 146, -21, 51, -369, 29, 59, -111, -64, -73, 46, -104, -79, 78, -96, -60, 120, -98, 43, 151, -164, -37, 145, -67, 44, -10, 91, -133, -8, 225, -10, -97, -112, 35, 112, -131, 14, -38, -257, -19, -21, -89, -13, 33, -117, -195, 126, -130, -42, 217, 197, -85, 23, -203, -169, 91, 87, 228, 92, -68, -58, 71, -119, -36, 61, 44, -64, -5, -29, 142, -128, -1, 166, -142, 16, -171, -85, -111, -55, 156, -204, -314, 55, 171, -91, 39, 51, 192, -62, 22, -24, 45, 35, 215, -88, 81, -33]
3686c3K5N4k19K41l5L3N7n1k28L14j53J13k7l10M44k71o0K05q2L5j06L35k03j97
3710a19p2J79L0m5K80l25K70q7j67J45N3k39Q5j65J78L4Q9l17L70L2j17J63j90
3733F5q0J12k23J49J03o9K41k87j2J02q9k5K7j11J9K35j30j44R1J47j5m6Rk75
3757b06M08k95J03J12j07pn1Q8N3o1M6K1j70o5k2L93k09j50N3P5L7m8K7O1j66
3782h0J39j58K78k72L75l38k74O8N58K6n91J65M7l4o9K95oj93J27RJ01l32L4K72
3806A47r5p8K2j74K14j3J33j51R9J04j22o7n9m2J44j90L90m62J94j4l5k6p8Q6
3830g3j8K13k22N3J5l4K7J0P9k70J42J19j57K01j65P1j70Q2Q3j30L8K13n6k19
3854a68j68L50M5J07M0l01j59K78k37M01j1l7j08j34J81k87K90j17J55j94j02
$$ y = [-33, -8, 46, -173, 68, 33, 66, 123, 72, -156, 158, 5, 118, 91, -219, 225, -46, -106, 99, 17, 52, -54, 281, 78, -119, -191, -12, 18, -27, 253, -72, 198, 111, -56, 89, 142, -97, -12, -177, 1, 35, 124, -193, 177, 209, 92, 255, 65, -15, 97, -126, 23, 126, 57, 298, 11, -1, 101, 12, -13, 14, -97, -78, 157, 27, -117, -26, 121, 106, 60, 69, -206, 202, -93, 10, 122, 15, 8, -43, 45, 98, 37, 83, 104, -66, -131, -153, 240, 31, -119, -66, 9, 46, -2, 25, 86, -80, 59, -99, 179, -93, 282, -56, -330, -262, 296, 322, -269, -104, -57, -91, -160, 135, 129, -64, 63, 72, 173, -159, -125, 147, 52, -26, -4, -178, 36, 23, 156, 5, 104, 208, 86, 19, -40, -82, 62, -128, 262, -200, -6, -20, -55, -81, -159, -73, -91, 122, -100, -47, -32, -66, -39, -29, 50, -220, -78, 41, -116, 85, -80, -9, -179, -97, -14, -144, -106, 107, 51, -168, -336, 14, 59, 166, 206, -95, -254, 24, -213, 188, 177, 140, 32, -102, 79, -208, 82, -35, 120, -74, -176]
3875a76J49L4lJ25n6j97j06L45p0k3o4j12J27J21Q5l84K37%q6L37m91J44k1L51
3899B66n8k37rM8j4r4n3J1K21k9k43K68Mj73K6L2J51j52K13j71l4l03O95k92L0
3924A03N9l48J32N6m52M37p3m7K48j97J18R5k86J5L59j24J46q2J0j86J56j58j12
3947a31P1K38j22N8NR5k5p4j17l8k76L28k0P7j10j79L07J7k65K84k38o8L88k65
3971f0K16k03K09qj92k62J3K39o4j2R0J93k20J05J46N3k87j19K69l05K84q4J31
3994A32k25Q6j13M5N4J37Qk75L61j67L4j60J53J01j94p5KP4j98J48J74q1L5K9
4018H5k00K9K59k55N8m8q8K86N6j50O0j18K35j71j25J95j62K40k29K9K4Q6j74
4041g8o3K45N3j08R3j65m2J79j47J32j81J02J6L6N5q0K8r4J96j03OJ2J99k84K2
$$ y = [-176, -27, 7, 4, 129, 73, -124, -230, 115, 45, 22, -42, -154, -27, 94, 179, -205, 32, 32, -54, 283, -208, -64, -85, 266, 208, -29, -38, 10, -4, -98, -151, -140, 81, 52, -191, 77, 81, -92, -66, -34, 117, -35, 178, 7, -27, -330, 365, 73, 103, 162, -186, -54, 2, -450, -13, -86, -133, 115, -82, 36, 131, -155, -140, 219, 95, 241, 159, 169, -17, 139, -19, -131, -60, 178, 56, 114, 119, 214, 189, 115, -2, -40, -316, 12, -8, 69, -41, -220, 87, 104, -161, 123, -115, -183, 205, -60, 156, -47, 162, 154, -38, -300, -287, -48, -112, -124, -34, 159, -61, 44, 190, 243, -44, -163, 106, -199, 85, 1, 132, -93, -7, -120, -75, -21, 116, 124, -151, 210, 43, 77, -83, 70, 171, -23, -98, -96, -22, -220, -72, 102, 21, 56, 85, -115, -86, 173, -82, -24, -72, -160, 126, 182, 32, 92, -26, 209, 38, -87, 108, -54, 186, -43, -14, 10, 96, -78, -141, 104, 157, 49, 142, -23, -65, 114, -33, 99, -82, 20, 36, 72, 127, 47, 75, -19, 177, 74, 80, 92, 291, 7, 29]
4066B9j24K73p9M3k42J46l7nk3J3P8k09J59l6m6J17J7j02P6k3K22j98M8M8k13
4091f8K03o3K3L33m96M6L3J59j85j4L0q1j4O9K51k97n0p4J24o7J35J50k52J58
4115E3Q9j54k9J24L6j03K74n69O35o76K35j2J8L4m7R1o9j3J68l7J5j45R5j42J90
4140F1Ko7r6R9j1R8R4j80j70k3j54J60P7K40j41M8l5J46k06j7K29k27K39k37J36
4165F5K18j22j09J11j76j25J23R7k05J5N9q4J90k85L66k19J09l03K50J25q6j14
4187a00R5J38l81K98k9j14q3Q8M58l28m5N5j87J74l9k2L47k71Q3m25N28n77L26
4210a1k1J4K55k08o2p5l1J04O7j48K97j4Q3m68J92LM7J29k15j41J04J76k07N6
4234g4j44K58Qo3j46K53o7r9l0L59k35q5L87l87J87k29J44P1j75o3K38L1q5P2
$$ y = [29, -95, 178, 99, 142, -100, 46, 9, 4, -19, -6, 72, -137, 22, -14, -60, 57, 74, -28, 48, 25, 247, 49, 97, 145, -68, 135, 72, 95, 428, -68, -22, 11, 170, -15, -29, 1, -80, -94, -25, 226, -71, -121, -195, -71, -138, -3, 147, -105, 53, 142, -12, -41, 83, 119, 16, 290, -279, 356, -320, -85, -97, -79, -45, -92, -1, -70, -83, 85, 48, 63, -82, 13, -129, 61, 63, -4, -100, -1, -12, 86, 180, 0, -170, -193, -347, -187, -110, 130, -11, 37, 2, 148, -58, -75, 154, -73, 166, -71, 65, 283, 161, 52, 163, -13, -138, -15, 82, -123, -108, -49, -133, 57, -228, 138, -81, 28, -275, -25, 100, 14, -100, -5, 133, -248, 50, 21, -93, -176, -88, 370, 42, -3, 52, -135, 39, 0, -22, 325, 54, 137, -288, 240, -337, -11, -32, -18, 237, 29, -33, -108, -139, -35, 32, -116, 181, 167, 250, -218, -26, -23, 24, 153, -62, -203, -99, 77, -130, -74, -218, 40, 48, -15, -161, 92, 25, -74, -104, 255, 20, -65, 322, -65, 122, -107, 37, 108, -67, -130, 108, 139, 54, 126]
4258A26k68L20l23J82J20k16J02j44RQK8M0p3L51k64l6K79m88L67j08l5m6j45
4281b14M0j46J51K76kj05m4n1R8j02L8l4J11j28J72j46K05L5l76J33M2j57lK83
4305G6J00j29k29K80l18J39K5J53k37J40j04NK50k95J87j17P1j51k7J57k15J41
4327i8P2O3L50n00J22K8l7r4M7K98j79K2k53J67k8J47l46J89j01K08j56M7R9j07
4351d0q7R0MN4K03k21n6K19k30R9j70L16k60J23j16K58l32q5M37k40J3j22K59
4374A16O9J7j8j08n3r1J40j3l1q0%p7J67M6j08P8M4M7j62J44k44Q4O0j44J11r9
4400a05J17j21K38j87N5L26k71j99J25K01p7K04l86J73J6j7j75Q3M2j35J85K8
4422A20j67m2M8J43k06m2K34j46j0J16j89L18k30J46k72J49L3J6j00ro5L01l54
$$ y = [126, -142, 178, -145, 37, 157, -59, 43, -101, -92, -84, -56, -16, -89, 262, -2, -38, 241, -247, 120, 12, -23, -69, -214, -174, -320, -169, 107, 105, 0, -44, -95, 3, -99, -61, -95, 16, -112, 60, -86, 119, 154, -222, -89, -47, -204, -207, 76, 176, 47, -182, 98, -220, -81, -56, 97, -140, 0, -104, -99, 151, -144, 43, -74, -3, -154, -181, -24, -239, -98, -26, 37, 387, -113, 9, 37, 0, -94, -47, 251, 72, 94, -159, 8, -20, 127, -219, -30, -131, 77, -79, -32, 67, -40, -127, -37, -33, 21, 224, 3, -53, 166, -64, 35, -135, 181, -79, 44, -72, 186, -146, -231, 206, -34, -21, -143, 116, 185, 202, 184, 76, 23, -68, 72, 59, 28, -52, -52, -129, 38, 84, -24, 54, 98, 145, -17, 127, -117, -33, 27, -117, -6, -105, 12, -109, 129, -58, -3, 323, 52, -147, -22, 179, 102, 306, -80, 93, 109, 92, -83, 0, 42, -93, 92, 120, -47, -89, -41, 102, -104, -146, 88, -58, -68, 48, -141, 177, -53, 93, -179, -30, 3, 19, -81, -90, -155, 146, -208]
4445b08K58J01j26J13k82n6M34k25j60J03P9J56k1q9l50L76l2j81Q9m6k7J79n2
4468C3m07N16P5m00L35k09N5k05R0J45j23J14k11K40j08r3J4m0K50Qj83L8L79
4491C13n22L5J96J94l2P8l47q9N8K59q9p6L2K6N3j44N9j0p7K30r9K0k32L8J99
4516G3K5k05J81j0j70N5r1J60jR5k4J04l72J62l5q2K20j31J03k7k27J50K42k30
4540c5j6K7o5J30N9k19j20J50RJ06o3J23m0j97J04Po0J3N1OK49m66L46j8k58J00
4566g7K1O2p9N8j20J1L12l6j09p2j80M51j69L9q5K14k42R2J08l61L63k62L17j60
4590I6N8p3r9N7l3j33j2K11k49n8R9M2j7L6M7o9K4p0j13M16j61J06j14O1r9n4
4616a01K7J82j13Q3K08k37p9N1PPj47L31j55j03M6j8k08K18k03O4J31J05l4rk2
$$ y = [-208, 50, 151, 25, 138, -144, -200, 234, 9, -151, -48, 31, 187, 166, 77, -273, 103, 71, -110, -21, -67, -94, 85, 33, -374, 142, 217, -183, 152, -57, -2, -207, -117, 28, -95, 19, -192, 48, -60, -153, -139, -179, 71, 79, -104, -66, 313, -209, -174, 22, 216, 184, 262, -85, -174, -116, 143, 54, -22, 10, 36, 89, -55, 4, -6, -83, 147, 48, 68, -164, -126, 73, 98, -107, 74, 64, -106, -51, -142, 18, 17, 112, 88, 192, -180, -18, -53, -135, 85, -46, 57, 30, -197, -47, 195, -35, -51, -24, -89, 41, 100, -119, -239, -89, -80, 26, -37, 86, 46, -151, -47, -40, -100, -87, -36, -30, 219, -247, 99, 81, -177, -77, -56, 6, -73, -15, -135, -124, 188, 152, 43, -29, -209, 242, 73, 112, 27, 241, -1, 91, 199, -162, 201, -61, 256, 96, 154, 81, -18, 39, 6, -127, -139, 72, -177, -235, -136, -94, -111, -75, -28, -97, -73, -143, -256, 160, -1, 105, -9, 52, -47, -101, -74, 108, -5, 78, 286, 49, -30, 21, 28, 35, -112, 219, 64, -39, 7, -11, -219, -1, -204, -140, -9, 96, 62, 53, 31]
4641C1mj21o7L41j31J1k67p5J14Q4J79j08Q6J48k33j9J47Ml6o1n5Q7J4l90K86
4666c5J35r4m2O4j14l7K10j52k5J41k69K97j47Q5k3k06K95k56L04l92L17o4j38
4689a46L27j96r3M3j41L17k21K4K3Q5j29J65J04k79J43J22k70K31LJ84k61j77
4711a42K03p3O1oJ34j98R2j8O8j50Q5j29L9J13k6k13J36m5J93j9n4k27K92J19
4735B35o6k13j61K08j42K83l3j38J11k01L94m99N5l5K66N8k27Q1P5l5k31K37J13
4758A35k55J97J93q2n2k09J02o3nO8m6j66K46L7j67m1L2Q3p2J61n4nN3J08j11
4783H7p4P1k21L44k94O2j6j48P4K05j46K0k0j47J66L10m06K52k59J63n6J8K0j93
4807a88L6k5J50o0j01K26K30k72J87r3o4k83J13Q0J6Q2pjJ57Np0k7Rj60J25k13
$$ y = [31, 27, -94, -161, 180, 49, 60, -207, -282, -168, -84, 95, -13, 73, 221, -12, -31, 116, 120, 84, 23, -32, 55, 69, -321, -35, 100, 6, -36, 28, -86, -123, 87, -65, -90, 51, -218, 79, -68, 17, -6, -212, 83, -173, 131, -261, 56, -8, -146, 181, -15, -108, -65, -206, 111, -110, -86, -63, 22, -107, 58, 162, -117, 26, 148, -122, 109, 112, 296, 35, -142, 61, -12, 49, 43, 177, -21, 71, 53, 121, -29, 56, -73, -34, 79, 53, -160, -24, -69, 124, 105, 51, -176, 116, 235, 169, -44, -205, 3, -139, 144, 111, -27, 84, -117, 277, -222, -167, -202, 64, 122, -105, -24, 51, 16, -215, 22, 135, -120, 77, 270, 188, 136, -73, 29, -34, -39, 29, -17, -183, 63, 100, -67, -108, -76, 7, -65, 96, 42, 37, 90, 198, 87, 13, 84, -137, 207, -87, -25, -41, -189, -115, 90, -56, -36, -56, -203, -37, 273, -133, 119, -140, 23, -33, -15, 5, -188, -152, -177, -27, -87, -188, 38, 268, -4, 183, 90, 26, -257, -144, -64, -48, 34, 27, 26, 183, 188, 118, 91, 100, -60, 65, -148]
4833a48K43K2l13K36L9q3j89k8RN91l19K22k52j2n4j12K72O4kl17J16N0q2j62
4857b09L42Rj44m0K10m7k54J37k3J59k71L55k26M9R4j05P7j24J58j10j09jK12
4880A39N4k99L38l22K66j42j32Ql5j05K71p5RK64m54o5l8K93J18k23J1P0P6p6
4904d9o6J36P5m7Nk4r1QR9j49k6J02J52k07K20j2k73L77m60K87LO4j66M2On9L14
4931B61j99j25j43K50j78K97j01m0j30J68J5j82K11M4j05Kk03OK57j16l9m4M9
4954d5J03j94n4L15m6j84QJ28K12k41j4l0p3J82J23k18j7Q6P5k07K05l9Q4k10
4978e1M7RP9L1l32k4K18j07L8K72k64J05o4k22J95rL56k80j8J33j13j70J51n9
5002g9J80j04K0M7M6m6l14J97K4L6J10l46M0L96k02j38q2K64O3J70j60j17pj52
$$ y = [-148, 95, 117, -196, 40, 79, -4, -193, -221, -212, 379, 60, 282, 30, 18, -36, -148, 124, 188, 186, -131, -15, 35, -47, -209, 133, 142, -2, -42, 168, 121, -133, 4, -19, 140, -131, 224, -2, 47, 141, 36, 113, -11, 147, 37, -72, -73, 139, 193, -106, 232, -90, 176, 34, -98, -90, -125, -230, 41, -34, -25, 239, -215, -280, -318, -25, 93, -130, -119, -49, 27, -49, -115, 21, 96, 49, 54, 30, -61, -53, 46, -103, -129, -27, 125, -82, 138, 126, -147, 230, -230, 57, 60, 124, -42, 0, 6, -53, 261, 62, -63, -206, 44, -134, 163, 62, 22, -108, 60, 75, -107, 104, 148, 43, 45, -158, -152, 105, -11, -50, -94, -45, 58, -136, -190, 125, 79, -105, -97, 31, 243, 2, -12, -42, -115, 67, 190, -28, -45, 41, 116, -91, 114, 75, 159, -51, -4, 5, 84, 115, -217, -241, -23, -130, -92, 180, -84, 21, -43, -265, -70, -79, 277, -3, -21, 112, -1, -171, -20, -79, 101, -3, 17, 64, 110, 64, -250, -53, -29, 7, 117, -229, -189, 207, 5, -133, -215, 49, 112, 282, 122, 5, -2, -154]
5026a54J45J57j26n1j28K5L96p3k18L47k89q8j5J77M9l30K41J15n8k59J52o2k06
5049b53K68lk06o1L44J4N8q8mK9m0k81J92j58J23J51q7j07P1j53J31m5L2J26K8
5074H1j31j99L45k32j11L70M6k87J10q1K35k80O4K67l59K10M0j63J62l72L79m06
5096c12L62m2J4j91m0K62Kl09K30K34j94Q5j00j97J61q0K40k9P7J8l47K32J2r2
5120dJ1L3L8k33J75K5O3k35NJ89j29p3K09k90K09R9j61R3Q7j54J07j43J72k16
5144a23M4J08j85j2L92k57L3p6L1k9r2K71m82N14j74l5K9P0r2J9J07rj8o2k12
5169b40J91K78l42J9R2K2j39M1J13K0P9J70j43o4j43p3M2J87k17j13P8J8J41k72
5193b55K91j37LK74l30J90J8j69J61K14m40J66J22j07j54K69K9q5R4p9K29m26
$$ y = [-154, -9, 148, 22, -29, -157, -132, 264, 191, -27, 320, 31, -57, -72, 105, 154, -176, 65, 180, 122, -137, 15, -47, -253, 15, 12, -194, -255, 89, 103, 161, 73, 69, 98, 58, -223, -31, -189, -66, 85, -2, -109, -38, -191, -60, -105, -73, 53, 81, -50, -249, 96, -136, -247, 123, 169, -118, -8, -89, 146, -134, -70, 197, -162, 48, 88, -75, 87, -285, 94, -312, 50, 8, 22, -169, -209, 53, 55, -254, -24, 210, 16, 101, 1, -196, -35, -115, 125, 96, 173, 191, -156, 76, 88, -4, 7, 40, 78, -155, 20, 45, 108, -127, -122, 67, -62, -135, 74, -216, -7, 92, -69, 24, 111, -43, 64, -79, 93, -123, -79, 29, -156, -168, 224, -33, 0, -76, -45, -74, -166, 105, -377, 137, -37, -72, -43, 27, -65, -46, 61, 52, 34, -28, -240, -49, 229, -113, -94, -2, 20, -119, -78, 35, 55, 134, 304, 161, 97, -46, -119, -77, 110, -107, -220, -142, -124, 17, -255, 36, -101, -98, 176, -154, 36, 54, -115, 46, 260, -180, -14, 108, 1, -153, 116, 145, 60, 154, 75, 304, -122]
5215a22o3K48O6k35L7l7K08l03K18j06j19K35L1k29K96p6M4j15J03j81M7q7K17
5238G7n4r8J65k33K25J5j81J51q6j88O9J29r2K83j17l9L8J56j88j6q7k09K87P3
5262H0J83k60L4R0j16n5j29J75j50J67k55L69j53O8J48k23j30L06L4j62K56k41
5284C6J32p5J39m28J09L19k08K24l35o1J39L8k32K42k90L54r3l6k74M65m7k26
5306a08K09q8o0K0p0K14k50P8J02K07l17J57j61mJ37k05L94K5q1r3lq2k6Q6n3
5331B8L1K55l12j52k0R2J76k60L0K5K21p5j83J75J67l25k4p5K43j82k1J30n7J47
5355C4J11k41q5K54l58L18m26K93o1K66l32P7K04mk24N2J07m1k14J23K7J7K32
5378A29L4j48j12K15m3k62R6K5M5m2R3Qj05K30m2k14J57q3QJ04k33J67r8J20k56
$$ y = [-122, -185, 63, 129, -106, -69, -106, 102, -201, 17, -89, -208, 27, 58, -171, 125, 49, 93, -22, 81, -100, -53, -140, 77, 23, -75, 90, -143, 82, 97, -84, 67, -19, -207, -138, -9, -101, 182, 65, 26, 64, 220, 32, 16, -71, -280, 7, 80, 263, 3, 37, 127, 11, -44, -173, 2, -148, 19, -236, 133, -20, 48, 196, -27, -157, 149, 183, 21, 277, 36, 168, 93, 232, -196, -87, 232, 24, 248, -87, -148, -9, 29, -203, 39, -251, 103, 10, -26, -300, 165, 118, -108, 101, 13, -47, -27, -97, 117, -133, -55, 47, 254, -63, 94, -67, -71, 66, -139, 255, 280, 199, 106, 103, 21, -5, 81, 28, 59, 314, 2, -150, -170, -78, 98, -162, -132, -107, 114, 39, -144, 31, 198, -127, -151, -226, 17, -165, -186, -56, -113, 34, 145, -96, -181, 73, -285, 33, -393, -100, -161, 105, -227, -150, 54, 50, -174, -122, -15, -56, -270, -147, -120, -103, 129, 163, 15, -97, 118, 75, -187, -91, -66, -21, -63, 30, 38, -67, 163, 121, -93, 64, -19, -11, 93, -140, 27, -71, 49, -207]
5403b07K90l17L36j90Q0J23o5J44j73KK61m06P9O0q4o7J39J9J4k35K46j22P3L0
5427C0k22K66R5j62j81K35j66j10K74N6r2L2j31Q9P7j15M9J86k28j11P4K6L5r3
5451h7j46J71K82k42K69l66J76l10K96L1j71J43l91J62L2J05N5L47m80Qo0L17
5473A41j24l7N9N2m36M07J24k80L94K8k66J12j44R3j93k18M89qL5k50j7R3k37
5496a83L03k22P5j06J14J14j69J53j29L1J84l48L94k11J18q3j49m9K76p8j40J43
5518C8K7m4q3l4K41m91K40K9J98M3J51q8k79P2j15J33p5o0O8J60O4q5o9J14j62
5543gk4k6N1P2k13K59k57J27K03J2m08J16J78j30o1R3r6N3K6J56k86J1K80k19
5567i0LJ59l6J60j96J00J4k25KQ3J15j80J28p9LK21j96j2M9q2K56j08j12k21L24
$$ y = [-207, 83, -234, 102, -88, -8, 115, 50, 194, 21, 23, 284, -122, -43, 17, -67, -134, 5, 24, 38, -197, 49, -73, 0, 30, -192, 74, 169, 7, -174, 61, -105, -215, 59, 115, 23, 55, -76, 13, 90, -25, 24, 210, -18, -129, -55, -29, 6, -87, -233, -62, 220, -22, 247, -119, 57, -253, 43, 74, -97, 46, -345, -183, -151, -46, 9, 356, -124, -116, -176, 141, 17, -20, 39, 91, -345, 62, 186, -94, 300, 328, 62, 174, 30, 123, -70, -288, 201, 193, 228, -22, -39, 54, -183, 120, -102, -27, -133, -19, 95, -74, 79, -50, -19, 165, -183, 211, 0, 118, 35, -114, -163, 113, 35, -105, 38, 65, 21, -62, -96, 145, -346, -106, -77, 121, 164, 315, 227, -52, 20, -95, 38, -37, -97, -29, 131, 195, 110, 41, 155, -7, -31, -57, -6, 66, -147, 112, -145, -18, 185, 197, -211, -95, 83, -47, -108, -15, -111, -58, -32, 124, -162, -151, 129, -90, -87, 72, 36, 196, 0, 100, 114, -111, -109, -26, 89, -91, 37, -42, -39, 182, -14, -26, 23, -59, 197, 89, -23, -244, 80]
5592H0k38J66o2J49oJ28l02P8O0p7K3j29J52j02j8J6p1M6J89j81K41k50K88j08
5616G2j18j8oj16K17j77K27n3k40K58j61J54l5Q9j02j02K42j73j38L80j15J19
5638B04l06n3O1J68K7j81ml42N72r5n9q1K9j52J89J57r3O7Q8j86j3l02Q6J83J55
5663A19j36p2K06r5j49J04Q2R1j96ll4P9n0J80p4j59L7q0P4J85k43J0L4J45m9
5688FJ30j8k98K34J4J73l12J08j03Q8Q8k46K91o4j85K18J64l46K41n8q6j16K60
5711A83m0l5j24J41k31J54k28J89p4q8J91j07J55n9o6o5R3LQ5p2j41j31J02J15
5735e0J29J52k48k08K10R8j94K59k83J10J9J58J17l85J28k18K25k04K28k8j08
5756i3J09J21J1j75J27j80K19l04m7L81j73O6j64J34l26M35k7k62M33l36KK01
$$ y = [80, -158, 8, -54, 95, 89, 217, -85, -7, 53, -24, -1, -130, 22, -80, -98, -82, -153, -107, 82, -99, 142, -108, 180, 72, -46, -64, -70, -186, 31, -146, 81, 28, -212, 46, -115, 39, 4, 93, -9, -111, 131, -42, -180, 200, 85, 204, -102, -155, -94, 74, 101, -80, -84, -426, 146, 51, -8, -89, -60, -212, -23, 134, 41, 108, 196, 10, -3, -305, -219, -36, 119, -17, -89, 117, 22, -127, -23, 59, 150, -46, -49, -83, -4, -54, 126, 52, -107, -70, -150, -76, 109, -134, -124, -90, 55, 6, 136, 118, -180, 54, 68, 241, -71, 37, -66, 22, 110, -136, 155, 91, -94, 124, 288, -58, 183, 125, 39, -77, 183, 143, 108, -16, 125, -106, 48, -180, 9, -65, -153, 38, -69, 86, 27, -39, -104, -11, -8, 77, 5, -136, -267, -165, -50, 79, 231, -17, -225, -15, 83, -111, 148, -135, -25, -6, 152, 269, -116, 12, -206, 19, -185, 43, 15, -93, 16, 137, 148, -27, 100, -80, 139, -165, -212, 169, -4, 62, -102, 32, -294, 141, 114, -148, 285, -51, -49, 152]
5778A52j7k70J75Q7q9k6o1o3l6N2J81L5j15p6O7j7K13k02p3r9K61j95%P5K7p5
5804h9j1P3j82J41O0N3L4o5j50J06L2j15J01M7j84j1K37j49O3m1J49j60J04Nn4
5829fj78J35Pj78K35j1n0J32j11K48j42j62M6P5p4%K62k75M0k1J55j55j22qJ68
5854A0o4J48n4k01L30k98M5J09J11k43K87r7k16K86k47K81m56J74J34p3L03l9
5876B30k04o4N3j79K45o3O8k64q0J09j72M02N0j57j80n9J68J2O4n3O3Q2m7M8k63
5901a91J77j03K59j92K1L7N1l82M48p0j79J22o9NJ15o1l1j10K99O1q7m4O3k05
5925f6K89J6j82nj11K27p0rj8k58P4J79j36K99l85N9k1j01J55j90K17j5k02J71
5949h3P6j07K5K4l9l8J01J99j49j68Q5J91j29L0j28K37k57K46k21J57o7k8J0q3
$$ y = [152, 135, -135, 40, 127, 38, 12, -49, -112, -148, -96, 85, 120, 5, -71, -4, -21, 192, -10, -83, -182, 79, -116, -116, -41, -14, -89, -100, -27, -209, -68, -8, 45, 79, 14, -136, -30, 2, -113, -12, 35, -149, -160, 77, -72, -9, -50, 99, -61, 43, 48, -6, -184, -49, -42, -220, 15, 4, -46, 86, -25, 223, 81, -81, -35, 40, -34, -34, 228, -47, -7, -28, 127, -28, -150, -158, 10, -54, 94, 40, -161, 169, -129, -84, 25, 136, -107, 180, 83, -133, 153, -94, 187, -269, -95, 39, -34, 269, 230, 26, -38, 15, -164, 81, 18, 86, -178, -258, -149, -321, 81, 131, -26, -206, -265, -97, -85, -21, -74, -11, 71, 24, 72, -191, -14, -117, 142, -50, -29, 8, 59, -323, 125, 55, -124, -2, -71, -66, 49, -12, -43, -153, 146, 207, 120, 76, 139, -66, 223, 239, 57, 52, -59, 168, 98, 89, 71, -187, -113, 66, -70, 229, -156, -97, -118, -219, -64, -254, -37, -52, -254, -83, -7, -114, -89, -65, -104, -142, -41, 158, 9, -159, -74, 117, -12, 18, -110, 127, -130, 116, -105, 52, -15, -43, -33, -116]
5973a16K36q6k99N36l07p6R2L3N9N6j36k7J72k92K54j22J45k3r1J81q5Ll13K37
5997C1j0j75K49j99k4J9j25K4%K34J74P6l74J73O8k12M0k5o6O6J02qRr3j4j79
6023b39L63k37K65k98OJ42lJqlLk7l9K07r4P9j56K13k01R4j60K17j67J92j59M8
6049C9J29j21L20l83K03l43J23J9k23J14K42j36J11o9k8l5P4J62k78j6K05L8n9
6072H8j48N2J1P1k39J68j71J75l9K1j19L23k01J00j47j04J50n2M5J97r0l19L13
6095H5j47J59k70K94R9k36J4j12J10J29k9K37l02l0j04J74k17K22l4p2O1k37J74
6118c2k9l1O3J01j18m2O2O0j87M6J1O3p4J34R7j91qJ53L9n6J58j92j32J46j04
6143f3l5K02n8L08n09M62m55J93J05k73K54l86J17J56M0Q3j63P5o2J94J22l06
$$ y = [-116, 120, 34, -265, 271, -36, -112, -20, 13, 72, 128, -8, -35, 137, -155, 99, -23, 122, 99, 8, 189, 104, 107, -206, 31, 21, -154, 95, -104, -128, -109, -234, -210, -210, 24, 198, 274, -100, 73, 141, -71, -31, -56, -122, -56, 46, 38, 47, -46, -60, -239, 124, -113, 152, -146, -140, 2, -1, 0, -8, -11, -8, -35, -74, 133, 39, 118, -38, 175, -26, 68, -92, 125, -42, 150, -9, 39, 168, 47, 367, -16, 187, -156, -33, -14, -237, -123, 119, -17, 94, 25, -3, -38, 36, 198, -80, -96, 109, 147, 88, -60, -8, 3, 74, -165, 3, -168, 7, -32, -11, -130, 193, -8, 92, -55, -159, -9, -61, -16, 181, 91, -228, 85, -62, 97, -173, 121, 220, -16, -2, -114, -4, 125, 96, 333, 31, 1, -103, 71, -146, 76, 42, -30, 31, -206, -32, -61, -92, -29, 72, -46, -88, -26, 34, -153, -107, -96, -33, -107, 27, 124, -67, -75, 78, 117, 61, 219, 27, -105, 41, -63, -98, 104, 46, 354, -155, 307, -148, 45, 150, -123, 131, -255, -138, 18, 58, 141, -22, 53, -9, 185, 307, 1]
6165AP4P0Lm2o3j08l6K4J4J43j34qr1K09j75Q4n9m3M7L5J12p7O0k99J41J67k31
6192a82J94o9l7K20L2q9nj23l4L13j15k11N9q7k53K93K11j28p7P6R5p6p8J44j26
6217e3J91j86j22K31nJ36l44J84P4l15R6J17j31M3j35K30k7m6Mj8L9j72L75j42
6241B4K05k61K35k36j01L51m19J74R8j20rJ83K4j36qn2p1J53l3n9rK94l58K24
6265I3k10J67j06P9J65j93K50j76k34J47J51k25J23p3N0M3O3Q0R3j69r6k08J72
6288a4n1R8l25M12P5m2mj90MJ07N9jj29r2m7N5j73K28Q9j07J20k5j01K6L6P1m32
6315c53K00K01J28P5k61p0J3rj23K21l15K84j51J30J64l7r9m7P9j71K58l83K82
6338A6N4o9P8l3j78J91m6mJ03o2j79r6L38n1Q9l36J44L60l23J33k00j19P0k23
$$ y = [1, 75, 145, 148, 106, 43, -65, -101, -77, -63, 80, -54, -62, -153, 56, -119, -35, -94, -137, -90, -55, 57, -20, 40, -259, -118, 49, -182, 12, -57, -94, 126, 158, 69, 64, -59, -93, 220, 105, -106, -47, -134, -387, -94, 117, -11, -88, -12, 83, 7, -71, 73, -53, 138, -48, -170, 61, 56, 192, -152, 32, 106, -209, -113, 4, -127, -84, -219, 11, -16, -62, -58, -76, -37, -209, 166, 24, 229, -32, 203, -33, -134, 217, -202, -28, 70, -50, -59, 124, 148, 12, 4, -48, -119, 34, 1, -58, -67, 227, -131, 93, -117, 50, -56, 23, 188, -5, 245, 69, -165, -18, 133, -92, 31, -42, 8, 51, 114, 194, 287, 118, 22, -186, -14, -65, 33, -292, 120, 195, 153, 149, -41, -37, 70, 129, 128, -1, -93, -140, -85, -258, -30, 59, -48, 72, 47, -54, -28, 8, 79, -353, -153, 48, 176, 251, -10, -80, -67, -76, -199, 22, -293, -9, -160, -30, 134, 97, -2, -49, 30, -141, 117, -266, 16, 70, 1, 79, 46, -132, 59, 13, 9, 112, 50, -129, -225, 113, 62, 151, -185, -41, 319, -4, 129, -71, -190, -120, -343]
6362c43K19n9J49j40P6K45k49K8j5k37M01kQ3k8k38J70omJ57r3j09J19m3Q4l54
6387a89J26j95K21j9J05j53J45J11n08M14qK07l01P2P7K02m88RL25j39J50j08
6409E6O9k51J21J08m0n0K10l71J64j97J10l5K18k29K01p8J38l7k03kP5Q2r5L5
6433aL0j02j25N3M00k82J97r9j58JP7J67j%k45P1K1j57L17j27Pq4J06j07k66L36
6459B9j20R1kO5p6J77m34L1K05J60j20n6j3L1j4K28j94j37J91R0p4N6J12l25J65
6484F6p0l5l2J27j35o9K72k11K25K07m73K48j35j5j45l7K18k49J48J62l3J04o3
6507G5p9J15l0k82K0L98l36M7P4k16M66j93J28j40M0k76L64k1l34n8L42k84L1
6530a49kJ70k71J73K75j82N3m9l58M97j40K4L07m13j9J23j76K04N2k17P1r3Q1
$$ y = [-343, -124, -183, -34, -174, -98, 147, -102, -74, -89, -326, 75, 73, 156, 128, -110, 60, 54, 50, 207, 114, 5, 124, 81, 165, -189, -63, -258, -37, -56, 49, -104, 41, 152, -356, 58, 50, 257, -44, 28, 105, 307, -181, -172, 153, 14, 164, 56, 125, -126, -5, 103, 63, 13, 223, -148, 16, -181, -71, -106, 112, -117, 84, 6, 144, 107, -96, -98, -23, 59, -36, -1, 29, -73, -198, -145, 255, -27, 170, 71, -87, -86, -9, 158, 157, 157, -88, -17, 4, -153, 164, 37, 44, -40, 66, -41, -307, 29, -91, 0, -2, 63, -13, 164, -270, -239, -34, 126, 6, -50, -63, -32, -46, 182, -12, -149, 42, 132, 58, 114, 226, -99, 66, -4, -39, -71, 56, -79, -148, 124, -87, 138, 345, -128, 120, -15, -30, -175, -212, 6, -243, -95, 67, 34, 138, 75, -4, 111, 81, -201, -181, 217, -119, -72, 2, -214, 252, 59, 187, 47, 87, -189, 175, 154, -180, -238, 104, -180, -149, -151, 19, -252, -79, 196, 14, 67, 18, -340, 157, 17, 41, 348, -65, -84, 39, -137, 67, 119, -98, -27, -120, -39]
6553c9lJ76N5K7k95J03L7k89J72P6J08q5J8jmj85J97j45P8o8J38m5j69J72r1P
6579e5K5l0N7q2K1O2j76j9J95O2r2R0p7J38k81k4L98p3j47j40J29j23K8J61R3
6604A40o1R2k33P7p7P5J20N1k77M6O5j55LJ38l53M16j50J08M4j14k07L70p8J46
6628A86j65N9j13q7n3R6O8R6j52P7J91k74k04L35J92j91q4L3J58l04N5K76k14
6651a9P5q7l0L5K0R9j13N5K1k00j05K13N3q7J86Jk64J64j11O5r1ML58r2j31l1
6677a2q6J73M8K9L9l1%l87K11J47k43p3J11N8Q9Jj28Q8J37j32k5J16m76J78J49
6702a9m8J38k11P7R6k97L18k61J73Mm9K07m25K18J33M3k1r9J18j97J18L1l0L7
6726E4J66l18J87k2K29l93k17M32j34j55K46R4j37m5K8K5j41J05L4j58K3K5J80
$$ y = [-39, -42, 134, 189, 216, -79, 24, 61, -228, -56, 20, 128, 43, 61, 60, 56, -129, 68, -77, 1, -67, 71, 26, -143, 29, -62, -55, -30, -60, -3, -85, -64, -2, -178, -197, -2, 60, -32, 58, -19, 119, -162, -186, 212, 139, -8, -148, -19, -142, -114, 47, 140, 79, 171, -62, 15, -62, 13, 133, 184, -93, -47, 18, -137, -134, 4, -349, 67, -83, 25, 69, -45, -252, 118, 40, 186, 21, 80, -33, -120, -173, -77, -9, 87, -65, 12, 203, -71, -275, 60, 252, 61, -23, 10, 168, -136, -81, 195, -19, 56, -31, -61, -26, -6, 93, -20, 35, 56, -144, -249, -36, 17, -70, 116, 117, -147, 17, -94, -29, -120, -116, 242, 150, 19, -12, -98, 75, 123, 152, 191, 160, 160, -227, -16, 131, -112, -185, -74, -16, 73, 74, -54, 34, 171, 39, 14, 130, -346, -168, -19, -67, 71, -140, -63, 33, -264, 54, -207, -34, -30, -79, 128, -297, -79, 54, 97, 76, -23, 95, -102, 16, 47, 17, 54, 220, -98, 89, 67, 296, -97, -314, 118, -16, -171, 75, 169, 32, -13, 15, 40, -101, 4, 38, -120, -97, -72, 108]
6749A08j36j3l1m1K80r9q4J1j10K15j68M7Q8p5J33l15L74k74PJ80J5l8p4k29K32
6774CK1kJ09j24j19K47j37M1n0l4J52j8M4l24K98m43M12o8J15n6J5m4J38j57j73
6799a54J19L25l95J74l02J48J09j42J67j8l23N25k89qL18l65j4J5K07j04K28m05
6821a84J39N2K9K33j72j20M5j51K12K13j15k13J6o2K45j00J58k37o9J89l60L47
6843I5N1n5lp6j87j34M62o6j56Q9j05J67j27J9J34j78J05q8L2j94J91k4K25r1
6867H6j31L3O3j38M9l1M7rJ98j89j91L36k11J76q0k5Qm6K25N8j3j61q%j1k6k7
6894a8j0L8q0J1j06p2K75Ok0L7j55j90L96k14K6J01p0K10k32q6O5j85L69r0nj8
6920a7J05Q5k59J36R7l09K21k8M7Q4j48l2r9K08J28r3k63K99J0J2K2k46K09k23
$$ y = [108, -28, -41, -72, -113, 167, 68, -16, -5, -115, 100, -68, -21, 67, -8, 125, -190, 184, -90, -83, 97, 112, 74, 0, -229, 3, 24, 22, 131, 7, -112, 135, -2, 39, -11, -45, 107, 89, 133, -191, 107, -336, 76, 8, 123, 67, 82, 38, 176, 19, -154, -35, 290, -105, 69, -233, -85, 24, -118, 49, 31, -292, 233, -56, -64, 254, -111, -125, -110, 97, -7, 221, -184, -45, 7, 36, 269, 97, -23, 22, -129, 83, 296, 181, -32, -16, -78, 167, 67, 225, -12, -81, 108, -252, 95, 146, 91, 88, 12, -175, -309, 153, 87, -69, 20, -85, 82, -45, -26, 108, -70, 35, -53, -21, -215, -24, -48, 177, 86, -45, -12, 51, -87, -38, -69, -22, -31, 167, -22, -213, 123, -88, 88, 8, -17, -9, -55, 170, 228, 215, 54, 46, 46, 35, 9, -18, -28, 10, -70, -59, -165, -237, 38, 44, 24, 61, -94, -284, 112, -102, -76, 25, -45, 165, -67, -153, -88, -273, 96, 6, 1, -17, 88, 173, -86, 50, 147, -162, 59, 31, 78, 162, 14, -18, -117, 91, 219, 126, -137, 162, 172, 184, 206, -40, 169, -54]
6944e4J43k57J25M1N2M5q5j80N0L23l38L62k57M06m40o9M6mJ40R4p4N3q4K6j57
6969i3K82J4j78j30J74j84L7O9R0j58K83l25L54j42k3n8K6o6K95k68R4j93K74
6992A74j7l7j42M8N4m0j28J8Q6o2J11p7Q9j75J6o7P6K05m5O0l68K88q1k6j2j15
7018a67J21K6q1RK71k62K61k43J01j63O1LK16l17kJ88Pl8k77N49l26p4K00j2o1
7043a0m6J17J29j10M5k56J69o4o4Q1r0Jo0K09k45J48J81j03J94k68J81j97K43
7066A85k39j07n9K54l86K46J66j94l5K16q3M6K1M7k64J34K8n9j20K58OO2l5M6
7090A34n5L1l09P0K26L70l94%rj3p2Q6j62J04l5O7j45k1O3P8O5l51K89k54K24
7115a3N8l2J42k60J12o3l5j1J69n5pj95J36O9r1OnN8J0R1J7k34j7J04j6l9J09
$$ y = [-54, 89, -168, -43, -2, 50, 95, 10, -170, -120, 203, -135, 227, -30, 376, -64, -133, -87, -91, 49, 143, 69, 122, 38, 64, -93, 189, 203, 25, -105, 69, -115, -78, -9, 81, -77, 206, -119, 235, 93, 70, 12, 38, -28, 267, -1, 93, -100, 174, 157, 120, -22, 26, 80, 40, -88, -70, 16, -46, 65, -12, 77, -98, -82, -149, -73, 132, 87, 147, -221, 67, -14, -40, -52, -167, -46, -20, -101, -92, 179, -83, 178, -65, 36, -127, -66, -63, 153, -164, -166, 22, 29, -9, -286, 263, -63, -137, 63, 51, -10, -56, 61, 190, 80, 125, -131, 38, -26, -90, -9, -99, -98, -158, 51, -194, -46, 135, 32, 226, -42, 139, -58, 185, -54, -161, -220, 34, -352, -106, 60, -134, -169, 47, -36, 10, 31, 78, -186, -52, -24, -83, -203, 55, 61, 123, 88, 134, 79, 110, -199, -129, 97, 467, 73, 73, 64, 51, -21, 65, -97, 7, -28, 39, -106, -127, -64, 14, 79, -272, 17, -237, -13, 45, 13, 155, -105, 7, -56, -91, -102, 67, 12, 5, -190, -54, 15, -76, -70, -75, -17, -7, 84, 101, -133, -150, -46, -62, -101, 8]
7142Hm9M8J54r1K4k6j31j18Q7K70j38k3j40J26R5j0p9K79l28K1O0L2q9O6j92K23
7168G9J08m27L49k3k55L14k65K37l86K59Q0k30J74R1j35l5Q8p2J85j75j34K2k3
7191a74K34J33J1j44kk0k30K49k7q6l96M95N2L9nl51K21j1%q5J62J4k61J50l7
7216f9L08j30j51L28l32K23j12j7j3l2J0mq5J28J86m58Q4j7o2J37J39j68K66j18
7240D1L4Jq7n8J53j48RP9P5o0k62L02o0KO0j31K25l55K32P4k12K66j32M2j45K85
7266B30k70J15K6k32J14m61L37L41m76K77pL1j6j11J09j51K51k77K74p7j05J57
7288G9P6j0k61K93Mk19L6o1J14p9l04K21P4q5j08J97kK85k72j5j77J22K83j45
7312D6J00j90o3M7R3K8m2k43K13n0j93M27j61mj87m5N60k18l8r8k0J58n42L01
$$ y = [8, -41, 7, 161, 70, 94, 68, -63, -181, -94, 176, 38, 15, -125, 1, 96, 86, 7, 286, -42, -21, 39, 71, -18, 48, -144, 79, 187, -240, 109, 86, -169, 145, -120, 117, -269, -10, 70, -160, 14, 105, -30, -65, 23, -49, 136, -39, -173, -151, -174, 60, 193, 204, 60, 58, 38, -192, 57, 30, -56, -452, 43, 95, 134, 129, -222, -1, -12, -12, -97, 65, 79, -182, -32, -69, 239, 109, -42, 286, -46, 177, 65, 48, 35, 3, 13, 9, -76, 52, 238, -220, -136, -153, -215, -78, 61, -107, 159, 41, 75, 76, -11, -69, 84, -64, -55, 24, 99, 39, -223, 79, 19, 21, 81, -50, 175, -180, 52, 126, -86, 180, 48, 90, -55, 230, -40, 75, 101, -131, -17, -478, -141, 200, -276, 1, -6, 25, 9, -102, 7, -144, 107, -170, 104, 27, -78, 79, 155, 145, -116, 177, 181, -38, -2, -63, 51, -28, -332, -111, -37, -122, -230, -33, -35, 250, -22, -37, -214, -92, 191, 46, 146, -44, -107, -60, 33, 61, 19, -224, -11, -61, -254, 173, 12, 8, -179, -224, 336, 118, 80, -18, -38, 120, -422, -121]
7336a21L05p8j99J38j46K59j89Q2q5k39Q6K87j78J58j54J06J9k03J70l5q4L12
7358B11l89P5K86M9k57km5j74K77k52R4J30K2j07j22K05j71K43q7M9k4J50n4j10
7382cl28Q6N45r3k69J92j25k14K17j5PK60m08J20K50m8j15M9n7j31J69q0m2J2
7406b1q1J02J09j53J14L2k72J5m3L62m01J04J28j04P7p5J83r9k3q6K24k39k01
7429c48J16L08R9k77J63j85J88k72K40o0J03j23m6r8Q9LQ1M7r4oJ77l9j54J44
7453E6j33K9j98J90n7N6J17O7P9j30k77L58o6q9k11K28k65J52K01k59K31k36L04
7476A47k56R2M9j68J74Lj83M1R5J49k65J82k6K09J43n59J18J93r6j90j54J78J0
7499a14j92M35n9K2o8j58N1L38k94R7J50k26n4N4k9N8j69L21l05J64j60J57p2
$$ y = [-121, 184, 106, -93, 45, -101, 158, -31, 51, -34, -273, -187, 100, -78, 80, -74, 32, 51, -152, 18, -17, -101, 211, -178, -103, 183, 232, -25, -27, -72, -246, 31, -221, -127, 3, 25, -82, -204, 1, -170, 73, -14, 35, 11, 161, 107, -3, -331, -245, 300, 207, -62, 130, 5, -209, 8, -7, 0, 260, -148, -28, 222, 174, 59, 108, 51, -80, 89, 9, -33, -21, -102, 0, 109, -44, 70, 102, -170, -155, -198, 164, -237, -133, -5, -109, -32, -107, 76, -23, -46, -132, 92, -147, -348, -232, 76, 175, -102, 61, -124, 64, -208, 32, -28, 75, -48, -94, -192, -103, -100, -19, 28, -66, -72, 105, 66, -88, 56, -77, -48, -246, -56, -113, -57, 60, 127, 206, 76, -201, 157, 91, 2, -209, 19, -246, -94, 107, -152, 79, -157, 147, -109, -17, 32, -136, 38, 41, -142, -101, -6, 143, -122, 60, 34, 243, 386, -173, -55, 138, 42, -148, -302, -124, -114, -306, 129, 70, 92, 24, -134, -83, 255, -39, 58, 208, -18, -72, -18, -47, 11, -158, 163, -142, 22, -138, 19, -53]
7522e3k85K38O8j65oM53m83K08J0n6J3M7K0L0q1J92k08L12k23j22K68j48J37j23
7546D3l5J7J22l12J40o0M7L04j98j38O6K30m46N2Q4PJ98m6j61L76n04J42O1j53
7570a64l3M13k94J61Nj75o2N8O8QK07k07O8j52K5q8J42N4M7j00O2j47j9J46L48
7595C71m76K5J57j0j93J48k9j39N37k46j48k27K35J77O5nj22l26J33r5M64l81
7617h5Q0J34j17p0lN6MJ53k49J74k77R3K26r8l7jn0J93k51L3J35J01j15j17J2
7642g6J11k26j25K87M7o1K8J29n0K6K9j95K38j40j90J94j88J87l6r7K59k53J20
7665A8j35K06On8n2JJ36j32l23K76R5P5N6j81O4q3M2J67k76J03n2P6k08J91J40
7690A52o2J17l19O7J93j01nj39K66j12j48R1j6n6K9j79J41J58m4N3K72k24l45
$$ y = [-53, -338, -100, -32, -197, -203, 250, -233, -25, -15, -71, -58, -11, 9, 39, -42, 150, -58, 254, 31, -91, 177, 29, 166, 43, 8, 25, 147, -165, -25, -85, -38, 266, 68, -70, -4, 226, -220, -168, -84, -77, 121, 75, -86, 290, -214, -72, -11, -164, -197, 216, -78, 83, 88, -87, -149, -91, -23, -15, 192, -15, 53, -99, -74, -162, -20, 34, 81, -19, 43, -104, -123, 23, 371, -105, -80, 77, 67, -126, 22, -7, -146, 391, 145, -3, -230, 5, 182, 247, 242, 120, -206, -73, -168, 296, -85, -5, 129, 12, -58, -61, -5, -1, 152, -97, 77, -200, -107, 119, 21, -16, -17, -67, 126, -125, -92, 43, 144, 29, -88, -76, 35, -191, -316, -29, 18, -43, -15, 114, 64, 90, 119, -76, 162, 22, -168, 26, -162, 25, -11, -108, 151, -102, 18, -117, 89, 95, 37, -15, -14, 122, -10, -333, -57, 38, 113, 169, -12, 52, -31, 11, 178, -98, 5, -47, 29, -179, 12, 152, 90, 207, -112, -45, 148, 47, 42, -97, 169, 57, -91, 0, -16, -72, -43, -222, -81, 77, 33, 86, 358, 134, -211]
7713b11K02j09J32j36L24j52r1M4N2J15j99Q4p9R2l2l74J60K85k43J60J78k73
7735g1J72j59K89l33K27Oj79J92j41Q6k35J5M5j0k2K36k1k9j17L12l42R9j17N3
7759d4q9K67k22K00l5j14R9l1j57K59j07j66J07Q3j02K39q1j99R9J24j15j5J21
7782A21p8K20k25j6J41J6m24K83m4L96k25k58q2j6L38k54K51k4j69j02m2R3J14
7805A4j07J22j31J74M3q9J1n7j99M80j88k88K30P0P6o9o0j56J08k9J03k54J0J87
7829Aq2r5P5J67n4j19K48l23lK07j3P8J40k88P1j4J55l87J77K1j57K73J06m73
7853b89K73O1l2J69k90l28L74J19K07m13j47L72k77J30J64n4L9p1M3m3Mj04P9
7876a4J07M8j51j23K2K96q0q1J5k62K69m04L67O3R9m14J63j54L85l12m9J40J94
$$ y = [-211, -9, -118, 14, -122, 202, 50, -41, 3, 55, 170, -29, 55, -24, 68, 36, -338, -178, 107, -136, 24, 202, -71, 101, -58, 231, -102, 125, 131, -48, 144, 3, 89, -146, -131, -86, -96, -118, 118, 97, 68, -49, 263, -79, 20, -97, -44, -133, 134, -88, 112, 77, -37, 62, 31, -126, 133, 26, -140, -33, 50, -52, 187, 106, -93, 6, 130, 15, 0, 121, 43, 263, 38, 22, 163, 179, -245, 38, -6, 390, 165, -93, -175, -191, 147, -107, 144, 120, -49, -151, -193, -100, 14, -93, 29, -102, 72, 115, 26, 37, -20, -219, 261, 73, -215, 15, 85, 161, 92, 32, -124, -16, -45, 58, -196, -186, 1, -81, -176, -101, 66, 12, -107, 141, -182, -185, 22, 9, 87, 227, -61, 10, -4, 151, -236, -59, -38, -195, 78, 184, -289, -16, 45, 13, 182, -108, -436, -62, 57, 264, -149, -296, 76, -201, -71, 93, 39, 78, 7, 50, 7, 11, -93, -14, 93, 141, -10, -133, -111, 185, 105, 24, 39, -223, 46, -358, 9, 72, 171, -243, -80, -234, 151, -161, -210, -70, 124]
7899A24p3k28L21k97K43n12M08K51k51L3m6l3K57k23q2N8K23j72K3l4K12l78L00
7922A24k04J18j15n4Q6r7R5o3q3K55K7j26J46k65J95o0j03k9Q8J97j47j62J22
7945e5O7Jj62K37k09p3K88l8j14K63l84R7J50l1o8j35J36J45j42J55q2j88J36
7968fN2k00L11Mn7j5p8K6J77j15k8j6j05R3K9k62k8K58j57R1K65j05k66J19q4
7993i7J03j30o0K72r2k37K70J85j64m4J50k28O1M2k48K82J19j56k3qR3l6Q0k83
8017a49L1K0l5kK01l08N55l97k16R7K25P7o4J97j92j6k90J46J74m6P4N0j13q3
8041f4J8n8N3k9Mq5K25k75J92J1o9K8l5j83%L33M0p1j39K54q5R1m0j89O3K54l07
8068f3J20K69p6k22m2k19K53k38K64p2O5N9J6q1j53J19OM6k37mP4K15J91k70J05
$$ y = [124, 51, -177, 144, -153, 90, -422, -14, 237, -14, 19, -27, -60, 197, -26, -108, -50, 173, 1, 24, -10, 202, -176, 124, -80, 38, -77, -131, -45, -142, -47, -110, -193, 62, 89, -37, 109, -156, 39, -21, -124, -153, -65, 132, -15, -177, -55, 12, 13, -149, 88, -121, -194, 94, 56, -58, 205, -179, -82, 68, 37, -31, -166, -30, 115, -27, 128, 46, -142, -6, 46, -154, 157, 161, 104, 89, 11, 37, 214, 99, 71, 55, -50, 43, 72, -190, -218, 40, -117, -26, 239, 134, -132, -13, -97, 6, -124, -184, 88, -4, -241, 29, 214, 50, 6, 156, -72, -11, 31, -217, 65, 184, 28, 5, -3, 90, 54, 134, -149, -118, -98, -133, -135, 66, -242, 313, -84, -300, -203, 22, 99, 35, 232, 40, 24, -266, -120, 54, 8, 82, 132, 19, -64, -46, -104, -51, -80, -76, -161, 64, -211, -19, -8, -77, -49, -84, -267, -267, 66, 106, 35, -104, 150, 65, 156, 116, -73, -10, 244, -63, 57, 326, 250, 28, -14, -233, 20, -218, 46, -26, 39, 98, 114, 33, -120, -1, 5, 51, -186, -190, -116, 99, 290, 20, 125]
8093A25l65M58k58K30k89J1q5K01k4n0J12j98O0p3j57O1J57o9K11j19Q1jk67K60
8117A2Q2q2j6n3j73J14L1K31J9k38K36m51O34n56M46j70K2k6k15Q2J40j10N8L4
8141E1j22Q6K13j22m3j69J53j58o5L45l13J6l5J79o2m0K1p7J49r8j01J23jK02
8165A32k46J31o1mJ11k41K22n6J61k45L46p7m1j05K45m20K5L07jj79l1J45j91
8188g3j74J71J13
$$ y = [125, -240, 218, -40, 190, -99, -88, -173, 28, 4, -46, 66, -132, -72, -145, -302, -241, -84, -153, 58, -61, 20, 19, -248, 12, 94, 12, -4, -57, -230, -116, -85, 146, 165, -73, 163, -288, 346, -210, 236, 66, 88, 62, -153, -71, 69, -41, 17, 51, -71, 15, 228, 106, 63, -106, 47, -111, -176, 169, -144, -128, -163, 16, -46, -86, -65, -142, 7, -91, -192, -69, -70, 132, -114, 17, -44, -48, 63, -178, 44, -12, 149, -96, 250, 173, 132, 27, 272, -148, -123, 184, 183, 4, -27, 118, -73, -247, -76, 37]
8191C7
$$ Imaginary data points
##PAGE= N=2
##DATA TABLE= (X++(I..I)), XYDATA
0@%%%%%%%%%%%%%qJ6j6J6k4L2l2M0m9N7p2Q7j00J15j33J52j74K00k29K61k96L34
35A77l75M21m74N30n89O57p32Q14r03R98j103J219j345J481j631J796j981K185
53A145k408K661k944L264l633M059m561N159n886O800p984R588j1897J5534k2180
68a3283L8267j48778j94144L46223K41073k49301j47526K39002O4650o4093j02400
79I690L3224l8290n8830J06068p2278j04467P1495J32361M1966j83837K3383J20760
91H1245o5833m9606l6184m573j5558J3575Q5864o8702l0400J25835P7202o0702
103E2163p2025Q1789M4163o4999k6170J12k022k0533L7004q746r1300M4838O1957
116C6231l7644m6586K4430O9851o5144m1158Q8419j7039q6877J1957R8967k0259
$$ y = [0, 0, 0, 0, 0, 0, 0, 0, 0, 0, 0, 0, 0, 0, -8, 8, -8, 8, -16, 16, -16, 24, -25, 32, -40, 47, -53, 62, -71, 81, -93, 107, -122, 139, -157, 177, -198, 223, -251, 279, -310, 347, -385, 429, -474, 524, -579, 640, -705, 776, -855, 941, -1040, 1145, -1263, 1398, -1546, 1718, -1915, 2144, -2417, 2742, -3144, 3656, -4328, 5260, -6637, 8897, -13283, 24984, -123794, -317938, 28285, 269358, 20057, -127469, 111533, 176183, 112090, 9690, 42914, 4624, -54206, 51862, -20416, -124883, -53388, 78973, 120939, -62898, -39515, 81245, 15412, -34194, -70378, -74951, -90509, -76934, 8930, -59772, -90172, 35663, 112865, 52163, -19862, 61927, 106090, 41091, 14921, 15033, 13011, -7522, 29482, 20736, -70564, -25726, 36231, -1413, -47999, -23569, 46282, -18862, -60020, 28399, 11360, -75517, -63560, 35407, 15148]
128A5148j37387N3975J60492k9180j15137M5910J24490k3112q7097j120L4161
139D1143j4639l2514n113l4333k275N9806p211m6747M783O4359J9477p6584n921
152c5769N1341j7895k9661L152J6747o018m417L4552j071k3547L5013L6505k5692
165C3240k6084K2397J4364k9722k3765J3837k959k8828J1204K533k6188K0422
177a9549L2977j3265l1515K3838N4062l9142n6496M2810M0911l8367m5699K9609
189a9826N2641k3951l0466L3136K4066j0843l694L94r542p273M673n416k8915
202b5016J191K7604j6262k1147J9628J7236m431q517J5171R674k5583L368K5439
215A8355j4989k0329Q668K0269n281k1184J2748J9711r103j052O885n728k305
$$ y = [15148, -122239, -68264, 92228, 63048, -52089, -6179, 118311, 95199, 8102, 6982, 41143, 26504, -6010, -11123, -45456, -47731, 12075, 4864, -41883, -37100, 27259, 46736, -29848, -35769, 15572, -2323, -31984, -28832, -12085, -18103, -22520, 12032, 10961, -12586, 22427, 58932, 33240, 7156, 29553, 43917, 14195, -9570, 4267, 1308, -27520, -16316, -13783, -39971, -19549, 13428, 163, -31352, -7514, 46548, 7406, -49090, -6280, 34631, -3736, -49435, -19826, 32815, 8864, -21602, 11534, 35600, 24757, 21063, 21457, 11915, 4642, 9315, 3899, -25016, -23825, 3779, -12483, -33630, -14002, 3234, -1197, -9714, 5457, 15131, -10452, -7084, 18355, 3366, -16963, -8295, 11974, 6693, -14491, -1743, 17968, 8865, 7813, 14698, 8970, 6665]
228F665K068k972j4027q502J6238K76k3405O906J6301n177k915R997J0943j1052
242A344q350K1353k080k4611N789J7585k105j7891l454K1467J608j2838M687K360
256D864K06M244o736q758j510Q566M271j8482l938K1246j539j2854L297J1517
270D394N275j0243J197R529j0125l412R706k913o500r34O212K061j0650K788R491
285E876n168m76K781m572m86J099K125l907o058J0316M810j3352N43R907K263
300E701m607m221Q482J417r739L243K939m777J910N69o22k466k927P074j846n516
316e386O273J220l536J111p52J384j234K89O292n645m173P571k64m520o10L285
332A305M543o319l675O509j947j745K208j728J058r07j260J326l794K293M537
$$ y = [6665, 8733, 5761, -8266, -16768, -530, -254, -23659, -16753, -452, -5629, -8544, 1453, 12396, 1344, -7006, 14347, 12267, -12344, -6555, 11030, 8925, -8966, -12420, 9047, 10655, -2183, 2504, 4864, 5070, 9314, 2578, -6180, -7690, 876, 5147, -13335, -17273, 3973, 2434, -10420, -7123, 4394, 9669, -574, 623, 10152, 27, -3385, 6321, 3408, -3092, -4026, 2186, 4247, -6403, -3615, 5876, 708, 232, 3013, -1559, -2045, -946, 1179, -2728, -8786, 1530, 6340, -7012, -6469, 3438, 5701, 1094, -3127, 5355, 6772, -2967, 276, 3215, -1562, 348, 917, 295, -2171, -5098, 1976, 130, -5386, 887, 2107, -1429, -318, -1070, 314, -920, -631, 5661, 16, -4157, 3414, 3150, -1370, -1980, 1305, 5848, -471, -4146, 2363, 416, -1329, 879, -849, 209, -698, -1958, -632, -4426, -2133, 2404]
347B404m537K70L275r99N63j880K949L113n376J479K451m617J1J93N49J278l596
364b470J934Q06l753L304J027j922K199j212m83L73k741L309q43k496M491k76
380A247j895J044J77L483p99l917L897q4l182J2l183J340K120k193N31j833N68
397b667N008k778j127K757M53J294k767l249K719K00R31m5m530L728L773k319
413A381j234j011L791L279o050k488J438M47O18l711j280L818o2J290q95k898
429c567M992L045k982q28o46J639L04l943J420P67j492J945J11j31k20j584M148
446B978J413m848r65M83J187k95n103J153L675J97l2k409K90N320L60j174j254
463I76j608M517J7n002k209P20N982P41q601n96P376K206l371n124K398N819k494
$$ y = [2404, -2133, -1863, 1412, 413, 976, -904, 2045, 5158, -218, 1261, 3712, -905, -894, -701, -152, 1126, -2470, -536, 270, -3483, -179, 848, -1074, 1125, -87, -570, -197, -2938, 371, -472, -2968, 1523, 1247, -648, 396, 573, 4056, 3257, -660, 3237, 3153, -29, -17, -3200, -1860, 260, -1933, -1402, -3235, -2667, 2341, -437, -1564, 1193, 1646, 2940, 173, -3076, -357, -157, 774, 729, -3801, -73, 3700, 1381, 147, -864, 2927, 6206, 156, -2332, -894, -447, 171, -3540, -4820, -1002, -1064, 226, -669, -3567, 1425, 4470, 1488, 660, 14, 1653, 1957, -1986, -566, 201, -1291, 654, 765, 634, 414, -1170, 2978, 4391, -457, -1422, -939, 248, -47, -5150, -3997, -322, -125, -157, -2566, -2276, 3044, 3404, 2230, 976, -632, 3885, 3902, -1100, -3309, -2589, 3393, 4134, -4467, -5063, 2313, 4519, 1148, -3976, -1578, 4241, 1747]
480A747m321j939R97M499p57k886Q8P21N406R19o759R54O618J085m958m790L971
497E95L420m995j324R80P11J018j912J376J263l210J644K739j978k044j738K482
513i73J995l589J1K604K97J219q05m49J563K11J835l47m849j72K947P71k921n819
531f471M080P303m302n840J601N675J977n556j797K850R14O32k032l429L363L389
547B357K27k271l614M717N679m550m777J853M964q53p329J09M816j133j693j012
563b510R29K065j567K02J809k195L69K295o97r89k333J598K989k263m15K201l86
580A102J72p62J170J608l413lK103j360j658j610J469L167l695k541L573K035
596A357q44k377K53L225o80o82k84k165K344K307k514j458P79K961J507m736o58
$$ y = [1747, -2574, -4513, -3516, 983, 226, -2660, -2572, -1851, 3555, 4474, -2285, -1331, 5287, 6372, 1414, -3376, 595, 4015, -980, -2304, -1324, -613, 405, -1507, -131, 1132, -2078, -434, 2305, 327, -1717, -3455, -973, 1022, -2567, -2556, 48, 345, 1564, 759, 310, 1873, 2084, 3919, 3572, -1277, -1449, 1498, 2269, -652, -6471, -2391, 4912, 610, -5230, -3629, 2046, 4023, -1533, -3330, -480, 434, 1066, -966, -4395, -1032, 2357, 2584, 313, -3301, 1416, 7095, 2545, -2232, -379, 4585, 3732, -3597, -3488, 1328, 195, -1498, -2510, -1581, 484, -1083, -881, 928, -1267, -898, 1397, 700, -289, -2622, -1024, 1965, -298, -713, 1488, 1102, 1274, 512, 1682, 3290, -123, -126, 1977, 617, -1041, -2651, -1182, 1985, -1710, -4251, -678, 1357, 513, -1864, -1611, 1614, 934, 252, -32, -2197, 147, 2454, -60, -1518, -739, 2222, 3729, -1007, -1665]
613a665L743J031k276k677J089K724k745r29J186o37R87l32q13R32l06K70J560
630A142j397L20L19o05J445j738o24K176j73l80l62J81P93r16l29J753j407r13
648g15P23k86R59j671q40K312nj229l03J09J493j27r85Q82p28J208O99k814L22
667i96K087L28r15j712L02K661j138j191m2R51J617j813j542J678k81NO13j565
685i53O93K64q01Q14r48J95J251o97M93m41n38J587m35j039P95k35L61k72j380
704a286J294N76m92Q08j069N77O35r67J41K58n73N59q41Q0J74q52N76L66o80Q71
724A55p28L34P77j284P20N41n12M45q25m73J280m37J32K55l20J328o04j102J127
743H09j20j40O8j393R04k79j186O98l45M19L59n08M67L43l85O25j05j37N32j152
$$ y = [-1665, 2078, 3109, 833, -1844, -755, 1969, -776, -1705, -519, -1156, -169, -501, -1314, -382, -688, -418, 1142, -255, 65, 384, -221, 1224, -514, -1138, 1038, 865, 485, 123, 304, 1097, 181, -148, 1605, 198, -715, 8, -278, 681, -990, -1830, 482, 477, -752, -1055, -946, 547, 420, -565, 317, -411, 797, 1496, -1318, -996, 1091, 1419, 504, -1208, -906, 1755, 617, -574, -616, 335, 1952, 139, -1403, 275, -6, -1, 612, -953, -260, 4, -797, 17, -931, -736, 515, -182, 311, -130, -668, 919, 484, -555, 240, 5, 366, 94, -1286, 8, 584, 92, 900, -169, 408, 1043, 76, 217, 475, -98, 461, -380, -300, -126, -978, -402, -36, -716, 155, -573, -239, 538, -746, -26, 515, 3, 448, -377, -850, 430, -7, 125, 380, 60, 1388, 784, -318, 809, 689, 549, 617, -776, 128, -151, -1337, -639, -984, -565, -206, -714, -247, 96, -289, 336, 231, 94, 626, -526]
763e26N03K65q17Q51J07L03N31j006N26O22j070K86m95l10N38j129n28M49n20
782a420O44L31l81J012j88MO73j077R78O3n96M23p13r0Q98n92N47L80k18O13n05
803G86p35N41nj46n45j377M26K61o98L12N8P01Q32q52N65M87n00N52n22j08P08
824G41q55J29j12j45J218l40l69Q46n68K31j81o27L07n02n07J68r10K9O60l69
844a156Q27K15j50R72l59p2O85m52O2N7p19K04l03JP04l80L10N09r46N60m47j29
866gN85q49k34jq12L85J13k96J031p1M71K91p84O54L86j92J49p52j85O47q70K86
888e5q2k34P02J63o00L21J28j57j5o13N02l93m96K59o93M61Q03p5K93R1k50R32
910I92m97o38L96j23M68l25q64M94m5p1M34k96L26J01m14M15m56m54J032k59n36
$$ y = [-526, -23, 242, -575, 276, 383, 686, 1217, 211, 737, 1359, 289, 575, 80, -230, 308, -821, -1349, -900, -1420, -776, -445, -826, 186, -2, 2, 675, -402, 576, 639, 43, 466, -247, -337, 561, -31, 516, 896, 678, 1291, 786, 51, 592, 587, 441, -104, -1481, -1055, -794, -1492, -1180, -1122, -421, 411, -441, 124, 611, 111, 663, 141, 33, 741, -114, 15, -97, -242, 976, 636, 267, 1113, 545, 776, 595, -32, 275, -227, -734, -566, -1476, -1447, -787, -1156, -329, -114, -264, 708, 349, 277, 962, 510, 572, 629, -90, 114, -189, -188, 516, 136, 446, 955, 9, 569, 122, -7, 578, -271, -505, -506, -1318, -933, -820, -1116, -85, -156, 315, 606, -178, 476, 862, 670, 819, 67, -118, 529, -341, -55, -137, -371, 331, 494, -106, 215, 343, 186, 171, -442, 60, -333, -829, -570, -1263, -802, 1, -74, 219, 310, 60, 992, 495, -143, 253, 130, 598, 273, -591, -97, -142, -213, 221, -75, 251, 352, -62, 353, -103, -557, 475, 216, -320]
931c20rm17L71Q12p14L12k81K71M12p55J67K02J3M93o06o21Q37k72J29Q7o56R64
953D19L69p68l3j29P30j24q67N96K63p30M20q39L09O36m39K89j35o31N78J15n9
974c0O2j15M99k07n42L63K88m71N68m33K11m3m63N00J40k95M24m03Q1K62r16K71
996b49J52K21k35q12N39M67q18M25J29j19J086K5o42q2k18O82M56j033k00M31
1016B05J69j45n15N44P81j136M6J73k79m9k81k55R3m42N54jl21M33L77M48Rl64
1038D4N55M34q39N14l08k19p4l27O3K33n75Q71O2k55P2m16k45K77j95l84J0k75
1060i77M81o60K23R46p7L01O64m51L42L1r5J73q96J67O03p66m17j38L12N51p24
1081d07M73N63p12j17L45o90J38l27K89j12m92O71L35k25P35K47M13L11q47K70
$$ y = [-320, -329, -746, -375, 437, -277, 35, -246, 25, 437, -318, -151, 51, 64, 557, -49, -670, 167, -105, 24, 111, -545, 419, 788, 20, -13, -142, 588, 464, -403, 193, 456, -274, 146, -693, -384, 252, -187, 102, -33, -664, -86, 29, -30, 32, -83, 416, 209, -333, 30, 318, -153, 415, -18, 193, 150, -313, 187, 327, 32, 456, 53, 134, 396, -520, -249, -97, 124, -111, -923, -384, 83, -735, -310, -181, -300, 786, 811, 169, 87, -131, 551, 1007, -26, -226, 205, 374, 229, -286, 258, 1039, -97, -51, 122, -157, -206, -487, -742, -649, -1091, -537, -538, -859, -426, -49, 399, 408, 44, 599, 1033, 194, 708, 400, 181, 107, -220, -157, 76, -499, 372, 434, 179, 251, -165, -410, -133, -328, -712, -702, -977, -496, -1156, -933, 13, -64, 237, 901, 450, 792, 823, 728, 901, 5, 172, 775, 9, -408, -546, -234, 317, -407, 66, 629, -83, -200, 145, -545, -407, -734, -445, -557, -1049, -378, -43, -268, 467, 714, 1127, 1438, 591, 861]
1101H61K4o77J69l75o35M13m68r8K16j01O06J13J8K49l05l49M1k69L88n17o7M87
1123b76j29K07R49K20j12N11k11j00k42k56m8j055j03J87l27j23j28j91J434n52
1143c45K52M22m89J87k1j74j10l38M17K99o38O92N32o2K36R5L6J94n94j27k78
1164A86q51K06l23j76r3p0J83M72kP08L69n73L86j49j64N7l06J56j58j1N80l26
1186A01O1O78J99j15Ll78N7q21m97K73q86J98K26n31M87L57J94O79J82Q4M83n46
1208D88j81J64k92J17l83K11o7n6J82N10k28K09k12J51K1j249J77l49k30rj52
1229a178k37O62N5O89jJ29O27L09m15j8j86k4p4n23K50J36l06K57O2M1M42j47
1251E50n0o60j21M6o14k77L21l02J87L92M0N16L50K63M29k58kL37n58k59j05q1
$$ y = [861, 885, 208, 377, 2, -633, -220, -688, -786, -570, -671, -65, 48, 66, 315, 10, -339, -298, -567, -179, -696, -763, -276, -405, -198, 751, 971, 859, 1370, 1159, 1059, 817, 561, 513, -542, -645, -458, -785, -908, -1036, -1227, 207, -345, -93, 329, -160, 27, 6, -168, -278, -616, -199, 100, -538, 154, 686, 624, 860, 955, 991, 1185, 591, 464, 186, -665, -459, -782, -958, -1051, -1121, -938, -466, -468, 240, 609, 36, 422, 273, 109, 166, -140, 16, -142, -153, 427, 101, 162, 840, 1039, 924, 927, 549, 606, -215, -712, -439, -1325, -1127, -901, -1432, -945, -588, -394, 285, 467, 551, 1034, 488, 307, 471, 179, 296, -87, 124, 57, 1, 183, 693, 465, 674, 462, 613, 634, -615, -438, -787, -1017, -1026, -1178, -1415, -753, -698, -9, -10, 119, 746, 1055, 640, 622, 436, 412, 338, -185, 65, 201, -105, 152, 214, 255, 697, 550, 500, -160, -281, -235, -849, -1126, -805, -1107, -920, -528, -488, 28, 378, 641, 1070, 812, 810, 1147, 589, 330, 225, 144]
1273A44J86m96j48L29l57N6L08L21j60m13J58k59m15r6J84j65J78R9K08K81K72
1294B15K60K68j17K94J48n49R3m42j05j10l14L75k45o1M81l56J00K54q9k83N9
1315a24n23R2j79l0L82K22P1j3L73M63j80p4N24m04j07j7m25J72l53j92K73m18
1337d67J32J57n4L16L9j62j58l9k7J93m92J94J68l0L00j9J68M18k85N29k16j22
1359E43J29k76n68J77k56q5K15l41p7K34k04M75K9r0L20l69l8J23M9l2o8krM6
1383g5M07m7K7J21Q2l38J08k42q3L5k15J17k74j3J03K9k1M06l62K25J20l94K23
1406f1P8l25L75k50J39m1K0N51l79j36P21m01J41Q6n94K63k87k4j67R2MK31j92
1429a56J60j85L4K45n1j16L92k87R6K7l91L39j47k7J64j06J12m1m5K8J78l85M64
$$ y = [144, 330, -166, -314, 15, -342, -286, 22, 343, 183, -230, -72, -331, -746, -842, -658, -823, -645, -546, -338, -57, 215, 475, 743, 626, 920, 1068, 519, 612, 170, 65, -45, -359, 16, -229, -290, 191, -165, -65, 189, 100, -183, -124, -647, -555, -734, -764, -382, -160, -89, -102, 271, 734, 554, 480, 1004, 600, 493, 476, 51, 223, -130, -322, -49, -467, -335, -178, -232, 84, 123, -39, -197, -236, -263, -70, -562, -368, -200, -230, 70, 51, 219, 637, 352, 881, 665, 543, 672, 396, -172, 5, -251, -336, -121, -462, -539, -305, -509, -34, -5, -95, 225, -144, -182, -59, -10, -42, -110, -112, -121, -75, 332, 285, 312, 433, 515, 177, 285, 43, -40, -5, -220, -103, -377, -390, -287, -258, -279, 127, -235, -10, 110, -284, -61, 17, -308, 67, -183, -44, -85, -65, 486, 107, -29, 692, 291, 432, 518, -76, 187, -100, -124, -291, -199, -195, 36, -156, 4, -181, -147, 98, 47, -69, 323, 36, 132, 159, -232, 107, -40, -67, 97, -9, 103, 62, 17, 45, 223, -162, 302]
1452C02m79j00L94l33M68k61k8M7j62R5J65l09K02J47l59K11k70J14L87k82K45
1473A94K3m89J93O4j46J56j49Q5L36l56Q0K27j06P0l84K01k1j56J21l7r7K03O1
1496G3j30P4j04P4R9m50N28l37J4K18j16n1Q0j46M47k41l19N12j73P6j22k2K46
1519B30m77QL23l75L12n9P3k57L25j19j5j18L70k92o8O9P4r1p7J79o1L32j99K1
1543A08L4oM7M7J91k19j91Q8l8j97j4O0q7K19k53J67l5j08M0K85j55jK80k30M3
1568G5m37M21R9j72L13j56LJ75k48J9K73j20j53N9m77M72l99R4P1k52L43j98Q7
1591a08n4J97o2J56RP1k43rK36j01PJ08k56nM71l7j22j59j57OQ2K7k42j93rM17
1617C0m49L46j7k28L00O0j81M81k87l5jl01J03J38L32m7k87J5J3l4J29J0p4M5
$$ y = [302, -177, -277, 117, -216, 252, -9, -37, 10, -152, -57, 108, -201, 1, 148, -211, 0, -270, -156, 231, -51, 194, 217, -272, -79, -15, -161, -5, -154, -69, 267, -89, -9, 218, 112, 182, -202, -1, -22, -178, -57, -94, -191, 12, 73, -57, 17, -87, -13, 86, -364, 164, -173, -159, 59, -57, -108, -28, -174, 273, 32, -287, 225, 52, 128, 6, -16, 230, -247, -239, 84, -291, 21, -38, 35, -222, 103, -16, -31, -149, 221, -71, -139, -70, 4, -87, -164, 15, -46, 286, 87, 108, 142, 136, 183, 230, 421, 202, 11, 99, 61, -136, -150, -90, -177, 42, -211, -44, -79, -187, -147, 138, -17, -18, 262, 32, 75, -362, 59, 158, -14, 299, 143, 146, 321, 73, 92, 365, 245, 92, 151, -326, 146, -253, -159, -88, -340, 3, -195, -108, -162, 35, -27, 129, 138, 209, -34, -43, 193, 92, 99, 207, -49, -54, 417, 380, 258, 99, -58, -52, 30, 57, -185, -378, -387, 30, -419, -73, -90, -318, -18, 42, -139, 342, 55, 20, 19, -282, -179, -41, 291, 244, -43, -28, -15, -49, 80, 90, 16, 61]
1641F1r2n6j53Q3n2p9K46J29n8JJ38j90j50L47j95J16k54O8p4N1l3M0J88j42L29
1666B69m34J39NK36q8k63M3K11n60M52j39N1M64l60J87k1j68L37o9k28J67k65
1688c4J69k75j98K62j35R8J17j55J09K62l20K34k46J82K1k03J0N7o8J78K1P8p8
1711H6J92l77K81m6Nq2O3R2j31lj19m8O1Rj16L64j66l9j53R5L0q1j09p4J73K4
1737f9o3q2pJ6P1L97l57J53J64k16k7p4J75Lj06J8q9J69k13J86K25n39P7J54J00
1762F6Q2Rn8j70P1J32p0k0J43l56L18j29j99K92k55J15k25L31k5k4k47K78k97
1785b38M11j50M5Rj88L4K81l81L83q4r0r8q5m4J44k7P2m4j04N7J5K21j31O4j97
1810a25P2j15j06M92j67l42J25N9l9J27K3l6j25J95j19RK07l3k27k42N71o4q6
$$ y = [61, -31, -87, -240, -157, -209, -288, -42, 87, 29, 30, 168, -22, -172, 175, -20, 96, -158, -90, -164, -113, -146, -106, 82, -60, 269, -165, -26, -21, 215, 127, -136, -93, 118, -442, 10, -129, -78, 386, 26, 213, 192, 24, 361, 292, 64, 231, -34, 135, -140, -338, -76, -211, -113, 4, -151, -42, 220, -100, 134, -112, 70, 91, -112, -102, -45, -113, 65, 86, 164, 86, 278, -99, 182, 136, 141, 59, 122, 214, 83, 80, -39, -87, -26, -17, -133, 231, 65, 26, -127, -32, -2, -83, -192, -266, -93, -69, -132, -214, -221, -205, -134, 263, -94, 59, 223, 7, -20, -94, 81, 84, -22, -4, -93, 76, -137, 49, 274, -265, -188, -34, 66, 148, 157, 99, -71, 0, 132, 62, 42, 185, -171, 147, 18, -181, 111, -144, -29, -254, 77, 52, 28, -219, 59, -238, 173, 23, 68, 77, -111, -77, 204, -177, 206, 122, 32, -66, -151, -195, -51, -78, -6, -50, -154, -97, -82, 139, 8, 72, -125, -53, -168, -274, 218, 51, -291, -166, -107, -146, -19, 4, -32, -157, 38, -81, -72, 135, 102, -125, -367, 204, 140, 54]
1833E4j15L92n18L67J47m55J64r0J03p8o7J10K3j34J42J44k84L12k55J93j06q8
1855c9J23j91J90j54J0pJ8j64K4P9J82l12J39J51k82J41J72J12o5j63K38k28J71
1878A45m2k06J17p6P1p9J59j9O6k6J39n7J01l10K63m29J35N3l8L5j29J76%O0J03
1903B12o8k05J13j66P4J47J05l71P3J69q1lm9J25l3j26L35l66J14J79j34j23j39
1926b18M3j06M97l04p2m6J91L31l53O7rl7R0j62J96l45L20k70L55j36j83J06m5
1949i0Q5k18K16J2J41l15K94j74j22M34l19O2l6l3K41%j87r2Q8L9p3J60j63j69
1973b19r0L26J04J29j9j6j25Lm6J5L7L8K5m4k48Q9m9P8J90j95J86j38L3R2l01
1998a45J39J41m31J58K84j27r1K45j94O9j8K00l33J11j7R2j74M48k86Q7k68L07
$$ y = [54, -61, 331, -187, 180, 327, -128, 36, -54, 49, -29, -96, 14, 37, -97, 45, 189, -95, 217, -38, 155, 49, -39, 84, -107, 83, -71, -61, -68, -50, -214, -190, -111, 71, -241, -102, 49, -233, -92, 80, 192, 127, -36, 202, -26, 145, 103, -103, 14, -62, 9, -70, 89, 70, 136, 110, 249, 192, 293, -17, 246, -183, -48, 5, -33, 2, -127, 49, 49, 109, 212, 144, -61, 52, -114, -40, 107, 212, -159, -86, 83, 2, -1, -50, 75, 42, -84, 251, -115, -1, 178, 44, -79, -218, -175, -281, 216, -88, -160, -206, -15, 316, -37, 30, 21, -16, 74, -88, 108, -237, 83, -187, 168, 32, -151, -45, -90, -5, -223, -7, 5, 146, -169, 125, -49, -171, 263, -56, 6, -30, -63, 178, 178, -9, -101, -13, 26, -47, 113, -50, -219, -309, 17, 121, 250, 231, 215, 90, 93, 47, 62, 99, 137, 162, 118, -130, -41, -90, -12, 178, -17, 169, 31, 64, 156, -145, -6, 135, -296, -138, 146, 19, -72, 173, -21, 48, 30, 230, -103, 8, -9, 83, -91, 357, 71, 158, -110, 197]
2020A97Jl37Q8R0L0k4l2k75K97j45J02j32J77j2R4q9p3K03k60K6K54o6n7j77Q8
2045c2L31k64M8m9k46J96n2K73j50k17J59K17m61K30Mk29J9NK76J57l67J60j25
2068a17K18N8k40J24j4k3J5k3M7Nj17Q3k22Q8j00Q1M34j69l8M4j54j35L66m59
2092b48M76o0m2j30q6J14o2PM4M5m4QN5n1j7q6N1R4o5k27K95l37j06L93q0r1J55
2119Ej03J32j37k7K17j8m7n7J14lJ74k22j00J84n2j77J7M02j21q2j7N4l4J04k92
2144h6Q6R5O9j73q1J5n4J97m5J78j29j32K0k3m3j47K21O3O8k34k31L15K72k79
2168e8R8q6P3m8M3m1j05K8J52o7N6N6k01J67j95J21m6L43j52k71J47lm2L25m07
2193a13J6R2r0J93m75K94o5J00K3l8P5p4J31J35j09j36j95K39L02l93J08L6q8
$$ y = [197, 198, -139, -51, 39, 69, 45, 13, -262, 35, -110, -8, -140, 37, 25, 119, 30, -43, 160, -100, -74, 180, 114, 57, -120, -32, 299, 35, 83, 34, -212, -16, -68, 205, 55, -162, -3, 214, -247, -17, -13, -242, -223, -218, 58, 215, -152, 8, -117, 101, 159, -81, 43, 29, 6, 21, -2, 45, 50, -67, 16, -206, -118, -218, -137, 297, 128, 90, 134, -20, -155, 211, -248, 228, 168, 126, -4, -90, 24, -38, -31, 13, 58, 14, 22, 77, 26, 9, -77, -26, 68, 3, -224, 71, -266, -372, 21, -59, -150, 5, -98, 34, -103, -130, 87, 69, 22, -35, 79, 76, 250, 28, -72, 112, 60, -117, -100, 302, 181, 99, 82, 136, 102, 206, -86, 0, 95, 164, -9, -90, -75, -129, 68, 23, 201, 72, -60, -40, -63, -106, -253, -32, 31, 99, -135, -366, -51, 221, -58, 40, -46, 27, -21, 22, -19, -124, -96, 56, -11, 45, 101, -100, 67, -128, -7, -53, 290, 138, -133, 14, 11, -31, 294, -113, -97, -5, -95, 98, -377, -83, -148, -48, -25, -63, 12, -62, 69, 204, 95, -41, -236, 3, 305, -88, 20, 56, -32]
2216c2J97k20k65L22L0K26k96K07n1pK62m2p8k59P7k1k47L15Q1l86J80K4j36p1
2240a90M6J0K71k06NL8o6L3j28L75m26N2N9J97K3l7k45J31K0j23K00n0r1l2J57
2265B3j04N6L5l8J93j13P4n9j24N4R3j95J14p6k51J74p6R8k00N28k47J30q9j50
2289a50J64J35j06j36K34r0o9j20l01L27M5j66K02Mk24J57k5K09j90L5J62j42
2311d5o3L63j23k83J10L5M8J5Q6n5nk14O3j89J52J93k29j40K07O4j10K50O4j82
2335A2j30N1J20k26N2q3L89l79N0J20K04rq2j1N8k14P9r7L14k5j92j78jJ13P5
2360A0n7kJ1j10K70p6J7j60pJ5j37K92k20J40n9K0P3J7L6k17J78J87l87nK73k36
2386a34K33j60N4P6j01L8L2N2j18J12P6l46M8k85O05j71k04K36j2j3P7J46j38
$$ y = [-32, 165, -55, -320, 2, 32, 258, -38, 169, 118, 111, 373, 331, 253, -6, 71, 50, -197, 118, 199, -187, -7, 17, -119, -190, -144, -134, 137, -69, -64, -26, -92, -59, -187, 188, -238, -186, -127, 70, 93, 56, -189, -58, -38, -161, 39, -11, -102, -134, 23, -81, -25, 10, -28, 165, 52, 126, 67, -57, -3, 90, -105, 9, -67, -318, -144, -220, -122, -322, 206, -41, 89, 0, -150, 14, 149, 43, -93, 141, 51, -18, -138, -439, -112, -67, -233, -31, -27, -251, -94, -119, 90, -100, -65, 97, -45, -108, 255, 132, -151, -41, -6, 42, 57, 143, 88, 83, -131, -68, -257, -105, 88, -141, -281, -74, -10, -120, 130, 194, 12, -118, -67, 53, -173, -121, -204, 185, -194, -144, -24, 180, 171, 89, 78, 136, -78, 1, -96, 218, 193, 1, -177, -178, -65, 10, -47, -49, -38, -148, 122, 46, 63, -97, -104, -89, -226, 66, -154, -14, -73, -53, 20, 37, 73, -144, 34, 221, -166, -171, 102, -134, 99, -61, -7, 69, -32, 6, 38, 90, -28, 84, 160, -186, -138, -423, 182, 11, -193, 43, 31, 18, 95, 241, 103]
2409A03q5L1N7R7k37l9J96n9j38j72J3J52M31m33J20O8K3J6J64m11L51r8k23j31
2433b04L65k41J61j29J05Q9k31K20J3M5O3l32o0R1o7j29L03j23j44K13R0N7P1
2456B26J22l87j50K06j72Q9J98j93j02R3N6K25k77N8k1J75k06J20k8r9o4L7L00
2479B06j18Q8k45P1p6J17m7K9K78l47j2j6J58j62K50j07J43j55k39J58O3Q7l43
2502b19K07J72j34k33J34RL49m11J95l4r2J78j28K96l98k2m2L30K5j07k74k0J43
2525g6J58O8m1J04k20j19J14n3Ok45L03o8J28j47j29J85j37R6k3L03j68j2r4J28
2549F1j32J18m0O0q2K9Q9k07M2j30J99n4n1oJ49K9j15m0q2J10o4J65l4o3R5j22
2575g6J37n2MR0p1q1K45m96K81j13N4J02r6J89Nm12L67mm1l0m1K52l40K35l42
$$ y = [103, 18, 49, 106, 203, -34, -73, 123, 64, -74, -246, -233, -81, 350, -83, 37, 105, 128, 144, 308, -103, 248, 150, -73, -204, 161, -80, 81, -48, 57, 146, -85, 135, 148, 193, 256, -76, -136, -45, -112, -241, 62, -61, -205, 8, 98, 155, 226, 348, -39, -189, 17, -155, -66, 132, -61, -163, -70, -14, 211, -66, -8, -29, 146, -60, 60, 32, -67, -131, -94, 206, 88, 176, -69, 2, -74, 43, -4, 25, 303, -44, -56, -72, 86, -76, 174, 67, 210, 55, -184, -26, 37, 124, -219, -12, 160, 26, -207, -73, -64, 285, -126, 69, 35, -57, 121, -7, 289, -109, -131, -173, 157, 182, 75, -199, -219, -76, 82, 150, 109, 213, -7, -126, -12, -65, -59, -304, -1, -69, 59, -88, -217, -32, -169, -73, -96, 207, 39, 27, -67, 61, -71, 47, 7, 67, -15, 14, 103, -104, -62, -192, 7, -47, -98, -104, 45, 74, -41, -81, -163, -53, -117, 48, 14, -49, 46, -76, 61, 9, 13, 103, 32, -49, 196, -300, -19, -132, -78, 24, -72, 117, 122, -290, 77, 73, 32, 2, -39, 213, -127, 108, -234]
2600b34J51Nj56L01M3m89N56m2n1j62K2oL6L0P7k37J41l9J63j06j55K08M6r1N1
2625F2j10J79k03j95L18j15j5P1r0J84P1J09o4l36J41J54N8l56K31n9J01k81N0
2648i5n9j84J66j76M30j44K1M2m8j91K8K75k38j28K34L06l38J01N0K3Lj53K25
2671A50k17n5K01k1q7J04O6k01lO2ML4M7N1q3j3K51l45J52j54J13K04j10k48r3
2696a91L51J9k44N8J35l31J20N1j06J57j91K06N3l9j26K18k35J57k19R2J77k27
2718a15J82J2o0j73J62l4Lj8L2J32p9J12k70J59K7J58j00j81RJ60p5K69l11N4
2742E5K24k86j0j97J33Q7L0lN0k92j2J87J04l8M6n1j9L5r1M1L3j13J69J8P2j98
2768b6Oj60K2J36q6J55j66K71k53K44K5j64n8K2k5j4k42L63k6j52J13K4j72K76
$$ y = [-234, -83, -78, -234, 67, 110, -379, 177, 135, 84, -78, -56, -62, -26, 4, 81, -156, -15, -54, 109, 3, -152, 56, 102, 11, 62, -48, 131, -72, -267, 51, -64, -79, -8, -98, 86, 157, 266, 202, -134, 7, 161, 219, -137, 94, 35, 136, -145, -95, -154, -338, -172, -348, 82, -62, -41, 1, -47, -238, -210, 65, -173, -301, -67, 239, -99, 2, 52, 75, 78, -75, 150, -67, -122, 79, 58, -29, 75, 141, -60, -63, -1, 3, 37, 84, 135, 52, 39, 290, -55, 97, -57, 56, 260, 150, -98, -191, 160, 179, -65, -7, 128, -203, -83, -32, -138, 19, -172, 34, 87, 48, -78, 140, -95, 62, -157, -65, 112, -115, 67, 79, 19, -154, 8, -26, -23, -41, -9, 123, 44, 156, -114, 45, 72, 230, 130, -51, -42, 118, 43, 312, 1, 55, 279, -7, -17, -214, -81, 6, 36, 33, 83, -209, -221, -34, 70, 32, 78, 27, 8, 43, -48, -7, 26, -87, 82, 100, 172, -26, -20, -180, -158, -22, -108, 47, -119, 152, -101, 143, 168, 4, -54, -32, -57, -71, -313, 50, 24, -128, -15, 9, -163, 113]
2792A13j14k13K9L47k89K04k24J12K19k92k9K32j1J18m28LJ49K43q0k59J37J47
2814A14K40o19L18p3Q1k00q6L77j54j02J01j24K02j6P2n5p4P2q7J74K0l14K56
2837A23l1k62J68J9N8J05l27L23j41j3J10L2k66J08J7j19Q7M0p4kL18j23k99K66
2861A17K4p2j80R4P4j23K01j98k2J29Rj0k30K57k80L27j40J03m8j71R4J1J43n2
2885E7k44M5K68N5k45K02p9L9p5R4j57j09K2K43N0l40Jp0P6J68Q7l05K8K85j66
2910g0j39J94J6K29j53j33N5J16j93K95l51J34j17O2K39j80J3m44M19j44K88j45
2932iK72k81k6k3J37r3O0R6k52K73j16L5j29J18oJ18l02L10k03N1j26O7K4j68
2956a73J81n5K3R1j85J79j8k3Qj15J59k6j42L7J95j30n5P3q7j03N0J59l31J69
$$ y = [113, -1, -214, -185, 162, -127, 77, -147, -35, 184, -108, -137, 95, 84, 202, -226, -223, -74, 169, 89, -170, -33, 114, 354, -265, 53, -20, 61, -139, -225, 152, -2, -104, -3, -127, 75, 59, 131, 76, 2, 74, -13, 161, 181, -133, 123, 92, -170, -2, 17, 75, 180, -147, 176, 35, 22, 132, 164, -102, 6, 23, -96, -9, 31, -43, -45, 273, 150, -149, 117, 141, 69, -111, -17, 57, -66, 135, -63, -85, 44, 53, 43, -187, 70, -210, 117, -23, 80, 32, -139, -45, -34, 109, 57, -187, -142, 126, 181, -64, 138, 59, 98, 23, 117, -40, -149, -127, 116, 166, -174, -173, -243, -167, 1, 88, -217, -189, 96, -70, -209, -15, 1, 230, 77, -56, -1, 115, -78, 217, -134, 0, -117, -55, 184, 4, 17, -427, -8, -152, 136, -9, 263, -18, -44, -67, 70, -23, 37, 133, -119, 154, 38, 73, -56, 62, 56, 174, -128, 182, -21, 30, -96, -29, -5, -173, 8, -47, -24, 67, -118, 61, 43, 20, 28, -87, 72, 46, -96, -59, 136, 6, -49, 24, -63, -166, -116, 43, -288, -119]
2980a19L10n0r8l0j3q5J11J5N7j11j08Q2j89K98j21J8K5M6j26j12J37P9J15r7
3004C4j58J73j41J80M9l77J19K25j53J7K84j9k31J07j05kP6l57K87m2r5n2K39
3027E8q6J2K28j18k78P8J48NK0o2p9K46k24J14o5J72m80L17J01j56K32l59K65
3050H9l15L59j27P3j14m7J39mn9M7Q4J19l8m1M7l16J58K0k19n4M4ML61k06j5n8
3076f9J12j23j9O6j4J28j2r5J18j34J3J48j75R1N8j46M5M7J07j76O6k10J17J96
3100A39j6k84J50p1j19L35l87k9M05k1j61J40l61J36K25k35N4O9l8J57J3k03J29
3123B7l31K44p3M0n1o8K59J44k89N9J66j18R3j01j31L04j29J48n5j64m5O6JJ00
3147I6o9j6J40J0Qj40J61j04j28j04L31k52J18k91J89J67K4k13L9j7O1O6l78K72
$$ y = [-119, 191, 141, 43, 13, 0, -85, 26, 41, 98, -13, -121, -39, -228, 70, -51, -33, -8, 38, -88, -200, -63, 16, 131, 34, -124, 49, -92, 88, 137, -240, -121, 104, -49, -32, 252, 233, 2, 109, 4, 2, 78, -279, 8, -34, -129, -181, 58, -28, -16, 212, 94, -184, -106, 42, 47, 67, 5, -74, 172, -52, 62, -3, 169, -311, 6, 107, -49, 183, -176, 89, -226, 133, 6, 79, -35, -82, 57, 53, -6, 41, 125, 244, 206, 165, 212, -104, 54, 74, -145, -199, -155, -151, 210, 4, -11, -69, 43, -80, -99, -33, -47, 81, 69, -26, 92, -42, -29, 119, -56, 35, 93, -53, -8, 39, 146, -30, 36, -174, -57, 139, 123, -161, -11, -82, -201, 134, -253, -282, 123, 102, -59, 81, -280, -144, 81, -154, -100, -31, -69, 88, 101, -102, 27, -304, -60, -133, -93, -144, -212, 47, 191, -98, -39, 127, 9, 102, 1, -130, 174, 45, 193, 138, -26, -71, -5, -4, 96, 27, 11, 151, 161, 169, 29, 190, 86, -42, -146, 185, -67, 51, -240, -51, 116, 140, -73, -34, -51, 10, 76, -302, -30]
3171c0J30l11N5K7L85j18q8j75R8J04j07K74Mj85N6k31L0J37J13k8q2m3J72k21
3195c4K9j47L4J92j55J97l08J43j83KK81q8j95K00J67k84R7J4K5p6J87K5j19n5
3219e1L3j75P2K23n5rj8k68J23J36J24j43m7nr7K68J21m92K15K60l86K47j95N3
3243f6L72l80Pl7K9o7L69j50J04r2J05k44K86k48J20j64j0J81j31J32k36J70k2
3266B8j37J04K88l44M9R9j05N0j43K89N1k26j7k07K63r3J36n2j7n2K38r3J21j06
3290A24o1q2J10q5J07k04J91o2M8j7l8k18J07J03q9k0K68Pl01J50R2j42j22K39
3314A05j68j95K20K84m31L16k16L2K33j07JJ42r8q7q5j33k5L86L27k14o9k95l
3337h0l4l5J57MJ85l2o2rk13MJ23j21K36j61l7P5J06j36nk2K92l10K17l63L12
$$ y = [-30, 100, -211, -156, -129, 256, 138, 50, -125, -27, 77, -30, 244, 248, 63, 119, -112, -82, 55, 168, 140, 58, 15, 187, -34, -5, -152, -118, 74, -81, 116, -192, -49, -232, -230, 51, -37, -232, -32, 135, -149, -52, -38, -13, -89, 98, 123, 4, -51, -18, -193, -121, 102, 47, 38, 20, -248, -125, 11, 135, -8, -55, -60, -157, 111, 232, -260, -45, 215, -171, 76, -119, -66, 306, -74, -67, -104, -75, -142, 227, 77, 181, 89, 194, -50, 236, -12, 108, -56, -66, 115, -16, 116, -120, 50, 28, -109, -5, 283, -61, -12, 87, -18, 32, -111, 178, 229, 3, -14, -221, 42, -51, 85, 33, 16, -36, 202, 109, 230, 124, 63, -19, 91, 6, 113, -91, 100, 38, 86, 69, 31, -187, -80, 23, -66, -86, 182, 189, -112, 38, 130, -12, -134, 105, -63, -258, -38, 246, -185, 131, -85, -53, 180, 73, 74, 216, 118, 31, -54, -187, -212, 174, 501, 287, 218, -77, -80, -114, -149, 8, 12, 197, 165, 103, 94, -119, -115, 8, -113, 123, -38, -75, 0, 106, -30, -35, -57, 235, -75, 142, -221, 91]
3362I1Lk1J06j05j61K0l6K02oqM0l29J31J06k14L17j05MQ1j73L1k0R5j86J84k09
3388a62K68l60N81l68Q5n9kp6n0J71l4K19k90J12r5K78j57j55J81k3m8J6P7Mk81
3413a68J38j2Rj6r4K13j13N1j37L6J41J17q3q1n8K81k61J69j06J46k71J75J65
3436B41k27K79k94j23j20L89r7j97J71j0K35l20kJ31n8j4j1j20K1k8J69p6J40
3459G9k0j82K53L0l05jK64k62K86k97M7k0L63l35J26J82l35K50n9o8N1J38k42
3482e7j3l6J54L6j43J25j43l5j50K73N8o4R3l60L33j61K32j45J66k01j76K46R2
3505A24k4k22J43l1J32J8j43k1N9r9R2j84K13L5m8J51j75J42j34J42j4j79J54
3528A31k8J64k89j29K27j59M89o78K43l16L55R8j67J31j01R0k02K35k58M4J24
$$ y = [91, 94, 73, 179, 74, -87, -67, -103, 99, 93, 85, 125, -204, -73, 33, -181, 136, 31, 35, 116, -57, -26, -46, 49, -137, 47, -162, 106, -254, 327, -41, 44, -15, -17, -93, -143, 28, -6, 213, -77, 35, -60, 218, 61, -94, 87, 64, 16, 32, 109, 113, -168, -30, -42, -33, -49, -143, 70, -43, 8, -129, -93, 48, 165, 82, 1, -57, 224, -37, 132, 26, 172, -99, 76, 241, 14, 293, -1, -124, -244, 145, 48, -149, 22, 12, 247, -73, -75, 56, -2, -16, -27, -147, -126, -154, 15, -61, 79, 59, -123, 130, 160, -145, -146, 118, -144, 142, -155, -108, -128, 235, -100, 26, 208, -127, 123, 64, -4, 47, 185, -57, -70, -106, 48, 84, -59, 66, -77, -112, -262, 11, 69, 5, 98, -262, 71, -90, 142, -3, 163, -38, -214, 32, 124, 100, -122, 21, -10, 122, 140, -3, -24, 35, -64, 28, -156, 57, 92, 44, 195, 20, 162, 28, 170, 156, -23, 131, 103, 267, -22, -151, 76, -83, 406, -272, -29, -345, 10, 108, -59, 72, -29, 61, -141, 94, -164, -120, 4]
3549DP7l15M05j25o7K48n3j69ml6K1p0nL1R0j7j51K28J66n06M31j77R4l43K68
3574B5Q3j71J43q2R2k64L74q9p6j5j3k1m3l2J09MJ6K3j08J75J27j82j73J48m8
3599BO9P2r8j34r2J34Q2l12J72J11J33k23J61M2P1k52l5N8j38L21j97M07l90r9
3623a35OK29l52M55l48J18Q3p9J31k48k5J86k38J22J06j73K77k03J20o5K71P3
3645C11o41J75J96j17J13j16J28p9k6r8K97j75L8R4K6j80J00M3m5J3J64k03N2
3668G0N9k24J85J6q6j7R0p1lk8j88K90j35kK83r7l24J77m4O2M9j11nJ50k04J29
3694B1J62Q9l54m3R2J35q8J3J03k68J76J27n1j96K19j43K40Nk33J03j84k7J23
3717B1m2o4J35R9j52P1k72J49j64K46m3J41k49N0L2P0n4j4J45o0K0n7mO0n3l5
$$ y = [4, 81, -234, 171, 46, -21, 227, 174, 5, 1, -35, -14, -84, -89, -58, 32, 15, -136, 92, 258, -248, 183, 6, 100, -243, 25, 108, -63, 80, -2, 90, -174, 200, 111, 35, 20, 7, -14, -57, -89, 20, 24, 40, 63, -45, 130, 257, 75, -98, 50, 2, 71, 143, 45, -89, -181, -47, 35, -277, -105, 6, 139, -84, 77, 119, 190, -62, -97, -39, -177, 144, -53, 354, -36, -135, -129, 100, -252, 203, -145, -27, 56, -23, 108, -140, -165, 21, -217, -95, 11, -162, 115, -88, 32, -33, 238, 311, -330, -155, 41, -76, 37, -79, 49, -30, -56, -154, 143, -32, 6, 100, 126, -54, 46, 89, 44, 57, 221, 18, 70, 129, -95, 90, 106, 20, 3, 93, 22, 19, -9, -197, 93, -42, -44, 239, 142, -182, -5, -49, 13, 62, -49, -54, 96, -108, 21, 183, 272, -82, -125, -33, 102, 14, 27, 130, -138, 38, 165, 114, -82, 137, -6, 234, 239, 6, 109, -75, -102, 21, -21, -85, 50, 149, -3, 68, -204, -55, -219, 27, -16, 125, -124, -74, -42, 28, -26, -40, 105, 45, 65, 8, 4, 64, 11, -24]
3743b4K38j82l26L66J10k22P9l63L00J03j85K25k20J37K5r2l98K61J51m0J94j90
3765e3J85k3j65l8qR8N2O1j11j00J0Q4J75j25K7j17j6K11l60J16J41R1l29K50
3789E6J22r8k34L92m1j94j53j11K22J52kj58L92m52K41j08j75J45J35L5k04m0
3811g8pR3l0P7J53l44J37K31r0Nr6k11L26k46J49k12L64j12j03j21J44Jk4p4k54
3836c22L85j30J34p7M5J0Q8k66K09l29J28o1K67r4O7L0k8M1j23K67j80P1K3l00
3860a45J19j45J89j15J24K16j91j21P3J22k24rP8L32j83o6j7Qm1k00J86J20j06
3883Dk08J76N0j58J26k68K32N9J40k91J90J8q5J10j03k23K89j65L66n13L12k41
3905a83O2K53o8p5j22n1j02K82J03j76j06M9j66L80m1p6n5n2R2O3J25j03J15k17
$$ y = [-24, 214, 32, -294, 72, 182, -40, 39, -324, -24, 79, -106, 119, -101, 36, 61, -31, -429, -168, -17, -57, 137, -53, 132, 109, -56, -94, -102, -4, 48, 109, -2, -102, -92, -8, 167, 42, 69, -48, -64, 147, -213, -97, 44, 135, -194, 56, 178, 80, -154, 238, 197, 3, -150, -261, -39, 113, 111, -47, 345, -107, 134, 26, -149, -4, 131, 166, -38, -78, -85, 8, -22, 55, 208, -136, 1, 232, 142, 147, 51, -160, 166, -80, 69, -143, 221, 109, 6, -115, 29, 30, 6, -68, -322, 63, -67, 67, -10, 35, 45, 133, -133, 76, -253, -125, -186, 81, -13, 54, 84, 56, 97, -26, 241, 61, 132, 155, -145, -26, -171, 18, -97, 27, 243, 52, -69, 4, 126, -98, -107, -29, 303, 120, 54, 37, 45, 4, -196, -10, 110, 4, -204, -28, 22, -136, -10, -278, -46, 13, 153, -138, 52, 70, -15, 95, -8, -231, 58, -107, 259, -254, 58, -183, -121, 132, 64, -11, -133, -184, -286, -4, 99, -77, -183, -134, -300, 80, 39, -37, -92, -144, -52, 11, 136, 33, 148, -69]
3929f9J95M2J34k98L9m7N5j56K04k35k27M74j15J56k80O4J0N6j13P2J18j0j68
3952i9MJ51j44O1o3O0k0Po5L4o9J13j45J78J66m28J58J35r3k03M69k13j77mL86
3977A99l5j20J8j90K55k53K9K32k44p2L36p4l74N34m10l7M77l49J23j6J77j49
3999E7m1ll8o4L3ol8M0jp6J76j75K0K77l52J54N5p9K37j28Nn6j14K55j21J58k05
4026c0j12J37J01J66k86j3m0n8K61J1j18j97j51L18R6L6k15L23m7j11K12n06M6
4049a77M22m53J66J41K50m27J24Q5j46K25m62K32m9k65J73K5J55N8j09J85j40
4070A3O9r6K04l25K80j81j92N36k44K6L0k0L4k78l6nK96p5K33l61K34j26M9Qr9
4095b6j84O1L46l18K1K27j05J8nM9j09K27j25k27J78o2j26K88p6K40l21J35J62
$$ y = [-69, 126, 168, 302, 4, 43, -4, 51, -105, 99, -136, -363, 111, -4, 152, -128, -64, -54, 2, -111, -39, 79, 69, -99, -95, 56, -88, -27, -90, -30, -50, -43, -108, -74, -143, -30, -175, 3, 169, -259, -101, 34, -59, -262, 207, -6, -183, -187, 199, 164, 44, 62, -128, 127, -126, -97, 135, -109, -181, 155, 81, -293, 241, -169, -206, 271, -78, 45, 29, 206, 57, 16, 13, -25, -89, -56, -62, -100, -60, -61, -137, 39, -136, -116, 161, -191, -37, 18, -61, 176, 48, 53, -3, -117, 138, 17, 175, -30, -142, -5, 96, 262, -24, -37, -77, -135, 126, 137, 19, -178, -329, -11, 85, 121, -94, 229, 182, 71, 283, -223, -177, 245, -208, -42, 99, 349, -78, 46, 131, -15, 210, -252, -20, -69, -334, -161, -136, 19, 77, -32, 153, 13, 82, -14, 190, -135, 145, -36, -228, 308, 64, 90, 120, 100, 134, -144, -180, -185, 111, 36, 269, -92, 142, 16, 65, 73, -26, -210, -149, 197, -121, -100, 127, 22, 40, 35, 84, -25, 202, 77, -150, 28, -34, -160, 128, 52, 292, -29, 106, 268]
4118B68k15p2J44j55r6J44mM6q9J16j3p4q7P4j02K76l1k88J55k2M04l23k37M5
4142a36J17K53l48J60n1K00q5k7k32K36%p9J00j08N9p9K31k88J72j9k32L2o2K29
4166D3j74O1Q1j82J6L48Lm27L69k37N1O6j72J02R7J01j79J19K8l15J23J9J30l
4190F8k40M8LK79m6q9r9p6J51O1J53k51K26j48R0M3l34J84O4K9p3L40l86P2J80
$$ y = [268, 53, -19, 125, -30, -126, 18, 14, 60, -29, 87, 74, 0, -87, -13, -115, 161, 130, -158, -3, -25, 379, 56, -181, -136, -19, 234, -114, 46, -5, 195, 110, 83, -149, 87, 87, 8, 108, 0, 59, -20, 211, -77, 95, 76, -156, -124, -186, 43, -131, -70, 11, -171, -155, 193, 196, -231, 138, -99, -48, 18, -154, -52, 45, 146, -33, 86, 114, -201, -78, -59, 71, 68, -172, -124, -121, 158, 112, 23, -76, -152, -1, 60, 213, -38, 188, 40, 130, 173, -161, 23, 87, 116, 43, 383, -3, 69, 249]
$$ [...]
8191c1
##END NTUPLES=NMR FID
##END=
