##TITLE=1H_Pr 5063-m
 CDCl3
 8 sc, 
 16.12.2021
##JCAMPDX= 6.0         $$ Bruker NMR JCAMP-DX V2.0
##DATA TYPE= NMR FID
##DATA CLASS= NTUPLES
##ORIGIN= UXNMR, Bruker Analytische Messtechnik GmbH
##OWNER= root
$$ XWIN-NMR		Version 3.5
$$ Thu Dec 16 12:46:11 2021 Russian Standard Time (UT+4h)  she@DPX200
##.OBSERVE FREQUENCY= 200.131346
##.OBSERVE NUCLEUS= ^1H
##.DELAY= (6, 6)
##.ACQUISITION MODE= SIMULTANEOUS
##.ACQUISITION SCHEME= undefined
##.AVERAGES= 8
##.DIGITISER RES= 18
##SPECTROMETER/DATA SYSTEM= spect
##.PULSE SEQUENCE= zg30
##.SOLVENT NAME= CDCl3
##.SHIFT REFERENCE= (INTERNAL, CDCl3, 0, 15.7039)
##AUDIT TRAIL= $$ (NUMBER, WHEN, WHO, WHERE, WHAT)
$$ ##TITLE= Audit trail, XWIN-NMR		Version 3.5
$$ ##JCAMPDX= 5.01
$$ ##ORIGIN= Bruker BioSpin GmbH
$$ ##OWNER= she
$$ F:/spectra/data/she/nmr/H-F/1/audita.txt
$$ ##AUDIT TRAIL=  $$ (NUMBER, WHEN, WHO, WHERE, WHAT)
(   1,<2021-12-16 12:45:06.06 +0400>,<she>,<DPX200>,
      <created by zg, POWCHK disabled, PULCHK disabled
       configuration hash MD5:
       00 E9 B6 7A A2 85 ED C7 34 08 36 98 17 FE 4E 26
       data hash MD5: 16K
       75 F5 EC E0 4C 1B 90 04 BC 68 F6 40 D0 10 6A 9A>)
$$ ##END=
$$ 
$$ hash MD5
$$ F4 77 FD 57 18 9C 14 BF 20 8C 52 EE AD 5D 12 43
##$RELAX= 
##$RELAX= 
##$RELAX= 
##$RELAX= 
##$RELAX= 
##$RELAX= 
$$ Bruker specific parameters
$$ --------------------------
##$DU= <F:/spectra>
##$EXPNO= 1
##$NAME= <H-F>
##$PROCNO= 1
##$TYPE= <nmr>
##$USER= <she>
##$AMP= (0..31)
100 100 100 100 100 100 100 100 100 100 100 100 100 100 100 100 100 100 
100 100 100 100 100 100 100 100 100 100 100 100 100 100 
##$AQSEQ= 0
##$AQ_mod= 1
##$AUNM= <au_zg>
##$AUTOPOS= <>
##$BF1= 200.13
##$BF2= 200.13
##$BF3= 200.13
##$BF4= 200.13
##$BF5= 200.13
##$BF6= 200.13
##$BF7= 200.13
##$BF8= 200.13
##$BYTORDA= 1
##$CFDGTYP= 0
##$CFRGTYP= 5
##$CHEMSTR= <none>
##$CNST= (0..31)
1 1 145 1 1 1 1 1 1 1 1 1 1 1 1 1 1 1 1 1 1 1 1 1 1 1 1 1 1 1 1 1 
##$CPDPRG= <>
##$CPDPRG1= <>
##$CPDPRG2= <>
##$CPDPRG3= <>
##$CPDPRG4= <mlev>
##$CPDPRG5= <mlev>
##$CPDPRG6= <mlev>
##$CPDPRG7= <mlev>
##$CPDPRG8= <mlev>
##$CPDPRGB= <>
##$CPDPRGT= <>
##$D= (0..31)
0 1.2 0 0 0 0 0 0 0 0.06 0 0.03 0 0 0 0 0.0002 0 0 0 0 0 0 0 0 0 0 0 0 
0 0 0 
##$DATE= 1639644305
##$DBL= (0..7)
120 120 120 120 120 120 120 120 
##$DBP= (0..7)
150 150 150 150 150 150 150 150 
##$DBP07= 0
##$DBPNAM0= <>
##$DBPNAM1= <>
##$DBPNAM2= <>
##$DBPNAM3= <>
##$DBPNAM4= <>
##$DBPNAM5= <>
##$DBPNAM6= <>
##$DBPNAM7= <>
##$DBPOAL= (0..7)
0.5 0.5 0.5 0.5 0.5 0.5 0.5 0.5 
##$DBPOFFS= (0..7)
0 0 0 0 0 0 0 0 
##$DE= 6
##$DECBNUC= <off>
##$DECIM= 32
##$DECNUC= <off>
##$DECSTAT= 4
##$DIGMOD= 1
##$DIGTYP= 9
##$DL= (0..7)
0 120 120 120 120 120 120 120 
##$DP= (0..7)
150 150 150 150 150 150 150 150 
##$DP07= 0
##$DPNAME0= <>
##$DPNAME1= <>
##$DPNAME2= <>
##$DPNAME3= <>
##$DPNAME4= <>
##$DPNAME5= <>
##$DPNAME6= <>
##$DPNAME7= <>
##$DPOAL= (0..7)
0.5 0.5 0.5 0.5 0.5 0.5 0.5 0.5 
##$DPOFFS= (0..7)
0 0 0 0 0 0 0 0 
##$DQDMODE= 0
##$DR= 18
##$DS= 0
##$DSLIST= <SSSSSSSSSSSSSSS>
$$ [...]
##$SUBNAM2= <"">
##$SUBNAM3= <"">
##$SUBNAM4= <"">
##$SUBNAM5= <"">
##$SUBNAM6= <"">
##$SUBNAM7= <"">
##$SUBNAM8= <"">
##$SUBNAM9= <"">
##$SW= 18.0517287032376
##$SWIBOX= (0..15)
0 0 2 0 0 0 0 0 0 0 0 0 0 0 0 0 
##$SW_h= 3612.71676300578
##$TD= 16384
##$TD0= 1
##$TE= 0
##$TE2= 300
##$TE3= 300
##$TEG= 300
##$TL= (0..7)
0 120 120 120 120 120 120 120 
##$TP= (0..7)
150 150 150 150 150 150 150 150 
##$TP07= 0
##$TPNAME0= <>
##$TPNAME1= <>
##$TPNAME2= <>
##$TPNAME3= <>
##$TPNAME4= <>
##$TPNAME5= <>
##$TPNAME6= <>
##$TPNAME7= <>
##$TPOAL= (0..7)
0.5 0.5 0.5 0.5 0.5 0.5 0.5 0.5 
##$TPOFFS= (0..7)
0 0 0 0 0 0 0 0 
##$TUNHIN= 0
##$TUNHOUT= 0
##$TUNXOUT= 0
##$USERA1= <user>
##$USERA2= <user>
##$USERA3= <user>
##$USERA4= <user>
##$USERA5= <user>
##$V9= 5
##$VALIST= <valist>
##$VCLIST= <CCCCCCCCCCCCCCC>
##$VD= 0
##$VDLIST= <DDDDDDDDDDDDDDD>
##$VPLIST= <PPPPPPPPPPPPPPP>
##$VTLIST= <TTTTTTTTTTTTTTT>
##$WBST= 1024
##$WBSW= 4
##$XGAIN= (0..3)
0 0 0 0 
##$XL= 0
##$YL= 0
##$YMAX_a= 437095
##$YMIN_a= -602326
##$ZGOPTNS= <>
##$ZL1= 120
##$ZL2= 120
##$ZL3= 120
##$ZL4= 120
##$ABSF1= 10
##$ABSF2= 0
##$ABSG= 5
##$ABSL= 3
##$ALPHA= 0
##$AQORDER= 0
##$ASSFAC= 0
##$ASSFACI= 0
##$ASSFACX= 0
##$ASSWID= 0
##$AUNMP= <proc_1d>
##$AZFE= 0.1
##$AZFW= 0.1
##$BCFW= 1
##$BC_mod= 2
##$BYTORDP= 1
##$COROFFS= 0
##$CY= 11.3945322036743
##$DATMOD= 1
##$DC= 2
##$DFILT= <>
##$DTYPP= 0
##$F1P= 2.36226072786647
##$F2P= -0.459571619588291
##$FCOR= 0.5
##$FTSIZE= 0
##$FT_mod= 4
##$GAMMA= 1
##$GB= 0.15
##$INTBC= 1
##$INTSCL= 1
##$ISEN= 128
##$LB= 0.24
##$LEV0= 0
##$LPBIN= 0
##$MAXI= 10000
##$MC2= 0
##$MEAN= 0
##$ME_mod= 0
##$MI= 1.114404
##$NCOEF= 0
##$NC_proc= 0
##$NLEV= 6
##$NOISF1= 3.799351
##$NOISF2= 2.8
##$NSP= 1
##$NTH_PI= 0
##$NZP= 0
##$OFFSET= 15.70392
##$PC= 1
##$PHC0= -15870.3
##$PHC1= 10.80079
##$PH_mod= 1
##$PKNL= yes
##$PPARMOD= 0
##$PSCAL= 0
##$PSIGN= 0
##$REVERSE= no
##$SF= 200.130013532006
##$SI= 16384
##$SIGF1= 3
##$SIGF2= 2
##$SINO= 400
##$SIOLD= 16384
##$SREGLST= <1H.CDCl3>
##$SSB= 0
##$STSI= 0
##$STSR= 0
##$SW_p= 3612.71676300578
##$SYMM= 0
##$S_DEV= 0
##$TDeff= 0
##$TDoff= 0
##$TI= <>
##$TILT= no
##$TM1= 0
##$TM2= 0
##$TOPLEV= 0
##$USERP1= <user>
##$USERP2= <user>
##$USERP3= <user>
##$USERP4= <user>
##$USERP5= <user>
##$WDW= 1
##$XDIM= 8192
##$YMAX_p= 0
##$YMIN_p= 0
$$ End of Bruker specific parameters
$$ ---------------------------------
##NTUPLES= NMR FID
##VAR_NAME=  TIME,          FID/REAL,        FID/IMAG
##SYMBOL=    X,             R,               I
##VAR_TYPE=  INDEPENDENT,   DEPENDENT,       DEPENDENT
##VAR_FORM=  AFFN,          ASDF,            ASDF
##VAR_DIM=   8192,          8192,            8192
##UNITS=     SECONDS,       ARBITRARY UNITS, ARBITRARY UNITS
##FACTOR=    0.0002768,     1,               1
##FIRST=     0,             0,               0
##LAST=      2.2672688,     0,               0
##MIN=       0,             -602326,         0
##MAX=       2.2672688,     437095,          0
$$ Real data points
##PAGE= N=1
##DATA TABLE= (X++(R..R)), XYDATA
0@%%%%%%%QqQj6J6k2L0m0M8n6P2q8J04j28J60j87K19k59L00l50M06m70N42o19
31c30P07q06R15j035J167j313J473j649J841k051K282k534K807l107L436l793
47a990M184m611N080n597O168o800P497q274R152j0146J1278j2585J4116j5935
61h463J8137k0871K4374k9040L5604m5585O2767j00319L28057k80978n65500O52678
73G0861L66208l89541m18822K43371K13878m6779m9432l1962j41423J57530K85761
84B59650r2657l74797O1459L99475p463l85995l8258K25488M4228j18799n5159
95h2828j8851J3124J32282P9410j98268q4676K54022J18556k09822r8769J55701
106E9881N8392j31822p711N1340j09726j1417J61189m4565j98718P1709K48989
$$ plain form
0 0 0 0 0 0 0 0 0 8 0 8 -8 8 -14 16 -24 24 -32 40 -48 56 -72 88 -99 120 -139 161 -189 217 -253 289 -330
31 -330 377 -429 486 -549 618 -695 778 -871 970 -1081 1201 -1333 1474 -1633 1803 -1990
47 -1990 2194 -2417 2663 -2934 3234 -3566 3931 -4343 4809 -5337 5941 -6644 7472 -8463
61 -8463 9674 -11197 13177 -15863 19741 -25844 36923 -63396 264661 -16317 -581817 70861
73 70861 437069 47528 -371294 -127923 85955 39176 -10256 -42218 -183641 -26111 259650
84 259650 166993 -207804 -146345 253130 245667 -140328 -178586 46902 91130 -27669 -82828
95 -82828 -101679 -88555 43727 123137 -75131 -159807 94215 212771 2949 -95820 59881
106 59881 118273 -13549 -21260 30080 -79646 -91063 70126 25561 -173157 -101448 147541
117A47541p1096k43845J38853K46931j69552j97858J93378J55124k35016j51406
127a86946K47417R0290k79075n2092K50358K3694j98240R057J83887j5780j20399
138d7829O8770O7093q1654j3913O4943l4565q2418L5479O3612q3457n3657J04944
150G348K0097r5454K3468J06163j4429q8455M4695R1685o5882o1904O3279L683
162C4294o7290R774M3085m7779n3496Q3705M7949j05821n803J27140j893j04070
174d0205K4612J10208m7306j17530P3109Q7067j14564q0767J03837O3466j07953
185d6026o1536J18052N4352r3171r989P4529P302l2461N952J7712l2446j1071
197h801M3682k9607o0280L3953L7781l6392k8331M1006K9573m2268M631O5559
$$ plain form
117 147541 76445 -167400 -28547 218384 48832 -149026 44352 199476 -35540 -186946
127 -186946 60471 150761 -128314 -180406 69952 93646 -104594 -95537 88350 72570 -47829
138 -47829 20941 88034 6380 -7533 57410 22845 -59573 -24094 39518 -43939 -97596 7348
150 7348 27445 -68009 -44541 61622 47193 -41262 3433 95118 29236 -32668 30611 34294
162 34294 -32996 -23222 19863 -27916 -81412 2293 50242 -55579 -61382 65758 63865 -40205
174 -40205 -15593 94615 47309 -70221 2888 89955 -24609 -105376 -1539 61927 -46026
185 -46026 -107562 10490 64842 -28329 -38318 36211 43513 11052 17004 34716 2270 -8801
197 -8801 34881 5274 -55006 -21053 16728 -19664 -47995 -6989 22584 -19684 -15053 50506
209E0506k3532n3734L8921M7133m1500o2884L2928M8533m9576l6236L5773P003
221f665j4247J5818J4755j9509m636N7340R819p4003P514P1153j7054p1850k259
234c3824N9769j3100o4874K1088M3193k5457j4335K7102J6973j6510l241L2724
246B9508n285l0825J7667J0128k5443q105Q861o51j9034M489K3644j9399q485
259b2930M0628K609k8517P885L6078k508m6218O381M2019k6826l9617J5303K0099
272D386j4096k1720J6104J9571j8595P350K5945j3428q523J9917J2705k1197k1545
285a3126K5908R404m0560l341K5110n567j8731L039K4831k611j9131K1648J5448
298B2321j5338j610N860J831n859j0412J856q122m156J3024j3742j2137K0423
$$ plain form
209 50506 26974 -26760 12161 59294 17794 -45090 -12162 36371 -13205 -49441 -13668 -6665
221 -6665 -20912 -5094 9661 -9848 -14484 42856 52675 -21328 -13814 57339 40285 -31565 -33824
234 -33824 25945 12845 -52029 -30941 12252 -13205 -27540 -438 16535 25 -3216 29508
246 29508 24223 -6602 11065 21193 -4250 -12355 -3494 -4145 -23179 -18690 4954 -14445 -22930
259 -22930 17698 20307 -8210 -325 35753 33245 -12973 -6592 35427 8601 -31016 -15713 4386
272 4386 -9710 -31430 -15326 4245 -14350 -7000 18945 5517 -3006 16911 29616 8419 -13126
285 -13126 12782 22186 -18374 -21715 3395 -2172 -20903 -17864 6967 4356 -14775 6873 22321
298 22321 6983 5373 11233 13064 7205 -3207 -1351 -9473 -13629 -605 -14347 -26484 -6061
311f061J1944q569j0851J8109K4473k1413j2030K4214r16j8222l620P825k455
324B428k0986O900J6854k0028n223K2082N676r613n346J8823J0351k1600o31J3613
338A3300q369p924l199J661j592r492Q859M742j1618Q569J1418o31k32j951R548
353A3089L209j0607O69l686l126N070j1968p441P557K738j443p800N721J8044
367A0026q310n849J2535L176m208p422L827P744j7004n489J3064m684q923j14
381a1631R817O148j1640M514J5639o072k441M008J64L43p714l00J278j0025J344
396f568K566o944J622O74O176N410q929M384J1090J137k303j0080K902J4328q728
411F737j4631k723R175J0294j5838j1305J4878Q400K5m647m412R022M617K060
$$ plain form
311 -6061 5883 -2686 -13537 4572 29045 7632 -4398 19816 18900 678 -2942 4883 2428
324 2428 -18558 -11658 5196 -14832 -20055 2027 7703 -1910 -7256 11567 21918 318 -313 13300
338 13300 4931 -2993 -6192 -4531 -6123 -15615 -6756 -2014 -13632 -5063 6355 5724 5492 3541 13089
353 13089 16298 5691 6360 2674 -452 4618 -7350 -14791 -7234 -4496 -5939 -13739 -8018 10026
367 10026 1716 -4133 8402 11578 7370 -52 3775 11519 -5485 -10974 2090 -2594 -11517 -11631
381 -11631 -1814 4334 -7306 -2792 12847 6775 4334 8342 8506 8849 1135 835 2113 -7912 -6568
396 -6568 -4002 -10946 -9324 -8650 -2474 2936 -5993 -1609 9481 10618 8315 -1765 1137 15465 6737
411 6737 -7894 -10617 -1442 8852 -6986 -18291 -3413 4987 5012 365 -4047 4975 9592 11652
425A1652l374j7467M076J7661n356j8807j2213J6602K2804j7836k1035J0722K2760
438A0189R685k0254j2593J8655J2311k128j4553j4067J2857J1691p008j3132j0784
451a9131J2674J6893p555j2462m022J4691K0457j4377j8151P147J2996N607j4927
464a60j3839R122N328o00n94j0268o50J0276J0273J955k0160r64K6766N013j7126
479D372j4590P880J7286o229j5868l521R78R982P385j1633r452n17K1425J6133
493B3631k3522j9104J5085K6647o14l4990j2817L0341J7131j5478k8454j269L3775
506A0362J0890k2700j5862O389K6258R955k3408j6676P454K4676P788l3107k0748
519b8729K2684K4362o989l3600n652L4769J2558j8660j6640O293K3501K826j4830
$$ plain form
425 11652 8278 -9189 -5113 12548 7192 -11615 -23828 -7226 15578 -2258 -23293 -12571 10189
438 10189 19874 -380 -12973 5682 17993 15865 1312 -12755 102 11793 4785 -8347 -19131
451 -19131 -6457 10436 2881 -9581 -13603 1088 21545 7168 -10983 -3836 9160 14767 -160
464 -160 -13999 -4877 451 -149 -743 -11011 -11661 -1385 8888 10843 -9317 -10281 16485 21498 4372
479 4372 -10218 -2338 14948 8719 -7149 -10670 -9692 290 7675 -3958 -13410 -13927 7498 23631
493 23631 109 -18995 -3910 22737 22123 -12867 -25684 4657 21788 6310 -22144 -23413 10362
506 10362 21252 -1448 -17310 -10921 15337 25292 1884 -14792 -7338 17338 25126 -7981 -28729
519 -28729 -6045 18317 11328 -22272 -27924 6845 19403 743 -15897 -9604 13897 16723 1893
532A893p796j973J4354J1055j8452j7241Q279K1650J223k6862m529K5263P637
545A4501j2088j0790N967J6563p539j0333M113o72J41j436j218J702p007J948
559f148O998j172j152j676K365R787l717n522L770j310J858o01m879L64k883R44
575b974O559o927l262M854L458L945p826j989Q854J120m042k481r53M298m013
590a379k847M072n336J241O939k654k793p20P109O010j1345j209J0763N60o442
605A969o807M813R088j1439o656Q111K554k595o170K174R658k202l221q02L4P737
621F246j359q810K854Q95J227J43n884J679J735J293M625o997k450Q442K679q07
637E511p283k272J1291j941p153k035M95M537k10n677r72q54O505P254j1097l413
$$ plain form
532 1893 -5903 -7876 6478 17533 -919 -18160 -9881 11769 12992 -13870 -18399 6864 14501
545 14501 2413 -8377 -2410 14153 6614 -3719 394 -278 -137 -1573 -2791 -1089 -8096 -6148
559 -6148 850 -322 -1474 -3150 -785 9002 5285 -237 3533 2223 4081 3480 -1399 -1035 -3918 -2974
575 -2974 3585 -3342 -6604 -1750 1708 5653 -2173 -4162 4692 5812 1770 -711 -1664 2634 -1379
590 -1379 -4226 -154 -5490 -4249 2690 36 -2757 -3477 3632 9642 -1703 -2912 7851 8411 1969
605 1969 -4838 -25 9063 -2376 -9032 -921 1633 -962 -7132 -4958 4700 2498 -723 -1525 -1491 6246
621 6246 4887 -3923 -1069 -174 1053 1196 -4688 -3009 -1274 19 4644 -2353 -4803 3639 6318 5511
637 5511 -1772 -4044 7247 5306 -1847 -3882 -3387 1150 940 -4737 -5709 -6563 -58 7196 -3901 -7314
653g314R254P462l435j3429J660J6280m031r942j602L591O076m533l716L626l048
668c101L485M838l564k528o08M423N253q347n398L684K848K929q510n182R837
683E9K711l438m046K53R786j056o121M254l40m92J883j466n11m822P00Q311n951
700b86o733N381L626L51m341o74O156l180n90M511n233k295L333K969j383r838
716h226K886J1304m602p398J279P062M797q215k811P878J116j613l438j591N380
731C808j838m291J698j625J357j50j739L438k957j138O944j764l248j99K497N509
747F302p496n265Q461J486n087k733K515O107m680l268O518j255j537K882q08
762B142m21k414J520M201p344k297O256o07l318k880K770N942n993j535N655m86
$$ plain form
653 -7314 1940 9402 5967 -7462 -5802 10478 6447 -3495 -5097 -1506 4570 37 -3679 -53 -3101
668 -3101 384 5222 1658 -870 -1478 2945 8198 -149 -5547 -1863 985 3914 -4596 -9778 59
683 59 2770 -668 -4714 -4461 5325 4269 -1852 2402 2062 1570 3453 1987 1476 -3346 -2646 5665 -286
700 -286 -7019 -1638 1988 2339 -2002 -2676 3480 300 -290 4221 -1012 -3307 26 2995 1612 -8226
716 -8226 -5340 5964 1362 -6036 -4757 2305 7102 -1113 -3924 3954 5070 3457 19 -1572 3808
731 3808 1970 -2321 -623 -2248 -891 -1041 -2780 658 -2299 -3437 3507 1743 -1505 -1704 793 6302
747 6302 -1194 -6459 2002 3488 -1599 -4332 -1817 4290 -390 -3658 2860 1605 68 2950 2142
762 2142 1721 -693 827 5028 -2316 -4613 1643 1036 -2282 -5162 -2392 3550 -2443 -3978 1677 1191
778A191k61j491M16M184l668k111L420j003R7k692k50N746l300l756L988J796
794B306J57l902m66P119l754m426L420K05n15k743p25N184m028k308N520o07j638
811a201m12J982M234n156j699O664j841k720n31R56K858m038j574M117k153p73
827a287J278l64J573k088j2M423m080j258K348o23J034l524r73N494k193k233
843b485Q95R62L481l085k128O217j561k619J583O95J134m381r54O598m072m352
859d072K731J681J279m112j201N908j692k208K243j223R24Q4q32K291m139k55
875b593N182k157j751j080J404N997m349l887L673K594J069m133k698N463n33
890B201l041J454k609O11R41n7J428n208Q1Q031j267n323j280M752N795o320n538
$$ plain form
778 1191 930 -561 -145 4039 371 -1740 1680 677 774 -1918 -2168 3578 278 -3478 510 2306
794 2306 2463 -1439 -1905 5214 1460 -2966 454 659 144 -2599 -3324 1860 -2168 -4476 1044 437 -1201
811 -1201 -1613 369 4603 -553 -2252 4412 2571 -149 -680 276 3134 -904 -2478 1639 -514 -1287
827 -1287 -9 -373 1200 -888 -900 3523 -557 -1815 533 -90 944 -2580 -3553 1941 -252 -2485
843 -2485 -1590 -628 2853 -232 -2360 3857 2296 -323 1260 1955 3089 -1292 -2246 4352 280 -4072
859 -4072 -1341 340 1619 -2493 -3694 2214 522 -1686 557 -666 258 342 -490 1801 -2338 -2593
875 -2593 2589 432 -1319 -2399 -995 5002 653 -3234 439 3033 4102 -31 -2729 2734 2201
890 2201 -840 614 -1995 -1384 -443 -500 928 -4280 -4199 3832 2565 -2758 -4038 714 6509 189 -5349
907e349O567J934k544j802k87K960k122LM494m928k152M872K171j036o815J085
923b949Q459k888n898L2K788L354l962l126L747p80O08K159k400m22q6L056M257
940E949o965l868O657L909k746q304J311J0330l121p366J969L170J875k975j300
955a475L319l854M93O111l949n339J348O816J574j1011j321J1641K56p090k631
970e112N175N512n570k825N120j126n54J162r14k78l059K806M405o209l105M412
986a60L439k189o115K402P800m222m884K327L137J485n565q95O567k783k903K523
1002c6R42P6l158J634N312n686k216O220R10l889l717M474N114q176l000P244
1018B048P68m432k805M150L891o251n19N918k656k088J501K283Rn394K553N377
$$ plain form
907 -5349 1218 3152 608 -1194 -1481 1479 -643 -640 3854 -1074 -3226 1646 3817 2781 -4034 -2949
923 -2949 5510 2622 -3276 -3244 -456 2898 -1064 -4190 -443 -1223 -615 1544 -856 -1278 -1364 1692 5949
940 5949 -1016 -4884 1773 5682 2936 -5368 -4057 6273 3152 -4214 -2245 925 2800 -175 -1475
955 -1475 1844 -2010 -1517 4594 645 -4694 -3346 3470 5044 -5967 -7288 4353 4609 -2481 -5112
970 -5112 63 5575 5 -2820 2300 1174 620 1782 868 590 -2469 337 4742 -1467 -4572 -160
986 -160 3279 1090 -5025 -2623 5177 955 -3929 -1602 1535 3020 -2545 -3440 3127 344 -2559 -36
1002 -36 906 982 -2176 -542 4770 -916 -3132 3088 3998 109 -3608 866 5980 -2196 -5196 2048
1018 2048 2816 -1616 -4421 -271 3620 -2631 -3150 2768 112 -1976 -475 1808 1817 -3577 -1024 4353
1034D353m375k461K090K209J077m706M52M241k558l30P27o08P68j995J304K120
1050B308m117m90K359O20K20m568P53O016k483l243R77K490K277l844p32L380
1066A923j834M28J369k297k59j17K557J598o673M12N689K96l272l581L292M413
1082C944m110j960J582o84K678p17k735L06L06L121N0n063K400K725m49k67l017
1099a890J612L027j955J24j933m03M320j369l332j62J588L127l162k942L996k00
1115D46r91J001j776R86pP2J752l123n26L445p35o76j339J257K761k266j294K304
1133A291r30P75m9j808J713m30p21Q97j907J422k18j839K333o64j578J114K14
1150c85R35j524j062M218p39l128J298J061K67k507J31L803k461k371M284L80
$$ plain form
1034 4353 -22 -2483 -393 1816 2893 -1813 -1361 2880 322 -8 719 111 879 -1116 188 2308
1050 2308 -1809 -2299 60 680 900 -3668 -2915 3101 618 -2625 -1648 842 3119 -725 -1457 1923
1066 1923 89 517 1886 -411 -670 -787 1770 3368 -3305 -2893 2796 3092 -180 -3761 -469 3944
1082 3944 -166 -2126 -544 -1228 1450 733 -2002 -1696 -1390 1731 1781 -3282 -882 1843 1394 1127 -1890
1099 -1890 -278 2749 794 918 -1015 -1418 2902 1533 -1799 -1961 -373 2754 -408 -3350 646 446
1115 446 -545 456 -1320 -334 -341 -269 1483 -1640 -2166 1279 544 -132 -1471 -214 2547 281 -1013 1291
1133 1291 361 1136 1087 -721 992 562 -159 738 -1169 253 35 -1804 529 -135 -1713 -599 -385
1150 -385 550 -974 -2036 2182 1443 -1685 -387 674 941 -1566 -1435 2368 -93 -2464 1820 2200
1166B200k374j104J607L083l483j990M628o64l692P07R28J647k958m64L303k083
1182g09j065K082j015J403r92Q8J869j494r38J903p95J655k023j538K438J046
1198A915j495K50p61K628k419k070L393o1k899M46R73J127k481q81M112n64m456
1215c243K725J384N06l274m4N056j628m079L817O68n33k234N01L467k927k503
1231b341L862p36k293Q71M13J850k146j598L108j340J97q35N69J037m93j768K444
1248H01j338m68Q53l55K039j162k258K200J636j010r89o86L526k557k640L928
1264A520k13j657r19N40K259k467j980M321q08k146O60O73K228l308r95M357j129
1281I36k754J567J112j5j801m70L470j941j301K232q65Q48r84n50K600j992j365
$$ plain form
1166 2200 -174 -1278 329 3412 -71 -2061 2567 1903 -1789 -1082 -154 1493 -1465 -1929 1374 -709
1182 -709 -1774 308 -707 696 -296 -208 1661 167 -771 1132 337 1992 -31 -1569 869 1915
1198 1915 420 670 -91 2537 118 -1952 1441 1380 -1519 -1073 -100 1027 -1454 -2335 1777 1213 -3243
1215 -3243 -518 866 1372 -1902 -1946 3110 1482 -2597 1220 1888 1355 -879 -378 3089 162 -2341
1231 -2341 1521 785 -1508 -637 -224 1626 -520 -2118 990 -350 -153 -988 -419 618 125 -1643 801
1248 801 -537 -1005 -152 -507 1532 370 -1888 312 1948 938 -51 -737 2789 232 -2408 1520
1264 1520 1307 -350 -1269 -729 1530 -937 -2917 1404 596 -1550 -890 -217 2011 -1297 -2292 2065 936
1281 936 -1818 -251 861 846 -955 -1425 2045 104 -1197 1035 170 1018 34 -516 2084 92 -1273
1298a273K051n13K6r52j035K736j111k323K155L37N01j254r35K984j014j441J604
1315E43L37k8j131m70L154j956k031K563J51o63j607M00L182k314k590L411J42
1332A093j556n69K06K226j881j465K300o90n26M99J82J301k026l61L079j327j248
1349g63M60O70J340j617j616K715l49q40k04m94J634j099j050K225j161q55R17
1366h7m07J216j807n79L046j275j686J149N57J110j549r98K513m73j652J224R4
1383C96Q03j032j041K844j242k270J911M19o35j046p23L066j493k267K201L12
1399B03J11j296j22K341j472j305K007J41o74j58K42J643j655j568K995o70r71
1416b08P2L04J455j180k211K358K85j508J45k13K155j915j385K729j015p54O76
$$ plain form
1298 -1273 778 265 291 -661 -1696 1040 -71 -2394 -239 98 599 -655 -1590 1394 380 -1061 543
1315 543 880 852 -279 -749 2405 449 -1582 981 1132 469 -1138 -738 2444 130 -2460 951 1093
1332 1093 -463 -1032 -826 1400 -481 -1946 354 -336 -862 -363 -181 1120 -906 -1267 1812 485 -763
1349 -763 -303 367 1707 90 -1526 1189 840 0 -204 -698 936 -163 -1213 1012 -149 -1004 -87
1366 -87 -494 722 -1085 -1664 1382 107 -1579 -430 127 1237 -312 -1310 1203 730 -922 302 396
1383 396 1199 167 -874 1970 728 -1542 369 788 153 -893 -1616 1450 -43 -2310 -109 203
1399 203 314 -982 -1104 1237 -235 -1540 467 608 -66 -224 18 1661 6 -1562 1433 763 -208
1416 -208 -136 168 1623 443 -1768 590 875 -633 -488 -701 1454 -461 -1846 883 -132 -886 -210
1433b10K7J014j761q2K045o32q93K56L87J374j879j208L236p78j771L25J194P77
1451A421j691j178K841j184q42P18l65M24q52j19K503j585k077K297P26r62j021
1468i46l74L153j533j317J683p57Q43o07k78J868j536p38J546q11o18J03K48J988
1486A917k428j397K748n08q09m5n02K082j140j295J383r61M47P94r02J780j372
1503b08j214K374p30n54N76k82J888j581j278J961o1m43m35p77J646r21j066J720
1521F15n82q91Q50M17m33j441J52K382j033j059R35m49Q90j15j213K031l89l93
1539B74j83p12J999o69j308J497p25J63K48q25J055j414o42K141l16k169J363
1556b23j14J456j464j211K294j47j540Q98l4R26j420p3K024j160q13J071K99m30
$$ plain form
1433 -210 -183 831 -930 -1012 1033 401 -492 -236 151 1525 -354 -1562 1674 896 -875 -550 644 1421
1451 1421 -270 -1448 1393 209 -633 85 -280 144 -708 -827 1676 91 -1986 311 1037 75 -946
1468 -946 -1320 1833 300 -1017 666 -91 752 145 -133 1735 199 -539 1007 196 -422 -319 -71 1917
1486 1917 -511 -1908 840 332 -477 -522 -1024 1058 -82 -1377 6 -955 -508 286 -616 1164 -208
1503 -208 -1422 952 222 -332 244 -38 1850 269 -1009 952 891 448 13 -764 882 -39 -1105 615
1521 615 33 -858 -8 409 -24 -1465 -1313 1069 36 -1023 -88 -537 353 238 -975 1056 667 274
1539 274 91 -621 1378 709 -599 898 173 336 584 -241 814 -600 -1242 899 583 -1586 -223
1556 -223 -337 1119 -345 -1556 738 591 -949 -51 -85 841 -579 -652 1372 212 -601 470 769 339
1574C39r90o8K336j493j207J164N34j086j27j92J120k86j482J362J66L1l27j094
1592a300K267m46j635J442k29K1j37j106K351J87k300J375L66j22j454l42K452
1609A390p41k357K144P31j195q39kJ936j461j441L129o4k371K25J383O62j060
1626F9j567K277J89j709J418k9K81j109q66K789j440j065J584p71R02j291m39
1643g77J551n03p91q03Q82R80n91j620J747O77j763j95R10R92q72j343K601J07
1661A189j700Q33P65M97k052r98L600k036j720J308J270o88j544P83J339j206
1677c60j677K636j090n35L69j03K240k067n45J471l9j035Q93o79J795j125j046
1694h97J416k02M14l37j709K346k16k151J700M78m59j182K80J141k17j974K566
$$ plain form
1574 339 -651 -719 1617 124 -1083 81 615 -471 -598 -790 330 44 -1438 -76 90 121 -206 -1300
1592 -1300 967 521 -1114 328 99 120 -17 -1123 1228 1415 -885 490 856 734 -720 -1062 1390
1609 1390 649 -1708 436 1167 -28 -867 -869 1067 -394 -1835 1294 1230 -1141 -916 467 1129 69
1626 69 -1498 779 968 -741 677 648 929 -180 -1046 1743 303 -762 822 51 953 -338 -777
1643 -777 774 271 -520 -1323 -441 539 -52 -1672 75 752 -1011 -1206 -296 696 -176 -1519 1082 1189
1661 1189 -511 322 1087 1584 -468 -1466 2134 98 -1622 -314 956 268 -1276 -493 846 -360
1677 -360 -2037 599 -491 -1026 -657 -760 1480 -587 -1132 339 300 -735 158 -521 1274 149 -897
1694 -897 519 317 731 394 -1315 1031 815 -1336 364 842 383 -799 -519 622 405 -1569 997
1711I97K98j529r94P32J775j179j967K864j35k057J021O38J74j079n01L183j288
1728I53k397J324J150m94r89l03J870p41r04J278m37l28q69k7J563m74j080Q64
1746d1J41N60j73j697J920l85p32O28J91L88j231l11J667k25j558O78Q70L52j274
1765b32j185K339q15j700J893O98j038j042N08K040j814j399K256n28m32L16m9
1782a84J248p34r17J390m66l80K8j95O38k77q12J406m35j26K83j341J385j86j332
1801a007J301k11k92K17j408K156q41j458K041K6r87L60k71J772j332q37J878
1818A107k7j949P17R03oo23q24J960l86j738M38Q61k94j170K19K374q80q79N07
1837C10l33K15o81l75J928j111r89J275o0J68l48q90J256K38r87K0O75L14m64
$$ plain form
1711 997 1295 -234 -1228 -496 1279 100 -1867 997 862 -1195 -174 464 638 -441 -942 2241 953
1728 953 -1444 -120 1030 536 -453 -756 1114 373 -531 747 310 -18 -887 -914 649 175 -905 -41
1746 -41 100 660 487 -1210 710 325 -407 221 412 800 -431 -742 925 700 -858 -180 690 1042 -232
1765 -232 -1417 922 107 -1593 300 998 -40 -1082 -574 1466 -348 -1747 509 -19 -451 -135 -184
1782 -184 1064 330 -587 803 337 -43 -15 -210 428 151 -661 745 310 184 467 -874 511 325 -1007
1801 -1007 294 83 -209 8 -1400 756 -85 -1543 498 524 -463 -103 -374 1398 66 -771 1107
1818 1107 1080 -869 -152 751 745 122 -702 1258 872 -866 -428 433 139 -1031 -812 1562 682 -197 310
1837 310 -23 192 -489 -864 1064 -47 -1036 239 179 347 -1 -891 365 603 -384 -364 311 625 161
1856A61p54J252L87j792N74Q84o59k03o51J281n97j400J246J066p18j220K52J864
1874I73q83j458K596l07o34l89K24M83k56j478K053o9r39j78L86Q57r98r21J377
1893D39M91j396K70k51J297o67j135J020N21j025N56n83J122p57r33J869R6j086
1911a52M74m41J309o15j756J656M33j593K77R93k40p9j448K002m50r09O70l69
1929b38k5k25n61J608j98j093P48L21o3o11k28J171k25q34N12j70M35J7p75J208
1949G74j1j535J364J5l70n37n46J472m31j505J393J75l84j79k22J123q3j581R64
1968a04J58J4j84k53Q97J66j214R54J77m38Q4l44J004l04k000J572P92j123n5
1987b01m10J252m41j396J374K57o64M7o48J171j52j272J559N48j356p5O40N71
$$ plain form
1856 161 -593 659 1046 -746 -172 712 53 -150 -801 480 -117 -1517 -271 795 77 -1143 -891 973
1874 973 90 -1368 1228 921 287 -102 122 605 349 -1129 924 855 -84 -262 124 981 -17 -938 439
1893 439 930 -466 -196 -447 850 183 -952 68 589 -436 120 -463 659 -98 -1031 838 934 -152
1911 -152 322 -119 1190 575 -1181 475 908 -685 -408 585 345 266 -1182 820 370 -539 131 -238
1929 -238 -263 -488 -1049 559 361 -732 16 337 274 -337 -565 606 381 -453 59 -111 324 341 -434 774
1949 774 763 -772 592 607 237 -300 -846 626 195 -1310 83 258 -126 -305 -527 596 513 -1068 -104
1968 -104 54 68 -116 -369 528 694 -520 434 611 173 257 -87 917 613 -1387 185 977 -146 -201
1987 -201 -611 641 200 -1196 178 435 -229 -182 -830 341 189 -1083 476 1024 -332 -407 233 804
2005H04r77r62K122K94j361mM09M66m26j247J486k08j004N42J38K57p22p47J319
2024A79K56j429O52O14n1l62o48J600k61j465Q10K93O46m75r89J644r3j632O83
2043b8O37m2j133r4J787p59j464J156O86n85j087J31J515m81j642J414O30r59
2061c18k01M96Q27r28q95J983j48j153M42q6P10m59j143J536L04j232J29J11Q39
2080H14o62r80J125j21q34J38K51O08j87j228J425J63j123K1M90J055j005j323
2098a373K185M43k033P59K30Q26j012j011K048j55j543O87P78m30j060p2J420
2115F87m89j576J229K82m01l22J77R05m35p88J026L7n31K31m40J203o61o68J114
2134E80Q6m68J0p36J184j60j123O77L59l64n42k79J369j3j807R93P93o34o08J35
$$ plain form
2005 804 -173 -1135 987 1281 -80 -84 325 791 365 -882 604 396 -608 -66 72 329 -393 -1140 179
2024 179 435 -994 -342 272 221 -141 -789 811 550 -915 -105 188 834 359 -630 1014 921 -711 -28
2043 -28 609 567 -566 -660 1127 368 -1096 60 746 161 -926 -795 720 239 -1403 11 641 -318
2061 -318 -519 -23 804 -124 -1019 964 816 -337 105 19 729 270 -873 663 967 -265 -136 -25 814
2080 814 152 -828 297 176 -658 -520 -269 339 152 -1076 349 512 -611 -590 -100 955 -50 -1373
2098 -1373 812 1255 -778 -19 211 1037 25 -986 1062 907 -636 51 829 399 -661 -733 687
2115 687 198 -1378 -149 133 -268 -590 -413 492 57 -731 295 332 -199 32 -408 795 134 -534 580
2134 580 666 198 208 -528 656 496 -627 50 409 45 -497 -776 593 580 -1227 -234 559 -75 -683 -548
2154e48J472p64j469J565P81j484L8Q08M65j016q62J842M1j540M08Q00o1p67m19
2173g10J532m67j423Q99K16L74n08q26J104k14m72J87K19K53J16j116J628k49
2191E43j038L40P61j90l11p61J355R5j386O97M02l9q49k53J455l13j615O87J137
2210G17q01o26N1J608j211r90J130J184k029L38q6P41R43j584J790p00p07O52
2228D20r94R30K8j214J873k27j069Q59o72L55M96j584O47M32n11l26j71P96l43
2247b75j008J418N17j032N09l70Q37J01j712J546l47p03L98l44J212o98o32J422
2265H39j07j803J137M14K23j087O55j97K43j205O71K61J01k91l70J046j04j194
2283g68Q00J94J88k32o97Q23L82j085L91P6L79q4j061J226jj202O51J00J82o82
$$ plain form
2154 -548 924 160 -1309 256 1037 -447 -409 399 864 -152 -1014 828 869 -671 -263 537 476 -291 -710
2173 -710 822 355 -1068 -169 47 421 -87 -913 191 -23 -495 -308 -89 164 280 -836 792 543
2191 543 -495 -155 606 416 105 -656 699 794 -592 105 507 468 -381 -634 821 508 -1107 -420 717
2210 717 -84 -710 -659 949 -262 -1252 -122 1062 -967 -629 -715 26 969 -615 1175 475 -232 420
2228 420 -574 356 384 -830 1043 816 -253 606 -66 289 785 -799 -152 280 -231 -557 -728 68 -275
2247 -275 -1283 135 652 -380 129 -241 596 697 -1015 531 184 -519 -121 -465 747 49 -583 839
2265 839 732 -1071 66 480 703 -384 271 74 317 -888 -217 44 145 -146 -516 530 426 -768
2283 -768 32 226 414 182 -515 308 690 -395 -4 72 451 367 -694 532 531 -671 -20 80 262 -420
2303d20p21J547K4j543R54N68m76k42k74J516n38j701J509P61q10q9m19J066m44
2322B68j175J241L59j101L24K15K39k43q09Q94N0q23L12j63N08j96r15J212kn97
2342d02L21k38Q97j62j230J065L52p70L48l34P76j32j187J031L61q15p1M40J95
2361D45m32j283J524K52j553P34J96L07l21p60J499k25j239P01K19J81l25l14
2379c94Q83j26r07Q51J70k24l2l44Q86r7j170O79K83k39l01n48R81jj194O76L01
2400A33l01o2k56Q67j11j137P91N63m00j56o15J684k84j092J45R2N28j90j25Q30
2420I04j83j484R59K86p09k36M9O83K1j050J009J12r26J65K66N00k20r13Q29N95
2440F57r29J12M9N62p5q68J041J12r03K57L38J70l94j143J416K56j414K26N59
$$ plain form
2303 -420 -1141 406 430 -1113 -159 409 -67 -309 -583 933 395 -1306 203 964 154 65 -354 712 268
2322 268 -907 334 693 -408 -84 131 370 127 -682 212 262 -561 -249 -412 96 -100 -1015 197 195 -402
2342 -402 -81 -319 578 416 -814 251 603 -167 181 -153 623 491 -696 335 696 -119 -190 250 445
2361 445 13 -1270 254 506 -1047 -313 -117 190 -131 -891 608 383 -856 -155 64 245 -80 -394
2379 -394 489 363 -544 307 477 253 221 -123 763 666 -504 175 458 219 -82 -630 351 350 -844 -168 133
2400 133 -168 -230 -486 381 270 -867 -76 487 87 -69 -684 1000 716 -376 -231 -139 389 199 74 904
2420 904 721 -763 196 482 -227 -463 -414 269 290 -760 249 361 -565 -400 -134 366 146 -767 62 657
2440 657 -272 -160 -111 451 376 -492 549 661 -242 15 353 523 129 -1014 402 658 -756 -530 29
2459B9J03L9j379J571J56j126K73J88L66j98o96J301q8j224Q65K15k8m74m36J064
2479E21J71j316N31M30k56l20k18Q92j8j087M15O16m58j72j43M21P0q01O37O88
2499F03m29l43L03N82n86j632J583O48j115k58R74P30p84J79J07K07j458O22K95
2518B28K49j47j337Q45L09n66N4K23K48l4q47O84M36o51K77K98J2j12j107J378
2538D40K80j261N45L30K72n63p12J167J71j197K34M84J95o74n11J207j72j056
2556h21N91L46q4k53l18J131j68j426J124L02l41l28Q9R40m72p57L02Q69m03k25
2576I8m13O27o5j041O96L11L1j29n15O14m7r64M93N14k65k52j92J101j10j451
2596i59R77Q69r17o2k16J096m85r71J013M56q96j01J74Q74o20r45J160j65p46
$$ plain form
2459 29 132 171 -1208 363 519 -607 -334 -146 220 22 -674 627 539 -685 180 395 367 -107 -543 521
2479 521 692 -624 -93 337 81 -239 -457 435 417 -670 -255 361 -97 -269 -412 9 79 -722 -85 603
2499 603 174 -169 134 716 130 -1502 81 729 -386 -644 330 1060 276 455 562 769 -689 -67 228
2518 228 477 330 -1007 -162 147 -419 -365 -142 106 72 -775 -91 345 -306 -29 269 281 169 -938 440
2538 440 720 -541 4 334 606 43 -669 498 669 -528 -294 190 385 -289 -800 407 235 -821
2556 -821 -230 116 32 -221 -539 592 424 -1002 122 424 83 -245 -156 784 312 -445 -143 726 323 98
2576 98 -315 312 247 -794 -98 213 244 115 -400 214 167 -797 -304 210 -55 -307 -499 602 492 -959
2596 -959 18 887 -30 -92 -308 788 303 -668 345 801 -95 -196 -22 852 232 -713 447 282 -464
2615d64Q11P3k67m88q90J688j56r88O86j51N09j21p40N67M72q04K25O8L06p8p56
2636d98R20P4p60n8L88K23l44n85O56M57j046J51O63q4l59l55R78R0j285N03P45
2657D74l92l01l71J000k61q86R85L29m82j38K82M80q8j190O75K48l89k15kN88
2677C46n95j58M32J20n63K51j3M23K83r30K17M77l42K33n04P73k05o26Q70L09
2697G98j032J94K49M4J52j106J218j55m94j93K74J97l21o16Q76N04j273L80M66
2716A62Q7m61k36Q48O2q74M65K49j74n4l42L52N28q24K13L36k17Q9o54N23J57
2737B35n14J64J63J68m42l59P27L03j188M30M36q4q1n17P88K47q51J89P95o04
2757Er3oO85L6j124N90L39p47P8J24N02k16j079R35K91n98O7M6K95j76n66M44
$$ plain form
2615 -464 347 420 153 -335 -1225 463 307 -681 5 -146 363 242 -498 69 541 -263 -38 30 336 258 -498
2636 -498 422 496 -264 -322 66 289 -55 -640 16 473 -573 -422 241 157 -202 -557 421 511 -774 -271 474
2657 474 82 -219 -590 410 149 -737 248 577 95 -43 239 719 631 -559 116 364 -25 -240 -242 346
2677 346 -249 -407 25 145 -418 -167 -180 243 526 -404 -187 290 -52 181 -323 450 245 -381 489 798
2697 798 -234 -40 209 253 405 -701 517 362 -132 -325 -51 146 -175 -791 85 589 -684 -304 162
2716 162 249 -212 -448 400 462 -412 53 302 128 74 -268 84 612 -212 1 337 120 209 -445 78 235
2737 235 -279 -115 48 216 -226 -585 142 445 -743 -313 123 39 -42 -559 229 476 -375 -186 609 5
2757 5 -88 -94 591 627 -497 93 432 -315 -237 -113 389 173 -906 29 320 -278 -211 -165 130 -46 -612 -168
2779a68N55p71J70J13L44k64l27O14L63r37L14j5M39kp08M84K65p75Q4M28L86
2800E92m14r78N46O48q91K82K5M72n34m83Q42K43o99N0P14j35p4o18J117J25j181
2821c51j0J120J9o21l90P10k9r60N96K98l06l18m08R36j91o88L62K17j67Q7l12
2842d06N46L03q86L14K82o7p3j44K81J95p61L48N59m49l43O8Q87l21r87O24M83
2863D53m53j41m8M09m7q73O71L52k81q6J52K0J46r78P54N41q35J29mL42J06p38
2885d09P74N1m21N4j78L56k47m55L49K76q03M66J42J5J65o81O28L53p65l16P66
2906A20K91n05m31N35O16q19J99J13j2J1n46P53L46j172K85L13J5j20m30P11P9
2927C52r55N01L68m76R1k01M70K72j109N00N17m32j15J69M85Po28J50K68l34O4
$$ plain form
2779 -168 387 -384 -214 -101 243 -21 -348 266 629 -308 6 -9 430 428 -280 204 469 -306 -222 206 592
2800 592 178 -800 -254 394 -497 -215 -190 282 -252 -735 107 350 -349 -299 415 280 206 -412 705 830 -351
2821 -351 -361 759 778 157 -233 477 448 -512 84 382 76 -242 -650 286 95 -593 -231 -14 -181 -94 -406
2842 -406 140 443 -443 -129 153 86 13 -131 150 345 -416 -68 491 42 -301 -233 654 333 -654 -30 453
2863 453 0 -141 -189 220 173 -700 -29 323 42 -44 108 128 274 -704 50 591 -244 -115 -119 223 329 -409
2885 -409 365 416 -5 49 -129 227 -20 -475 -126 150 -653 -187 -45 -30 135 -546 82 435 -330 -646 120
2906 120 411 -94 -525 10 626 -193 6 119 107 118 -428 325 671 -501 -216 97 112 -8 -438 273 352
2927 352 -603 -102 266 -210 -119 -320 150 422 -687 -187 330 -102 -217 -48 437 444 -184 -34 234 -100 -36
2948c6l29P68J76q28L93N02l28n28o3M57L68j247K87O22l98J58o8q1J20k42M60
2969A63N37j148M19j60N51p6n28N94K16o18N2L00J04m7q52O57L62k88m64O21m05
2990a0n3o51P45M20r58K09M60J69k25o86N94O55r35L74L24l50n0j59L72M08q88
3011b35J47L13q7k25l20P46J18r58J81K79n4j31n5K60N26j036M75M28n97K56k47
3032b16M33J62o50L43L56l20J8q8L53m4o38L67L68l21m82N28P4K52j090L38M33
3053A76l83o0J52K76M4q29O04M24p21Q5J61q3K84n51L11N75p54L33N8L90m63m51
3075d22N37L58p69J14M06j5j7q08P35J41n01J49m2N4j08j20N19J26r04O20J03
3096A56K2l47j59P44L0r01M73J88l10J28j61N54n4o91J65M16m49J13k82O38K79
$$ plain form
2948 -36 -365 403 579 -249 144 646 318 -210 -273 184 552 -695 -408 214 -184 -26 -94 -175 -55 -297 163
2969 163 700 -448 -29 -189 362 286 -242 352 568 -50 2 302 406 359 -493 164 526 238 -226 395 -10
2990 -10 -63 -714 31 451 -507 -298 162 331 106 -580 14 669 -266 108 432 82 32 -127 245 653 -235
3011 -235 -88 225 138 -87 -407 339 457 -501 -320 -41 -95 -226 -281 -21 505 -531 -56 372 -225 31 -216
3032 -216 217 379 -271 72 428 108 126 38 391 347 -291 76 444 123 -359 169 243 495 -595 -257 176
3053 176 -207 -267 -115 161 205 -624 -20 404 -317 -232 -71 -154 130 -421 -110 465 -289 44 102 492 29 -422
3075 -422 115 473 -296 -182 224 209 192 -616 119 260 -241 -92 -134 -80 -188 -308 211 337 -567 53 156
3096 156 178 -169 -328 416 446 -455 18 206 -104 24 -137 417 363 -328 -163 253 -196 -83 -365 273 552
3117E52j310O49M20j09m38j31N05K47q04L06N34p10n8L22J50K68r56O87M73n89
3137Hj17q4J87L15q52N10O03o30k46M06J00k34l61K54O78p90J63l26N00J5m52
3158c53N91L88q74L41RJ91j19n10J93N05m81M52k11r7M7k18L36J71p23N4N20j17
3180I5j39m35N44O1l51P3N88l92j96m5L11L37o78J69K09n9j88j25M23K83p44J58
3202a01L71l64J31l26N28J94r10Q6L71P7Q0l02K51J50r26M35O37p33M78j50K65
3223B42o5k51j04O50n75L2K4J04K08p55N46K48m68j7J70q6J78n42K22O02n68j34
3245c39J03L04J29q29O85M65n31k1L67j61j69l74M54M25r13M41L48l77J41o08
3265d60O27K38q81L74L16l79K20m72M83L19m95k76M19r2j43J79J49M47q62J19
$$ plain form
3117 552 -758 -109 311 202 -236 -367 138 385 -419 -113 421 -289 -347 -25 125 393 -563 124 597 8
3137 8 -109 -193 -6 309 -543 -33 570 -60 -306 100 200 -34 -395 -141 537 -253 -90 -416 84 99 -353
3158 -353 238 626 -248 93 102 293 174 -336 -143 362 -119 333 122 25 72 -146 190 361 -362 -308 212 95
3180 95 -44 -479 65 126 -225 -152 436 44 -152 -197 114 451 -227 -58 151 92 -96 -221 202 485 -259 -101
3202 -101 270 -94 37 -289 239 433 -477 -391 -20 57 137 -165 86 236 -690 -255 382 -351 127 -23 242
3223 242 177 -74 -178 472 -103 -71 -47 57 265 -490 56 304 -164 -181 -11 -97 81 -461 -239 363 -205 -339
3245 -339 -236 68 197 -632 53 518 -13 -34 333 172 3 -371 83 508 -405 36 384 7 148 -460
3265 -460 167 405 -476 -102 214 -165 55 -417 66 385 -110 -386 33 -59 -202 -23 126 573 -289 -170
3285a70M70k40K20m96M54L48r02K13J96o3J90l74l5P01p64l9P79m86j95j99L94
3306BK05p54L87N74m85j25R0J59K73q35M16L10m29L96l90N00Q8m64J67L81p67
3327c01K5L79j76p3r8M11m8M0n07O9J62M13o83M54K62k90l81L89j22M99m77J47
3349I4J98o81M07M3K23k42m68O64M15j004J36L81j42r3k50J43M22o39L63J37k43
3370a36P9k60K25L90p50K93O98m51j6j82L51J43q35L12O69n77j18oJ01N88q35
3391c17J33N54m08Pk25M13K11o67J16M99n46q0n7L39N35r84L69L96l81J32K90
3412C29o5J31o38N2N94n37p1M72J52j06o50K49K96n64j48O91m22J10k37P3M71
3433A82k49J58l96J51L01l13lP81o01m1J12j0%J8l0N72j014L79K00j15k03j10
$$ plain form
3285 -170 300 60 280 -216 238 586 -316 -103 93 30 220 -154 -189 512 -252 -291 488 2 -193 -392 2
3306 2 207 -547 -160 414 -71 -196 -106 53 326 -509 -93 217 -212 184 -206 294 382 -82 85 466 -301
3327 -301 -276 103 -73 -146 -244 167 119 159 -348 -279 -117 296 -387 67 329 39 -342 47 -75 424 -53 94
3349 94 292 -389 18 61 284 42 -426 238 653 -351 -215 166 24 -69 -319 -176 246 -393 -30 107 -136
3370 -136 -57 -317 -92 298 -452 -159 539 88 72 -110 241 384 -451 -139 530 -47 -165 -171 -70 518 -317
3391 -317 -184 370 -38 -31 -256 157 368 -299 -183 316 -230 -310 -367 -28 507 -477 -108 288 -93 39 329
3412 329 264 395 -243 -191 403 -134 -205 267 419 313 -337 -88 208 -356 -504 187 -235 -125 -362 -289 182
3433 182 -67 91 -305 -154 147 -166 -169 612 11 -30 82 72 72 90 60 632 -382 -3 197 82 -121 -231
3455b31L50J48n66rM33j39l3n17O70j8p19N60L49k73j2k38K00L33o85J51O06k60
3477A00k13L3L08J04p92K59O38l01j38k30M58j15o03N73K74m44q8J30P0L25o72
3498c24M0O90l78m55L44K30j35K17k18L91n01l2J34K63n8m97J61O02o65R7J32
3519C8L48m35m80N14j7L35o87L28K34k36k37M31P7k70l35L83L19m7l36L80K30
3540E37n81p2L30j35j72j24Q2M03l48n30M42m3P0k12L71K11n23J4M57j16q6j54
3562a79J77L16n00J70N61m61J06k95L2M45p08L45K83m1k09Jn0L30m48j21M84m53
3584b15J05K0K44J21o46L05M71l59l56M9L56N8k09j5O19k70l31L04j7j47l45M78
3606B20P4j75k52L3j9O6j81J35J93o2j88J81k2L3m32L21K92n02k2M99J16m95l2
$$ plain form
3455 -231 119 267 -299 -308 125 -14 -47 -564 106 88 -631 -71 278 5 -7 -245 -45 288 -397 -246 360 100
3477 100 -113 -80 228 332 -460 -201 437 136 -2 -232 226 111 -492 81 355 -89 -177 -47 23 348 -324
3498 -324 -284 406 28 -427 -83 147 12 229 11 402 -99 -131 3 266 208 -289 -128 474 -191 -94 38
3519 38 386 -49 -529 -15 -32 303 -384 -56 178 -58 -295 136 213 -57 -392 -9 310 263 -73 307 537
3540 537 -44 -116 214 79 -93 -217 -135 268 -80 -610 -168 -211 -141 -353 18 229 -294 -280 177 61 -25 -179
3562 -179 -2 314 -186 -16 545 84 190 -105 -73 372 -336 9 292 251 42 43 -7 323 -125 -246 238 -215
3584 -215 -110 -90 154 275 -371 -66 405 46 -310 -261 95 153 -56 -71 548 278 -53 251 234 87 -258 220
3606 220 294 119 -133 -100 -119 -53 -234 -99 94 32 -156 25 3 36 -396 -75 217 -285 -307 192 308 -187 -219
3629b19L86J45n53QM95J10k14k38j36P63k79j02J01m11N16p98K75L05l20KL32
3650A68k86P3l47L56O02q02j44N90l85J53j13K59J94l55o1N17k89l3k83M19J91
3671D24m96J17J06j94l42L74k2J43m04M4L22K51k24j27R1J82l19l5K24k35k16
3692c36N60k13J31k86J9O84n85P4R8l06N38m82j26P21n83m66P96r4m4j90J46L47
3714D03m00l15L45j45P4j5q0M75m59j42J94J48L1o1m2K27l34j35M17j33M5n21
3736d23J45P57o99J70O9k48R8J62o3M36m76j9K65j22k85J6K25L36n17N0L36M1
3758B54j22o0J24Q1n76O6N78m00P2l16L48M4l85M9L94k13k16J56R3K29n54M0O06
3781B92n17L52j63L9J51k50lM53o9l88J70k97N99n27l7N69n03j94K68j39J78l50
$$ plain form
3629 -219 167 312 -241 -233 262 372 158 -80 -216 547 268 166 267 -144 372 -426 -151 154 -166 -164 168
3650 168 -118 -45 -392 -36 566 -236 -380 210 -175 -22 -135 124 318 -37 -98 419 130 97 -186 233 424
3671 424 -72 45 151 -43 -385 -11 -33 110 -294 -250 72 323 99 -28 63 245 -74 -109 115 -120 -336
3692 -336 224 11 142 -144 -125 559 -26 48 146 -160 378 -104 -230 491 -92 -558 238 144 100 -90 56 403
3714 403 3 -312 33 -112 -38 -53 -133 342 -117 -259 -65 83 114 53 11 238 -96 -231 186 53 98 -423
3736 -423 -278 479 -220 -50 19 -229 -131 31 -32 404 -72 -91 174 52 -233 -217 8 344 -173 -123 213 254
3758 254 132 72 196 277 -299 -233 345 -55 17 -299 49 93 -292 -243 151 -62 -278 -122 -29 200 -354 -314 292
3781 292 -225 127 -36 3 154 -96 -99 354 285 -103 67 -230 369 -158 -195 374 -129 -323 -55 -194 -16 -366
3803c66j96R00o74q2N97k30J27r2R4M38m22l33L52N2k30k41M65K43l37j82N08
3824C91l64j82J03M1J66n13J57K71m51K86q9M78j49k45l24N25k86K16o2J31m1
3845E9j25j89M77j66j36l9K44R5n09M35J03k83j80L50mo5l11j40P82l22k74o0
3867b58L49K1m04J82L15k43l38N03K26J3l40nR6k94o5N64j52J10l19r7M86l88
3889c8k33J70J57j20j68r4O53n44L3J61Q0J25n91L92K98l11k89M84q3j4j34r3
3911a59N36l19k61M07j56j97q2J73M93m96k18N55oj79k99M2M03n84N9K22q6K17
3933F5l50M13J16l36j24N42l45n3j49K73N27q72J93K14N0m58J73J42K33m56O5
3954a37P45o15k97K72o5K65k40j32N77j08o36M43j97K4O3j87Q56q11n7K46NJ14
$$ plain form
3803 -366 -562 338 -336 -418 179 -51 76 -16 78 516 94 -239 113 165 -65 -306 159 402 65 -117 391
3824 391 27 -155 -52 -11 155 -358 -201 70 -381 -95 -184 294 145 -100 -424 101 -185 31 -31 100 59
3845 59 -66 -255 222 56 -80 -119 125 220 -289 146 249 -34 -214 136 132 67 -244 -384 398 76 -198 -258
3867 -258 91 112 -292 -110 205 -38 -376 127 353 366 26 21 117 -177 -242 322 170 280 -39 -136 350 -38
3889 -38 -271 -101 56 -64 -232 -326 327 -217 -184 -23 57 182 -409 -17 281 -30 -319 165 82 68 -66 -159
3911 -159 377 58 -203 204 48 -149 -231 -58 435 -61 -279 276 270 91 -208 -166 237 -347 -288 -66 -152 65
3933 65 -285 128 244 -92 -216 326 -19 -72 -221 52 579 -293 -100 114 164 -294 -121 21 254 -202 -137
3954 -137 608 -7 -304 -32 -97 168 -72 -204 373 265 -371 72 -125 -101 -38 -225 631 -180 -237 9 14 128
3976A28o9j63M35l42rK06j76K3l93K93L16l53j69M45j20j99j52J02M72l71j08
3997b04M55k78K6j02J04K20k01k40N91j30k03k64R8N01o57L96K43m32j41J69m2
4018i1L70j81k94L64j69j32K48j05L47r52L90L76j72m03K75J40J51j59j13N43
4038D33l85k35J04j1M74m95j99N16J23l07n3j02J00l52L2N44k89l00M27M4l5j92
4060a58j93R57k37m26J39J66l11J24p3L68l96j87L25O2l92q7L56K01m14j95N42
4081A71k02K26n71O18n4k28k04L67l7M5m56L4M95l24j61M82j88J2J90k09K46k25
4103B7j88K58j30q5K57k38M93n64j75M45q0j40J41K7J20m08NK67n1o7J28Q0O1
4126A83k96j64L05Jn7M9k93N24j76k67M42l38k02J56K09K45m62j12L87Mm20L74
$$ plain form
3976 128 59 -104 331 -11 -20 186 10 33 -360 -67 249 -104 -273 172 52 -147 -299 -197 275 -96 -204
3997 -204 251 -27 -1 -103 1 221 20 -220 371 241 38 -226 -128 373 -284 112 355 -77 -218 -49 -91
4018 -91 279 98 -196 168 -1 -133 115 10 357 -595 -205 171 -1 -404 -129 11 162 3 -110 433
4038 433 48 -187 -83 -94 380 -115 -314 202 325 18 -35 -137 -37 -389 -357 187 -102 -402 25 69 34 -158
4060 -158 -351 606 369 -57 82 248 -63 61 -12 356 -40 -227 98 160 -232 -319 37 238 -176 -371 171
4081 171 -31 195 -376 242 188 -40 -244 123 86 131 -325 -291 204 -120 -281 201 13 25 215 6 252 27
4103 27 -161 97 -33 -118 139 -99 394 -170 -345 100 20 -120 21 48 168 -240 -235 32 -19 -86 42 122 183
4126 183 -113 -277 28 29 -28 21 -272 252 76 -191 251 -87 -289 -133 76 321 -141 -253 134 138 -282 92
4148I2K92m13j94j61M31M2j06L97k71Q9j36K5J42r2j81J94p7K86m15k34N59l29
4170f0k26K93j4M1j71j75L74k42jL08N4m16KQ4L24j68k44M57k6k26j78K70L69
4193D29j91P2J42l29j84K06K11j50M30p20J98n0Nj86m4J62P1m27L37j31o1K08
4215bR0J41l22k62P41n80O8J90J74k98J65m1K57j65l01K99N8j17k33o5M25k19
4237Cl00K64o7K50j69k97M39Ln94M26J06ll44J39N95l11n39M74L9K08j95k97M41
4260B71k32k16J89o0K88m19P1N06n17J0K39P1k58J09k14L77l61k0L53j56n2j29
4282a50J04L49J1m59M24k63jm3oN72l44m61L61N4k21q4J50M17o87RM37K6l17O9
4306e3K2O8L3l67M47r9n14M01J35P7j23k65M09k4k54M15m63K29j14k38N96k07
$$ plain form
4148 92 384 -29 -223 -384 47 89 -17 380 109 198 62 87 229 137 -44 150 73 359 -56 -290 269 -60
4170 -60 -286 7 -7 34 -137 -312 62 -180 -181 127 181 -235 -233 -149 175 7 -237 220 194 -32 -210 60 429
4193 429 238 310 452 123 -61 145 356 206 636 -84 114 64 69 -117 -161 1 72 -355 -18 -149 -210 -2
4215 -2 88 229 -93 -355 386 -194 -126 64 238 -60 105 64 321 156 -145 154 212 95 -138 -203 222 3
4237 3 -297 -33 -100 150 -19 -316 123 126 -468 -42 64 61 -283 -144 451 140 -399 75 114 322 127 -170 271
4260 271 39 -177 12 -48 240 -179 -108 398 -119 -109 130 201 -57 52 -162 215 -146 -166 187 31 -21 -150
4282 -150 -46 303 314 -145 279 16 15 -28 -34 538 194 -267 94 148 -73 -157 -7 410 -277 -268 169 195 -122 -53
4306 -53 -31 37 70 -297 150 51 -463 -62 73 150 27 -238 171 147 -107 308 -155 74 -40 -278 318 111
4328A11k48J30j11K28l48M0N53m51k01L15o5K13l89n9N92l19l28P25k53Lk00l8
4350a00L30j49l18Q6J24r0J24RJ33l30j0L80j55J37k89q0L89n21J28J79l7K67
4372B07l03O4J65J2n77P20p8j74k87K94Q9k5k93N02j00j78J08l36M56l58k81M78
4394A05K5l96J42j13N22n84n2M49K54n08J92n4Q4k26j4N01j79l95M32L6J90m54
4416d3k2L45k06m43N23r0J13m19J79K10k18q9L75k94O8J06j74L49k45k99L73n3
4438D6L7L8o2N50k97l87K35k23K48k72m9J27J53l15Q5M3n5k13J3M80k93l61M62
4461a0J29m29L64k0Q8j52k36L91k68K50l2j4J54O6m00K05j79k66k6M48J09n27
4483c55k26O38J99l57K79k93M88o27k42J135o41r5j9O07o04KJ12K61l15O5K74
$$ plain form
4328 111 -137 -7 -118 110 -238 -198 355 -96 -297 18 -47 166 -223 -282 310 -9 -337 388 135 138 -62 -100
4350 -100 230 81 -237 -151 -27 -117 7 16 149 -181 -191 189 34 171 -118 -198 191 -330 -202 -23 -60 207
4372 207 -96 -32 133 145 -432 288 210 36 -251 43 132 107 -186 316 216 38 146 -190 266 -92 -373 105
4394 105 130 -266 -124 -237 285 -299 -351 98 352 -156 36 -18 66 -160 -174 327 148 -247 185 221 411 -43
4416 -43 -65 280 74 -369 154 64 177 -242 -63 147 -71 -160 215 -79 -11 95 -79 270 25 -274 99 46
4438 46 83 121 59 609 312 -75 160 -63 185 -87 -136 -9 144 -171 -86 -43 -98 -311 -298 182 -111 -472 -10
4461 -10 119 -310 54 34 122 -30 -266 125 -143 107 75 61 215 281 -119 86 -93 -359 -385 63 172 -355
4483 -355 -581 57 256 -101 178 -115 373 -254 -496 639 -2 -97 -116 491 -113 -111 1 262 -53 12 286
4504B86m81O99p23l9J021o29j74L8L93q8n71m58O23P6l67N40O4l05J3O27q9r9
4526C57j277M58N8K8O41q18J095K44r04j48R41o71M16J018p06j37o01O47m82P7
4546B36o15P56k99j44l71N42l16J31j74J00L13P7o36N26k01o4K29n1p7o3j66L59
4568I2J0j68P0R6K0r1j68L22j96j27K31j32L16j35k02L15j23n97M42n9L75j47
4590A44l15K62O7k80J34M70k64Rl65K36Q4j84O6j82K26l2k15L16j31k67L32m7
4612F4k7j21J26k0K2k77J20J64j8j36J95P3J24n30M14Q0j47k5m67P32l45j60M02
4635B43j19l1l3j00K75k51l30L66K18l09k31J32K79q8k85K88Q1m02K8L09J91k59
4657b8j77N55k65j30K9K06K05l87n76P68k05K29k86K7j14j96k62P00J53m66LK56
$$ plain form
4504 286 -195 504 -219 -258 763 134 -40 -2 391 303 -268 -726 -103 -27 -394 146 210 -95 -82 545 456 357
4526 357 -920 -462 -404 -376 265 -553 542 786 -118 -266 675 4 420 1438 732 595 -6 641 159 236
4546 236 -379 377 78 -66 -437 105 -211 -80 -254 -154 159 236 -400 126 -75 -139 90 39 -38 -101 -267 92
4568 92 102 -66 4 100 120 29 -139 183 -13 -140 91 -41 275 140 -62 253 130 -467 -25 -84 291 144
4590 144 -171 91 158 -122 12 482 218 227 -138 98 182 -2 64 -118 108 76 -139 177 46 -221 111 64
4612 64 37 -84 42 22 44 -233 -113 51 33 -103 92 165 289 -241 173 253 106 81 -386 346 1 -159 243
4635 243 124 93 60 -40 235 -16 -346 20 238 -71 -302 -170 109 21 -264 24 105 -297 -269 40 231 -28
4657 -28 -205 350 85 -45 -16 190 395 8 -568 200 -5 224 -62 -35 -149 -345 -607 93 246 -220 -217 39
4679C9p1N2p0K8K63p10L89L2k00j73l6J172m26m11j2K45n22O05m18K28j46j8Q8
4702g2N42k23m67L01J34j74r8Jj8R3k09K32J14n8j47K50Kl70J55k72L87K71n98
4725b24M02j42k88L34pJ44k48j98K32P1M3k32j35R6J14m29P98o06PK24p6J69N6
4748A05k02J98J0j69m6j38L19p8J6K07J18j67m47K55K11k31N5J38j27k01P5k2
4770a21M3K68l59J87Lk56jM00j13k84o4J46J39k22L48N2q7k32n2L58l2m51M53
4793A23K9j20j42Q8K84k72m76L59M8o4J51r6J74J43m79K05J66k80K8o2L31k9k3
4816H6k9K81j82m18N58l20l4k20J93k5O9J68j84J57J12m68M11l7j5m1l3K96l21
4839Dj95N27j09k91l9P1K71l13k06K49K40l46Q8M2J74k29J69m3p5j27Q8MK16m31
$$ plain form
4679 39 -32 20 -50 -22 241 -469 -80 -48 -248 -421 -457 715 289 -122 -134 111 -411 194 -224 4 -142 -160 -72
4702 -72 470 247 -220 81 215 41 -57 -56 -74 19 -190 42 156 98 -49 201 203 -167 -12 -284 103 374 -224
4725 -224 178 36 -252 82 75 219 -29 -227 5 76 119 -113 -248 -152 -38 -467 331 -275 -268 -44 -120 49 105
4748 105 -97 101 111 -58 -104 -242 77 -1 15 222 340 173 -274 -19 192 -39 16 154 27 -174 -99 -121
4770 -121 -78 190 -169 18 21 -235 -236 164 51 -233 -297 -151 -12 -234 114 166 79 -153 -205 153 121 -330 123
4793 123 152 32 -110 -22 262 -10 -486 -127 -79 -143 8 -88 86 229 -250 -45 121 -159 -131 -193 138 109 86
4816 86 57 338 156 -262 296 -24 -58 -278 -85 -110 -41 127 -57 100 212 -256 155 118 103 62 29 325 4
4839 4 -191 336 227 -64 -103 -32 239 -74 -280 -31 209 -137 -49 -7 167 -62 107 64 -11 -138 -50 -46 170 -261
4863b61J02L16M2k67O4r3J56Q0j45L21k43m4L08l25K04k48o5O21m03m33J42L36
4885A65k5n6l71O68k97o51M78K20k93o9k1K97J07k56J05K13k62m8N0L96n63J2
4907b01K99p8m5J60o1J99j05k28K13k99N1q9P5O9J9k6P9J79l02j92K59mk16k24
4931d68P11j24j63PL17j25j62j49N0K87n2n8N3j8p1k59L42L5k69J74P8j2l41K9
4955a88N54m13k76K12M28k81L0j55J86j62l94N28K08l53J78k13J74J20k34J22
4975G1m0j51L52k61K64r2j66P8rlj31j88N42l49j38O6j15M21l24J22p9L42n33
4998c21K77p2l06N01k85M57l12q7RJ1N0O3M9J12o7k0J96Q3l28j86K33o5k54q3
5022c45L54J40n89K05J08L78p93R35k20q5n66N99pL27o56K2L35j23p3J24K1N8
$$ plain form
4863 -261 -159 157 199 -68 -4 -97 59 139 -6 315 72 28 336 11 215 -33 -98 523 120 -313 -171 165
4885 165 140 84 -287 381 84 -567 -89 131 -162 -231 -252 45 152 -104 1 214 -48 -96 -46 350 -213 -201
4907 -201 98 20 -25 135 74 273 168 -60 153 -146 -95 -184 -109 -40 -21 -47 32 211 -91 -283 -24 -28 -244 -468
4931 -468 243 119 -44 -37 280 155 -7 -156 -106 181 129 71 124 106 35 -224 118 153 -116 58 136 124 -217 -188
4955 -188 366 -47 -323 -111 317 36 66 -89 97 -65 -459 69 277 -76 102 -111 63 183 -51 71
4975 71 31 -120 232 -29 235 143 -23 55 46 43 -88 -276 266 -83 -221 -155 -270 151 -173 -51 -130 212 -321
4998 -321 -44 -116 -422 79 -206 251 -61 -148 -139 -128 -78 -15 34 146 79 59 255 338 10 -176 57 -8 -262 -345
5022 -345 9 149 -440 -235 -127 251 -542 393 173 88 -478 121 114 441 -215 -193 142 19 -54 70 91 149
5044A49j2l49K16O2l58J88L67k37k07Ol6J48q7J90n6J86k58mP7K29n26L39P1j
5068I7j25P6O4J92n46K62K7j88J83j09K17n1l12J33K85k96O8m8K31n3k93J64L08
5091B86m07oJ22L9J08k16J92M5j7k27r7L76K5m02M24P0km53m30J267l75o50L6
5114b92J96J13J36l21O3L44k05o7J159j118L97o61K12K6k93M87K80r38P41m10
5134a51J13oJ19N09p88l1L53k05J78l63l6J66Q5m74Q04k11o0k29P57l27m51R04
5156F56p11k4N96j124o2M46R60r76Q49l08j180J257l0j70o68j92K80J08J53k83
5176d23M19L40j35l71k6M45j269J072k50K08L37q16O54o2r7Mj3O4o8j27J43J38
5198A67K1k35J70Q1o3l96J28M0j26K38M93l00l26M11J75k55l39K4p6J89k04J38
$$ plain form
5044 149 137 -212 4 66 -292 -104 263 26 -181 -175 -211 -63 -150 40 -16 170 -88 -92 -15 214 -312 27 98 97
5068 97 -28 48 112 304 -242 20 47 -141 42 -67 150 99 -213 -80 205 -91 -23 -71 160 107 -186 -22 286
5091 286 -121 -127 -5 34 142 -74 118 163 146 -81 -178 198 223 -179 245 315 313 -140 -570 697 322 -328 -292
5114 -292 -96 17 153 -168 -105 239 34 -33 1126 8 405 -256 -44 -18 -311 176 456 -482 259 -151
5134 -151 -38 -44 75 584 -204 -235 118 -87 91 -272 -308 -142 -57 -531 273 62 2 -227 530 203 -248 656
5156 656 -55 -79 517 -607 -669 -223 737 -239 610 302 -878 379 349 179 -489 -681 -401 -293 -140 -423
5176 -423 -4 336 201 -170 -196 249 -1020 52 -198 10 347 -469 185 123 26 30 17 81 13 -114 29 167
5198 167 188 -47 123 204 141 -255 -127 -87 -213 25 518 218 -108 303 478 223 -116 -92 -168 21 -183 -45
5220d5m6j2k13L09J76l09M91l18L37k54m7r6J80Q2k91N2K34j47j33p6L7k1J46
5243C6n17N20M73p26K17J42k81J00K46j45Q01j169j36L90k31M08M48m7K10q59
5263a20M12k59N26k49r76J256j12p48O45o33L99m17J86K38p32J013q89K42n69
5282g87R67p41N28K4l21J022m85q99J494q15N79q86J40M84l80n79R92l71K63j89
5302D0M99L55m44j9K74q35l33P02p38L00L45L1n28L89L89K75J5K60l56n19m93
5323c91J737j155m23l6L53m47l91J914j22j232m20O27m07M07l20o82N36N8J71
5342b23J21K20K25p16K34l45R68m91k32M29P5m17N26K39n48K02J82K37k12j272
5362g98P38N39l40o34O1N92J07q33r7P21o69O12M00p34J89o43J071n31J85l33
$$ plain form
5220 -45 -91 -103 -316 -7 169 -140 351 33 370 116 69 -27 153 235 -56 -4 230 83 -50 -126 -89 -110 36
5243 36 -481 39 512 -214 3 145 -136 -36 210 65 866 -303 -439 -49 -280 128 576 529 739 -120
5263 -120 292 33 559 310 -666 590 478 -270 375 -258 141 -276 -90 148 -584 429 -460 -218 -787
5282 -787 180 -561 -33 -9 -330 692 207 -692 802 -13 566 -320 -180 304 -76 -655 337 -34 229 40
5302 40 539 894 450 431 705 -130 -463 239 -499 -199 146 177 -351 38 427 702 717 977 621 102 -391
5323 -391 1346 191 -232 -268 85 -362 -753 1161 1039 -193 -613 14 -393 14 -306 -988 -452 -394 -223
5342 -223 -102 118 343 -373 -139 -484 484 -7 -239 190 265 -152 374 613 65 267 449 686 474 -798
5362 -798 -60 479 139 -495 -434 158 265 -568 -665 56 -613 -1 399 -335 -146 -789 282 -249 -64 -397
5382c97L76K00K15p48Q32l67J9Q5k52j47o2P68n04j22m3j26O6J75J047q06L26
5403E35L05r36L77l13J09R33j599J324n27m30L5O01n01K11m04J91P05q13Q82L21
5423A006j759P71Q39l11k51p24O20p5K32p20j53J450k91q06L8jJ39k0n7P6j53
5444a50l81P78j47k27m9L05k22Q2j20J98J46l21P0l1N5k3k81L89Q3k48r3K21K9
5467F3J4k69L66J26l35j65K21R8J14n82K70L19m94K73j75J96o1r6O3J15k73k3
5489b35L20j51J98n99O10l2o34M95j27M14m89K84m8K33m64J13K11l8P6j21K13
5510B29q7j12J62p7jj95j95N35j14l69K14J85o06N64j26J63O6j67o0p9K14k04
5532f0k82N05J54n87K12J65k89N88q63L75L69q85O60J89l44J96Q5L4j05l29K41
$$ plain form
5382 -397 -21 179 394 -354 478 111 130 215 -37 -184 -246 522 18 -104 -147 -273 -207 -32 1015 209 535
5403 535 840 -96 281 -32 77 1010 -589 735 208 -222 -187 414 -87 124 -280 -89 616 -197 685 1006
5423 1006 -753 18 857 546 295 -429 191 116 348 -372 -525 925 634 -172 -134 -135 4 -16 -73 3 -150
5444 -150 -531 247 100 -127 -176 129 -93 -11 -131 67 213 -108 -38 -69 -14 -37 -318 71 154 -94 -187 34 63
5467 63 77 -192 174 300 -35 -200 21 119 233 -349 -79 240 -254 19 -156 40 -21 -117 -54 61 -212 -235
5489 -235 85 -66 132 -467 143 111 -523 -28 -155 259 -230 54 6 239 -225 -112 99 61 137 16 229
5510 229 142 30 192 115 114 -81 -276 259 145 -224 -10 175 -431 133 7 170 236 69 9 -70 144 -60
5532 -60 -342 163 317 -270 -58 107 -182 406 -457 -82 287 -598 62 251 -93 103 188 222 117 -212 29
5553B9N72p29N34o7l86L20n59K28K01n48M11j58K92L0m56M39J98n10J95p9J43
5574A00j98M6Q5K1j39j25R7J16j39L59j78j87n4J93j22p9J08n2K40Q6l55k15M76
5597H4j65r2M32L58o41o0K41k61O53r45O54j72LK04j96p43o7O85N75p0m01m71
5619c95O62m29P51m16RJ23o16R6K96K83n37L93j179O66K52o7J64L08k84N5M77
5640F12K82o73k52J42j43k83J196p79R1k7l21P05o55k32K86M7K22l62M58n81m1
5661c08k93J24L73Q93r39m0J195r79K82m81L66m4l35J27J05J54M2r86P36k26j74
5682d08Q47m1m15n48NJ180o46L30r24J390o46K25Qk21J23K25k86k7N01q07N85
5703D50p84P43mk10m46K80j84J03J82Q33j168L97k00J38p39K29N47l9k07j08n2
$$ plain form
5553 29 601 -128 406 339 -47 273 -286 -58 143 -405 6 -152 140 170 -286 153 351 -159 36 -43 100
5574 100 -98 -52 33 54 -85 -210 -113 3 -136 223 45 -142 -196 -3 -125 -204 -96 -148 92 178 -177 -392 84
5597 84 -81 -173 259 617 -24 -84 157 -104 549 -396 258 86 89 293 97 -646 -713 -28 547 477 76 -395
5619 -395 267 -162 589 173 182 305 -311 -215 81 364 -173 220 -959 -293 -41 -108 56 364 80 135 612
5640 612 894 221 -31 111 -32 -315 881 102 193 166 -155 550 -105 -337 -51 -4 218 -144 314 -267 -308
5661 -308 -601 -477 -104 789 -150 -190 1005 26 308 -173 193 149 -186 -59 46 200 242 -744 -8 -234 -408
5682 -408 439 398 -17 -565 -560 620 -26 304 -620 770 124 349 357 136 259 484 198 171 672 -135 450
5703 450 -334 409 405 195 -251 29 -155 -52 130 963 -205 192 -8 130 -609 -380 167 128 -79 -187 -239
5724b39R7M26%Q1j86J41n01L35k17Q9J85p3j93j50J17kl04L72k71r1N07l91K51
5747a7n35M83k5K20J44n77N5O10m73J52r1J32M25N1j462J699n11J40p84l02L19
5768c47P18r0o80M04K52k43L61k56l01j89R28l82n0m72J92K03J33n4j80K69j16
5789A00Lj60Q1j49J49o1l39L16j30K90L00n34M15J14k48o2j16J25j29k75K20J70
5811H0pj84K21N07m69m58J122n01L54m45j62P2L16o24J70M15j003Q62R3n56N52
5832C55q77P05K16Q6o33J25J51n24L27K8o92m06J819p28K81K01o76K08K99l94
5852a29m9L09o65J303r30O4J17n52P44k95K35k0K96r5k90k80J95j88k48N32J39
5873A93n2k37k47J46O18o23J47n9pm10L37K5O09r0n80k3M44k16K13J48l2l86N0
$$ plain form
5724 -239 -142 284 284 365 179 320 -181 154 -63 26 211 138 -55 -205 -88 -90 -394 -22 -293 -384 123 -268 -17
5747 -17 -552 -69 -94 126 270 -307 -252 358 -115 37 -54 78 503 554 -908 791 280 420 -364 -666 -347
5768 -347 371 281 -399 5 257 14 375 119 -182 -371 557 175 125 -347 -155 48 181 127 -53 216 100
5789 100 103 -57 24 -125 24 -37 -376 -60 -190 100 400 -134 281 395 147 85 -31 94 -35 -310 -90 80
5811 80 73 -111 110 617 148 -310 812 311 665 220 58 130 446 -178 -8 407 -596 266 359 -197 355
5832 355 -522 183 399 485 -148 -23 128 -396 -69 -41 -733 -1139 680 -48 233 434 -242 -34 265 -129
5852 -129 -178 131 -534 769 -161 -97 20 -532 212 -83 152 132 428 333 43 -237 -42 -230 -478 54 193
5873 193 141 -96 -343 -197 421 -202 -55 -114 -121 -531 -194 -169 440 350 -230 -253 191 -25 188 336 304 -82 -32
5896c2l11N55K1l63j46N36p39L57K05J03o53L91P19n98l53n1o89P28K47m23K04
5917b92P38M87r87M71n41n12J67O73N84p32q02J133q57M70o24R08J67j26p56l75
5937h06R11J165j977N16O27p45l04L52N27j91p3K97o07j91N59J34M08l17r73J140
5957D52m61q8j51L75r26K79L00L61p66M21L16M0L79r71R40o95K01N8l35K66L62
5978C57o77O3N58l25o01M23O36p7l41l44L20J95r10J109l98o42M37O75j25p09
5998c76J36N05j24R4k98L75K26n46m8P48j11r95J00l3M04o18M65K41j23o01R05
6019C26j31j46J7l04P4J42k09j25J39P54l42K77j62m67o8K02L99j408Q22r36N22
6040f24Q59n92k42Q26m69J02o4k01L16K6j1Qm98R58q71M45K79j76p8K73j51N6
$$ plain form
5896 -32 -343 212 233 -130 -276 260 -479 -122 83 186 -467 -76 643 45 -308 -359 -1048 -320 -73 -496 -292
5917 -292 446 933 -54 417 -124 -636 -469 204 788 56 -746 387 -470 0 -624 284 451 325 -431 -806
5937 -806 105 1270 -707 -191 436 -309 -613 -261 266 75 2 299 -308 -499 60 194 602 285 -688 452
5957 452 -9 -97 -248 127 -799 -520 -220 141 -625 -204 112 152 531 -440 500 -195 6 64 -271 -5 357
5978 357 -320 -257 301 -24 -625 -202 434 357 16 -328 -8 187 -723 386 -12 -654 -217 458 333 -376
5998 -376 -240 265 141 235 -63 312 538 -8 -56 692 581 -414 -314 -347 57 -561 -96 145 22 -579 326
6019 326 195 49 66 -238 -164 -22 -231 -356 -217 537 195 472 310 -157 -225 -23 376 -1032 -210 -1146 -624
6040 -624 235 -357 -599 227 -242 -140 -204 -405 -89 -63 -74 -66 -564 394 -477 -32 247 71 -7 266 115 171
6062A71o16L87K55r06Q26k56K03l04j05J79j35m31J444j12o85O39j21p48j53L44
6082a24J25l8K82r62J679j316n33O28N47m58j017J433p53J411j945o2J686o03
6100b0m66Q34k48j18J89O47P36q23q57j89k16K57n97P98p11J247j97J63L03j470
6120g38O00M9N75m87R7l62L59M21q04J32N99r70k74K34j85L48P95k26N67K93q17
6141B06K49K97p2q36o4K15O52j041j31M05N8k46n57Q53J2Q0m29O27k2l75k0p30
6163h69N95k3q15J069O47j200Q1N18M37o57L26o25N8L73n02O30o56k8J51J362
6183H72n63j338Q76J74m96N63J62P7l66K82o90K33K61N74r5m09n22j7K69k60R02
6204D89r90M38N30m96r7J408j361O82n00o2j23p60M19J86P79o51K30p13N54m31
$$ plain form
6062 171 -445 -58 197 -709 117 -139 64 -240 -345 -166 -301 -732 712 600 -85 554 433 -315 -468 -124
6082 -124 1 -37 245 -717 962 -354 -887 -259 288 -170 -1187 246 -507 904 -1041 -1103 583 -20
6100 -20 -486 348 100 -18 171 818 1554 731 -126 -315 -531 -274 -871 -73 -784 463 266 429 732 -738
6120 -738 -138 -89 486 -1 96 -266 93 514 -290 -158 441 -529 -803 -569 -754 -406 389 163 730 1023 206
6141 206 455 752 680 -156 -220 -5 647 -394 -525 -120 -62 -308 -865 -12 0 80 -349 278 256 -119 -139 -869
6163 -869 -274 -297 -1112 -43 604 -596 -515 3 440 -217 109 -516 -458 -85 -587 43 -613 -641 -490 872
6183 872 309 -1029 -153 21 -475 88 250 327 -39 243 -447 -214 47 621 526 117 -405 -422 -153 -413 489
6204 489 -501 -63 467 -29 -126 1282 -79 603 103 41 -82 -842 -423 -237 542 -109 121 -592 -38 -469
6224d69l85J333j050M68K86o21J75N13j09o13J82n84J072j36q6K4K39M65k55j03
6244C46r26J012k7k85o38J384j027N27j9l38m07o89J294l47J06o09Q73l51J16
6263eK5p6R3P0o65J12M46L54m49J71Q6o2k23J8M53m22k81K19K50l44j29n59R14
6286dj65L84m58L25l15N55j33j81J89o98Q8R97r49J72Q06m85j35L82k00p46N15
6307e6j19M12o11L68k62J09J53j34J90k74r5N35l25K74O5p56J068l79j40n20O23
6328A26K0j18q0P4M46n74m58N34l14j7K21N38j3o86N63l1m05K63l28L54m29K83
6350c1M7N10r63K61L12j37L95l80o06P04Lk55j57J48L15j55l73M95KR2r58N21
6372b10K17j72l04J155r18J22N60p78J641j004K13m20l0J69p71M30M14n36L35
$$ plain form
6224 -469 -854 479 -571 -103 183 -438 -263 250 141 -472 -290 -874 198 62 -24 0 239 704 449 346
6244 346 -580 432 405 120 -518 866 -161 366 347 9 -398 -1087 207 -140 -34 -643 230 -121 -5
6263 -5 20 -56 37 107 -558 -446 0 354 -95 76 162 100 -123 -105 348 -74 -355 -136 114 -230 -359 -918 -4
6286 -4 -169 215 -243 82 -233 322 189 8 197 -501 -413 584 -365 -193 613 128 -7 375 175 -571 -56
6307 -56 -175 237 -374 -6 -268 -159 -6 -140 50 -224 -319 216 -109 165 230 -526 542 163 23 -497 126
6328 126 146 28 -52 22 468 -106 -564 -30 -344 -361 -140 398 385 -301 262 231 -174 89 -239 115 -314 -31
6350 -31 16 526 -437 -176 136 -1 394 14 -592 112 115 -140 -297 -149 166 11 -362 133 135 227 -731 -210
6372 -210 7 -165 -469 686 -232 -110 450 -328 1313 309 522 102 72 241 -530 -100 314 -222 113
6391A13m5K97p24L56K67J10p17R91n74%K25k53L91q75l63P89J44k29M47m14j98
6412b62N73k98Q34n04L45j87j200L72M31m54L33J101j365K17P9O1Q13n93P9L46
6432G21j047J32J26K78Q9l01J98M80r39M87l39j01L00K0m20J86l6p83N17J046
6452F14j322L40J72O68n91O78l06r65J211K11m09n39k10R98r2o13O50j54j201
6471h60J235m78m25L72o09Q43m62O38m00m49J016m68j54rL23L88o36MK30k15M5
6492g1m2m43O47n62P52k27Km47J05P57K06m13n35j51K60k21M74k40Q7K00l05J8
6514a49q3j24L12J06J10J87n11K27l83R05q6k60q53M73l6J85K6p50N10J06K34
6535A46m63P11j376P23n02L28R22p96J047p11NL63n26L9o1P61p52l88M66L65K60
$$ plain form
6391 113 68 365 -359 -3 264 374 -343 648 74 74 299 46 437 -438 -801 -12 132 -97 350 -64 -262
6412 -262 311 13 847 343 688 501 -699 -327 104 -350 -17 1084 -281 -64 15 76 889 296 375 721
6432 721 -326 -194 -68 210 299 -2 196 676 -263 224 -115 -216 84 104 -316 -130 -166 -949 -432 614
6452 614 -708 -368 -196 472 -119 559 253 -712 499 710 301 -238 -448 550 458 -155 495 341 -860
6471 -860 375 -103 -528 -156 -765 78 -384 254 -146 -595 421 -47 -201 -210 113 501 -135 -131 99 -116 -71
6492 -71 -113 -556 91 -471 281 54 56 -391 -286 471 677 264 -271 -422 -162 -383 91 -149 -62 138 -167 -149
6514 -149 -232 -356 -44 62 172 359 -152 75 -308 597 511 251 -602 -129 -165 20 46 -704 -194 -88 146
6535 146 -317 394 -982 -259 -761 -433 489 -307 740 29 34 397 -129 -90 -151 610 -142 -530 -64 301 561
6556E61r07p56R67L88l64l19L65O3Q4l08j91R9L24JK49q45L02L83o4m52J54L55
6578H9O52K87k53j015M76m24o19R77L43j085K6J493L6k83j279R68j116N95J22
6597a0l0j94p01J662p86m33K38K63J85m14m19Q5K44P2J51N79m52q2j09k52K86
6618a17m33J03J77J5J16M89k24N02q96K07j07M85k15m57L83l3k80Q5K98j44k06
6639b52r4M89k5J98o88O12J20m89J75J57p1k98m2J76O71n30q51J004k93M75o74
6660b30l16Q39j91m53Q50k63j43k60l44J077j041N68L28q7K28q24L07k80J45l7
6680a27o1M55n00M86p23N41K2k86N6j89J30m2l03L93J47l72O52j82q34K42N72
6701G7M78o12K13K55k15m02P0r9K95l30M92n81O63l32K12m74P16q3l53K58L8l54
$$ plain form
6556 561 -346 -1102 -135 253 -111 -430 -65 -2 82 -226 -417 -318 6 7 256 -589 -287 96 32 -420 -266 89
6578 89 741 1028 775 -240 236 -188 -807 170 513 -572 -546 947 983 700 -579 389 -727 -132 -10
6597 -10 -40 -234 -935 727 -59 -492 -254 9 194 -220 -639 -554 -310 -238 -87 492 40 -42 -151 -403 -117
6618 -117 -550 -447 -270 -255 -139 350 126 628 -268 -61 -168 317 102 -355 28 -5 -285 -200 98 -46 -252
6639 -252 -346 143 118 316 -372 240 360 -129 46 203 132 -166 -208 -32 639 109 -742 262 -31 444 -230
6660 -230 -546 293 102 -351 499 236 93 -167 -511 566 -475 93 421 334 562 -262 45 -235 -90 -127
6680 -127 -188 267 -233 253 -470 71 93 -193 -137 -326 -196 -238 -541 -148 -1 -373 279 97 -737 -495 77
6701 77 555 -57 156 411 196 -206 -136 -235 60 -270 222 -359 304 -28 184 -290 426 343 -10 248 286 -68
6723f8K29m28l63K61J23N82p3k85K25K26r39J019k62j73k29o95N68K91j82j60
6743c33n8N98m96j01K61j08J44J9J02m09P08p10O35m42K2J1k18N70n35O3J57K13
6765I3j68K13k55L78j82K0j9k31K16L5n02M96r37J142O3J50J2j109R88p03L46
6786D6j55N70K70j317J066K79j059R43r39n17P84K57J45r98M01l23n5Q38R7n35
6806b02K07N89j516J031l62L62P2n55P71J73l81m02L09j299J211L0K21j67J69
6825B61j01J54l72M26r56K49O41j85j49J02l64P04m36M57o57K15M90j56J98o69
6845a48K57L56J19l86J0k64J29J83l30L05n43n99r19J185M45r5n13J06J72J37
6865c93j3P71M08o71K49k16J33m79k2J67P57o30K19j24m42k80P84K99m04oK63
$$ plain form
6723 -68 161 -267 -630 -369 -246 336 263 -22 203 429 -510 509 247 74 -155 -850 -282 9 -173 -333
6743 -333 -391 207 -289 -390 -129 -237 -93 -74 28 -381 327 -383 252 -190 -168 -157 -375 195 -340 -277 -120 93
6765 93 -75 138 -117 261 79 99 80 -151 65 100 -402 94 -843 299 362 512 524 -585 403 -300 46
6786 46 -109 461 731 -586 480 759 -300 643 -296 -813 -29 228 373 -625 -224 -547 -602 236 333 -202
6806 -202 5 594 -922 109 -253 109 181 -374 397 570 189 -213 96 -1203 8 38 259 92 261
6825 261 160 314 -58 368 -588 -339 302 117 -32 70 -294 410 -26 431 -226 -11 479 323 521 -148
6845 -148 109 465 584 198 208 -56 73 256 -74 231 -312 -911 -1830 -645 -200 -295 -808 -702 -530 -393
6865 -393 -406 365 773 102 351 135 268 -211 -233 -66 691 61 280 156 -286 -566 218 517 113 107 370
6886C70L31O70j891P81j150J388N6K02L20j259n86O81L21M63J99p25P84l85m92
6905G8J4M14j88n54M90o3n22N92n30J75J75n17O16K49o92O4o0J09M79k52N7k71
6927a37ln16N89k01K72j478J409M39P13j215k87L07L36j15k5L05o82M39M17M07
6947I74j408K5R5j25R96p84J093o25k50m10K02L06n04K62L89J37j16j25l01J95
6967B6o81R34k84K42j19l27N26j56o8J22l1q5l62K6K53k85K03j6K09j83j66J2
6989b10O02k33j82OJ57pl3K5j11j45K11j94L05j15j32J38K6J33k63K5O2J7o7K76
7013B91j42j80J41j99n2J98m2n2J2q7M3J96O2k12J58L1j26M9m47L17q1Q1o5K18
7037A12n7p5OP4J87k40j06L23j36m29N77m72oK07o8o8O4P7j96K92l0j27j26qN53
$$ plain form
6886 370 701 1371 -520 261 -889 499 555 757 1077 -182 -768 -87 234 697 896 171 955 570 78
6905 78 92 506 318 -236 254 191 -331 261 -269 -94 81 -436 180 429 -263 -199 -259 -150 329 77 134 -137
6927 -137 -140 -656 -67 -268 4 -1474 -65 374 1087 -128 -415 -108 228 113 88 393 -289 150 567 974
6947 974 -434 -409 -314 -439 557 -227 866 241 -9 -419 -217 89 -415 -153 236 373 257 132 -169 26
6967 26 -655 279 -5 237 118 -209 317 161 93 215 184 99 -263 -237 16 -269 -66 -82 127 -56 -222 -210
6989 -210 392 159 -23 -17 140 133 100 125 14 -131 80 -114 191 76 -56 82 108 241 -22 3 65 82 15 291
7013 291 149 -31 110 -89 -141 57 15 -37 -25 -112 -69 127 189 -23 135 166 40 89 -358 -41 -122 -41 -106 112
7037 112 55 -20 -14 60 247 7 -99 224 88 -341 236 -236 -242 -35 -103 -171 -107 -30 -226 66 36 -91 -217 -225 328
7062C28K1l99J60r3q4k58M22m29J98L7J07J19m61J44P5L33j77m21J66M90m99N46
7084C25n85j60O94L54r29L64O83q79Q31j727J568n0k95J40l12J30J78k78j0j49
7104a07r92J464q24l1R55m18p9L96n74K35p77P33N18m11j46L11O2n68M05k86N21
7125C87l47j09L40k80J33L7m9M7l2j75L2k38N0K23k51L14K85k06q1J21l9J9j16
7148F5n62K3j80M47J59m23k27P77J59j368J295P20N0j096L06J178j411j39m3L4
7168b36L02j92m38K64P88j225N90J18m41M00n32K07O44k49R1O99k01q64NP05n51
7189a16MP4k22J98M29l38k55R55r58P88J97m24l04M72K5q53J99j54q0L3M53k39
7211a16p0K19o4l50k40M23J07L63l25k73K7J85P27n85K95j79o52M10QK51l87J43
$$ plain form
7062 328 349 -50 110 17 -67 -325 97 -332 -134 -97 10 129 -332 -188 -113 220 43 -378 -212 278 -221 325
7084 325 -260 -420 274 628 -301 63 746 -133 698 -1029 539 489 194 334 22 152 330 52 42 -107
7104 -107 -1099 365 -459 -490 465 47 -32 364 -210 25 -752 -19 499 88 -58 253 315 -253 152 -134 387
7125 387 40 -69 271 -9 124 161 112 159 127 -48 -16 -254 -204 19 -232 82 367 161 80 201 162 181 65
7148 65 -497 -474 -654 -207 -48 -471 -698 79 238 -1130 165 885 935 -161 145 1323 -88 -227 -270 -236
7168 -236 66 -126 -564 -300 488 -737 -147 -29 -470 -70 -602 -395 249 0 91 790 589 -275 -270 435 -116
7189 -116 -112 -38 -260 -62 367 29 -226 729 -229 559 756 332 28 500 525 -328 -129 -283 -363 -330 123 -116
7211 -116 -186 33 -31 -381 -621 -198 -91 272 -53 -326 -299 -114 613 28 323 144 -508 -98 -90 161 -226 -83
7233h3L76n48M90j56p4k99K22M5k43l72O80K59l97q04J289j4p15J128o4p80n75
7254f35K94M66J69o72L33M38j148J404n01p26J14L43j20j05M54L77o48J35p24
7273g52m36J307k05q14N72K96r23R13N00m93j85m32R5P60L13n99j44L41N9q83
7293g10O67n91P04K37L34q41j131J593p81K6j16Q87o48O17j46J44L50p02N45l23
7313A15j70M14j317R30J382j588n21L20N19K22p18P55j350J447n83J45M91n23
7331c0p45P30o91J018n15L51K80n24l32N41m80O24o29O43L21J76j182O83q17K17
7351c61J62K00l91L30m46M97n75PJ41J09Q58n66M17r56J325j249J84J108r68P56
7371E82j209J034k71l92M53P8p58K42M25k18kn24k74Q59j94L82l20K95L0J40o29
$$ plain form
7233 -83 293 -255 235 79 5 -294 -72 -27 -270 -642 38 297 -100 -904 385 371 -344 784 720 -60 -635
7254 -635 -341 125 294 -378 -45 393 -755 649 148 -578 -464 -121 -241 -346 108 485 -163 -28 -752
7273 -752 -1188 119 -86 -900 -328 -32 -955 -42 458 -35 -220 -652 -557 203 516 -83 -227 114 173 -710
7293 -710 -43 -634 70 307 641 -200 -1331 262 -519 -493 -609 278 -370 247 101 245 595 -107 438 115
7313 115 -55 359 -958 -28 1354 -234 -755 -435 84 306 -412 343 -1007 440 -143 2 493 -30
7331 -30 -775 -45 -736 282 -233 118 398 -126 -458 83 -397 227 -402 241 562 738 -444 239 -578 -361
7351 -361 -199 1 -390 -60 -506 -9 -584 -577 -436 -327 531 -35 382 -574 751 -498 -314 794 -174 582
7371 582 -627 407 136 -256 197 275 -483 -241 184 -34 -36 -560 -834 25 -169 213 -107 188 218 358 -271
7392b71k62Q78q03P56km39J0k81l06O50n51N71j66J045J4o17J80q39K88m40N39
7413d6J34O11j395O75k51J22j05k22P52o33M09o91k4M2K39NM60J3p31R73j225
7434h88M03L87P23j111J201j46r42J31J80o8P6o09L0J085r86N01N61p22K45J35
7454A86Q8o89L49Q6l02n64J071n5k34k61OJ95J68K43j97o25N41R34o97n48R06
7475F01m98k15l17K41N1K19K92j48j013J164L1q41N17k98j88K41N79l51l12k8
7495b73O36n60M69j53r2K8k25J22pJ41r43O42n71J322p53J12N40p15K20M52m4
7516C48o66M58K6m74O16q52M09k02r5M58k63j11L67j27L97r7n06L58j60l93O59
7537A50M03j178m7L52k7m02J547J59j121k70O43r00K47Q58l43J03m2n51N22J41
$$ plain form
7392 -271 -533 345 -458 298 296 -143 -133 -414 -720 -70 -621 -50 -216 829 843 226 406 -433 -145 -585 -46
7413 -46 88 699 -696 -21 -272 -150 -255 -477 275 -358 51 -640 -664 -622 -383 -378 82 95 -636 337 -888
7434 -888 -485 -98 625 -486 715 569 -373 -242 -62 -130 -54 -663 -633 452 -534 -33 528 -194 51 186
7454 186 274 -415 -66 20 -282 -846 225 170 -64 -325 -319 -124 44 287 90 -535 6 940 243 -305 601
7475 601 103 -112 -429 -188 -137 82 374 226 -787 377 408 -433 84 -214 -402 -161 418 67 -245 -273
7495 -273 363 -197 272 119 27 55 -170 -48 -55 86 -857 -215 -786 536 -217 -105 435 -280 -60 392 348
7516 348 -318 140 166 -308 308 -544 -135 -337 -432 26 -237 -348 19 -108 289 192 -314 44 -116 -509 150
7537 150 553 -625 -672 -320 -347 -749 798 957 -164 -434 209 -691 -444 414 71 174 132 -419 103 244
7557B44J07O0l08j61m73oK75j80K13L86k91L81r9p2R4J6m84K97k06P22j90l51
7579b6N5n69P81l7m18J95Kk4j13p46P57l3L21m24M21j31m58n38Q55K43j87r2N7
7602a09M97K02r81M39L14l88m50K63n7K81K2J07k09K55k16n6n09N44L1N64o38
7623i4R02q26n64P59K31o40J98M67o52Q5J84K75q68M76L8P9k78K1NM66P8j04p51
7646e13P66K24p76M21j18p86O98OJ68J66n74L65o8j41J97j1K91j65j41j14K45
7667A40p5l14L77k64J2k03J27J88j22L20M9j41k70RJ7J63j24k37L00L8l2j61K83
7690H0j21o5K08l22K17o3J89R8j12j10J54l01L90k83j61L19O9o00L38L36l22k32
7712b94J28K31k07O5K12l95l8O23m21l89M82Q4r1l54o51P47j02j1J16L80L36r45
$$ plain form
7557 244 351 411 103 -58 -531 -537 -262 -442 -229 157 -134 247 148 76 170 186 -298 -1 -207 515 325 -26
7579 -26 29 -540 241 204 -214 -19 -17 -41 -154 -900 -143 -176 145 -279 142 11 -447 -985 -130 113 -74 -166 -109
7602 -109 388 590 -391 48 362 -26 -476 -213 -270 11 33 140 -69 186 -30 -86 -595 -51 -20 544 -94
7623 -94 808 -18 -582 177 408 -232 -34 433 -219 -134 50 325 -543 -67 -29 50 -228 -207 -202 264 342 238 -513
7646 -513 253 477 -299 122 4 -782 -84 -78 90 256 -318 47 -21 -162 35 24 315 150 9 -105 140
7667 140 65 -249 128 -136 -124 -327 -200 -12 -134 186 235 94 -176 -167 -150 13 -111 -348 -48 -10 -42 -203 80
7690 80 -41 -106 102 -220 -3 -66 123 221 109 -1 153 -148 242 -41 -202 117 186 -414 -76 260 -62 -294
7712 -294 -166 65 -142 -77 135 -260 -298 325 -96 -485 -3 81 -10 -364 -1015 -268 -370 -381 -265 115 451 -494
7734d94M37k24J56M17j11l45K33L26j000O08K53k62j88O14l97l31M06K33P1j7
7754C85n7m39L81n69K59L8Q69o75J45k18n63L36j66M80j47L44p03m3L23p1k2P2
7776d1J61j77J80m90j72O66MJ3k33L09m19L84k53R6j5N4M63n66J75k93M88o38
7798c04K25K19j51L83m64M83k52l92j56M92k27l2R7J97j56M18l27l6J40n67L29
7819h1L30K69m63J28o6P8j48J56l07j4K25R0j98j33M06l92K51k3o8k51J78j47
7841a80K42k81K8K77M5m06L95k09NJ26m2k0J40p5L33m71J18j60J56l5k39K24p9
7864a08J98M7j77k6J97k30L08n50L13j28K15j07K63j96q2lN1j01J88J81j28o6
7886E9k05mK85j88p0J85r7NJ18k34J87R7k62O5P5j50J39L3prk12J47j38M30m80
$$ plain form
7734 -494 -57 -281 -125 292 181 -164 69 395 -605 3 256 -6 -194 420 23 -308 98 331 402 385
7754 385 328 -111 270 -299 -40 -2 867 192 337 119 -444 -108 -274 206 59 403 -300 -343 -20 -91 -113 -41
7776 -41 120 -57 123 -367 -539 127 131 144 -89 220 -199 185 -68 28 13 67 530 -36 139 -154 334 -304
7798 -304 -79 140 -11 372 -92 391 139 -253 -409 83 -144 -176 -79 118 -38 380 53 17 157 -410 -81
7819 -81 249 518 55 183 117 195 47 203 -104 -118 107 197 -1 -134 272 -120 131 108 40 -211 -33 -180
7841 -180 62 -219 -191 86 131 -275 120 -89 -84 42 0 -20 120 45 378 -93 25 -135 21 -14 -253 -29 -108
7864 -108 90 137 -40 -66 131 -99 209 -341 -28 -156 59 -48 215 19 -63 -66 -15 -116 72 253 125 59
7886 59 -146 -150 135 -53 -123 62 -35 -30 88 -146 41 138 -124 -59 16 -134 5 38 31 22 -190 -43 -181 249 -231
7911b31K01o3J86j38k3L46k45j2P9k54K92j01M7j12M2j97J72K2j17J05L2k57K46
7934B0L2R1J27l48O9R1Q3q2nl7j38K24k21p5L26j79J63n5j10R7k27K49j31J4J8
7959dJ52k0l24K63j54m4J13p4J39j4J13n8J63q8k31L13n83Q79q01O70l27rq79
7982h05R81J218j171n94Q28n83M4N78j44j176M99J089m30K17j263J99J56M36n05
8001d26J267m02n39J25M53m81K48p95N49p47Q31L52k8k55J07l0l28p0J74l4J11
8022H2M6Mm4l20N04k31J23j02j08K34l40P9L92l88L11o0l63m6L12l8m5j08J9L24
8046B37l95J1J67k31R4J52p9L80n88J28K37K6k54P9J06J87l24j07K30L8Q6j13
8068F7J40j31P3l83J22K62k90l1K89m9J6j92L76k52n9o0J16J34n05K76j08J86
$$ plain form
7911 -231 -30 -93 93 -45 -68 278 33 21 100 -154 138 37 84 -28 14 -183 -11 11 -106 -1 31 -226 20
7934 20 52 143 270 -78 -9 82 165 83 78 41 -97 127 -94 -169 157 -22 141 86 -24 73 -154 95 -36 -22 -4
7959 -4 148 128 -196 67 -87 -131 -18 -92 47 33 146 88 251 163 -68 245 -338 541 -260 410 83 74 -805
7982 -805 176 1394 223 -371 457 -126 -82 496 352 -824 -325 764 334 551 -712 -513 -357 79 -426
8001 -426 841 439 -100 25 478 -3 245 -550 -1 -748 83 435 407 152 259 229 -99 -169 5 -29 82
8022 82 128 132 88 -232 272 41 164 62 -46 188 -152 -73 319 -69 242 182 -181 -227 85 47 2 -106 -87 237
8046 237 -158 -147 20 -211 -117 35 -44 336 -252 -124 113 139 -115 -36 70 257 -67 -174 56 94 180 67
8068 67 207 76 149 -234 -112 150 -140 -171 118 69 85 -107 269 17 -42 -102 14 148 -357 -81 -189 -3
8090cO0j46J31J03k66K8J6lj6Q6j33J43l1Q3o8J7J38p7j49L0K92k30j92K55j41
8115g3k03P2L37R6k01r5O31m09q5j14J33L52n76J53O9j48L7J19l2j7j38j13J89
8138a6k26K56P9K2J75j51k41K63l58P7n3K18L0k15j2M11m64L76j58j28N7r9J86
8161B9j4M4j7j8q0J18k44R8k3J04M9m6r8L81l33j21J87L51l37j60j16K44j92n8
8185b52M47j39p8j95J70k11
$$ plain form
8090 -3 57 -89 42 145 -121 -93 -77 -80 -96 -10 -143 0 -31 52 -16 1 139 62 -87 -57 235 5 -187 68 -73
8115 -73 -276 -204 133 229 28 -67 564 155 70 -44 89 441 -135 18 87 -61 -24 95 63 46 -92 -205 -16
8138 -16 -242 14 93 115 290 139 -102 161 -197 -120 -173 45 75 -140 -152 259 -205 171 13 -115 -58 -157 29
8161 29 15 59 42 24 -56 62 -182 -84 -107 -3 46 0 -98 283 -50 -171 16 367 30 -130 -246 -2 -194 -252
8185 -252 195 56 -22 -217 -47 -258
8191b58
$$ Imaginary data points
##PAGE= N=2
##DATA TABLE= (X++(I..I)), XYDATA
0@%%%%%%%%%%Qj2J2j6J6j6K4l2L6m4N6o4P2q8J04j20J40j64J88k16K48k80L18
33A70l62M08m59N13n74O43p16P96q84R78j081J196j321J458j607J769j948K146
51A125k365K609k880L184l530L924m376M906n536O296p238Q439j0027J2226j5479
66h722K0775l0809N6092k30820m08842O80252L59169n04839l56899L61730K78234
77B15321j59270r6710O5024p0233O2943K18660q6822l38657K7842L59175m228
88A93045l85450m5736K70613N8675j29600m7665J8072M2413J17877O1235j91300
99c7821j08990K51588J28758k54242j47201J73021J03676j42185o6530P8486l0123
110e1563p312J34076l4339j66790R0596K30631q6580k56518J18259K56574j78264
$$ plain form
0 0 0 0 0 0 0 0 0 0 0 0 8 -4 8 -8 8 -8 16 -16 20 -24 32 -32 40 -48 56 -64 76 -88 100 -116 132 -148 170
33 170 -192 216 -243 270 -304 339 -377 419 -465 513 -568 628 -693 765 -842 927 -1021 1125
51 1125 -1240 1369 -1511 1673 -1857 2067 -2309 2597 -2939 3357 -3881 4558 -5469 6757 -8722
66 -8722 12053 -18756 37336 -193484 -602326 77926 437095 -67744 -424643 -62913 215321
77 215321 56051 -40659 24365 -45868 17075 235735 148913 -189744 -161902 197273 193045
88 193045 -192405 -238141 32472 91147 -38453 -86118 -68046 -25633 92244 153479 -37821
99 -37821 -146811 104777 233535 -20707 -167908 5113 108789 -33396 -99926 -21440 -51563
110 -51563 -58875 75201 40862 -125928 -35332 195299 108719 -147799 -29540 227034 48770
121D8770k46424J83623J83425k22917j74698K39855J42261k57474p7279K67406
131H6548N3859k04889q173J80896o644j43421M0036P7421r0805l4478P5146k5669
143a73q3945L9369Q6113n6152o6757J01834N3314r4836J279R5721j4932r1896
155c1061J9608P9171o1334p8668O4214K1374p0805J1827O1276k7244m8011P3897
167A4244O6031r2772l0184J19972N257j15633N031R6265l6428j16133N2981R6270
179F4901r8079p7659J14274O9617j02788n5100J21013O2111j09913k9501Q7874
190D6750M534n8819p046K2048k0088k1322L5299q093n0586L7328N0997l2725k3260
203b4983M1996L0545l9431j2913N5814j8278o7653K9731M7078m5339o0163L2322
$$ plain form
121 48770 -197654 -14031 169394 -53523 -228221 11634 153895 -103579 -180858 86548
131 86548 140407 -64482 -72655 108241 101597 -41824 -1788 75633 -15172 -49650 25496 -173
143 -173 -84118 -44749 41364 -14788 -81545 20289 73603 -21233 -19954 75767 60835 -31061
155 -31061 -11453 67718 6384 -72284 -8070 13304 -57501 -45674 15602 -11642 -59653 14244
167 14244 80275 -12497 -42681 77291 82548 -33085 -28054 68211 31783 -84350 -31369 64901
179 64901 -33178 -110837 3437 73054 -29734 -84834 36179 98290 -11623 -41124 46750
190 46750 51284 -7535 -14581 7467 -12621 -33943 1356 -6737 -57323 -19995 31002 -1723 -24983
203 -24983 17013 47558 8127 -4786 51028 32750 -34903 -5172 41906 -3433 -63596 -31274
215c1274N9393m0260m2855M7484K5266j9103R783J3324j4640p914L7902M822p1814
228b9886l772P2034j7353p5343P140O7008j713o2376J8840O1376k1578k4835K7736
241A7278J4895j9425j3263K0596l457l8192J0091J7300k7087q107J8176M744j0031
254a6482L618K7533p111j6130L3621O603l4734K703K7903p478m3352m30M3258
267A9522j8816m2332K3739K9367j2530j6942J6416K4710j6783n459K4156j2643
279A2405j8532J5001N879k1949k0717K0098J7036l4784n345L5754l66j7039P762
292d797K3347J018k1864J3471J7845k2765r665Q674k737p269r472K693K248m630
306a3903J3008k916j1139K1309J2902j3483r312J1500J8487k1243k1967K2248
$$ plain form
215 -31274 28119 -12141 -54996 -7512 17754 -1349 8434 21758 7118 -796 37106 41928 -29886
228 -29886 -33658 38376 21023 -54320 -47180 19828 18115 -44261 -25421 35955 14377 -10458 17278
241 17278 32173 12748 -515 20081 16624 -21568 -11477 5823 -21264 -29371 -11195 -6451 -16482
254 -16482 -12864 14669 7558 -8572 25049 31652 -3082 -379 27524 20046 -23306 -23736 19522
267 19522 706 -41626 -17887 11480 -1050 -17992 -1576 23134 6351 892 25048 12405
279 12405 -6127 8874 14753 -7196 -27913 -7815 9221 -25563 -30908 4846 4480 -12559 -4797
292 -4797 18550 19568 -2296 11175 29020 6255 -3410 5264 2527 -4742 -14214 -11521 -9273 -13903
306 -13903 -895 -3811 -14950 6359 19261 5778 -3534 7966 26453 5210 -16757 5491
318E491K833k3675j428J1486J736j2786N275K2982j2087q799K4475N716j4664
331F555n369J1729P258k3268q561J6375p568j1681K720K856K933m747O620J0698
345F550r748M462J3596n346m591j698L013K212j3018k608K990m194N807m436o409
360a3418J3011N558j616l487L417J4862p275j3527J0631J545j0642o301P43P007
374E08j1655p905J7169L21r368N539R787O057q907r54J5543o246r984M864j842
389B927k027n622k841N289n764M91P979m608K038N311K425M342q111q94J0239
404A1174m215p517o891j99J2627p591j5512M889J1652Q332j0471j0522J8897J1139
418A5792p313m674l764P197M631o337n027j1755K149J8537p193j8568k190J7864
$$ plain form
318 5491 8324 -15351 -16779 -5293 -3557 -16343 -11068 11914 -173 -8972 15503 21219 6555
331 6555 1186 12915 20173 -3095 -11656 4719 -2849 -14530 -11810 -8954 -6021 -10768 -4148 6550
345 6550 -3198 1264 14860 9514 4923 3225 6238 8450 -4568 -7176 -4186 -8380 -2573 -7009 -13418
360 -13418 -407 5151 3535 48 3465 18327 11052 -2475 8156 9701 -941 -7242 -6499 508
374 508 -11147 -19052 -1883 -1562 -10930 -5391 4396 10453 1546 592 16135 9889 -95 4769 2927
389 2927 900 -4722 -7563 -2274 -8038 -7547 432 -4176 -2138 3173 5598 9940 1829 935 11174
404 11174 6959 -558 -7449 -7648 4979 -2612 -18124 -13235 -1583 6749 -3722 -14244 4653 15792
418 15792 8479 3805 41 7238 11869 5532 505 -11250 -9101 9436 2243 -16325 -18515 -651
432f51J9548j6529k1853J6628K1582P8k1501j3193J9892J1714j2304j4051p956
445a8596J4254J4369j0907j1478o27J4389J7608j1182j4517L200J3539J2753j6177
458F628k1221R823J4111j069j5267j2382J3118J0152n021k551m212J248J2636
471E993N274k884j5458k418K4767O46k2183j0595J1116J8573r142j8343M917P066
485b671Q845M992j2430p016Q138J3349R815k5144j8856K0708K0481q052l3004
498b0845q182L3841J6799k5801k0477P827L2768P748k7886j1861J4094K1613J463
511B1101k6034j3783J5434J9466n63k9313j5650K9846K2071j4899k8092N92L5147
524A5323R903k7230j3078R464K2044j869k1714o474O391J0585P046j7702j4543
$$ plain form
432 -651 18897 2368 -19485 -2857 18725 18803 -2698 -15891 4001 15715 3411 -10640 -18596
445 -18596 -4342 10027 -880 -12358 -12985 1404 19012 7830 -6687 -3487 10052 22805 6628
458 6628 -14593 -4770 9341 8272 -6995 -19377 -6259 3893 -1128 -3679 -7891 -6643 5993
471 5993 11267 8383 -7075 -9493 15274 15920 -6263 -16858 -5742 12831 3689 -14654 -9737 -2671
485 -2671 6174 11166 -1264 -8280 -142 13207 23022 -2122 -20978 -270 20211 12159 -20845
498 -20845 -29027 4814 21613 -4188 -24665 -16838 15930 23678 -4208 -16069 -1975 19638 21101
511 21101 -4933 -18716 -3282 16184 15621 -13692 -29342 504 22575 7676 -20416 -19824 15323
524 15323 25226 -2004 -15082 -5618 16426 14557 -7157 -13631 -7240 3345 10391 -7311 -21854
537b1854J5735J8600j179k2677l442K7665P070j8757q789O534J4945p955j3673
550g777N929K713l022l94j523K689j301j520R313k121m534K021N65M801j458q786
566d405K092J947j016L81m577K413J506q29P431l693m013O685K817k95n548m377
582c481Q627J406r084o05j051L867j925l995N769k006j403P206p33n658L253M050
598D237M131j0037m097J1159q1r099k882M430Q588q452p371J1447M277m906l360
613b016R97R554k386q288J569J080K772j734r068L451M115k386J305m565J363
628d237N687k07K896l759l810Q021L373n193n326l77Q513l35j0810N13M429L164
644B542J130o904Q79L022L260M582j0420n475J0388N264p344r721N48J5148l422
$$ plain form
537 -21854 -6119 12481 11302 -11375 -14817 12848 19918 1161 -7628 -1094 13851 5896 -7777
550 -7777 -1848 865 -2157 -2551 -4074 -1385 -2686 -4206 5107 2986 -1548 473 1038 5839 4381 -4405
566 -4405 -2313 -366 -1382 -1001 -5578 -3165 -1659 -2488 4943 1250 -2763 3922 6739 6444 896 -3481
582 -3481 5146 6552 -2532 -3137 -4188 -321 -2246 -6241 -472 -2478 -3881 3325 2592 -3066 187 4237
598 4237 8368 -1669 -5766 5393 5312 -3787 -6669 -2239 6349 -2103 -9474 1973 6250 1344 -2016
613 -2016 -1019 8535 6149 -2139 -570 510 3282 1548 -7520 -4069 46 -2340 -1035 -5600 -4237
628 -4237 1450 1243 4139 380 -3430 4591 7964 2771 -2555 -2932 5581 5246 -5564 -5051 -622 2542
644 2542 3672 -3232 -2353 669 3929 8511 -1909 -7384 3004 8268 924 -8797 -8249 6899 3477
659C477j1979R19N910N207k494m662M714k8Q17N398m559m448K034J503L775o585
675a001o436O802K869r7n350m922J0129M515p326k448J299O999k33q930K778K588
691A236k897J703j376j072j192M21P847l237p971P228N170k157l352j353N600
706D598j388m254M023l954l508M714J145k221n962J230J1684l959r246M140O653
721C695K619p484m815R151J310n179j375j262M898L18n403K763J055l02J962j877
737G4K070n73k732N650j210n826R56J950K616n289n916Q510K887p069r54L300
753a556N356l047m980O417J287m512K862m3j696l66j13L894n029l235P275K18
769B732m593J37J988M915m499m223O253l8l419k64q52L270k309l963M443j48j404
$$ plain form
659 3477 -8502 -7583 -1673 3534 1040 -3622 1092 1064 1881 7279 2720 -1728 306 1809 5584 -1001
675 -1001 -7437 -635 2234 2137 -3213 -8135 1994 6509 -817 -3265 -1966 5033 4800 -4130 -1352 1236
691 1236 -1661 42 -1334 -2406 -3598 -3177 4670 1433 -6538 690 5860 3703 351 -1002 4598
706 4598 3210 -1044 2979 -975 -4483 231 1376 -845 -6807 -5577 6107 2148 -7098 -2958 3695
721 3695 6314 -1170 -5985 3166 4476 -703 -2078 -3340 1558 1876 -3527 -764 291 -11 1951 74
737 74 2144 1571 -1161 4489 3279 -2547 -1591 359 2975 -2314 -8230 280 3167 -3902 -4856 -1556
753 -1556 3800 753 -4227 2190 3477 -1035 1827 1784 88 -278 -391 3503 -1526 -4761 2514 2732
769 2732 -1861 -1724 264 5179 680 -3543 2710 2672 -747 -1011 -1863 1407 -902 -4865 -422 -570 -1974
786a974J26o89N423j072n280N111K432j762k448j213N829j745o854M109J884k406
802e29r77q43M038j194m153N327N64l683R18R98K024l113l686O204l87n055J687
819a860Q69K167j662k679N042k65k407L101r24K41j15j417L326k773l061L385
835I68o60p77j224j752M997p76m145K443J181J240j438l337N441L5m714K256J373
852A111l84j982j740N793j069n866M244K702n83k058j975N491j99m937K406l02
868F52r44O25k025J710k083j716N512j271l404J022J665L827k379n663N247L002
884C777j865k571k581N347J062m872J513k64k01K150o62K39k137j075O614p81
900C693p364N24M699L406n579o632P024L323m885r13O77K711m80j698M424k622
$$ plain form
786 -1974 -1848 -2537 2886 1814 -3466 1645 4077 2315 -133 -1346 4483 2738 -4116 -7 1877 -529
802 -529 -1506 -2349 1689 495 -3658 1669 2233 -1450 -532 466 2490 -623 -4309 1895 1508 -3547 -1860
819 -1860 -991 1176 -486 -3165 1877 1612 -795 2306 1382 1623 1508 91 3417 644 -2417 968
835 968 308 -469 -1693 -3445 1552 776 -3369 -926 255 1495 57 -3280 2161 2196 -2518 -262 1111
852 1111 727 -1255 -2995 2798 1729 -4137 107 2809 2226 168 -1807 3684 3485 -1452 954 652
868 652 -292 333 -1692 18 -2065 -3781 1731 460 -2944 -1922 -257 3570 1191 -4472 775 3777
884 3777 1912 -659 -3240 2107 3169 -1703 -190 -454 -655 1495 833 1072 -1065 -2140 4474 3693
900 3693 -3671 -3147 1552 4958 -621 -7253 -229 3094 -1791 -2704 -2027 684 204 -1494 2930 308
916C08l578N754J809k646m453L97Q251k681p736K360L588J636k930m132M321J203
932A471j940K276k474j190J590R55K590m966m899P629L659m758n860J843J0198
947F124k311r010L225N301o3k423k125L541j298k310N426l057n924L225N194L70
963C885r148k167J2118Q51r791j019N806M726n450m521N927K77k748J630p94l08
979g26n02Q55M729m966l774O440K489l201m169J220P383l277p163M000L050o95
995A693m166j760O363q74n100L055J392o19j724P56M408l844l632O785O91m843
1011a419j521L600M852o492m356Q088J585n722j296L368L842n171k577O427j538
1026A670m337K177J677o16l806R87N456l719l866L770K024K90l281p06N343j574
$$ plain form
916 308 -3270 2484 4293 1647 -2806 -2409 5842 3161 -4575 -2215 1373 3009 79 -4053 268 1471
932 1471 -469 1807 -667 -1857 -267 688 3278 -1688 -6587 1042 4701 -57 -5917 -4074 6124
947 6124 3813 -5197 -1972 3329 3266 843 -1282 2259 961 -1349 4077 1020 -4904 -1679 3515 3885
963 3885 -5263 -7430 4688 5539 -4252 -5271 535 5261 -189 -4710 1217 1494 -1254 376 -418 -726
979 -726 -1228 -373 4356 -610 -4384 2056 4545 1344 -2825 -1605 5778 2501 -4662 -662 2388 1693
995 1693 -2473 -4233 2130 1256 -3844 -789 603 -16 -1740 -984 3424 -420 -4052 2733 3424 -1419
1011 -1419 -2940 660 5512 -980 -5336 2752 4337 -1385 -2681 687 4529 -642 -3219 3208 1670
1026 1670 -2667 -490 1187 571 -3235 -2248 3208 -511 -4377 -607 1417 1707 -1574 -2280 3063 1489
1042A489k489K185n03L08q44m63K937l234j740L715K65j214k463R1N592k224m795
1059c387K338J918J110l082k260M161o22j679K165j971k98J484J258J385m677
1074b157r87O957k48m608j413K883M279m137l576L146M40j26M79l293J003J075
1090b83J105M77m411R17M815j904j109j726J121L488k368j312L21q02L845k6m370
1107b222J084K265K063k258l657L769J867l246Q18r79l36J630j305J117j771j406
1123b567L797n51k609N15N76K449j306k787L295j16o96R51k067J343O04r44P59
1140F46r25M06J861k212J156J219l461J291J087l14j240j599K393J943m921J793
1156h77J223p85n77j596M298j84m135K838K208l189o36K560J709k527k584M354
$$ plain form
1042 1489 -1000 1185 682 990 146 -317 2620 -614 -2354 1361 1626 412 -2051 -1960 3632 1408 -3387
1059 -3387 -1049 869 1979 -1103 -3363 798 176 -1503 662 -1309 -1607 -123 1135 2520 -2157
1074 -2157 -3144 3813 3565 -1043 -2456 427 4706 569 -3007 139 579 453 932 -2361 -1358 -283
1090 -283 822 1299 -3112 -2195 2620 716 -393 -2119 -998 2490 122 -1190 -869 -1671 2174 2148 -2222
1107 -2222 -1138 1127 3190 932 -2725 1044 2911 -335 483 -496 -832 798 -507 610 -1161 -2567
1123 -2567 1230 679 -1930 -1415 -839 1610 304 -2483 812 696 0 951 -1116 227 831 -113 646
1140 646 -279 127 1988 -224 932 2151 -1310 -19 1068 754 -486 -2085 308 2251 -2670 -877
1156 -877 346 -439 -1016 -2612 1686 1502 -2633 205 2413 -776 -1412 1148 2857 330 -2254 2100
1172B100L25m723O95K147Q70j113j896L497j00l167J747R6j54k70r40J493j121
1189e14j123J917j10j28p94l80K579m14j715L44P75R67q5l205L301J246l891L98
1207h32J290J494j997k221L327m61l398J941J863j93k516k07L737on699M025K377
1224B524j997k375O51L264j541k987M013J71k353l5Q23K222j539k033K510J317
1240B635l454J406j058J408l00k683J949L6j273R80o77J428L9l201L684N52k472
1257a001P59j88J995j77l782L912M27k347n85Q58K063j571k387L642N58l642R64
1274e02J244L02j710j840M019q62l356J901J416n93j102p28K734j04k950K899
1290G68L04p26n3q73K122k44k455J982K1r39j62k37J757l67k091J079N77N1k74
$$ plain form
1172 2100 2425 -2298 -1603 544 1414 301 -1595 1902 1802 -1365 382 478 324 54 -886 607 -514
1189 -514 -1637 280 170 42 -752 -1132 1447 1033 -682 -338 437 1404 1319 -1886 1415 2661 -1230 -832
1207 -832 458 1952 -45 -2266 1061 600 -2798 -857 1006 813 -1703 -1910 1827 1821 -3878 147 2524
1224 2524 527 -1848 -1197 2067 526 -2461 1552 1723 -630 -665 158 2380 841 -1192 1318 2635
1240 2635 -819 587 -471 937 637 -2046 -97 -61 -1334 -354 -1031 397 436 -2765 919 1471 -1001
1257 -1001 -242 -430 1565 1388 -2394 1518 1945 -402 -987 -129 1934 363 -2024 1618 2176 -1466 -502
1274 -502 742 1044 -666 -2506 1513 651 -2705 -804 612 19 -1083 -1811 923 819 -2131 768
1290 768 1072 346 293 -580 1542 1298 -1157 825 846 -93 -255 -492 1265 898 -1193 -114 463 514 240
1309B40j239J774Pk640J349P35p67o7p20K229n83k595K743J146j925k97L31K704
1327B425r26l498L232Q59j892o90p6J710o29k284K345L22k181J370n60J074j089
1344d88j628L215o96k106J303M85O48p63k199K686O65j939J033k6N45pj524J393
1362E97N84j954J076M17m01l23j343K192l3k803J546O19j32n53j434K590J49k379
1380a585J159N97J58k7j463K200k21k453K115O58k82j165j78K098n01l090K517
1397E37J033j792l58j70J699p70k033K072L65j532M91O9R89o83j386K032L74j801
1415h64M71L73J369j069j657K530L16k115N44N09N46p9k352K037N05j771N88k8
1433a47J134j294j133J923k43k122J502O92J19l06j837K246J120l261J233J054
$$ plain form
1309 240 -999 775 782 -1858 -509 226 -541 -608 -1328 901 318 -2277 466 1612 -313 -610 -279 2425
1327 2425 1499 -1999 1233 2092 200 -490 -566 1144 515 -1769 576 898 -1283 87 -473 601 -488
1344 -488 -2116 1099 403 -1703 -400 85 733 -30 -2229 457 1122 -817 216 190 735 728 -796 597
1362 597 1181 -773 303 720 319 -4 -1347 845 812 -1991 -445 174 42 -511 -1945 645 794 -1585
1380 -1585 -426 171 329 302 -1161 1039 818 -1635 480 1138 856 -309 -487 1611 1110 -1980 537
1397 537 1570 -222 -580 -750 949 179 -1854 218 583 -949 -458 -389 600 -83 -1469 563 937 -864
1415 -864 -393 -20 1349 280 -1377 1153 1469 -646 -102 407 953 874 -1478 559 1064 -707 -119 -147
1433 -147 987 -307 -1440 483 240 -1882 -380 312 431 125 -1712 534 1654 -1607 -374 680
1449F80M47n61k382K877J43k121J624J90r06j95l74K249j439k737K927O22j388
1466c44l85l44J907M89k577J669J50j036J53o21J359k18r61J530l36q98J78O06
1484C21J483j492j288J773N12j398j18J77J255m68k059J203K44l05K78r62R00
1501E6K51j801K207j50j583M22O53J503j283j462J948M48j457O63n94Q87j59j391
1519h42J453l67q89J369j62j46o25m98J747j157r46Q31M33q3K46j614J047M30
1537B27m49L77n31j36J891j425O27Q3r30J192n03n44O53j218J445M24j803M31
1555a89R18j01q08j548K355L86k169M95N16Pl73L40K16L58j925J787J180j626
1573a81M92l13J005J56k191Q92J065l03p92p7J173J02k138J124m04N90m12n67
$$ plain form
1449 680 1127 566 -1816 1061 1204 -917 707 897 -9 -204 -578 1671 232 -2505 422 1044 -344
1466 -344 -729 -1073 834 1323 -1254 415 565 -471 -318 -939 420 202 -759 771 435 -463 -285 321
1484 321 1804 312 -976 797 1309 -89 -207 -30 1225 757 -1302 -99 145 -160 118 -844 56
1501 56 307 -1494 713 563 -1020 -598 55 1558 275 -1187 761 1209 -248 415 -179 708 549 -842
1519 -842 611 244 -645 724 562 416 -209 -707 1040 -117 -1063 -232 201 118 364 -1250 -203 227
1537 227 -222 155 -376 -512 1379 -46 581 664 -266 926 423 -121 532 -686 759 1183 -620 -189
1555 -189 729 628 -180 -1728 627 1013 -1156 -661 -145 -138 -511 -171 45 403 -1522 265 1445 -181
1573 -181 311 -2 1003 1159 -1032 -140 925 622 -170 -247 926 1028 -1110 14 -390 200 -212 -779
1591g79Q84J60j246N26R51q98l64K3J736J38k260P63K016j000j262K69J672m23
1609I06j745J100J375k354Q8Q08P74p62j877K266Q87l059K99J396L35j532J93
1626i02J392J73j783P92O45K2n55o30R29K41j632J647L08k11r5j525K235m32p47
1645a28k18J101j3p18j375J825R36k477O19J241p51l56j198K889l52j971K48J208
1663E10J14j382k60K340j75k820K122J425j903q76O88J837l97k504K018M46j993
1680h10Q35N54j50l96j905J929Q49k149Q90m85R93j0j526K010L07q77m99l09J609
1699H60K13j668L92J210j030M1L56J478j382j892J131K124k429J50J025K75n81
1716B73k010K016J265k782O14J470p69p81r31K415M06k488J647O84q21L47q28
$$ plain form
1591 -779 105 265 -981 -455 496 -402 -766 -743 993 1131 -1129 -366 1650 650 -612 -343 1329 906
1609 906 -839 261 1636 -718 -630 178 952 190 -1687 579 1466 -1593 -1294 102 437 -1095 -902
1626 -902 490 663 -1120 -328 317 339 -216 -846 83 324 -1308 339 647 436 341 -1184 1051 619 -128
1645 -128 -346 755 742 24 -1351 474 1410 -1067 -448 793 42 -314 -1512 1377 1025 -946 -698 510
1663 510 624 -758 -1018 1322 1147 -1673 449 1874 -29 -905 -217 1620 1223 -1281 737 1183 -810
1680 -810 25 579 429 33 -1872 57 906 -1243 -353 -838 155 145 -1381 629 936 59 -440 -749 860
1699 860 1073 -595 -203 1007 -23 18 374 1852 470 -1422 -291 1833 -596 -446 579 854 273
1716 273 -1737 279 1544 -1238 -624 846 77 -704 -1635 780 1186 -1302 345 1029 208 555 -273
1733b73J573p01j567J505O44q91M2n27R25k77j541J841n29q56O72p69J029M51
1751G51j728O73L76P20o73j439J440J195k404P45J323m37m56n27J504l97j771
1768a105J149J212j689oQ4J799j189j840J826R19k049J92R40n0J65j777J219O95
1786D95j013L59J61L20j91j097J073N82o35j99K72L21J42j583J311P78q29o11
1804c44K57L95O9j572P57J642j776K59n36J224n09j542J994N66k018K88J196L28
1822F78q83q64J730K35k193J629P51r98k17n76J668L21k267J626K91r81j34l77
1840e61M14P43j922J228K25l05M89r89Q46P99k582J391P52p73M43o05P10O49p18
1859B34l41J759j849Q3nJ170q5k139Q86J738j413n55L15P40J74k358J159J489
$$ plain form
1733 -273 1300 599 -968 537 1181 290 332 -195 730 453 -1088 753 224 -632 40 -729 300 751
1751 751 -977 -304 72 792 119 -1320 120 1315 -1089 -344 979 542 86 -441 1063 666 -1105
1768 -1105 44 1256 -433 -439 -355 1444 255 -1585 241 1160 -889 -697 243 193 358 -1419 -200 495
1786 495 -518 -159 2 322 131 -966 107 689 54 -145 127 448 590 -993 318 1096 267 -344
1804 -344 -87 308 377 -1195 -438 1204 -572 -313 -849 375 -134 -1676 318 884 -1134 -846 350 678
1822 678 -205 -1069 661 896 -1297 332 1083 85 -132 -708 960 1281 -986 640 931 -50 -184 -561
1840 -561 -147 596 -1326 -98 127 -178 311 -678 168 967 -1615 -224 528 -245 198 -407 303 952 234
1859 234 -107 1652 -197 -114 -119 1051 966 -1173 -287 1451 38 -517 -202 538 712 -1646 -487 1002
1877A002j072j87k68Q70k59j132J340N19j844J202K79r7J7j279J478N75j588Q00
1895C56o54O02m94q55R54R15j227k47N32M03J11j238R71Q01k003P76K78O72o01
1914E2j110J122J112k104N31O47K86n75r99J918j0j580P07J059j199O11o55R45
1932G58J69k040J442N29q54m90l30J208J82j446M85P84o18L15n96P28O74j522
1950f22R82L38q27K61l61Q16k57j353Q72J240j421J9m53Q26O63j908N45J121j147
1969f66J86k45Q93K07j344Q73O75q41NJ79O04mj772J391J231j575L48O9N45R5
1989H54j712Q73J138j305l82O14j45j42q40J164O36j692L54O57o1j84j051J569
2007C45L69j550M99Q60P7n40o28Q15O85j387O13O81o79J19o85R18M31j907Q23
$$ plain form
1877 1002 -70 -257 -525 345 86 -1046 294 813 -1031 171 450 353 370 -909 569 1144 -444 356
1895 356 -298 304 -190 -1045 -91 824 -403 -650 -118 285 396 -842 129 930 -1073 -297 -19 653 52
1914 52 -1058 64 1176 -928 -397 250 536 -39 -1038 880 870 -710 -3 1056 -143 468 -187 758
1932 758 927 -1113 329 858 4 -486 -816 392 574 -872 -387 397 -221 94 -502 226 900 -622
1950 -622 360 698 -129 132 -229 587 330 -1023 -151 1089 -332 -313 -766 60 723 -1185 -640 481 -666
1969 -666 -480 -725 168 375 -969 -96 579 -262 -257 -78 526 522 -1250 141 1372 -203 145 214 759 854
1989 854 -858 15 1153 -152 -534 80 -65 -207 -1047 117 753 -939 -585 72 11 -173 -1224 345
2007 345 714 -836 -337 523 600 60 -568 247 932 -455 158 839 160 279 -406 512 943 -964 -141
2026a41P78o72j10o93Q45O94j671N46J055o26K41j323J390O30k064N46J683r03
2044B05o68J70J107N9j908J133R91q62q97L02J206j80k012J227J161j918k5Q56
2062e3O89o17j445J829L46j643M33O82P2j26r42R54J318j790k7Q10J85n22o57
2081e04J009N10j320M1N18P1l17p27Q72L63j367J63O95O74r01j434J812J153k418
2100a107N12J184l40m10n83J403N61k370R52J121o40m85k43J148K17j984J216
2117A52R36j352l5j24J066l91j126R63J47p93K79k37L55M57j135Q20Q90j222K78
2136g2k38O90N36j653P13Q62q12J21k46N48K19j487P04J196j420l44M75P46l83
2155A55j516J212J152j614l23J087J04j39j078J394P70k010L05R41j59k00q43
$$ plain form
2026 -141 637 -35 -145 -838 7 701 -970 -424 631 5 246 -1077 313 943 -1121 -575 1108 205
2044 205 -463 -293 814 873 -1035 98 1089 227 -670 -368 838 658 -1354 -127 1034 -884 -909 -53
2062 -53 636 19 -1426 403 749 -894 -461 221 293 167 -775 179 1497 -293 -320 490 675 153 -504
2081 -504 505 1015 -305 -264 254 325 8 -719 153 516 -851 -688 7 681 -220 -1654 158 1311 -1107
2100 -1107 -595 589 249 -161 -744 659 1220 -1150 -198 923 283 -202 -445 703 920 -1064 152
2117 152 1088 -264 -299 -423 643 252 -874 89 236 -557 -278 -515 -160 297 -838 -18 872 -350 -72
2136 -72 -310 380 916 -737 -24 838 26 147 -99 449 668 -819 -115 1081 -339 -683 -208 538 155
2155 155 -1361 -149 1003 -611 -934 153 257 118 -960 434 1204 -806 -501 440 281 81 -762
2172g62J393N33j666N26O79l55m51l66Q23L74j593O63N46l96J94p69L36O89j004
2191f06L30M55p2m12k62P06P32j368M43Q23l51j96r75J323P83k319J050O42p17
2210Il17k57J415l78j582Q37J185j272m84J11K09K05o81J300m59r7r17J071k31
2229c33Q78k205J288K33l30Q66r34N30M46j849J515M09l69n60J57O64o28o35P08
2248a49N56m37n89m34J644n2j366N86J149j472Q9M97k89M97j097J631P09l094
2266a621J108J264j089K37o49J428j49j303P34R00q14j42l64O57J14j067M58O34
2284C36o48M85o56P22K43q89L41M40l72L07n45N86L60j051J11R31l30k16n51Q51
2304D55L56j550L20J062p79n42J59P85J56j722Q34J150j011l06N57N88j89j304
$$ plain form
2172 -762 631 1164 -502 24 703 348 -103 -469 354 728 -865 -202 344 -52 142 -627 -291 398 -606
2191 -606 -276 179 107 -305 -567 139 871 -497 -54 769 418 222 -753 570 1353 -966 84 726 9
2210 9 -308 -565 850 472 -1110 -273 912 -360 -844 -733 -524 -319 -1000 300 -159 -256 -1173 -102 -333
2229 -333 545 -1660 -372 -139 -469 397 -537 -7 439 -1410 105 514 145 -415 -258 406 -222 -857 -149
2248 -149 407 -30 -619 -1053 591 539 -827 -241 908 -564 -475 22 -267 230 -867 764 1473 -1621
2266 -1621 -513 751 -338 -101 -750 678 529 -774 -40 860 46 -96 -460 197 311 -756 -298 336
2284 336 -312 173 -483 239 482 -407 -66 374 2 309 -236 350 710 -341 -230 701 371 155 -396 455
2304 455 811 -739 -419 643 -136 -678 -519 266 422 -1300 -466 684 -327 -633 -76 512 323 -981
2322i81J179J027j588J62L22L50k18q07P92M00r04Q8M97l1j79p52L75P67r94j00
2342e95N43L2K93q72M29Q41j112M4N38J02K40j245O19J039j228OO87J96m93p84
2362g20R59P93j382M6P63m46l19n92J329J14j237L57L59J1j42n60P53K81j432
2381a065Q96L02j71j5l13O35N56j401O09Q30n82k82j07J80O47j193L45M83k30
2400A24m07j94N35M42j409L20J232r31m45M02N23N0j066L21J217q75p5q3L81P76
2420H38j452L89J128j136J92P6N13j04j011P87P46j156k74N48K00mr89P09P54
2439G54j411K82M17j1K19r77O33P86q59l14P68M3j81p32P06J066j666K62O98j86
2459B97Rp87N45P67j367j75J046m99Jk07L33L26j330Q04P54n34m24j2P44M53j452
$$ plain form
2322 -981 198 1225 -363 -201 121 471 253 -554 238 638 -266 -178 319 288 109 -643 -268 499 -495 -595
2342 -595 -52 -20 273 -599 -170 671 -441 -397 141 243 483 -762 -143 896 -332 -326 361 557 64 -720
2362 -720 239 1032 -350 -304 459 13 -306 -898 431 545 -692 -335 24 35 -107 -667 86 367 -1065
2381 -1065 -169 133 -38 -53 -366 269 825 -576 33 863 281 -1 -108 72 719 -474 -129 354 124
2400 124 -283 -477 58 500 -909 -589 643 -288 -733 -331 192 242 -824 -503 714 -161 -236 -319 62 838
2420 838 -614 -225 903 -233 -41 35 548 444 -567 220 966 -190 -464 84 284 280 -709 0 754
2439 754 -657 -375 42 31 250 -727 -94 692 -167 -481 287 330 149 -583 123 1189 -477 -215 483 297
2459 297 306 -481 64 831 -536 -711 335 -164 -163 -370 -37 289 -1041 -237 517 -17 -441 -453 291 744 -708
2480g08M59J018n78k91j49N53M17j169M66O33p55P6k22K96N82j416N64N59ko62
2500c29J9J349l8j817p1K191j011o35N41o79K84l50R11P56q43j046O93K71k43
2519d7m95K64J012q43l40P97j50L7j133P97P68j291j47O07K67jr29P60O07j057
2539e17K79P66j52k42q38Q92R27j844M64Q16k88l41l48Q10J15j045J24Q08l02
$$ plain form
2480 -708 -249 769 191 -100 -249 304 721 -448 18 651 -104 -28 -250 46 628 -788 -224 335 333 -329
2500 -329 -310 1039 1001 -816 -887 1304 293 -342 199 -480 -196 -546 365 1121 278 -768 -75 196 -47
2519 -47 -542 -278 734 -109 -449 348 198 235 -898 -101 667 -624 -771 -164 103 102 -827 -67 540 -517
2539 -517 -238 528 376 134 -704 188 1115 -729 -265 551 263 -78 -426 384 499 -546 -422 386 84
$$ [...]
8191A29
##END NTUPLES=NMR FID
##END=
