##TITLE=1H_Pr 5063-d
 CDCl3
 72 sc, 
 16.12.2021
##JCAMPDX= 6.0         $$ Bruker NMR JCAMP-DX V2.0
##DATA TYPE= NMR FID
##DATA CLASS= NTUPLES
##ORIGIN= UXNMR, Bruker Analytische Messtechnik GmbH
##OWNER= root
$$ XWIN-NMR		Version 3.5
$$ Thu Dec 16 12:57:35 2021 Russian Standard Time (UT+4h)  she@DPX200
##.OBSERVE FREQUENCY= 200.131346
##.OBSERVE NUCLEUS= ^1H
##.DELAY= (6, 6)
##.ACQUISITION MODE= SIMULTANEOUS
##.ACQUISITION SCHEME= undefined
##.AVERAGES= 72
##.DIGITISER RES= 18
##SPECTROMETER/DATA SYSTEM= spect
##.PULSE SEQUENCE= zg30
##.SOLVENT NAME= DMSO
##.SHIFT REFERENCE= (INTERNAL, DMSO, 0, 15.7039)
##AUDIT TRAIL= $$ (NUMBER, WHEN, WHO, WHERE, WHAT)
$$ ##TITLE= Audit trail, XWIN-NMR		Version 3.5
$$ ##JCAMPDX= 5.01
$$ ##ORIGIN= Bruker BioSpin GmbH
$$ ##OWNER= she
$$ F:/spectra/data/she/nmr/H-F/1/audita.txt
$$ ##AUDIT TRAIL=  $$ (NUMBER, WHEN, WHO, WHERE, WHAT)
(   1,<2021-12-16 12:56:38.67 +0400>,<she>,<DPX200>,
      <continue with go, POWCHK disabled, PULCHK disabled
       configuration hash MD5:
       00 E9 B6 7A A2 85 ED C7 34 08 36 98 17 FE 4E 26
       data hash MD5: 16K
       CA 38 26 60 AA 97 A5 9E 52 D8 D1 AC 27 07 CB F7>)
$$ ##END=
$$ 
$$ hash MD5
$$ 45 60 AE 1C BF DD 8D 70 42 DD D1 25 4D 31 36 06
##$RELAX= 
##$RELAX= 
##$RELAX= 
##$RELAX= 
##$RELAX= 
##$RELAX= 
$$ Bruker specific parameters
$$ --------------------------
##$DU= <F:/spectra>
##$EXPNO= 1
##$NAME= <H-F>
##$PROCNO= 1
##$TYPE= <nmr>
##$USER= <she>
##$AMP= (0..31)
100 100 100 100 100 100 100 100 100 100 100 100 100 100 100 100 100 100 
100 100 100 100 100 100 100 100 100 100 100 100 100 100 
##$AQSEQ= 0
##$AQ_mod= 1
##$AUNM= <au_zg>
##$AUTOPOS= <>
##$BF1= 200.13
##$BF2= 200.13
##$BF3= 200.13
##$BF4= 200.13
##$BF5= 200.13
##$BF6= 200.13
##$BF7= 200.13
##$BF8= 200.13
##$BYTORDA= 1
##$CFDGTYP= 0
##$CFRGTYP= 5
##$CHEMSTR= <none>
##$CNST= (0..31)
1 1 145 1 1 1 1 1 1 1 1 1 1 1 1 1 1 1 1 1 1 1 1 1 1 1 1 1 1 1 1 1 
##$CPDPRG= <>
##$CPDPRG1= <>
##$CPDPRG2= <>
##$CPDPRG3= <>
##$CPDPRG4= <mlev>
##$CPDPRG5= <mlev>
##$CPDPRG6= <mlev>
##$CPDPRG7= <mlev>
##$CPDPRG8= <mlev>
##$CPDPRGB= <>
##$CPDPRGT= <>
##$D= (0..31)
0 1.2 0 0 0 0 0 0 0 0.06 0 0.03 0 0 0 0 0.0002 0 0 0 0 0 0 0 0 0 0 0 0 
0 0 0 
##$DATE= 1639644714
##$DBL= (0..7)
120 120 120 120 120 120 120 120 
##$DBP= (0..7)
150 150 150 150 150 150 150 150 
##$DBP07= 0
##$DBPNAM0= <>
##$DBPNAM1= <>
##$DBPNAM2= <>
##$DBPNAM3= <>
##$DBPNAM4= <>
##$DBPNAM5= <>
##$DBPNAM6= <>
##$DBPNAM7= <>
##$DBPOAL= (0..7)
0.5 0.5 0.5 0.5 0.5 0.5 0.5 0.5 
##$DBPOFFS= (0..7)
0 0 0 0 0 0 0 0 
##$DE= 6
##$DECBNUC= <off>
##$DECIM= 32
##$DECNUC= <off>
##$DECSTAT= 4
##$DIGMOD= 1
##$DIGTYP= 9
##$DL= (0..7)
0 120 120 120 120 120 120 120 
##$DP= (0..7)
150 150 150 150 150 150 150 150 
##$DP07= 0
##$DPNAME0= <>
##$DPNAME1= <>
##$DPNAME2= <>
##$DPNAME3= <>
##$DPNAME4= <>
##$DPNAME5= <>
##$DPNAME6= <>
##$DPNAME7= <>
##$DPOAL= (0..7)
0.5 0.5 0.5 0.5 0.5 0.5 0.5 0.5 
##$DPOFFS= (0..7)
0 0 0 0 0 0 0 0 
##$DQDMODE= 0
##$DR= 18
##$DS= 0
##$DSLIST= <SSSSSSSSSSSSSSS>
$$ [...]
##$SUBNAM2= <"">
##$SUBNAM3= <"">
##$SUBNAM4= <"">
##$SUBNAM5= <"">
##$SUBNAM6= <"">
##$SUBNAM7= <"">
##$SUBNAM8= <"">
##$SUBNAM9= <"">
##$SW= 18.0517287032376
##$SWIBOX= (0..15)
0 0 2 0 0 0 0 0 0 0 0 0 0 0 0 0 
##$SW_h= 3612.71676300578
##$TD= 16384
##$TD0= 1
##$TE= 0
##$TE2= 300
##$TE3= 300
##$TEG= 300
##$TL= (0..7)
0 120 120 120 120 120 120 120 
##$TP= (0..7)
150 150 150 150 150 150 150 150 
##$TP07= 0
##$TPNAME0= <>
##$TPNAME1= <>
##$TPNAME2= <>
##$TPNAME3= <>
##$TPNAME4= <>
##$TPNAME5= <>
##$TPNAME6= <>
##$TPNAME7= <>
##$TPOAL= (0..7)
0.5 0.5 0.5 0.5 0.5 0.5 0.5 0.5 
##$TPOFFS= (0..7)
0 0 0 0 0 0 0 0 
##$TUNHIN= 0
##$TUNHOUT= 0
##$TUNXOUT= 0
##$USERA1= <user>
##$USERA2= <user>
##$USERA3= <user>
##$USERA4= <user>
##$USERA5= <user>
##$V9= 5
##$VALIST= <valist>
##$VCLIST= <CCCCCCCCCCCCCCC>
##$VD= 0
##$VDLIST= <DDDDDDDDDDDDDDD>
##$VPLIST= <PPPPPPPPPPPPPPP>
##$VTLIST= <TTTTTTTTTTTTTTT>
##$WBST= 1024
##$WBSW= 4
##$XGAIN= (0..3)
0 0 0 0 
##$XL= 0
##$YL= 0
##$YMAX_a= 288344
##$YMIN_a= -481630
##$ZGOPTNS= <>
##$ZL1= 120
##$ZL2= 120
##$ZL3= 120
##$ZL4= 120
##$ABSF1= 10
##$ABSF2= 0
##$ABSG= 5
##$ABSL= 3
##$ALPHA= 0
##$AQORDER= 0
##$ASSFAC= 0
##$ASSFACI= 0
##$ASSFACX= 0
##$ASSWID= 0
##$AUNMP= <proc_1d>
##$AZFE= 0.1
##$AZFW= 0.1
##$BCFW= 1
##$BC_mod= 2
##$BYTORDP= 1
##$COROFFS= 0
##$CY= 11.3945322036743
##$DATMOD= 1
##$DC= 2
##$DFILT= <>
##$DTYPP= 0
##$F1P= 2.36226072786647
##$F2P= -0.459571619588291
##$FCOR= 0.5
##$FTSIZE= 0
##$FT_mod= 4
##$GAMMA= 1
##$GB= 0.15
##$INTBC= 1
##$INTSCL= 1
##$ISEN= 128
##$LB= 0.24
##$LEV0= 0
##$LPBIN= 0
##$MAXI= 10000
##$MC2= 0
##$MEAN= 0
##$ME_mod= 0
##$MI= 1.114404
##$NCOEF= 0
##$NC_proc= 0
##$NLEV= 6
##$NOISF1= 3.799351
##$NOISF2= 2.8
##$NSP= 1
##$NTH_PI= 0
##$NZP= 0
##$OFFSET= 15.70392
##$PC= 1
##$PHC0= -15887.8
##$PHC1= 31.80079
##$PH_mod= 1
##$PKNL= yes
##$PPARMOD= 0
##$PSCAL= 0
##$PSIGN= 0
##$REVERSE= no
##$SF= 200.130013532006
##$SI= 16384
##$SIGF1= 3
##$SIGF2= 2
##$SINO= 400
##$SIOLD= 16384
##$SREGLST= <1H.CDCl3>
##$SSB= 0
##$STSI= 0
##$STSR= 0
##$SW_p= 3612.71676300578
##$SYMM= 0
##$S_DEV= 0
##$TDeff= 0
##$TDoff= 0
##$TI= <>
##$TILT= no
##$TM1= 0
##$TM2= 0
##$TOPLEV= 0
##$USERP1= <user>
##$USERP2= <user>
##$USERP3= <user>
##$USERP4= <user>
##$USERP5= <user>
##$WDW= 1
##$XDIM= 8192
##$YMAX_p= 0
##$YMIN_p= 0
$$ End of Bruker specific parameters
$$ ---------------------------------
##NTUPLES= NMR FID
##VAR_NAME=  TIME,          FID/REAL,        FID/IMAG
##SYMBOL=    X,             R,               I
##VAR_TYPE=  INDEPENDENT,   DEPENDENT,       DEPENDENT
##VAR_FORM=  AFFN,          ASDF,            ASDF
##VAR_DIM=   8192,          8192,            8192
##UNITS=     SECONDS,       ARBITRARY UNITS, ARBITRARY UNITS
##FACTOR=    0.0002768,     1,               1
##FIRST=     0,             0,               0
##LAST=      2.2672688,     0,               0
##MIN=       0,             -481630,         0
##MAX=       2.2672688,     288344,          0
$$ Real data points
##PAGE= N=1
##DATA TABLE= (X++(R..R)), XYDATA
0 0 0 0 0 0 0 0 0 0 0 0 0 0 0 0 0 0 0 43 -72 72 -72 72 -72 110 -144 144 -158 216 -219 287 -294 360 -392
33 -392 441 -508 580 -649 725 -807 898 -997 1116 -1232 1362 -1510 1673 -1843 2033 -2249
49 -2249 2475 -2719 2997 -3304 3646 -4022 4458 -4953 5509 -6155 6924 -7834 8953 -10357
63 -10357 12170 -14637 18191 -23756 33927 -58556 288344 16328 -393455 -53415 103868
74 103868 102837 -31554 48952 73227 -77237 -148524 -39746 76307 195702 39664 -133255
85 -133255 -121167 -35104 76561 93127 10602 40482 -53200 -156009 -39689 107853 152395
96 152395 22607 -137548 -64602 -7808 -2769 78919 77798 15940 -66611 -136036 -17917 97975
108 97975 105234 43168 -100400 -91739 16241 4064 38306 80940 29814 -52556 -137498 -39780
120 -39780 133264 88933 -12750 -56913 -53602 -3393 -19282 23001 105611 22980 -69113 -91570
132 -91570 -47482 90163 94797 -208 -39590 -66033 -22636 12711 11814 84225 47454 -80625
144 -80625 -92731 -23400 83778 84569 -27072 -31202 -16012 -37027 -9443 14787 71379 63313
156 63313 -71327 -94624 -14408 55527 83864 -920 -46463 -12829 -31568 -17673 26169 56653
168 56653 55644 -56110 -98500 3144 49562 47695 11724 -30429 -8385 -32811 -39467 40343
180 40343 62352 32444 -39322 -89868 -3817 55432 32458 14964 -22794 -17493 -14985 -41943
192 -41943 24678 69423 22532 -31639 -71876 -13323 54040 17598 11360 8342 -25148 -29228 -35086
205 -35086 21030 77990 16067 -43295 -51961 -16172 48751 24253 -5291 13925 -16355 -32199
217 -32199 -23119 6856 67165 26679 -47134 -37865 -12638 25229 27116 -1926 18418 -6708 -49387
230 -49387 -18430 19006 53317 28106 -48862 -36406 1805 12150 23825 2385 9902 8187
242 8187 -47679 -28651 25742 42018 27583 -35740 -40505 7692 6058 12919 18122 4589 1431
255 1431 -39384 -31289 34277 35804 12560 -19871 -36408 5565 7258 -3056 22984 13970 -4592
268 -4592 -31027 -38488 28088 46893 3803 -17173 -29758 -3605 13551 -4503 18639 21838 -16061
281 -16061 -25964 -24895 17185 43773 -1626 -16351 -11731 -11767 7145 -1441 12348 30541 -14063
294 -14063 -33123 -17155 11980 41189 4779 -23576 -5125 -10004 -2499 8384 7453 24823 -7224
307 -7224 -36533 -8806 10746 26497 13298 -20451 -4389 -4601 -14739 8813 14577 18029 -1019
320 -1019 -39008 -10978 19925 16762 10605 -15282 -7717 3258 -16614 1788 22202 12462 788
333 788 -29541 -17824 20747 12743 6979 -1112 -12528 -1132 -12207 -4130 26757 11990 -9386
346 -9386 -20725 -17791 19975 16004 -3651 3056 -7211 -7050 -6295 -8989 22999 18561 -12490 -15225
360 -15225 -14546 9129 20544 -3816 2404 30 -14691 -5077 -2547 16509 20673 -15738 -16806 -2974
374 -2974 3065 16298 -81 -1672 7306 -13859 -11610 4033 11215 20123 -8707 -22613 391
387 391 1792 9471 8001 -4171 4361 -8853 -16124 8123 10848 10977 -2143 -20293 -784 5956
401 5956 -435 10029 1595 -776 -4002 -18878 3631 18185 5329 -1261 -16367 -5578 9773
414 9773 -567 5821 6053 -5291 -3809 -12080 -1392 19758 3452 -3640 -6375 -9640 6878 1189
428 1189 1309 12551 -3973 -9740 -6876 -2470 18319 7746 -9963 -3269 -7313 1085 6576 -1450
442 -1450 9734 2323 -13071 -5233 -1869 9935 11630 -9817 -4667 -1852 -4437 6619 1936 5209
456 5209 5846 -14264 -6702 4969 4886 10087 -5386 -7410 2112 -5371 1548 6658 1756 4227 -9037
471 -9037 -10742 6533 3948 5283 1966 -9375 655 -1750 -4315 9688 2840 -419 -4347 -12189
485 -12189 5889 7395 -633 3346 -5799 -3738 1132 -6093 7644 8671 -3614 -3170 -9897 -126
499 -126 10829 -105 1154 -80 -7142 1160 -1651 1485 10381 -4049 -5430 -2866 -3109 8325 2037
514 2037 -1962 2621 -7041 -2556 1605 169 8855 -320 -9175 -719 -2061 3480 5627 -3152 2719
529 2719 -2487 -7073 4832 48 3562 3140 -8971 -1978 997 -372 7279 -338 -1124 499 -7770
544 -7770 1376 5190 1240 4388 -6185 -4731 4344 -792 2368 2856 -3539 1987 -4576 -3510 6934
559 6934 1063 358 -45 -7735 2762 -5 -174 5419 -2454 -2804 -1078 -5822 6806 3844 -2950 767
575 767 -4514 -79 5786 -242 3274 316 -5474 576 -2460 2279 6426 -2942 -627 -1849 -4749
590 -4749 4722 734 -343 3731 -6284 -2517 1652 -1611 6593 -1205 -3521 1161 -4252 1884 4416
605 4416 -1864 2897 -2039 -5346 3456 90 2312 2939 -5375 -302 -1207 -2396 5962 -705 -105 978
621 978 -6121 573 2271 -1172 3478 -3343 -2427 1897 -3601 2551 3139 -3110 2075 -4122 -987 4454
637 4454 -1414 2027 762 -4672 1945 -88 315 5137 -2253 -1736 -741 -3930 3699 587 -1384 2022
653 2022 -4288 -789 715 -1667 4417 1260 -4033 1032 -2949 1546 4019 -2402 969 -552 -3325
668 -3325 2896 -1197 854 3052 -3844 -1020 393 -1809 3475 -91 -789 1169 -5663 1102 1616 -2742
684 -2742 2410 -1414 -3528 2746 -1366 1758 2660 -2686 1212 -2331 -2156 4010 -2080 -87 362 -4291
700 -4291 1421 1279 -642 4145 -1930 -635 1381 -2707 2303 2160 -2121 2038 -2892 -960 2918 -1688
716 -1688 2108 595 -2526 -1128 -1100 -12 3790 -2408 -282 -38 -3493 3289 396 -598 2090 -3049
732 -3049 -160 1595 -1965 2457 -429 -2022 1305 -3449 1698 2509 -2456 2782 -1131 -3236 2002
747 2002 -1107 1092 1879 -3634 -58 -330 -1886 3038 -655 -289 1521 -3308 964 447 -84 1837
763 1837 -1727 -1507 1377 -2468 1436 1984 -2110 1285 -1787 -1077 2516 -774 836 -118 -2700 1523
779 1523 -410 -1205 2499 -1091 162 1358 -3132 1680 360 -405 1447 -2522 -532 1652 -2112 2337
795 2337 547 -1886 1126 -2406 331 2657 -1592 845 324 -2072 2398 -1110 -49 1681 -3363
810 -3363 -873 782 -1791 2067 -399 -674 1023 -2364 939 1029 -1084 2185 -1348 -1392 1702 -1261
826 -1261 977 1643 -1600 1082 -545 -1236 2489 -663 -291 1459 -2885 583 794 -1298 3093 -452
842 -452 -344 888 -2112 1944 765 -1299 1378 -1866 -1109 1840 -1418 1485 802 -1847 1601 -830
858 -830 -948 1228 -1866 446 699 -2431 1297 -273 -1009 1524 -1869 -569 301 -1386 1953 -22
874 -22 -1133 144 -2131 -491 1462 -1680 1408 162 -1244 1148 -1948 209 1478 -2226 264 -347
890 -347 -1761 1435 -707 -994 1613 -2315 407 1014 -1610 1827 -736 -811 1083 -1385 893 795 -1219
907 -1219 1578 -1819 -1168 1457 -1107 470 831 -1393 1099 240 -796 1775 -1108 179 1014 -1742
923 -1742 1016 636 -838 1111 -2131 302 1858 -1364 1280 -236 -1573 727 -2206 182 2264
938 2264 -1294 597 131 -1781 1041 -1240 81 2491 -650 -199 -213 -1100 1564 -127 -1348 1385
954 1385 -1740 1081 963 -1519 2175 -604 -1661 1302 -556 564 944 -2047 363 -147 -1578 523
970 523 -670 741 1226 -2049 778 127 -406 1455 -1083 -83 550 -1092 632 614 -932 2261 -1091
987 -1091 -339 1681 -1293 493 159 -1376 469 -506 -336 1333 -2271 85 474 -1431 1158 -390
1003 -390 -424 860 -1012 505 400 -1888 1668 367 -602 1346 -1009 461 1290 -1792 685 604 -880
1020 -880 1434 -1198 -172 1293 -824 198 813 -1155 1618 -3 -899 968 -769 916 70 -747
1036 -747 980 -462 -1005 993 -786 357 747 -1077 1241 -1073 -1211 655 -37 565 1192 -1666 228
1053 228 -248 -711 1580 -809 583 1148 -1184 967 -130 -1565 2008 -1550 -319 693 -996 1060
1069 1060 -85 -948 908 -586 105 1416 -1668 323 368 -1530 586 36 -223 2063 -848 807
1085 807 500 -1094 1364 -228 -628 562 251 703 1769 -374 217 -208 -460 1394 -467 -149 223
1102 223 -119 658 -853 -722 334 -146 1227 1280 -837 713 -38 -893 755 83 -128 1120 -334 -66
1120 -66 216 -889 420 -363 -1339 747 -617 302 236 -705 967 166 -352 743 -751 158 -194 -1137
1138 -1137 969 -572 -288 475 -621 13 469 -498 1277 584 -295 221 -760 270 900 -619 297 -427
1156 -427 -1121 623 -354 -546 584 -654 763 -302 -1012 510 -543 405 477 -559 -280 -450 463 99
1174 99 274 -209 715 -1373 487 1040 -529 1542 -478 -69 556 -454 441 909 -1275 497 356 -239
1192 -239 1127 -442 268 422 -996 271 -184 -254 826 -834 23 654 -694 410 912 -820 221
1209 221 -1263 -266 1072 -713 293 -662 -915 526 40 -354 193 -1059 116 585 -574 684 378
1226 378 -1381 -608 -893 -173 508 -605 869 -95 -1062 556 -317 1109 398 -396 353 1 -8 1053 -171
1245 -171 -579 542 53 1574 3 -543 892 -37 -332 727 -940 370 47 -1187 795 56 361
1262 361 75 -123 113 106 -481 676 -239 -253 586 -429 314 429 -1021 550 -130 -775 522 -121 554
1281 554 535 67 556 51 -735 176 -1227 551 -125 -1542 854 166 -269 1107 -423 137 -245 -926
1299 -926 -339 -493 -965 345 320 650 451 -1400 163 705 -717 941 -399 -514 735 -800 283
1316 283 960 -1199 -142 -509 -645 867 -354 747 348 -169 1008 18 -402 866 -542 271 901
1333 901 -184 439 742 -264 868 -583 65 303 -638 765 18 -366 1245 -665 -580 -5 -381 863
1351 863 303 -7 186 -610 588 326 -1062 -319 -660 -1205 369 361 329 181 -647 69 496 -565 317 -478
1371 -478 243 839 -288 180 960 -779 422 254 -858 1413 -277 -269 133 311 425 169 548 822 86
1390 86 -557 -300 -62 -322 -396 -683 1104 -32 84 404 -55 335 -367 -522 575 59 -676 1265 -769
1409 -769 151 854 234 131 -575 -1099 1682 245 -405 599 -129 1087 -193 212 158 860 230 703 -67
1428 -67 1063 33 -473 318 -342 411 683 -55 599 -189 -614 1190 206 -659 395 -315 183 149 -376
1447 -376 -399 -592 -62 -26 323 840 383 -1197 -5 -262 -635 394 -483 50 666 -572 487 -548 -351
1466 -351 1226 -76 -70 626 -58 206 -70 -546 36 -668 -238 -355 -385 668 473 -856 553 -560 -23
1485 -23 297 -418 190 157 -1223 385 -431 -459 517 -204 61 -566 -1120 624 -881 -380 445 -158 -347 598
1505 598 -335 263 162 -1081 433 -277 310 409 -49 1072 211 475 264 -614 681 -256 -457 -264 332
1524 332 -316 545 57 12 138 -1015 853 213 -932 1058 -665 54 903 -784 -555 703 -280 42
1542 42 217 -165 433 -157 -11 1041 -291 49 -283 -496 941 -766 368 -143 -358 730 -228 -542
1560 -542 997 -397 137 526 -407 507 354 -353 186 -477 20 39 -324 761 14 194 404 82 396
1579 396 531 324 -2 -322 -1096 -149 -415 -232 -105 -974 305 -232 -574 313 -321 655 523 -620 617
1598 617 343 -605 136 -265 -355 500 306 -117 271 42 323 361 -557 350 -657 -17 -137 -395 408 -449
1618 -449 -912 -523 -712 -219 -286 -1021 252 450 76 -163 -24 227 217 -86 -17 -70 -275 -776 -328 -756 228
1639 228 -455 67 470 -507 180 -285 -810 704 78 12 137 -177 -163 -78 -1195 861 109 19 348 -113
1659 -113 606 -240 1163 -348 -866 441 -556 5 734 -168 -1053 440 -830 -765 33 -824 370 340 -334
1678 -334 152 68 -284 85 -150 -186 55 -670 480 -906 726 47 724 935 483 359 146 538 -158 -186
1698 -186 69 -464 -266 23 -344 341 -761 547 -224 68 -365 314 -435 -627 -515 51 746 -91 148
1717 148 97 412 -49 -68 429 59 245 230 -216 8 777 -114 358 -341 222 406 -357 -104 -269 -258 312
1738 312 632 -551 231 111 323 285 478 92 -158 -224 435 57 -341 353 -409 80 -144 -249 178 188 499
1759 499 -50 -152 139 294 51 -261 -558 -319 1009 -607 77 288 243 -765 -920 193 345 412 -731
1778 -731 639 690 309 116 35 -797 375 -856 -82 506 713 -736 -489 929 -482 120 546 -856
1796 -856 -71 -149 -705 505 -618 261 488 -267 -130 -308 196 -94 298 764 399 400 -122 1174 -3 -25
1816 -25 210 -397 56 -2 96 -165 -606 391 -365 521 1025 106 -7 -783 -307 529 6 -672 135 -219 -331
1837 -331 88 57 775 438 -447 565 206 576 168 -455 93 889 -363 -20 -167 647 645 -1090 -973 -561
1857 -561 -79 -43 327 129 1039 -521 73 -247 799 1297 -78 -381 738 34 -806 793 -187 148 131
1876 131 -313 653 300 488 368 3 124 -285 -200 351 -29 984 102 -601 -194 858 -523 -459 -495 36
1896 36 -99 -629 -580 -421 182 -82 794 -977 388 -187 -84 533 146 -70 -212 -237 -144 -378 -40 718 204
1917 204 638 720 -48 8 529 464 -406 -610 -273 -575 -447 684 193 800 28 -282 -344 -261 580 -324 431
1938 431 -509 -214 -181 196 33 126 565 -287 -31 221 337 117 -329 -52 188 -643 -393 220 -354 -290 536
1959 536 -158 -346 752 423 304 860 134 -195 -616 -322 -420 54 150 413 345 -87 559 280 -431 990
1979 990 -745 -642 110 525 693 -478 592 -656 95 217 97 171 -436 -39 286 -848 328 -265
1997 -265 42 547 -312 411 -366 268 -139 -347 720 -235 69 -122 -377 -648 225 -2 118 155 -126 -299
2017 -299 -9 250 -195 -285 -174 671 -206 -116 -289 -386 -62 -47 630 -466 397 -411 278 499 681 -116 356
2038 356 -607 -404 -829 243 -239 -12 661 -597 598 -71 342 276 45 367 -127 -99 -351 -682 425
2057 425 422 722 646 -38 -673 -31 149 152 -167 634 -295 69 70 -758 -65 343 0 -489 337 -168 324 -378
2079 -378 414 -74 208 -191 -620 -289 -665 -131 289 592 -52 159 185 1151 -426 -49 -182 -1158 228 147
2099 147 408 191 -765 581 -469 -777 -165 273 118 -17 365 -399 152 4 -137 -202 349 -441 129 -572
2119 -572 -354 -515 -184 -527 426 154 -323 295 336 481 -206 -641 234 43 102 264 192 94 -936 -500 107
2140 107 -133 125 -250 931 391 -829 289 -760 207 340 -112 311 170 72 446 -379 4 117 42
2159 42 -260 244 222 265 66 -721 363 -426 306 200 119 253 563 -539 -274 411 183 -1166 -937 715
2179 715 296 -170 213 -598 -447 712 -779 -188 -15 1 -261 76 52 -319 377 848 -247 192 882 -518
2199 -518 -320 523 81 -11 -238 774 -622 -202 451 -655 684 -200 -326 -366 539 77 148 697 511 881
2219 881 -287 -167 465 442 288 170 -695 -113 -243 -251 1100 322 261 458 -380 242 1002 279 -533 299 -826
2240 -826 186 -59 329 -151 -293 317 -507 -100 -163 890 -502 799 163 230 -173 -639 -679 -690 123 48
2260 48 -92 182 196 -544 102 -59 -850 -886 -199 -147 110 -1 -302 785 375 153 166 -324 -555 -186 -336
2281 -336 96 -360 5 205 969 -171 -270 487 -693 24 -180 -91 -588 -611 616 289 643 -463 -513 241
2301 241 165 -21 2 232 -652 -161 -348 -567 740 205 -650 628 -24 -163 -124 -186 276 898 -408 306
2321 306 487 200 -427 -274 99 -358 -373 -76 943 -180 961 457 -563 147 -949 194 407 -68
2339 -68 216 -544 418 110 -246 219 995 -384 118 88 83 -195 500 610 254 -230 -364 -35 351 -706 -845
2360 -845 -190 -183 12 -13 -150 -801 -188 127 -236 -530 -738 717 -342 234 -369 -517 762 -563 21 569
2380 569 24 -76 447 390 -109 -32 348 371 408 385 572 351 237 25 120 21 130 -1061 -197 510 -62 58
2402 58 232 190 358 453 24 481 -124 -51 0 -27 101 -679 -237 -549 -274 419 14 -209 345 -267 -487 -597
2424 -597 354 646 131 -465 -543 -59 373 -101 -408 276 -47 -214 128 -267 443 -500 109 689 28 -390
2444 -390 282 388 -1219 -7 22 -45 53 33 415 363 286 -298 -346 519 339 -68 4 -598 -556 81 280 -330
2466 -330 -274 -285 -54 -602 280 -42 -152 -10 -391 70 18 -7 636 -437 454 144 -282 -1147 157 199 353
2487 353 -320 1 461 -375 -23 -88 722 -181 -425 -141 200 -55 1413 -136 -781 102 -307 -99 236 721
2507 721 -397 -214 -162 -435 -518 282 -76 508 65 381 -108 657 -330 -152 -98 83 608 76 55 -23 33 -201
2529 -201 68 -275 41 -114 95 -323 -270 681 -529 11 -154 -116 444 -196 -329 725 762 31 385 -469
2549 -469 196 -20 -147 -114 358 706 585 308 295 219 -30 61 -818 -240 404 305 -401 -531 -506 165 -733 122
2571 122 -547 -738 -1091 9 366 -69 107 -133 -237 157 -259 -164 449 -401 56 114 343 -261 700 377
2591 377 -593 341 -140 -428 -810 21 -131 -426 250 431 534 -117 -214 -114 -30 -211 -386 -452 -382 332 257 -116
2613 -116 -579 86 -178 -561 -796 327 198 198 1041 -289 288 -232 25 -239 302 -70 243 -6 -330 -853
2633 -853 -464 -234 -399 -314 -210 395 -469 -264 -398 -313 -929 -104 -377 193 -656 -1051 458 128 -824 572
2653 572 -691 756 365 109 -12 333 43 -381 -645 -144 -1072 -166 -385 -208 524 -222 221 542 -1087
2672 -1087 -43 -485 -1305 -697 -1334 770 -606 286 -116 -122 -123 -375 800 1162 -661 76 -494 -400 -231 -744
2692 -744 -106 265 -892 -590 275 108 -476 947 485 -277 -136 766 -28 787 404 -684 756 -164 209
2711 209 51 789 -364 -793 -271 -500 41 -121 -162 986 786 -341 -960 275 117 557 1275 -650 -726
2730 -726 559 -589 -1235 789 105 -65 135 57 -461 -249 449 113 -690 -387 399 842 -395 -544 -275
2749 -275 465 -191 307 -625 -316 574 139 135 -691 -698 609 423 -325 -156 -462 929 -64 -59 -240 489 864
2770 864 -161 106 -205 -18 4 543 -889 -419 201 -371 -102 -374 405 635 10 -2 28 1 428 -43 219
2791 219 94 -106 1208 697 5 130 -241 849 145 -274 501 311 -124 446 -285 -619 354 104 -46
2810 -46 316 338 -363 -31 -31 -82 -163 390 -328 329 409 639 -551 -338 -445 -361 1147 669 282 -211 302 -238
2832 -238 294 286 259 383 -525 90 -8 428 -208 -627 512 136 -780 -293 -337 51 -280 -203 -138 5 -113 -722
2854 -722 -1121 -264 49 -10 -86 -362 354 280 58 -433 117 517 25 -451 -483 163 -245 -777 -249 -133 -385
2875 -385 499 -649 -1194 124 -169 337 274 -1008 -131 264 418 367 -121 368 -111 624 507 -352 -32 841
2895 841 -89 388 49 898 189 -426 -388 -265 536 -510 900 149 20 -273 -188 -211 139 466 307 -481
2915 -481 294 -42 -18 -641 512 1010 555 -598 172 -86 111 -55 427 -519 -2 -367 161 -255 81 -401
2935 -401 -843 330 -946 -88 -403 206 95 142 -214 504 240 -533 674 185 696 -566 84 243 239 -100
2955 -100 76 486 -192 439 -1405 -90 -760 -672 -290 -684 47 -293 -184 403 152 -133 -77 -14 -483 52
2975 52 -118 283 -3 539 -324 -17 34 -224 659 337 165 -231 64 493 -398 -900 -128 -215 104 -654 224
2996 224 170 517 40 141 -228 189 688 795 -20 -138 28 -549 405 -66 -140 -435 425 122 420 -563 -131
3017 -131 138 -198 212 -205 -577 -368 576 -63 86 -462 -527 2 314 -376 253 773 -531 168 560 -112
3037 -112 -183 769 66 -646 368 -205 -331 -276 -201 64 -10 140 926 227 36 -35 -371 -248 253 178 286 204
3059 204 -216 94 -702 -65 -178 452 503 130 98 73 236 197 -240 -124 -24 -113 -115 -625 -17 -1155 825 -6
3081 -6 498 219 -313 398 9 657 858 -85 298 531 383 -321 -777 -430 182 1 92 563 -174 522 248
3102 248 142 -447 59 224 755 -112 305 -10 440 684 306 331 261 102 426 -283 627 -21 120 580 352
3123 352 -324 344 -50 -83 109 252 -525 505 374 431 61 399 -371 191 7 -419 137 0 333 129
3143 129 0 -956 95 -387 -142 -139 -543 -367 -244 -325 43 623 144 -106 102 -286 456 -594 834 56
3163 56 -90 -612 40 -74 51 499 214 622 -238 -353 438 790 -244 156 405 -497 -263 415 80 484
3183 484 -365 7 81 445 -359 -616 46 -592 -280 -534 -89 446 150 424 -469 -200 284 27 -946 -30
3203 -30 93 401 380 438 87 398 1104 -568 723 713 -111 12 -520 121 -418 351 26 -144 -27 -516 -82
3224 -82 628 -545 -369 -627 1 462 484 543 -341 -751 -232 -49 291 229 161 -433 632 -275 -371 -511 -272
3245 -272 -261 232 -89 -32 -545 -365 -559 174 377 -437 -238 362 609 -268 459 668 355 128 574 491 -121
3266 -121 -162 308 -532 -665 37 -706 473 -97 -243 525 -183 192 -189 -557 1162 166 -115 223 -2 86
3286 86 436 110 -233 53 298 -466 -275 664 -261 -594 -101 -77 -117 297 130 189 243 60 -250 300 -132 -801
3308 -801 -401 232 -245 -122 386 -263 28 463 371 -678 -725 -686 -317 -226 -624 670 -210 -161 -211 -266 606 -557
3330 -557 693 -506 -1105 -277 -55 118 -177 458 -261 -69 161 877 -395 -135 200 -289 -239 471 2
3349 2 328 467 -102 313 32 -515 308 -559 412 1071 27 132 93 235 -532 -474 -40 -305 -85 -128 -526
3370 -526 274 120 -23 -72 11 -279 -202 -9 563 548 -184 133 318 -17 -180 -852 418 -12 338 490 -628
3391 -628 150 256 -270 246 259 -140 -202 -313 -454 -117 117 -301 308 33 -375 656 496 -119 397 16
3411 16 -182 186 -250 356 110 409 310 172 -142 434 -163 236 -615 -203 9 -3 205 -263 -1333 -805 -101
3432 -101 12 -452 -187 174 -120 -254 42 -168 -762 250 779 450 -118 243 971 171 343 648 -594
3451 -594 -147 302 720 36 -656 -447 -855 -238 -269 458 196 546 134 -1695 90 -399 -80 -595 114 501
3471 501 409 -254 -113 310 627 -564 259 -573 720 -131 -89 -448 -252 140 8 -311 -38 529 -496 250
3491 250 -557 978 -961 421 470 -851 161 -1006 -22 295 -90 338 471 -152 687 176 -117 -648
3509 -648 -152 -401 -159 -51 -512 -797 366 -342 -9 161 260 -387 456 -249 -229 314 -588 218 -219 -221 361
3530 361 -216 1 239 141 -36 108 -4 -386 217 -313 -182 93 -58 250 -347 106 -239 -22 -408 454
3550 454 41 707 -157 548 154 -175 631 180 -354 -130 475 -129 -172 -359 539 681 -518 452 97 -494
3570 -494 -191 -407 -594 -336 -777 226 306 676 1123 -98 41 -433 589 556 264 -580 -809 176 47 -16
3590 -16 -293 263 -25 -678 72 -509 222 164 554 225 591 519 543 302 466 -267 -480 -89 -293 682 -275
3611 -275 -372 141 -363 451 325 -296 -267 -116 -53 478 -24 110 -280 148 -84 -653 523 -221 -321 -500 -263
3632 -263 -112 -151 891 3 598 -319 173 -313 -58 -244 -286 -257 -305 102 -776 138 -179 341 -193 126 227
3653 227 210 -303 -86 163 25 -61 234 -260 588 -214 43 -605 -883 -262 558 141 -34 -86 -144 -6 499
3674 499 -20 -640 -678 -513 -411 -308 449 -153 -308 -950 -399 -369 267 103 -551 -97 -475 65 -274 -253 542
3695 542 -349 -374 -437 -21 632 70 -216 -713 -405 814 -1000 356 32 134 -451 -114 34 191 354 -723
3715 -723 -55 -178 -252 286 -112 32 599 -359 -521 -3 -18 -339 565 -497 -119 -302 52 -606 -609 -584 190
3736 190 -750 -395 -18 336 78 345 -196 -61 863 404 64 -696 -424 -371 149 289 -2 -265 94 485
3756 485 158 -166 -321 92 515 -728 380 -419 278 572 -527 934 349 589 126 734 197 -284 725
3775 725 -514 773 248 460 801 169 -215 -105 -116 -230 -315 351 90 206 -2 58 252 -927 -58 -306
3795 -306 763 1390 360 -623 125 -760 52 -56 -468 638 -367 -362 -548 466 611 -396 -462 -521 446
3814 446 -325 -109 145 465 -235 79 -5 -559 171 -1159 287 -503 -215 45 -797 -501 87 252 -25 272
3834 272 220 104 106 -681 493 568 407 9 95 -456 -722 601 13 -2 211 576 -50 290 -1003 -269 -417
3855 -417 448 -634 433 341 -490 141 -535 -468 -388 740 181 -55 447 -75 -464 208 283 319 -451 216 -313
3876 -313 314 -277 138 216 -12 -354 -830 185 237 163 -246 -192 -183 -64 -610 584 125 88 -721 -960 262
3897 262 774 1122 -249 146 -109 -249 -165 303 -967 74 221 523 -11 26 211 170 5 53 884 -46
3917 -46 -1066 686 -695 147 261 -843 570 -556 -362 -526 169 77 -400 180 113 208 247 -332 517 -235
3937 -235 -115 35 418 -355 166 223 418 -147 789 -217 -534 186 634 158 202 -520 279 253 1014 -32
3957 -32 655 -846 229 354 212 -178 84 254 438 182 -142 -78 -216 527 255 -277 -222 -155 889 710
3977 710 132 199 365 316 -319 -92 -174 247 226 -119 -579 1202 142 189 -239 -69 -331 -520 -824 -182 -115
3998 -115 270 -40 -347 -191 962 -227 151 84 243 348 -93 471 -276 -173 340 406 50 -149 -57 161
4018 161 368 624 -19 -629 65 -140 383 -166 -568 806 -430 -868 471 697 133 235 -85 380 -571
4037 -571 122 -87 158 -2 -162 300 250 547 -739 306 -420 122 -625 -154 140 371 34 225 -224 -220
4057 -220 529 -3 173 991 698 584 -146 -85 272 67 94 -667 183 392 345 763 137 -304 -299 -456 -177 37
4079 37 -309 235 -102 -222 78 18 -147 -105 230 580 341 -329 -40 313 178 437 -171 289 320 -415 230
4100 230 537 -779 737 89 66 329 529 428 654 -337 296 316 -810 -346 198 65 -67 92 -1 535
4120 535 -89 244 851 19 -271 -124 -296 -858 -785 -399 149 609 690 257 618 -293 88 766 -189 -258 -485
4141 -485 177 -278 -358 -22 447 -76 173 165 326 705 203 414 -304 -452 -424 237 -250 371 -535 753 126
4162 126 538 -76 274 -636 -451 7 -648 342 -180 206 -152 -257 -194 22 -354 1411 -66 -1031 1096
4181 1096 703 -265 -835 32 -811 -140 8 -310 -257 -114 295 -436 87 -247 378 276 339 -383 67 21 -312
4202 -312 -231 -236 301 624 182 -363 -148 377 -430 217 240 407 -360 85 109 -279 -386 312 711 312 -229 498
4224 498 499 208 1267 -287 -119 387 540 53 -505 550 -379 214 -464 585 203 -241 360 -214 416
4243 416 -90 441 -374 47 90 -182 172 426 239 727 752 -302 -583 -402 -490 -651 350 387 110 -104 138
4264 138 -368 314 -620 -972 396 244 323 22 36 -81 -401 -353 -66 396 -456 -56 230 -61 391 -345 -117
4285 -117 95 44 -132 608 549 -158 -222 548 142 106 758 699 -284 -171 -262 -572 -321 -803 287 395 -408 111
4307 111 357 136 -49 -412 -386 -69 -499 528 434 -585 -331 -758 373 93 -300 249 235 187 874 -2
4327 -2 195 420 594 -173 -877 623 116 -167 -62 -12 313 -509 189 -309 349 231 796 950 769 68 -281
4348 -281 479 1092 851 -534 258 -16 65 666 37 201 370 658 575 34 -242 36 -229 501 -81 309
4368 309 391 -337 -119 206 813 121 397 678 113 220 -196 269 617 442 530 -1218 -72 194 180 -503
4388 -503 341 406 -227 -308 114 -183 199 385 -580 291 846 395 -129 611 815 -245 -505 320 194 396
4408 396 -86 404 -302 170 -388 -211 202 -229 -253 266 478 -271 818 669 78 42 67 -713 -120 -137 -306
4429 -306 329 -156 -75 -55 -137 715 260 -509 -10 -624 -234 -444 417 -26 -191 -52 325 182 -75 34 209
4450 209 523 -170 990 -391 -122 304 104 32 -272 367 -14 -129 71 -595 -260 261 -305 847 -607
4469 -607 -1184 228 -126 -82 89 -81 -259 -198 626 264 -575 -20 135 281 -180 -515 -309 244 4 846
4489 846 -33 -171 313 150 -132 656 236 -135 -366 -1 -295 -187 370 30 -245 -75 728 -151 -676 237
4509 237 353 -304 -434 888 -81 -55 -277 237 321 447 219 320 -526 -176 -49 -810 24 32 -421 888 -47
4530 -47 -1037 152 -570 438 -100 -276 150 -447 305 54 482 -98 509 281 121 -96 922 66 676
4549 676 -461 286 518 -116 -36 -293 -189 -691 -329 -53 35 425 204 60 -324 -321 -360 1167 588 -157 -94
4570 -94 72 -688 -360 422 109 -255 -494 -14 -36 225 -445 -490 -128 -185 149 -209 -147 187 93 -719 -115 34
4592 34 258 -198 -899 -153 85 190 -49 -417 260 -625 -805 -649 -197 264 -27 453 259 -13 74 -422 -179
4613 -179 95 676 -518 -398 -764 -271 158 -133 553 -564 -19 -538 86 213 -667 356 -16 402 -339
4632 -339 69 94 187 688 236 -412 -78 -416 134 716 -2 20 108 -190 207 -450 -148 -296 266 75 -225
4653 -225 277 -533 -339 -261 329 219 -99 363 -24 -116 671 286 -250 290 -273 9 292 416 37 45 133 -312
4675 -312 552 -485 310 11 250 -437 -111 -145 12 -682 -304 437 -651 -74 88 -310 -71 587 -398 93
4695 93 204 -185 13 -294 -529 -38 -414 -423 665 636 -121 -414 -915 -435 -305 -60 176 -430 42 -250 -238
4716 -238 703 -82 -275 -132 427 623 -370 190 137 -31 133 -364 -651 -412 406 -419 -508 -568 -570 -541 -373 99
4738 99 325 -584 164 -221 -123 42 -30 917 34 -171 -84 385 300 260 -736 242 -137 -384 493 -46 462 -99
4760 -99 -396 689 151 648 -90 275 -109 -316 325 -98 -140 -498 136 -164 551 -748 454 -70 65 -924
4780 -924 -444 -270 502 -308 -240 -172 -261 -562 721 339 -416 67 -917 357 404 -222 454 -261 -543 350 -224
4801 -224 -24 709 -96 700 433 293 31 550 -15 -424 -85 95 -15 -209 -225 -289 -87 436 -36 -321 342
4822 342 408 -285 -896 -339 -281 -315 29 -403 177 -557 192 66 -725 -170 -242 -590 -105 164 124 351 -202 119
4844 119 -447 -297 -876 591 -308 -514 -83 132 90 286 349 -41 137 -114 240 160 -490 -375 72 278 617
4865 617 -954 -786 36 -453 185 -88 366 -225 -644 216 -430 34 -35 -490 331 285 -36 596 -725 -76
4885 -76 -405 218 -449 -210 48 -613 333 216 -314 100 -319 -243 330 532 358 49 316 272 144 -242 337
4906 337 -156 507 -3 141 -527 -91 428 -31 902 315 -471 -277 391 256 -913 -91 -196 -414 -555 -102
4926 -102 -580 -482 -70 46 462 -158 -352 -448 427 46 116 342 -247 276 372 -132 -544 489 557 -97 -451
4947 -451 -763 -290 99 135 -574 -24 734 46 -59 -454 -46 -78 -611 228 -81 129 -459 -86 -144 -514 365
4968 365 375 -70 415 -397 -498 -603 622 -265 -256 -303 508 85 -62 531 278 -594 -886 -597 117 -726 -306
4989 -306 -270 -482 107 -15 -149 -608 -535 -304 -89 99 -335 -324 -478 -621 -448 11 155 121 -37 -640 670
5010 670 -51 -187 -552 -202 75 121 -332 130 -466 112 42 -281 -114 -40 132 95 228 -459 -891 303 309 352
5032 352 370 -164 -175 -873 157 428 60 223 233 -998 -86 376 -195 319 -413 -208 142 281 11 -631
5052 -631 -376 -201 -52 146 71 -425 -341 316 -119 -244 445 263 -521 -89 -113 433 -983 -738 990 240
5072 240 803 -593 282 257 -396 -309 -61 509 -375 -130 -552 50 -86 308 572 -441 -210 243 -263 276
5092 276 -478 427 890 -72 675 -353 109 -106 -321 -142 -447 -221 215 -145 -172 -279 -59 456 286 -177
5112 -177 -969 7 -368 768 93 115 214 655 448 241 151 553 338 23 -224 949 101 501 -88 -210
5132 -210 -356 -336 261 852 293 264 139 504 443 248 429 775 -171 319 -273 -597 -436 126 290 604 2
5153 2 14 -71 147 481 -286 86 566 -117 -814 559 39 -134 147 56 939 -428 -2 232 -356 178 -160
5174 -160 -637 -148 -200 130 471 306 -621 502 -295 -156 146 469 -392 427 304 -568 -707 -17 44 293
5194 293 71 219 314 -370 208 383 -407 274 -1220 3 -123 -954 376 -426 -190 47 269 379 -414
5213 -414 23 -141 368 -26 -528 -5 301 664 -348 247 -561 -205 -399 24 -94 -474 300 393 108 -192
5233 -192 302 -439 -201 -284 772 -299 -399 534 -131 -171 203 598 420 -440 -333 250 -394 294 409 772
5253 772 -447 514 -318 78 -266 -101 673 183 -86 -295 360 -443 63 -367 616 -137 83 -77 -594 340
5273 340 674 -681 631 -491 -299 339 -199 -269 9 246 -270 140 172 855 -265 731 -178 10 534
5292 534 815 216 399 -623 -250 103 340 436 -438 -776 -241 938 980 -511 339 186 -754 -171 -159 -131
5312 -131 269 -180 -44 401 22 11 -695 -411 -116 120 99 -422 -323 340 -640 -1129 -413 70 -374 84 -517
5333 -517 319 -293 -484 603 394 -70 -485 473 78 -296 -101 -732 628 -370 -540 -38 375 -669 -15
5352 -15 -218 92 -711 -249 406 3 470 304 351 96 445 -137 -18 39 -418 -112 702 -87 266 -8 398
5373 398 -26 779 270 -178 400 -828 -60 -210 -218 607 35 404 -215 -1022 -77 92 -304 -150 332 324 117
5394 117 -280 -628 156 207 4 -186 360 43 458 -318 -604 279 140 -77 -240 350 -289 713 -71 -112
5414 -112 -336 -174 -201 264 138 -449 -84 -62 133 -333 275 375 -354 93 191 -653 -24 111 -438 156 333
5435 333 256 -11 -64 -407 -698 -192 -44 446 -276 -29 339 -110 -525 -75 169 -137 -95 641 611 476 263
5456 263 -432 -150 384 521 -343 -294 -520 202 116 -248 -192 476 243 212 27 -107 -42 -183 109 363 511 245
5478 245 407 279 -37 -323 820 -84 143 -276 -600 -610 164 85 40 231 69 -227 24 -229 -422 -912 367
5499 367 -880 -666 31 456 614 -390 -806 22 336 -304 470 122 426 -210 299 143 366 -454 321
5518 321 189 251 152 -245 -464 -580 -65 810 -121 297 -253 -466 127 -234 -99 -605 195 313 92 -189 -655
5539 -655 -528 297 69 -371 341 -342 -65 23 -352 217 -728 603 -307 295 -661 -613 -243 60 -446 -153
5559 -153 387 289 483 -856 397 184 -726 -350 64 311 -337 -256 699 57 -146 -158 -486 -160 -478 -435 -633
5580 -633 -253 32 279 -165 -87 463 281 -407 -39 -256 -190 -703 -8 1 559 502 128 425 -457 -31 -383 -34
5602 -34 -295 -156 753 412 -162 -271 -147 378 -489 -402 -917 113 227 455 -16 -552 276 260 -290 -37 -358
5623 -358 -14 -471 -108 -220 -163 194 54 110 -430 -171 477 -352 -286 568 -331 -427 -73 -198 289 -265 80
5644 80 280 592 125 -396 591 -90 -489 -300 -13 447 -439 -391 -573 312 -300 63 425 -212 434 -87 664
5665 664 298 190 162 -248 203 -238 123 55 271 125 -38 -136 345 310 697 262 -31 -268 750 2 -82
5686 -82 -1018 -187 -365 -380 423 -62 -304 -200 315 396 -418 -605 -274 -433 -25 487 -146 -318 -571 331 199
5707 199 -326 -16 85 342 -287 150 306 -569 -786 505 64 665 171 815 -454 -311 -152 148 -310
5726 -310 -587 31 333 106 486 -339 286 949 -329 -128 -278 -652 413 68 646 281 -638 509 67
5745 67 811 -58 275 574 -435 1 -611 -126 -70 189 -94 -149 -115 -515 388 -628 -565 -146 325 -137 -680
5766 -680 -309 -204 -301 -322 460 -466 74 397 89 513 -522 401 -181 -479 -436 19 -631 887 -33 -193
5786 -193 252 432 -46 495 777 51 542 -1041 -1307 -185 329 164 -725 299 520 257 688 -419 -59
5805 -59 -514 -203 -29 618 -321 266 -236 -806 235 -1293 59 225 -340 -37 231 -39 -361 526 -78
5824 -78 -36 416 -787 83 -88 19 -194 -840 -277 -105 76 -493 258 -513 -457 -351 -84 -65 543 713 -83
5845 -83 154 -439 -31 -272 -167 124 -859 374 -644 -26 31 -549 -203 292 881 356 125 -464 -237 -18
5865 -18 -177 -62 -153 450 123 -199 21 -378 150 74 -435 -335 -277 -347 -299 545 147 -607 -88 45 876 -208
5887 -208 458 -177 -541 339 340 -451 351 -225 56 56 -381 -1188 -1735 -185 -509 -806 191 -883 -82 -58 916
5908 916 -122 -113 23 66 -27 27 215 -907 731 1046 -49 -781 -273 -194 391 -364 -910 -550 67 536 -22
5929 -22 381 330 -101 -414 724 414 217 272 272 153 -136 -17 -240 491 196 201 -159 162 -285 -387 -97 -447
5951 -447 344 -1020 -96 -118 -559 -145 -521 1382 322 -20 350 451 443 197 -180 46 388 -41 796 565
5971 565 -476 162 800 142 -759 46 9 -302 -400 -588 595 -47 -498 -976 48 1240 453 653 13
5990 13 477 9 -124 82 -113 -637 20 -217 110 -36 160 416 180 472 365 -142 399 1258 -329 340
6010 340 -236 619 47 37 136 506 1131 164 -229 147 -621 -654 -82 309 83 -171 320 -408 -491 -475 316 645
6032 645 -955 -397 -546 57 -339 -542 -603 40 333 46 -493 34 -193 20 776 302 -74 -477 480 515
6052 515 335 383 472 -490 232 625 -27 243 92 118 90 -326 232 1 106 318 -289 106 536 1076 485
6073 485 -563 127 386 377 111 665 -273 -585 177 326 51 604 -258 -432 -771 -525 -177 208 -235 -608
6093 -608 -455 187 256 -202 -320 -105 302 -110 646 104 -118 -571 -335 180 87 297 -430 704 23 -271
6113 -271 -492 40 615 103 119 471 -202 24 -62 443 -245 268 -685 -465 335 -446 146 -264 115 -721 -703
6134 -703 204 -433 490 -136 -76 477 -633 -227 110 -415 -161 -638 387 -526 -374 188 1082 93 -21 -590
6154 -590 557 165 -463 391 -266 -438 319 454 -637 -129 607 328 563 -508 267 102 -632 192 -2
6173 -2 -39 -482 513 -60 286 -47 -260 297 -220 -414 -29 -479 -71 -40 208 -3 167 -22 -229 -256 17 88
6195 88 -80 -156 32 403 475 -111 -503 -411 -408 365 157 -391 490 -251 519 -422 -293 -260 -25 750 -515 293
6217 293 219 -317 -25 -609 -173 -342 48 136 120 752 -351 582 721 807 5 -126 -754 -35 -463 69 -98
6238 -98 -472 -466 -293 487 -702 -291 -116 -607 -114 -159 298 -364 -546 62 763 -546 106 -212 -815 495
6258 495 582 374 -252 293 68 13 334 -585 -394 838 423 -764 -449 -163 -699 302 -344 -735 211 -312
6278 -312 599 -321 870 -4 -1318 -955 -24 518 -759 76 116 -15 -434 25 137 -768 -571 354 473
6297 473 -747 -710 -68 18 143 -115 26 -596 -360 -259 -119 -193 -202 162 480 414 414 204 -609 66 403 772
6319 772 -108 1 17 -64 79 31 64 -441 -333 114 -437 144 208 428 -321 -98 -164 -452 108 -875 -361 141
6341 141 -314 354 -202 675 639 -618 -83 -268 -15 30 -317 61 -309 -51 105 -330 -547 -759 -392 15
6361 15 -127 -261 721 646 -83 -161 -133 -787 -544 -308 -178 -219 -398 829 -492 261 270 236 -636 -250 -424 -350
6383 -350 -118 619 127 -1089 454 -53 -415 -90 -435 104 68 -182 133 -294 -611 92 -518 400 -320 -412
6403 -412 -263 -1188 -519 146 225 -1 -69 235 -219 798 263 560 -227 315 254 39 -1179 -252 658 -628
6423 -628 -467 569 6 -372 -63 -84 59 -3 490 -219 -256 81 -75 1102 50 -506 561 -132 248 3
6443 3 -84 86 -351 -431 -21 850 597 -527 154 -480 453 24 -295 -160 186 -542 196 905 -75 171 479
6464 479 -317 518 643 142 94 -518 -195 -127 -157 71 153 116 -187 74 -978 -246 234 124 223 31 -119 -57
6486 -57 553 70 218 -594 -31 -922 -254 555 1550 1610 -1166 -857 -421 -842 -400 25 -193 593 -175 211
6506 211 61 -262 -244 -89 -472 52 445 220 -631 -117 -443 -100 460 110 411 -210 118 -119 70 -139
6526 -139 -127 543 334 217 -98 -92 291 100 -526 21 653 -482 779 448 -183 -343 210 562 273 -84
6546 -84 -247 818 45 -423 -381 23 129 789 254 -55 -6 -408 -397 75 -170 550 704 -18 447 -690 180
6567 180 258 -142 -122 -557 -159 107 -693 446 -19 -195 -375 548 130 -237 -886 371 64 -385 466 -572
6587 -572 724 339 -531 475 334 542 314 907 361 -576 29 46 540 -375 622 33 -36 -119 -605 -349
6607 -349 -85 420 -498 417 83 -551 248 229 -334 -507 -174 327 -362 -985 399 -58 457 659 -411 -366
6627 -366 46 -419 -31 -673 -364 178 -402 466 743 -214 363 -29 258 -594 -602 -155 -682 105 -377 -627 -321
6648 -321 632 895 -830 -748 773 -951 -706 -479 -86 -114 -109 523 -182 757 607 -1612 -437 -68 483 -757
6668 -757 201 212 73 401 -153 -1542 -447 834 273 -658 139 -507 -617 1320 896 112 -407 -395 789
6687 789 777 45 1659 -807 48 1229 398 1102 300 -903 61 -398 -721 -687 863 -545 -93 -468 500
6706 500 -505 6 -606 30 -538 801 -1493 -1932 -552 540 250 -426 -682 905 -1148 -280 -417 413
6724 413 -46 -181 186 700 -497 -19 -369 -240 -63 377 -226 -218 347 4 224 637 308 1045 -1 -996
6744 -996 -315 840 328 -435 419 -68 -706 -993 378 -320 380 -1257 129 74 1166 -243 -442 -33
6762 -33 797 579 136 -1061 -511 86 484 -193 608 -113 -796 -646 -523 -692 157 -266 64 -1184 -364 96
6782 96 367 69 400 192 -95 -940 229 -478 68 -287 -380 -398 -210 -1 -162 -854 98 -25 247 333 310
6803 310 158 477 -262 -192 331 -484 -297 584 -113 -537 93 133 -835 -630 -836 -15 38 -211 431 -433 558
6824 558 177 172 -728 -95 -96 -19 -289 -186 -206 -405 204 -106 -857 -1190 -677 330 -247 -195 -834 -9 -134 -128 787
6847 787 -1439 413 -522 47 126 210 -738 568 -643 -554 -266 -316 -119 -36 602 -67 144 460 -516 89
6867 89 -268 -209 189 265 154 -16 -225 83 234 -412 47 75 653 1006 69 -251 400 141 -30 281 407
6888 407 -444 60 596 -312 146 -3 133 -150 367 -313 155 -2 29 398 453 -70 255 513 207 110 206
6909 206 -478 56 -3 17 -420 -518 -70 786 1012 -1215 -405 182 207 104 437 542 1062 -92 -310 303 699
6930 699 136 -23 -394 374 385 -429 312 257 -566 224 365 -701 -852 49 915 -145 -233 441 109 121 555
6951 555 186 -205 -681 828 19 -396 491 7 -565 260 554 122 -5 -85 41 220 -117 -255 -264 238 388
6972 388 840 3 218 -539 -312 40 161 843 335 -506 605 150 -98 -349 -297 538 222 412 883 -103
6992 -103 70 -682 519 88 -56 -559 316 587 -203 382 -561 719 -425 90 -65 -372 -108 -45 100
7011 100 -480 168 539 158 -35 -188 -808 197 -608 184 -471 -79 -97 -646 635 -659 538 11 -375
7030 -375 -135 122 -105 -135 41 212 379 -102 -485 474 91 -221 -12 629 -117 137 484 -572 -268 -464
7050 -464 -174 -115 -127 -77 -1001 757 -211 -211 -320 -45 -240 495 314 244 -309 232 -323 92 73 -853 725 -638
7072 -638 315 -1006 1588 -661 -113 1114 -1552 9 -236 -1451 332 -166 -71 -300 -896 -1000 -140 -658
7090 -658 154 1044 -289 220 -770 -113 -727 -347 -980 94 417 664 568 -45 -356 516 717 547 -51 -554
7110 -554 42 -191 -620 851 -229 -629 99 -487 -517 43 321 -280 687 122 185 429 112 540 303 406
7130 406 -258 -863 -157 -288 -11 247 165 -302 171 -505 -259 799 127 680 314 -126 43 -15 -380 413
7150 413 -406 -637 -214 -606 -203 -251 82 425 -133 890 39 -24 31 -294 30 -318 -398 -455 823 462 309
7171 309 -92 -22 -537 -566 60 211 173 -70 776 -147 -102 75 165 -546 169 -327 40 -419 408 353 202 -136
7193 -136 -729 354 537 -300 -346 -11 -49 -311 512 -233 253 42 1203 796 -984 2 777 272 484 -609
7213 -609 648 -20 -667 308 -59 753 -233 -574 -125 -158 457 247 -207 -608 -613 -45 -162 -541 -154 174 -365
7234 -365 -483 -67 261 -83 -35 45 -8 367 138 -122 564 399 -1069 -80 -225 738 306 131 -82 -669 -156
7255 -156 62 -65 88 -123 172 870 -5 -449 -305 -365 -163 -200 8 155 511 -1 -174 -262 -201 359 -401
7276 -401 -40 317 69 -427 474 136 -233 -387 -499 -499 -71 126 -251 739 142 -191 -425 -32 -280 -414 -449
7297 -449 442 -76 -98 -512 -95 -137 -123 -16 -142 -565 342 444 233 716 1402 -175 -95 -452 -823 -707 593
7318 593 -283 -646 145 -457 -99 -511 355 -598 392 561 272 97 -137 375 -44 452 136 691 273 84
7338 84 -149 35 -253 494 -198 -705 122 225 -388 403 -262 -287 59 205 114 134 489 547 634 556 104 -463
7360 -463 -141 -171 398 -360 -463 -1186 560 16 -211 -406 -1045 -561 -16 -816 -24 -432 -5 -366 -199 1028
7380 1028 271 223 9 -292 285 146 -455 -1308 18 161 -52 -893 -565 65 1095 85 -455 805 -449
7399 -449 -321 -569 -608 186 -648 -61 -415 135 -415 391 -239 141 -21 906 -158 -288 642 -250 426 467
7419 467 -538 -865 -457 -55 447 -279 30 -148 -583 -240 -178 245 -125 314 133 66 229 260 278 -295 -15
7440 -15 62 198 382 -214 41 917 15 -371 -436 306 -566 -549 628 -147 190 58 -454 319 -377 -85 319
7461 319 -730 528 1005 -516 -130 581 59 331 1157 -237 -28 -323 -183 229 -268 297 465 784 129
7480 129 323 -552 174 -959 418 -282 -99 -154 173 311 -277 320 -327 -23 371 -178 97 -487 272 -417
7500 -417 -193 129 -77 -128 -62 -202 113 109 206 160 162 -388 -81 -179 -11 -380 202 -1030 -310 -369 -744 719 102
7523 102 -461 505 57 19 480 1001 797 433 -8 51 164 -114 -15 73 152 -137 -923 -111 -471 387 353 658
7545 658 374 -299 28 -782 156 310 220 -640 137 378 471 -849 -962 208 -48 441 -648 -771 -60 471
7565 471 150 -560 -481 183 70 680 -133 -17 129 698 182 -728 434 -560 50 468 311 -303 154 795
7585 795 -135 -203 557 385 8 -399 489 -417 -159 213 -309 -357 -489 36 -556 97 166 987 94 -408 -56
7606 -56 -287 -404 -719 -57 61 276 666 -84 221 -337 -749 -139 297 138 -78 471 -260 264 393 104
7626 104 -151 -147 -476 424 469 396 882 -167 159 157 -493 137 57 341 -504 176 -81 327 188 -577 623 -677
7648 -677 -22 -37 302 -289 12 -769 -315 -1154 30 -432 -404 -668 299 -189 447 204 43 256 311 -195 -185
7669 -185 -671 755 509 764 193 -430 658 -88 -483 -386 877 118 -409 523 76 -872 -74 103 254
7688 254 256 438 -1295 192 -31 -260 -218 -24 -189 61 59 -416 -343 -246 974 -482 -283 449 -90 -692 -440
7709 -440 -20 134 -873 206 -20 -447 -565 -270 25 -43 136 -570 378 -298 468 -800 -144 -198 287 235
7729 235 761 427 -685 -230 432 -505 -13 103 -131 560 -436 11 -1256 -185 559 362 546 148 25
7748 25 46 -273 -363 524 -601 -465 -419 -183 542 -868 -144 -153 245 -249 69 192 -19 612 -222 329 -359
7769 -359 150 121 219 743 171 218 -368 605 -202 607 -20 -51 -261 -335 124 -746 -327 -410 -1037 281 -374 -114
7791 -114 -380 -215 329 -179 393 -52 95 319 -753 274 571 -1026 189 -137 98 -504 -105 74 -544
7810 -544 522 730 455 150 -833 148 879 397 -340 -1304 796 448 407 713 34 154 -158 -66 -876 -529
7830 -529 402 -234 167 109 -644 18 151 54 -344 116 -389 -35 424 403 755 579 -632 203 60 -353 172
7851 172 181 742 592 4 -578 -676 652 -265 -103 -140 184 -550 373 374 595 -35 -262 -391 195 535 -624
7872 -624 127 193 579 1044 125 -376 -14 621 422 -150 172 -541 -150 1081 -43 292 52 -537 341 -211
7892 -211 128 703 -499 -344 -220 68 828 -322 695 795 77 97 -592 -21 118 -7 -380 523 -203
7911 -203 -567 -407 -110 -47 14 51 715 -65 374 -43 -520 171 -30 117 344 473 -12 204 -709 0 -506
7932 -506 279 524 -612 -74 432 95 19 -282 -782 -151 -761 -377 195 -22 1010 239 272 698 394 -233
7952 -233 -499 -412 691 -719 -225 -290 472 300 -839 -6 -386 359 -107 -389 682 284 346 202 344 -160
7972 -160 -350 41 78 513 -248 474 -168 -260 -1 244 -291 -273 281 397 -540 -202 -550 -236 664 -29 -70
7993 -70 979 164 599 9 163 -434 139 535 650 337 223 -411 -142 31 497 -196 4 -96 -147 -228 -526
8014 -526 316 368 526 -7 665 108 34 133 408 61 -199 371 -339 188 -64 49 95 52 564 -105 -291 32
8036 32 853 30 -84 113 333 -125 -521 -628 -238 72 -676 190 -501 -288 -473 -103 -507 934 -148 -497
8056 -497 69 658 904 100 300 468 665 -117 217 87 -523 -22 -271 57 3 -914 -544 -471 4 187 -414
8077 -414 -64 -295 589 153 -301 275 580 248 241 457 -661 40 -350 -671 318 -69 622 -134 120 420
8097 420 -322 155 207 543 -881 -241 -378 771 134 -165 -424 -635 522 68 136 -216 -863 571 260
8116 260 -448 -130 198 158 -494 380 -402 -540 -173 -73 858 134 -684 -55 464 -741 579 -199 -72 -775
8136 -775 -1065 -76 413 -374 39 495 161 -874 458 103 -532 409 68 -194 267 -405 669 -246 4
8155 4 572 -256 184 -525 -85 150 143 -394 -992 -188 265 832 -281 -129 -384 508 40 63 -439 21 392
8176 392 264 -625 -196 523 -351 193 269 220 630 219 -513 316 -375 225 -146
8191a46
$$ Imaginary data points
##PAGE= N=2
##DATA TABLE= (X++(I..I)), XYDATA
0 0 0 0 0 0 0 0 0 0 0 0 0 0 0 0 0 0 0 0 0 0 2 -24 71 -71 71 -72 72 -73 83 -136 143 -145 158 -203 217 -237
36 -237 281 -302 340 -379 424 -467 522 -575 630 -696 768 -850 939 -1028 1137 -1255 1383
53 1383 -1526 1688 -1871 2081 -2322 2612 -2955 3362 -3884 4543 -5427 6671 -8542 11665 -17860
68 -17860 34637 -173400 -481630 -11317 230128 117411 -46511 -22626 38845 -78536 -125777
79 -125777 39728 125795 136256 -20785 -189840 -93559 52998 112117 92714 -34508 -39219
90 -39219 -49493 -112667 18398 151871 102876 -41265 -167186 -58679 69303 38999 63529
101 63529 47628 -49424 -84402 -88935 28772 138593 67071 -28947 -116423 -88179 64699 59830
113 59830 25216 49796 -18856 -80888 -88085 5619 155793 74973 -78238 -80541 -37012 28488
125 28488 32519 22024 71875 -8489 -105284 -61278 10460 103534 86421 -51604 -75855 -43346
137 -43346 3057 52820 27645 40566 15031 -99641 -76029 32745 95272 68629 -58838
148 -58838 -68989 398 -10285 12611 38317 40928 23736 -83598 -88752 34478 81197 59971
160 59971 -25539 -77099 -10833 3989 1331 43445 39043 11328 -64439 -89523 35188 82717
172 82717 27987 -13390 -49967 -18193 -170 -14924 47845 56370 -10737 -56662 -71660 17940
184 17940 83179 21532 -16236 -32367 -27228 4845 -9829 26352 63937 -6294 -55527 -53241
196 -53241 5423 73401 21771 -20335 -6472 -27975 -21738 34 29124 65178 -5522 -70170
208 -70170 -37045 10010 56872 29089 -28351 -6238 -10716 -29231 1414 22773 50059 11743
220 11743 -65829 -35584 16405 34383 29688 -12976 -8541 -5306 -41581 -2291 40241 37763 7460
233 7460 -57884 -39486 26079 25924 18119 -1200 -12713 -125 -32007 -17180 45287 36943 1351
246 1351 -41808 -42472 22834 26226 6010 12097 -8537 -13677 -23517 -18381 43811 36733 -13288 -28684
260 -28684 -31149 12400 26176 -2093 12640 6757 -19684 -23278 -18233 33612 48587 -14499 -33457
273 -33457 -20547 3513 28438 2265 4342 14191 -23879 -25036 -4123 22657 40016 -10639 -33544
286 -33544 -6486 -1567 11895 10337 2683 17115 -17859 -37012 1086 24379 33148 -1960 -37555
299 -37555 -6778 4851 1968 14851 5435 7207 -9066 -36346 749 25781 18125 4891 -26858
312 -26858 -11761 8610 -5042 12659 17869 1844 -7739 -32767 -6427 33669 14316 -3092
324 -3092 -17221 -14449 10500 -3747 194 24498 2260 -12853 -23090 -12589 29088 17942 -7242
337 -7242 -7321 -13421 -816 2530 -583 24194 7329 -22592 -16138 -6501 22148 20941 -13487 -5532
351 -5532 -3733 -7382 2959 10 16326 15206 -22735 -18444 -479 11792 20962 -6395 -10825 910
365 910 -11565 -1287 8903 11191 14423 -18716 -22566 6972 10241 12312 1085 -11775 3001
378 3001 -8770 -10317 12495 11926 7972 -10150 -24851 5518 12842 4896 6135 -9044 -3376 -2179
392 -2179 -11696 12026 15638 220 -6100 -19076 57 14957 498 4750 804 -7590 -2802 -10372
406 -10372 6181 21697 -354 -10003 -11965 -5782 15845 3337 -2610 5277 -7971 -5643 -2974
419 -2974 484 18340 2332 -12755 -5552 -5320 7711 8147 -3705 7245 -4281 -12657 271 2906
433 2906 13788 7456 -15691 -4815 586 1588 9357 -1776 2641 2580 -14474 -2337 6001 6623
447 6623 8899 -11474 -9976 3778 -1311 5974 4700 -2281 1768 -11340 -7278 12125 5579 3883
461 3883 -4653 -11411 4301 388 962 8555 -174 -1493 -5146 -9966 10767 7978 -1016 -396 -10460
476 -10460 -650 3831 -1501 7291 2245 -6141 -4027 -6906 5330 11147 -4126 -100 -2966 -5874
490 -5874 5152 -374 3334 8502 -6691 -6061 -1748 666 11946 -662 -5173 -14 -5766 2507
504 2507 3588 -513 8512 -4111 -8746 937 1010 6732 3191 -7189 1570 -3234 -3655 6271 1273
519 1273 4341 -20 -10969 669 3307 2179 5073 -4957 -2628 1731 -3875 4112 4838 -338 2670
534 2670 -7275 -4147 5721 -321 4350 194 -5869 1271 -3739 447 8440 -268 -1018 -4477 -6753
549 -6753 7549 1718 -2026 3446 -4185 -229 136 -2240 8177 1668 -4367 -544 -4939 2460 6757
564 6757 -1877 3798 -817 -6047 2196 -1334 2857 6051 -6559 -1690 -1993 -2814 6394 -203 55 1386
580 1386 -5335 1197 1851 -907 6228 -3308 -3776 675 -2955 3318 3280 -2479 422 -4880 -3070 4344
596 4344 1565 4200 1016 -6178 2378 -74 597 5307 -2083 -283 135 -5377 3234 2466 -213 2030
612 2030 -5356 -1933 2991 -490 3512 1836 -4558 1647 -3956 -91 6209 -217 869 -1739 -4845
627 -4845 2873 -106 1569 3924 -3864 -843 -916 -2356 5747 -334 -2252 636 -5122 1017 3154 -2010
643 -2010 3954 -1800 -4167 1717 -1489 1970 3343 -3465 1519 -1624 -3063 4471 -341 2274 1252
658 1252 -4343 -346 510 -798 3433 -2086 -2741 886 -2922 2491 3437 -2806 2869 -3580 -2212 3276
674 3276 -1651 3659 1358 -3215 1450 -2382 6 3895 -1942 -281 309 -3115 2255 383 -913
689 -913 1460 -4459 -1598 1535 -1845 3370 530 -962 1944 -3713 1191 3157 -1924 2079 -1532
704 -1532 -3016 2132 -1619 1160 3315 -2051 -777 -1531 -1604 3101 -530 184 1996 -3520 56 2884
720 2884 -1570 2886 -535 -1984 1587 -1376 1883 1737 -1476 1549 -1703 -1185 3553 -1450 1668 958
736 958 -4222 1830 772 -668 4039 -1538 61 186 -2723 1871 89 -1026 3060 -2752 -613 2018
752 2018 -1945 2579 739 -2539 1895 -1853 -472 2859 -1388 1166 15 -3467 994 -209 438
767 438 3120 -2389 452 57 -1783 2783 -132 -480 1063 -2511 53 1384 -768 2235 -650 -1645
783 -1645 1865 -2066 594 1625 -2338 904 -1186 -1911 3008 -1230 -315 1397 -3180 1321 294 -1561
799 -1561 3563 -617 -484 1323 -2263 1873 804 -1590 1896 -1649 -1784 2021 -1090 381 907 -2557
815 -2557 1360 -1377 -668 2885 -1095 -469 323 -2933 1809 -91 63 2402 -2474 -683 1295 -1383
831 -1383 2021 197 -1167 1846 -1914 462 2205 -1255 1687 -295 -1872 1726 -1225 167 2629
846 2629 -1893 141 196 -1739 2317 -1363 -282 1383 -2595 1284 1065 -544 2812 -1068 -889 1232
862 1232 -1833 1082 1193 -1073 992 -558 -1979 2276 -1161 1369 1022 -2257 949 -294 -763 1483
878 1483 -703 -565 1147 -2225 1249 805 -544 1973 -1206 -234 1183 -1344 1734 420 -1114 1128
894 1128 -1159 -414 2017 -1047 266 57 -2197 1093 9 -374 1443 -1902 249 756 -1277 1701
910 1701 -11 -762 731 -1754 390 862 -1746 620 -162 -938 1267 -1092 915 1625 -1631 554
926 554 -25 -1174 2423 -1559 -503 1719 -2016 187 489 -153 995 -1248 -325 1394 -1432 763
942 763 -376 -816 1150 -761 -800 912 -748 180 819 -1278 898 -309 -748 1056 -1819 542 888
959 888 -1895 1190 132 -357 2095 -651 -572 732 -1134 1202 913 -1041 413 -1497 -507 1383 -970
976 -970 653 -490 -1643 1470 -796 -259 1017 -444 724 468 -467 1965 -468 -587 935 -2281
992 -2281 8 681 -314 1119 -1040 -830 1186 -917 580 1539 -1821 1224 10 -1015 1338 -1120
1008 -1120 588 1159 -608 877 184 143 1609 -381 346 1076 -697 1043 477 -1073 1272 -1118 -223
1025 -223 1586 -371 438 219 -903 1436 -62 -341 1174 -778 256 724 -1415 346 288 -156 1316
1042 1316 -1115 353 490 -1395 531 456 -680 829 -1163 -285 -174 -2216 894 -299 -1785 1270
1058 1270 -1621 772 1132 -551 709 -92 -477 1821 -512 -256 688 -2026 1353 371 -261 806 34
1075 34 -44 1171 -1214 1349 466 -1479 948 -445 -250 1399 -1337 958 -28 -1555 1440 -44 -835
1092 -835 1988 -639 281 1579 -726 694 -1113 -121 747 -1087 -527 97 178 677 -236 147 800 -1014
1110 -1014 -252 1061 -16 1204 399 -1171 1110 -687 -95 -113 -1006 754 -318 -1780 930 16 126
1127 126 591 -751 1336 1101 -717 1152 8 -469 1384 -1031 376 162 -704 774 -16 -682 976
1144 976 -401 161 1038 -1836 1108 -94 -662 453 -625 -132 487 -1076 510 567 -1939 989 -453
1161 -453 -1724 883 -1085 744 -100 -261 1145 -990 -274 698 -479 -98 572 -526 391 -915 -648
1178 -648 880 -386 701 1524 -1110 1026 190 -496 773 -1013 623 -97 -609 136 644 -810 787
1195 787 -475 -950 432 -1224 597 -470 -725 793 -410 236 622 -782 339 196 -367 1069 -297
1212 -297 -150 187 -1019 569 -328 -261 1139 -285 -638 408 -433 489 829 -775 660 -1084 480
1229 480 1300 -355 648 277 -930 -14 -1462 -883 643 -277 751 1638 -1396 74 -483 -637 696
1246 696 -567 118 900 -320 273 -324 -229 880 -300 127 358 -3 954 558 282 66 -380 -142 867
1265 867 -900 517 -205 -620 298 -473 -254 -105 -23 -64 714 -566 551 -585 -734 848 -946 929
1283 929 -233 -704 56 -110 -400 469 -1055 92 -257 -651 186 132 -822 784 -376 198 335 -344 75
1302 75 224 -775 926 228 -845 287 -318 20 576 -1253 -34 -360 -221 247 -904 -446 -295 -1337
1320 -1337 119 -505 -109 109 -416 -294 243 -440 281 -323 -1019 441 -785 130 1191 -1111 555 618
1338 618 -937 1197 -650 -362 397 -445 -108 -108 -239 989 -937 410 616 -85 598 346 -500 62 509
1357 509 -48 531 -670 -226 793 -255 867 362 -837 280 -635 203 584 -1123 763 444 -283
1374 -283 360 -370 -116 -631 -198 436 461 -393 999 -298 12 528 -825 -328 -268 -355 -47 -873 -384 511
1394 511 -1186 -305 -594 -421 131 -42 -357 501 -432 315 408 -540 185 203 -490 888 -437 1 206 16
1414 16 -114 -16 -602 721 -1008 -603 206 -915 942 -615 -729 -548 -473 296 -106 -573 848 122 -144
1433 -144 644 -788 -1115 -106 -84 495 -419 98 542 615 -63 1135 -327 68 -260 -629 228 -452 -810
1452 -810 414 -569 433 117 -910 338 -69 -246 -273 -422 -102 780 -157 563 -19 -74 493 -783 -102
1471 -102 444 -250 -120 779 -603 -178 -570 -229 162 -496 476 559 -190 247 51 23 534 -813 -333 874
1491 874 -869 -141 -661 -511 706 272 -560 -26 -237 -716 -463 -21 1378 -459 -240 -32 -212 462 -844
1510 -844 -383 434 7 -204 20 -313 453 256 -1014 -83 -189 378 571 -513 915 51 17 571 -523
1529 -523 614 838 -826 191 340 222 46 554 -82 629 -906 -144 -689 -116 -344 -70 -457 -36 -114
1548 -114 -506 -294 -437 531 -417 57 527 -54 42 685 636 137 -28 -578 -236 -280 -186 252 -1010 283 339
1569 339 32 280 521 -177 -106 -519 195 120 -702 423 527 -266 108 20 102 -107 169 703 -736 -748 318
1590 318 -730 -163 661 -44 811 -473 -561 116 -124 864 -702 -566 460 -544 -498 680 129 505 328
1609 328 -629 452 519 -524 -91 201 40 200 -803 503 505 -106 3 -6 317 -164 356 106 924 -260
1629 -260 -374 -1027 -299 646 -1046 -101 294 377 -277 -101 -6 1030 -41 240 336 -18 -360 -1045 691 60
1649 60 -183 134 -631 -727 920 512 -686 285 257 -88 30 -467 105 348 -241 569 344 84 556 -1288
1669 -1288 116 -736 404 -184 -743 63 1427 -222 213 61 -441 525 802 94 357 -1178 -410 612
1687 612 73 158 -93 -89 684 -383 -210 -210 -535 95 17 -35 -263 -243 246 440 -330 90 -461 -1131 -254 161
1709 161 9 245 -298 222 676 -186 189 259 81 782 -413 229 164 -156 -107 -343 -165 -48 300 -127 216
1730 216 490 451 -576 304 58 -709 866 110 -525 -181 -697 -598 -180 -145 607 -358 133 494 513 -287 451
1751 451 -235 553 171 -386 384 103 422 792 -294 168 177 -206 331 460 -283 291 -504 -102 63 529
1771 529 -67 190 -156 57 182 -257 -45 419 -311 562 -388 598 320 -1269 -313 67 64 -446 -385 244 -197
1792 -197 38 -211 -736 344 -98 -798 -8 -640 114 439 -871 -220 -57 -837 -177 -315 -365 -308 -3 -418
1812 -418 394 -684 -369 420 713 658 270 -453 -232 161 -49 -279 -807 -356 88 -226 -514 26 -395 284
1832 284 -194 952 563 -424 172 134 201 -408 39 -582 593 144 566 -710 -323 407 614 -348 176 -495
1852 -495 486 -954 -637 297 138 217 -25 -500 -348 -418 -42 -44 518 192 220 204 184 427 -497 208 -130 445
1874 445 66 -386 103 89 -247 -413 227 -100 791 50 -371 139 471 487 78 -48 216 -292 646 -221 259
1895 259 217 20 97 56 534 -34 -141 -389 170 310 -387 2 591 -365 229 -885 -375 743 -125 -22
1915 -22 -233 206 -368 -555 -348 126 -270 -70 -310 -687 735 -626 809 293 208 115 633 -385 83 -376
1935 -376 -487 163 524 -32 235 -253 498 -444 42 467 -318 -226 -320 -531 12 294 -791 765 317 125
1955 125 26 -213 363 418 394 -478 -238 -62 6 904 764 291 558 -65 -755 -280 195 245 -666 154 -504 -22
1977 -22 82 340 365 -140 428 -31 -708 -88 335 170 -461 -739 734 116 33 -104 536 286 61 -310 485
1998 485 262 -89 325 580 -561 574 -65 380 702 -464 -380 -522 313 -854 -140 228 462 -634 343
2017 343 -699 326 759 -262 -580 -102 -216 379 321 -481 -298 321 -311 -189 -115 32 -452 -173 543 58
2037 58 236 331 27 707 -398 164 -61 -575 -73 442 -225 176 -261 499 -505 56 430 368 -245 -17
2057 -17 6 -251 22 87 157 -326 175 -193 111 -24 288 -769 350 148 -558 40 -663 8 -166 645 -1078
2078 -1078 -239 -102 547 -192 -345 14 352 -580 -667 -719 -295 88 -147 504 510 -397 165 248 139 -271 152
2099 152 194 184 280 -183 490 69 47 -62 -1000 13 -253 -312 -525 -324 440 354 394 308 1164 343 124 -214
2121 -214 274 -536 6 298 -568 -166 -366 -228 332 -149 -109 478 -891 -452 -71 275 366 500 270 -102
2141 -102 -74 -97 229 150 -295 -78 59 379 -102 173 633 784 255 -298 392 -244 150 384 -356 -284 542
2162 542 166 -817 28 793 -142 195 633 -131 101 -301 -145 532 -160 -202 200 -36 109 -294 -65 205
2182 205 97 -9 -373 -139 -355 158 87 -335 -450 -98 326 177 623 313 898 390 -326 343 -94 12
2202 12 -633 182 312 -786 242 -3 609 -138 -126 -362 406 1114 -719 52 393 -185 -162 -881 456 164
2222 164 -229 59 -495 -156 433 377 -410 441 120 222 250 496 850 462 782 -214 -810 -22 -73 239 179
2243 179 124 -348 -253 578 -158 -813 129 80 -151 -290 -27 -405 40 -162 -226 667 319 552 -149 -411 -200
2264 -200 -30 34 433 237 1 -201 -392 336 401 278 26 197 -70 535 -123 -400 -13 -614 -847 208
2284 208 748 -197 29 -696 -440 -158 -8 84 -103 -225 -680 -617 -616 777 -96 168 96 -156 -76 -53 99 -38
2306 -38 491 2 502 -186 -462 -598 46 -68 -451 -144 -638 -616 -269 -120 181 -161 16 354 123 -262 -378
2327 -378 -512 -480 634 -247 213 -108 -98 -559 -22 284 306 -251 -178 -173 176 251 -254 249 -144 349 -80 -124
2349 -124 -465 613 535 -10 -728 -600 -410 -144 448 -158 -275 284 573 -376 -128 -766 -292 63 186 278
2369 278 60 -664 -418 1 -534 -535 -175 -6 130 349 -315 438 -258 -331 -61 -319 -100 451 433 320 143
2390 143 -359 143 261 957 -91 249 443 -668 430 -331 279 218 -529 150 516 -65 -173 227 1007
2409 1007 195 488 656 -260 153 -672 179 182 -527 -296 -64 122 79 -535 -175 -206 -214 -634 525 523 -429 328
2431 328 280 193 -117 -137 -378 382 -279 443 -410 373 -552 -9 341 262 125 -358 227 141 -84 113 28 -719
2453 -719 273 -257 -467 -113 -147 101 462 -338 -48 35 -456 -462 -4 -72 161 -237 -50 -1094 -166 188 174 642
2475 642 -472 114 447 23 -152 457 223 -192 -160 405 -16 -310 50 87 -180 437 328 509 -101 159
2495 159 590 7 -757 312 -658 -225 -9 311 335 4 429 -883 231 -353 171 808 620 -96 287
2514 287 -154 -410 -717 87 -367 -133 -705 -1574 -146 -126 600 -116 408 -228 -634 225 119 180 -23 -418
2534 -418 541 212 -64 -4 -330 -97 289 110 -32 211 532 -46 563 -461 -126 -603 -501 -924 317 -255
2554 -255 98 85 18 -65 -359 -93 407 -534 -323 -299 -948 -297 -369 603 438 178 163 -68 -347 197 -294 -30
2576 -30 -161 -227 -417 -292 114 -593 486 42 386 -372 -689 -482 418 -330 -898 -429 111 -347 -500 -284
2596 -284 -209 -107 -215 622 1 -154 461 840 619 -383 -844 114 -116 112 676 -301 58 282 -109 579
2616 579 124 225 -994 -72 -356 -309 -493 -354 385 -501 -643 298 -197 -542 524 -832 299 193 119
2635 119 240 -155 242 567 459 -181 797 -506 155 -374 298 -876 -72 508 -396 728 -32 0 -239
2654 -239 148 1067 339 103 400 69 244 69 -1096 498 727 -69 -523 -672 -149 -669 340 -562 -856
2673 -856 814 583 258 -643 -157 -161 -48 338 -384 -127 -392 343 823 -480 909 884 -73 397 -1117 501
2693 501 -526 -621 385 67 -394 -19 191 1037 23 562 -845 -398 58 866 -235 444 -42 485 19
2712 19 -118 -568 1154 -67 -332 861 -18 -450 608 -223 -1062 23 -666 -1308 774 -49 -209 261
2730 261 -5 798 46 -259 516 -89 -349 -72 364 -133 160 -19 -461 -554 -58 -330 -314 -165 220 -842
2750 -842 99 -278 152 -332 132 578 -79 -432 -365 272 464 -440 31 208 345 -663 -293 -367 192 486
2770 486 -454 -308 127 -20 -341 460 555 -176 -217 -288 -155 1052 34 -1123 431 -42 -518 -133 838 84
2790 84 555 -175 -317 419 82 -176 -449 347 -155 -71 -63 -327 -226 -75 51 -293 -553 198 348 -75 -224
2811 -224 161 5 -88 -587 291 362 623 -43 77 384 -13 185 -408 159 300 310 -680 88 375 507 -322
2832 -322 -357 -612 -1006 581 -149 190 1214 -714 -285 -160 -1159 -383 176 -654 -78 -172 -196 128 881 799
2852 799 -81 -382 261 342 187 109 153 84 515 -266 248 -558 -483 256 -362 119 -335 21 -177 -59 74 280
2874 280 -362 -629 -876 -445 507 824 257 -524 -79 -206 -483 -211 -171 -501 -650 -3 -561 173 229 16 32
2895 32 -480 -202 150 -27 -368 299 -991 1090 360 11 284 -599 -172 -544 -486 459 -400 -49 256 353
2915 353 -303 -503 193 -40 427 79 562 -48 373 155 11 402 147 541 -2 355 807 -326 320 750
2935 750 457 -365 478 116 -498 -605 -282 -43 260 515 -99 197 39 606 -383 -129 -33 -349 -310 153 363
2956 363 580 361 -265 -485 63 -56 -959 380 587 -307 756 -476 -277 -543 790 -349 188 415
2974 415 -490 -373 29 -291 -354 -351 -87 721 -470 510 171 275 36 160 -629 -763 97 -195 251 368 859
2995 859 -688 -60 -313 102 -359 -158 110 -337 -132 -430 -203 -611 -353 170 486 33 529 12 22 -171
3015 -171 -808 456 -321 -180 423 -247 -661 -546 644 172 -135 580 175 -524 -225 -13 349 64 305
3034 305 -113 626 -265 -202 -13 -254 -191 -80 -108 216 -473 80 -884 -789 564 -930 181 -173 -111 -12 -88
3055 -88 281 18 -177 -170 225 614 -139 -643 -207 848 -226 -787 517 462 403 -366 -46 -240 241 -305 380
3076 380 -677 243 -100 -512 -506 -904 347 23 -193 98 -177 21 -39 -151 -299 98 79 772 -17 347 -334
3097 -334 -881 108 -650 -53 -428 -76 131 502 425 -113 -414 -442 -1007 -413 180 307 136 145 -512 249 -787
3118 -787 355 327 -161 -1073 82 -81 -189 249 -25 -59 36 -361 -494 331 191 399 256 84 -981 -366
3138 -366 -44 -18 -25 707 -509 -27 -218 -169 693 -421 -78 -887 552 600 149 -43 -347 410 1074 -428
3158 -428 -297 -592 653 -92 63 -258 474 294 -374 -346 -1115 125 375 -530 493 -75 -209 35 -301
3177 -301 53 -524 -473 -385 317 483 161 287 53 325 -8 -682 -582 461 507 -450 168 1096 239 -364 199
3198 199 -202 373 14 -628 -217 -1343 -88 893 312 -102 -821 -55 -382 -10 -482 195 -207 -228 -246 -557
3218 -557 238 595 -8 -48 -160 -664 384 -255 906 8 411 277 -715 -374 194 205 410 -1000 726
3237 726 186 -375 146 428 -140 264 176 -697 561 -160 253 -263 263 -352 -322 414 20 -614 462 247
3257 247 130 -395 189 78 510 -324 -202 434 -422 -177 75 -396 264 -504 -381 136 364 178 -316 736
3277 736 -12 -115 -8 -145 -448 -483 943 -7 -683 -652 69 22 140 334 -694 782 -312 -78 -481 -279
3297 -279 -148 -73 535 36 422 370 179 431 485 1001 222 365 -79 -434 288 -102 -333 546 51 325 -665
3318 -665 594 673 -712 320 229 -823 640 72 -137 325 -408 -267 -635 -169 -74 185 86 -36 -178 281
3338 281 -306 -612 11 145 -221 -42 332 657 -85 533 162 -417 676 169 -563 302 -873 -812 -253 410
3358 410 -277 -60 -811 -121 -408 1063 -381 -201 -61 414 -108 114 -561 -483 137 -509 14 108 78 217
3378 217 303 -451 -1070 -355 -377 89 438 318 251 843 -142 -64 -498 235 88 -653 397 -278 -2 -24 -530
3399 -530 -57 29 53 119 -687 -442 390 236 -515 245 21 181 -231 150 -15 54 -288 327 -215 -290 333 -281
3421 -281 -231 -56 -618 -349 -258 -407 787 -140 539 626 -915 -826 419 -247 -107 268 -960 -435 278 -281
3441 -281 7 -212 -440 -606 -120 1092 714 -511 1285 -154 -366 -193 232 -1054 -430 346 819 1060
3459 1060 -161 231 645 783 -749 -576 -211 -50 -842 -82 -762 -42 15 -682 289 -274 150 -783 648
3478 648 148 357 311 615 -7 300 418 428 396 -309 656 -42 -154 243 1 743 -166 -157 -385 -1627 153
3499 153 -963 -287 249 -572 392 17 -69 -50 -112 -1097 -503 645 -616 -103 25 -165 246 -28 94 -8
3519 -8 -237 -485 243 213 -601 -20 -29 471 26 792 393 81 -874 948 259 -661 -162 -464 226 -75 18 427
3541 427 -256 343 979 -374 -59 -549 -349 358 325 76 438 -674 554 -697 -457 255 602 216 -374
3560 -374 -113 -164 661 354 604 605 -372 340 451 -690 25 -526 416 -137 343 -13 16 431 410 -10 -59 213
3582 213 -218 72 -198 -758 248 -330 -171 -159 -624 -90 116 65 10 -379 -94 -288 90 661 -173 34 229
3603 229 134 28 728 184 -765 398 600 453 330 -504 511 53 46 79 -224 221 -137 529 41 245 1147
3624 1147 -25 -665 172 -966 -50 -631 -749 379 -423 -558 369 -224 91 -424 -789 -86 -381 292 -241
3643 -241 -83 309 259 -5 -247 217 -557 699 -88 -432 61 259 217 220 302 -42 653 758 112 1088 517
3664 517 -366 20 439 460 -274 202 615 -16 244 -16 340 411 -73 560 -319 660 -322 503 -178 -84 288
3685 288 -359 -1 453 -375 20 648 222 685 -148 241 -505 -46 715 -72 -181 -632 470 139 -233 527
3705 527 -372 -40 -277 -317 -162 414 -173 425 186 233 389 -519 691 -227 -402 -475 126 -182 -304 -598 145
3726 145 -259 371 288 -366 -10 1 -600 233 367 521 487 -169 571 -391 199 -342 300 495 -18 305 -92
3747 -92 -234 204 -554 -63 134 512 -104 -457 538 103 456 180 -422 563 -5 232 -130 -27 210 -560
3767 -560 -206 -299 -424 -528 588 73 429 -85 -61 -159 -51 -536 707 748 438 -145 694 -78 166 -60 -11
3788 -11 130 -125 17 -266 792 -73 -1042 361 26 828 799 26 50 280 173 8 99 -224 359 -250 533
3809 533 502 -488 167 33 -888 1128 238 -346 662 -295 91 -20 46 1084 469 160 274 -495 -860 356
3829 356 257 -201 25 -518 -135 -280 703 1454 178 182 -215 263 -93 748 -110 561 -422 728 -104 -281
3849 -281 -4 -15 -198 476 665 109 420 865 53 -36 -9 -483 -78 -62 -61 12 -69 -479 -64 944 57 -326
3871 -326 263 361 -443 -219 390 -138 219 -12 145 -1046 -218 -183 278 185 254 324 -2 88 -316 -671 201 486
3893 486 349 -566 -255 -630 244 570 -442 1 880 221 -26 365 803 114 421 -85 83 -651 424
3912 424 -191 221 -266 -374 1055 18 -109 114 -38 76 385 634 -22 -91 -409 693 168 -204 577
3931 577 -119 -406 -113 -257 -177 532 158 -283 205 398 -674 33 -667 -71 -114 -849 466 167 -347 287
3951 287 432 205 -55 -610 -459 -257 -166 -854 -439 71 -282 792 164 -87 128 -21 702 -816 -307 426
3971 426 -16 181 46 234 220 -384 267 406 100 -286 345 315 177 -1003 21 28 29 400 36 224 -188
3992 -188 610 -542 182 -431 436 -165 264 -39 532 462 -247 774 -2 -240 16 -122 -226 -194 -105 -291
4012 -291 633 -447 -18 270 900 -626 181 231 -434 -39 -102 653 883 280 711 289 486 -200 853 -423
4032 -423 -33 100 867 -334 -970 -383 7 85 -305 -385 -654 75 201 105 -363 56 -1068 300 -482 -395
4052 -395 229 22 -151 62 695 -694 -485 -180 -11 612 49 -252 -158 -868 -180 342 -451 -163 -283 150
4072 150 97 98 1059 469 -38 538 -203 -124 -502 -107 -208 189 345 92 598 -434 473 38 186 -519 -103
4093 -103 -365 510 716 -110 -153 662 402 -318 619 347 462 -139 38 85 -193 -630 -108 571 333 320 852
4114 852 350 56 -187 -405 -311 -20 -14 120 559 -489 326 60 570 -663 393 -780 381 140 -614
4133 -614 -697 53 -35 -704 -747 -629 495 299 83 -635 338 -170 -398 -127 -539 -119 130 250 -445 533 -56
4154 -56 -66 -517 4 292 96 -316 962 47 148 564 -333 -430 -498 -188 60 -147 320 -98 -222 33 -1117
4175 -1117 -191 398 583 -503 77 548 357 38 -305 751 -289 -2 638 -500 -657 -518 -718 941
4193 941 236 42 103 39 378 130 -751 -546 -882 -49 602 -538 -206 485 -261 -367 -294 296 408 -198 -18
4214 -18 -577 -666 239 170 -452 64 -257 773 254 -216 -217 -689 2 -423 -21 723 450 -454 -57 -158 -410
4235 -410 -452 230 -28 460 -233 -443 261 266 401 432 -9 501 -298 -468 574 -428 -420 -288 -237 -591 139 74
4257 74 91 -358 696 -13 203 790 37 455 -263 289 -299 -535 -285 -151 -40 170 97 -46 -300 -437 434
4278 434 -477 445 696 302 125 -223 100 -620 -875 283 -195 615 99 179 771 -301 -302 -145 -339 346
4298 346 200 331 -521 -17 -119 117 -20 -221 466 -564 204 -245 438 287 81 -204 192 569 376 695
4318 695 -451 -417 -254 -365 471 -76 105 224 172 111 -365 -676 -101 -761 -84 142 -346 -58 247 103 228
4339 228 -93 -425 350 -321 -338 -108 284 -603 -126 -139 652 84 94 418 -86 -123 -441 -19 489 895 -168
4360 -168 -328 -623 420 -652 -283 -533 139 -856 119 578 232 173 175 -190 15 800 -143 58 295 125
4380 125 359 -504 -642 38 -378 -269 -542 -386 650 -21 -207 67 -496 1016 -92 553 59 -551 559
4399 559 -83 -53 -40 -336 25 -201 -46 338 -43 27 76 -366 278 841 -591 -76 -321 -20 -409 -170 796
4420 796 753 330 193 -46 249 -1039 965 -399 -33 397 172 -275 9 712 89 -481 36 -100 324
4439 324 127 44 476 184 319 -739 255 -402 -264 -247 314 -251 1086 433 -835 393 302 80 -370 670
4459 670 -33 58 -886 527 -42 3 -225 8 438 -285 1049 -60 205 336 -345 -55 -194 657 -241 200
4479 200 -74 -516 493 -232 3 214 598 -413 6 -88 -37 -31 261 396 205 150 -103 -265 -608 -684 63
4500 63 332 136 -231 102 -388 164 -317 669 446 293 179 -213 -180 -299 -536 -203 -705 -790 -109 -124 -153 100
4522 100 -333 -647 -125 -431 111 -115 508 -630 -203 -257 43 -56 -221 368 449 -301 -649 216 -282 -617 -141
4543 -141 347 -296 357 -91 -712 392 535 458 -123 -658 -324 174 213 89 393 524 -695 -90 30 -319
4563 -319 654 214 249 287 956 -833 343 95 1195 -795 423 -136 458 364 7 253 -78 -263 -334 -70
4583 -70 237 236 -138 -102 95 403 110 613 440 -414 -773 -968 28 -125 45 716 378 217 -136 -502 -438 -350
4605 -350 579 279 -399 -184 -331 -816 -587 -198 327 595 322 -568 -352 84 742 173 -267 567 -476 127
4625 127 -212 -58 -252 -152 -44 -897 709 122 -295 47 -479 685 -29 -336 613 -88 345 -286 -149
4644 -149 -364 820 197 74 550 -537 676 -81 -568 -90 121 95 64 348 192 -51 6 50 -92 315
4664 315 166 180 -2 -78 222 -769 90 196 -162 280 399 307 353 169 -337 980 121 357 -628 197 -15
4685 -15 414 -318 -123 -349 -102 276 -550 -152 128 263 47 197 -240 81 -36 423 640 -42 228 308 -62
4706 -62 254 -643 106 24 -692 -135 548 -285 -126 25 -87 -289 539 129 315 295 -238 125 477 286 243
4727 243 52 293 -772 973 111 356 -218 -192 114 488 312 518 465 201 -244 -30 81 -137 -365 -243
4747 -243 -238 186 -293 662 -113 321 178 497 359 146 13 -32 802 166 -255 244 -738 -144 -27 -27 -57 59
4769 59 264 32 114 -51 -787 530 136 -130 -559 -489 -348 -572 -40 532 895 -79 211 239 -267 -286 429
4790 429 185 473 -767 37 -127 -171 146 -122 -641 -342 -534 286 421 82 -308 -544 111 210 -659 538
4810 538 -286 -540 -2 210 192 -125 358 307 646 693 -54 -358 311 -68 -74 -340 66 -470 -524 -89 -130 18
4832 18 218 745 -258 -283 703 165 18 57 177 235 -100 -742 103 173 -391 -375 -711 -452 -47 -260 207 272
4854 272 272 -691 -229 502 114 -153 -420 710 -546 453 -497 -92 -284 716 356 780 367 -106 385 -147
4874 -147 331 -443 816 -260 -906 -284 -8 -140 143 255 -370 -358 -55 -511 62 -141 -80 -369 -509 -175
4894 -175 66 -613 500 1131 -98 69 15 492 1155 298 180 -890 7 136 -174 -34 -345 -453 -110
4913 -110 -93 140 444 27 -172 156 486 -885 28 -238 240 462 -101 -343 54 4 56 -477 550 -296
4933 -296 -3 -122 -100 -172 -249 490 235 760 -179 329 691 291 88 370 -417 474 444 -594 -504 295 380 -393
4955 -393 257 668 243 -385 -159 -227 437 335 176 205 -275 2 -8 -99 209 -39 -310 449 70 -593 24
4976 24 -193 -107 663 -417 129 -828 221 -398 56 198 -204 -135 122 -623 400 596 128 917 -746 223
4996 223 95 -145 54 -275 109 -175 831 289 -821 5 379 201 -3 -119 170 19 -88 -384 148
5015 148 605 91 -349 532 -360 378 193 -414 36 -10 -687 110 -570 630 -108 -2 549 -522 369 -145
5035 -145 -136 324 188 -149 -452 -19 -58 -168 -401 88 -394 -53 -22 482 -79 159 -375 88 -73 42 -235
5056 -235 -524 -228 -336 175 153 10 49 -191 -22 -282 229 -324 272 483 479 -197 239 -340 239 158 -408 1032
5078 1032 -363 904 462 -58 75 115 164 22 -388 765 346 266 -166 199 311 490 -798 14 128
5097 128 -345 157 740 295 -509 -29 167 -111 64 -96 228 -432 -119 46 -318 -123 536 183 -167 -617
5117 -617 634 512 -194 110 1082 553 -61 -391 379 -203 77 702 366 683 -6 -177 163 -51 -641 173
5137 173 578 -386 318 -132 291 -103 -1054 -309 -163 -110 -431 -354 -215 608 450 762 -99 13 255 126 -130
5158 -130 -26 245 -111 -45 296 621 201 -234 417 425 -264 -987 585 365 272 -35 -39 489 -656 286 903
5179 903 30 48 -158 224 -4 7 -58 -292 269 -460 156 -342 -345 10 -809 718 -248 -402 381 214 85
5200 85 288 -184 83 491 -316 1094 504 586 1006 2 174 29 21 -337 24 -206 234 -288 103 -309 -617
5221 -617 -392 138 -233 -144 -78 117 107 -367 415 57 330 -201 -279 -228 -266 744 417 -474 248 -109 825 -348
5243 -348 156 -125 -204 -260 -49 627 333 -192 -399 -463 -345 -575 580 -133 -503 272 -180 -543 -369 -452 -244
5264 -244 -486 -149 -384 648 383 -665 687 1136 145 481 208 -26 148 -726 229 -75 253 -1232 600
5283 600 106 512 -100 -102 -280 -447 -320 -412 -48 -476 622 -161 703 -489 -930 476 -713 -489 -516 325
5303 325 -235 99 156 -204 -281 159 -493 -585 -548 -367 -1115 -101 143 336 -288 246 22 110 396 265 -168
5324 -168 -279 103 599 -240 888 181 235 15 248 -517 210 -116 -403 -27 -239 -265 1 321 620 -53
5344 -53 57 -418 639 618 -143 -6 65 -546 -176 359 425 180 -67 -287 -20 524 81 194 -511 -116 158
5365 158 -54 133 82 -587 70 -154 -568 37 18 891 -425 -443 216 -465 610 552 -89 123 -527 5 213
5386 213 169 -304 -255 -296 -128 -193 -175 135 -183 -267 130 171 -54 64 -47 178 -98 125 85 -133 -43 149 -530
5409 -530 396 -71 244 805 -211 -8 334 -609 -534 512 -86 403 101 439 -454 491 353 -323 257 -429
5429 -429 -12 569 -298 -243 -87 148 -1241 -1131 -811 -206 81 151 160 -36 -381 -550 -647 -450 59 -342 -752
5450 -752 682 32 -315 -75 167 -196 389 32 -369 356 258 438 380 -50 -560 -75 -521 266 -471 203
5470 203 104 -620 -316 -178 -168 626 158 -13 220 -648 212 763 -166 29 137 1077 340 -147 -54 142 2
5491 2 -730 -113 70 503 -317 415 -99 -170 846 -431 256 919 539 432 42 -513 349 -323 -450 350
5511 350 -214 152 -231 -121 -381 -239 98 -113 -603 524 290 135 -220 -209 -216 7 -567 473 -673 -319
5531 -319 -332 540 -369 -6 450 435 328 -222 881 -261 256 -316 222 812 -367 -391 397 9 143 -305
5551 -305 -51 139 -332 95 -82 -493 130 -48 -47 -87 568 588 -5 -420 7 204 -11 -461 -439 110 28 -192
5573 -192 -785 -245 421 134 274 -922 -478 -174 -337 31 122 557 -905 132 446 25 322 -63 365
5592 365 452 -379 -699 13 627 785 -150 -185 -423 187 519 145 78 227 -61 -751 -460 -166 489 301 278
5613 278 -211 -27 -85 23 178 -208 434 -840 -358 355 463 -93 -310 -115 -2 -198 250 29 246 290
5633 290 8 380 468 471 564 33 -142 4 45 292 -603 -638 -265 156 382 940 -175 -188 44 -459 -433 -312
5655 -312 528 -11 -599 598 -91 -727 46 -292 148 -173 574 -30 21 86 501 576 -308 468 -420 -389 -264
5676 -264 124 418 -631 54 150 -209 357 513 196 -753 -790 18 113 161 -956 431 -261 -216 684 -28 -482
5697 -482 -162 488 24 428 -513 -643 502 -83 -530 259 496 -349 111 190 -329 410 -344 -137 -163 -216 110
5718 110 55 -582 -142 361 343 -1 161 -421 616 -552 23 441 -24 54 -486 -175 -208 140 48 -216 -618
5739 -618 -628 35 299 -481 -295 27 -62 -805 228 190 9 444 42 -365 -276 22 -70 207 -253 313 142
5760 142 3 197 -200 317 377 468 491 -44 46 -246 -231 -550 667 -164 -224 -905 242 1422 110 515 1025
5781 1025 39 535 -356 -20 -523 42 -248 747 -194 644 -569 -16 654 548 -1125 545 158 -735 292
5800 292 -510 784 -185 1206 678 -38 -445 487 138 269 -203 -457 894 109 666 -144 -1021 340 -728
5819 -728 -299 -367 44 -239 139 -277 -326 131 -204 -739 747 -565 434 -304 -737 -73 -231 -89 78 60
5839 60 -211 -215 -360 289 600 -305 149 -418 440 211 -399 221 -768 318 -134 52 -1 207 -307 18 660
5860 660 99 27 99 -137 415 -258 -658 118 229 -240 122 341 -71 -615 -546 44 -841 -19 -377 -340 -213
5881 -213 5 -350 252 0 -539 -37 -300 -751 449 -136 -636 -532 395 163 -554 735 -699 -33 -183
5900 -183 1318 550 -75 -478 -81 -444 -835 -231 223 -620 561 -685 -254 -18 -381 -5 289 459 -194
5919 -194 816 291 50 341 178 -73 350 -708 227 25 136 169 -761 -4 -418 303 676 406 -25 361
5939 361 -601 -140 241 606 -240 392 712 -290 406 -194 -427 -562 -92 -111 -449 -908 300 -772 -1
5958 -1 -843 640 150 199 -727 422 107 697 -108 -66 335 249 536 -508 -396 -30 -472 -160 93 -1100
5978 -1100 -228 -205 243 -632 155 -5 878 305 674 226 137 473 -205 -424 81 466 -60 -191 -305 106
5998 106 58 0 92 -515 344 443 22 -29 -27 -135 311 -72 279 676 -639 119 -23 821 353 -265 -434 383
6020 383 399 108 -280 -634 -55 96 258 -493 -796 21 -29 -106 181 -89 85 252 -492 -628 -91 -223 27
6041 27 1019 -152 109 106 237 -190 589 -449 -110 164 7 -5 1121 -129 -231 -38 12 567 -123 400
6061 400 -47 -425 -271 41 -14 409 341 570 -256 375 -156 -275 -432 -79 62 619 872 -21 448 -309 -271
6082 -271 -757 283 41 -531 152 171 -625 -264 -118 412 706 -325 300 -127 745 -142 -163 286 574 92
6102 92 230 31 79 -227 828 -722 -377 -256 -263 631 -652 -290 600 638 -242 630 650 56 -569 -209 -242
6123 -242 149 -179 422 -448 -107 -124 70 334 -349 237 -851 375 -438 -209 484 -88 289 -50 -67 2
6143 2 -369 158 -138 130 49 -306 -264 325 51 -315 -69 -553 255 15 158 153 -410 630 359 -566 354 299
6165 299 769 -513 -313 491 121 -10 -113 -232 316 -257 -992 -105 134 -615 35 351 -495 124 826 252
6185 252 378 28 -146 -110 -679 -227 1004 253 3 263 -779 162 29 495 339 -558 -979 400 580
6204 580 -130 315 545 89 -55 -452 84 423 -323 -343 -348 -332 426 203 5 -738 569 -196 949 -449
6224 -449 -285 -102 -80 564 908 621 100 568 696 71 -741 171 590 342 617 935 -499 0 563 115
6244 115 -623 175 -41 93 10 69 -245 563 -136 -69 -357 -41 800 123 -102 795 185 -385 128 11 470
6265 470 381 -173 -87 310 69 -81 90 13 -119 471 -44 -625 410 -125 538 -37 -73 114 -635 -50 165
6286 165 -713 299 161 -825 105 115 82 -382 336 -611 -330 -2 -392 178 800 -495 -268 -462 -235 -93
6306 -93 -837 -6 33 -380 -480 -588 -25 100 291 -398 84 143 229 -213 -337 133 229 109 169 697 197 131
6328 131 -111 201 277 -167 398 -651 -215 -522 -161 437 -59 651 396 58 -402 335 262 -158 -77 192 233
6349 233 -257 -205 -496 -214 -243 26 -286 232 38 268 536 -45 72 673 -243 -148 469 -358 311 -216 -214 227
6371 227 282 -403 -311 347 156 -158 -338 -196 -52 382 402 -36 -239 697 336 113 -180 208 -369 -3 1169
6392 1169 -74 -193 -241 180 101 -2 -605 -443 103 -427 -646 -22 -341 -251 532 -654 -813 219 115 2
6412 2 -130 144 359 122 -741 -218 -645 -317 -371 725 303 324 67 -614 160 -5 -49 891 393 133 389
6433 389 -61 998 -78 472 490 -850 -161 576 427 -832 133 52 592 -271 429 394 -366 196 -58 416
6453 416 625 -69 327 356 275 -127 590 -210 51 43 525 -103 127 675 189 0 -18 -277 -842 -363 -680 191
6475 191 447 -114 -200 -713 266 146 -289 -291 143 -544 -135 -276 -252 -391 -730 95 255 -407 371 -463 5
6496 5 -572 -488 36 -841 -826 262 -318 39 597 -475 -961 -711 447 12 -165 -363 -122 679 -180 -105 33
6517 33 69 424 268 166 -199 104 -361 -35 -876 -1028 -537 630 94 -101 419 -426 -374 -178 539 59 66
6538 66 -123 -100 -51 156 22 -272 418 -590 687 -248 -218 898 232 295 -224 266 1053 -341 -769 -563
6558 -563 -443 304 907 -20 -7 -188 -168 -182 200 -314 657 247 -190 -15 858 940 342 -8 -945 282 32
6579 32 -139 -260 -201 929 -612 -637 487 463 -91 -222 -995 -516 -478 1 754 -93 -133 -154 302 -209 -551
6600 -551 -238 591 -1015 137 143 172 172 206 -540 -384 -39 -303 -772 -620 -601 -407 -297 297 -251 -321 662 -573
6622 -573 -479 676 662 87 -51 -90 586 398 667 -213 109 395 202 -143 224 -997 182 202 -221 -133 -21
6643 -21 -665 -89 378 176 -722 -468 -811 114 -900 289 -403 -389 1236 -404 702 7 -584 -1276 -157
6662 -157 -172 83 431 -260 305 -1060 -89 -372 409 -12 -321 -339 -939 -196 142 199 168 -281 80 -694 -803
6683 -803 514 378 -187 496 -326 92 480 1104 18 402 -760 -1129 475 100 -961 -126 374 -1507
6701 -1507 -399 -863 -228 846 258 -153 -154 689 -427 -1279 -504 70 576 1214 22 636 197 929 53
6720 53 -543 36 -75 -1107 -198 310 237 -792 54 -436 -392 523 -389 90 -246 -269 -419 -1015 -412 546 929
6741 929 -692 -357 417 3 -418 159 13 893 752 -608 521 850 289 -27 -499 -838 -837 905 -333
6760 -333 -757 612 52 -334 190 588 -586 563 207 384 -242 -949 -1381 -797 226 291 -588 -1 -312
6779 -312 120 -543 -114 46 164 -265 -40 226 583 8 713 -312 -393 12 379 -46 726 -559 364 34
6799 34 303 -222 -131 391 -333 94 -36 -273 396 -59 -245 -756 -423 262 739 193 -108 167 -5 -356 249
6820 249 -188 -263 -878 325 -202 -439 400 34 -466 490 373 69 -395 15 1168 -8 381 440 -245 -355
6840 -355 -1406 804 -629 249 -151 -1126 168 -59 205 -760 309 -166 384 87 -111 72 -706 -744 -398
6859 -398 -469 374 -58 270 522 -957 271 65 811 -143 668 -173 504 -39 -170 468 -456 137 -55 295
6879 295 -359 254 429 331 -495 -426 -677 80 162 -860 -325 590 435 556 -360 -722 17 -606 332 370 -340
6900 -340 -187 238 104 161 -286 829 212 33 -14 -671 756 86 -412 -108 -619 -39 25 250 466 -866
6920 -866 609 -249 -329 67 293 399 487 -331 75 7 161 -56 532 -324 -38 -334 1154 1095 419 225 -174
6941 -174 -572 -27 -559 -220 -288 834 -120 543 -343 -906 -236 184 -730 -91 469 531 504 45 342 -502 149
6962 149 26 380 -772 290 231 800 767 388 -259 -83 725 114 -33 -128 -1033 316 187 -388 254 -436
6982 -436 55 -193 -123 -837 -294 430 500 44 -40 119 709 699 -875 701 -818 -206 31 454 -61 53
7002 53 -298 -671 -673 451 -216 -177 24 535 416 -418 -63 46 -421 -25 -292 724 1063 -933 -384 120
7022 120 -239 244 -108 -674 278 205 -318 1023 469 328 -59 281 -291 19 -192 -68 413 -415 223 -53
7042 -53 -156 -22 890 -105 683 248 440 565 491 -165 142 28 386 -875 -164 -239 -164 -288 -322 -273 224 -124
7064 -124 -208 -71 -54 326 146 412 520 129 -738 -38 -83 51 -178 -665 274 71 -293 -374 -27 -374 78
7085 78 221 1047 298 -322 482 -566 -1015 414 797 -612 -975 -221 -655 -206 -337 573 377 650 337
7104 337 161 -411 -1068 355 -431 -63 -56 -125 -708 -58 -843 -41 -56 153 219 -115 -946 -106 570 -189 174
7125 174 -323 276 298 153 -62 571 299 574 -571 143 -67 -231 683 -613 -241 328 -159 1439 148
7144 148 280 660 21 282 -8 308 -453 -210 100 -9 -196 -39 -540 209 551 -435 -225 643 488 -658
7164 -658 547 225 221 -385 13 -336 514 72 -403 -431 732 -277 -287 285 622 -66 -532 -429 -409 53 265
7185 265 189 5 -396 -47 -272 11 8 -5 291 237 709 123 -34 -316 1 159 418 80 -622 -210 -151 -551
7207 -551 96 283 320 -39 -619 -158 287 322 10 -139 310 267 -271 270 -257 167 750 626 -113 -266 -92
7228 -92 -605 -549 233 -135 131 -604 -195 55 -760 -285 356 -331 -777 -888 55 852 152 -944 423 53
7248 53 723 -283 467 -134 65 -323 -252 -285 179 225 -680 436 23 1000 -427 -351 -103 616 -67 338 531
7269 531 -988 -577 -214 -697 -307 -236 547 -259 469 -21 276 127 -200 32 148 -320 174 569 -470 109
7289 109 1027 52 122 810 405 491 436 -271 151 -281 -11 -185 -502 155 283 -546 259 -222 122 263 -132
7310 -132 -148 430 634 -642 53 -1280 480 -61 -939 -298 201 147 415 -297 10 -267 104 896 -365
7329 -365 -92 54 304 113 932 191 -556 3 -287 -539 -366 -120 73 35 -141 97 -127 263 -83 492
7349 492 423 253 598 736 249 -300 638 598 299 -205 339 60 244 575 190 100 297 -325 -260 724 -91
7370 -91 -507 -274 -172 -925 -632 -211 524 -387 186 -413 -248 -63 -501 351 795 18 431 526 158 304 -1198
7391 -1198 -671 -222 315 401 -680 -19 161 -1532 1018 219 -55 -117 272 344 148 -299 -10 -406 -287 489
7411 489 -217 326 -52 -199 -596 273 -1002 -899 251 -325 -178 -3 -525 -81 55 -228 -237 -205 174 -202
7431 -202 -37 -398 467 832 163 -5 120 -399 342 37 280 -232 -887 58 -1009 239 -78 322 38
7450 38 -520 54 -363 -267 165 263 164 786 -592 439 336 261 -18 -5 419 -995 757 -518 623 -127
7470 -127 192 30 -126 424 -452 365 -159 83 -1081 -243 722 -861 34 -155 -362 -198 478 -175 -325
7489 -325 -330 -368 -68 115 241 186 50 -178 -202 463 -170 -1 -191 -251 128 -187 329 -480 601 328 38 -488
7511 -488 -48 -136 210 -260 49 -477 157 358 969 1043 -542 -571 -329 -350 481 45 -41 119 -48 266 -783
7532 -783 -218 -75 -316 41 -617 -230 1269 123 -330 609 -401 478 577 1012 -30 -222 92 471 377
7551 377 -862 -697 132 473 921 540 180 -356 -81 555 -679 -452 703 -51 140 64 335 480 -8
7570 -8 13 101 260 -750 86 -164 162 165 145 -394 790 186 241 -858 120 451 1013 81 366 380 -259 -261 -345
7593 -345 56 -90 -63 631 177 -32 162 -275 -673 586 -577 410 322 -56 -529 -164 -853 -642 -657 94
7613 94 57 141 259 126 -346 -412 414 691 -60 732 408 543 69 -38 -179 -1025 278 466 -332 252 9
7634 9 -6 -278 175 -154 -203 726 323 71 542 38 167 144 219 55 193 126 180 -620 -31 -453 -68 9 581
7657 581 617 -674 -560 -63 780 187 250 -164 407 -162 573 -100 600 545 -64 -438 -521 13 632 -159 364
7678 364 -457 -968 -368 584 -456 507 262 215 -112 -7 -285 -33 -81 -223 -52 -65 128 197 -71 227 190
7699 190 -235 127 87 486 -116 607 415 331 -248 361 18 116 -606 228 700 246 304 260 605 282 -248 -67
7721 -67 421 90 54 110 -162 -312 -207 -379 -220 -132 -155 70 -387 103 357 -15 -188 200 203 83 -756 -789 762
7744 762 -34 -454 632 602 208 -172 -274 456 582 469 -432 -337 -664 366 458 513 281 599 276 -6 -150
7765 -150 237 327 386 154 35 -123 940 263 -742 -319 117 -35 -318 -124 419 -146 -337 406 -909 716
7785 716 438 277 285 -1020 -539 -260 -395 -38 379 -586 543 162 -538 727 272 143 57 400 387 -980
7805 -980 705 555 -227 493 -264 -1581 171 437 -693 -120 -458 -177 -29 882 -17 11 774 280 383
7824 383 517 -599 -103 159 -150 -485 -485 -140 368 -224 -263 -651 617 -213 150 254 502 -821 177 -127
7844 -127 397 327 167 -15 53 304 -42 -47 -11 -78 833 -50 -359 117 -166 -181 -16 361 721 -559 -555 562
7866 562 455 47 -329 69 -154 86 318 496 -177 411 -284 -1439 -311 796 -78 278 -378 -197 317
7885 317 -319 -230 -446 -400 717 428 -102 -673 3 -226 231 -88 98 -71 752 -464 53 514 560 -464
7905 -464 -88 -519 793 418 -366 -869 -197 127 -573 -197 -396 -121 440 729 -188 -575 175 -618 -567 675
7925 675 113 -391 -5 -379 33 141 -179 280 243 100 55 -272 -148 730 -39 587 106 -252 491 -186 428
7946 428 231 700 445 252 -735 -345 476 -311 -364 -352 -265 222 186 143 43 179 235 -210 -391 -787 228 20
7968 20 368 774 -1 31 215 176 -317 195 -563 542 58 211 -269 440 -194 -215 -191 300 553 -338 270
7989 270 -317 -53 -407 260 414 426 70 319 659 -257 -366 -620 152 635 1077 631 -318 3 -32 -548 -127
8010 -127 -169 272 -32 648 538 245 339 -305 382 123 569 -280 -432 143 257 300 -97 166 701 -68 -411
8031 -411 -6 -646 -22 -160 -271 326 -244 -441 -800 465 67 -145 642 749 43 -1204 194 507 190
8050 190 9 -202 -262 -476 -929 -137 -332 35 -75 -76 460 -645 247 -26 0 456 -203 408 -254 453 381
8071 381 431 315 125 -216 79 -357 40 680 -406 -556 -515 88 446 302 360 -65 -307 -300 160 81 -205 -177
8093 -177 -251 -213 337 -153 898 515 -41 -563 202 -44 -433 -90 -92 -334 186 434 633 330 241 -290 -728
8114 -728 405 -732 -587 -366 254 -381 558 -287 572 -216 -297 342 147 -247 355 -522 -743 -512 -10 85
8134 85 -995 492 74 350 131 -44 -8 -1115 -652 -592 187 195 -322 286 406 -28 -625 -146 373 -286 -153
8155 -153 575 101 887 383 -338 76 -218 -452 362 -100 306 183 -652 -124 -122 58 -499 133 -480 585
8175 585 152 -788 408 250 1207 -133 255 156 -256 475 -259 366 480 -660 -419 -31
8191c1
##END NTUPLES=NMR FID
##END=
