##TITLE=1H_Pr 5063-2
 CDCl3
 8 sc, 
 23.09.2022
##JCAMPDX= 6.0         $$ Bruker NMR JCAMP-DX V2.0
##DATA TYPE= NMR FID
##DATA CLASS= NTUPLES
##ORIGIN= UXNMR, Bruker Analytische Messtechnik GmbH
##OWNER= root
$$ XWIN-NMR		Version 3.5
$$ Fri Sep 23 15:39:39 2022 Russian Standard Time (UT+4h)  she@DPX200
##.OBSERVE FREQUENCY= 200.1313499994
##.OBSERVE NUCLEUS= ^1H
##.DELAY= (6, 6)
##.ACQUISITION MODE= SIMULTANEOUS
##.ACQUISITION SCHEME= undefined
##.AVERAGES= 8
##.DIGITISER RES= 18
##SPECTROMETER/DATA SYSTEM= spect
##.PULSE SEQUENCE= zg30
##.SOLVENT NAME= CDCl3
##.SHIFT REFERENCE= (INTERNAL, CDCl3, 0, 15.7039)
##AUDIT TRAIL= $$ (NUMBER, WHEN, WHO, WHERE, WHAT)
$$ ##TITLE= Audit trail, XWIN-NMR		Version 3.5
$$ ##JCAMPDX= 5.01
$$ ##ORIGIN= Bruker BioSpin GmbH
$$ ##OWNER= she
$$ F:/spectra/data/she/nmr/H-F/1/audita.txt
$$ ##AUDIT TRAIL=  $$ (NUMBER, WHEN, WHO, WHERE, WHAT)
(   1,<2022-09-23 15:37:50.00 +0400>,<she>,<DPX200>,
      <created by zg, POWCHK disabled, PULCHK disabled
       configuration hash MD5:
       00 E9 B6 7A A2 85 ED C7 34 08 36 98 17 FE 4E 26
       data hash MD5: 16K
       6B 92 BC 05 44 A5 28 AF 61 E3 B8 85 D7 9B 7B 05>)
$$ ##END=
$$ 
$$ hash MD5
$$ 83 79 50 8F 05 EA 74 72 43 41 4A 50 3F FD 3A 73
##$RELAX= 
##$RELAX= 
##$RELAX= 
##$RELAX= 
##$RELAX= 
##$RELAX= 
$$ Bruker specific parameters
$$ --------------------------
##$DU= <F:/spectra>
##$EXPNO= 1
##$NAME= <H-F>
##$PROCNO= 1
##$TYPE= <nmr>
##$USER= <she>
##$AMP= (0..31)
100 100 100 100 100 100 100 100 100 100 100 100 100 100 100 100 100 100 
100 100 100 100 100 100 100 100 100 100 100 100 100 100 
##$AQSEQ= 0
##$AQ_mod= 1
##$AUNM= <au_zg>
##$AUTOPOS= <>
##$BF1= 200.13
##$BF2= 200.13
##$BF3= 200.13
##$BF4= 200.13
##$BF5= 200.13
##$BF6= 200.13
##$BF7= 200.13
##$BF8= 200.13
##$BYTORDA= 1
##$CFDGTYP= 0
##$CFRGTYP= 5
##$CHEMSTR= <none>
##$CNST= (0..31)
1 1 145 1 1 1 1 1 1 1 1 1 1 1 1 1 1 1 1 1 1 1 1 1 1 1 1 1 1 1 1 1 
##$CPDPRG= <>
##$CPDPRG1= <>
##$CPDPRG2= <>
##$CPDPRG3= <>
##$CPDPRG4= <mlev>
##$CPDPRG5= <mlev>
##$CPDPRG6= <mlev>
##$CPDPRG7= <mlev>
##$CPDPRG8= <mlev>
##$CPDPRGB= <>
##$CPDPRGT= <>
##$D= (0..31)
0 1.2 0 0 0 0 0 0 0 0.06 0 0.03 0 0 0 0 0.0002 0 0 0 0 0 0 0 0 0 0 0 0 
0 0 0 
##$DATE= 1663933069
##$DBL= (0..7)
120 120 120 120 120 120 120 120 
##$DBP= (0..7)
150 150 150 150 150 150 150 150 
##$DBP07= 0
##$DBPNAM0= <>
##$DBPNAM1= <>
##$DBPNAM2= <>
##$DBPNAM3= <>
##$DBPNAM4= <>
##$DBPNAM5= <>
##$DBPNAM6= <>
##$DBPNAM7= <>
##$DBPOAL= (0..7)
0.5 0.5 0.5 0.5 0.5 0.5 0.5 0.5 
##$DBPOFFS= (0..7)
0 0 0 0 0 0 0 0 
##$DE= 6
##$DECBNUC= <off>
##$DECIM= 32
##$DECNUC= <off>
##$DECSTAT= 4
##$DIGMOD= 1
##$DIGTYP= 9
##$DL= (0..7)
0 120 120 120 120 120 120 120 
##$DP= (0..7)
150 150 150 150 150 150 150 150 
##$DP07= 0
##$DPNAME0= <>
##$DPNAME1= <>
##$DPNAME2= <>
##$DPNAME3= <>
##$DPNAME4= <>
##$DPNAME5= <>
##$DPNAME6= <>
##$DPNAME7= <>
##$DPOAL= (0..7)
0.5 0.5 0.5 0.5 0.5 0.5 0.5 0.5 
##$DPOFFS= (0..7)
0 0 0 0 0 0 0 0 
##$DQDMODE= 0
##$DR= 18
##$DS= 0
##$DSLIST= <SSSSSSSSSSSSSSS>
$$ [...]
##$SUBNAM2= <"">
##$SUBNAM3= <"">
##$SUBNAM4= <"">
##$SUBNAM5= <"">
##$SUBNAM6= <"">
##$SUBNAM7= <"">
##$SUBNAM8= <"">
##$SUBNAM9= <"">
##$SW= 18.0517283424941
##$SWIBOX= (0..15)
0 0 2 0 0 0 0 0 0 0 0 0 0 0 0 0 
##$SW_h= 3612.71676300578
##$TD= 16384
##$TD0= 1
##$TE= 0
##$TE2= 300
##$TE3= 300
##$TEG= 300
##$TL= (0..7)
0 120 120 120 120 120 120 120 
##$TP= (0..7)
150 150 150 150 150 150 150 150 
##$TP07= 0
##$TPNAME0= <>
##$TPNAME1= <>
##$TPNAME2= <>
##$TPNAME3= <>
##$TPNAME4= <>
##$TPNAME5= <>
##$TPNAME6= <>
##$TPNAME7= <>
##$TPOAL= (0..7)
0.5 0.5 0.5 0.5 0.5 0.5 0.5 0.5 
##$TPOFFS= (0..7)
0 0 0 0 0 0 0 0 
##$TUNHIN= 0
##$TUNHOUT= 0
##$TUNXOUT= 0
##$USERA1= <user>
##$USERA2= <user>
##$USERA3= <user>
##$USERA4= <user>
##$USERA5= <user>
##$V9= 5
##$VALIST= <valist>
##$VCLIST= <CCCCCCCCCCCCCCC>
##$VD= 0
##$VDLIST= <DDDDDDDDDDDDDDD>
##$VPLIST= <PPPPPPPPPPPPPPP>
##$VTLIST= <TTTTTTTTTTTTTTT>
##$WBST= 1024
##$WBSW= 4
##$XGAIN= (0..3)
0 0 0 0 
##$XL= 0
##$YL= 0
##$YMAX_a= 14637
##$YMIN_a= -12619
##$ZGOPTNS= <>
##$ZL1= 120
##$ZL2= 120
##$ZL3= 120
##$ZL4= 120
##$ABSF1= 10
##$ABSF2= 0
##$ABSG= 5
##$ABSL= 3
##$ALPHA= 0
##$AQORDER= 0
##$ASSFAC= 0
##$ASSFACI= 0
##$ASSFACX= 0
##$ASSWID= 0
##$AUNMP= <proc_1d>
##$AZFE= 0.1
##$AZFW= 0.1
##$BCFW= 1
##$BC_mod= 2
##$BYTORDP= 1
##$COROFFS= 0
##$CY= 11.3945322036743
##$DATMOD= 1
##$DC= 2
##$DFILT= <>
##$DTYPP= 0
##$F1P= 2.36226072786647
##$F2P= -0.459571619588291
##$FCOR= 0.5
##$FTSIZE= 0
##$FT_mod= 4
##$GAMMA= 1
##$GB= 0.15
##$INTBC= 1
##$INTSCL= 1
##$ISEN= 128
##$LB= 0.24
##$LEV0= 0
##$LPBIN= 0
##$MAXI= 10000
##$MC2= 0
##$MEAN= 0
##$ME_mod= 0
##$MI= 1.114404
##$NCOEF= 0
##$NC_proc= 0
##$NLEV= 6
##$NOISF1= 3.799351
##$NOISF2= 2.8
##$NSP= 1
##$NTH_PI= 0
##$NZP= 0
##$OFFSET= 15.70392
##$PC= 1
##$PHC0= -17954.25
##$PHC1= 21.00069
##$PH_mod= 1
##$PKNL= yes
##$PPARMOD= 0
##$PSCAL= 0
##$PSIGN= 0
##$REVERSE= no
##$SF= 200.130013532006
##$SI= 16384
##$SIGF1= 3
##$SIGF2= 2
##$SINO= 400
##$SIOLD= 16384
##$SREGLST= <1H.CDCl3>
##$SSB= 0
##$STSI= 0
##$STSR= 0
##$SW_p= 3612.71676300578
##$SYMM= 0
##$S_DEV= 0
##$TDeff= 0
##$TDoff= 0
##$TI= <>
##$TILT= no
##$TM1= 0
##$TM2= 0
##$TOPLEV= 0
##$USERP1= <user>
##$USERP2= <user>
##$USERP3= <user>
##$USERP4= <user>
##$USERP5= <user>
##$WDW= 1
##$XDIM= 8192
##$YMAX_p= 0
##$YMIN_p= 0
$$ End of Bruker specific parameters
$$ ---------------------------------
##NTUPLES= NMR FID
##VAR_NAME=  TIME,          FID/REAL,        FID/IMAG
##SYMBOL=    X,             R,               I
##VAR_TYPE=  INDEPENDENT,   DEPENDENT,       DEPENDENT
##VAR_FORM=  AFFN,          ASDF,            ASDF
##VAR_DIM=   8192,          8192,            8192
##UNITS=     SECONDS,       ARBITRARY UNITS, ARBITRARY UNITS
##FACTOR=    0.0002768,     1,               1
##FIRST=     0,             0,               0
##LAST=      2.2672688,     0,               0
##MIN=       0,             -12619,          0
##MAX=       2.2672688,     14637,           0
$$ Real data points
##PAGE= N=1
##DATA TABLE= (X++(R..R)), XYDATA
0@%%%%%%%%%%%%%%%%%%%%%%%%%%%%mJ2j6J6j6J6j6J6j6K0k8L2l2L2l7M5m8N1n9
47c2O4p0P8q5R4j04J15j27J42j58J75j95K19k49K86l31L90m73N92p75J120j961
69a285P498Q424j9725p531J1956N804j1744m910P660N665j170K14j215l220K268
84a311N952k910p132K689Q134j643o989N52N109Q68k57J274j205j924K543Q43
100D593o498m498M386L101m383k679L125J569j128J362J529j437J048M401p11
115C780n355n8M058j127l667J707K849j757j78L762j169n373K123O531l421q606
131e901K086P490l160q304J659P170J30l757J021L238O45j23k10j674l89K602
147B523J21l980j167L279P72l048k76K902N12j451L67M72j690o46J257p20k329
$$ plain form
0 0 0 0 0 0 0 0 0 0 0 0 0 0 0 0 0 0 0 0 0 0 0 0 0 0 0 0 0 0 -4 8 -8 8 -8 8 -8 8 -8 12 -16 16 -16 16 -21 24 -24 27 -32
47 -32 32 -38 40 -45 49 -55 60 -67 75 -83 92 -103 116 -133 153 -178 212 -261 331 -444 676 -1285
69 -1285 6213 14637 -5088 -12619 -663 5141 -6603 -11513 -3853 1812 642 856 -359 -3579 -1311
84 -1311 4641 1731 -5401 -2712 5422 3779 -3210 -2658 2451 3319 3062 4336 3131 1207 3750 4593
100 4593 -1905 -6403 -2017 1084 -3299 -5978 -2853 -1284 -2412 -1050 479 -958 90 4491 3780
115 3780 -1575 -1633 2425 1298 -2369 -662 2187 430 252 4014 2845 -2528 -405 6126 2705 -5901
131 -5901 -3815 3675 515 -7789 -6130 1040 1170 -2587 -1566 1672 2317 2194 1984 310 -79 2523
147 2523 2644 -1336 -2503 776 1548 -1500 -1776 1126 1638 187 554 1026 -664 -1310 -53 -773 -3102
164c102P79K505o54j649J567K327m09n68J166M58r47k57j96j385o42J051m43j733
182b132P48K209p06k080J389K448j342k276J360J728j731j782J447J283j102l05
198h44J653P22o05J68O90l27n92o1m53q19m8l1j065l40J230M64j115Q5J856M63
218A031j434k47J313J60j098k31O46J09j29L26O4j94N11O37m47o98K37J98q03
237d9o72o4j85k61L40J09n17J91J238L56r98L8J310L04j137l72Q62K09n56j83
257c7L33J77M3J73k09k20K24J33n81m78J95%n06j09L09j70j96N44N14l70k16P63
279C16M35o20l41N28L26m47k84K28J15MK9j21j11K37K85m27m37K89L00n03m18
300f17L41K44l38j33L49M3j84K01K52j94j68L30J48l43r0L38O0k47RJ89p6nJ46
$$ plain form
164 -3102 -2323 182 -472 -2121 -554 1773 1364 796 1962 2420 1473 1216 1020 -365 -1007 44 -399 -2132
182 -2132 -1384 825 119 -1961 -572 1876 534 -1742 -382 1346 -385 -2167 -720 563 -539 -844
198 -844 809 1531 926 1094 1784 1457 865 804 351 -468 -516 -547 -1612 -1952 -722 -258 -1373 -1288 568 1031
218 1031 -403 -650 663 823 -275 -506 140 249 120 446 510 316 827 1464 1017 319 556 754 -49
237 -49 -721 -785 -970 -1231 -891 -782 -1299 -1108 130 486 -512 -474 836 1140 3 -369 493 702 146 -37
257 -37 296 473 516 689 480 260 484 617 36 -442 -247 -247 -753 -862 -553 -723 -919 -375 139 -231 -447 316
279 316 751 131 -210 318 644 197 -87 141 256 260 289 168 57 294 579 152 -285 4 304 -199 -617
300 -617 -276 -32 -370 -503 -154 -111 -295 -94 158 -36 -204 126 274 -69 -159 179 239 -8 1 190 114 109 255
323B55l8k05R9K49j85k88J63K08k62l19J91J68k95j08J82J2j70Q2K17j05n1J78
345b2J47j71K4J97Qj09O5J09q2m6J69N8k37N3K27r8l31OJ14j48k89k0J07j27o7
370d63Q0J06pJ13J72K4j2J28O7r8M2Q0j08o1J42J29j93o1K71J11l00j96J44Q5
394A95k67k89m0J30j8j36l3J25K30Q5k2K4J85J22m2j48mQ2q1o6l4LP7R4L7p2l3
421A04J24k0j81q8lj20j41O0L5p9MK65J99q2r2J77K17j44k31n0K7L9o2j60j56
446c58K64L53j01l54R4N43O8n55k67L81K98l71m83J42M76N9l48o6L17K85j11k21
468D5o9M7O2j33k24j51R0K08Oj12j1L61K31j45j68J85J44j87j48J24m9j82O7K27
492B18q4k92J12L72n0m04j26K14R1k61k94l7J58K48J3k96n2O27M88l88n10M65
$$ plain form
323 255 217 12 111 360 175 -113 50 258 -4 -323 -132 36 -259 -367 -185 -173 -343 -261 -44 -149 -200 -22
345 -22 125 -46 -22 175 183 74 139 248 166 120 289 347 110 163 390 292 -39 -33 81 -67 -356 -376 -269 -396 -463
370 -463 -383 -277 -284 -171 1 25 13 141 208 110 152 232 124 63 205 334 141 80 351 462 162 -34 110 195
394 195 -72 -361 -401 -271 -289 -425 -458 -333 -103 -18 -40 -16 169 291 249 101 97 179 98 32 -2 1 78 172 209 137 104
421 104 228 208 27 -61 -64 -184 -325 -265 -230 -309 -305 -40 159 77 -15 162 379 235 4 -46 -19 20 -42 -202 -358
446 -358 -94 259 158 -196 -102 441 509 -46 -313 68 366 -5 -488 -346 130 189 -159 -225 92 377 266 45
468 45 -24 23 85 -48 -272 -423 -333 -125 -119 -231 -242 119 350 205 37 222 366 179 31 155 106 -76 -9 218
492 218 134 -158 -46 326 276 -128 -254 -40 51 -210 -504 -541 -383 -135 -122 -418 -470 157 645 257 -253 212
514B12O90k61q27jN82J39n55l25L26L52n3l29j21R0J52j6l16l29J58K77p8l52
536e85J7M39K64j34r4K34K91j2j55k2P5p5p5M4p2j80N2K19l8k83n1J83O0k12j90
561c00m2Q7O9l9k00j09L35M62j49m79K00P69J07p58k49O85L23n82m84K82M29p7
583B80m19m8K52J42j00j67j30N2J70n3l35j62L56K65k29k73K20M31m9k31kK46
605B16M8j77n6O4l6q2M7O4j21pJ13R0j23o8J02m6o1k2k4o9k8J39j9j17o4K47J67
632A77k17k49K25L46j25m20O7M18O9l55j40K81K43j94j77P1K20p4j04k9rM2l1
655C5r9j33M1J58p1j70j6J98P3j32n2J10J37l3r1J0R0O0j8m9L6P4J1p1m7K9J03
682A83p3j32J9R7o9j43k2N2J4o2q9L6J23m0j1N1J19j2l7L9Q5K6j03L0L6K4j01
$$ plain form
514 212 902 641 -186 -187 395 534 -21 -346 -20 332 279 -50 -171 -81 71 55 -261 -590 -432 -155 -233 -585
536 -585 -568 -129 135 1 -93 141 432 420 265 243 318 243 168 212 140 -40 12 231 193 -90 -141 42 102 -110 -300
561 -300 -342 -255 -186 -225 -425 -534 -199 263 114 -365 -165 604 711 -47 -296 389 712 130 -354 -72 357 280
583 280 -139 -187 65 207 107 -60 -190 -138 32 -21 -356 -518 -162 103 -126 -399 -179 252 203 -28 -30 216
605 216 264 87 31 95 59 -23 24 88 -33 -40 73 163 40 -28 74 28 -33 -55 -79 -148 -176 -37 -56 -173 -237 10 177
632 177 -40 -289 -64 282 157 -263 -196 222 291 -64 -204 77 320 126 -51 20 240 166 62 33 24 66 35
655 35 -64 -197 -156 2 -69 -239 -255 -57 16 -116 -168 -58 79 46 -45 -35 55 115 97 48 84 158 169 98 51 80 183
682 183 110 -22 -3 94 25 -118 -140 -88 -74 -136 -225 -189 -66 -106 -117 -66 53 41 4 43 128 154 51 81 117 141 40
709D0k8R9K3q5k4O3j1p1n2mj8j4r1j8K5O9J8m2O1P2K3j3P0j5k0m2L3l6k7QLM8
741D4k1J4Q2N2n7k4JJ6n9j11l5k8M6m8l8O9J12k1l8nR0Lp5k2jl2k4L9L7rM2Q3
773H2O4l4O8Q4Lj17m1k2o2j9r7m7NR4j9o0LJ23J1j41l2O2N1j17m8M7N0M1N6N3
803D1J34N3J9jM2mn5q4o2m8o7n9k5QJ2j8M3R%l6l0J4o0n2M1O7qJ2Q8R1R2M1Q2
836B80L7k5pl8o0p7p1o7k5n5k4K2QK6nJ3J8nk9p4LM7l0jM2P1R1J3M2R8Q0k4k7
869B47o7qo6q6q6oj6Kj4j7N1N9kl2Jopl1k0m3L6O5J2N1j9O2J05Jk8j8L5oq6q0
903a7j5L6l2Km1K9K3N0k1l4J0L4l0n3r2M1O6k8p3lJ01P9lr1Q3Q8qp9K2L1Ml9J4
936E4k2j5M3L1qo6OO6k6p6n0J4Ln8Lrl3NR6nm4K4J29K7p4m5R9J27q3j07M8R0R
$$ plain form
709 40 12 111 134 49 25 88 77 6 -46 -50 -68 -82 -173 -191 -166 -97 -79 -121 -60 12 35 22 92 77 57 15 48 12 -15 -7 -4 44
741 44 23 37 119 171 114 90 91 107 48 -63 -98 -126 -80 -128 -166 -97 15 -6 -44 -49 41 44 -31 -53 -54 -86 -110 -71 -34 -43 -1 82
773 82 146 112 180 264 267 150 109 87 25 6 -91 -138 -133 -39 -58 -118 -115 8 19 -122 -154 -92 -41 -158 -206 -159 -109 -68 -12 41
803 41 175 228 247 246 288 284 229 145 83 35 -32 -91 -116 -108 -96 -114 -71 -62 -62 -98 -128 -114 -174 -226 -185 -118 -126 -114 -26 65 157 198 280
836 280 317 292 285 247 187 110 39 -28 -53 -108 -132 -110 -102 -76 -81 -68 -50 -55 -84 -158 -155 -108 -138 -139 -97 -26 65 78 120 218 298 274 247
869 247 180 172 106 20 -66 -72 -88 -86 -100 -117 -66 -7 -9 -41 -40 -46 -53 -84 -104 -147 -111 -46 -34 17 -2 60 165 166 138 120 155 149 63 -17
903 -17 -32 4 -28 -26 -67 -38 -15 35 14 -20 -10 24 -6 -59 -151 -110 -44 -72 -145 -148 -47 32 29 -62 21 109 101 22 44 75 79 40 54
936 54 32 17 60 91 83 17 23 89 63 -13 -63 -49 -46 -104 -101 -110 -143 -138 -42 -47 -91 -67 62 89 15 -30 69 196 113 6 54 144 153
969A53j11m0M4RLo5m9KL7Kq4m2PJ18j9j54J8J41N1j11rJ46P3o0k3R6Ok6j9M2o8
1000F8j02K1P1n0j21M2J08J4q2k2P4Kk2o5l0nK8K4l1m3M1J60lk4p8J42J12j52
1028G7j50J8J21n1j57L1Q4M2NQK1M1N8J7p7j02RL5r1j54N0J01j9n8N2J18kK4l2
1057A9K5m0n9J9l1m3J3O5N7O6J5Q0N7K0k2n7n8p0k8j06q6m8OOK8J5L8O6Q3m5l7
1088e2M3K2q0j11P0R6k3K0R3J09P5J4J4l3k2%j35j72q8l6l0q1K1O0P4l7J14P3
1116bJ5m4P5j6q6NJ8MlP8J14N1J1J06Lk7q7j4j16j30j34l4p5o9j1J09M2P5P1P5
1146DoO8R1q9n6LL1q7lR1P2J7K7J40Mm9n8l8j46q8q7p9j03kN2K8L9J23J10K5O0
1177I4N7K4r2k7J2o9p6K5L7OJ2J08N2j3k4L9m8j08q8l1j17n2K9L7L0M8J30P5N1
$$ plain form
969 153 42 2 46 55 58 -7 -56 -54 -17 -15 -99 -141 -134 -16 -35 -189 -171 -30 21 -90 -99 47 120 60 37 133 139 113 94 136 68
1000 68 -34 -13 58 8 -113 -71 37 51 -31 -53 21 23 1 -64 -94 -99 -71 -47 -78 -121 -80 80 77 53 -25 117 229 77
1028 77 -73 -55 66 15 -142 -111 -27 15 20 28 49 90 148 165 88 -14 -5 30 -61 -215 -165 -64 -83 -141 -89 29 27 51 19
1057 19 44 4 -55 -36 -67 -110 -97 -32 25 91 106 186 243 263 241 184 126 56 28 -78 -164 -212 -206 -200 -172 -157 -119 -53 30 -15 -52
1088 -52 -9 13 -67 -178 -108 -12 -35 -15 78 187 262 276 290 257 235 235 100 -72 -160 -196 -226 -307 -286 -226 -152 -189 -75 -2
1116 -2 13 -31 44 28 -58 -53 -35 -31 -34 44 158 209 220 326 329 302 215 201 85 -45 -179 -213 -288 -357 -368 -259 -217 -142 -71 4
1146 4 -2 66 157 68 12 15 46 -41 -44 47 119 136 163 303 307 258 200 162 16 -72 -159 -238 -341 -343 -291 -263 -224 -101 9 34 94
1177 94 151 175 83 56 68 -1 -77 -52 -15 -9 3 111 163 150 126 165 117 9 -79 -110 -227 -279 -250 -213 -183 -135 -5 70 121
1206A21N6M4l4o5k4l8j04q1L7j6l5N0P5L0L1N6Jl6m7l8k7o6l2j5L2M2N6R5P3O6
1236B07K8J9p8k3m2j15j14j3p5m1J5N2P5L9M7Q2lj3rJ0l7n8l1N8l3L5O5N7L6O3
1266B03M9k1p4o1o1j13q8l6n7l6J9N5L5N9J05N6M0J9L6oo6k7m%Kj7R3K0L0K6k1
1297A59K1n8l2r7j01m9p0l4Lk7K8Q3Q2O9N5J1O0K1j3m1J3m1K4l0K0J2JO1rK1J
1328A43l7m3o2p8n0n6p7M5k8L0Q0N4N2M6N1N4j3l6OPm2l5J6k3K6KN4jROl9Pn2
1361A6l3m9p1Qk1nJ2M5K4M1M3O9J3k2J0m7j3Kqj7l3J6K7J7K1RJ1pj2rm2j2j3l2
1395f2j3KnN1j4M6L3Oj1nJ1m1J6m9J9k9P%M7jj4P5j4J0J8kpm6k5j1MoJk5oM6l0
1432b4J3K2j5l5J6j7k1mmL0LNK5L3Qj1O9k7J0oKl3Ok2mj9K8m8J7J9m1j1Qj6j3
$$ plain form
1206 121 177 221 187 122 98 60 -44 -125 -88 -104 -139 -89 -14 16 47 103 104 68 21 -17 -44 -110 -142 -157 -125 -83 -27 68 141 207
1236 207 235 254 176 153 111 -4 -118 -131 -206 -247 -232 -180 -105 -66 -19 63 60 47 38 48 11 -47 -78 -20 -53 -18 47 104 140 203
1266 203 252 231 157 96 35 -78 -166 -202 -259 -295 -276 -221 -186 -127 -22 34 74 93 129 123 57 30 26 26 28 11 104 124 154 180 159
1297 159 180 122 90 -7 -108 -157 -227 -261 -258 -285 -257 -174 -92 -23 32 43 103 124 111 70 83 42 66 36 56 68 69 130 121 142 143
1328 143 106 63 1 -77 -127 -183 -260 -215 -243 -213 -133 -79 -27 19 70 124 111 75 81 88 46 11 27 4 30 32 86 85 94 100 61 68 16
1361 16 -17 -66 -137 -129 -150 -155 -143 -98 -74 -33 10 79 92 70 80 33 20 22 14 -3 -36 -20 7 24 45 54 65 58 46 37 -5 -17 -30 -62
1395 -62 -75 -73 -78 -27 -41 5 38 44 33 28 39 -2 14 -35 -16 -45 -38 -38 9 8 -6 69 55 65 83 81 74 28 3 -8 -4 -10 -9 -34 -40 6 -24
1432 -24 -11 11 -4 -39 -23 -40 -61 -65 -69 -39 -36 -31 -6 27 35 24 93 66 76 70 72 39 45 23 19 0 28 -20 -3 16 -25 -36 -28 -44 -57
1467e7j1J8KlNj9M0RK6qML4J9mJ1l0RL0J0k2n3kK0k7l5KJ8l1kK4k2qJ9LL3Lk2
1504a7J7j1j3j1K1J2K6l8N0Kj1NO8l5l2jljo0%K5l4kK4J7k3pL1J0j4j9j9J2l6
1538f7nM2L1l6J1N9J0RK9%j2kj6k7jJ0p0M5km6M0pmJj6j4rk6KJ9j4l7K9LM3N0
1574B2j7P3J0j8J6K9k6m6K2%k0n0j1L9j7j9OJ4l1Jl6jm1j7K8l7LM8M1K9RN6J7
1607G6JK0Jj5j1Rl4m3k8K6MK3l0Qomm8J5j2j4Ll8J6J0QpO4K6K6j6K7M2lk4Kk1
1643E3n0K0j7j9MQrM2l4mj9Krorl0pL6Qj0J1K4L3MM2Oj1k8K3k1n0K1j0j1RL7j1
1680A8kK0j5%%k5%k4j1l9L8j7k7J7N0k0L1L7npj0J6l0J1Lk2J0JK9J0j4M4j0Pj7
1715D7j1kj9l9J5%k7l2L2oj6RM2ll%qqLPJ2RML4J0k7L6m3M3lJ6k7Kl2j7J5j1l4
$$ plain form
1467 -57 -68 -50 -48 -51 -46 -65 -25 -16 10 2 6 40 59 55 66 36 45 75 85 63 10 8 28 1 -34 -32 -14 -45 -47 -23 -45 -53 -34 -31 2 5 -17
1504 -17 0 -11 -24 -35 -14 -2 24 -14 36 38 27 32 100 65 33 32 29 28 -32 -32 -7 -41 -43 -19 -2 -25 -32 -1 9 -5 -24 -43 -31 -67
1538 -67 -72 -30 1 -35 -24 35 45 54 83 83 71 69 53 26 25 35 -35 10 8 -38 2 -5 -9 -8 -24 -38 -47 -73 -71 -52 -66 -103 -74 -71 -28 22
1574 22 5 78 88 70 86 115 89 43 65 65 45 -5 -16 23 6 -13 -7 7 -24 -23 -59 -60 -101 -118 -90 -127 -124 -76 -35 -6 3 59 76
1607 76 77 97 98 83 72 81 47 4 -24 2 6 29 -1 7 1 -3 -51 -36 -48 -62 -59 -97 -81 -71 -63 -70 -6 20 46 30 57 99 96 72 74 53
1643 53 3 23 6 -13 -9 -1 -10 32 -2 -6 -25 -23 -32 -38 -47 -77 -84 -48 -40 -50 -39 -15 18 22 64 70 59 31 54 33 -17 4 -6 -17 -8 29 18
1680 18 16 36 21 21 21 -4 -4 -28 -39 -78 -40 -57 -84 -67 -17 -37 -6 31 26 19 9 25 -5 6 9 -13 -3 -2 27 37 23 67 57 64 47
1715 47 36 34 15 -24 -9 -9 -36 -68 -36 -42 -58 -49 -7 -10 -13 -13 -21 -29 -26 -19 -7 2 6 40 50 23 59 16 59 56 72 45 47 15 -2 13 2 -32
1753c2Oj0PRk6L6l4J8qJ2OKK3l1L8Rk2K4K3l0K1L5k6k5Nj1j3npk2J8pk9K6Qj7
1789b9Kk4K6qL1k0OK0PlK0mj2L5MoJ4pJl3J3k4Kj1Pj6j4mk3kj2J0J3j4L7l3L1
1826b0LKRK3j7L5mk9M7J6j3jmK0l7J3j4J0n0j2jLj7RK6l1j0JL7j5j3j7L3n%kJ4
1863a1Mj1N2Rk4K7lRkLk2J6k4ojk1lK1l3J6lk3J4Qk2J5n0K0J0OLQK5Rj6N7Pj6
1901D8J1J6k3k8J4J0n5K3jlk3JmqJkJ9m3J3j7K3JPjMK4K4lJ0j9M3j3rJ3%l9k6
1938a2nPj1L2k9j7K1Qj3k2qj4L2k2JJ4K2rL7njPL9k0K1J7l5j2L5m5QLj4LNj4m
1975@k3K7j6Joj7mpJ3j1J0LqN1k8K8jpM3k0kj1kjKJ5j6J7k4J6k0K2j3NLkk4m0
2013d7K0nk1%J8K0L1l7OL6k6nJ2J4Ok1j2J0K8J4j6qPL0l0j4qKqk1J3j3k0J5j5
$$ plain form
1753 -32 -26 -36 -29 -20 -46 -10 -44 -26 -34 -22 -16 -14 9 -22 16 25 3 27 50 20 41 76 50 25 30 19 6 1 -6 -28 -10 -17 -46 -20 -12 -29
1789 -29 -27 -51 -25 -33 -2 -22 -16 4 11 8 28 24 12 47 51 45 59 52 53 20 33 9 11 0 7 -9 -23 -27 -50 -52 -64 -54 -41 -55 -18 -51 -20
1826 -20 -17 -15 -6 17 0 35 31 2 49 65 52 51 47 67 30 43 29 39 -11 -23 -24 -21 -38 -29 -3 -34 -44 -43 -6 -21 -34 -51 -18 -23 -23 -25 -11
1863 -11 -7 -18 34 43 19 46 43 52 50 53 31 47 23 17 16 -5 -8 13 -20 -4 -7 -30 -16 -8 -30 -15 -65 -45 -35 -29 -26 -18 7 16 0 57 64 48
1901 48 59 75 52 24 38 48 -7 16 15 12 -11 -10 -14 -22 -21 -23 -4 -47 -34 -51 -28 -27 -20 -21 -17 7 31 28 38 19 62 49 40 53 53 14 -12
1938 -12 -17 -10 -21 11 -18 -35 -14 -6 -19 -41 -49 -63 -31 -53 -52 -38 -16 -25 12 7 6 13 52 32 53 70 35 23 58 13 21 24 10 13 18 4 0
1975 0 -23 4 -12 -11 -17 -34 -38 -45 -32 -43 -33 -30 -38 13 -15 13 12 5 48 28 26 15 13 12 14 29 13 30 6 22 2 24 11 16 19 17 -7 -47
2013 -47 -27 -32 -53 -53 -35 -15 16 -21 -15 21 -5 -10 2 16 22 1 -11 -1 27 41 25 17 24 54 24 10 2 4 -4 -25 -12 -25 -45 -30 -45
2048d5J2K8j0m4N3NpK1k1j3M1LOk9J0J4J0j3pRL2l6Jl3J7j7k7J4j4NJ1qRnNjK8
2085Dj4L6k1Rj7J9KJ0KK1l0J1%K0k8j4pJrjk8L6k7j9LlKK1j8K6k2MK8qJ0nL2j9
2123GPQK9m9L2knJ1rj4K9k5j5J3m7qL0j7k3K7j4K4k4Oj2J8oJ6knJ7K7j7J0K4k5
2159A6j0K5qj5L8ok2Pk3K1n0L4l6lJ3Pl2j1L5j6J0K0oJ5k1J6K3k4K9OQk2NOL6
2194F5l7J6qm1RNj5J4m8j5L0k0j6K7j1Rj1N5QMk1j3jL1l8N1Mj5lM0k3JjJ1l0j4
2230aLk8j4K0j5kj2J0j7K1K3kmJJ0Mk0QMm%KK9Ql1L3N5j9l3k4J1jQk2k8Qj5J1
2268b3J5NKJ8l1pL2pm5K7k3J4Jj3J1J3J7K1j7K1Jj0L4n8om%rMJ8J3j2PL3l1nj4
2305hK2m4%j4j4J2pJ7MJ4L4J1J3kkk3mK0l7%oJ8j8J3L5j0k9j4K1Kk8j8mkj4mM
$$ plain form
2048 -45 -33 -5 -15 -59 -6 -1 -8 13 -8 -21 20 23 29 0 10 24 34 21 14 23 55 19 20 -13 4 -13 -40 -26 -40 -35 -24 -32 -23 -28 -23 -24 4
2085 4 -10 26 5 14 -3 16 18 28 30 51 21 32 32 52 24 10 3 4 -5 -6 -34 2 -25 -44 -41 -44 -42 -21 -39 -13 -35 -31 -3 -11 -1 -6 26 7
2123 7 14 22 51 2 34 32 27 38 29 15 44 19 4 17 -30 -38 -8 -25 -48 -21 -35 -11 -35 -29 -41 -23 -29 -13 -15 -20 -3 24 7 17 41 16
2159 16 6 31 23 8 46 40 18 25 2 23 -27 7 -29 -32 -19 -12 -44 -55 -20 -36 -26 -6 -12 3 -18 -2 21 -3 26 32 40 18 23 29 65
2194 65 28 44 36 -5 4 9 -6 8 -40 -55 -25 -45 -61 -34 -45 -36 -47 8 16 20 -1 -14 -15 16 -22 29 33 18 15 55 32 33 32 43 13 -1
2230 -1 2 -26 -40 -20 -35 -37 -49 -39 -56 -35 -12 -14 -18 -17 -7 -3 -23 -15 -11 -15 -15 -13 16 24 -7 26 81 62 29 5 16 15 23 1 -27 -19 -34 -23
2268 -23 -8 -3 -1 17 -14 -21 11 4 -41 -14 -37 -23 -22 -35 -24 -11 6 27 10 31 32 22 56 -2 -8 -12 -12 -21 -17 1 14 2 9 42 11 6 -8
2305 -8 14 -30 -30 -44 -58 -46 -53 -36 -32 -18 16 27 40 38 36 13 9 29 -8 -8 -14 4 -14 -1 34 24 -5 -19 2 4 -24 -42 -46 -48 -62 -66 -62
2342f2LKN2J5PL6k4lJ2j0j6J1k1J9k1LL0j8Qj4Lpk0jl7K6l1nMNML5QoJ8K4J7J3
2380E9k3Jk8KJ3j7J7j8J6K4j0j3Oj0%l4j0J6k2j5pqJ4J5K6J1k8J9K7j6pJ1mj6
2414iJ1l1J5J1L1J1j7J8qrL2j7jk2k3m5Oj4J6J5j6K0J3LK1j7J4KnKj8k3J1K3J6
2449A6QLk7M9l9%jj0J3k1l0J9j7OOpJ5lM0mok3J5oMk0%PK2j2J2K6LJ2%j4J3j9
2487C0j3l1K1n5M1k8J6Qk2J3J6qKPj9Pj6NKj5L9J3mL5k0J9Qk5J6j1j1J1l1J1J0
2522B1j4j8pK6l5K4K2l3rKJ0npj4K6k5K6nQJ7K3j6Kk%LLj6j7L4K6n0nK0j2Pj9
2559iJ0Pl6J2Nj3nK6k7J3K7rNQj8J8J6oj6KqjK0Rk5j1Jj4kOL4k0kKrj4K4p%j7
2599b4jJ5lL8l2L2k6M0j2j5K1j1K4k3k1K3k7lJ0J2l4J2kMRqj0J0o3K7K3%lrK1
$$ plain form
2342 -62 -59 -57 -5 10 17 53 29 26 38 28 12 23 2 21 0 3 33 15 23 9 12 5 -15 -16 -53 -27 -58 -63 -59 -54 -50 -15 -7 -13 5 29 46 59
2380 59 36 37 9 11 24 7 24 6 22 46 36 23 29 19 19 -15 -25 -9 -31 -46 -53 -61 -47 -32 -6 5 -23 -4 23 7 0 11 7 -9
2414 -9 2 -29 -14 -3 28 39 22 40 32 23 55 38 37 15 -8 -53 -47 -61 -45 -30 -46 -26 -13 -10 11 -6 8 10 5 7 -11 -34 -23 0 16
2449 16 24 27 0 49 10 10 9 -1 12 -9 -39 -20 -37 -31 -25 -32 -17 -20 20 16 10 -13 2 -4 0 -20 -20 -13 9 -3 9 35 38 50 50 36 49 30
2487 30 17 -14 7 -48 -7 -35 -19 -11 -33 -20 -4 -12 -10 -3 -22 -15 -31 -26 -24 -39 0 13 9 44 24 43 51 26 42 31 20 31 0 11 21
2522 21 7 -11 -18 8 -27 -3 19 -14 -23 -21 -11 -16 -23 -37 -11 -36 -10 -15 -7 10 33 17 19 17 17 20 23 7 -10 24 50 0 -5 15 3 10 -9
2559 -9 1 8 -28 -16 -11 -24 -29 -3 -30 -17 10 1 6 14 -4 14 30 24 8 10 2 1 21 30 5 -6 -5 -19 -21 -15 19 -1 -3 -1 -10 -24 0 -7 -7 -24
2599 -24 -25 -10 -13 25 -7 25 -1 39 27 12 33 22 46 23 2 25 -2 -5 5 17 -17 -5 -7 -3 6 -2 -12 -2 -65 -38 -15 -15 -18 -27 -6
2634fKMNj2J4L5k0oNJ4qkrnMLl7LK6%l8K8qLk2jK2rnJ9k8K6j7K0JQj2L3lRl4N0
2676E2k4j1k1jJ6oOQmk2L1l5pk2L3jj4LJ6j8K4mj1j0L1k2J9J8k8J4j8L2m2J9J5
2711A6R%nk3J0jJ0jk1j9J6kLj2j0J8Ln%L6j0mJ1%J7j2jkoK8l2J5Nl4L1qJ9l7n
2750cJ3k7jNj7rK4j7J6LQLj7QKK5jl2J7J7Jk5J0L2j8j5L0j5j6L3k5j5J2Jm1%%
2787c4kQRoJ4K3k8J2rJk1L5j7J8J6mj6k2L7J3KkrJ6km1J6k9j2K7j2J9Oj4qJ8%
2824BpNjmJ3nkPj7JM1l2J4l8L9j9J4kj3K3Qmk2k0k2O1k4Rm4N5rpj6J6Rm9K6LL5
2863B4k3J6k7RJK4nJkk2qJ8K2n7J1NK9j9k0K3k6J5k2J7J2k3L2l9L5kJ7l0L9k5
2897@Qj2K7J6j0j6K6k0j5ppJ0J1rkl4L6pRk6J3rK7l1rK8l3JNM4jJ6Lj4k4L4J1
$$ plain form
2634 -6 -4 0 5 -7 7 42 22 16 21 35 27 25 16 11 15 18 -19 -16 10 10 -28 0 -8 -5 -27 -28 -6 -15 -20 -1 -29 -3 -20 0 1 9 -3 30 27 36 2 52
2676 52 28 17 -4 -5 11 5 11 19 15 -7 24 -11 -18 -40 -7 -8 -22 -19 -3 -21 3 -1 -12 -22 9 -13 6 24 -4 10 -8 24 -18 1 16
2711 16 25 25 20 -3 7 6 16 15 -6 -25 -9 -11 -8 -20 -30 -12 -9 -14 -14 22 12 8 19 19 36 24 23 21 15 43 11 26 31 -3 28 20 39 2 -3
2750 -3 10 -17 -18 -13 -30 -39 -15 -32 -16 -13 -5 -2 -19 -11 -9 16 15 -17 0 17 18 -7 3 35 17 2 32 17 1 34 9 -6 6 7 -34 -34 -34
2787 -34 -36 -28 -19 -25 -11 12 -16 -4 -13 -12 -33 2 -15 3 19 15 -1 -23 14 27 29 27 18 34 32 -9 7 -22 -34 -7 -19 0 6 -8 -16 2 2
2824 2 -5 0 -1 -5 8 3 1 8 -9 -8 33 1 15 -23 16 -3 11 9 -4 19 27 23 1 -19 -41 20 -4 5 -39 16 7 0 -16 0 9 -40 -14 -11 24
2863 24 1 17 -10 -1 0 24 19 20 18 -4 -12 6 28 -29 -18 -13 16 -3 -23 0 -26 -11 -33 -16 -4 -27 5 -34 1 -1 16 -14 25 0
2897 0 8 -4 23 39 29 13 39 19 4 -3 -10 0 11 2 0 -34 2 -5 4 -22 -9 -18 9 -22 -31 -3 -36 -35 -30 14 13 29 32 18 -6 28 39
2934C9j5k3J1Jk8N5k1J2Jk2J3k7Qj1j4OpoL0oJLl5M1Oj4PLoJ5lmmMj5J4kNLk9
2974a4K5ml4QPK3k2Rj2J1J6k6J0oK3j0lK8m3L8qppMJ5k8M2j5j4%k3OJ8j8pKP%
3012il4J5KPJK0k4JL1l3N4n4J7j9K6L7J2rk7K9k8Qokk0J5jj3K4l0K7k7j0J9m3
3047d4PJ4J0mLJ4j1NlJ5l2K4lJ1M2l4Rj4RkoJ5m3M1m7K5k2K0Qj0J0j7j2J1J7k5
3083a9MjK1ok7L9k2K0j2j9J3QJ0j3QLlj5J0rqJ1kj4oRK2l4lL0k8L5l0J7J%J2k0
3121a8O0k4j5pK0j6POj4J8kj1Qk0Op%J3n4K9J4kl2L5k2QJ3j1Q%Ok3J2KL4k0J3
3158A4%j1J6j3OK0k6MJ4k1Jk1K8lkj5j4%j8K8j1NM%rJ6mk5L4Jj8KL8k7J0QJ5O
3196C2j7j3J4j9J6jjJ5k5J3qJ0l4Qj9J4lJk2J7lj1J9K2J7m2N4n8K7Qk2J1Oj4K2
$$ plain form
2934 39 24 1 12 13 -15 40 19 31 32 10 23 -4 4 -7 -21 -15 -22 -28 2 -4 -3 0 -35 6 12 -2 5 8 2 17 14 10 6 10 -5 9 7 12 15 -14
2974 -14 11 7 -27 -19 -12 11 -11 -2 -14 -3 13 -13 -3 -9 14 4 1 29 -14 24 16 9 2 6 21 -7 35 20 6 6 -17 -11 7 -11 -18 -16 -9 -9
3012 -9 -43 -28 -26 -19 -18 2 -22 -21 10 -23 31 -23 -6 -25 1 38 50 41 14 43 15 23 17 15 -5 10 9 -4 20 -10 17 -10 -20 -1 -44
3047 -44 -37 -23 -13 -17 -14 0 -11 -6 -9 6 -26 -2 -5 6 48 14 23 9 18 16 10 25 -18 23 -24 1 -21 -1 7 -3 7 -10 -22 -11 6 -19
3083 -19 -15 -16 5 -1 -28 11 -11 9 -3 -22 -9 -1 9 -4 4 7 4 -11 -1 -10 -18 -7 -9 -23 -29 -20 2 -32 -35 -5 -33 2 -28 -11 -10 -10 2 -18
3121 -18 42 18 3 -4 16 0 7 13 -1 17 15 4 12 -8 -2 -9 -9 4 -50 -21 -7 -9 -41 -6 -28 -20 -7 -18 -10 -10 -4 -27 -15 -13 21 1 14
3158 14 14 3 19 6 12 32 6 10 24 3 4 -17 11 8 6 -9 -23 -23 -41 -13 -24 -19 -15 -15 -24 -8 -12 -37 -3 -2 -20 -18 20 -7 3 11 26 32
3196 32 15 2 16 -3 13 12 11 26 1 14 6 16 -18 -10 -29 -15 -18 -17 -39 -22 -25 -36 -17 5 22 -20 34 -24 3 11 -11 0 6 -8 14
3231A4j9mj8J9rj3J1j6NJ6MJ5k3J2PL0l6K0k1RJ3k2OK0j7lnJ0lpj0pJ1O%j7L2
3268A0j8N%mK2l5Lj3J7KJ6j8K2mRNK8k4%j7nJ3mk5N6l4Ql4K1Oj7Jpj7J2oNk5L0
3307a6%Nj1npJ7RqJ2K2k5J8J8lk7J2JOJ7k1Qj5J1k5K9J7m2r%kJ8j2k4J6j8J5J1
3344hj2k7J3K1J8Rl2K2lQkqJ2k4K8jlj3j4RJ2rJ3Moqk0lK8j3MoJ7orqK8Lrj2q
3385a5K7jl0jL0mj8j0RnJ8oj5J2l0M0j2pK1l8OJ9J2Mlj1J2oL1l0NmJ6rj3J6j1
3422aJ1k8K0j4KJ1j5JJ3mk6K8k2rMK1L4l8J0K2j7j7L5l1RnjOPqLlK7oj1J9%k4
3460COOj3J9l8K7ok1jK1pNj0J7Jj2OmqJ4nk0L5k9J3J1k9L1J6j3mRj2Kmj7Jj9K0
3499ijJ7k5MK2k8JK5oqJ8Nk7J8Qj2K7m5L0jJ0l2oK6jl3qPMj7K2%J8jj0jK5Jj5
$$ plain form
3231 14 -5 -9 -27 -8 -17 -30 -19 -35 -30 -14 -10 5 -18 -6 1 31 -5 15 -6 3 16 -6 0 20 3 0 -5 5 2 -5 -15 -22 -11 -5 -5 -22 10
3268 10 -8 -3 -3 -7 15 -20 -17 -30 -13 -11 5 -13 9 5 14 19 47 23 23 6 1 14 10 -15 41 7 15 -19 2 8 -9 -8 -15 -32 -20 -26 -21 -46 -16
3307 -16 -16 -11 -22 -27 -34 -17 -8 -16 -4 18 -7 11 29 26 -1 11 12 18 35 14 22 7 18 -7 22 39 -3 -12 -12 -14 4 -8 -32 -16 -34 -19 -8
3344 -8 -20 -47 -34 -13 5 14 -18 4 1 9 7 -1 11 -13 15 14 11 -2 -16 -7 5 -4 9 13 7 -1 -21 -24 4 -9 -5 -11 6 0 -9 -17 11 14 5 -7 -15
3385 -15 12 11 -19 -20 10 6 -12 -22 -13 -18 0 -6 -21 -9 -39 1 -11 -18 3 -35 -29 -10 2 6 3 -8 4 -2 29 -1 4 0 16 7 -6 10 -1
3422 -1 10 -18 2 -12 -10 1 -14 -13 0 -4 -30 -2 -24 -33 -29 -8 26 -12 -2 20 3 -14 21 -10 -1 -6 -7 -1 6 -2 1 -2 25 19 8 27 27 3
3460 3 9 15 2 21 -17 10 4 -17 -18 3 -4 1 -9 8 9 -3 3 -1 -9 5 0 -20 15 -14 -1 10 -19 12 28 15 11 20 8 10 6 -11 -10 -29 -9
3499 -9 -10 7 -18 -14 8 -20 -19 6 0 -8 10 15 -12 6 14 2 29 -16 14 13 23 -9 -15 11 10 -23 -31 -24 -20 -37 -15 -15 3 2 -8 -9 16 17 2
3538BoJ9k8J9J4POj2K9m9K7k9j9L0k0lMJ3ll0J4OL3m2OJ9k5L6qj0rMJ6l1K4J0
3574A4LJ9o9N2mK3j8KJ6j8J3k3l2L9j3j7QJ7k8MJJ5J2m5QJ1Lj5qpJ4L1nPj3LR
3611IlOpj1OJJ9k1LoJ3k9L6j9K3l1J6lj8PK2j2j0J3jJJ7j0nL2k6l4L0k1JK2l0
3648b0J9k7K5k1KK0l4K1J9Jj2j7J4K4k8j6J3J0oJ4j4O0k2m6L3j4J6Lk3K2K6j9
3680B3k4J8%Mk3K0k0k2%rJ0PNj5%J9MrK8k3K1J2l9K8kk1j0K9Nj3K3l2L7J0n0K4
3716A5k1J8j6Ppk3M1m3J7k0J3K7j3Ok8J1J8k6jL0oLolK4l9K8Ok4L6pk6K2Jj9P
3752BmJ3j3%PJOj6pL0m5L7lj0j5J1j0QOJ1j4Lj3Nj1J7oK6l7K4l0kL1l7K9%KNJ
3791BqL7m5qJ9k3PPJ8J8m8L3KOpmj4J5NkJm0L2j4mJ4K3n1J3Rj3JmJ2j7J8JJ3K3
$$ plain form
3538 2 -4 15 -13 6 20 27 33 21 50 1 28 -1 -20 10 -10 -13 -9 4 1 -29 -15 -9 24 -18 -12 7 -18 18 10 0 -9 -5 11 -20 4 14
3574 14 17 36 -33 19 15 38 20 22 38 20 33 10 -22 17 4 -13 -5 12 -16 -12 -11 4 16 -29 -21 -10 -7 -22 -30 -37 -23 8 3 10 -3 0 9
3611 9 6 12 5 -6 0 1 20 -1 2 -4 9 -20 16 -3 20 -11 5 2 -16 -9 13 1 -9 4 3 4 21 11 6 38 12 -22 8 -13 -12 10 -20
3648 -20 -1 -28 -3 -24 -22 -2 -36 -15 4 5 -7 -24 -10 14 -14 -30 -17 -7 -13 1 -13 47 25 -21 12 -2 14 17 -6 16 42 23
3680 23 -1 17 17 21 -2 18 -2 -24 -24 -33 -23 -16 -11 -26 -26 -7 -3 -12 16 -7 14 26 -13 15 13 -8 -18 11 16 3 26 -6 31 41 -9 15
3716 15 -6 12 -4 3 -4 -27 14 -29 -12 -32 -19 8 -5 1 -27 -16 2 -24 -25 5 -1 2 -4 -7 17 -22 6 12 -12 24 17 -9 13 14 -5 2
3752 2 -2 11 -2 -2 5 6 12 -4 -11 19 -26 11 8 -2 -17 -6 -16 -8 -2 9 -5 -2 -15 -10 -21 -4 -10 16 -21 3 -27 -29 2 -35 -6 -6 -4 1 2
3791 2 -6 31 -14 -22 -3 -26 -19 -12 6 24 -24 9 11 17 10 6 -8 7 12 10 11 -29 3 -11 -15 -1 22 -29 -16 -7 -20 -19 -23 -11 -28 -10 -9 4 27
3830B7k1%qJJ0j2K5l5J6kK2j4k9K3LLqkj1K4k7Rj4K1Nj8j1jR%JPnL5m6J5L0k1
3868Aj3J2Nk0K8l0K5mJ1k4J7j3%LJ7mj0K2j8J2j3Mqj0RpqJ8jk9M8j5j4j4K1j6
3904a8J8Ll4K8%Oj7MK5l5J1K0Ll8J7LNmJ2k1oK2ooJ0MmM2k7k7J1J6l%j8OOJ4n0
3943b8J9L0qk7rLK5j9oQnJ0Lj%j5kL1mkKPL5j9k1P%qQJ5j8J5pl3J5J5K1m1pQJ2
3984IJk7NrKQrK5l3J5J3mJ8l0K2Pk5K8Ok5QMj2K8mk8jJK1k1K0j3j6LK7mj8ooN
4024a5PJ6J3k7Lj2NPL9j9j9nkK6k1j0%RrKJ3j3Kj4L3k0K0Mj1J1m3L2LPj6k2L3
4061Gk1jJ5lK2l0J5Jj0lJJ1k3j4L1K3m0jK1m8L1qqJ8LK2k0k1L0K1j4Qkkk9M0k3
4098aJ6k4K1l6L7qj4L8l9J2pRl4J0KNj6qK8lj0jmOnN3j6j9J6J4lj4j5J3J6Ql6
$$ plain form
3830 27 6 6 -2 -1 9 -3 22 -13 3 1 23 9 -20 3 6 9 1 -1 -12 12 -15 -6 -20 1 6 -12 -23 -24 -15 -15 -14 -7 -12 23 -23 -8 22 1
3868 1 -12 0 5 -15 13 -17 8 4 15 -9 8 -5 -5 -2 15 11 1 23 5 17 4 8 0 -10 -1 -8 -16 2 1 -28 20 5 -9 -23 -2 -18
3904 -18 0 3 -31 -3 -3 3 -14 -10 15 -20 -9 11 14 -24 -7 -4 1 -3 9 -12 -18 4 -2 -8 2 6 2 44 17 -10 1 17 14 14 -4 2 8 22 -28
3943 -28 -9 21 13 -14 -23 -20 5 -14 -20 -12 -17 -7 -4 -5 -5 -20 -22 9 5 3 5 12 47 28 7 14 14 6 14 29 11 26 19 -14 1 16 37 -4 -11 -3 9
3984 9 10 -17 -12 -21 -19 -11 -20 5 -28 -13 0 -4 14 -16 6 13 -12 16 22 -3 5 9 -3 25 21 -7 -8 -7 14 -7 13 0 -16 -13 14 10 -8 -14 -20 -15
4024 -15 -8 8 21 -6 -3 -15 -10 -3 36 17 -2 -7 -9 17 -4 -14 -14 -5 -14 -12 1 -12 -10 -24 9 -11 9 13 2 13 -30 2 5 12 -4 -26 7
4061 7 -14 -15 0 -3 19 -11 4 5 -5 -8 -7 4 -19 -33 -2 21 -19 -20 1 -47 -16 -24 -32 -14 -11 11 -9 -30 0 21 7 15 13 11 -18 22 -1
4098 -1 15 -9 12 -24 13 5 -9 29 -10 2 -5 4 -30 -20 -18 -13 -29 -37 -9 -12 -22 -23 -27 -21 -26 27 11 -8 8 22 19 5 -10 3 19 27 -9
4135iJ8k5JJ8J8pk9jK5j2rJpK8j4j4K9jl0P%J0jNJ1Kj0m0N1m2J4J7jj9J1qlJ1
4173eOK%pK1rj4j5K4k0K2%Jk5j1N3j6J6J2l2JJ1k1%m%J2l4OL0j1Lj2j9K3lRj8
4211b4L5olJQj6K7j8K0ojLpJk8K0J5J8j3k7M3l1npk0K7om%jj5Ol4K0NqK7j2J9
4250Cm2L7j3L3j2lMk7J9J2Qj0j0RK5k1J0j7l2K3QJ1j3j0lrkMOMrJ2oNJJ8j7J6
4288A2Mmk8K3pJ4mj8jJoJ9Qk3rn%K0J1k8K0k6K7l9N6j4j7J9pJ0Lk6K5k3K8k5j4
4325b4JK7j2nRpmj1K0j5J3qJ7K4l5j3K1lK8rRj9jJKj8K1p%K4k9k3L6%kl0J0J1
4363aj3mK8k1J9J6n8K5Jk2J8J0rJ6ljj4K3K6j7lj5J2kmJ5klj5L7k0rK3l0oOk1
4400a8jK1l4J7J4nLMlJ6oJ0j8J5qnjmnK4J7j1j5jj9K2J4j6oJk0j1L9nOj2K9k6
$$ plain form
4135 -9 9 -16 -15 3 21 14 -15 -16 9 -3 -12 -11 -18 10 -4 -18 11 10 -20 -13 -13 -3 -4 1 12 14 4 -36 15 -27 -13 4 3 -16 -5 -13 -16 -5
4173 -5 1 3 3 -4 17 8 -6 -21 3 -17 5 5 6 -19 -30 23 7 23 35 3 4 15 -6 -6 -10 -10 2 -32 -26 4 -7 -4 -16 -35 -12 -15 -6 -24
4211 -24 11 5 2 3 11 -5 22 4 24 18 17 20 13 14 -14 6 21 39 26 -1 42 11 6 -1 -21 6 0 -4 -4 -5 -20 -14 -48 -28 -23 -31 -4 -16 3
4250 3 -39 -2 -15 18 6 3 7 -20 -1 11 19 9 -1 8 33 12 22 5 -27 -4 4 15 2 -8 -11 -20 -22 -18 -12 -8 -17 -5 -11 -6 -5 13 -4 12
4288 12 16 12 -16 7 0 14 10 -8 -9 -8 -14 5 13 -10 -19 -24 -24 -4 7 -21 -1 -27 0 -39 17 3 -14 5 -2 8 11 -15 10 -13 15 -10 -24
4325 -24 -23 4 -8 -13 -4 -11 -15 -26 -6 -21 -8 -16 1 25 -10 -23 -2 -5 23 14 23 4 3 4 6 -12 9 2 2 26 -3 -26 10 10 8 -22 -12 -1
4363 -1 -14 -18 10 -11 8 24 -34 -9 -8 -30 -12 -2 -11 5 2 1 -13 10 36 19 16 1 13 11 7 22 20 17 2 39 19 10 33 3 -3 3 -18
4400 -18 -19 2 -32 -15 -1 -6 -3 1 -2 14 8 18 0 15 7 2 1 -3 -8 16 33 22 7 6 -13 9 23 7 1 2 -18 -29 10 5 11 -1 28 2
4438Blj4K0qPNj0JJ1kJ0rk1J5pL0m0OpjLK3Oj3l2J4J7ojJ4j0k1K0k8L6J4j4kj9
4477a4OJ8J7rrQqK5m0J7l1J6K1K5n9j6K4k0N2l3Mk6L5J6k7j7pRL2qk6J3mK6j7
4512glL2m0K6NK4k7%K5l8RLOrk1L5k3K7k3mj3M5k2k6k3J7kJ8K9l3%JM0n1K6LK
4549HNl4RJ5L7m7RJ0Lj0Qk5RMk4N4k9pJL3j7k9LL0j0j0%MpJ1PJl2J7K1l1Oj5N
4588a7QJ9j4j7LLMK0j7K9nk5J5lj2lN2m9NkJ8Rj7K9l9K0kPoj7qPJ3l5PJ3l4M7
4626Fk2J6l1JK4lK0j3l0K2kJ3J2j1NRpOj4L6j7j0J7l8K4Oj0lK5k7%K4k7J6m1J4
4662a0J2jlj7K1Lj3j2rL0j9kJ6J2k5K9k1M%K0oPk4K4j7lJJ5J2l0Rj7K0k1J6k7
4698b6M3j3k4L1m7J8MJ7qKq%J4jk6K8j1Nk6K6k8K1rJ7KLj2QPn9N5lLj5J7LklJ9
$$ plain form
4438 2 -1 -15 5 -3 4 9 -1 0 11 9 19 10 -11 4 -3 27 -13 -7 -14 -15 -12 11 17 4 -28 -14 3 -3 -4 10 0 -21 -1 -29 7 21 7 5 -14
4477 -14 -8 10 27 18 9 17 9 34 -6 11 -20 -4 17 42 -17 -33 -9 -29 23 -10 -6 -32 3 19 -8 -25 -32 -23 9 1 -25 -12 -16 10 -7
4512 -7 -10 22 -18 8 13 37 10 10 35 -3 6 9 15 6 -15 20 -3 24 1 -3 -16 29 7 -19 -42 -25 -27 -9 20 -13 -13 -12 28 -23 3 6 8
4549 8 13 -21 -12 3 40 -7 2 12 15 5 13 -12 -3 1 -23 31 2 -5 -4 29 12 -17 -14 16 6 -4 -4 0 -7 4 11 12 -20 -3 18 -13 -7 -22 -17
4588 -17 -9 10 -4 -21 -18 -15 -11 9 -8 21 16 -9 6 3 -9 -12 40 -9 -4 -6 12 21 4 33 -6 14 12 19 13 -4 -12 -5 8 -27 -20 -7 -41 6
4626 6 -16 0 -31 -30 -6 -9 11 -2 -32 -10 -12 1 13 2 7 16 9 15 1 37 20 10 27 -11 13 19 9 6 31 4 4 28 1 17 -24 -10
4662 -10 2 1 -2 -19 2 5 -8 -20 -29 1 -18 -20 -4 8 -17 12 -9 -5 -5 15 9 16 -8 16 -1 -4 -3 12 24 -6 3 -14 6 -15 1 -26
4698 -26 17 4 -20 11 -36 -18 -14 3 -5 -3 -11 -11 3 2 -24 4 -7 -2 -28 -2 -30 -9 -18 -1 1 4 -8 0 7 -52 3 0 3 -12 5 8 6 3 22
4737B2j0Mk8J3orJ3k0K0kK6Nj5k3Rj5K3k4j3K2Nk9lK5J6%J7m0QK2j4J9%k1MMl
4774B%J1k6NnRL8m0L1Lok4j%lkNj0J1pMj0J7j6mJj3K2J3J8k3jK8k7J9j8MpJ4j7
4814erO%J2mjj5OL1k7j0lJ8jjlj3L0l5L3l5L0PNk2j5J3j2L0k1Pj8K2J1k9L1j8
4851eMPkj2j2J3j4M5j4oj1oJ5K1l5K6Lk5PJ1l5J1J8oj8oRL3j4jqk5NJ2J6pJ1j5
4889a0J0j1LK3j0j1L6m5J3jqL7l9M2k6KjJ8k6J7Mjlj4qkjK9m1mK0j3K6k3rL0q
4926e%j0qJ3ROk4J6nlK0k6K7k3j1L3opK6k5K8n8K1K3j5J9k8kJ2jJ8k2j5LKlK8
4963GrMJJOm0J3lJ8j4J3J0j1J4k2Mlj6K1J1k8LK2J0j9j1J3k6J7J5M2l7j4L0oJ2
4999B8m1K6J4j6Nj1J0l3M4k4pNl6L2k4J4QMm9M4Mj2OJ6j0OlJ3k3R%J1%PLKj6j4
$$ plain form
4737 22 12 16 -12 1 -5 -14 -1 -21 -1 -3 23 28 13 -10 -1 -16 7 -17 -30 -8 -3 -32 -35 -10 6 6 23 -17 -9 13 -1 18 18 -3 1 5 2
4774 2 2 13 -13 -8 -13 -4 34 -6 25 28 22 -2 -3 -3 -6 -8 -3 -13 -2 -9 -5 -15 2 -14 -18 -17 -30 -8 5 23 0 -1 27 0 19 1 5 -2 12 -5
4814 -5 -14 -8 -8 4 0 -1 -16 -10 21 -6 -16 -19 -1 -2 -3 -6 -19 11 -24 9 -26 4 11 16 -6 -21 -8 -20 10 -11 -4 -22 0 11 -18 13 -5
4851 -5 -1 6 4 -8 -20 -7 -21 24 10 4 -7 -13 2 23 -12 14 17 -8 -1 10 -25 -14 4 -2 -20 -26 -17 16 2 1 -7 -32 -27 -15 1 -6 5 -10
4889 -10 0 -11 -8 15 5 -6 30 -15 -2 -3 -11 26 -13 29 3 5 4 22 -4 13 17 16 13 -1 -9 -11 -12 17 -24 -28 -8 -21 5 -18 -27 3 -5
4926 -5 -5 -15 -23 -10 -1 5 -19 -3 -8 -11 9 -17 10 -13 -24 9 3 -4 22 -3 25 -33 -12 11 -4 15 -13 -15 -3 -4 14 -8 -23 -20 -18 -21 7
4963 7 -2 2 3 4 10 -30 -17 -20 -2 -16 -3 7 -4 10 -12 -8 -11 -27 -6 5 -23 -20 2 12 -7 -18 -5 -31 -14 1 43 6 -8 22 16 28
4999 28 -13 13 27 11 16 5 15 -18 26 2 -5 0 -36 -4 -28 -14 -6 -2 -51 -7 -3 -15 -9 7 -3 3 0 13 -10 -1 -1 10 10 17 20 22 6 -8
5037hRK0k1J4k7rL0k0K2J7k0klj1m2M7%l2K2K9j4j0K1j7K3NNj9k1K7j2j0PKnL4
5073C1m1oL2l3K5%J5j1k1J0K1Ml8K8oJ5l3J1j4J3j0J4j3K8j3k5L4j8j4MJ3pQL
5107Fok0J1K9j7%mrj3M3Ol2K4Ml4J0QKkrJ6K5k6j4k0MK2j6MJ2j9K4pk1J6l%J1
5145ENj6J5m8N1k5qL1k6L5k1JJ0kJK0qj1Ok3J1MJ8l3J5j5lj4L7l1K5kpj0Pk2R
5182a9oLPQj3J2j3PJ4k5K7qKJ9jj6MJ9JLl5J1p%J0j3L8m0J6Qj2J9KpLk3nkPj8
5222b3K4j1j2K5mj0MJ1j0J7j4poQJ5j4j2MRK1j1j2Pk3M3lnj9K0Oj5Pj6jJ2J1j
5259A5J4j9jm6L2K5l1MRk4K0J2RqMk2J3J2k4J3j7QoK6k2NMJ3l1J0K4Kk0oJ4j9
5295hQJ5Nk5K0l3J0j7K5Qj5%L0j3m5J8LJ1Mj4L0k8J8rnK4Lk4J8opJ9jl5J6K7k3
$$ plain form
5037 -8 1 21 0 14 -13 -22 8 -12 10 27 7 5 2 -9 -51 -4 -4 -36 -14 15 1 -9 12 -5 18 23 28 9 -12 15 3 -7 0 2 -3 31
5073 31 -10 -16 16 -17 8 8 23 12 -9 1 22 26 -12 16 10 25 -8 3 -11 2 -8 6 -7 21 8 -17 17 -1 -15 -11 2 -5 3 6
5107 6 0 -20 -9 20 3 3 -1 -10 -23 20 26 -6 18 22 -12 -2 6 8 6 -3 13 38 12 -2 -22 -18 4 -12 -8 4 -15 9 2 -19 -3 -6 -6 5
5145 5 10 -6 9 -39 12 -13 -21 10 -16 19 -2 -1 9 7 8 28 20 9 15 -8 3 7 25 -8 7 -8 -11 -25 12 -19 6 4 -3 -13 -6 -28 -19
5182 -19 -25 -22 -15 -7 -20 -8 -21 -14 0 -25 2 -6 -4 15 14 -2 2 21 22 25 -10 1 -6 -6 4 -9 29 -11 5 13 1 20 22 15 18 -5 -10 -12 -5 -23
5222 -23 1 -10 -22 3 -1 -11 -7 4 -6 11 -3 -10 -16 -8 7 -7 -19 -15 -6 15 4 -8 -1 -24 19 16 11 -8 12 18 3 10 -6 -7 5 16 15
5259 15 29 10 9 -37 -5 20 -11 -7 2 -22 -2 10 19 11 15 -7 6 18 -6 7 -10 -2 -8 18 -4 1 5 18 -13 -3 21 23 3 -3 11 -8
5295 -8 0 15 20 -5 15 -18 -8 -25 0 8 -7 -7 23 10 -35 -17 -14 -3 1 -13 17 -11 7 -2 -7 17 20 -4 14 8 1 20 19 -16 0 27 4
5332DnJRj2Rplj9K3j0loJ8K2j6Qk5J0j4RK2j0Pj5k5J7K7noJ0qk6J7mJ7J9k9pL1
5371B5j8j5PNOj8J4nJ2k0j1Kj5K6J1k5PPj4L1k1J2m5J5LLJ3Kj0kj4qN3j9m%J4
5408Dl3L7nOJ0Mj1Rmk6RJ7l0K8j8MJ%K5l1jj1J4j9NJ7k1pQrkJ8j2K3%kj0L0m4
5447b7MRqJ0L0oKKn0L9kJL7k4J4k0kOmj3JJRj8k4L2l8K7KJ0j6J7k0rM0k9pK0n
5486iJ5k4J0Kkk4M1kj1J%RMj8JOmOKkK9j2j0rKj2J9nRj9J0j7kL0j5pj3j4J4J9
5526bk7K8jojQl0oK3Qk4N9k6j0J8k0K7l8K3PJ5l0mLjJJ7j1j9K1qJ9l4NJ4jk3K4
5564bj8K0k8L3l0mQJ9nmJ6k3L8k0Nj4jlK0j0K4j4J3k8%J2oK6k4j0M5j9ok7J1r
5600a5J2nlK3pk0MNl4L6Pk8L4j2j3J1Pj4PqJ3%J0KrrK6j5omK4J8j9Pk8K6k7Kl
$$ plain form
5332 4 -1 0 9 -3 6 -1 -4 -23 0 -10 -13 -19 -1 21 5 13 -12 -2 -16 -7 15 5 12 -3 -28 -11 16 11 5 15 7 -19 -2 -6 11 30 1 -6 25
5371 25 7 -8 -1 4 10 -8 6 1 13 -7 -18 -16 -31 -5 6 -19 -12 -5 -19 12 -9 3 -42 -27 -24 -21 -8 -6 -16 -18 -32 -40 13 -6 -10 -10 4
5408 4 -29 8 3 9 19 23 12 21 17 -9 0 17 -13 15 -3 1 2 2 27 -4 -5 -16 -2 -21 -16 1 -20 -27 -19 -28 -30 -12 -24 -1 -1 -3 -13 17 -27
5447 -27 -23 -14 -22 -12 18 12 14 16 -34 5 3 4 41 17 31 11 9 15 11 -2 -1 0 9 -9 -33 -1 -39 -12 -10 0 -16 1 -19 -28 12 -17 -24 -4 -9
5486 -9 6 -18 -8 -6 -8 -32 9 7 -4 -3 -3 6 10 -8 -7 -1 -5 1 3 1 30 18 8 -1 1 -11 8 3 12 -7 3 -14 -16 14 -1 -8 -21 -35 -21 -2
5526 -2 -29 -1 -2 -8 -9 -1 -31 -37 -14 -6 -30 29 3 -7 11 -9 18 -20 3 10 25 -5 -9 -6 -7 -6 11 0 -19 2 -6 13 -21 -16 -2 -3 -26 -2
5564 -2 -20 0 -28 5 -25 -29 -21 -2 -7 -11 5 -18 20 0 5 -9 -10 -13 7 -3 21 7 20 -8 -8 4 -2 24 0 -10 35 16 10 -17 -6 -15
5600 -15 -3 -8 -11 12 5 -15 -11 -6 -40 -4 3 -25 9 -3 -16 -5 2 -12 -5 -13 0 0 10 12 3 -6 20 5 -1 -5 19 37 18 25 -3 23 -4 -2 -5
5639eK8j0J5k1k7L1%j9qJ7p%nQj1MNmml2J9K9OKj9K6n1O0j8J5k4NJ6j4Pj0J1m
5677A1j6K2mj7k2L0J6%n1M0l3MK5nj6J9pkrj2L8j8J1j4rK4J2j7K9l2K6m1M7l2
5711cJ8l7L3l1J9LLj0PKL8m4J3m6L4MqJ7k0K0k0OpmJ3j4JL3k8L1k6j5O4o4J3r
5747a4J0J7lrknL3j0Ql8K8k5L1j5%j3L2j6nLmqJ5qj2omLRk3J0J0%K0qj3omK1n
5787fJ3j2mj9J1RJ1klPlJ1j6njRM1l5j8P2m5k3M0j6m0L2j8K3lqll2J5nK2k3L2
5824Hl7K6Rk9KJ0K6J5rm2L5JqNk0PK9j2K1j7l7OjJ5J6k2QpK8n1K9JKp%Oj3J5k0
5863a2OJj6j3K6k0J8j8J4mJ7J1pj4K3JJ5j3j6Mj5K4MJ1Jk1j9%J7oLj3RrJ6nJ2
5900A2j2j7OLKj4ORKj4J3Kk8K5j8J3k7M3j6j3M2j2jpJ4Mjnk3J9k0K0%NJ0nn3L
$$ plain form
5639 -5 23 13 28 7 -20 11 11 -8 -16 1 -6 -6 -11 -3 -14 -10 -5 -9 -13 -45 -26 3 9 11 -8 18 -33 27 9 24 0 5 21 7 14 4 15 11
5677 11 -5 17 13 -4 -26 4 20 20 -31 9 -24 -20 5 0 -16 3 -4 -6 -15 -27 11 -7 4 -10 -19 5 17 0 29 -3 23 -18 29 -3
5711 -3 15 -22 11 -20 -1 2 5 -5 2 4 42 -2 11 -35 -1 3 -5 12 -8 12 -8 -2 -9 -13 0 -14 -13 20 -8 23 -3 -18 46 -18 -5 -14
5747 -14 -4 13 10 1 -1 -6 27 17 25 -13 15 -10 21 6 6 -7 25 9 4 7 3 -5 10 2 -10 -16 -20 -17 -8 -31 -21 -11 -11 9 1 -12 -18 -22 -1 -6
5787 -6 7 -5 -9 -28 -17 -8 3 1 -2 5 2 13 -3 -8 -9 0 41 6 -12 60 15 -8 32 16 -24 8 -10 13 10 2 -1 -33 -18 -23 -1 -24 8
5824 8 -29 -3 6 -23 -21 -11 15 30 21 -21 14 15 7 12 -8 -1 28 16 37 20 -17 -11 -12 3 19 -3 5 -2 26 -25 4 5 7 0 0 6 -7 8 -12
5863 -12 -6 -5 -21 -34 -8 -28 -10 -28 -14 -18 -1 10 3 -11 12 13 28 15 -1 3 -12 12 16 27 28 7 -12 -12 5 -1 2 -11 -2 -11 5 0 12
5900 12 0 -17 -11 -8 -6 -20 -14 -5 -3 -17 -4 -2 -30 -5 -23 -10 -37 6 -10 -23 19 7 6 -1 13 17 16 11 -12 7 -13 7 7 12 22 17 -36 -33
5938c3L0K3j8RMJ4k6Nl7K0J3J0l2lL4l1j6J9NjNjJ2ppJ8mpJ1JmK5j7J5j5nnqM
5977@j5K5j8K6k0k9K4K1l8%M3l3J0lL5m0%ROMk1K8pqk4L1k9K4j4KL3j2j6jJ9n
6013GJ4kloj3J2mk7pJ3K5j2K1m2K8j3J9l4J1j4K1k2N4m9L4k0Pj4J2J5rj0J0L2
6047C4m9K4mMJj4j0K1rJ0JoqLj5RJ7J9m3J6jMj3j3Rj8K1L6o3L2j0j4K0k7NK1l
6084a3M%%rL3kn6O1k6j0L4kj7L7n9M5Jlj7J6orK2l9L4n0J9J9k7L0k2qJ4j0LOj9
6121b6LK9j8pJ5Pk0KJ0mj4L1qqJ6qk1M1l2RJ9oj6j1L3l8J2J8j7MPj1lK8k5j2J3
6158hj3mJ4j0mJ8mlK5k3Oj0mKlJ9LPj9j7J7J%MmQqJ2J0q%j0LL5m2L0l5J3j0QJ9
6199A5j3j3J0k6K7lj4mL1m1PlK1j5rJ7l1L5K9l6K4k5J9j1J7nkJ1k1L3j7MqJ0l6
$$ plain form
5938 -33 -3 20 2 11 15 29 3 8 -29 -9 4 14 -18 -21 13 -18 -34 -15 -10 -11 -6 -7 5 -2 -9 9 5 -2 9 10 6 31 14 29 14 9 4 -4 0
5977 0 -15 10 -8 18 -2 -31 -7 14 -24 -24 19 -14 -4 -7 28 -12 -12 -3 3 7 -14 14 7 -1 -25 6 -23 1 -13 -11 22 10 -6 -7 12 7
6013 7 21 19 16 10 -3 9 5 -22 -29 -16 9 -3 18 -24 4 -9 10 -24 -13 -27 -6 -28 26 -23 11 -9 -2 -16 -4 11 2 -8 2 34
6047 34 -15 9 5 9 10 -4 -14 7 -2 8 9 3 -5 -2 -17 -8 9 28 -15 1 0 4 -9 -22 -13 -31 -10 26 -37 -5 -15 -29 -9 -36 -31 -10 -13
6084 -13 -9 -9 -9 -18 15 13 -43 18 -8 -18 16 14 -3 34 -25 20 21 18 1 17 11 2 24 -15 19 -31 -12 7 -20 10 -12 -20 -6 -16 -13 -7 -26
6121 -26 -23 6 -12 -19 -4 3 -17 -15 -5 -9 -23 8 0 -8 8 0 -21 20 -12 -3 16 10 -6 -17 16 -22 -10 8 -9 -5 2 -9 -12 16 -9 -21 -8
6158 -8 -21 -25 -11 -21 -25 -7 -11 -14 11 -12 -6 -16 -20 -18 -21 -2 1 8 -11 -28 -11 -10 -10 -6 -10 -2 -10 2 12 4 4 -6 -3 32 -10 20 -15 -2 -12 -4 15
6199 15 2 -11 -1 -27 0 -3 -17 -21 10 -31 -24 -27 -6 -21 -30 -13 -44 -9 20 -16 8 -17 2 -9 8 3 1 12 -9 24 7 11 3 13 -23
6234b3K2qK4k0j9MRlRPm8J2K5lnJj2M5n7N3l5L2k8K3Oj0qqJ4K1k8mRK4rlMRpJ3
6274B8j0J3mk0opK4j9J8k9J3mJ1l0K4qOjJ4lrj4J4j4K6k8J2J1pmMnK4nk7pML5
6312B0m7J7L4j7j3J4j4l4L2LPLjnJ1Kj8Ol2K8k4QK1j4J3j9PjK1J4Kl9M3k6J1M
6348A7%J3l5k1K4j1L9ok8jK2l0K4k0J1kNQj6K8m2J7Pj7k5K0JJ9J4k8J1Rk2Rk5
6383c1N6k7K2mkl7M7k1J2loj9L0J0nk2j6J2J4oQMj6l3O4k8Lk1J8K1k3J6n5L7j8
6418a9lJ3J0qQkqNJ7l2K4k6L8k1jJ8qj7RlJ4k0J6LLlJ1j9k0L4k3J3j7K1j7RJ3
6455A2Kl7M1%j1k6nJ6j4K7k7mK2j1j1J1L0rj5nrK1J5j3J7j1J7k8L0k0lJ6l3K0
6489Ej7mK3j0J5lnj2Qj2J7j7j1QJ9k2NJkQOOj5J5nk6L9j0Jk9P5l6kkL%j3KlNm
$$ plain form
6234 -23 -1 -9 15 -5 -24 -20 -11 -14 -5 2 -46 -34 -9 -12 -17 -16 -28 17 -40 13 -22 10 -18 5 11 1 -7 -15 -1 20 -8 -12 -3 21 12 9 13 22 15 28
6274 28 18 31 27 7 1 -6 18 -1 17 -12 1 -3 8 -22 2 -6 0 -1 13 10 1 -13 1 -13 13 -15 -3 8 1 -3 1 -4 20 15 -12 -19 -15 20
6312 20 -27 -10 24 7 -6 8 -6 -40 -8 -5 2 5 4 -1 10 12 -6 0 -32 -4 -28 -20 1 -13 0 -19 -12 -13 8 22 24 -15 28 2 13 17
6348 17 17 30 -5 -26 -2 -13 26 20 -8 -9 13 -17 7 -13 -2 -4 1 9 -7 21 -21 -4 3 -14 -39 -19 -18 1 15 -13 -2 7 -15 -6 -31
6383 -31 25 -2 20 16 14 -23 24 3 15 12 6 -13 17 27 22 0 -16 -4 10 4 12 16 0 -33 31 3 6 -15 3 24 1 17 -38 -1 -19
6418 -19 -22 -9 1 -7 1 -1 -9 -4 13 -19 5 -21 17 -4 -5 13 5 -12 -3 -6 8 -12 4 7 10 7 18 -1 -21 13 -10 3 -14 7 -10 -1 12
6455 12 14 -23 18 18 7 -19 -24 -8 -22 5 -22 -26 -4 -15 -26 -15 15 6 -9 -14 -23 -2 13 0 17 6 23 -5 25 5 2 18 -15 5
6489 5 -12 -16 7 -3 12 9 4 -8 0 -12 5 -12 -23 -15 4 -18 -13 -12 -14 -6 0 6 -9 6 1 -25 14 4 5 -24 51 15 13 11 14 14 1 3 0 5 1
6530AJ1k1jRj7M1kk3QJ3j1j2k0kL0npj2j2M3l2K0Kk6K4NONk6MojK9k1PJ0j9qJ2
6569dj3J0qK2k5K6J4k3mJ1j2J6k1Qj1J7j1k3M8ko5K1L2j3k0J5QJ8m1J1jJ0%K1
6603A1j2j3J7Q%j4J7%l6QL7K5n2J6Nl3K4k6%%K6j1Oj4K0l0J6k6K1j1J9k3RJ5j3
6638a4L4k3K7j6J1lJ0j7oKqJ7jLlk2K8k6QJ5l3K8nLJ4k5j6J3j9L%J0j0J7J0J8
6674B4Mm9JJ9lkJ2j9Rj9M4k0KJ5jj6jMmJ0Pl4J2J6pPJ0%j6K7kl8M1k8j1K4oj6
6712dJJ8k1MmJ2OQj8L6k1rj9lPj5L4lj9jK1j8J1LrROk8NK7nklplJ3j1%%j3LL2
6754B0l5j4K1j6%K0mOK5m6M0k7%J1K1k3jJ2j4J2rRlj8K5Pk6K2k2L2l6L1kj8nl
6790hKJ9l0rK4kNj8J6l2L8Km1J4K3PNl5K5k1K2K0k5loK8k4NJ2k3OK3l2J0J2j3
$$ plain form
6530 1 12 -9 -10 -1 -18 23 21 -2 6 19 8 -4 -24 -26 4 -1 -8 -20 -32 11 -21 -1 1 -25 -1 4 10 15 -11 -7 -13 -14 15 -6 1 11 -8 -16 -4
6569 -4 -17 -7 -15 7 -18 8 22 -1 -5 6 -6 10 -11 -3 -14 3 -8 -31 17 15 -50 -29 3 -10 -30 -15 -7 11 -30 -19 -20 -10 -10 11
6603 11 -1 -14 3 11 11 -3 14 14 -22 -14 23 48 -4 12 17 -16 8 -18 -18 -18 8 -3 3 -11 9 -21 -5 -31 -10 -21 -2 -25 -16 -1 -14
6638 -14 20 -3 24 8 19 16 26 9 3 5 -3 14 13 16 13 -9 19 -7 1 16 -17 11 6 9 23 -2 -18 -5 -24 -21 -21 -11 -21 -4 6 24
6674 24 28 -21 -20 -1 -4 -6 6 -13 -4 -23 21 1 3 18 17 1 0 4 0 10 17 -17 -5 11 4 11 21 21 5 32 30 -8 33 5 -6 18 12 -4
6712 -4 -3 15 -6 -2 -6 6 12 20 2 38 17 8 -11 -14 -7 -22 12 9 -10 -11 10 -8 3 6 -3 6 12 -16 -11 16 11 9 6 -1 -4 9 -2 -2 -2 -15 -12 20
6754 20 -15 -29 -8 -24 -24 -4 -8 -2 23 -23 17 -10 -10 1 22 -1 -2 10 -4 8 -1 8 5 -13 12 19 -7 15 -7 25 -11 20 18 0 -5 -8
6790 -8 -6 13 -17 -26 -2 -4 1 -17 -1 -33 5 7 -34 -20 3 10 15 -20 5 -16 6 26 1 -2 -8 20 -4 1 13 -10 -4 19 -13 -3 9 -4
6826dJ2PKk7K1j2k0oJ9J2k1MK3Olk7J4J1j7OLk7J9K5k6Mj1RLpqK4k3oL2k1K7o
6864A1pqJ0M7p2K7%qJ6mj8nk1L6K0l6J5pj0RLj6j2L5jk6J8j2oNK1j7J4jOmK5m9
6902b2J2L5k4J4NmK2k0oQj5K3j6j6nmpJ9PJj9J8k4K9j8K4m7J6jpK6Kk1qK7k0o
6939b2L9l7LM6ol6J8J0k6J0J5lmk2J8J9j7j5NK1k5L1k2j4J0J5j3Nk4K2k1J3J2
6972Ejk4j2N0l9PpK7k3J4Q%l5M0j9j0J9rL3ok8%jJ0J7k1J5Mj3rjOPjk1RJ1k9L8
7011A1Nn4L2K2m3MJ3j4J3k8M9j5k7N8n0J5lK4k4J8Lj0j3N1m1MJ4NJ3m7QkK4j5
7045@J1l9M9k2k5jK0j5LJK2lkJ9l7PJ9l7J1L9k2k7M2l3JJ3J1j5kJ0OnJ7rpJpp
7083a3Plj0L0j2J2j1j1%QnK1rnOJ4l7kP%Kj4Qj2K0oj4K2jjJ4n3P1l7K3j8K5j1
$$ plain form
6826 -4 8 15 17 -10 11 -1 -21 -27 -8 4 -17 -13 10 16 13 -14 0 11 -6 0 3 -24 -5 20 -6 -2 -13 -4 -1 -8 -16 8 -15 -21 11 -10 17 11
6864 11 4 -4 6 53 -19 8 8 0 16 12 -6 -11 -32 4 24 -12 3 -4 -14 -5 -2 -18 -30 5 4 -22 -4 -16 -22 -17 4 -13 1 0 6 2 27 -22
6902 -22 -10 25 1 15 20 16 38 18 12 20 5 28 12 -4 -9 -13 -20 -1 6 7 -12 6 -18 11 -7 17 -30 -14 -15 -22 4 6 -15 -23 4 -16 -22
6939 -22 17 -20 -17 29 23 -13 5 15 -11 -1 14 11 7 -15 3 22 5 -10 -5 16 -9 22 0 -14 -4 11 -2 3 -21 1 -20 -7 5
6972 5 4 -20 -32 18 -21 -14 -21 6 -17 -3 5 5 -30 10 -9 -19 0 -9 24 18 -10 -10 -11 -1 16 -5 10 14 1 -8 -9 -3 4 3 -18 -9 2 -27 11
7011 11 16 -38 -6 16 -27 -23 -10 -24 -11 -39 10 -5 -32 26 -24 -9 -12 12 -12 6 9 -1 -14 37 -4 0 14 19 32 -15 -7 -9 15 0
7045 0 11 -28 21 -1 -26 -27 -7 -22 -19 -18 4 1 -1 18 -19 -12 7 -30 -19 20 -2 -29 13 -20 -19 -6 5 -10 -12 -2 4 -1 16 7 0 1 -6 -13
7083 -13 -6 -9 -19 11 -1 11 0 -11 -11 -3 -8 13 4 -1 5 19 -18 -20 -13 -13 -11 -25 -17 -29 -9 -15 -29 -7 -8 -9 5 -48 23 -14 9 -9 16 5
7121EK9k5k1L7k9j6M7l1j2K6j4mJnJ6J0j6j6K4Ol7J3J6rK4m0OJ1j9K3J1l5L0k3
7155a7K1K4oj1mJ2k9K9rkpJ5k8L4ppk7K9j1%j8KK2J2l1j7K2oj5L0lJ4j4J4k0j9
7191b8pL4l4L0LL0k5oJ1J4l2J6l%K1l0jJ2J0j6JJ3J2%j0j8J5l7M0l8J6j0JJ3J1
7226Hj0l2M8l1J4k8K1nMJ1rJ7rk5M2Jj9K8m3j0L2j0J2%nKJJ5Kj5l1N0m0k0L7j
7262BLMj6J7Mj8j%Kk3J3KJ8j4j7Nj1K3Rk6NK3j1Mj1NMJMPOj8j7J8K4l6L3l7K9
7301IRj2j5Mk1K2rnJ9pK0l0RQ%l1J4j5J5%PjK1l6Om%N1k9J3NLlm0J4L1jkmmJ0
7342B1k6J8j1QJk0qJ3J5k5j7KK9Qj0%j6QRMomk2J4K5l5M3j7J0J9l8Oj0J0J8rK
7379INnj0J1knmK5rl2K8k1k3L2M%j3kNjJ1j0Pk1JKJ7k7K5Lk5j0NL0j1J3Rk6%K2
$$ plain form
7121 5 34 9 -12 25 -4 -20 27 -4 -16 10 -4 -8 -7 -12 4 14 -2 -18 6 12 -25 -12 4 -5 19 -21 -15 -4 -23 0 11 -24 6 -17
7155 -17 4 28 22 11 7 19 -10 19 10 8 1 16 -12 22 15 8 -19 10 -1 -1 -19 -17 5 17 -14 -31 -9 -15 -30 0 -3 11 -3 11 -9 -28
7191 -28 -35 -1 -35 -5 -2 28 3 -3 8 22 -10 6 3 3 24 -6 -7 5 15 -1 0 13 25 25 15 -3 12 -25 15 -23 -7 -17 -16 -3 8
7226 8 -2 -34 14 -17 -3 -31 -10 -15 -11 0 -9 8 -1 -26 16 17 -2 26 -17 -27 5 -5 7 7 2 4 5 20 22 7 -24 26 -14 -34 3 2
7262 2 5 9 -7 10 14 -4 -5 -5 -3 -26 -13 -11 7 -7 -24 -19 -30 -7 2 -24 -19 4 -7 -3 -14 -9 -5 -4 0 7 13 -5 -22 -4 20 -16 17 -20 9
7301 9 18 6 -9 -5 -26 -4 -13 -18 1 -6 14 -16 -7 1 1 -30 -16 -31 -16 -16 -9 -10 11 -25 -19 -23 -23 28 -1 12 17 20 17 -23 -9 22 21 19 15 11 21
7342 21 -5 13 2 10 11 -9 -17 -4 11 -14 -31 -29 0 8 -2 -2 -18 -10 -1 3 -3 -7 -29 -15 10 -25 18 1 11 30 -8 -2 -12 -2 16 7 9
7379 9 14 9 -1 10 8 3 -1 24 15 -17 11 -10 -33 -1 3 3 -10 -12 -7 -8 3 -7 0 -21 -20 -18 -1 -28 -3 0 -25 -35 -30 0 -11 2 11 -15 -15 7
7419G%k1L2j7Nj0%LooN3rj8qj6Kj4RpK4K3l4J0l3L3kJM1n4MK6rk8J4Kj9K7j7M6
7458C4k0k7L3j4K2k1jl7J8j0L9j8j2K0j3jnL1k2jRj1rnK3rKLj9L7m3K1K6l1k1
7493c2K6K6j9k7J3Kj2L1pJ8m1M1J3l4l2N1k8NM3k3plKQl5jJ4L5n1KjK2Ppk8k0
7529d9N0Mk8J6Lmlk2M1j9J0nOjj2%J9j2J1L2l5kJ3KJ7j6qj8%L7k8j1NMqj0Pl0
7567d4OOkJ2K4Kk3K8j7Rk%J0mk3%L6k1Lj6K9k9K8jqJkoJ3Lj5PoJ7j3j8J3k0J4
7606ilj7J4qJ0RMK1j3j0l2M0j4LKl2M2pK7n5PJ3J3mMjJ1jnK4j5k7K5l4K9ol4L0
7644AJ2llrmQk2J4Mj0J9l4LM2k7K3m0J6mLJ3j5J7ql1K0J5PlJ1RMlj1kj2K0Nk6
7683anmK1RMm5K3J0j9jj0K8k8nL3j4j7RQj5mL1k7Rjj2J8J6k2J5k1oJ6JQj6K0P
$$ plain form
7419 7 7 -14 18 1 6 -4 -4 -1 -7 -13 40 31 13 5 -11 -9 -23 -14 -21 3 26 -8 2 -31 2 0 1 42 -12 -8 18 9 -19 -5 -3 -22 5 -12 34
7458 34 14 -13 20 6 28 7 6 -31 -13 -23 16 -2 -14 6 -7 -8 -13 18 -4 -5 4 -7 -16 -21 2 -7 -5 -2 -21 16 -27 -6 20 -11 -32
7493 -32 -6 20 1 -26 -13 -11 -23 8 1 19 -22 19 32 -2 -34 17 -11 -6 37 14 7 4 6 14 -21 -22 -8 27 -24 -22 -23 -1 6 -1 -29 -49
7529 -49 1 5 -23 -7 -4 -8 -11 -33 8 -11 -1 -6 0 -1 -13 -13 6 -6 5 37 2 0 13 15 32 16 8 -10 -10 27 -1 -12 -7 -3 -11 -21 -14 -44
7567 -44 -38 -32 -34 -22 2 4 -19 9 -8 1 -1 -1 9 5 -18 -18 18 -3 0 -16 13 -16 12 11 3 4 2 -4 9 12 -3 4 -2 15 2 -16 -3 -23 -9
7606 -9 -12 -29 -15 -23 -13 -4 0 21 8 -2 -34 6 -8 -5 -3 -35 7 0 27 -28 -21 -8 5 1 5 4 15 14 9 33 18 -9 16 -18 11 5 -29 1
7644 1 13 10 7 -2 -6 2 -20 -6 -2 -12 7 -27 -24 18 -9 14 -26 -10 -14 -11 2 -13 4 -4 -35 -15 0 7 4 15 24 28 25 14 12 0 20 25 -1
7683 -1 -6 -10 11 20 24 -21 2 12 -7 -8 -18 10 -18 -23 10 -4 -21 -12 -4 -19 -23 8 -19 -10 -11 -23 -5 11 -11 4 -17 -23 -7 -6 2 -14 6 13
7721A3l3J6Nk4L8j4J8J1l1%k0Kj6RK4j0QJl4M8j2Mqjk2J3MK2l3K6j4K9k7j0K1
7756Cj8K6k4J4%jJJ2J2l9pM3k4J2j7Pj0MJ7K7n4KJ1opm%MqJ4k0NJ5j6J5j5j2K7
7794a1l5N3k3K4k2J8Qj4rJ9J5pmj1onK2mjlkJNk8JL5m0JJkK1l4J5L6l6J8j9QK1
7833Fj9KoJ5J0j8kLK3Jj1lK6k7K3l2K2%j4kRMjj7J3l4L8nj4l4L5J4k8L2oj6J0
7870cJ1qmrJ0KKk5J3J3nKk7K8QJ6k4lJ3j7pK9k6NRkOj0J4Ql7J8k2K0rJ2njJ5l
7910Gk9j6K5JJ1Nk2L5l6K2Roj4K0j2pMjKK6kk6PlPJ5l5L4k4PPj5J7Mj0j9nL6l1
7949a2K2j2n%j0KJ3Jk2j3N0j8J0lk2J7j3lK9J0rNm0J6K9k4qL1Jj7j5NK2k3Ll3
7985c6L4K6k1Kj5J0rj0J2oPMk6K4K2m3L1k9J0JL2j2lol5L5nKLJPmJ1j5JK0k1J3
$$ plain form
7721 13 -20 -4 1 -23 15 1 19 30 -1 -1 -21 -19 -35 -26 -2 -12 -4 -3 -37 11 -1 3 -5 -6 -28 -15 -11 11 -22 4 -10 19 -8 -18 3
7756 3 -15 11 -13 1 1 0 1 13 25 -14 -21 22 -2 10 -7 0 -10 -6 11 38 -16 -14 -3 -9 -16 -20 -20 -16 -24 -10 -30 -25 -10 -26 -11 -26 -38 -11
7794 -11 -46 7 -16 8 -14 4 12 -2 -11 8 23 16 12 1 -5 -10 12 8 7 4 2 3 8 -20 -19 16 -24 -23 -22 -24 -3 -37 -22 14 -22 -4 -23 -15 6
7833 6 -13 -11 -17 -2 8 -10 -12 -9 14 15 4 1 27 0 23 -9 13 13 -1 -3 6 10 9 -8 5 -29 9 4 -10 -44 -9 5 -23 9 3 -13 -3
7870 -3 8 0 -4 -13 -3 -1 1 -24 -11 2 -3 -1 -28 0 8 24 0 -3 10 -7 -14 15 -11 -6 3 1 7 -3 11 19 -18 0 -22 -2 -11 1 -4 -5 10 7
7910 7 -22 -38 -13 -12 -1 4 -18 17 -19 3 12 6 -8 12 0 -7 -3 -4 -2 24 22 -4 3 0 7 22 -13 21 -3 4 11 -4 13 17 7 -12 -17 19 -12
7949 -12 10 -2 -7 -7 -17 -15 -2 -1 -23 -36 14 -4 6 3 -19 -2 -15 -18 11 21 12 17 -23 -7 22 -2 -10 21 22 5 -10 -5 17 -6 -3 -36
7985 -36 -2 24 3 5 -10 0 -9 -19 -7 -13 -6 -2 -28 -4 18 -25 6 -23 -13 -12 20 8 5 -1 -36 -1 -6 -4 -1 0 7 3 14 -1 0 20 -1 12
8023A2ol1J6J6k7J7NkMkOj3%J5l0J9J0k7J4Qoj1J2j5rJ9k3Rj2L1MJ8ok3j8lL6
8060GK2k6kNJ0k5%nQOqoL7l2qK7l7J2KRk0J9qj4M1j6l7K5J4j8J4Ql9N0k1MJ9%
8098A7J5ql1PMkKJ9l1M2k4LlKMl1L3k8jJ6J8j3j2k9qJ4J3K7k5lJ4LkKJ0j4j9K0
8136Aj4J2mM1k5Ok2K5j2J6rl4K6k6K1qLMpj4K6Ok2QJ8j1j3k6K8pOj1J9k4K9pM
8173CRk5rJ1J8k3J1K9nj5qN%%mOj4r
$$ plain form
8023 12 6 -25 -9 7 -20 -3 2 0 4 2 8 -5 -5 10 -20 -1 9 -18 -4 4 -2 -13 -1 -16 -25 -6 -29 -20 -32 -1 3 21 15 -8 -26 -29 7
8060 7 29 3 1 6 16 -9 -9 -14 -6 0 -8 -14 23 -9 -17 10 -27 -15 -13 -4 -24 -5 -13 -27 14 -2 -39 -14 0 -18 -4 4 -35 15 -6 -2 17 17
8098 17 32 24 -7 0 4 2 4 23 -8 34 10 13 10 12 16 -15 18 -10 -11 5 23 10 -2 -31 -39 -25 -12 15 -10 -13 1 4 2 4 14 0 -19 1
8136 1 -13 -1 -5 36 11 17 -5 20 8 24 15 -19 7 -19 2 -6 -3 1 -6 -20 6 12 -10 -2 16 5 -8 -34 -6 -13 -7 -18 1 -23 6 -1 3
8173 3 12 -13 -22 -11 7 -16 -5 24 19 4 -4 1 1 1 -3 3 -11 -20
8191b0
$$ Imaginary data points
##PAGE= N=2
##DATA TABLE= (X++(I..I)), XYDATA
0@%%%%%%%%%%%%%%%%%%%%%%%%qJ6j6J6j6J6j6J6k4L2l2L2m0M8m8N6o4P2q0Q8r6
45d8J04j20J33j43J56j73J93k14K34k58K86l16L51l92M41m98N67o53P61r08J116
66F19j433J986l218J1511m449j5104J4650P163q800q729N238K416j901j334j054
81b439m529K703P808q9q076Q73P426p58q021r42M372J311m55J480q24j021M025
98B844L684m089l446N045M144m961n062J149O95k524l30O45j601P31M510M1m830
115c355M18N367K6m261M45K653j737j447K572m89l760L126P086k221p413L011
131B1Q090l404r233J067O856j530o286k63L287L56p75L67QQ67L025O72l419j080
149a374L252O02l605j003K792O33j804L14J346n86j44J710k77k349R8J684j561
$$ plain form
0 0 0 0 0 0 0 0 0 0 0 0 0 0 0 0 0 0 0 0 0 0 0 0 0 0 -8 8 -8 8 -8 8 -8 8 -16 16 -16 16 -24 24 -24 32 -32 40 -40 48 -48
45 -48 56 -64 69 -74 82 -91 102 -112 122 -136 150 -166 185 -207 234 -264 303 -350 411 -497 619
66 619 -814 1172 -2046 9465 5016 -10088 4562 11725 2925 -5804 -566 1850 -51 -1385 -2439
81 -2439 -6968 -4265 3543 3454 -4622 -3749 3677 2919 -5102 -6044 -1672 -361 -816 664 -160 -1181 2844
98 2844 6528 2439 -1007 4038 8182 3221 -1841 -692 3 -2521 -2851 -2206 -3807 -3076 1434 1475 -3355
115 -3355 -2937 2430 2456 -1805 -1360 1293 -444 -1891 681 192 -3568 -442 6644 4423 -2990 21
131 21 8111 4707 -4526 -3459 3397 1867 -4419 -4682 -1395 -1039 -1814 -1447 -1439 -572 2453 3125 -294 -1374
149 -1374 1878 2480 -1125 -2128 664 1297 -507 -193 1153 567 423 2133 1856 -493 -395 1289 -272
166b72k878N35J883p63r53J454J327k27M45R24l22j72J032k69j921p0J494j083
184A64k279J090K430j101j993J644K072j638j960J300J106j685j191J167N42j006
200a338M5J250L45Q1P25M86k08J92J12r81p06N93q1j636m12J377K59j446j41J620
220A36M40j095j89P82k7n73k8L6k73L99P25j47k72P86Q01k99l93K78K3m16j87
241E07k81q65k88O60qj126k6J368L10j050j51J079L21p28k38M04J18p2Q5m3J5
262iM40M39k60k26M35J69n28k65J79k92n30J19K15n26l65O16M51n89k51P02M49
283C73m55k79L21J84j37l1m2l8K74K74k39k75M35L91m18m23L48K29m31k85K20
304dQl28N0K36j84j50L16J58k67j69L49M9k78J8K12l0r8J25L9j45R2K88j14k27
$$ plain form
166 -272 -3150 -2615 -732 -1495 -2448 -994 333 106 551 1475 1153 981 2013 1744 -177 -247 1247 164
184 164 -2115 -1025 1405 304 -1689 -45 2027 389 -1571 -271 835 -850 -2041 -874 -332 -1338
200 -1338 -1293 -43 302 383 1108 1594 1386 1578 1690 709 3 596 515 -1121 -1533 -156 103 -1343 -1484 136
220 136 576 -519 -708 74 47 -526 -554 -518 -791 -392 333 186 -86 700 1501 1202 809 1087 1110 694 507
241 507 226 -639 -927 -267 -275 -1401 -1427 -59 251 -799 -950 129 450 -278 -516 -112 6 -66 19 -24 -9
262 -9 431 870 610 384 819 988 460 195 374 82 -448 -329 -114 -640 -1005 -389 62 -527 -778 -76 373
283 373 -82 -361 -40 144 7 -24 -66 -104 170 444 205 -70 365 756 338 -85 263 492 61 -224 -4
304 -4 4 -324 -274 -38 -222 -372 -56 102 -165 -334 15 64 -214 -196 16 -14 -112 13 52 -93 -1 287 173 -54
328e4K24K78j90k58K23J93k65j92J73K7k68k5J26j32k01J32J06j88n5K19K9j20
350b18M7J31p8l5J67O1j67O6L12K5k05J14K83l2k24K9J08j69k05n1l5j75p1L2
374b90l3m7R1J04k1N0Q8k8m4R6Q7j64n2K59J78j88p2K83K71j61k08Q0J34j38l00
399b5j28lj3p1j29o8J51J93n7l5J21J55j1r0Qk0j5M8j9n2J8J98M9p8N7J50l0j36
427A68m3k0k04j34N6O2j64j23K25K43k9j25J01K12Rq3j96j26J22J69k21l65J37
450c29N36Q5m63j20N60L44m44m49J87L88j16m82j31L47K37j53j23P3K74J18n6
471B83j73j13P0M4k24k17q0J86J41k41q1K86K59j12p3J61P2j55nJ66j13k46J51
494a4L07k3k84J0M00J18k57k42KP3K1k18m43j08M15K47m98l87N81P37k53o29J79
$$ plain form
328 -54 170 448 258 0 223 416 151 -41 132 159 -109 -134 -8 -140 -341 -209 -103 -291 -346 -127 -98 -218
350 -218 -171 -40 -118 -153 14 75 -92 -26 286 311 106 220 503 471 247 276 384 215 10 -41 -76 -251 -322 -290
374 -290 -323 -370 -279 -175 -196 -146 -58 -86 -130 -34 53 -111 -163 96 274 86 14 297 568 407 199 279 413 275 -25
399 -25 -153 -156 -169 -240 -369 -437 -286 -93 -150 -185 -64 91 80 -10 -2 -22 -37 11 -8 -60 -42 156 205 127 184 334 304 168
427 168 125 105 -99 -233 -177 -115 -279 -402 -177 66 37 -88 13 225 234 151 -45 -171 -49 120 -101 -466 -329
450 -329 207 292 -171 -291 269 613 169 -280 -93 295 179 -303 -434 -87 150 -3 -126 -53 221 339 283
471 283 110 -3 67 111 -113 -330 -410 -224 -83 -324 -405 -119 140 28 -45 116 188 33 28 194 81 -165 -14
494 -14 293 270 -14 -4 396 514 257 15 17 90 111 -107 -550 -658 -243 4 -494 -881 -300 437 184 -445 -266
517b66P66R1o06k65M08L30k06k98j0K88K36m3k56j52K07J80k51m83j37L01L2l51
539d85k04K01L26pr8J27J89L9KP3kj42O2K08o4k10pK96R5j84j32P0J08l3j50k59
565a81j25J35K18l17n01K19O69O5o75r2Q02L94n84l84M08M60k14m53J5L37J33
586C29j62j64J0J42J81k0l47j29K49J46l47l60J94L25j21l10P0K98J03j66qJ18
608C1N0q5K1N8j00m6J14O1r5l8J51M9o1K4Mo8jK3l3j43r9J86J24k40k26K33L42
635B36j93l95J19M23rl95j12L45J71k28j92J67K39m1j36K7R6O1jm7q3J7J28m8
659A49k15j6J47K2j90r0Q2J27r3q9k7J21L0o1k0K7P8L5j1n8Q8J18k8j19R1J00
685A98j1j02kN6L0r9q3j2J4n1j12J5M8j0l6K4Q0M2p7M1O9N2q6j6Q1J8p2K3Q9L2
$$ plain form
517 -266 500 591 -15 -280 128 458 252 -46 -56 232 468 425 169 17 224 404 153 -330 -467 -166 -134 -485
539 -485 -689 -488 -162 -169 -267 -140 49 88 90 163 161 19 81 289 225 15 8 304 399 215 83 153 261 228 78 -181
565 -181 -306 -171 47 -270 -771 -552 117 182 -493 -585 217 611 27 -357 51 511 297 -156 -141 196 329
586 329 167 3 13 155 336 316 -31 -160 89 235 -112 -472 -278 47 -74 -384 -314 -16 87 -79 -87 31
608 31 81 -4 17 75 -25 -71 43 104 9 -29 122 171 110 134 138 70 69 92 59 -84 -183 3 127 -113 -339 -106 236
635 236 43 -352 -233 190 181 -214 -326 19 190 -38 -230 -63 176 135 -1 26 122 183 182 135 52 69 197 149
659 149 -66 -82 65 87 -103 -193 -111 16 -77 -166 -193 -72 -42 -103 -123 -96 -18 17 6 -52 36 154 126 7 98 198
685 198 187 85 83 139 169 70 -13 -25 -11 -62 -174 -159 -111 -121 -157 -133 -53 -11 -88 -47 22 74 -12 -28 53 71 -1 22 111 143
715A43n8rQ1PJ2n6r3k1M8j04q7j0N3k1m4O0K6M2j1N7L2o6K6Rj2o0n8P0N4o7K9
746b8R1Q9mk9j2L9k1m8j02j2M1k0p0J4Q0rRj9O1k0m6Mo6o5k5j0K4m4L3J08J15
777E8kJ2O7P1Pp1l4J8km2j16J1Q8L5j04J1Q2Qr7n8J6l1j29n7nM0M7j7N4Q0P7Q6
809A03M4M9L8qmm9m2l1o4KLk3K9qK5m0m5l0K5j00j12Ol3j1mP3N3Q0P1J27P2M2
841B38J0nPo3m5ok4n6m3oK1Ql7k0J8J0q0q0m3ORj01J7R5P7K9O0O4R3K3K5j4j0
874A77Mn5o7k5qpNk8J3L6rPl2n6lk9k8o0m7M3O1k0%P9O7Q0k0l1M9K7k1n7m6qM5
909C6J9m9j2L5N8nl5pK5kk7r7j6K4Qn3p2P2Q0Lo2K7O1J1nj9J3l3JO3nn7MJ18K0
944A22n1QM3J0o9j7j2%n9kk0j16J1J29jj21m7J38Q5o8p3P0J32j3j01J2J23Ol3
$$ plain form
715 143 85 76 157 164 176 120 27 6 54 -50 -137 -147 -94 -115 -159 -99 -73 -31 -42 15 47 -19 7 16 4 -56 -114 -44 10 -57 -28
746 -28 63 152 148 119 107 146 125 77 -25 -37 4 -16 -86 -72 8 -1 8 -11 50 30 -16 -12 -78 -143 -168 -178 -154 -198 -165 -57 58
777 58 56 68 135 206 213 142 108 126 124 82 -34 -23 65 100 -4 7 89 97 0 -58 -42 -73 -202 -259 -264 -224 -177 -194 -140 -60 17 103
809 103 147 196 234 226 222 173 131 100 36 38 41 18 47 39 64 24 -21 -51 -26 -126 -238 -232 -265 -276 -280 -207 -154 -74 -3 124 196 238
841 238 248 243 250 187 142 136 112 56 13 7 28 36 -1 -21 -3 7 -73 -153 -196 -190 -181 -282 -265 -170 -93 -64 -4 60 153 176 201 187 177
874 177 181 126 59 34 26 19 24 -4 9 45 36 43 11 -45 -48 -77 -105 -165 -212 -169 -108 -128 -128 -49 18 98 78 47 96 123 102 45 -1 -9 36
909 36 55 6 -6 29 87 82 47 40 65 63 36 -61 -77 -53 -45 -98 -170 -98 -18 -15 -77 -50 11 22 17 -2 11 -22 -21 42 37 -20 -16 102 122
944 122 71 79 122 132 63 46 34 34 -25 -27 -47 -163 -152 -23 -24 -145 -192 -54 31 -37 -110 -40 92 79 -22 -10 113 119 86
973H6j5j3RM9j6r1j6J6J06q5j21l3J28Jj54p1J54J5p7k5Q6M6j4M9R2k8k9N9N4
1002A62p3j07K0R9jj33LQ1K0l9%Lk1K5%r3m0pM1Mp5m0J42J42r1j05J14J37n1j59
1032d2j6O3Rr0k6j9R6K5N1kk8J28O1m3j44K1P2j00j29J3P9j6p0N8P4k2L6L0m9
1061B0p4Ll5l2p4J%J01M7K5Q3R1P5N2o0l5%l1o7j16j0n5j8L3k6k0R7Q7j13p5O2
1092f4K6p7j29L1L6RK4P3Q5J27P0P2J6LKQj71r1l8n5j18m1N3k0J6N0O3l7lM1l3
1123g2q3l9P7p7lJ35Q1K4P7J76O0J4k1N5j13j21j04q2o5j15Lj1k3K6J29mj7L5
1151e8Q4o2q0K7k2o2L2M2Q5L4J15J09M2K7M5k3j21q2j08o1j29n8Lj8l1J15Q1J9
1179e5N3R8Lp1Klp9p3O7J3l9O8J06O8LM5K6k0r0m7o3j43o9%j9J0K0R2M5P7R1R4
$$ plain form
973 86 71 58 67 116 100 9 -7 9 115 30 -91 -124 4 5 -149 -220 -66 -51 -128 -153 -67 -21 -35 14 106 78 49 108 162
1002 162 89 -18 2 101 100 -33 -30 51 71 32 32 35 14 39 39 -54 -94 -101 -60 -56 -131 -171 -29 113 22 -83 31 168 117 -42
1032 -42 -58 5 14 -76 -102 -121 -25 0 51 49 21 149 210 167 23 44 116 16 -113 -100 -21 -37 -107 -49 25 3 39 69 20
1061 20 -54 -51 -86 -118 -192 -191 -191 -90 -43 -18 65 156 231 283 223 188 188 157 90 -26 -36 -91 -109 -76 -102 -122 -25 62 -51 -126 -64
1092 -64 -38 -115 -244 -213 -177 -168 -144 -71 14 141 211 283 299 302 304 312 141 50 12 -43 -161 -202 -149 -169 -153 -103 -40 -77 -80 -39 -72
1123 -72 -155 -194 -117 -194 -197 -62 19 43 120 296 356 370 349 404 291 170 66 -16 -81 -196 -193 -204 -227 -201 -72 -76 -93 -58
1151 -58 26 -36 -116 -89 -111 -173 -141 -99 -14 20 135 244 286 313 358 335 214 132 24 -37 -166 -224 -221 -239 -270 -155 -74 -55
1179 -55 -2 96 99 28 30 27 -52 -125 -58 -45 -84 -16 90 158 161 206 232 212 122 75 12 -131 -200 -200 -219 -209 -189 -97 -52 25 116 210
1211B10m8l4Rn8o9q6J6k8l5P8N6N6NL2K1l3n0k2o0p9o4j3j6L2R0N0R0O5R8Rj0
1242B12J9l8q5q9p2l2p9nO5omO4Q5k1K6k4mo5k9jk8k7O3M1P9M1J22N6j1K2j4o8
1274A93p1j06o5o3q2j1k1L5K1O9M6ML9K9j5m5k0j4L3pK4P2L1O0P4K6J0K2k5o4
1304A79n2p2j06j08k7l8Jk4O0L8N9N7K5Rj3rJ3l9kJ1M3J7N5L3M0K3L5L0m1l8q2
1335G7p5q0o2j4k5k6L3L5M2M0N0J2K0Oj1m3L9l8j6K2K6JN4K6L0J1j2NJ1q2o9j8
1367c1m1n8j1%J8lN5L7L9%K7K2k4jn9K7Ll1%M3K3K0ML3J1j5Nn2j2Lm2l8oJ2lK2
1403b3j0J1O0Pl6Rl6qRl5Kl0K5K2J2j6L0K9K8MRj6L4k7n2L5Ol1mM6k4k2mK1pN
1439B3m6rOk8j0j5JKK8LJ7lNO7J4j4M0j9J8o1L6J4j0j9j3J8%l5m%Mn7J8qpk8J2
$$ plain form
1211 210 162 128 137 79 10 -76 -60 -88 -123 -45 11 67 72 104 125 92 42 20 -40 -119 -183 -196 -212 -180 -90 -40 50 115 213 222 212
1242 212 231 193 108 19 -53 -85 -164 -169 -104 -110 -114 -50 35 14 40 16 12 -53 -82 -83 -111 -138 -75 -34 45 86 208 264 253 275 261 193
1274 193 122 16 -49 -112 -194 -205 -226 -191 -170 -101 -55 -51 -12 17 2 -43 -63 -77 -44 -51 -27 45 76 136 210 236 246 268 243 179
1304 179 127 55 -51 -159 -186 -224 -223 -247 -187 -149 -90 -33 -8 1 -12 -21 -8 -47 -49 -38 5 22 77 110 150 173 208 238 197 159 77
1335 77 2 -78 -140 -154 -179 -205 -172 -137 -95 -55 -5 7 27 33 22 -21 18 -20 -36 -14 12 13 67 93 123 134 122 127 138 56 -13 -31
1367 -31 -72 -130 -141 -141 -123 -126 -71 -34 5 5 32 54 30 29 -30 -3 0 -31 -31 12 35 55 59 92 103 88 93 41 29 32 -10 -48 -54 -42 -45 -23
1403 -23 -33 -22 38 45 9 18 -18 -26 -17 -52 -50 -80 -55 -33 -21 -37 -7 22 50 54 63 47 81 54 2 37 43 12 8 54 30 8 4 25 18 23
1439 23 -23 -32 -26 -54 -64 -79 -78 -76 -48 -45 -28 -31 -26 41 55 41 81 62 80 19 55 69 59 40 27 45 45 10 6 6 10 -47 -29 -37 -44 -72 -60
1476f0K0j6jM0kj2M2mK7k7QL5L6m3mJ0j2J8m0l4L6l5Oj4J6n0L6NrJ5l1%K9j8j4
1511d7RRJ3k1N1L3n5L6L1jprRJ0n9Rnqm8L6K0Nk8J5K8k9j5l1%n0N2j8k2PK9L9
1547a2pNN9k8M5RnPj7k6Lj7L1lpjK8NJ6n6j6k6m0l2J5j7n2N6J4j2pQ0%JM9M3m5
1584D0kj3Mj1J7J6J7mlj4M7k9n0K8l7q2MQk5j8J2J9j8M5L1j2P0%qmJ1J8k4j3J9
1619C9qpJL9Pjk2Oqn3l5j1n1k7K2K9k8J7N4%J1J9P3j8k6M5ojj9%Rj3j5J6K0%l1
1656B7L5m9j2%j3n8k1N4n9K5K5K5L%N6jj8J7k7j5J2J7k2JoJ0K2J5RL4j5j6qj3
1690C4mn3pj4pNMM3k7L3J1%j0j8K4k5j4jrqM1k2RN5pj0K1K9m3M4l6k4j1KNJMm8
1728c3K9K3j9K7l4j4k8PJ8k6%j2N5l7L9J2RL1j6K3j4NMoj2j2mLj0Mmnk8K5k5N
$$ plain form
1476 -60 -40 -56 -57 -17 -19 -31 11 7 34 7 15 50 86 43 39 49 37 55 15 -19 17 -18 -12 -26 -10 -60 -24 -19 -28 -13 -44 -44 -15 -33 -47
1511 -47 -38 -29 -16 -37 14 47 -8 28 59 58 51 42 51 61 2 11 6 -2 -50 -14 6 11 -17 -2 26 -3 -18 -49 -49 -99 -47 -65 -87 -80 -51 -12
1547 -12 -19 -14 45 17 62 71 66 73 56 30 33 16 47 44 37 36 64 69 85 29 13 -13 -53 -85 -70 -87 -139 -83 -69 -81 -88 -8 -8 -7 42 85 40
1584 40 38 25 29 18 35 51 68 64 61 47 94 65 15 43 6 -76 -72 -64 -89 -107 -95 -76 -94 -49 -18 -30 40 40 32 28 39 57 33 20 39
1619 39 31 24 25 64 71 70 48 54 46 -7 -42 -53 -104 -131 -109 -80 -108 -91 -37 -37 -26 -7 66 48 22 67 61 60 41 41 50 37 22 38 58 58 27
1656 27 62 13 1 1 -12 -70 -91 -37 -96 -71 -46 -21 -18 -18 38 37 19 36 9 -6 6 23 1 2 -4 6 28 43 52 86 71 55 47 34
1690 34 30 -23 -30 -44 -51 -46 -42 1 -26 7 18 18 8 -10 14 -11 -25 -26 -35 -43 -2 -24 -15 40 33 23 44 73 30 74 38 14 3 5 10 11 15 -33
1728 -33 -4 19 0 27 -7 -21 -49 -42 -24 -50 -50 -62 -7 -44 -5 7 16 47 31 54 40 45 49 43 31 19 15 18 8 12 8 3 -25 0 -25 -20
1764b0k2QNj3KJ5oJ0K1J4kJ9LK9pQl2JJ2Rm6L0ol9RqK6m6Kj1QK3j4m0J6Nj6K7
1802b6J3K4j8K3J8k8L5J9kj3J1Pj8kJ9j8l7L3k3nMj6Jj3j5j4J2l8J5K6k5KK5%
1836b4KPL0rK0j6L9k2J0j1K1mnpk0Jj1J9k5j6L3Mk8l3K8Jl3Mk1M0k1J8J8qK0N
1872FJ5rMJ9M2l4KKk0l6N7l0j2rnj9RJ9mm2jrL8j2k7K5OPkK5J5L6m8L3LOlJ1j0
1911D8m6K8jj7J0j1J7k8lk9J6k8QrPl4K4j4JL6Kj0M0K7rQ%J8j7J2j1jj4qJ8k3
1947GJ6J5l6Pk0j0lj8oJ7k3Pj4OlRM4lK5j0K3prL5k2Pj9pjK0j2K2l0K4Jkj2l1
1985a3J9jl0k1J7kK1j7J5J0Lj6QJK6j0J5k7j4J2K8J6k5J0K1j3mrkNk5nJ5rpl6
2021d4PK1j9J2l%JM2ol7K4j7K7jL1j7%oN0j3kk0J5k3qjn0L6pl3rK3Mj9J2lK3k1
$$ plain form
1764 -20 -42 -34 -29 -42 -40 -25 -31 -21 0 14 12 31 34 63 56 64 32 33 45 54 8 38 32 -7 2 -6 20 -26 -24 -35 -27 -4 -18 -58 -42 -37 -53 -26
1802 -26 -13 11 -7 16 34 6 41 60 58 45 56 63 45 43 62 44 7 40 17 12 16 0 1 -12 -27 -41 -29 -67 -52 -26 -51 -49 -24 -24
1836 -24 -22 -15 15 6 26 10 49 27 37 26 47 43 38 31 11 12 1 20 -5 -21 12 16 -12 -45 -17 -16 -49 -45 -66 -26 -47 -29 -11 -19 1 6
1872 6 21 12 16 35 77 43 45 47 27 -9 48 18 6 -3 -8 -27 -18 1 -3 -45 -46 -55 -17 -29 -56 -31 -25 -18 -20 5 20 56 8 41 44 50 47 58 48
1911 48 2 30 29 12 22 11 28 0 -3 -32 -16 -44 -36 -45 -38 -72 -48 -62 -61 -25 -23 -33 7 34 25 33 33 51 34 46 35 34 20 12 30 7
1947 7 23 38 2 9 -11 -21 -24 -42 -48 -31 -54 -47 -61 -55 -58 -49 -5 -8 17 7 30 23 14 49 27 34 15 8 7 27 15 37 7 31 32 30 18 -13
1985 -13 6 5 -25 -46 -29 -31 -10 -27 -12 -2 1 -15 -7 -6 20 10 25 -2 -16 -4 24 40 15 25 46 33 29 20 18 23 -2 -7 8 -1 -8 -44
2021 -44 -37 -16 -35 -23 -26 -26 -25 17 11 -26 -2 -19 8 7 38 21 21 15 65 52 50 30 45 22 14 13 -37 -1 -8 -41 -50 -27 -23 -42 -30 -33 -10 -31
2059c1j2J3OJ1j2M3j1K0PJ9oj4K2rJ2k0j7J2rnk5K1k1k3LOOj3j9L1j0mKk0M9l8
2095c6L7rM3m8K5L6J3j9j3M6o5J6RJ1k9K2j6j8jLj6k8L5k7JKnl1M1PrK8k1K8q
2130D%LJ4nrJ9PJ2Lk1K7j5m3K0J0k2k8J8k3k3N0k3J8Q%pJj2K7nj4M9kj8k1L9m
2167C4Rk8L9j6Mk0oj4j8klPK1k4k4K6j0mJ2K6n6L2j7MM0j5L3j7J3Mk2N3jj5mj9
2203B2J9j0k0njoKj6k2JJJ8J4k0JJ0j3J1nqNL7j7KL4NkLjKplj8onk4L9l0K6J2
2243B5k0L0l8j4K0j1l6J3oQk6L1rK6kK7Mj1L6j6Krom5J6OoJ0qJ3MJ1Rj3J1j9k6
2280a9j9Nj1K1JpK9mj6K3M2l2K5Rk7rj5%jJ5JpJ8k0L0J9k1k4jj6k6j8K6j4oJ8
2316c1kM2RJMj3M0m9J3JmNJ5j4kK2jJ8lk1L0j0l0m9qQl6J3l6K6mL5jK6jL1j4q
$$ plain form
2059 -31 -43 -30 -24 -13 -25 18 7 27 34 53 47 33 55 46 58 38 21 33 24 19 -6 15 -6 -29 -26 -20 -14 -27 -46 -15 -25 -29 -27 -47 2 -36
2095 -36 1 -8 35 -13 12 48 61 42 29 75 10 26 35 46 17 39 23 5 4 7 -9 -37 -2 -29 -28 -26 -31 -62 -21 -14 -23 5 -16 12 4
2130 4 4 7 21 16 7 26 33 45 48 27 54 39 -4 16 26 4 -24 -6 -29 -52 -2 -25 -7 1 1 -6 -5 -17 10 5 -9 40 38 20 -1 38 34
2167 34 43 15 54 38 42 22 16 2 -16 -18 -21 -14 7 -17 -41 -15 -25 -29 -17 9 -47 -15 -32 -28 12 -3 30 13 26 30 8 61 60 45 41 22
2203 22 41 31 11 6 5 -1 1 -15 -37 -36 -35 -17 -3 -23 -22 -12 -25 -14 -19 -27 -22 15 -2 0 34 39 37 40 39 41 34 31 13 7 2 -22 17 -13 13 25
2243 25 5 35 -3 -17 3 -8 -44 -31 -37 -29 -55 -24 -33 -7 -9 18 22 11 47 31 33 24 18 -27 -11 -5 -11 -1 -9 4 8 19 28 15 26 7 -19
2280 -19 -38 -33 -44 -23 -22 -29 0 -4 -20 3 45 13 38 47 20 11 -4 -4 -5 10 11 4 22 2 32 51 30 6 5 -11 -37 -55 -29 -43 -49 -31
2316 -31 -33 9 18 19 23 10 50 1 14 15 11 16 31 17 15 37 36 54 51 30 60 50 20 -29 -37 -29 -65 -52 -88 -62 -66 -31 -32 -6 -7 24 10 2
2354BpL0k7nJ7K4l2L8j4OLoM8rj1l4k7j2jl0%j4lM3j1M0j3J2Lpj7j7L0l3L6qR
2391CPJ0LQ%L1k6Rk3%l0k7J8k7Oj2K4PoN4j4j3K0k5Rl4K7k2PJ9k%J2K2j3J0k0
2428A2J2J1k1j8j6njJ7l2L5kRJ1Rk2L0m0PJ2l4JLOrL1K6K5k9PmK3j2k2Oj7k2O
2465gmpJ3j0K7j3J2j8m%mK3m9JK5j3J9J2k9N3ljJ5%qLj8Mk4J3QrJ1k1J4nk7J7
2503d%k2NNj3Kj8kK8k1M6j1QrJ2lRmKnJ2KJ8l6M0m0MkK8ml2j2K6k1j6J9noj0K7
2543cpj2RJ9J9J0k4OK0Ml5K8qj3Oqqk3LKKL2l4k9L9Nk9Rj8M3jqk2K2PJ1Mj1kK6
2583C1qj4J4K1m2NJ6Nnk2K0%m0J1lJ1J2l1Pk8L1j2oJ6j4J0NMJ1j8K0%K0L0j8k2
2619A7J2rJ9j9ROkk2j6K1oKk5kK1k0J9j1k3MJPnK2kj1PkK3k7L7J2j4k8K4J5k5
$$ plain form
2354 2 -5 25 -2 -7 10 34 2 40 26 32 35 29 77 68 57 23 -4 -16 -17 -47 -47 -61 -64 -21 -32 8 -5 7 10 3 -14 -31 -1 -34 2 -6 3
2391 3 10 20 23 31 31 62 36 45 22 22 -8 -35 -17 -44 -38 -50 -26 -19 -25 29 15 2 22 -3 6 -28 -1 -23 -16 3 1 1 13 35 22 32 12
2428 12 24 35 14 -4 -20 -25 -26 -9 -41 -6 -8 1 12 21 -1 29 -11 -4 8 -26 -25 -22 -16 -25 6 32 57 28 35 31 54 42 20 26 9 -13 -7
2465 -7 -11 -18 -5 -15 12 -1 11 -7 -11 -11 -15 8 -41 -40 -15 -28 -9 3 -26 27 24 23 38 38 30 33 15 19 -5 8 16 7 18 -3 11 6 -21 -4
2503 -4 -4 -26 -21 -16 -29 -27 -45 -47 -19 -40 6 -5 3 -6 6 3 12 8 10 5 17 19 37 1 41 1 5 3 31 27 -5 -17 9 -12 -28 -9 -14 -20 -30 -3
2543 -3 -10 -22 -13 6 25 35 11 17 37 41 6 34 26 13 19 11 3 -20 -17 -15 -13 19 -15 -44 -5 0 -29 -20 -38 5 4 -4 -26 -4 3 14 18 7 5 31
2583 31 23 9 23 44 2 7 23 28 23 1 21 21 -19 -8 -11 0 12 -19 -12 -40 -9 -21 -27 -11 -25 -15 -10 -6 5 -13 7 7 27 57 39 17
2619 17 29 20 39 20 29 35 33 11 -5 16 10 12 -13 -15 6 -14 5 -6 -29 -25 -24 -17 -22 0 -2 -13 -6 -8 15 -12 25 37 23 -5 19 34 9
2656ImK4m8M0k3L6o0L7j7j1M0o2M5l9L8j2J7j3j8j6P8k2l9K2rJ2K1j2Mm6N1lk4
2689dK2j0Mlj9Nj3jj3OQMlK0J1qJ4rqJ3J7k9J1NnJPkJ4j4pJ7j1%kk2K2l2L1k7
2729a0k4l4L3J7pLK5j9NJ0j5lN0k8J6ok7O1m0K5j0K5j9jJ4k7J1nKk3j1j5J3nj4
2764c3kPkK2J4j2k8J8j4L2lMmnJ9ML8l3mJ7Kj4k1Lj9L2k3j4K4lMmrl0K2J0J6j5
2802dk3K4l3K8R%j2K9pQmJ8nl1J5k1j1mJ3Oj4K3j7j4RK0oNLj5k6L2rJ1J3Kk2K3
2840A3J6l3K1K5l7L0k8PmMMl9jJ6J7k9K0l1J3J6k4K2n3K1K1j2J6J0j1J2j9M4J0
2873C7k2K2m0RR%j6J6j0J0Jkj%oj6Jk0PK3k4Qjj3j1K3KJ6j0rOj1N6k2pNj2K8O
2912C2l3M5k0lJ0l1J4NJk5k3K3rK5j4k4Mj5K8j9L1j4K5k9J3rLrmJK0K6l8L7k9
$$ plain form
2656 9 5 29 -19 21 -2 34 -26 11 -6 -17 23 -39 6 -33 5 -7 10 -3 -21 -37 41 19 -20 2 -7 5 26 14 18 -28 23 20 -4
2689 -4 18 8 12 9 -10 -5 -18 -19 -32 -26 -18 -14 -17 3 14 6 20 11 3 16 33 4 15 20 15 16 23 21 35 21 14 31 20 20 18 -4 18 -14 17 -10
2729 -10 -34 -68 -35 -18 -25 -22 3 -16 -11 -1 -16 -19 31 3 19 13 -14 47 7 32 22 47 28 27 41 14 25 20 22 -1 -12 -27 -14 -19 -33
2764 -33 -35 -28 -30 -8 6 -6 -34 -16 -30 2 -1 3 -1 -6 13 17 55 22 18 35 37 23 2 5 -14 18 -5 -19 5 2 6 2 -7 -37 -15 -5 11 -4
2802 -4 -27 -3 -36 -8 1 1 -11 18 11 19 15 33 28 -3 12 -9 -20 -24 -11 -5 -19 4 -13 -27 -18 2 -4 1 4 -11 -37 -5 -14 -3 10 12 -10 13
2840 13 29 -4 17 42 5 35 7 14 10 14 18 -21 -22 -6 11 -18 2 -29 -16 0 -24 -2 -55 -34 -13 -25 -9 1 -10 2 -17 27 37
2873 37 15 37 -3 6 15 15 -1 15 5 15 16 14 13 13 7 -9 -8 -28 -21 2 -22 -14 -15 -28 -39 -16 -14 2 -8 -17 -11 -22 34 12 5 10 -2 26 32
2912 32 -1 44 24 21 31 0 14 19 20 -5 -28 -5 -14 11 -3 -27 -23 -38 -10 -29 2 -12 13 -16 -3 -12 -9 -18 -22 -21 -1 25 -13 24 -5
2947eMlJ3m5K1J3K0m8K0Kk1K6Moj4K0j0K1j4J2j1%L6l8L5m3L0Jk7N1l7OoPj7J3
2983A0k2Lj0J3oj9j3lL3k5M0k3K9j2j7M4j6j2NK8J0l1j2M5mj6k8L2lQj5k0K4j3
3017Dj3J3K1m8K6j6jlMk7M0j5LLMMRqj1J4J5J1jpPrkM0l3J7m1PJ8j5JK7j2m3J4
3056cL%%j0J9k9J9qK0j2Ol4L8LJ7l2J9lj0j2L3j8k8K1LMl8L1J6j8K7n4K7J6N%
3092A8j5oJ0OJ8k5k7J5K5pK2Mm3K8j2K0k3Rr%nk9L3k6K0j9L4k1J6m1K7o%Mj9L2
3128Hk7J5K1k1JK8l2L8%M0l5j6k5K8k4J0Mk6qOoLj7K7k0PJ4j2k0L5k7J9K7k6O
3163eRj1K5kj3rML0j8K2l5PK4Rmj5%J1j8j1k1%J8l%Rpj9jJ8j3J9J2k4J6j7K4j3
3201bJ3k2L9kj1mJ9j7%%j4J4Oj8ojRLj2j6OM9j8j9K9k7J0J1k7K9j6K8k7J4k2J7
$$ plain form
2947 -5 -1 -4 9 -36 -15 -2 18 -30 -10 -8 -29 -3 1 -5 -19 1 -9 12 -2 10 -1 -1 35 -3 32 -11 19 20 -7 44 7 13 7 14 -3 10
2983 10 -12 -9 -19 -6 -12 -31 -44 -47 -14 -39 1 -22 7 -5 -22 22 6 -6 -1 27 37 6 -6 39 35 19 -9 23 20 28 13 -7 17 4
3017 4 -9 4 25 -23 3 -13 -14 -17 -13 -40 0 -15 -12 -9 -5 -1 8 0 -11 3 18 29 28 21 28 19 17 57 24 41 0 7 25 10 11 38 26 -17 -3
3056 -3 0 0 0 -10 9 -20 -1 -9 11 -1 5 -29 9 12 29 -3 16 13 3 -9 24 6 -22 -1 2 6 -32 -1 15 -3 24 -30 -3 13 18 18
3092 18 3 -3 7 13 31 6 -21 -6 19 12 34 38 -5 23 11 31 8 17 8 8 3 -26 7 -19 1 -18 16 -5 11 -30 -3 -9 -9 -5 -24 8
3128 8 -19 -4 17 -4 -3 25 -7 31 31 71 36 20 -5 23 -1 9 13 -13 -21 -15 -21 -18 -35 -8 -28 -21 -7 -19 -39 -4 -31 -12 15 -11 -5
3163 -5 4 -7 18 16 3 -6 -2 28 10 32 -3 4 28 37 33 18 18 29 11 0 -21 -21 -3 -6 -6 3 -4 -23 -24 -6 -19 0 12 -12 4 -13 11 -2
3201 -2 11 -11 28 26 15 11 30 13 13 13 -1 13 19 1 -5 -6 3 6 -6 -22 -16 33 15 -4 25 -2 8 19 -8 21 5 33 6 20 -2 15
3237A5j4rK1Ppk1J7k2%j8K2J9j8J2pK%L1rnK0k6J0j5OK4mJ0k0j1J2Ml0L0k8Kj6
3274a6JK7Rk6Mqoj7M4Mk7J1k3L3k1rL5j1OJ7l3nK5K7j1k4L2k5NjlRk4K9l4jLP
3312Cj5J7Oj8kLJ2j6j2L5j9k8J6J3J9J6l6J5KlPkl4QJkJ9j3L3j6l0J2K9qNm1K1
3349cQ%k3NK6k2PJ3qk0K2J7k1K5l1J3LNk1Jqj0J1k2RRj1L2k1mK9j9KjJ6J4j9K4
3387B7l2J0J0J0Lk1K1Kj1j0j4mK3Nj3oj6J5j0j2j4K9rJj8jL8l%J8l6K2j0j2J4
3422djnQk2K4j7K5kJ9j8J4LnKl1R%qLj6K3Oj6%J5k2K5Pm3L8m3K3J8pk9K2K0%k9
3461a4K1j1M5m9K4Rk0k3J7j6lM1j7oLK4j7ppMk6K1jj8k1N5jJ8J6l6j0mJ9j3Qk4
3497a9J4MK9m9K2j9nMj4M8j8jj9K2k1J6rJK1lK6l6L%Kj0L6J0k8pJK7l4Qk3J5j1
$$ plain form
3237 15 1 -8 13 20 13 -8 9 -13 -13 -31 -9 10 -8 4 -3 -1 -1 30 21 16 36 10 20 5 11 35 31 41 21 10 22 26 -4 26 -2 0 -16
3274 -16 -15 12 21 -5 -1 -9 -15 -32 12 16 -11 0 -23 10 -11 -20 15 4 10 27 -6 -11 14 41 30 6 38 13 18 17 14 23 -1 28 -6 -7 -4 3
3312 3 -12 5 11 -7 -9 -6 6 -10 -22 13 -6 -34 -18 -5 14 30 -6 9 11 8 15 13 -21 -13 -12 -14 5 -8 25 9 -21 -9 20 12 17 -24 -3
3349 -3 5 5 -18 -13 13 -9 -2 11 3 -17 5 22 1 26 -5 8 11 16 -5 -4 -12 -22 -11 -33 -24 -15 -26 6 -15 -19 10 -9 -7 -8 8 22 3 27
3387 27 -5 5 15 25 28 7 28 30 19 9 -5 -9 14 19 6 0 -16 -1 -11 -23 -37 -8 -17 -16 -34 -35 3 0 0 18 -18 4 -6 -18 -4
3422 -4 -5 -10 -2 -24 0 -17 8 6 25 7 21 24 19 21 -10 -1 -1 -9 -6 -22 1 7 -9 -9 6 -16 9 16 -27 11 -32 -9 9 2 -27 -5 15 15 -14
3461 -14 7 -4 41 -8 16 25 5 -18 -1 -17 -20 21 4 -2 1 25 8 1 -6 -2 -28 -7 -8 -26 -47 8 7 25 41 5 -5 -9 10 -3 5 -19
3497 -19 -5 -1 28 -21 1 -18 -23 -19 -33 15 -3 -4 -23 -1 -22 -6 -15 -14 7 4 30 -6 -3 -3 -1 -11 25 35 7 0 1 28 -6 2 -21 -6 -17
3534a7jK1%ORm9j9J5lK2J8j1j8Q%MJ9K0J%J9j5k9K6l5J8qK7l5K1JpNJ8k3l3J7
3571hK5l5J4J2j8Rj5k0J0J3PJ1K%j9LQk%moj1L6j6lOj5L7j2RKKl2qJ9k2K1l3M7
3610A4j5Kk1K0j7L6l9L4k5kJ0kOk0L1k3J1J4k0K6p5P5k1J1k6RoJ2K1j5k5L2j5
3643cK3l4J9K7l0KqNNQPk6J5K8k8Oj2J0l9K5k1kL3j4rk7K9K2l6pK8qj4K4jOl0
3680b7N8m4R%K6K1k7Rj3K7j9jk9QK1k0L1l4L2k2r%PMl0OJ7Nk1j6L2l1J4%M7m3
3716a2J1okJ1K3m0PLJ7j1NJ5l9K9pjk0jJ4pJ2j1j0M6m1J5J0lOpj0K3qQk3J1qk
3754cJ2Pj1j0nqkkK7k6J8Nmj5K9k2J8l8M9KNkNl3J2jQMKj1Ok2J2kkOrK4j0j7J3
3795Ij5k%mOj7kL2k4L7m7M6j1%NJ1Pk4PoL3k5K4m4J8Rj3j3KLk3K5j8Ljj0PPJ3
$$ plain form
3534 -17 -18 3 3 9 18 -31 -50 -35 -38 -16 2 -9 -27 -19 -19 -15 4 24 25 25 44 29 0 26 -9 9 1 28 -7 14 15 8 13 31 8 -25 -8
3571 -8 17 -18 -4 8 -10 -1 -16 -36 -26 -13 -6 5 7 7 -12 -9 -1 -3 -3 -7 -13 -24 12 -4 -7 -1 -16 21 9 18 20 22 -10 -18 1 -21 0 -33 14
3610 14 -1 1 -20 0 -17 19 -20 14 -11 -13 -3 -5 1 -19 12 -11 0 14 -6 20 -55 20 -1 10 -16 -7 -13 -1 20 5 -20 12 -3
3643 -3 20 -14 5 32 2 4 -4 1 6 14 21 -5 10 38 10 16 4 14 -25 0 -21 -23 10 -4 -13 -40 -11 11 -25 -32 -4 -12 -26 -2 -3 3 -27
3680 -27 31 -13 -4 -4 22 43 16 25 12 39 20 19 -10 -2 19 -1 30 -4 28 6 -3 -3 4 8 -22 -16 1 6 -15 -31 1 -30 -16 -16 31 -12
3716 -12 -1 -7 -9 2 25 -15 -8 -5 12 1 6 21 -18 11 4 3 -17 -18 -4 -11 1 -10 -20 26 -15 0 10 7 13 6 -4 19 11 19 -4 7 -1 -3
3754 -3 9 16 5 -5 -10 -18 -20 -22 5 -21 -3 2 -2 -17 12 -10 8 -30 19 21 26 24 29 -4 8 7 15 19 21 10 16 -6 6 4 2 8 -1 23 13 -4 9
3795 9 -6 -8 -8 -12 -6 -23 -25 7 -17 20 -27 19 8 8 13 24 31 7 14 8 41 16 40 -4 14 23 10 -3 -1 2 -21 4 -14 -11 -12 -22 -15 -8 5
3834Ek3lJj2L5j5LkPK0mrk5K4Rj3L4m7K1J3k1j7J9LqPO%k4K1J1j0Rjj2NLj7Jj
3874gJ5j7LJ9JJ3k5lNkkjOrmj2J0j9O4l6J9j9lJ5pj5l%L6j5J6j0j2L4n0K6J8k6
3912Cj9L0j6J8ln4N7k6J4Kj3QRk2j5K0Kj8K8k1L5l6J3%mkJ8OqJ1K1ok2oJ0j2R
3949A1K9j3j8L0ok2j7oqJ7Qll%j5j4L0j1MkmJ4nJ5KLj7L1j8J8nj1%J7Qn5L6pl3
3988b0J6MK6l1lK5J3n3K4%j6L2j5QoMJ9m9N6m4OL0j6K0j7Lj6M1n3jj6N0m0K0k9
4023b8L8rJ5OJ2o4L2J7j8K4k0oJ0Nnk1L6j5Kj1kmj6PNMj3Oj3J1lojmQOL7l3J1
4062@LJ3J2j9PNj9J7j7MJ8k2L6k9lJ5k8K9Mk7LJ7Nrk5J4Qj3j9M4j5j8j7KL0l2
4098b6M3mk4J8j5LkK2j7mM0l4J1j2J4K5k5k7J8J9j3j8QK5l4KJ8Oj2qK2k4J3j2
$$ plain form
3834 5 -18 -21 -20 -32 3 -12 -9 -11 -4 16 12 3 -22 2 11 -2 32 -15 6 19 -2 -19 0 3 -5 2 8 8 -16 5 16 6 15 14 2 7 10 -7 -6 -7
3874 -7 8 -9 -6 13 14 27 2 -1 4 2 0 -1 5 -4 -8 -20 -10 -29 35 -1 18 -1 -4 11 4 -11 -14 -14 22 7 23 13 1 35 -15 11 29 3
3912 3 -16 14 -2 16 13 -41 16 -10 4 6 -7 1 10 -12 -27 -7 -5 -23 5 -16 19 -17 -4 -4 -8 -10 8 14 6 17 38 32 10 4 14 2 11
3949 11 40 27 9 39 33 11 -6 -12 -20 -3 5 2 -1 -1 -16 -30 0 -11 -7 -9 -13 1 -4 11 13 16 -1 30 12 30 25 14 14 31 39 -16 20 13 -20
3988 -20 -4 0 26 -5 -8 17 30 -23 1 1 -15 17 2 10 4 8 27 -22 34 -10 -4 26 10 30 13 16 0 41 -12 -13 -29 21 -19 1 -28
4023 -28 10 1 16 22 34 -30 2 19 1 25 5 -1 9 14 9 -12 24 9 11 0 -2 -6 -22 -15 -10 -6 -19 -13 -26 -15 -18 -24 -25 -29 -21 -15 22 -11 0
4062 0 3 16 28 9 16 21 2 19 2 6 24 2 38 9 6 21 -7 22 26 -1 2 19 24 15 -10 4 12 -1 -20 24 9 -9 -26 -24 6 -26
4098 -26 17 13 -11 7 -8 -5 -7 15 -2 -6 34 0 11 -1 13 38 13 -14 4 23 10 -8 0 25 -9 -7 11 17 5 -3 19 -5 8 -4
4132dQk7L5Oj6J2qk0J5JkKN%k3PJ1ooJ8k2J7J6J1m2J5j5J6OJ6kj1Nk8L6l7K2J9
4170C0k4j3K1pk0J3K5j6k2L0k4j4JJJ0J1J0n2K6K0j8J0LkJ8k0J6rj5K4NMK4n2
4204f%K7Jl8K6j4PnP%j1Mj7J5j9lj5N0nl1J0K3K0j6j2J6j0NnJ2Pk0NJ7qj6L2j3
4242B0k9J3J2k1J5k4M9l0Rj9k2N2m7K0kJ8L8o4nJ2oKK7l8kK9jj9L3l4K5Lk6L4
4276B2k1J9k4k0J8J2j6J2m2L3pJ3JlK6j7Oj0Ql4L4prL6n3L6oK2m1PNj2lORj1M
4313gJQQj6NJ2Pql1PK3J4nj1MnjRNQk0KQnMnj2JjOk4K4k8K8j2K2m0J0nmL4j7j9
4356b6K4J2pj9PpK5j1J6J1j3k3J7%pJ9k9K4j6K1Kj7JJ5rlNl0K8rJ8j3j9K7l9m
4392b9L1k8J6%lJ1J2l5K2J5Pj9k0L2m2K9J5J8l0j1J8pK1ol3ML9j7JRj7J9j9MJ4
$$ plain form
4132 -4 4 -23 12 18 2 14 6 -14 1 2 0 2 7 7 -16 -9 2 -4 -10 8 -14 3 19 30 -12 3 -12 4 10 26 24 13 18 -10 26 -11 11 30
4170 30 6 -7 14 7 -13 0 25 9 -13 17 -7 -21 -20 -19 -9 2 12 -40 -14 6 -12 -2 1 -1 17 -3 13 4 -11 13 18 22 46 -6
4204 -6 -6 21 22 -16 10 -4 3 -2 5 5 -6 -2 -19 -4 -23 -26 -41 9 4 -27 -17 6 26 10 -2 14 4 9 4 16 23 3 8 25 17 1 33 20
4242 20 -9 4 16 -5 10 -14 35 5 14 -5 -27 25 -22 -2 -4 14 52 -12 -17 -5 -11 -9 18 -20 -22 7 6 -13 20 -14 11 14 -12 22
4276 22 1 20 -4 -24 -6 6 -10 2 -40 -7 -14 -1 0 -3 23 6 12 2 10 -24 10 3 -6 30 -23 13 7 29 -12 -5 0 -12 -15 -9 0 -11 -7
4313 -7 -6 2 10 -6 -1 11 18 10 -21 -14 9 23 18 7 11 6 5 14 19 27 7 9 17 12 16 11 -1 0 -1 5 -19 5 -23 5 -7 15 -25 -15 -20 -24 10 -7 -26
4356 -26 -2 10 3 -16 -9 -16 9 -2 14 25 12 -11 6 6 -1 18 -11 13 -3 18 20 3 4 19 10 7 12 -18 10 1 19 6 -13 14 -25 -29
4392 -29 2 -26 -10 -10 -13 -2 10 -25 -3 12 19 0 -20 12 -30 -1 14 32 2 -9 9 2 23 17 -16 -12 27 10 11 20 3 22 3 7 21
4427B1m5M6k2J3rOk3J6j1oL0k3mk9K1L8l1K6mk5NmK1j0K1j2JJ1lj7N0k2j2nnR
4463A3Jj7K6%j3j5J5k1J0j8Qj0J5Om6O1m9M2m1L5j5J2LNJ8j3nk2K1j0j9L1k3M1
4497B6k2J3j2j2K0lppK2nl5PQL4kk5l2LK6j7M2m6L4k0OOlk6K4j6K5Nk2QJ2Ml2
4534a9OoK1J4Rk7J2k3K6j5K7m0L7mpk8OJ8Onj9M5l3j6RK4mj8J2k8OJ5mk0J3j4
4570b4K2Rm0K2pJ0kK0j0J5k0J3Mk0K1J1j9j6J5L9k1j7j4J9mj1J0oj9OPkqL3k8
4605a2J2nLPk1mJ9%jQkj1LJ0LJ5k5N%J8J4j7KkMj1mOj0k0J7j9K7KnJ6n2K9J5k
4645A2Pl1L2nrlj2pK8j0ljPn%jL4l2L4j8qj1J4NrPjLk1Qj6PJ2mmJ5j4jJKJ0nk7
4688b0L6k7QJ5j5j9L7j8k3J8j5K6K4l1pJ2Rj0J9j7J0K6m1J5Jj6L5k3kJ0J0j7K
$$ plain form
4427 21 -24 22 0 13 4 10 -13 3 -8 -14 16 -7 -11 -40 -19 19 -12 14 10 -15 -10 -14 7 -3 18 6 7 18 15 -2 48 26 14 9 4 13
4463 13 14 -3 23 23 10 -5 10 -11 -1 -19 -11 -21 -6 0 -46 15 -34 8 -33 2 -13 -1 2 7 25 12 7 -15 6 -4 -23 8 -15 26
4497 26 4 17 5 -7 13 10 3 -4 18 13 -22 -15 -7 27 25 0 -32 -29 -3 -20 22 -24 10 -10 -4 2 -1 -27 -3 -19 6 11 -11 -3 9 13 -19
4534 -19 -13 -19 2 16 25 -2 10 -13 13 -2 25 -15 22 18 11 -17 -11 7 13 8 -11 34 1 -15 -6 18 14 -4 8 -20 -14 1 -3 -23 -10 -24
4570 -24 -2 7 -33 -11 -18 -8 -10 10 0 15 -5 8 12 -8 13 24 5 -11 4 43 22 5 -9 10 6 -5 5 -1 -20 -14 -7 -9 -17 16 -12
4605 -12 0 -5 -2 5 -16 -20 -1 -1 -2 6 4 -7 -4 6 9 24 -1 4 4 22 36 19 21 19 23 12 8 14 4 -16 1 -18 9 11 6 22 -30 -1 14 12
4645 12 19 -12 20 15 6 3 -9 -16 12 2 -1 -2 5 0 0 -1 33 1 35 17 9 -2 12 17 8 15 14 17 -4 4 -12 -5 7 3 -1 14 0 -1 0 2 12 7 -20
4688 -20 16 -11 -3 12 -3 -22 15 -3 -26 -8 -23 3 27 -4 -11 1 10 0 19 2 12 38 -3 12 13 -3 32 9 7 17 27 10 12
4721A2J2j6j3J9j7mJ9K0l9Pj7Mk2J7J7j6J1jqJ8Lj5j0J8K0j3Jk1OL6J1m1J2Lk
4756A1J4Mk4rmK0j6J9k6J4k1K2k6K6qk3M2k0NNmlk3RK3lJ3j5Lk9L9j6KRlk4J7
4793@k4M0J1j8mJ9l3%K6ll1J8KJ6k1JkK0n2K0L6om4K6J7l6M1l5KJ1Nj9QPmj3L9
4830B0k2k0J9kJ3k0L5Kpk9L3Pm0PK0OJ4l3j4K7rmm%lJpJmMj0J1Lk1J6j7K2j6K0
4869ajkqJK3l2K1K2J4n0K4k5J5k5N4Lm0L8j3oj0oJ8j2K2kn0K6mK7j2j2J1j4J8
4904A2j0l4N7l8K9l0L0Pj7pkJ9j9K8pJ%n4M0Mj7K1qK3l3J6Kj4Jj5KL9prj3lK5
4941A9j5l4M0j4RJ0j9jJ7k7LJ8J6k9J5j1J1jlRkj1J9j2kJ6Nk3QoJ4Jok9J4K7n
4978B1j0Rk3LNmokKj2J4K3m2K8j7Nj4K7l8L7k0L3l8NJM0j7%K6l6J6j5K2LQj7Q
$$ plain form
4721 12 24 8 -5 14 -3 -7 12 32 -7 0 -17 -13 -35 -18 -1 -17 -6 -7 -15 3 6 -9 -19 -1 19 6 7 -14 -8 28 39 -2 10 13 11
4756 11 25 29 5 -4 -8 12 -4 15 -11 3 -18 4 -22 4 -4 -27 15 -5 0 5 1 -2 -25 -16 7 4 17 2 5 -24 15 -1 1 10 7 -17 0
4793 0 -24 16 27 9 5 24 -9 -9 17 14 -17 1 3 19 -2 -1 -3 17 -35 -15 21 15 -29 -3 14 -22 19 -16 -14 -3 2 -17 -9 -2 -6 -19 20
4830 20 -2 -22 -3 -5 8 -12 23 25 18 -11 22 29 -11 -4 16 22 36 3 -11 16 7 3 -1 -1 -4 -3 -10 -9 -13 -9 -19 -8 -5 -26 -10 -27 -5 -21 -1
4869 -1 -2 -4 -12 -11 12 -20 1 23 37 -13 11 -14 1 -24 30 33 -7 31 18 12 2 -4 14 2 24 22 -28 -2 -6 21 9 -3 8 -6 12
4904 12 2 -32 25 -13 16 -14 16 23 6 -1 -3 16 -3 25 18 19 19 -35 5 9 -8 13 5 28 -5 11 13 -1 0 -15 -13 26 19 10 -3 -6 19
4941 19 4 -30 10 -4 5 15 -4 -5 12 -15 -12 6 22 -7 8 -3 8 7 4 13 11 0 19 7 5 21 26 3 11 5 19 20 14 -15 -1 26 21
4978 21 11 20 -3 0 5 1 -5 -7 -5 -17 -3 20 -22 6 -11 -6 -20 7 -31 6 -14 19 -19 -14 -13 27 10 10 36 0 16 1 23 26 34 17 25
5015B5kqMj7RmJ1k2O%J3l2L5k4j4J3NJ9knk3j9kRJ4K0QjPl2K0J7j9oJ8l3MJ4K9
5054C5k0j7K4qj7N5o2J8qQkpJJ3olj4J1%Ok1LK6Rj6kK0k4k9j7Q0j9qj2pQOMmj1
5094gML2l7N1k5pJ4j2j2lK1%mJmRj6lLnJ4pj3Oj3LMPj8K3j4j4J8NlJ2q%JK8l6
5135emKjL3kJJ7jl6K7l1K0J3k5%j9NJ7k7K0J1j8pj5L7j6J0j4j1pM3k3J3k3K2k1
5171a5K2K4l4pJ0L8n0JJ3L3nm1N5n3K4jJ4Lpj9k0K2K5l1%qj3K5MRMkl0J2N%J7
5208B4J3k0j9j9j0K7Lj4%oL3pqk6J1J8k2M7j7J9j3J4jl4M5j8prrNNPj6j3J7lj
5245dJ0j6LNnoRJJ3lqoOJ6oqqK0NNj1%k9L3lkM7p2J5%Ok0L0k9J1J0j0njl5O1k6
5287gk1K1QNj1OP%%QmmlJrJ1l6L8K0j2qJ8l5K2Kj7kK7l2RK7l1J5j3k2L3L8m2o
$$ plain form
5015 25 23 15 19 2 11 7 18 -4 2 2 15 -17 18 -6 -20 -7 -2 17 15 10 -13 -32 -34 -25 -11 9 17 16 23 -9 11 28 9 3 21 -12 -8 6 35
5054 35 15 -2 22 14 -3 52 -10 8 0 8 6 -1 0 13 7 4 -10 1 1 7 -14 -11 15 24 8 6 26 2 -27 -44 36 17 9 -3 -10 -2 4 8 4 -7
5094 -7 -3 29 -8 43 18 11 25 13 1 -2 19 19 15 16 12 21 5 2 5 0 14 7 -6 0 -13 -10 -6 1 -17 6 -8 -22 -4 1 -2 10 2 2 3 31 -5
5135 -5 -9 -7 -8 25 23 24 41 40 4 31 0 20 33 8 8 -11 -6 11 -16 4 15 -3 -10 -25 12 -4 6 -8 -19 -26 17 -6 7 -16 6 -15
5171 -15 7 31 -3 -10 0 38 -12 -11 2 35 30 -11 44 -9 15 14 28 31 24 5 -15 7 32 1 1 -7 -20 5 9 18 22 20 -10 2 7 7 24
5208 24 37 17 -2 -21 -31 -4 -1 -15 -15 -21 12 5 -3 -29 -18 0 -22 25 8 27 14 28 27 -7 38 20 13 4 -5 0 5 12 -4 -17 0 -3 -4
5245 -4 6 -10 -7 -2 -7 -13 -4 -3 10 7 -1 -7 -1 15 9 1 -7 13 18 23 12 12 -17 16 13 11 58 -14 1 1 7 -13 17 -12 -1 9 -1 -6 -7 -42 19 -7
5287 -7 -28 -7 1 6 -5 1 8 8 8 16 12 8 5 6 -3 8 -28 10 30 18 10 28 -7 15 17 0 -2 25 -7 2 29 -2 13 0 -22 11 49 7 1
5326Aj9QK6j3J0j7j4J2k0L4oJ1j7jl1O5k7pK6l2K3lK0l3J3J4rmk8L6k4K2J2j1
5360A7j5j3L5j2Jj1KlKRnnqlj9K8K2m4K2Nk7J7J9k4J9k2PJ5j7J6l5L1lNk9K9L
5397IK3k1j2K3k6K5%l3RK3k1l0M5k3OJj6ML2m0L2k9J2J7QrpJ3j0MpK9k5L2l9L2
5433C1j4j4K9rjj1j8L3qRk2l4L9l0L6m7M6rk7Kj1L6J0k3pL4kqqj1l7N1k0J8J6
5468A9k7kJ6j5K7j4JK2l4J5kJ6j0Ql1L4k5N2j1j1nJrQnKKnk4K4j8plmJ8J0J1k1
5506CmnQoJ8k3%L0k0J1jJ4k2j7N9l5lJ2j5K1rk0K2J9n4kRNrK4j3KMj8J7mOl5J4
5545a7qJ2J1j5K3j3J2oKNmOJ4l0M1j3J6j9%l0K0k2K3K3m0Qj2K1%k5L3j4K6l8n
5580a5nOJ4j5QK8j0k9K0j2L3n5M2j0J8k5j5K4Q%k8J4Qoj4M1k2K0o3M3jjJ1qKk0
$$ plain form
5326 1 -18 -10 16 3 13 -4 -18 -6 -26 8 2 13 -4 -5 -36 29 2 -5 21 -11 12 9 29 -4 9 23 14 10 -18 18 -6 16 28 17
5360 17 2 -11 24 12 13 2 4 1 3 12 7 2 -6 -9 -28 0 22 -22 0 5 -22 -5 14 -10 9 -13 -6 9 -8 8 -27 4 1 6 -23 6 9
5397 9 32 11 -1 22 -4 21 21 -12 -3 20 -1 -31 14 -9 -3 -2 -18 -14 18 -22 10 -19 -7 10 18 9 2 15 5 9 2 31 6 38 -1 31
5433 31 17 3 32 23 22 11 -7 26 18 27 5 -29 10 -20 16 -31 15 6 -21 -19 -30 6 16 -7 -14 20 18 10 2 -9 -46 5 -15 3 19
5468 19 -8 -10 6 -9 18 4 5 27 -7 8 6 22 12 20 -11 23 -2 50 39 28 23 24 15 23 18 20 22 17 -7 17 -1 -8 -11 -15 3 13 24 3
5506 3 -1 -6 2 -4 14 -9 -9 21 1 12 11 25 3 -14 45 10 7 19 4 25 16 -4 18 37 -17 -19 -10 -5 -14 10 -3 -1 3 -15 2 -2 4 -31 -17
5545 -17 -25 -13 -2 -17 6 -7 5 -1 1 6 2 8 22 -8 33 20 36 17 17 -13 7 -15 8 31 -9 -1 -13 8 8 -17 16 2 28 -10 -15
5580 -15 -20 -14 0 -15 -7 21 11 -18 2 -10 23 -32 10 0 18 -7 -22 2 10 10 -18 -4 4 -2 -16 25 3 23 -40 3 2 1 12 4 6 -14
5616a4K8j5OK5l0MJ3j0kj2K7l4RMn%OPj3Rm0K4RK6j3j5pK3Jj1K3k8J4j4LK3k1
5653@J2O%QlJ3j7LnJpqj3nK4k8J5oJ3j9RpJ3mKmqQoJ0J4kj9RM0j0j0J5k7LnRP
5696B1l0M1j5J7j9nqnJ3nk3J6J9l1L4m1Rj7K6kOLrJ7kl3J5J1J1Rj6J0Lrj7KJ6
5733A2KolpJ8o%K0m4L9j0lk7LM0k0j0J2k1K3Oj7j8lJ1K9oK1n3J7j4J7qLQl1J2
5770a4K0mj6nO1k2k0J0K2j9qJ5pmJ4lk0qK1lnOqj2jPrL3rk2L5j2l6K6k6OMPj3
5809a9K6%qJ0Rj1MoOj7PJ8lk6M0qm1M0l1L6k3j5K5llj2j1J5Kk2L0l4K5J0rj0J2
5846CPj0J4k5RKoj8J3J8J6k8j8K1pK5Mpn1M2pPk3K3l1K2MMJ9j4mj0kL3n0L0mk
5884aj2orMQl0K5J7NJ0m1JJ5nJ9j9QNK4Qm2K2rKj2L8m0L0j1RjLj1J3J3rj1pj8
$$ plain form
5616 -14 14 -1 5 30 0 4 17 7 5 -7 20 -14 -5 -1 -6 -6 0 7 -6 3 -37 -13 -4 22 9 -6 -13 10 11 0 23 -5 9 -5 -2 21 0
5653 0 12 18 18 26 23 36 19 22 17 18 11 3 -10 -15 9 -19 -4 -10 3 -16 -7 -14 -1 -5 -3 -7 -15 -7 -13 -3 11 9 -10 -1 39 29 19 34 7 10 5 14 21
5696 21 -9 32 17 34 15 10 2 -3 10 5 -18 -2 17 -14 20 -21 -12 -29 -3 -5 1 4 -5 12 10 -23 -8 3 14 23 7 17 20 11 -6 -4 12
5733 12 14 8 5 -2 16 10 10 30 -14 25 15 12 -15 -12 28 8 -2 10 -11 12 18 1 -17 -20 -9 20 14 35 -18 -1 -15 2 -6 -3 5 -26 -14
5770 -14 6 2 -14 -19 42 20 0 10 32 13 5 20 13 9 23 20 0 -8 13 10 5 11 3 -9 -10 -3 -12 21 12 -10 25 13 -23 3 -23 -17 -13 -6 -19
5809 -19 7 7 -1 9 18 7 11 5 11 -6 1 19 16 -10 30 22 -19 21 -10 26 3 -12 13 10 7 -5 -16 -1 1 -21 9 -25 0 10 1 -9 3
5846 3 10 0 14 -11 -2 0 -6 -24 -11 7 23 -5 -23 -2 -9 16 20 13 -38 4 -3 4 -19 4 -27 -5 -1 3 22 8 4 -6 -8 25 -25 5 1 -1
5884 -1 -13 -19 -28 -24 -16 -46 -21 -4 1 11 -30 -29 -14 -19 0 -19 -11 -6 18 26 -16 6 -3 -1 -13 25 -15 15 4 13 12 15 4 17 30 21 10 3 -15
5923a5lmL0qPom8M5qJ7k1kK1mLk5L7%kLk3J1J8j2Rmj3K9m5K1k0K5mj1rK5%l7K8
5962Ejq%J0k7K7k5L1JJk5j3QJ7Lj1M1l5RJ4k6J9k3K5m7N0Nj1j7J0j6J4j1qPj1
5998a8M7Jm1J4j6Oj2K7j5j4K4m1O6ql1NkJ0KJk1K0j6j0K1M7n1jMj4L3mj4MQK0
6034C1l2OkJ0Lj7pJ3jmJ7j4MroMj0J2j2JpJ5j1Pk0K7QKl0K9LLJlpL2l4J1j7J2
6074HqmNk1L1pK5j7Kjj0p%Lk6J7j0nK1jpJJ2j3J7j2J9qpJJ6k0rK2j2qJ2K1lKk2
6115cMRj3Noj9K9qJ3mj0okM3j7l7J9K0j9MpqJ4OK7m0LKLl8K8j6K1m3N4Ll8J3J0
6154dJ2Om1L5R%j6K3j1lL3l9L2j2j7j3QNJ9rj6Jj2J7Pj0Q%j9J4k0M%n4O8J2k4
6191gKJ9J3k3j2mL0k9QJ2j3kLlJ2RJRj8lK3l8K3k1oJ1j4J2nJ8j9k1qK3K2Ok8K8
$$ plain form
5923 -15 -18 -22 8 0 7 1 -47 -2 -10 7 -14 -16 5 1 4 -21 16 16 14 17 -6 5 23 11 20 16 3 32 -13 8 -12 13 9 -2 -11 14 14 -23 5
5962 5 4 -4 -4 6 -21 6 -19 12 13 14 -11 -24 -16 1 4 -7 34 -1 8 22 -4 15 -8 17 -30 20 25 14 -3 7 -9 5 -6 -14 -7 -18
5998 -18 29 30 -11 3 -13 -7 -19 8 -7 -21 3 -38 28 20 -11 -6 -8 2 4 5 -16 4 -12 -22 -1 46 -5 -6 -2 -16 17 13 -1 3 11 31
6034 31 -1 5 3 13 16 -1 -8 5 4 0 17 3 7 -2 -8 -4 -14 -2 -14 -13 -20 -5 -16 -9 -29 -2 6 8 -22 7 10 13 14 11 4 36 2 13 -4 8
6074 8 0 -4 1 -20 11 4 29 12 14 13 3 -4 -4 -1 -27 -10 -20 -25 -4 -5 -12 -11 1 -12 5 -7 12 4 -3 -2 14 -6 -15 7 -5 -13 -1 20 17 19 -3
6115 -3 1 10 -3 2 -4 -23 6 -2 11 7 -3 -9 -11 32 15 -22 -3 17 -2 2 -5 -13 1 7 34 -6 -3 -1 2 -36 -8 -24 -3 -46 8 11 -27 -14 -4
6154 -4 8 14 -27 8 17 17 1 24 13 10 43 4 36 24 7 -6 2 7 26 17 1 2 -10 7 14 4 12 12 -7 7 -13 -9 -9 -63 5 17 -7
6191 -7 -5 14 27 4 -8 -12 18 -11 -3 9 -4 -6 -3 -6 6 15 16 25 7 4 27 -11 12 -9 -15 -4 -18 -6 -11 7 -12 -33 -41 -18 4 10 -18 10
6229A0Lj2j4K1qj3QJJ6j9j4K2jnJ1OnnLJ3qJ4k0J4j0k9L0Nqj3J4k3L7m9J7L8l1
6266dK5j4Jj7j9L1Om1M0Rm1L8j7K0k1lJJ2Qk3j5QL8lk1j6K3Ok1JJ5oj6L4J1pk
6303B0LJ3l3k4L7j7ojK0Kok0K2k5J6qL0m4J0J3j8M4k5L0n1N1k8K1k%j2lL1n6K8
6338A2Lk0K5J4nj9Ll6L5rRk1j6OK6j6K6j0mj6L1j1Ol9J0J4J0P%j0j0JK1j4j6J9
6374FqkJlMJ1k1J2NqM2l6jPQk3K5n9L6kqJ8J9j7k0nKJ7nJ2k1J1J6k0LQk0L6k1
6413aJ3j0j0Rk1M8k9Kj6K%J1J4j7K1k1MJ2j3K7k9%jMMJ6k9RpmPj4K3j8J3rj1L2
6451A1k4%QK5j4pJ0pLQJj5J9mk3J3Qj0JJLrK9k0j6Lk7M2%j2nj3L5j6J4l5J4kJ4
6490Cj6Jj4M3qkoj6J7pQj1J8Qj6oJ2jpjJkj5lJ8K1pll7J4MJ4k3lM2j5%k2k4M3
$$ plain form
6229 10 13 1 -13 8 0 -13 -5 -4 12 -7 -21 1 0 -5 6 12 7 2 5 18 10 24 4 18 8 -21 9 14 6 -7 7 -16 21 -28 -11 27 -4
6266 -4 21 7 8 -9 -28 3 9 -32 8 17 -24 14 -3 17 -4 -7 -6 6 14 -9 -24 -16 22 19 -2 -18 5 11 -10 -9 6 0 -16 18 29 22 20
6303 20 23 36 3 -21 16 -1 -7 -8 12 14 8 -12 10 -15 1 -7 23 -21 -11 2 -16 28 3 33 -18 33 5 26 24 24 12 9 40 -16 12
6338 12 15 -5 20 34 29 10 13 -23 12 3 12 -9 -25 -19 7 -9 17 7 3 -13 18 7 13 -26 -16 -2 8 15 15 5 -5 -4 17 3 -13 6
6374 6 -2 -4 -3 -6 -2 9 -12 0 5 -3 39 3 2 9 17 -6 19 -40 -4 -6 -14 4 23 6 -14 -19 -17 0 -5 7 -14 -3 13 -7 -4 4 -16 20 -1
6413 -1 12 2 -8 1 -20 28 -1 1 -15 -13 -13 -2 12 -5 16 -5 -1 11 -2 25 -4 -4 -5 -1 3 19 -10 -1 -8 -12 -5 -19 4 -14 -1 -10 -21 11
6451 11 -13 -13 -5 20 6 -1 9 2 5 13 14 -1 18 14 -9 4 12 2 3 4 7 -2 27 7 -9 -6 -33 9 9 -3 -8 -21 14 -2 12 -23 -9 -11 3
6490 3 -13 -12 -26 17 9 7 1 -15 2 -5 3 -8 10 18 2 -4 8 7 0 -1 0 -2 -17 -20 -2 19 12 9 -28 -14 -10 4 -19 -22 20 5 5 -17 -41 2
6530BMlj6KLoJ6rOqJ1l8N7m0N7m5J3j3OJ7K6j6rj7j5M2l2Nj1J6kPl6K8q%Pk5l
6569b7L5Ok8J2J2m3N8m8J7J0n%Onj0lK5rJ8kJ2k1qJ4oj7K3rRoJ5k3j7L3k2j1K5
6606A0kqj2MqNK4l7J1k7N0J5l7J3K4l6J3JJ1njk1J3kJ0qRK1j9KnlK0oj3k9K7P
6644A1j9k6K1Pj5J7pj3JJ1J0pqPrL0j4J0qo%j8K2jJ7j7nLJ8MJ0l4M9m5nK6JRk7
6683@J4j1oJ4j7%k0J6K4nk1KpJ7j1Mj8L8j8J6p4L2NJ6MJRmnK1Jk0J8qrrkPK6r
6723A1j8%J2j9L0l2J5Qmj3mj0QJ0LmLk1L6j1l9N8lm9L6Lj9%M2l5L2k7NJ5%qJq
6761Dk3M6rk5mJ5NQj2j0k2K4j8K4k%J2m9NL2Oj9OnJ7j2LJ%qK2k6qM1m2L5lj2J8
6800A5J9m9J4J4j0POj8jOLj0L0rk1Mm2N3j3lJ0nj5J5nMJ2l6J3J0j9QK1l6K0L7
$$ plain form
6530 2 6 3 -13 -11 -8 -14 2 -7 -1 -9 2 -36 21 -19 38 -7 6 -7 -1 16 42 26 17 0 -15 27 -5 0 -11 5 3 10 -26 2 -6 -6 1 -24 -27
6569 -27 8 14 -14 -2 10 -33 25 -23 -6 4 -1 -1 5 0 -10 -13 12 3 21 19 31 10 2 16 10 -7 16 7 16 10 25 2 -15 18 -4 -15 10
6606 10 8 0 -12 -8 -16 -11 13 -24 -13 -40 10 25 -12 1 25 -11 2 3 14 9 8 -13 0 -2 8 0 9 30 11 13 8 5 25 19 6 -23 4 11
6644 11 -8 -34 -13 -6 -21 -4 -11 -24 -23 -12 -2 -9 -17 -10 -19 11 -3 7 -1 -7 -7 -25 -3 -4 13 -4 -9 -6 12 16 26 -8 41 -4 -9 17 18 27 0
6683 0 14 3 -3 11 -6 -6 -26 -10 14 9 -12 -10 -17 0 -11 -7 -25 13 -5 11 -63 -31 -26 -10 -6 -5 4 0 -5 16 17 -3 15 7 -2 -11 -13 -6 20 11
6723 11 -7 -7 5 -14 16 -16 -1 7 3 -10 -14 -24 -16 -6 -3 -7 -4 -25 11 0 -39 19 16 -33 3 6 -13 -13 29 -6 26 -1 4 19 19 11 12 4
6761 4 -19 27 18 -7 -11 4 9 17 5 -5 -27 -3 -21 3 1 1 13 -36 -31 1 7 -12 -6 -11 6 -6 -3 -2 -2 -10 12 -14 -22 19 -23 12 9 -3 15
6800 15 34 -15 -1 13 3 10 16 -2 -3 3 6 -4 26 17 -4 0 -42 11 -2 -5 5 0 -15 0 -5 -1 11 -25 -12 -2 -21 -13 8 -28 -8 29
6836B9l9OMj2J7qJ7pNj1L2j7k6%Nj2J8k5K7oOK3k7j8J5j0J7oj4K4l3L1j6lMj9
6872b9mN0j5K0j6Kj9PL0l5nNJ5K2k9qJ4K3k8J3J7k8Oj9j6K8j0OJ2j7J5j7lnJ7
6907anKk2L3j0K4l4J7J5k0l1J6QQrkJ4k1J9%j0J4k3K8j0qK2J0l6L3l1PnPk0mN
6944b0K6m2M1qk0L1j9J3j3j8L3j5k6K8MJ9j7k1RNJ4jJ8j0j5K5m0K5j2K9k3K4j7
6977GKoNLJ9k1qJ6mpLk4J9j1Rl2M6kk8J5KmK0m5K2NNj5J3J1m8K3K0mpj9L5j5N
7016EKJ1j2rMJ8qj4qK8jk4KjmNJ1j4lMjJ1J2l9J8kMl2N0k5K6k8RJ9ol0K7J1%L
7056A9nlj5Mj0lL7j4LPjj1J1l2K0J3rk7J4LPJ%j8oJ7l2J2QKK9k4J4pJJ5j5rJ7
7095A3j3K3k3K5j9%ok8N1j3k3J9qK9k0nmlm0L4KlR%Pk8j8NJ2lL4rnJ6qqk3L6J2
$$ plain form
6836 29 -10 -4 0 -12 5 -3 14 7 12 1 33 16 -10 -10 -5 -17 1 -24 3 -3 3 26 -1 -19 -4 -14 3 -3 -17 7 -26 5 -11 -14 -10 -29
6872 -29 -33 17 2 22 6 8 -11 -4 26 -9 -14 -9 6 28 -1 -9 5 28 0 13 30 2 8 -11 -27 1 -9 -3 9 -8 7 -10 -13 -18 -1
6907 -1 -6 -4 -26 7 -3 21 -13 4 19 -1 -32 -16 -8 0 -9 -11 3 -18 1 1 -9 5 -18 10 0 -8 14 24 -12 21 -10 -3 -8 -1 -21 -25 -20
6944 -20 6 -36 5 -3 -23 8 -11 2 -11 -29 4 -11 -37 -9 -5 14 -3 -24 -15 -10 4 3 21 11 -4 21 -19 6 -6 23 0 24 7
6977 7 9 3 8 11 30 9 1 17 13 6 9 -15 4 -7 2 -30 16 14 -14 1 3 -1 19 -26 -4 1 6 -9 4 15 -33 -10 10 6 -1 -20 15 0 5
7016 5 7 18 6 -3 1 19 11 -3 -11 17 16 -8 -6 -7 -11 -6 5 -9 -12 -8 -9 2 14 -25 -7 -9 -5 -37 13 -12 14 -14 -5 14 8 -22 5 16 16 19
7056 19 14 11 -4 0 -10 -13 24 10 13 20 19 8 19 -13 7 20 11 -16 -2 1 8 9 9 -9 -15 2 -30 -18 -10 -8 21 -3 11 4 5 20 5 -4 13
7095 13 0 23 0 25 6 6 0 -28 23 10 -13 6 -2 27 7 2 -2 -5 -45 -11 -9 -12 -3 -3 4 -24 -42 -37 -25 -28 6 -3 -8 8 0 -8 -31 5 17
7134A7m7L0pRlMj8K8J2k9Rj2K6k1Pj2LK3k0L4o8L8j0L1j4k4NoJ0Qk1QK0j9OKq
7171iL1l2pRK7kl5J6jPj4J1k3J7J5j4NJ5k0J3j9J6j0J4l9K1J8lJ2l1K8k3oJ4k2
7206b1J3K0k1J4k4pJ9Jj2M1l4J1MK3j9Kl1J2K4pRj5j7OKjlJ1J5k1j0L7k7plL6
7242B0pj8NOk1lJ1Rk1J8k3mJ7k6L4pnK0j0J1J0mJ2l0L0j8qjL4j1j3qj8MM5j1J5
7279C4k9Mj4k2M3j8%Ll1L5k5J4pJ3Jj3J4l6mJ4pKL5Kr%K8j4rpK3%Kk3NoNJ8k8
7318gK7k3K1k9JL4m7K7k6K6k0kjK0%J9Nm0LJ0j9RJ0nOk1L4k3J4j4Ok0LL9j3j9
7354a5OjJ9k1KJ9j1Pj8M1m4J1K7k2JK2k4kK6j1Mk9J6k6kOQJPk7K9kj6LK3l2J9
7391fJ9jjONk4j2K7oqK5j4J6k9NNkl1K8JLl0rJ0J5J1pQk0K2j2mkK1joJk5K6M%
$$ plain form
7134 17 -30 0 -7 2 -1 3 -15 13 25 -4 5 -7 19 -2 5 -7 -4 19 -1 33 -35 3 -7 24 10 -14 -9 -15 -5 3 -18 -10 10 -9 -3 -1 -9
7171 -9 22 -10 -17 -8 19 17 -18 -2 -3 4 -10 1 -22 -5 10 -4 1 16 -4 9 -10 6 -4 10 -29 -8 10 7 19 -12 16 -7 -13 1 -21
7206 -21 -8 12 -9 5 -19 -26 -7 -6 -18 23 -11 0 4 27 8 10 -21 -9 15 8 17 2 -15 -9 -7 -8 -11 0 15 -6 -16 21 -6 -13 -16 20
7242 20 13 -5 0 6 -15 -18 -7 2 -19 -1 -24 -28 -11 -37 -3 -10 -15 5 -5 6 16 12 24 -6 24 6 -2 -3 31 20 7 -1 -19 -15 30 19 34
7279 34 5 9 -5 -27 16 -2 -2 1 -30 5 -20 -6 -13 0 1 -12 2 -34 -38 -24 -31 -29 6 8 -1 -1 27 13 4 -3 20 20 22 -1 4 -2 3 21 -7
7318 -7 20 -3 18 -11 -10 24 -23 4 -22 4 -16 -18 -19 1 1 20 25 -15 -12 -2 -21 -12 -2 -7 -1 -22 12 -11 3 -11 -5 -25 -22 17 4 -15
7354 -15 -9 -10 9 -12 -10 9 -2 5 -13 28 -16 -5 22 0 1 23 -1 -3 23 12 16 -13 3 -23 -25 -19 -11 -10 -3 -30 -1 -3 -19 -16 7 -25 -6
7391 -6 13 12 11 17 22 -2 -14 13 7 -1 24 10 26 -3 2 7 5 -26 2 3 6 -24 -33 -23 -8 3 -4 4 -16 6 -6 -10 -12 9 8 2 3 -22 4 8 8
7432Hk%j0K8j8J1k7K8j4%ljK0Qm8N3n2OL2j9j3J0j0J9oJ1l1MJ5k2OJ4Pl5M4l8
7468b5N4m4oJ8j0Rk2j1J5M0opMj5j9K9j4K0j2jQK1j4J2j7k1J5J6k7RMJrJj5K6
7504Gj2j0L6l0J4k9M7m6OnJ9j5NJ2K0k0RQk3K0k0RK3l2J5Mjj3MK1j8J5j3j5J4
7539Fk2J2LOJ1l1L8k7QkqoRj1K1kRj4j1K8k0L7m2j2N1k6LPk0J2NJ8l4J2K6l6o
7576hjK2j6J3OPl7oM1J0m7j0L3J0j9k0J0J0Qm5M3k3J5jK1mk0k0K5J0j7RJ2LP%
7612B1l0OK3pnjkKlj1%L8l2J8l6lK1J0j2qj0RK0j9O%qoKlMJ6K9k9l5L0Mj4M2l
7652B4k8mK4j7J2l3J5K8m1L4J2k6J3k1J0Rj8j0J0MJ1k9J1oPQK3j5j9J7Qj1rJ2
7686Ek2rJ7j0L6k2lkJ6OljmRj9K1K0k1lj0J0J1pPk3j0jNLkJ2k2J9j9LJ9J3m3L1
$$ plain form
7432 8 6 6 -4 24 6 17 -10 18 4 4 1 0 20 28 -20 33 -19 -13 19 0 -13 -3 -13 6 0 11 -20 -16 -1 -23 -17 -3 4 -31 13 -25
7468 -25 29 -15 -21 -3 -13 -4 -26 -37 -22 18 12 5 9 -6 -25 4 -10 10 -2 -3 5 26 12 24 7 -14 1 17 -10 -1 3 4 -5 -4 -19 7
7504 7 -5 -15 21 -9 5 -24 23 -23 -17 -22 -3 -18 -13 -1 19 -1 8 16 -7 13 -7 2 25 -7 8 12 11 -2 2 23 5 20 7 -8 6
7539 6 -16 -4 -1 5 16 -15 23 -4 4 2 -6 -12 -3 -14 7 5 14 0 -11 17 -3 34 -8 -20 31 5 8 15 -5 7 12 30 -4 8 34 -2 -8
7576 -8 -9 13 -3 10 16 23 -14 -20 21 31 -16 -26 7 17 -2 -22 -12 -2 6 -39 4 -19 -4 -5 16 12 -8 -28 -3 7 -10 -1 11 14 21 21
7612 21 -9 -3 20 13 8 7 5 7 4 -7 -7 31 -1 17 -19 -22 -1 9 -3 -11 -21 -12 8 -11 -5 -5 -13 -19 -17 -20 -16 0 29 0 -35 -5 -1 -15 27 24
7652 24 -4 -8 16 -1 11 -22 -7 21 -20 14 26 0 13 -8 2 11 -7 -17 -7 -3 8 -21 -10 -16 -9 -1 22 7 -12 5 13 2 -7 5
7686 5 -17 -26 -9 -19 17 -5 -8 -10 6 12 9 8 4 13 -6 15 35 14 11 1 11 22 15 22 -1 -11 -12 -7 -4 -6 6 -16 3 -16 -13 6 19 -24 7
7725GKl9L2%j4K8k2j1K2J7nl0PJ1J6k2J3j3j2J1rJ3k2%J6j0J8J1j2Rj0J2j3jj5
7760a5K9kk3J1j6J5mQj1Oj0QKkNNK5k8J1jj3MKjL1k0k9J0mJ8NJk5JMPMj1mNJ4
7801A2l8Qqj3L8k7L0lk7L%K9Jk1PLJJ0mQj3L2J4l6j2J1lopK8Kk6kJ5Pl3K8k8K3
7840Cj6j5L1Lj2J2j5ojPoJ2K8o8K5j1K2j1J6RL2n3J4j3K0j5J5j3jj9L0K3l1K2
7874A8m1J3J2j7L7Km5M7k5k1K3j8L9k3J2k8J7m1J6K2j3J9Oj3Ml5K1Mj6K9Rj1m
7907aJ5k5J6NJ1j9K3k2lJ8j6klKK5j3k0lj6J2J0k5K8kMj7JM5k3k1K9k5lk0K9J1
7943Ej4%J9j0J0jK2l6%K0pj2NQNmopRj7L7m5J6J9k8oM5l5K0j8L4n4K0kj8rM7k4
7981a2RoL6j6rJ7l8L5j1j2qK2Nl2N3Nm6QOLk0K3k1j0L0J0k1j1PK4l9L1r%j7K5
$$ plain form
7725 7 9 -30 2 2 -12 16 -6 -17 5 22 17 -13 -6 5 21 -1 12 -1 -13 -2 -11 2 -20 -20 -4 -14 4 15 3 12 2 14 1 0 -15
7760 -15 14 12 -11 0 -16 -1 -5 3 -8 -2 -12 -4 -2 -4 1 6 31 3 14 13 0 4 6 5 36 16 -13 -3 -7 11 16 17 -8 -7 -3 4 8 -3 -7 -2 12
7801 12 -26 -18 -26 -39 -1 -28 2 -1 -28 -25 -25 4 5 -16 -9 -6 -5 5 1 9 -4 28 42 6 -6 5 2 -4 -11 17 19 -7 -9 6 13 -20 8 -20 3
7840 3 -13 -28 3 6 -6 6 -9 -15 -16 -9 -15 -3 25 -43 -18 -29 -7 -18 -2 7 39 -14 0 -13 7 -8 7 -6 -7 -26 4 27 -4 18
7874 18 -23 -10 2 -15 22 24 -21 26 1 -20 3 -15 24 1 13 -15 2 -39 -23 -1 -14 5 11 -2 2 -33 -12 -8 -24 5 14 3 -1
7907 -1 14 -11 5 10 21 2 25 3 0 18 2 0 -3 -1 24 11 -9 -12 -28 -16 -6 -31 -3 -5 -1 -18 -17 28 5 -16 13 -12 -15 -35 -6 5
7943 5 -9 -9 10 0 10 9 31 -5 -5 15 8 -4 1 9 14 10 4 -3 6 -11 26 -19 -3 16 -12 -18 27 -8 12 -6 28 -26 -6 -8 -26 -35 12 -12
7981 -12 -3 -9 27 11 2 19 -19 16 5 -7 -15 7 12 -20 33 38 -8 0 6 9 -11 12 -9 -19 11 21 0 -11 -4 20 -19 12 3 3 -14 11
8017A1pJ4j9m0L9j2J4Nj0jnj2J9j3KJ1J7k4J7k5K3J1J5j2j0Pj2L4k3j4j8K0J4
8050A6nOj9rMjlLj5j2K9%okKmK3k2J8j7qJ7mmK7l9J2K4j7OK4qK4pn5M2j3MoL9
8090D4l9kj2%J5j1Pj4J3l5L4k0JjJ3mNk6J9J7k6Rj7M5mkk4J3Nj3k%K4l7L0pJ3
8127A1j4j%J3%Ppk9M2J2j1k0k1J2KPj9oL1l7J6j6K2Rmj9pMK5k5J7Qk2J5J7nj1
8164dK2J2rj%J1j9mj2Jj8K5rjK0kNk9Qj2K0l7K5mj7M0m
$$ plain form
8017 11 4 18 -1 -41 -2 -14 0 5 -5 -6 -11 -23 -4 -17 -15 -4 13 -11 6 -19 4 15 30 18 8 15 3 37 14 0 -18 2 16
8050 16 11 17 -2 -11 -7 -8 -11 -8 -23 -35 -6 -6 -12 -14 -12 -16 7 -15 3 -14 -22 -5 -9 -13 14 -25 -13 11 -6 0 24 16 40 33 -22 20 7 11 5 44
8090 44 5 3 -9 -9 6 -5 2 -12 1 -34 0 -20 -19 -20 -7 -11 -6 -32 -13 4 -22 -13 -30 15 11 9 -15 -2 3 -10 -12 -12 12 -25 5 -2 11
8127 11 -3 -4 -4 9 9 16 9 -20 22 34 23 3 -18 -6 -4 3 -16 -22 9 -28 -12 -28 -6 3 -1 -20 -27 -23 2 -23 -6 2 -20 -5 12 7 -4
8164 -4 18 30 21 20 20 31 12 8 -4 -3 -21 4 -5 -6 14 12 17 -12 -4 -16 4 -33 -8 -12 -29 11 7
8191G
##END NTUPLES=NMR FID
##END=
