##TITLE=1H_Pr 5058
 CD3OD
 8 sc, 
 27.10.2022
##JCAMPDX= 6.0         $$ Bruker NMR JCAMP-DX V2.0
##DATA TYPE= NMR FID
##DATA CLASS= NTUPLES
##ORIGIN= UXNMR, Bruker Analytische Messtechnik GmbH
##OWNER= root
$$ XWIN-NMR		Version 3.5
$$ Thu Oct 27 14:59:53 2022 Russian Standard Time (UT+4h)  she@DPX200
##.OBSERVE FREQUENCY= 200.1313499994
##.OBSERVE NUCLEUS= ^1H
##.DELAY= (6, 6)
##.ACQUISITION MODE= SIMULTANEOUS
##.ACQUISITION SCHEME= undefined
##.AVERAGES= 8
##.DIGITISER RES= 18
##SPECTROMETER/DATA SYSTEM= spect
##.PULSE SEQUENCE= zg30
##.SOLVENT NAME= MeOD
##.SHIFT REFERENCE= (INTERNAL, MeOD, 0, 15.7039)
##AUDIT TRAIL= $$ (NUMBER, WHEN, WHO, WHERE, WHAT)
$$ ##TITLE= Audit trail, XWIN-NMR		Version 3.5
$$ ##JCAMPDX= 5.01
$$ ##ORIGIN= Bruker BioSpin GmbH
$$ ##OWNER= she
$$ F:/spectra/data/she/nmr/H-F/1/audita.txt
$$ ##AUDIT TRAIL=  $$ (NUMBER, WHEN, WHO, WHERE, WHAT)
(   1,<2022-10-27 14:58:50.40 +0400>,<she>,<DPX200>,
      <created by zg, POWCHK disabled, PULCHK disabled
       configuration hash MD5:
       00 E9 B6 7A A2 85 ED C7 34 08 36 98 17 FE 4E 26
       data hash MD5: 16K
       05 49 50 8F 07 C5 E5 44 7D 55 F7 47 AC 6B 58 CE>)
$$ ##END=
$$ 
$$ hash MD5
$$ 0E 00 3D D1 D5 46 5C F0 B1 D1 7C 4C 34 67 60 49
##$RELAX= 
##$RELAX= 
##$RELAX= 
##$RELAX= 
##$RELAX= 
##$RELAX= 
$$ Bruker specific parameters
$$ --------------------------
##$DU= <F:/spectra>
##$EXPNO= 1
##$NAME= <H-F>
##$PROCNO= 1
##$TYPE= <nmr>
##$USER= <she>
##$AMP= (0..31)
100 100 100 100 100 100 100 100 100 100 100 100 100 100 100 100 100 100 
100 100 100 100 100 100 100 100 100 100 100 100 100 100 
##$AQSEQ= 0
##$AQ_mod= 1
##$AUNM= <au_zg>
##$AUTOPOS= <>
##$BF1= 200.13
##$BF2= 200.13
##$BF3= 200.13
##$BF4= 200.13
##$BF5= 200.13
##$BF6= 200.13
##$BF7= 200.13
##$BF8= 200.13
##$BYTORDA= 1
##$CFDGTYP= 0
##$CFRGTYP= 5
##$CHEMSTR= <none>
##$CNST= (0..31)
1 1 145 1 1 1 1 1 1 1 1 1 1 1 1 1 1 1 1 1 1 1 1 1 1 1 1 1 1 1 1 1 
##$CPDPRG= <>
##$CPDPRG1= <>
##$CPDPRG2= <>
##$CPDPRG3= <>
##$CPDPRG4= <mlev>
##$CPDPRG5= <mlev>
##$CPDPRG6= <mlev>
##$CPDPRG7= <mlev>
##$CPDPRG8= <mlev>
##$CPDPRGB= <>
##$CPDPRGT= <>
##$D= (0..31)
0 1.2 0 0 0 0 0 0 0 0.06 0 0.03 0 0 0 0 0.0002 0 0 0 0 0 0 0 0 0 0 0 0 
0 0 0 
##$DATE= 1666868329
##$DBL= (0..7)
120 120 120 120 120 120 120 120 
##$DBP= (0..7)
150 150 150 150 150 150 150 150 
##$DBP07= 0
##$DBPNAM0= <>
##$DBPNAM1= <>
##$DBPNAM2= <>
##$DBPNAM3= <>
##$DBPNAM4= <>
##$DBPNAM5= <>
##$DBPNAM6= <>
##$DBPNAM7= <>
##$DBPOAL= (0..7)
0.5 0.5 0.5 0.5 0.5 0.5 0.5 0.5 
##$DBPOFFS= (0..7)
0 0 0 0 0 0 0 0 
##$DE= 6
##$DECBNUC= <off>
##$DECIM= 32
##$DECNUC= <off>
##$DECSTAT= 4
##$DIGMOD= 1
##$DIGTYP= 9
##$DL= (0..7)
0 120 120 120 120 120 120 120 
##$DP= (0..7)
150 150 150 150 150 150 150 150 
##$DP07= 0
##$DPNAME0= <>
##$DPNAME1= <>
##$DPNAME2= <>
##$DPNAME3= <>
##$DPNAME4= <>
##$DPNAME5= <>
##$DPNAME6= <>
##$DPNAME7= <>
##$DPOAL= (0..7)
0.5 0.5 0.5 0.5 0.5 0.5 0.5 0.5 
##$DPOFFS= (0..7)
0 0 0 0 0 0 0 0 
##$DQDMODE= 0
##$DR= 18
##$DS= 0
##$DSLIST= <SSSSSSSSSSSSSSS>
$$ [...]
##$SUBNAM2= <"">
##$SUBNAM3= <"">
##$SUBNAM4= <"">
##$SUBNAM5= <"">
##$SUBNAM6= <"">
##$SUBNAM7= <"">
##$SUBNAM8= <"">
##$SUBNAM9= <"">
##$SW= 18.0517283424941
##$SWIBOX= (0..15)
0 0 2 0 0 0 0 0 0 0 0 0 0 0 0 0 
##$SW_h= 3612.71676300578
##$TD= 16384
##$TD0= 1
##$TE= 0
##$TE2= 300
##$TE3= 300
##$TEG= 300
##$TL= (0..7)
0 120 120 120 120 120 120 120 
##$TP= (0..7)
150 150 150 150 150 150 150 150 
##$TP07= 0
##$TPNAME0= <>
##$TPNAME1= <>
##$TPNAME2= <>
##$TPNAME3= <>
##$TPNAME4= <>
##$TPNAME5= <>
##$TPNAME6= <>
##$TPNAME7= <>
##$TPOAL= (0..7)
0.5 0.5 0.5 0.5 0.5 0.5 0.5 0.5 
##$TPOFFS= (0..7)
0 0 0 0 0 0 0 0 
##$TUNHIN= 0
##$TUNHOUT= 0
##$TUNXOUT= 0
##$USERA1= <user>
##$USERA2= <user>
##$USERA3= <user>
##$USERA4= <user>
##$USERA5= <user>
##$V9= 5
##$VALIST= <valist>
##$VCLIST= <CCCCCCCCCCCCCCC>
##$VD= 0
##$VDLIST= <DDDDDDDDDDDDDDD>
##$VPLIST= <PPPPPPPPPPPPPPP>
##$VTLIST= <TTTTTTTTTTTTTTT>
##$WBST= 1024
##$WBSW= 4
##$XGAIN= (0..3)
0 0 0 0 
##$XL= 0
##$YL= 0
##$YMAX_a= 77921
##$YMIN_a= -116800
##$ZGOPTNS= <>
##$ZL1= 120
##$ZL2= 120
##$ZL3= 120
##$ZL4= 120
##$ABSF1= 10
##$ABSF2= 0
##$ABSG= 5
##$ABSL= 3
##$ALPHA= 0
##$AQORDER= 0
##$ASSFAC= 0
##$ASSFACI= 0
##$ASSFACX= 0
##$ASSWID= 0
##$AUNMP= <proc_1d>
##$AZFE= 0.1
##$AZFW= 0.1
##$BCFW= 1
##$BC_mod= 2
##$BYTORDP= 1
##$COROFFS= 0
##$CY= 11.3945322036743
##$DATMOD= 1
##$DC= 2
##$DFILT= <>
##$DTYPP= 0
##$F1P= 2.36226072786647
##$F2P= -0.459571619588291
##$FCOR= 0.5
##$FTSIZE= 0
##$FT_mod= 4
##$GAMMA= 1
##$GB= 0.15
##$INTBC= 1
##$INTSCL= 1
##$ISEN= 128
##$LB= 0.24
##$LEV0= 0
##$LPBIN= 0
##$MAXI= 10000
##$MC2= 0
##$MEAN= 0
##$ME_mod= 0
##$MI= 1.114404
##$NCOEF= 0
##$NC_proc= 0
##$NLEV= 6
##$NOISF1= 3.799351
##$NOISF2= 2.8
##$NSP= 1
##$NTH_PI= 0
##$NZP= 0
##$OFFSET= 15.70392
##$PC= 1
##$PHC0= -18395.37
##$PHC1= 13.2007
##$PH_mod= 1
##$PKNL= yes
##$PPARMOD= 0
##$PSCAL= 0
##$PSIGN= 0
##$REVERSE= no
##$SF= 200.130013532006
##$SI= 16384
##$SIGF1= 3
##$SIGF2= 2
##$SINO= 400
##$SIOLD= 16384
##$SREGLST= <1H.CDCl3>
##$SSB= 0
##$STSI= 0
##$STSR= 0
##$SW_p= 3612.71676300578
##$SYMM= 0
##$S_DEV= 0
##$TDeff= 0
##$TDoff= 0
##$TI= <>
##$TILT= no
##$TM1= 0
##$TM2= 0
##$TOPLEV= 0
##$USERP1= <user>
##$USERP2= <user>
##$USERP3= <user>
##$USERP4= <user>
##$USERP5= <user>
##$WDW= 1
##$XDIM= 8192
##$YMAX_p= 0
##$YMIN_p= 0
$$ End of Bruker specific parameters
$$ ---------------------------------
##NTUPLES= NMR FID
##VAR_NAME=  TIME,          FID/REAL,        FID/IMAG
##SYMBOL=    X,             R,               I
##VAR_TYPE=  INDEPENDENT,   DEPENDENT,       DEPENDENT
##VAR_FORM=  AFFN,          ASDF,            ASDF
##VAR_DIM=   8192,          8192,            8192
##UNITS=     SECONDS,       ARBITRARY UNITS, ARBITRARY UNITS
##FACTOR=    0.0002768,     1,               1
##FIRST=     0,             0,               0
##LAST=      2.2672688,     0,               0
##MIN=       0,             -116800,         0
##MAX=       2.2672688,     77921,           0
$$ Real data points
##PAGE= N=1
##DATA TABLE= (X++(R..R)), XYDATA
0 0 0 0 0 0 0 0 0 0 0 0 0 0 0 0 -8 8 -8 8 -8 14 -16 16 -22 24 -30 32 -40 46 -51 58 -67 78 -89 99 -113 128
36 128 -143 161 -179 200 -224 248 -276 304 -336 371 -411 452 -500 549 -605 669 -735 811 -896
55 -896 992 -1100 1225 -1367 1537 -1739 1988 -2299 2700 -3246 4026 -5255 7479 -12830 58097
70 58097 16776 -57020 -19323 -51217 -38778 -34290 -643 30556 43952 77921 48404 -37694
82 -37694 -34015 -47674 -55318 -19701 -8953 31926 67025 40830 38900 -3230 -47064 -39091 -55798
95 -55798 -35676 11132 21406 59561 54017 16214 11447 -33392 -57676 -41140 -39415 10091 36766
108 36766 29777 56964 33979 -3635 -20219 -59630 -46340 -23318 -12012 46193 49182 24922
120 24922 34627 3148 -19264 -37746 -65596 -29615 3399 27713 59063 30330 19528 12794
132 12794 -34047 -29481 -36519 -54311 365 34676 43641 44784 14916 10190 -17914 -52813 -29520
145 -29520 -31345 -16138 36021 36910 39159 31795 -2625 -10741 -42644 -51887 -11107 -9473 11240 45999
159 45999 37448 33119 2504 -27223 -24834 -47674 -29418 8709 4208 33042 48204 24176 12852
172 12852 -25166 -42073 -27160 -31574 -2319 17630 18921 48181 30107 1271 -4631 -43549 -43809
185 -43809 -16682 -8781 20888 27373 27688 37689 4135 -10615 -23465 -55072 -24119 3288 8722
198 8722 35934 27740 21295 20036 -16098 -27534 -36985 -38169 3134 13949 24326 40355 14782
211 14782 11600 -813 -36814 -30840 -28800 -14974 22791 23888 31677 29902 -835 -3561 -22626
224 -22626 -38365 -20097 -18895 9191 38584 24508 27769 11638 -19358 -16282 -29923 -28863 -7898
237 -7898 -1189 31701 38574 15999 16854 -11709 -30176 -18673 -28918 -13081 9379 15133 39259
250 39259 27834 4435 -2277 -30794 -27729 -15216 -21004 8208 22119 22729 37421 9892 -11979
263 -11979 -18411 -35663 -17514 -6913 -4092 24929 24993 23719 23105 -12664 -22331 -25664 -31297 -1860
277 -1860 4373 12139 33596 19318 13735 2877 -26893 -24576 -26391 -16377 14923 13919 22930 29098
291 29098 5181 2850 -14781 -34943 -19222 -15846 2620 26402 18613 24546 15048 -7749 -8025
304 -8025 -29049 -30437 -6009 -2136 19951 30241 13924 16729 -1463 -18348 -16402 -31065 -15755
317 -15755 7015 10761 31396 23246 4327 4732 -18137 -22296 -15730 -23229 1499 18252 20491 30760
331 30760 8545 -5517 -8286 -27964 -18073 -10407 -9313 18894 22506 20516 21273 -7035 -14560 -17512
345 -17512 -27512 -7586 -1782 7068 29091 18361 14728 6080 -21549 -18019 -19520 -18301 5375
358 5375 7102 18706 28601 9005 5130 -11475 -29142 -14635 -14321 -3710 16765 12334 22867
371 22867 19589 -2879 -5516 -23667 -26803 -6235 -4887 12289 22621 11746 19208 5002 -13308
384 -13308 -13613 -27329 -15672 3466 5526 23441 19910 6902 10055 -11086 -19763 -15224 -22130 -947
398 -947 13381 13529 25142 10756 521 -1565 -22880 -18329 -12053 -10681 15099 17920 15270 19359
412 19359 -1759 -7585 -11614 -24954 -11759 -5741 4020 25245 15552 12402 7752 -14421 -11802 -15977
426 -15977 -20230 -547 3411 14834 25918 9500 5784 -6310 -21530 -11229 -15271 -8183 11678
439 11678 9094 19950 19702 -349 -2568 -16561 -22232 -7311 -8282 6249 17256 11222 20054 6754
453 6754 -11079 -9078 -21587 -15056 748 -87 15438 18835 10292 11493 -7660 -16563 -12957 -19069
467 -19069 -2333 7268 6530 21497 13319 3787 1443 -18644 -17232 -10289 -10668 8788 12441 12670 18650
482 18650 2029 -3208 -8363 -22907 -10718 -5785 -946 19254 14082 11658 10116 -9153 -8734 -13549
496 -13549 -18596 -2807 -202 11378 22701 7983 7322 -536 -17145 -9948 -14049 -11209 7038 8391
510 8391 17197 16542 1012 1092 -11904 -18044 -6806 -12349 709 16299 10613 16257 7983 -6807
524 -6807 -6069 -16784 -13980 -3287 -3684 13026 16272 8674 13082 -4344 -13499 -8932 -18080 -6296
538 -6296 4935 4484 17427 12908 5388 3338 -14094 -13387 -10955 -12787 6984 9399 7567 18817
552 18817 5474 -1864 -5328 -18771 -11208 -6343 -1954 13951 9517 11624 13019 -5364 -5994 -12076
566 -12076 -19535 -2337 1120 5370 16429 8713 9317 2248 -12623 -8830 -14698 -10288 6051 3866
580 3866 12627 16730 2237 2809 -6370 -15974 -8599 -10792 -569 11111 8092 15726 7976 -4226
594 -4226 -2179 -14611 -13958 -2897 -6085 8475 15178 8315 11439 -830 -9117 -7787 -16428 -6427
608 -6427 867 2049 16495 10907 4224 6956 -9973 -12258 -7670 -12599 494 6259 8898 16827
622 16827 4671 524 -2556 -16407 -8187 -6422 -6455 10523 8810 9278 13293 -1443 -5073 -9310 -15659
637 -15659 -4349 -3148 4003 14800 6544 9622 5213 -10579 -6923 -11140 -12305 2287 3063 10263
651 10263 13996 4092 5158 -4497 -13371 -6634 -11993 -3055 9259 4619 13472 10913 -2333 -985
665 -985 -10656 -12719 -4962 -5862 6713 10466 6168 13434 1426 -6780 -3764 -15435 -8737 1208 35
680 35 11690 11170 5319 6197 -6821 -7777 -7647 -13382 568 3427 4462 16395 6566 652 717 -12249
696 -12249 -9191 -6593 -6317 6949 6329 8994 12007 -1054 -1170 -6198 -15541 -4024 -3571 -235 12753
711 12753 7318 7704 5780 -6090 -5229 -10712 -10872 1184 -672 7598 13696 3324 5981 -979 -11875
726 -11875 -5663 -9556 -5036 5634 3778 11484 9494 357 2035 -10081 -11933 -3180 -7755 2876
740 2876 10187 4706 10917 4154 -4124 -3269 -12282 -7729 -1932 -2376 10619 9189 4845 8640 -4949
755 -4949 -7952 -4530 -12132 -2857 2642 3165 12359 6153 3359 1828 -10706 -6727 -6781 -8551 5828
770 5828 5154 5988 12238 1417 -858 -3653 -12406 -5294 -4885 -1138 9953 5426 8553 6977 -5969
785 -5969 -2515 -7325 -11830 -227 -1112 4709 11655 4236 6480 36 -8910 -4251 -9892 -5703 4798
800 4798 761 9463 10139 64 3050 -5593 -10524 -4392 -7394 1378 7362 4151 10890 3585 -2999
815 -2999 -90 -10548 -8007 -1278 -3960 6825 8508 4731 8369 -2411 -5615 -4604 -11103 -1929
829 -1929 580 599 11277 5868 2834 4633 -7689 -6880 -5715 -8448 2848 3588 5108 10781 1630
844 1630 1195 -1922 -10969 -4133 -5170 -3967 8085 4844 6942 7766 -3241 -1613 -6298 -9965 -1032
859 -1032 -2949 2611 9907 3139 7281 2723 -7475 -3414 -8324 -6574 2746 268 7445 8481 1218
874 1218 4273 -4062 -8268 -3306 -8534 -945 6207 2524 9716 5133 -1735 602 -8173 -7239 -2028
889 -2028 -5023 4666 6536 3908 9139 -659 -4233 -2527 -10358 -3499 414 -721 8546 5194 3195
904 3195 4971 -5467 -4540 -4835 -9098 1871 2016 3087 10549 2025 1136 308 -8941 -3825 -4694 -4583
920 -4583 5898 3188 6268 8236 -2064 -481 -4448 -9601 -1465 -3106 784 8286 2899 6809 3780
935 3780 -5284 -1903 -7653 -6931 1520 -923 5587 8301 1296 4743 -1773 -6785 -2264 -8037 -2642
950 -2642 4531 1389 8232 5581 -585 1990 -6794 -6428 -1833 -5818 2946 5595 2810 8500 1090
965 1090 -2574 -1277 -8991 -3783 -768 -1876 7592 4904 3036 5723 -3991 -3840 -3638 -8327 445 791
981 791 1377 9579 2553 2184 1572 -7565 -3349 -4217 -4976 3988 1855 4802 7932 -809 952 -2705 -9180
998 -9180 -1111 -3354 -879 6825 2343 5889 4495 -3783 -1121 -6353 -6763 951 -2474 4057 7625
1013 7625 1098 5006 -170 -6117 -1934 -6729 -3269 2931 23 7351 5322 142 2899 -5070 -6124
1028 -6124 -1667 -6044 1666 4283 1506 7944 1617 -1458 257 -7576 -4229 -1540 -3082 6051 4007
1043 4007 2654 6363 -2627 -2750 -2080 -8174 -1099 176 589 7880 2934 2654 2400 -6013 -2170 -4047
1059 -4047 -6114 3235 1147 3121 7883 121 1044 -945 -7027 -1938 -3942 -1517 5498 1430 5403
1074 5403 4844 -3239 257 -4348 -6787 194 -2427 2137 6644 1716 5143 597 -4588 -1148 -6520
1089 -6520 -2896 2308 -1722 5816 5502 157 3818 -3262 -5742 -1799 -5190 822 3252 1028 7101
1104 7101 1551 -750 1575 -6600 -4030 -923 -3930 4208 4204 2342 5947 -1315 -1689 -1989 -7225 -554
1120 -554 -944 -1032 7364 2310 2068 3827 -4521 -2828 -3156 -5464 1683 639 2809 6829 -40 2212
1136 2212 -1 -6604 -1225 -3915 -3489 4920 1443 4028 4865 -1876 294 -3143 -5154 -310 -4005
1151 -4005 1539 5778 1053 5255 1350 -4441 -201 -5060 -4064 1718 -1567 4077 4635 934 4142
1166 4142 -2746 -4040 -919 -6395 -199 3005 -90 6064 2992 -968 1474 -4756 -3063 -1577 -4059
1181 -4059 3026 2358 1572 6490 -933 -1459 -277 -6811 -1503 -176 -1561 4870 2283 2594 3608 -3490
1197 -3490 -1103 -3027 -6135 1928 -51 1147 6553 230 1401 1405 -4663 -1885 -3673 -2962 2987 578
1213 578 4128 4815 -1777 1680 -2096 -5995 126 -3295 -524 4755 1027 4249 2142 -2149 -86
1228 -86 -5063 -3677 1091 -2401 3928 4765 -513 4233 -743 -3889 -639 -5041 -1395 1482 130 5741
1244 5741 2461 108 2502 -4712 -2801 -221 -4733 1522 2800 887 5585 643 -1031 -482 -5428
1259 -5428 -1170 -1261 -2048 4546 1405 2026 5038 -2904 -1678 -1658 -5442 260 -113 604 5220 762 2749
1276 2749 1389 -4596 -473 -3273 -3921 3073 -8 2499 5207 -559 1022 -1501 -4519 -490 -3203
1291 -3203 -238 3749 -465 4209 3031 -2295 1139 -3718 -4523 730 -1932 2089 3753 706 3504
1306 3504 -802 -2724 174 -5217 -1706 1459 -1323 4569 3141 -498 2470 -2762 -2693 -1142 -3934
1321 -3934 1227 1610 701 5362 132 -360 912 -4903 -1638 -544 -2881 3469 1708 1381 3883 -1372
1337 -1372 -248 -1426 -4796 196 -1311 -474 5428 566 1881 2140 -3726 -939 -2067 -3418 1558
1352 1558 -339 2390 4382 -357 2293 -1098 -4586 105 -2919 -1515 3675 -73 2931 2741 -1467
1367 -1467 922 -3048 -3501 138 -2902 2141 3794 44 3687 390 -2702 395 -3744 -2224 825
1382 825 -1184 3314 2402 551 3047 -2498 -2412 -482 -4299 603 1745 -167 4330 1227 19 1433
1398 1433 -3652 -1730 -1490 -2896 3162 1073 1296 4357 -1669 -208 137 -4359 -325 -1093 -862 4049
1414 4049 923 1984 2398 -3084 67 -1870 -3587 1664 -998 923 4242 49 1559 272 -3622
1429 -3622 -473 -2763 -1323 2499 -574 2923 2919 -1434 1372 -2151 -3629 261 -2605 629 2985 280
1445 280 3341 827 -1813 245 -3775 -1849 739 -1912 2975 2340 -121 3142 -1468 -2298 -475 -3922
1461 -3922 200 1183 -254 4103 713 187 1705 -3060 -1341 -941 -3324 2138 1133 891 3641 -886
1477 -886 -122 -127 -3931 50 -1101 -1495 3375 626 1560 2885 -2243 -229 -1657 -3217 1164 -684 929
1494 929 3412 -261 1801 640 -3035 67 -2821 -2255 2072 -363 2259 2728 -1034 1365 -1251 -2672
1510 -2672 471 -2845 125 2428 -185 3405 1166 -1774 629 -2953 -2012 633 -1854 1910 2033
1525 2033 536 3080 -818 -1578 -145 -3691 25 718 -645 3286 947 123 1808 -2583 -1238 -574
1541 -574 -3081 1437 651 753 3760 -360 180 551 -3629 -347 -1019 -1332 2652 356 1512 2789 -1648
1558 -1648 35 -1014 -3321 472 -863 315 3093 -136 1876 729 -2594 252 -2227 -2168 1515
1573 1515 -597 1893 2857 -548 1567 -1119 -2570 246 -2317 -293 1802 -626 2864 1252 -1057
1588 -1057 1307 -2376 -1949 530 -1820 1757 1612 87 2746 -488 -1163 426 -3341 -568 629 -989
1604 -989 3059 1178 -73 1843 -1875 -999 -180 -2966 1193 519 459 3473 -161 371 669 -3149 -494
1621 -494 -647 -1612 2325 545 951 2280 -1267 293 -944 -2841 299 -1321 -123 3095 -60 1596
1637 1596 1098 -2233 48 -1942 -1803 1149 -819 1428 2420 -455 1767 -519 -2614 183 -2275 -784
1653 -784 1963 -688 2265 1250 -556 1105 -1994 -1715 67 -2054 1348 1735 -346 2828 -17 -1112
1669 -1112 709 -2485 -1052 129 -968 2358 958 438 1981 -1936 -813 -67 -3278 722 476 -308
1685 -308 3005 544 455 691 -2440 -644 -1096 -1810 2056 96 1056 2716 -1038 184 -14 -2557 64
1702 64 -1003 -639 2335 264 1396 1006 -2009 568 -1835 -2012 1503 -1548 595 2182 -386 1363
1718 1363 53 -2304 -172 -1990 -395 1170 -827 2173 1339 -738 1875 -1581 -1736 447 -1843
1733 -1843 253 1280 20 2130 227 -812 629 -2774 -484 224 -1590 2194 1198 -309 2424
1748 2424 -883 -953 -162 -2452 275 -7 -247 2443 -119 622 1706 -2390 -285 -421 -2239 1507 655
1765 655 645 1981 -663 451 98 -2176 466 -1396 -813 2259 -212 1327 1603 -1818 373 -648
1781 -648 -1939 537 -1093 691 1916 -43 1989 58 -1947 723 -1920 -1293 1253 -933 1565
1796 1565 1532 -647 857 -1125 -1379 219 -1966 577 1032 -586 2906 505 -1069 848 -2262 -1136
1812 -1136 369 -1294 1016 838 433 2449 -1111 -398 105 -2614 573 464 -1092 1945 280 171
1828 171 1504 -1430 -651 -830 -1871 1297 -13 287 2027 -944 790 758 -2398 165 -819 -938 1941
1845 1941 120 861 1462 -1127 939 -966 -2106 853 -1103 511 2142 -832 1198 587 -1420 351
1861 351 -1754 -1170 438 -725 1975 1227 -846 1271 -768 -1537 656 -1957 -411 1221 -403 1889
1877 1889 669 -830 377 -1768 -243 171 -1889 1347 770 -220 2523 -747 -914 452 -1882 131
1893 131 -11 -804 1661 20 644 1289 -2193 -50 -194 -1914 1259 -288 -529 2441 113 604 184
1910 184 -2081 267 -968 -689 1597 -875 728 2181 -741 914 -558 -2270 360 -677 284 1281
1926 1281 -630 1362 668 -1036 934 -1932 -1202 1061 -995 1091 1293 -668 1289 -124 -1031 150
1942 150 -2188 -81 1063 -656 2037 37 -818 1668 -1316 -895 350 -1773 970 1066 63 1690
1958 1690 -730 -219 655 -2043 135 -219 -1377 2123 703 213 1428 -1515 -286 110 -1654 450
1974 450 -801 -191 2505 -217 579 393 -2024 361 -276 -1002 1184 -525 612 1955 -670 476
1990 476 -847 -1907 941 -1055 -119 1477 -802 1310 970 -1393 403 -1275 -1290 1133 -557 453
2006 453 856 -265 1824 -345 -1386 226 -2035 307 1438 -854 993 277 -127 1555 -1203 -1148
2022 -1148 -153 -1554 1174 735 -808 1298 -503 55 1185 -1894 -581 -195 -777 2007 333 -91
2038 -91 1078 -1271 221 205 -1994 333 -364 -209 2061 -399 -37 805 -1684 501 -593 -1630 510
2055 510 -451 953 1831 -1224 182 103 -1418 1035 -992 -972 995 -193 1514 920 -1527 376 -727
2072 -727 -528 920 -1431 25 1163 -48 1823 41 -1497 382 -1366 132 977 -1232 1288 740
2088 740 -376 1542 -1193 -1107 361 -1452 899 400 -1081 1483 101 168 664 -1939 -274 156 -774
2105 -774 1617 -397 -586 1585 -587 261 27 -2068 387 180 -275 1654 -807 219 1210 -1200 269
2122 269 -814 -1960 1197 -147 641 1041 -1182 545 190 -842 728 -1422 -891 1321 -193 1192
2138 1192 556 -1222 840 -265 -836 583 -1630 239 1425 -164 1270 -584 -1316 984 -771 -98
2154 -98 260 -1293 1218 1077 -308 958 -1392 -422 860 -1110 178 97 -667 1662 418 2 485
2171 485 -1869 89 646 -1153 631 -103 -188 2067 -94 -355 -261 -2039 733 198 -590 1211 -902
2188 -902 533 1365 -951 343 -590 -1410 1660 -8 -236 1144 -540 1135 602 -1341 186 -1236
2204 -1236 -410 1715 -671 738 402 -676 1200 -447 -1222 166 -1231 556 1252 -608 743 -164
2220 -164 -304 1441 -1256 -992 288 -1154 1307 842 -993 743 -596 -221 938 -1511 -272 -14
2236 -14 -376 1954 127 -835 673 -1136 322 465 -1334 290 279 160 1813 -727 -255 189 -1284
2253 -1284 846 -104 -1314 1205 -23 598 1377 -1658 69 -37 -674 1161 -837 -254 1419 -423
2269 -423 1160 356 -1727 408 -559 -487 1169 -912 97 950 -184 1189 -601 -1177 646 -783 635
2286 635 1101 -1191 795 602 -550 991 -1063 -928 715 -733 1404 561 -783 1013 -510 -58
2302 -58 723 -1758 -22 677 -443 983 -249 -587 1107 -588 229 -221 -1510 964 376 14 1274
2319 1274 -1207 -504 775 -1001 245 -450 -1115 1226 172 345 691 -1686 411 235 -802 780
2335 780 -864 -520 1137 -54 544 127 -1397 457 -280 -455 674 -1140 630 1361 -619 746 -352
2352 -352 -1158 980 -527 -139 456 -881 1019 375 -328 385 -1347 -464 975 -1131 562 258 -705
2369 -705 1349 284 -653 118 -1355 434 506 -599 867 -383 -531 1539 -699 -652 71 -1241 1082
2386 1082 490 -514 734 -591 198 758 -886 233 -550 -748 1390 2 7 881 -629 261 465 -997
2404 -997 489 -569 149 1341 -489 238 440 -1128 842 -129 -1091 541 -458 366 1115 -582 195
2421 195 -275 -634 848 -1021 -448 433 -920 1061 734 -1065 392 -451 -527 411 -843 -252 258 -169
2439 -169 1634 -137 -742 380 -967 592 724 -832 676 21 -176 748 -513 -297 82 -1042 685
2456 685 -53 -557 1080 -272 174 732 -1557 -247 -151 -618 1250 -387 -338 836 -175 667 -122 -1387
2474 -1387 607 -248 -182 1020 -735 32 1003 -571 619 -547 -974 355 -322 639 744 -956 335
2491 335 271 -720 699 -975 -463 617 -290 693 345 -873 870 -756 -61 750 -1335 243 609 -277
2509 -277 1092 -211 -867 582 -637 -61 -32 -1101 846 405 -137 864 -1095 -372 804 -786 121
2526 121 -102 -564 1132 385 13 25 -1272 124 330 -694 734 -422 -132 966 -345 158 -101 -1015
2544 -1015 224 53 -393 932 -420 306 690 -852 434 -484 -732 865 -241 -31 632 -494 612
2561 612 199 -487 227 -751 68 553 -677 665 274 -629 658 -277 -646 360 -988 470 503 -465
2579 -465 762 -296 -230 863 -762 -174 259 -906 1074 336 -266 768 -493 -108 542 -731 265
2596 265 -193 -710 1094 154 -127 765 -1037 92 176 -876 709 -120 136 744 -483 246 121 -994
2614 -994 316 -283 -383 674 -660 309 836 -633 361 -230 -502 679 -417 -9 614 -590 667
2631 667 -34 -910 364 -532 -379 641 -823 398 497 -190 863 -310 -784 239 -657 435 394 -670
2649 -670 398 -9 -185 567 -559 -197 133 -480 765 231 -580 669 -289 -169 405 -917 -46 -151
2667 -151 -521 863 -205 -151 850 -546 101 112 -678 530 -116 -20 832 -591 225 354 -619 266 -334
2686 -334 -835 776 -374 544 388 -670 239 -123 -597 425 -534 -28 863 -216 341 292 -651 417
2704 417 -351 -193 676 -805 172 503 -306 545 -326 -680 460 -637 -70 508 -638 760 209 -236
2722 -236 470 -760 -241 617 -807 365 -36 -421 987 -198 -292 312 -862 113 155 -584 795 -385
2740 -385 -294 812 -297 102 -5 -723 512 -311 -94 722 -408 58 528 -528 285 -90 -559 653
2758 653 -300 126 594 -676 450 -179 -698 577 -313 -39 527 -415 186 316 -488 406 -400 -587 417
2777 417 -602 178 534 -444 779 -177 -376 911 -586 -176 418 -548 564 43 -321 845 -543 -209
2795 -209 325 -701 367 27 -586 841 -395 43 577 -811 152 212 -521 502 -130 -84 958 -472
2813 -472 -14 53 -841 644 -63 -262 724 -155 260 218 -696 289 33 -465 526 -377 -31 802 -333 223
2833 223 -91 -403 541 -188 -51 430 -322 453 270 -391 718 -159 -707 330 -552 254 607 -634 587
2852 587 3 -250 398 -572 77 238 -617 689 78 -556 573 -533 -153 410 -361 121 315 -341 677
2871 677 -176 10 491 -583 -41 135 -468 438 51 -297 520 -490 63 80 -571 541 -195 -332 892
2890 892 -372 320 114 -965 507 52 -534 582 -100 -43 415 -517 585 1 -809 522 -479 -225
2908 -225 596 -527 264 521 -277 509 -65 -353 278 -441 70 318 -552 437 -345 -420 404 -441 -162 421
2928 421 -554 312 104 -91 484 -343 -98 368 -640 440 265 -273 685 -255 -524 471 -432 -52 103
2947 103 -662 456 -206 -236 558 -682 126 165 -609 557 -290 -292 603 -399 91 305 -569 245 65 -250
2967 -250 541 -596 9 599 -523 357 113 -520 442 -95 -382 358 -131 212 -7 -579 463 -228 -538
2986 -538 367 -463 344 518 -524 264 49 -428 602 -556 86 158 -705 495 22 -443 874 -347
3004 -347 -530 509 -335 356 301 -409 475 -149 -320 380 -602 189 92 -507 684 133 -309 683 -498 -201
3024 -201 278 -630 117 113 -72 552 -181 162 553 -446 472 -19 -520 445 -178 -159 327 -249 346 -83 -703
3045 -703 475 -172 -362 539 -468 267 664 -600 411 143 -235 484 -511 148 312 -342 797 -58
3063 -58 -375 250 -621 -160 196 -411 388 424 -381 215 -199 -72 427 -473 90 127 -309 658 88 -244 449
3084 449 -363 -45 158 -426 188 -182 -197 321 -476 38 439 -598 186 202 -426 668 -385 -228 608 -475
3104 -475 303 -99 -485 426 -217 -193 718 -485 177 384 -351 261 -13 -552 264 -331 193 310 -471 614
3124 614 -505 -525 315 -292 -85 148 -413 196 323 -278 519 -423 5 244 -367 394 368 -332 592 -365
3144 -365 -214 393 -316 47 117 -455 312 -127 -143 273 -599 -163 179 -625 437 2 -587 620 -261 68
3164 68 354 -457 163 381 -280 182 -165 -55 390 -559 48 364 -503 391 -313 -192 743 -369 216 1
3184 1 -605 531 74 -358 468 -850 42 532 -683 408 191 -602 313 -251 200 382 -503 465 -21
3203 -21 -251 435 -608 -173 558 -566 -50 283 -217 410 -379 -129 239 -461 -30 51 -708 577 -121 -154
3223 -154 297 -447 101 314 -425 291 32 -304 654 -83 -95 557 -664 -81 128 -267 501 -204 48 444
3243 444 -226 208 23 -491 323 -187 -455 467 -372 233 264 -591 274 -70 -452 330 -279 -358 157 -518 324
3264 324 -34 -336 246 -329 100 463 -221 279 0 -349 600 1 -232 168 -412 415 365 -92 514 -36
3284 -36 -316 248 -429 -119 309 -315 408 -82 -334 566 -279 -145 106 -581 318 1 -203 401 -457 -105
3304 -105 347 -410 222 172 -326 393 -280 66 362 -479 151 34 -513 301 13 -135 334 -172 193 28
3324 28 -343 260 -179 -288 549 -589 -102 380 -303 237 40 -292 462 -642 93 169 -426 266 -24 -347
3344 -347 375 -410 -376 273 -478 72 131 -325 279 23 -286 454 -305 81 62 -515 287 205 -235 512 -449
3365 -449 150 354 -406 366 243 -412 725 -176 -133 529 -441 -53 87 -131 232 -97 -114 471 -195 442
3385 442 25 -534 661 -78 -374 211 -202 327 256 -170 174 -93 -183 599 -521 21 -24 -263 130 -13
3405 -13 -205 549 -309 -71 293 -460 259 213 -374 314 -118 -149 479 -240 -13 327 -554 440 180 -339 380
3426 380 -179 -59 132 -169 149 89 -320 308 -438 100 122 -428 17 78 -556 500 -75 -187 202 -430 362
3447 362 110 -448 346 21 -125 394 -356 269 231 -359 135 -15 -94 195 -426 -29 323 -359 329 239 -510
3468 -510 466 -56 -18 362 -209 229 -47 -272 590 -174 -380 295 -360 231 301 -387 325 -318 -228 518 -211
3489 -211 113 40 -525 329 -179 -287 299 -82 180 528 -173 229 293 -387 398 13 83 331 -378 192 158
3510 158 -372 453 -254 14 106 -568 -26 161 -357 253 -265 -246 384 -231 102 196 -424 303 -83 -295 350
3531 350 -380 133 386 -200 93 125 -135 258 -139 -53 578 -306 331 -8 -144 288 -138 -200 468 -220 93
3552 93 -65 -220 218 -16 -130 389 -507 -20 309 -355 238 -8 -507 356 -339 -46 191 -165 253 -251
3572 -251 -129 373 -250 -140 387 -484 49 -33 -190 320 -147 -53 201 -271 53 3 -340 454 -75 -188 129
3593 129 -411 -78 204 -387 241 14 -32 326 -66 124 276 -290 413 -22 -107 204 -296 -179 538 -44 256
3614 256 261 -348 301 -220 29 475 -217 26 168 -321 339 105 -329 147 -227 149 296 -214 85 5 -25
3635 -25 291 -475 -39 219 -719 269 105 -334 239 24 -121 87 -235 250 -155 9 274 -159 40 176
3655 176 -263 -159 154 -451 286 272 -100 470 -48 251 197 -243 73 -199 -230 285 -131 19 331 -453 145
3676 145 1 -301 303 -229 210 95 -211 370 160 -144 164 -39 -126 432 -332 118 -42 -6 130 70 -446
3697 -446 436 -389 -88 161 -291 320 -3 -297 223 -104 30 157 -456 1 26 -283 317 -298 -177 391
3717 391 -100 -115 64 -282 248 49 -190 262 -204 82 139 -181 77 -1 27 242 -413 128 191 -96 228 36
3739 36 -262 259 -207 -220 -18 -94 259 -81 -209 143 -307 -108 319 -371 -139 114 -212 265 -144 -195 354
3760 354 -162 268 271 -319 186 56 -303 20 -315 4 239 -87 151 139 -266 -132 -281 -279 255 10 47 3
3782 3 -67 150 -232 -311 93 -306 70 128 -475 303 -138 -326 288 -343 186 -3 -264 168 -265 -303 467 -77
3804 -77 -5 -67 -237 409 -132 -161 420 -160 -208 258 -182 1 90 -330 144 -185 -79 15 -263 144 -11 -253
3826 -253 259 -42 -411 322 -283 -78 262 -495 185 -9 -139 223 -156 -263 82 -162 201 1 -370 132
3846 132 -401 -69 98 -123 179 -65 -201 382 -268 -40 246 -13 40 96 -87 211 -88 -84 264 -357 208
3867 208 -4 -502 318 11 -139 254 -118 -13 147 -456 -54 184 -191 214 -111 -76 205 -337 264 -34
3887 -34 -255 276 32 78 94 -291 -92 -14 -150 246 141 -62 -107 -219 73 247 -242 262 -182 -156 274 -151
3909 -151 82 131 -20 50 85 -114 510 29 103 219 -225 92 173 21 304 46 -48 278 -217 257 -216 -238
3931 -238 140 -171 35 148 -171 -64 284 -183 -85 133 -34 294 -298 -137 198 -234 322 -97 -375 97
3951 97 109 -67 168 -260 185 -245 -214 223 -113 -119 58 -229 132 185 -438 111 21 -145 244 -156 81 -5 -350
3974 -350 189 126 -185 154 -326 -131 140 -170 29 229 -47 420 -242 151 252 -284 -76 225 -410 222
3994 222 127 -106 211 -370 419 288 -500 202 13 -127 102 -201 126 60 -173 230 -224 -422 318 -129 -66
4015 -66 162 -121 125 -74 -198 202 -146 81 184 -573 -147 267 -273 183 -105 -330 85 -300 195 338
4035 338 -281 431 -17 -33 316 -272 152 26 16 156 179 -112 165 -24 -90 218 -185 322 -124 -168 74 -220
4057 -220 -77 46 -333 107 -15 -178 244 42 -35 327 -259 95 152 -402 330 -151 -69 426 8 89 216
4078 216 146 166 -220 -32 467 -99 -39 202 -196 49 -96 -66 214 -328 6 115 -137 82 91 41 215 -11
4100 -11 -302 113 -84 204 254 -143 370 -118 111 395 -397 93 79 -119 26 -147 189 525 -53 -149 151
4121 151 -214 132 -11 -279 96 -311 -95 231 -64 65 -11 -301 452 183 -173 457 -126 23 232 -182
4141 -182 172 -176 -108 273 -145 90 48 -320 111 -33 -126 -99 -76 -236 69 -243 127 85 -298 141 -229 -94
4163 -94 119 -290 240 84 -314 442 -22 -132 255 -167 183 55 -198 281 -286 -95 132 -133 101 146 -216
4184 -216 10 -105 -25 91 -336 -120 16 44 352 89 -298 30 -148 -50 222 -391 -137 131 47 148 -82
4205 -82 86 3 -538 -31 192 -190 392 -8 -96 111 -271 31 264 -184 88 152 -202 282 -101 100 167 -501
4227 -501 428 133 -338 286 38 -90 365 -52 -237 129 -242 61 -197 51 260 -432 250 122 91 243
4247 243 -43 -80 95 -180 186 10 -141 158 -190 74 110 -169 -124 68 -201 110 134 -347 112 -83 -66 220
4269 220 -147 37 134 -187 164 -97 -420 137 -5 -37 18 -146 285 208 144 184 -401 36 -92 -118 159 -68
4291 -68 -211 179 -100 44 169 -451 146 135 -57 128 -197 124 92 -94 177 -22 -245 151 66 -184 195
4312 195 -120 9 60 -172 143 -381 -191 256 -107 -127 -152 -244 246 237 -225 34 -168 243 231 -194 -161 -6 -312
4335 -312 134 -55 24 213 -20 23 256 -18 22 -113 97 372 -94 -257 -43 15 251 56 30 29 114 -81 175
4358 175 -52 105 125 -154 207 74 48 100 -240 278 72 -125 140 -79 5 249 -374 -70 51 -106 359
4379 359 -45 -27 -92 -147 184 196 -414 -105 118 159 257 -155 48 290 188 180 162 -369 117 30 77 19 -233 172
4403 172 53 -165 231 -90 -95 158 -184 -19 280 -345 415 -90 -108 114 -273 143 -147 -141 188 -41 -460 160
4425 160 27 -204 157 -87 -169 97 -115 421 -226 -105 105 -22 -4 -35 -320 168 -152 154 -3 -350 207
4446 207 27 71 -97 -99 -183 244 7 158 191 -297 -138 147 -88 -13 37 -75 142 -204 141 243 -333 211
4468 211 -163 -46 -6 -180 136 210 15 400 -150 47 195 9 -11 35 -204 200 168 -145 367 -452 10 179
4490 179 -217 91 -235 -256 163 83 -9 1 -156 55 38 -134 309 -264 -113 126 -125 296 26 -214 262 81
4512 81 166 -151 -134 -97 345 -353 246 -22 -23 325 -230 -99 169 -225 355 45 -237 272 -347 116 -53 -67
4534 -67 170 -68 -136 282 114 -326 -158 -73 147 158 -227 405 -37 -81 82 -173 91 -337 -471 350 104 -120
4556 -120 88 -270 137 68 -81 -72 7 -130 123 -296 -313 274 -117 304 49 -171 116 -134 119 274 -33 113
4578 113 201 24 321 -70 -121 21 -168 333 57 -267 -150 -175 175 85 -149 221 192 -147 208 -86 -283 137
4600 137 -163 100 204 -262 -139 15 85 274 -265 -102 114 -14 1 61 -259 319 5 60 292 -293 158
4621 158 171 8 165 -58 -57 72 -74 36 261 -66 -91 188 -155 325 55 50 168 -11 100 68 -243 77
4643 77 147 -87 140 -55 53 -117 -82 173 110 -21 106 91 85 -9 -198 239 -76 -151 35 -190 45 337 171
4666 171 267 -7 -74 41 -144 99 53 -234 221 108 -36 100 -436 -295 141 96 -15 -110 -62 -9 59 -194 182
4689 182 -358 253 352 -150 -9 -147 -55 111 -274 53 227 -90 330 115 -18 155 -197 9 48 -350 -3
4710 -3 326 -228 156 -167 105 79 -185 155 -33 176 219 -49 -136 177 -248 27 269 -317 234 -76 -215 39
4732 39 -151 145 -3 -287 -17 -316 -103 35 -137 -247 17 -106 -41 238 -171 193 101 55 67 -83 248 -172
4754 -172 -465 353 -113 -321 105 79 63 107 -194 116 50 -177 118 -267 -110 125 -83 124 -25 -243 1
4775 1 65 28 139 -204 160 -135 -325 126 -57 -93 118 -335 66 278 -174 -37 -53 -37 52 -103 53 23 -295
4798 -295 246 67 -61 29 -119 -260 194 -12 66 177 -348 -162 -18 110 67 -408 232 351 -82 301 -174
4819 -174 -51 79 -191 -68 296 -355 288 -50 -42 -225 -80 -168 0 -267 62 43 -33 199 -297 -67 40 -252
4841 -252 -28 33 -158 286 -246 256 224 -30 161 -140 -179 95 135 -290 -117 74 -162 67 -131 83 152 -149
4863 -149 235 29 58 -262 -232 28 -74 -99 -71 44 10 243 -325 -213 113 -40 18 94 -192 280 154 158 85
4886 85 -190 -8 -113 -87 -16 39 124 136 -85 265 -159 -76 134 -19 -100 171 -130 253 54 -202 -21 -134 -74
4909 -74 212 -241 -33 10 -141 -76 130 100 106 -28 52 80 -214 178 -130 -126 195 95 133 97 -108 -95 215 -67
4933 -67 253 -93 192 -51 -131 -176 -27 74 454 -99 -51 181 -66 -19 19 -28 223 5 -140 -26 -204 0
4955 0 253 -54 89 -19 -89 -17 200 -82 -182 -238 78 149 -268 -178 -216 109 69 -129 184 201 -289 31 -61 75
4979 75 8 -262 292 16 -94 346 -49 101 212 -189 106 -81 -156 347 289 -272 -196 -248 -257 293 -1 139 108
5002 108 148 389 188 -156 333 -323 143 71 17 238 -130 -167 168 -97 26 -57 -205 196 -156 -151 43 -180
5024 -180 -48 20 -131 -42 -82 190 177 -55 -3 106 -188 224 -89 -73 41 -22 -11 182 -154 56 33 11 279
5047 279 20 139 113 -20 -73 -49 69 291 179 -59 34 -101 -25 120 -323 -36 -190 -181 266 -285 106 242
5069 242 -324 151 -58 -64 161 -170 23 249 -133 243 22 -297 305 -29 -171 150 -35 -141 312 -24 -83
5090 -83 -177 -63 299 -319 -64 146 -216 239 -242 -168 311 -109 305 168 -336 24 88 -153 106 -21 28 268
5112 268 -131 12 -186 -64 -81 6 106 118 -159 -80 146 -281 133 157 -204 247 132 -191 26 -11 -98 -279
5134 -279 -20 145 -98 94 110 -306 189 65 -73 227 -150 141 38 -386 -204 171 -119 54 201 31
5154 31 62 -168 247 257 -47 -114 -68 -246 247 32 -24 229 47 89 -8 64 177 -222 34 370 -120 147 8
5177 8 -19 144 -74 -142 137 -279 -85 42 -103 129 -71 -15 96 -158 53 56 -86 144 60 -203 107 -125 103
5200 103 -71 173 142 152 -199 -29 61 60 -136 -74 173 138 134 39 129 -12 102 9 131 -39 -111 269 142 52 180
5225 180 -176 266 90 -222 113 -114 -148 -38 -269 11 107 -245 183 -122 -110 -23 -50 12 10 -123 222 -23 118
5248 118 191 -28 57 76 47 119 -219 -224 -231 -21 -346 199 -61 168 -126 -384 -202 -93 -183 44 -182 -1 -45 -117
5272 -117 -89 -131 -42 322 -30 329 225 -110 312 153 -88 90 71 -6 215 -45 74 178 -11 68 67 -51 179
5295 179 -39 132 -175 -127 88 -58 -211 225 -93 265 137 -141 -27 -102 -52 154 -144 54 72 -302 179
5316 179 32 -238 130 274 50 271 -59 73 154 -81 68 -147 -155 -39 -129 -47 168 110 15 287 -10 236
5338 236 -50 12 78 54 -140 33 -82 -117 -6 -10 14 -205 -1 171 -195 124 27 151 115 -121 -21 248 -76
5361 -76 245 221 -37 -16 -33 150 125 17 110 -281 -162 74 -104 159 -75 -193 -51 47 -23 164 -221 -254 12
5384 12 0 394 33 -35 274 85 -1 298 -120 -139 289 95 88 46 -110 23 51 22 33 -52 148 -57 -113 -185 39
5409 39 262 -47 -159 27 81 -97 43 -81 4 206 -79 230 -27 -194 267 -255 149 291 -206 129 20
5430 20 -141 97 -200 117 39 -115 -2 -26 -144 44 -72 -83 35 76 1 274 -39 181 0 -114 111 -71
5452 -71 -63 262 -295 -47 106 -74 156 128 -121 242 22 -30 -256 42 223 101 48 122 -257 -92 -157 -194 225
5475 225 15 -60 79 -90 51 222 -45 129 80 80 -18 16 19 162 -22 42 267 -209 88 -63 11 -324 -146
5498 -146 -67 100 -108 -6 72 -112 -6 -4 -59 317 56 -73 -129 -75 -27 44 32 179 44 -16 -267 -92 258 7
5522 7 152 357 -252 -19 -77 -210 159 44 99 358 -117 -125 -224 -72 28 -69 156 -43 -284 51 155 -108 130
5545 130 -62 84 199 36 -4 208 -177 92 7 -84 108 -217 -163 25 -194 -79 135 105 13 -423 -55 -17
5567 -17 8 -10 279 -6 -180 -80 -315 212 -158 -152 12 -3 -29 -207 49 194 -245 -275 -144 185 55 -72 -244
5590 -244 208 3 69 176 -138 194 128 -200 -56 123 32 61 51 -1 66 128 2 94 36 189 -278 -175 63
5613 63 -141 74 -145 -33 197 -71 11 213 -153 106 -41 46 37 174 -75 54 -329 175 20 -104 333 -83
5635 -83 -203 154 29 -16 506 -210 135 -35 21 -49 120 190 2 -265 95 -20 41 -17 -241 -227 184 119 -55
5658 -55 131 -143 176 127 -150 271 18 26 -6 -196 143 -144 -119 106 -78 141 121 92 57 193 -150 121 -273
5681 -273 42 139 -227 -67 -195 9 146 7 -63 27 -118 71 -45 -104 77 -6 -12 122 -18 4 60 -198 49
5704 49 -25 -142 207 -417 -124 92 -287 123 -159 8 327 -177 86 20 -219 43 -163 -20 154 -61 -141
5725 -141 109 -283 294 -43 -164 218 -74 9 112 335 95 77 -107 38 -319 -71 211 -149 -179 300 -46
5746 -46 -38 69 -100 159 -72 155 -120 -292 114 123 -69 -81 26 73 -183 -129 -145 288 -178 1 63 -80 46
5769 46 -154 87 124 -162 193 50 74 -165 -187 -4 48 -98 -147 -9 -16 172 -50 -16 -1 -65 103 259 -13 93
5793 93 -92 3 255 -254 98 -16 78 30 -64 130 182 -38 255 383 -3 53 -200 33 259 195 85 -53 -207
5816 -207 139 -56 -200 121 -37 -203 165 -289 -20 -69 -268 142 -63 -137 -167 -71 165 79 -144 121 -265 -265
5838 -265 -42 -157 45 72 -246 -71 193 -108 167 -249 -121 251 42 137 -200 147 223 -166 -65 -27 -180
5859 -180 136 -151 -23 -29 -375 -31 46 97 -51 21 -11 132 16 -196 -45 74 96 129 35 -269 54 -118 112
5882 112 6 47 296 -143 314 141 -206 113 -178 -154 268 142 -36 -70 -158 -149 299 27 221 -34 31 63 -14
5905 -14 -75 -59 -17 -64 144 -4 169 -246 315 -95 -16 364 -186 114 68 -295 -213 -41 -177 142 -166 -42 246
5928 246 -28 176 201 -244 279 49 7 12 -73 -141 72 -91 13 12 -262 36 -283 -109 55 -7 225 142 -162
5951 -162 261 6 222 -72 65 335 103 -200 -90 232 -121 176 -217 -30 35 -57 213 142 -147 235 -219
5972 -219 -32 257 -70 59 188 -13 -117 -336 -232 93 53 34 -108 -325 42 17 -284 -56 -120 104 -4
5993 -4 -178 80 34 -62 255 -120 -74 36 -66 140 225 -14 167 -107 -29 -63 -151 120 -13 24 147 -115 79
6016 79 53 -49 166 111 -215 -203 211 2 114 -227 -46 -99 -337 32 17 -378 78 -94 -288 -175 139 72
6038 72 -147 -188 123 -58 44 139 -222 29 -244 -171 113 218 -71 204 109 -179 -108 -81 358 82 -211 108
6060 108 -179 -210 -77 -14 34 123 204 118 -128 -42 170 -204 200 -76 -28 299 -261 -194 1 10 -23 29 -143 57
6084 57 27 -11 188 -188 -265 -62 -230 -59 -118 -94 173 -356 45 -16 82 -45 -10 -160 90 -102 79 161 -77
6107 -77 -36 200 -228 -89 -63 -260 -9 -139 -44 71 -65 133 -127 144 -59 -162 167 310 -90 188 153 -150
6129 -150 66 -245 120 100 -5 67 60 217 -55 -465 49 -68 -3 77 389 133 -6 171 26 97 -45 67
6151 67 125 -76 -162 -241 -185 -158 53 365 -277 -324 62 167 -33 185 -236 209 90 -93 -85 -167 324 72 107 117
6175 117 -6 116 -14 -63 -192 -34 -54 16 -89 -311 -3 251 -64 67 -187 -73 234 -284 -133 -158 -27
6196 -27 67 221 169 -176 -99 -172 6 -92 -55 -105 -67 13 -191 51 -215 4 252 167 28 389 -210 -70 68 -69
6220 -69 -56 114 -121 54 -200 41 220 -174 -130 10 -86 35 27 81 146 -409 136 122 -24 -37 -53 -214 2 -57
6244 -57 -35 28 -44 -17 64 67 249 -196 22 67 106 223 133 -37 -65 -65 -89 117 -31 117 95 20 121 33 -40 431
6270 431 55 -118 96 -163 137 60 -124 -12 -171 -66 -31 -170 35 43 -3 17 0 -43 55 -249 341 86 53
6293 53 -75 284 -34 342 -171 -131 -156 -38 93 97 -54 129 172 -3 4 -60 113 -3 -37 9 122 -94 333 -64
6317 -64 -26 28 -100 95 68 -28 229 -81 -59 174 -95 67 31 -178 -26 -197 222 -199 -37 113 -109 -108 22
6340 22 -29 -72 201 126 325 -149 -33 170 -142 -160 242 91 135 8 -45 217 -57 -6 -98 -143 32 -119 -167 146
6364 146 -315 -112 214 -43 62 18 115 33 4 -317 -186 -36 231 -138 -138 -14 -23 11 69 -71 -57 150 -205 43
6388 43 17 -31 87 -16 207 119 -43 -185 135 126 -36 44 -169 127 -85 -44 57 26 113 127 152 -46 -155 -181
6412 -181 167 -321 294 -15 -119 -70 -339 72 -10 -172 -121 77 -79 -7 -193 -207 24 37 11 56 -293 301 80
6435 80 -372 42 -57 4 141 -88 -35 81 -51 -13 -83 -171 20 -95 9 67 -42 -116 -195 -136 234 -127 -33 -54
6459 -54 70 171 66 -71 87 39 -42 45 -129 70 -147 -42 8 123 161 -24 -239 -26 212 31 -180 55
6481 55 -89 135 25 21 116 236 -69 -64 201 219 70 -141 -41 -103 -15 -178 -87 168 119 134 5 -184 186 39
6505 39 -130 117 20 -184 127 -198 -26 -276 -465 183 -83 -19 167 -128 109 -67 -97 -16 83 129 23 -134
6527 -134 287 186 -8 138 57 -247 151 -165 -73 25 1 -140 102 194 370 -120 -17 -9 -139 89 -107 -39 -14
6550 -14 -16 -59 142 -194 25 -69 -21 252 59 -107 22 65 47 21 -43 88 109 -223 47 -185 -204 -145 86 60 -15
6575 -15 -261 3 6 -235 -6 -383 138 131 -87 138 -138 91 -75 -126 104 -98 -121 10 13 -141 144 -420 70
6598 70 -23 161 455 26 -182 195 -197 75 -134 2 424 22 79 -204 -93 161 209 -27 231 -240 -195 21
6620 21 -200 -101 209 -127 15 56 -224 -60 -253 -123 263 48 115 215 45 190 -195 -71 37 -116 -34 332
6642 332 13 32 17 25 133 -111 -58 -99 -7 17 50 -88 133 -49 139 155 -180 2 246 10 280 146 37
6665 37 -49 -107 104 -6 -72 34 142 -53 -3 -134 176 39 -138 60 -230 -105 -76 -57 -271 43 -61 -44 -68
6688 -68 6 113 21 -178 70 -27 30 127 -78 0 3 139 94 27 -64 -75 -217 76 123 70 -103 44 35 207 60 -27
6714 -27 284 -155 277 -75 -321 -66 47 112 -148 -322 -53 49 36 -17 -12 91 163 -8 74 -24 63 -61 62
6737 62 -126 134 23 106 83 32 124 -240 -305 11 15 316 171 -155 -12 137 245 -61 -94 -61 116 -151 117
6760 117 32 -13 282 110 -14 -313 -240 31 261 -97 263 -50 -45 -75 168 153 -110 -146 -156 -127 89 176 -40 -92
6784 -92 -144 -84 189 -142 27 12 6 -8 -104 -166 -29 -174 -41 -126 122 -156 306 -79 61 -346 -206 1 -24 -199
6808 -199 -2 -27 160 55 -57 101 16 32 237 18 54 120 12 129 271 -255 186 -14 -135 72 -239 303
6830 303 -314 -200 231 52 126 -4 -225 142 -136 -83 -37 -81 240 58 -40 139 91 -31 29 38 -108 -185 -363
6853 -363 224 205 12 -1 37 -172 239 -23 -201 -56 -148 115 -21 143 -88 -10 198 -57 -59 65 -138 131
6875 131 41 -68 26 221 -254 42 124 25 51 189 -226 -116 53 -141 104 -172 230 -142 33 36 -107 -110 230
6898 230 -261 -76 -290 66 269 -205 -97 85 -3 52 101 75 -142 -142 319 154 -135 -4 140 -152 149 -240
6920 -240 64 -120 -61 242 -240 14 31 -83 -158 245 -268 -266 4 63 107 -114 159 -281 -137 131 39 45 -45 -118
6944 -118 -91 -23 91 -50 143 -200 58 81 -92 -3 -81 -109 276 -44 193 -96 119 -83 -6 -57 107 -306 51
6967 51 -139 -210 78 109 84 131 140 -2 12 -173 101 -50 -65 48 54 77 210 -263 354 -12 28 56 156 -2 423
6992 423 -126 -98 74 -98 -66 133 126 225 -201 28 -124 -183 124 -27 61 38 -113 59 -118 108 -19 -234 87
7015 87 127 -144 105 197 -40 89 -114 132 15 174 17 31 55 -43 -111 145 15 -131 22 296 -206 88
7037 88 -1 -157 -67 119 -101 88 -361 -161 54 -76 174 -177 -238 163 55 -29 103 -173 35 -5 20 9 -308
7060 -308 -145 119 -82 -55 208 -373 88 -122 -86 143 -122 -208 39 -221 -44 198 -77 76 95 -45 103
7081 103 -156 124 71 -118 199 -238 -180 47 -70 -130 141 -149 161 -161 -153 129 -131 149 -97 -218 -22 -232
7103 -232 136 -84 98 -25 -123 264 325 -98 15 29 84 170 29 -79 -198 -89 -17 -2 -91 -54 282 -26 209
7126 209 96 9 231 311 9 105 -87 19 -231 -84 126 -307 -139 5 -48 -116 158 -17 32 3 -100 100
7148 100 -102 -161 131 -206 7 -141 -102 93 -92 230 79 -163 123 26 84 -62 -212 -30 27 93 -181 -4
7170 -4 -14 -119 -14 -64 -84 77 58 267 -224 236 159 -166 -148 185 8 29 -260 152 -125 129 103 -317 220
7193 220 -36 104 -69 -38 39 -35 -123 -11 180 15 -142 -79 -67 -59 9 175 120 105 -170 -45 -226 -39 16 -210
7217 -210 -8 104 -255 -52 78 328 237 -197 93 -164 -120 172 -50 -50 -125 -109 180 156 211 201 -342 -31 -25 -70
7241 -70 -126 101 -205 30 80 -323 216 59 70 45 -161 359 -38 -43 40 12 -160 -99 -76 92 115 -44 259 -62
7265 -62 219 137 -110 76 36 -92 91 66 -44 203 6 -38 25 81 27 -21 -193 -14 -86 -72 40 -14 167 176 142
7290 142 43 -250 71 5 -201 96 141 49 88 -24 -139 99 -3 165 -122 -255 146 201 -44 -233 -246 161
7312 161 -216 -142 140 -12 -28 35 -252 -165 111 -180 -5 16 61 96 -106 -236 -78 84 167 -50 -467 66 -76
7335 -76 63 14 38 4 -42 -35 21 -101 60 39 -19 -6 36 164 -149 24 80 110 -229 81 -159 -40 -147 -83 51
7360 51 27 -180 162 105 -71 -144 -210 239 48 86 -8 287 -126 126 -134 -69 -81 -87 78 -225 -161 -11 104 97 109
7385 109 -118 56 -7 -169 178 100 -185 62 71 27 -90 -162 -101 0 -142 -93 84 54 -230 -304 -70 244 -129
7408 -129 -22 -116 28 -22 -199 -351 -128 -107 -181 203 -117 -8 42 -1 -6 13 54 -181 -78 118 290 62 21 163
7432 163 123 69 -39 44 46 -35 96 111 193 203 -121 137 -222 -159 81 196 125 43 -371 -1 153 66 7 71 -87
7457 -87 -108 -325 174 111 -189 244 145 105 -46 94 -334 -4 -57 -102 -69 76 153 -91 -181 -31 -118 130 125 -43
7481 -43 105 55 -84 159 -65 50 -258 132 -347 176 2 -127 18 3 -119 -50 0 -93 114 82 138 126 104
7504 104 -205 -33 -41 84 148 -96 34 76 -252 379 172 27 211 6 -135 50 10 192 234 105 17 133
7526 133 -119 -9 -158 -26 124 29 181 -121 -113 70 -51 119 289 68 61 93 -157 146 -59 6 132 -148
7548 -148 206 -151 -183 157 -22 241 44 -23 -191 30 -10 -11 -102 -88 205 31 49 -81 -145 -13 97 -194 -2
7571 -2 122 -5 188 -79 60 58 -105 159 -2 57 -58 -98 -242 49 -154 2 -74 -52 219 -77 176 -19 16
7594 16 54 -59 -131 -20 163 -44 83 -116 21 78 100 110 -393 -54 232 -20 427 61 -115 69 2 -132
7616 -132 -209 79 146 -60 58 -265 203 -21 124 -103 -20 -174 75 -105 -150 242 224 -291 -106 -12 -136 94
7638 94 5 -31 -134 -97 -142 35 -235 -32 -6 79 11 -259 -198 -123 -277 113 -112 13 -201 -189 11 -34 -238 219
7662 219 -263 -10 -60 54 -222 93 -7 -26 192 20 94 20 45 -96 -115 99 1 -31 -90 460 -26 1 5 -6
7686 -6 -25 -172 -84 64 -4 61 284 -360 -85 -68 -22 -98 -120 113 56 148 138 120 -49 -117 -48 34 1 63 55 -129 -67
7713 -67 26 77 -113 -178 121 -98 -17 -20 56 -46 333 155 37 -184 -47 -81 -303 -67 57 96 -87 -28 -261 -84
7737 -84 -11 -145 16 220 95 29 -99 182 -69 35 -23 -269 75 175 -5 -12 -139 216 -178 75 59 108 59
7760 59 22 -77 117 -95 194 189 133 58 -136 224 -76 159 -21 82 219 25 -2 -80 -14 -114 212 50 29 212
7784 212 -144 -65 16 68 200 -215 12 117 62 -80 180 -96 -3 -131 -67 161 -143 -25 48 -40 145 -18 52
7807 52 -64 -31 -205 -134 -166 83 38 -77 119 -320 34 84 16 -277 39 -124 -28 -50 78 -100 154 -38 -173
7830 -173 -155 42 148 -21 197 -97 -94 192 -29 129 -60 88 97 -35 -28 122 -85 91 127 37 90 -80 24
7853 24 9 -190 79 -17 -64 26 18 -122 308 116 -144 228 -217 82 -165 -148 296 -93 -108 180 231 -18 -158
7876 -158 56 146 -44 -281 264 105 319 7 -223 146 92 -31 -91 -275 64 94 -160 61 -112 -15 -257 -212
7898 -212 400 -17 -111 23 17 60 150 -107 132 115 -33 6 -145 -153 80 -125 -1 -64 -158 118 67 160 -24 -148
7922 -148 -46 51 -103 110 -39 68 -69 -165 -8 227 183 -176 -159 -223 -178 -109 -72 -78 -352 -127 39 -165 -115 34
7946 34 216 162 -4 -145 117 -161 -155 -25 -130 18 -84 -122 55 -20 76 -97 -5 6 -130 -28 210 46 -126
7969 -126 28 -62 89 -47 -47 143 -207 -101 -38 -66 65 -21 -9 -72 87 -77 -153 -47 67 152 36 -149 -128 126
7993 126 60 -306 136 69 35 158 38 -119 23 -128 -7 17 -122 112 207 -74 -34 76 -2 46 47 67 -143 65
8017 65 360 64 -167 -216 43 10 -26 52 54 5 101 -9 -51 277 -129 -39 -250 68 91 57 90 -183 -269 139 -188
8042 -188 -54 254 52 41 -64 81 -61 -59 -145 -52 211 52 -84 -5 39 -34 -59 44 57 -158 123 222 -163 104
8066 104 -20 177 96 -5 -146 228 -54 -160 -89 -156 -132 -38 -250 -70 68 -71 75 -275 -49 17 325 -63
8088 -63 -86 180 -72 -185 263 48 -218 -93 -61 62 161 31 -101 -202 -207 -22 -78 56 -208 -3 174 162 -295
8111 -295 -96 132 -14 102 16 4 -13 129 -181 -160 -102 -61 -157 -90 -48 64 -166 82 -97 -50 -17 61 -172 -57
8135 -57 -288 199 -335 148 23 -70 3 -166 86 -325 230 57 -146 87 98 -233 -259 120 59 90 147 -222 187
8158 187 137 -109 82 37 -8 87 -33 64 -73 -49 -82 -234 24 0 -34 112 165 -14 55 -147 -37 202 181 114
8182 114 -29 -132 4 -203 -78 147 -194 -154 177
8191A77
$$ Imaginary data points
##PAGE= N=2
##DATA TABLE= (X++(I..I)), XYDATA
0 0 0 0 0 0 0 0 0 0 0 0 0 0 0 0 0 0 0 -7 8 -8 8 -8 8 -16 16 -16 19 -24 24 -32 33 -40 43 -50 56 -63 71 -78 89
39 89 -99 107 -122 134 -148 164 -181 200 -220 244 -266 294 -324 356 -394 436 -485 539 -601 676
59 676 -763 871 -1002 1174 -1400 1720 -2197 2993 -4554 8732 -43212 -116800 -31602 -21510
73 -21510 -10854 18633 37208 57536 41931 27745 -1698 -82383 -64568 -21221 -19148 25519
85 25519 43714 46086 60460 8315 -22143 -38223 -69134 -33775 -9437 5843 55568 49115 40804
98 40804 25441 -32552 -38601 -45853 -55733 -7318 14932 41484 62691 23810 16982 -2254 -50492
111 -50492 -45794 -45762 -21969 28448 32016 55272 49655 -7776 -10513 -25475 -48896 -34013 -32568 8669
125 8669 53399 46357 46524 8278 -28467 -20187 -46905 -38156 -5480 -11392 33733 64908 34959
138 34959 14300 -20008 -33406 -32037 -49621 -12268 16210 16581 54191 41828 6597 -3030 -36174
151 -36174 -39000 -33035 -31147 21192 34496 25826 45801 19449 -9999 -27524 -49586 -26934 -16551
164 -16551 -2001 43013 31914 25776 32865 -9341 -28812 -39661 -44914 -5921 7200 22085 42812
177 42812 22347 23502 5724 -37191 -31101 -36769 -29407 18089 26215 33788 33724 8173 5564 -21077
191 -21077 -41141 -25147 -31491 477 41851 28519 31020 17882 -10887 -10802 -33476 -38497 -16136
204 -16136 -6762 30558 41367 21351 23071 -6038 -24707 -18360 -39354 -22917 6205 13989 41126
217 41126 32758 10389 4826 -25964 -29978 -21922 -27996 2752 18041 25200 44157 14588 -6247
230 -6247 -12024 -38515 -25532 -12000 -8825 20432 25380 31568 30351 -9443 -17725 -24720 -38145 -9286
244 -9286 -169 7821 33229 24535 23170 8778 -26580 -25248 -29491 -22462 9341 8302 22165 35445
258 35445 13350 9729 -11826 -38003 -23990 -20681 -1384 22261 15103 28280 23796 -1069 -4533
271 -4533 -29752 -35928 -12354 -7731 18099 29478 15825 24323 5477 -16393 -16250 -33788 -22253
284 -22253 -26 7155 32404 26744 10338 11683 -14791 -23188 -19273 -29385 -3288 15092 18764
297 18764 33897 14894 341 -4246 -27666 -21377 -17788 -15584 17700 22835 22490 26065 -2863 -10446
311 -10446 -15439 -30013 -13934 -9169 2745 30067 22278 20229 10375 -19790 -16720 -21003 -23070 412
325 412 1662 16502 33153 15797 9993 -8824 -28314 -16900 -19961 -8413 13776 10217 25218
338 25218 25068 2033 -2062 -22358 -28977 -11073 -10788 8012 21456 15104 24852 8828 -10949 -12044
352 -12044 -28848 -20062 -636 542 20813 22510 12986 16092 -7903 -19394 -18104 -27078 -4117
365 -4117 10706 10522 26302 15112 5696 3660 -21317 -21174 -17267 -16128 12422 17542 16858 23011 2037
380 2037 -3021 -8076 -26771 -15974 -10708 -693 23913 18146 17176 12363 -11802 -9769 -17128 -24206
394 -24206 -4230 -624 12879 27847 13416 10048 -2349 -19618 -12638 -19435 -13055 8189 8089
407 8089 22251 22917 2276 1110 -14328 -22493 -10579 -14171 575 16314 14124 24142 9684
420 9684 -8566 -7682 -22123 -17201 -3121 -5514 13393 19964 13428 16909 -3958 -15694 -14167 -22625
434 -22625 -5749 4327 4484 22090 15233 7449 6777 -16051 -18364 -14373 -15677 6117 11503 12839
448 12839 21211 5699 1150 -5401 -24219 -13877 -9550 -4229 17120 13419 14071 15485 -4191 -6898
462 -6898 -15295 -22901 -5518 -1810 8879 21329 9499 12031 4482 -14108 -11231 -18638 -14651 5355
476 5355 6020 16328 19406 4684 4608 -9422 -18522 -10051 -15296 -1693 13439 9422 19996 12138
490 12138 -4539 -3728 -17323 -16303 -5403 -6956 9362 15722 12302 17555 -1596 -11891 -9095 -19738
504 -19738 -8827 1569 992 17567 15932 8899 6242 -12443 -13539 -11988 -15537 2499 5818 8112
518 8112 22111 8509 690 -2902 -18563 -12575 -9079 -6073 10506 9890 14118 15843 -2486 -3901
532 -3901 -11602 -20738 -5194 -3761 2937 17875 10116 10915 6240 -9458 -8600 -16232 -13988 1585 1569
547 1569 14101 17979 3146 7063 -3468 -16498 -9877 -13619 -4472 9468 8016 16852 10412 -561
561 -561 1228 -14069 -15540 -6337 -9645 7349 15561 8317 13341 2876 -6055 -6527 -17612 -9716 -2006
576 -2006 -420 16421 12285 6916 9776 -8059 -11238 -8894 -15214 -2014 4534 7380 17730 7782
590 7782 3759 -485 -15774 -9849 -9197 -8910 8811 7444 10290 16308 662 -2711 -7971 -16960 -6906
605 -6906 -5604 1326 14038 8383 12577 7042 -9135 -4652 -12181 -15163 702 210 7864 15626 7459
620 7459 7978 -3178 -12909 -7307 -13524 -5010 7393 3357 14110 12595 276 2372 -9528 -14516
634 -14516 -7101 -8658 3725 10474 8077 14582 2894 -4164 -2755 -15693 -9913 -1595 -3553 10961
648 10961 12216 7528 8960 -4432 -7808 -8030 -14692 -2479 1301 3855 16629 7310 3803 3973 -12170
663 -12170 -10012 -7937 -9244 4429 5825 9714 13709 1031 1463 -4803 -15558 -5780 -7045 -2854
677 -2854 12466 7903 9677 8904 -4941 -4129 -10108 -11890 -1253 -3477 6493 13448 5107 9612 984
692 984 -11806 -5999 -11048 -7656 4134 2782 11466 10890 2433 4215 -7809 -11215 -5411 -10881 1199
707 1199 9249 4616 13026 6347 -3109 -1760 -11942 -8964 -3991 -4485 9146 8883 6526 10915 -2803
722 -2803 -6538 -5205 -14253 -4457 1308 1349 12386 7621 5283 4237 -8818 -6917 -8668 -10608 4326
737 4326 3520 5770 14233 2846 1012 -1678 -12190 -6577 -6950 -3293 8165 5293 10146 9106 -3670
752 -3670 -929 -8199 -13070 -1158 -3241 2477 11648 5577 8034 2422 -7273 -4622 -11180 -7118 2578
767 2578 -332 9988 10992 1678 5044 -4062 -10471 -4831 -9209 -1351 5817 4109 12054 5496 -652
782 -652 553 -11272 -8624 -2321 -6259 5446 8302 4975 9936 212 -3948 -4538 -12574 -4238 -965
797 -965 -178 11343 6263 4430 6388 -6885 -5980 -5855 -10489 791 2483 5151 11879 3051 2827 -802
813 -802 -10978 -4279 -6697 -5701 6949 3990 7215 9991 -1084 -623 -6021 -11197 -2792 -4435 1893
828 1893 9468 3477 8591 3697 -6075 -2058 -9081 -8958 897 -891 7059 9649 2842 5885 -3018
843 -3018 -7897 -3818 -9721 -2215 4411 1443 10294 7183 -95 1837 -8036 -7913 -3121 -6165 3976
858 3976 5794 3837 10180 1142 -2673 -1566 -11258 -5046 -1000 -2162 8803 6141 4169 6377 -4204
873 -4204 -4100 -4601 -9990 -153 302 2579 11320 3586 3016 1446 -8860 -4276 -5597 -5987 4651 2276
889 2276 6145 9374 -256 1653 -4133 -10188 -2437 -4892 -685 8336 3214 6868 5333 -3906 -980
904 -980 -7246 -8062 -276 -2916 5254 9054 1849 6470 -472 -6935 -2363 -8053 -3579 3055 79 8385
920 8385 6517 1112 3623 -6494 -7075 -2477 -7067 2195 4868 2681 8989 2059 -971 -79 -9363
935 -9363 -4818 -2196 -3504 6885 5142 3963 7118 -3075 -2941 -3260 -8998 -839 -945 518 9483
950 9483 3701 3786 3038 -6989 -3456 -5147 -6549 3340 1450 4506 8897 562 2026 -2014 -8786 -2676
966 -2676 -5241 -1910 6374 2321 6650 5442 -3045 237 -5634 -7806 -623 -3595 3278 7438 1860
981 1860 6721 679 -5462 -1646 -7649 -4232 2290 -786 6576 6077 1314 4588 -4193 -5694 -2637
996 -2637 -7687 1021 4408 1127 8182 2918 -710 1207 -7323 -4585 -2429 -4199 5479 4151 2917
1011 2917 7575 -1715 -1954 -1912 -8681 -1902 -1098 -538 7686 2924 3337 4056 -4989 -2637 -4408 -6928 2085
1028 2085 371 3241 8287 751 2546 -58 -7072 -1957 -4830 -3002 4787 1613 6351 5592 -2153
1043 -2153 1372 -4465 -6973 28 -4136 1117 6205 2124 5873 1978 -3999 -892 -7250 -4046 1071
1058 1071 -2449 5484 5974 277 5047 -2181 -5212 -1712 -6861 -680 2437 1125 7427 2854 147
1073 147 1799 -6669 -3878 -1602 -5406 3443 3564 2094 7231 193 -1126 -1345 -7660 -1728 -1256 -1222
1089 -1222 6533 1954 3045 5065 -4073 -1742 -3443 -7412 917 269 2360 6786 846 2895 493
1104 493 -6008 -938 -4910 -3992 4116 347 4341 6270 -1066 1055 -2913 -6096 -1197 -4035 914
1119 914 5175 665 6131 2516 -3639 399 -5496 -4873 721 -2154 4029 5150 1333 4648 -1998
1134 -1998 -3471 -927 -6818 -1337 1947 -753 6804 3632 -147 2391 -4870 -3638 -1467 -4548 2211
1149 2211 1841 1683 7340 -91 -406 -65 -7535 -2117 -1028 -2529 5079 2435 2196 4464 -2331 -893
1165 -893 -2942 -6344 731 -1266 750 7083 691 2683 2038 -5206 -1552 -3598 -4039 2286 -180 3957
1181 3957 5001 -519 2913 -2278 -6289 -516 -4206 -782 4783 461 4473 3312 -1685 463 -4419
1196 -4419 -4320 -296 -3200 3480 4815 381 4705 -330 -3535 -58 -5195 -2532 1105 -516 5365
1211 5365 3317 782 2923 -4368 -2972 -676 -5793 1575 1967 175 5977 1535 -221 369 -5161
1226 -5161 -2117 -2178 -2548 4737 1601 2637 5174 -2420 -425 -999 -6167 -332 -1056 -343 4895 1631
1242 1631 3087 1729 -4274 -281 -3567 -4423 2698 -769 2101 5568 -266 2062 -543 -4623 -1350
1257 -1350 -3726 -598 3245 -72 4826 3233 -2057 1862 -3807 -4761 385 -2813 1320 3993 958
1272 958 4376 100 -1783 -95 -5523 -1747 776 -1950 4478 3211 -92 3774 -2450 -3004 -1112
1287 -1112 -4499 567 1004 516 5617 523 695 1884 -4949 -1723 -1691 -3923 3063 1958 1861 4431 -1061
1304 -1061 -255 -1213 -4831 236 -1998 -1016 5103 618 2422 3232 -3433 -586 -2117 -4141 973 -587
1320 -587 1961 4434 25 2827 -177 -4519 206 -3757 -1959 3259 -286 3345 3833 -864 1268
1335 1268 -2480 -3732 -454 -3281 1356 3082 -56 4758 931 -2208 779 -4302 -2398 1120 -1673
1350 -1673 3002 2597 983 3653 -1981 -1724 -677 -5149 273 1368 -665 4982 1241 32 1933
1365 1933 -3291 -1851 -1414 -3123 2523 953 1510 4848 -938 28 -23 -4893 -304 -1184 -1709 3589 1010
1382 1010 2176 2808 -2372 67 -2718 -4262 1232 -1395 938 4505 -218 2149 1124 -3323 -267
1397 -267 -2950 -2155 1629 -848 3291 3399 -1075 2149 -2104 -3512 416 -2951 -176 2722 136 3740
1413 3740 1308 -1386 649 -3852 -1896 343 -2224 2743 2278 14 3714 -903 -2106 -59 -4094
1428 -4094 -643 657 -504 4145 1026 657 1917 -3388 -1255 -820 -3740 1644 605 754 4394 173
1444 173 434 -47 -4076 -617 -1512 -1495 3205 332 1764 3167 -1632 308 -1239 -4008 250 -1028
1460 -1028 400 3810 47 1986 798 -2949 286 -3088 -2554 1729 -926 2321 3373 -526 1732
1475 1732 -1329 -2931 166 -3085 -23 2236 -545 3668 1330 -1160 1413 -3131 -2309 484 -2067
1490 -2067 1856 1996 182 3106 -764 -1211 166 -3763 -585 93 -1247 3583 1325 463 2555 -2273
1506 -2273 -1150 -698 -3230 995 217 375 3774 358 736 758 -3563 -667 -1126 -1813 2436 329 1515
1523 1515 3003 -1277 637 -733 -3641 106 -1479 149 3490 72 2103 1156 -2553 441 -2388
1538 -2388 -2270 1431 -1013 1876 2952 -375 2155 -624 -2698 139 -2642 -373 1938 -426 2924
1553 2924 1667 -745 1264 -2396 -2326 432 -2391 1405 1603 13 3081 -256 -1107 489 -3160 -732
1569 -732 -154 -1516 2797 1446 301 2388 -1796 -1004 -837 -3107 521 19 -136 3475 201 809 1112
1586 1112 -2979 -641 -1138 -2518 2315 261 1004 2921 -756 701 -703 -3003 253 -1805 -198
1601 -198 2798 -202 1860 1880 -2109 291 -1755 -2500 959 -999 1233 2398 -423 2230 -256 -2207
1617 -2207 277 -2878 -1079 1756 -659 2258 1801 -619 1226 -1812 -1654 -114 -2698 824 1537 -151
1633 -151 3128 361 -1037 780 -2808 -1069 58 -1459 2130 862 289 2562 -1413 -705 -375 -3041
1649 -3041 579 73 -618 2982 339 208 1592 -2238 -244 -1202 -2372 1495 -181 1015 2702 -1354
1665 -1354 624 -38 -2994 192 -1194 -1105 2247 98 1923 1685 -1430 254 -1866 -2032 826 -1594
1681 -1594 895 2420 -561 2217 365 -1776 144 -2251 -951 1051 -611 2089 1484 -702 1688
1696 1688 -1483 -1940 432 -2372 109 1311 -296 2597 504 -393 470 -2621 -464 78 -1681 2054
1712 2054 573 27 2583 -543 -597 -114 -2830 -89 54 -333 2367 -180 625 1482 -2141 50 -630
1729 -630 -2763 1478 -48 519 2555 -326 594 199 -1985 -182 -1546 -997 1920 -494 1720 1847
1745 1847 -1623 800 -869 -2393 697 -1141 314 1881 -5 1809 127 -1415 947 -2107 -1339
1760 -1339 1121 -1120 1622 1939 -522 1370 -871 -1553 451 -1994 42 733 -462 2930 631 -690
1776 -690 1186 -2279 -1219 314 -1646 1117 792 -222 2349 -514 -38 310 -2553 336 -388 -988
1792 -988 2221 492 471 1822 -1503 -647 -954 -1791 960 -239 193 2188 -594 1230 564 -2601 114
1809 114 -817 -1449 1755 -42 697 1714 -721 1057 -969 -1932 523 -1328 596 2145 -826 1454
1825 1454 1140 -1507 565 -1609 -1710 563 -1057 1745 1761 -360 1654 -940 -1373 964 -2299 -564
1841 -564 1221 -556 2092 843 -425 971 -1537 -596 -43 -2096 1309 668 -9 2585 -671 -739 737
1858 737 -2110 -148 -210 -1164 1606 673 1065 1524 -1705 22 32 -1900 1374 -337 -626 2258 200
1875 200 641 500 -1846 -65 -729 -846 1240 -824 596 1910 -1032 1020 -613 -2095 420 -966
1891 -966 -78 1375 -708 1451 610 -575 642 -1795 -1098 1072 -1218 1045 1500 -860 1802 88
1907 88 -1045 -62 -2006 -178 831 -252 1927 314 -551 2069 -1094 -927 16 -2033 785 1380 45
1924 45 1739 -566 -377 789 -2027 198 -776 -1380 2124 697 183 1710 -1591 -327 -2 -1758 359
1941 359 -591 -137 2125 -287 852 511 -1935 704 -451 -1731 1038 -516 740 2224 -353 522
1957 522 -658 -1514 894 -1207 -471 1303 -860 1877 1716 -1339 492 -1428 -1259 1068 -1041 494
1973 494 954 -107 2024 -127 -1082 183 -2011 -133 1471 -901 1252 290 -143 1531 -1007 -951 10
1990 10 -1721 1039 834 -626 1870 -281 -34 1253 -1849 -314 -55 -961 1751 221 -140 1430 -835
2007 -835 725 105 -2265 412 -109 -264 2254 -542 -144 1111 -1143 554 -735 -1639 830 -473
2023 -473 960 1998 -1164 558 116 -1210 1054 -1220 -935 1114 -346 1451 956 -1224 449 -705
2039 -705 -594 624 -1606 236 969 -382 1888 321 -1224 655 -1104 -128 402 -1332 1202 648
2055 648 -132 1534 -1317 -799 720 -1241 533 37 -1089 1696 554 105 965 -2306 -262 371 -1260
2072 -1260 1121 -255 -461 2150 -483 232 221 -2051 451 -75 -254 1531 -739 73 1407 -894 603
2089 603 -943 -1676 1148 -295 463 1443 -825 568 554 -1072 518 -1489 -799 1404 -242 1104 606
2106 606 -1142 1303 -151 -1169 285 -1839 166 1493 -458 1144 -145 -819 1257 -930 -588 322
2122 322 -1132 1264 1078 -516 1016 -1009 -565 1107 -1305 166 111 -1002 2156 420 -18 556 -1508
2139 -1508 -90 652 -1128 653 -297 -6 2195 -466 160 52 -1716 852 -102 -948 1144 -366 920
2156 920 1386 -1227 93 -767 -1416 1202 -481 -333 845 -707 1216 654 -1415 76 -1193 -418 1599
2173 1599 -710 171 560 -685 1464 -35 -1272 69 -1084 414 1476 -712 933 -119 -255 1340
2189 1340 -1280 -1013 28 -917 1596 840 -751 1008 -458 -146 768 -1501 -51 122 -485 1812 46
2206 46 -526 1017 -873 313 398 -1830 476 464 303 1838 -804 -98 300 -1345 811 -542 -1639
2223 -1639 978 -230 840 1354 -1440 -97 -44 -716 1002 -910 -500 1170 -79 1175 474 -2059
2239 -2059 368 -536 -739 1219 -899 41 929 -420 1234 -509 -1355 474 -1020 602 987 -1161
2255 -1161 939 683 -285 828 -1447 -832 836 -608 697 404 -673 1303 -2 -56 544 -2065 144
2272 144 476 -572 1080 -118 -392 1237 -443 150 -67 -1661 1033 509 56 1519 -989 -66 1215
2289 1215 -694 279 -553 -1328 1100 47 506 935 -1503 606 145 -998 644 -881 -738 1476 -225
2306 -225 487 196 -1363 507 13 -524 472 -1128 617 1490 -506 752 -645 -1155 1123 -501 -496 344
2324 344 -745 1375 805 -303 394 -1228 -308 884 -1105 416 133 -658 1714 296 -530 207 -1258
2341 -1258 153 683 -545 900 -185 17 1538 -835 -354 83 -1190 991 668 -576 928 -436
2357 -436 259 739 -876 69 -469 -875 1332 -439 -91 1053 -566 651 386 -1486 135 -337 188
2374 188 1527 -408 174 357 -820 1117 -389 -1449 650 -388 573 1305 -671 269 -140 -418 820
2391 820 -1070 -320 540 -811 1243 616 -784 768 -642 -568 893 -1137 -241 543 -9 1324 -372
2408 -372 -552 339 -1100 323 713 -1296 964 596 -185 1240 -837 -519 218 -623 490 -59 -615 750
2426 750 -424 339 869 -1402 -264 111 -483 791 -245 -170 1098 -410 557 -132 -1329 675 -336
2443 -336 -328 1489 -821 28 778 -577 745 -584 -1168 503 -275 628 909 -831 870 466 -796 760
2461 760 -1069 -657 1072 -412 553 383 -638 929 -202 -317 257 -1670 290 739 -404 946 -396
2478 -396 -650 881 -612 -92 68 -1118 775 406 -191 933 -901 -16 702 -1265 443 -129 -708
2495 -708 1071 134 -17 451 -1291 106 154 -802 683 -827 -136 1193 -398 304 381 -1321 479 -52
2513 -52 -396 610 -200 824 685 -719 299 -785 -969 1009 -550 34 733 -315 510 539 -745 175
2531 175 -989 -215 810 -474 729 350 -494 1288 -38 -632 464 -1210 143 810 -334 634 -329
2548 -329 -266 1019 -1274 -137 12 -772 1024 449 -446 674 -485 -131 486 -983 33 -152 -527 970
2566 970 -284 -42 485 -1054 354 208 -1021 339 -80 -43 1101 -512 66 204 -749 573 -555
2583 -555 -797 802 -338 348 717 -901 338 -36 -648 756 -735 -273 499 -768 591 182 -864
2600 -864 483 -596 -321 675 -747 245 633 -244 897 -79 -565 289 -780 294 568 -598 753
2617 753 263 -193 767 -866 -481 257 -850 674 225 -473 741 -173 218 611 -1294 145 37 -786
2635 -786 560 -10 -300 839 -140 207 122 -800 363 -114 -145 1029 -555 93 250 -758 326 -585
2653 -585 -733 670 -337 135 707 -710 355 -58 -716 724 -514 -135 677 -551 592 181 -521
2670 -521 570 -344 -344 460 -355 500 319 -413 735 -247 -388 523 -887 234 341 -491 590 175 -603
2689 -603 600 -576 -288 399 -608 556 69 -506 773 -287 -120 645 -894 271 175 -627 540
2706 540 -349 -36 670 -777 182 -136 -832 178 -215 -222 708 -643 172 622 -723 510 -412 -630 590
2725 590 -246 11 649 -455 550 84 -743 421 -560 64 934 -658 556 60 -587 598 -438 -450
2743 -450 369 -755 408 373 -562 767 -28 -361 570 -652 65 486 -397 535 142 -395 462 -347 -222
2762 -222 330 -950 531 414 -392 680 -57 -47 412 -696 196 85 -948 529 -194 -317 818 -526
2780 -526 -264 169 -800 407 91 -521 773 -418 98 478 -565 405 -226 -613 814 -493 13 475
2798 475 -603 173 42 -824 420 -307 -215 496 -396 218 135 -394 433 -337 -391 401 -348 125 681 -472
2818 -472 624 236 -293 668 -669 25 419 -518 420 391 -298 810 -528 -63 242 -874 233 279 -180
2837 -180 791 -179 -52 297 -328 550 81 -925 749 -96 -150 787 -549 -20 -16 -684 439 20 -586 506
2857 506 -717 63 456 -683 554 -25 -503 649 -92 -236 406 -616 251 149 -574 409 -475 -146
2875 -146 854 -553 262 497 -397 481 -84 -360 471 -411 97 342 -318 578 -120 -289 590 -709 152
2894 152 352 -504 235 127 -252 664 -197 -107 262 -776 408 206 -459 732 -126 -223 684 -574 -136
2913 -136 260 -607 626 -206 -88 569 -399 71 77 -617 254 -33 -574 378 -268 -163 550 -548 115 -161
2933 -161 -217 748 -232 182 676 -588 293 172 -544 312 -14 -401 408 -322 438 584 -498 373 -382 -183
2953 -183 491 -678 419 623 -823 563 97 -417 148 -476 -171 208 -687 477 136 -420 687 -249
2971 -249 -191 596 -616 251 337 -312 336 178 -228 234 -863 -24 -78 -559 321 -249 -373 790 -394 96
2991 96 237 -525 400 222 -531 490 -325 247 451 -559 502 3 -582 642 -92 -227 754 -329 223
3010 223 99 -311 204 -307 -251 479 -626 172 428 -600 648 128 -497 663 -426 102 538 -426 115
3029 115 28 -305 634 -424 -74 497 -574 382 308 -353 446 21 -433 361 -604 330 194 -598 692 -39
3049 -39 -321 657 -305 -227 117 -587 330 -16 -190 368 -320 -26 438 -762 359 -51 -419 716 -174 -78
3069 -78 469 -525 268 180 -432 437 -83 -256 490 -522 429 355 -574 249 22 -194 651 -596 131 427
3089 427 -439 495 -159 -393 664 -688 182 374 -380 348 217 -415 622 -218 -228 193 -435 397 238
3108 238 -411 663 -83 -385 302 -266 95 69 -330 437 -48 20 506 -95 -108 103 -486 404 7 -146 540
3129 540 -253 -30 252 -381 -22 18 -342 342 -149 78 489 -559 219 129 -582 558 -282 -201 881 -288
3149 -288 33 397 -440 372 -231 -269 351 -231 107 447 -535 419 -52 -552 655 -585 3 331 -269 333
3169 333 143 -306 529 -112 -202 490 -513 314 109 -365 591 -67 -278 284 -423 366 436 -181 149 -137
3189 -137 -346 479 -672 -258 394 -677 226 -56 -174 342 -326 128 371 -477 462 141 -297 677 -60
3208 -60 7 561 -289 -6 224 -234 332 -286 -242 526 -242 421 442 -208 284 -63 -458 399 -531 187 326
3229 326 -519 414 -24 -127 371 -524 233 468 -402 257 318 -367 494 -219 -431 232 -533 -104 164 -278
3249 -278 481 -238 -176 315 -438 -112 286 -540 364 -180 -352 130 -446 55 48 -722 108 -162 -372 492 -24
3270 -24 7 411 -339 -73 177 -606 427 -330 -13 520 -381 165 134 -377 442 -315 -250 398 -225 59 349
3291 349 -397 315 50 -408 237 -338 96 378 -654 378 202 -592 453 -559 -311 291 -548 292 333
3310 333 -468 303 -32 -154 246 -358 209 154 -326 500 6 -154 582 -358 0 341 -473 451 27 -227
3330 -227 381 -178 -4 260 -153 42 208 -246 326 -382 -147 394 -460 21 212 -381 469 -203 -289 333
3350 333 -232 233 423 -442 216 -9 -194 631 -310 -182 406 -358 298 17 -348 405 -412 82 329 -661
3370 -661 301 80 -584 695 -186 -228 299 -409 -7 22 -111 368 5 -453 431 -561 117 87 -422 127 -232
3391 -232 -230 321 -292 25 96 -607 260 -90 -164 353 -256 -16 316 -614 270 126 -503 663 119 68 468
3412 468 -420 216 -43 -481 357 -148 -248 386 -238 71 315 -349 249 59 -202 247 -152 145 446 -397
3432 -397 463 -78 -33 427 -451 -101 197 -354 208 78 -205 218 -318 3 190 -67 97 -52 -154 443
3452 443 -221 -275 420 -457 49 279 -223 163 -245 50 423 -475 11 311 -409 297 -20 -317 431 -297
3472 -297 -116 108 -321 230 53 -28 532 -156 18 491 -381 170 117 -549 286 231 -96 482 -120 134 109
3493 109 -276 226 -185 23 406 -152 77 308 -276 159 -150 -511 159 35 -100 394 -476 228 16 -484
3513 -484 242 -332 -187 342 -471 342 174 -293 567 -222 -77 119 -270 -23 108 -255 -11 -63 -91 461 -30
3534 -30 -91 89 -190 294 -159 -189 305 -279 8 353 -448 263 136 -399 246 59 -186 211 -319 -60 218
3555 218 -222 240 9 -271 269 65 186 361 -384 139 -62 -318 285 -218 36 197 -333 40 -75 -234
3575 -234 390 -503 27 433 -605 325 391 -135 243 -131 -81 339 -267 140 67 -222 425 -81 -289 266 -284
3596 -284 -197 112 -68 155 77 -120 254 -102 207 129 -474 200 129 -263 187 -175 5 113 -134 494 203
3617 203 -256 361 34 -147 276 -249 97 205 -326 197 130 -30 137 -143 -31 135 -318 485 -146 27
3637 27 440 -259 -52 172 -408 390 221 -362 124 -105 -151 382 -263 77 74 -215 277 49 -55 564 -208
3658 -208 153 307 -292 429 -59 -279 156 -13 89 306 -276 101 108 -275 323 -93 -199 275 -60 171 -4
3679 -4 -84 341 -270 -63 313 -500 317 76 -480 430 62 -112 397 -124 198 103 -233 20 0 -151 341 -125
3701 -125 -16 357 -533 400 72 -146 191 -83 50 315 -244 127 86 -211 204 -323 -394 6 -183 -93 80
3722 80 -171 374 -72 -352 194 -564 92 155 -15 64 -20 -128 -25 -76 -66 339 -339 218 -27 -121 361 -256
3744 -256 -52 72 -156 24 251 -238 294 -168 -138 263 -117 237 90 -251 340 26 -249 129 -218 159
3764 159 -8 -426 -24 -205 -160 237 -285 -2 318 -263 180 -120 -265 259 -321 -108 307 -365 171 584
3784 584 -273 127 -41 -18 221 -198 283 220 -188 395 67 -71 224 -383 -48 302 -293 227 -42 -349 127
3805 127 -258 -35 104 -171 390 107 -169 331 -32 -57 273 -417 196 161 -61 347 18 -345 173 -21 -88
3826 -88 13 -288 145 127 -209 10 -358 47 241 -403 381 132 -155 37 -326 -155 263 -86 79 77 -91
3847 -91 279 -276 -309 350 -170 18 8 -255 237 -125 -336 261 -136 285 144 -187 94 -60 -13 247 29
3868 29 -58 336 -149 32 -69 -225 363 -220 115 179 -259 19 327 117 252 -197 -309 329 -41 129 -328
3889 -328 -326 269 -66 382 115 18 -58 82 -162 235 118 -329 141 -11 202 290 -119 224 0 -66 350 -99
3911 -99 -57 40 -265 149 188 -170 412 -274 68 151 -73 24 -178 -455 214 -121 -196 274 -191 79 230 -300
3933 -300 125 -396 -63 447 -137 -273 91 -215 273 -158 -173 440 -323 -66 132 -382 115 24 -119 172 -112
3954 -112 -265 232 -170 -23 -114 -212 124 82 -121 180 -363 94 77 -408 -81 9 -62 176 -284 104 207 -10
3976 -10 191 -112 -135 16 -203 -222 140 -338 56 27 -129 153 60 85 345 -152 188 -238 -274 415 61 -82
3998 -82 159 -177 -165 253 -72 -87 34 -78 145 -247 -251 96 -74 353 168 -324 395 15 -90 77 -423 130
4020 130 -12 125 287 -126 -155 127 -429 226 172 -534 318 347 -185 317 -173 131 176 -50 391 -209 63
4041 63 87 -79 88 57 -99 96 -76 39 244 -274 -106 295 -353 67 -77 -221 48 -214 -242 -73 -39 -103
4063 -103 16 -20 202 -201 -24 85 -180 -34 -55 -300 384 76 -24 406 20 105 398 -208 45 -117 -6
4084 -6 263 -63 -211 -72 -389 139 282 -130 321 -162 -64 190 -106 302 140 -284 183 -329 -54 152 -233
4105 -233 244 367 -297 156 -188 -76 267 -249 115 30 -95 247 -172 -213 182 -154 277 62 -264 132 -102
4126 -102 -104 51 47 -79 17 -133 84 36 -318 236 -12 -171 218 -6 213 98 -111 28 -126 -254 -21 -25 -203
4149 -203 346 -149 125 -40 -71 414 -111 -171 162 -144 -52 101 -127 303 211 -10 141 -218 188 311 -128
4170 -128 129 -7 -188 256 -97 37 127 -338 255 80 -20 239 -152 33 19 -193 237 -152 -279 325 -234
4191 -234 41 184 -294 142 203 -129 118 -287 -61 296 -126 104 -19 -110 44 157 -36 38 -306 148 134
4212 134 -318 145 -217 -263 11 -10 -146 465 -139 215 166 -21 288 -103 51 158 -70 271 -71 -187 154
4233 154 145 -279 85 -283 120 150 56 368 -264 -49 375 -36 -117 9 -158 115 168 -22 316 -80 33 53
4255 53 -88 187 -106 -20 148 -330 -80 84 -305 166 156 -240 -237 106 -122 -35 -25 -4 -34 -159 348 156 -130
4278 -130 44 -515 77 145 -96 -43 -33 19 445 109 -26 208 -236 147 117 36 138 -169 -281 286 135 -135
4300 -135 -140 -91 180 -103 -213 -33 -307 339 140 -302 -16 -50 71 424 8 280 -252 -149 269 -47 -249
4321 -249 184 -157 180 101 -264 130 71 -9 152 -24 68 316 118 293 -18 -170 168 -189 -215 493 -151 -83
4343 -83 154 -7 157 78 -180 -39 37 104 315 -248 128 -210 -372 144 -199 -212 -59 -240 -154 41 -175 42
4365 42 -79 275 152 -387 177 251 -228 293 -35 -477 171 -11 76 -46 -53 274 21 -48 380 -218 109 2
4387 2 -151 322 -96 -143 78 8 144 -35 -192 184 185 -79 357 -223 -141 222 131 12 158 -333 400 -291 -158
4410 -158 117 -127 230 175 -125 295 -48 -481 262 -220 64 -161 -370 200 38 -247 -103 -407 114 231
4430 231 -284 180 133 -199 135 -43 -115 8 -238 -105 204 -26 -23 -171 59 117 -269 7 -155 -247 20 157
4452 157 143 3 -40 -20 -167 -10 151 47 -74 282 48 -94 2 -263 321 55 -164 113 -193 285 357 -330
4474 -330 -57 -9 -292 246 -23 -137 -14 -323 271 -123 -275 212 228 -16 464 -83 148 -89 -212 177 -36
4495 -36 -115 10 -115 -235 238 -265 45 85 18 18 -100 -273 -62 -373 -9 110 -151 14 -203 -211 190 -196 -7
4518 -7 111 -182 357 -39 -298 111 122 227 243 -302 122 -57 36 46 73 -9 -26 -412 165 38 -339 234 -74
4541 -74 67 27 -86 -30 124 -219 385 -37 -273 426 -160 214 -48 -37 -7 -63 68 -126 69 -102 -100 -78 37
4564 37 -262 58 214 -57 -148 104 -14 -170 1 -107 -3 -110 -46 -31 -125 41 21 -197 118 55 -218 249
4586 249 -207 95 163 -138 26 -231 -57 312 -277 -135 35 10 153 -25 -208 84 -256 -89 66 64 68 -22
4608 -22 -78 252 -284 25 292 -224 174 227 -162 160 -210 -276 33 -153 283 -110 -113 183 -12 -241 185 -244
4630 -244 30 255 -126 168 115 -294 328 43 100 -13 -89 135 46 -283 14 -548 18 293 -291 152 -97
4651 -97 110 -2 -123 -131 94 -323 106 191 -135 -19 -177 -222 59 -10 -25 -47 -320 54 62 -197 39 -187 -98 -35
4675 -35 26 289 -84 -212 304 45 -177 137 -174 170 29 -91 71 -115 10 156 -121 0 -51 -12 158
4696 158 -107 -372 162 21 -272 27 -208 127 -27 -257 280 -211 -33 57 -134 -57 -52 -410 96 142 -148 287
4718 287 109 129 14 3 152 -103 61 73 80 34 151 -293 182 -104 -115 401 -178 0 28 -126 288 83 -111
4741 -111 5 69 -135 109 -31 80 208 -22 106 -16 78 148 15 0 -118 -92 -11 -58 -155 108 -53 317 205
4764 205 -121 109 -78 -102 11 -229 -48 155 -452 116 32 -293 -34 -219 -145 73 256 56 -221 -162 400
4785 400 -239 -113 144 -225 -47 211 -10 179 95 -164 130 -172 -154 121 -12 -184 114 -155 101 3 -38
4806 -38 334 -79 -29 185 68 -56 -79 56 73 -186 -36 9 -164 50 -289 -129 134 -124 -21 -104 -222 86
4828 86 5 -167 -107 -84 111 38 -192 -12 8 30 177 -60 107 -48 -91 92 6 192 169 -168 -51 210 -150
4851 -150 91 -94 -456 -105 208 -127 -44 -99 -40 243 131 -47 21 53 318 -142 88 47 -284 -31 4 74 -59
4874 -59 139 -159 208 23 -133 -105 -43 110 139 -38 169 -305 35 -72 -99 198 71 -212 140 -173 -64 -15
4896 -15 31 271 114 -137 267 0 178 404 46 -6 -157 -287 158 7 113 -80 -347 -144 31 -141 56
4917 56 -48 67 252 125 273 282 -348 260 -47 -74 178 -73 322 221 -175 -50 -103 -73 124 -65 -136 54
4939 54 -160 1 31 -199 159 1 -40 20 -88 -240 294 -60 -157 -91 14 1 8 121 -172 8 312 -219 -113
4962 -113 239 -86 205 112 -83 86 -133 -122 123 -122 -91 239 -164 140 464 94 119 114 -2 189 -69 -91
4984 -91 131 -150 81 27 98 160 214 -82 -5 -226 109 47 -88 28 -220 -294 92 90 -18 48 267 75 -43 93
5008 93 134 -8 80 10 -140 -2 -88 -94 51 26 100 2 -17 121 -94 190 106 -65 -18 -79 -307 -42 -64 -25 400
5033 400 20 -168 229 -149 68 -117 200 -1 -176 -5 -80 -143 17 -149 -220 60 -228 -9 -106 -195 -79 236
5055 236 -9 123 -127 231 143 -156 125 -24 -269 434 179 -77 257 10 156 78 -96 168 -82 -241 313
5076 313 -48 -188 313 -253 160 -99 -8 22 -140 -143 198 101 93 -15 -84 17 -99 -155 -8 -391 37 428 -88
5099 -88 328 -153 -35 253 19 147 186 -396 91 -78 -261 -59 -104 -31 101 -89 -192 217 -210 28 -163
5120 -163 -451 120 -165 20 170 144 -76 59 -10 -291 -129 112 113 -128 336 40 -167 300 -403 -7 132
5141 132 -232 36 -366 -160 233 390 220 199 -59 -345 117 150 153 72 211 153 -179 43 -47 -89 15 -36 -124
5164 -124 159 -183 2 151 -119 125 -111 -69 137 163 9 200 -79 -120 19 -206 54 228 -67 -17 -18 -1
5186 -1 -80 -313 211 -142 -7 112 20 338 46 -397 132 90 -168 -191 172 -12 60 -52 114 263 -214 177
5208 177 15 -238 105 -84 213 211 -130 90 -9 -186 57 -68 33 137 -250 176 -78 44 40 -161 167 127
5230 127 -272 211 -281 -95 137 -207 -89 68 -148 95 102 -47 118 -44 -79 109 -78 -51 -42 -54 49 -9 160
5253 160 -98 -114 -57 -79 -179 284 216 112 -74 -386 -272 27 28 198 145 -219 172 -283 100 -14 115 -40
5275 -40 126 -102 125 -161 70 19 -127 89 364 -84 190 141 -4 175 -163 -188 25 -290 75 -187 70
5296 70 -97 -233 136 230 -197 84 -118 4 -28 -363 -72 130 26 323 -75 -143 353 16 -69 -85 -87 -21 296
5319 296 -139 48 -178 11 241 -109 -28 -109 -151 177 -160 -122 128 -45 131 22 -70 137 23 66 199 -326
5341 -326 -54 288 -234 64 273 -179 -28 -197 -64 -124 -53 -308 173 -186 231 124 -38 167 55 197 -44
5362 -44 154 -8 -236 -176 69 112 -187 298 -188 99 -4 24 192 -166 -44 210 -231 161 139 -94 356 -225
5384 -225 -58 -197 32 57 157 -55 160 33 -253 167 109 83 -140 -323 37 94 -96 234 23 103 258 -237
5406 -237 108 -170 32 -73 -155 -40 18 -311 -13 62 -28 -184 -107 -175 4 -278 -9 173 -150 268 50 -39
5428 -39 109 30 5 -6 -89 81 94 263 57 21 222 50 -78 86 171 -168 96 38 66 -11 -49 381 -53 -165
5452 -165 70 145 -142 142 -80 214 91 -339 -71 7 -125 50 -224 -12 -60 -211 87 115 -14 6 -111 148
5474 148 210 -14 152 160 -141 -47 -90 -43 319 -211 221 -15 -136 159 99 -85 -117 -74 -244 252 -101 -106 -39 70
5498 70 203 -299 -30 165 -150 143 133 -193 179 -119 -120 192 -82 -40 238 -93 189 -7 -190 25 -114 54
5520 54 -49 -44 214 35 -99 157 -2 4 5 -175 -35 -71 -249 -134 11 -130 185 -348 136 -7 23 -66 -138 120
5544 120 33 -69 -157 -58 -35 302 -206 -71 285 -265 -23 174 75 149 -76 93 8 -267 -94 196 -102 310
5566 310 124 127 -54 -5 76 259 -4 115 -150 -81 430 -128 69 -172 82 123 210 -32 88 -106 60 112 -42
5589 -42 -20 241 -234 163 -89 -69 90 105 23 73 -155 -25 131 -127 183 -232 211 -13 -117 103 -16 -110
5611 -110 264 -40 -23 298 -174 -166 144 -249 124 33 -288 -120 -247 -37 48 -257 197 77 -1 185 -32 9
5633 9 62 12 39 174 -123 -158 -182 40 -193 -313 201 25 -82 172 -207 -28 178 -149 29 259 153 186 -130
5656 -130 -90 258 -11 -2 -121 -447 99 105 11 46 -4 -5 -35 53 51 274 -30 84 186 -63 -8 -122 21 147 -221
5681 -221 228 34 116 35 -109 247 -36 -126 147 328 -218 47 69 -68 124 -358 140 13 -351 174 -147
5702 -147 -114 332 6 136 -179 -53 326 -35 -3 229 -60 119 -38 -12 -59 -246 -118 143 -222 -108 -16 -18
5724 -18 39 -166 -173 -61 -73 -66 4 6 87 102 227 45 -126 -203 85 -60 169 -5 -41 -16 -109 -71 35 -142 196 -60
5750 -60 -85 -1 -137 -27 -27 -95 100 -138 -200 -114 -201 -29 126 -76 -38 184 -83 17 149 150 297 -153 -222 249
5774 249 -140 182 27 -64 330 192 180 78 -308 36 -60 -281 207 -288 -99 78 -115 -97 208 -97 279
5795 279 6 -130 -27 -156 16 -23 93 7 18 -33 -116 -104 -17 -15 -40 -138 -115 -22 163 133 143 107 -85 57 -73
5820 -73 -306 -9 117 -49 88 -221 125 95 -21 -47 52 -205 347 68 -58 107 -26 130 20 -67 26 150
5842 150 16 145 60 -268 182 38 156 -32 -50 154 -119 129 44 103 326 -76 -101 -25 -51 -109 114 -121 29
5865 29 171 102 131 113 32 -199 -267 165 75 -104 228 143 167 -118 -156 136 -212 7 -116 -152 -219 120 -296 -118
5889 -118 82 -77 201 -39 148 21 -123 100 5 -76 -115 -70 297 57 -323 29 194 -45 191 -43 -34 -62
5911 -62 -159 -135 100 89 55 14 14 65 -291 107 253 -114 191 -69 50 206 -28 37 -32 -97 -40 20 91 236 -65
5936 -65 -203 290 -18 -64 209 -225 -224 15 80 103 19 -20 9 -284 -92 -80 -97 284 -95 0 4 -123 1 217 -90
5961 -90 24 -52 63 185 -103 68 390 -193 225 47 -43 170 -281 -19 5 -65 -37 122 -11 38 136 -107 7
5984 7 -207 113 -177 -168 -110 142 -56 112 -61 14 -23 11 -102 -278 88 -48 -117 49 7 -98 120 -348 103
6007 103 76 -358 -139 136 -376 102 -40 60 204 -205 -137 -58 -106 -92 -118 55 111 160 -142 298 -205 -55 151
6030 151 -155 -144 -17 -12 172 -348 18 75 -4 -82 -52 -87 288 -14 -94 178 36 145 11 23 3 30 -229 63
6054 63 94 -189 -115 -162 46 -149 -5 227 -199 -119 7 -94 249 -125 -120 28 -88 102 -194 -58 44 74 18
6077 18 -36 94 -178 91 5 223 -50 -41 159 -124 189 136 -88 -167 -69 36 -102 -350 5 101 -147 -203 92
6100 92 93 155 -49 -191 33 8 234 186 -288 174 15 26 180 -84 -97 -18 -57 -165 168 -39 52 -147 -125 6
6124 6 36 -224 181 -176 -160 108 106 195 20 46 149 -177 -73 105 -164 37 -121 49 -50 -220 109 170 182 142
6148 142 191 11 -99 -153 71 90 -288 67 -80 -296 -182 83 249 32 -117 114 -82 69 -37 -261 24
6169 24 105 -132 -143 28 -177 233 -138 40 -174 34 83 51 35 43 44 32 130 -161 19 119 -101 24 87 26 6
6194 6 50 322 -75 -56 217 94 -110 108 119 -142 -96 -138 4 90 -12 56 -128 2 15 -288 117 89 62 -14
6218 -14 -82 138 283 -101 97 293 138 117 -136 53 16 -7 54 48 -18 94 269 136 -124 -49 -281 -69 -26 -77
6242 -77 109 -106 -66 107 116 188 96 -14 -76 -65 35 29 27 65 -114 120 277 -32 119 -77 -68 -52 -259 -365 55
6267 55 -212 94 -134 -299 318 -59 -1 -139 33 68 45 -29 324 -202 -29 -16 24 197 157 18 -125 135 -24
6290 -24 204 -168 127 139 -61 88 -7 94 190 -252 128 -24 -20 -29 -40 -52 177 177 -79 167 -70 181 -29 137
6314 137 107 -63 81 72 47 -15 -156 272 121 -232 71 62 148 36 275 -294 -53 32 -86 -222 5 -19 139
6337 139 -59 301 -246 -12 -18 -64 296 143 -198 108 109 33 354 122 -34 329 -7 304 300 -92 113 10 163
6360 163 154 -104 -101 -101 -83 223 -23 -135 209 109 -12 77 -342 71 72 -195 28 -8 94 253 -287 115 70 -47
6384 -47 191 154 33 162 -45 -70 44 -2 -132 -188 27 101 -150 176 13 -249 50 24 38 65 -26 108 33 -214
6408 -214 51 -186 -63 -83 -135 164 130 -179 296 160 16 -81 -20 124 222 -183 6 229 71 271 122 -236
6430 -236 115 -165 -38 35 -114 7 -173 -156 -4 234 5 -44 -159 3 33 147 389 3 75 -86 70 -46
6452 -46 27 1 130 -84 -52 -3 -93 -111 -19 -154 -46 287 241 282 -84 20 7 -64 -80 115 -102 50 -214 -172 -11
6477 -11 -167 188 -15 170 316 -226 -103 -90 213 293 166 82 120 -61 -34 -90 -205 -217 94 -40 5 63 158 -35
6501 -35 35 100 -40 39 276 -196 -339 38 -233 -7 206 -195 208 54 48 249 171 -53 32 11 -94 29 -79
6524 -79 280 147 -371 61 -134 206 -31 -170 58 -169 -3 -59 -163 -58 275 57 226 -263 -132 27 20
6545 20 -200 127 -97 4 203 42 49 -156 109 38 -172 141 113 2 2 135 -274 -7 -142 106 219 28
6567 28 194 -41 -116 -249 -127 122 121 -119 215 216 -188 -91 -55 -136 195 120 359 -51 -246 189 -129 144 -58
6590 -58 -319 -12 79 0 232 2 -51 186 -272 171 -22 112 21 111 26 -12 -243 -16 -132 -68 252 -62 167
6613 167 -45 -157 14 222 -3 28 42 -37 -14 -35 -192 -71 62 140 136 -100 -76 -126 76 321 -20 66 113 -251
6637 -251 243 -21 12 46 -36 86 -50 -269 197 -141 21 -73 70 -97 158 212 163 63 -107 306 -59 83
6659 83 -134 -43 -260 59 -51 -1 -3 -196 244 103 -139 134 132 200 -114 -100 94 -312 114 -13 -88 -81 47 7
6683 7 59 -7 -68 -9 -50 -29 -123 -75 -97 52 -113 -226 -124 262 -11 -167 17 -26 -267 -15 -29 98 221 -558
6707 -558 -30 -76 13 120 -189 177 131 -101 -34 125 -133 55 -237 -148 -42 -154 -40 131 -37 -105 -54 -10 -59
6730 -59 -169 117 -41 -20 256 -75 73 208 -27 2 -24 -100 48 -44 -16 -26 -159 -9 9 -188 -162 2 -89 -9
6754 -9 -37 -2 121 5 210 -10 67 236 -41 400 30 -104 -15 -148 76 -82 46 -221 130 176 -110 46
6776 46 -20 268 -165 -202 49 -158 194 -184 -19 -151 79 -331 392 209 -144 46 104 82 42 123 -132 22
6798 22 182 198 9 219 -19 -13 146 188 -58 251 -125 -68 -114 129 132 -165 -413 48 -79 -1 0 -87 -209 -72
6822 -72 1 229 117 102 114 -142 96 -8 73 30 41 -148 109 -88 -86 2 -54 185 -25 98 186 -166 45 251
6846 251 -31 235 42 36 196 -59 -53 -270 79 64 -46 -230 123 -93 -214 151 -50 189 320 -108 -148 17
6868 17 11 98 129 -111 89 -215 -117 -38 -197 -43 -310 -28 192 -57 212 20 208 210 81 62 -112 -57 144 -20
6892 -20 -116 215 27 185 37 -285 125 145 132 391 -102 -123 -153 -32 85 -12 -238 68 293 143 -126 -269
6914 -269 24 1 -193 85 294 -93 44 -93 47 171 12 43 12 -4 119 -182 60 183 -53 95 168 -158
6936 -158 37 -161 -236 228 -158 51 380 -137 80 -141 31 83 9 -55 245 30 -203 -93 19 210 -73
6957 -73 -80 147 -201 24 183 107 35 118 -17 -25 -20 4 50 69 101 -61 -196 -18 -48 -332 -92 -137 60 -20 -89 -246
6983 -246 204 -88 62 22 105 -39 48 74 151 243 366 -28 -147 27 -44 -65 56 67 184 -33 171 -37 183
7006 183 -126 129 25 -209 -127 -126 -18 167 -257 -41 30 133 -332 -151 -10 8 -192 204 -55 102 -195 -119
7028 -119 -26 -113 98 269 -112 35 -33 -347 163 -97 96 302 -131 -95 -127 -51 133 -229 -94 123 -16 181
7050 181 -213 -90 85 5 -76 81 129 -120 -118 132 -37 -124 13 4 -40 38 29 83 205 27 -98 55 166 129 -208
7075 -208 -62 49 92 -52 214 -96 53 106 -50 -49 137 -291 -122 58 178 179 93 -8 -92 119 -208 -47 -101
7098 -101 73 100 46 200 143 -58 124 -1 -110 50 -57 151 -20 -81 92 -305 108 -72 32 90 34 -5
7120 -5 -259 -110 238 233 2 78 -343 -72 142 -117 32 -147 -140 150 -50 -14 169 -242 -38 -17 93 212 -96
7143 -96 -160 194 -4 -19 127 -268 57 -72 67 172 -139 74 214 139 321 -39 215 260 -48 2 138 45
7165 45 193 139 1 283 -130 -154 64 -212 121 -98 -16 -7 79 17 348 -217 75 476 -69 230 -103 -31 -30 -168
7189 -168 55 -12 128 56 109 38 -74 3 173 -99 -23 190 118 8 122 -96 290 21 -19 -93 106 -143 67
7212 67 162 4 -31 -111 211 -17 138 126 45 47 113 -10 203 -73 233 9 -8 -102 174 -131 42 11 158 -182
7236 -182 -77 -127 244 232 44 -36 -90 62 56 -318 86 -195 -16 -61 13 68 -302 241 229 30 -2 -23 -18 20 -238
7261 -238 -110 309 151 6 162 -220 -188 47 8 111 -171 -190 39 -104 45 52 -86 -4 235 -121 84 -126
7283 -126 -84 27 -96 -27 26 -133 61 -149 -5 215 34 -142 128 96 45 -153 -34 263 -159 -131 -168 -10
7305 -10 74 -65 96 10 133 -124 -137 44 153 101 -8 -6 -77 100 -173 -183 -6 387 -112 82 -205 -77 92
7328 92 147 120 -40 90 235 6 -25 79 177 15 -47 -145 20 -99 25 17 -88 -135 30 -221 43 51 -85 209
7352 209 -81 260 128 184 112 -29 248 26 -129 43 253 168 -285 -244 -59 112 -223 -22 -104 35 43 19 173
7375 173 -13 35 20 114 -2 -143 75 -1 -16 46 113 67 153 -32 31 29 173 -139 -28 111 126 90 73 -320 -75
7400 -75 96 123 25 63 -124 281 -78 -26 -29 6 3 -26 129 164 -387 -111 -154 -249 29 24 -51 -36 -181 121 34 3 123
7427 123 167 -73 36 158 153 196 -296 -80 -68 61 71 8 120 26 -299 -180 63 204 241 -102 -85 266 70
7450 70 72 167 38 128 -86 -66 86 -182 174 71 -11 -108 147 28 -106 -99 -52 97 -155 -139 -95 90 153 196 -74
7475 -74 97 98 -87 49 -41 -87 107 -110 87 57 -59 -139 -220 127 65 36 179 -130 -89 105 -101 70 98 58
7499 58 141 -18 -309 196 -218 145 68 -54 64 -69 42 55 18 -80 119 -19 208 2 66 217 -163 -162 94
7522 94 -149 -69 -97 35 -126 8 140 96 -144 -176 60 117 157 -138 -6 64 -94 -155 26 98 -109 10 97 123
7546 123 12 -140 59 289 48 -9 -222 -53 32 97 -107 -4 -84 -4 -263 35 122 -251 43 -161 -44 180
7568 180 -45 91 72 -146 262 -317 50 -11 -157 206 -236 -68 -29 -58 -10 -72 -143 -21 -289 -4 41 92 -258
7591 -258 -2 -44 -129 -22 -226 -177 27 165 60 -186 -52 31 117 217 -113 -26 17 58 -14 102 -204 161 116
7614 116 60 -4 55 -74 -93 -28 39 -75 189 90 110 277 176 -89 56 240 0 -127 114 179 73 168 -16
7637 -16 -249 -37 313 27 -30 94 129 -259 33 -177 110 205 -379 176 -99 87 93 -135 76 81 -28 -62 43
7660 43 245 -69 -60 14 98 91 86 -30 -122 89 190 -326 -154 -72 38 123 14 -54 -185 -63 74 -45 218 -205
7684 -205 3 330 -172 -99 -60 -45 -43 82 61 -193 135 -9 50 28 -66 -73 -58 -51 -12 -3 175 -7 -233 78 73 7 38
7711 38 68 -80 79 -46 74 50 -139 -17 -139 87 276 -53 26 -71 -173 104 37 116 225 -148 129 3
7733 3 -50 173 59 -77 -84 -135 -4 57 81 203 -94 324 -94 -15 161 134 -70 -45 5 -15 282 115 72 110 103 17
7759 17 209 67 85 100 -276 232 5 181 -20 -75 171 -321 46 42 148 195 84 -127 92 118 187 -136 -87
7782 -87 44 -184 -119 -9 -231 -120 148 206 299 -36 46 -72 -145 56 189 -23 137 -32 -85 -210 -4 151
7804 151 67 -150 -24 -47 -6 -159 59 145 102 -229 16 -83 -245 -6 -198 19 -120 -220 129 15 -9 -54 98
7827 98 -196 55 222 -108 -60 -226 -28 16 209 142 -158 45 31 -72 91 -78 54 167 231 136 -29 32 107
7850 107 -181 -109 208 -107 88 -192 107 21 95 -13 162 107 -57 225 116 105 169 -60 -51 105 -197 60 60
7873 60 7 76 -82 330 247 -81 45 195 -155 240 -94 72 25 124 231 62 66 -10 -49 137 126 -125 90 205
7897 205 -114 12 50 202 -99 -147 -230 -19 11 -154 191 -52 -167 -48 -19 -50 -145 -10 -85 46 -120 -119 -38 8
7921 8 -187 -2 -168 81 69 -117 13 132 -91 -45 132 -16 -142 -365 3 -33 121 -77 -246 23 77 176
7943 176 78 -17 -160 -107 44 198 -48 -86 146 13 -61 175 259 -37 -37 -105 271 -7 -85 114 36 -222 217 -90
7967 -90 -10 37 -43 119 105 -240 -72 -35 133 32 20 -79 -108 40 102 -29 -20 128 -168 -174 -106 -157 -92 234 36 31
7993 31 -4 -209 259 -62 413 100 92 115 -78 46 211 75 -60 -126 1 -325 63 -170 -111 -215 12 117
8015 117 -211 190 72 -103 18 -63 21 23 -151 83 29 326 99 213 3 0 -80 -131 -221 -105 -135 -189 244 287
8039 287 -235 -50 -8 12 -76 -7 -232 6 98 -47 89 -84 49 264 -88 99 48 69 24 19 50 -83 -74 -8 130
8064 130 -132 80 37 70 -134 232 -114 92 54 248 -26 9 13 -121 172 -124 253 -103 6 293 44 20
8086 20 -37 23 -42 -184 132 141 37 -189 -318 -38 -160 55 86 88 1 -103 -29 246 -177 62 -98 273 168 59
8110 59 249 39 -327 95 316 205 56 109 37 23 39 2 127 109 120 10 38 100 79 -87 -128 308 64 -44
8134 -44 90 50 10 -75 68 201 44 -206 -23 135 -18 3 -8 11 49 -216 -225 -191 -173 152 140 -169 66 -44
8158 -44 -176 -281 -197 180 -6 -220 39 303 13 -78 -57 -172 60 134 -229 49 126 -214 -227 -125 -82 158 -98
8181 -98 83 122 -11 -171 169 -83 -277 -120 83 -169
8191a69
##END NTUPLES=NMR FID
##END=
