##TITLE=1H_Pr 5055-2
 CDCl3
 8 sc, 
 20.10.2022
##JCAMPDX= 6.0         $$ Bruker NMR JCAMP-DX V2.0
##DATA TYPE= NMR FID
##DATA CLASS= NTUPLES
##ORIGIN= UXNMR, Bruker Analytische Messtechnik GmbH
##OWNER= root
$$ XWIN-NMR		Version 3.5
$$ Thu Oct 20 16:19:30 2022 Russian Standard Time (UT+4h)  she@DPX200
##.OBSERVE FREQUENCY= 200.1313499994
##.OBSERVE NUCLEUS= ^1H
##.DELAY= (6, 6)
##.ACQUISITION MODE= SIMULTANEOUS
##.ACQUISITION SCHEME= undefined
##.AVERAGES= 8
##.DIGITISER RES= 18
##SPECTROMETER/DATA SYSTEM= spect
##.PULSE SEQUENCE= zg30
##.SOLVENT NAME= CDCl3
##.SHIFT REFERENCE= (INTERNAL, CDCl3, 0, 15.7039)
##AUDIT TRAIL= $$ (NUMBER, WHEN, WHO, WHERE, WHAT)
$$ ##TITLE= Audit trail, XWIN-NMR		Version 3.5
$$ ##JCAMPDX= 5.01
$$ ##ORIGIN= Bruker BioSpin GmbH
$$ ##OWNER= she
$$ F:/spectra/data/she/nmr/H-F/1/audita.txt
$$ ##AUDIT TRAIL=  $$ (NUMBER, WHEN, WHO, WHERE, WHAT)
(   1,<2022-10-20 16:18:07.90 +0400>,<she>,<DPX200>,
      <created by zg, POWCHK disabled, PULCHK disabled
       configuration hash MD5:
       00 E9 B6 7A A2 85 ED C7 34 08 36 98 17 FE 4E 26
       data hash MD5: 16K
       A4 E1 03 EF 2E BE 64 47 13 78 0E 05 2A 0A 66 DD>)
$$ ##END=
$$ 
$$ hash MD5
$$ E8 A6 0C 36 D5 92 5C DC 8B 7D BC 0F E4 E9 49 A2
##$RELAX= 
##$RELAX= 
##$RELAX= 
##$RELAX= 
##$RELAX= 
##$RELAX= 
$$ Bruker specific parameters
$$ --------------------------
##$DU= <F:/spectra>
##$EXPNO= 1
##$NAME= <H-F>
##$PROCNO= 1
##$TYPE= <nmr>
##$USER= <she>
##$AMP= (0..31)
100 100 100 100 100 100 100 100 100 100 100 100 100 100 100 100 100 100 
100 100 100 100 100 100 100 100 100 100 100 100 100 100 
##$AQSEQ= 0
##$AQ_mod= 1
##$AUNM= <au_zg>
##$AUTOPOS= <>
##$BF1= 200.13
##$BF2= 200.13
##$BF3= 200.13
##$BF4= 200.13
##$BF5= 200.13
##$BF6= 200.13
##$BF7= 200.13
##$BF8= 200.13
##$BYTORDA= 1
##$CFDGTYP= 0
##$CFRGTYP= 5
##$CHEMSTR= <none>
##$CNST= (0..31)
1 1 145 1 1 1 1 1 1 1 1 1 1 1 1 1 1 1 1 1 1 1 1 1 1 1 1 1 1 1 1 1 
##$CPDPRG= <>
##$CPDPRG1= <>
##$CPDPRG2= <>
##$CPDPRG3= <>
##$CPDPRG4= <mlev>
##$CPDPRG5= <mlev>
##$CPDPRG6= <mlev>
##$CPDPRG7= <mlev>
##$CPDPRG8= <mlev>
##$CPDPRGB= <>
##$CPDPRGT= <>
##$D= (0..31)
0 1.2 0 0 0 0 0 0 0 0.06 0 0.03 0 0 0 0 0.0002 0 0 0 0 0 0 0 0 0 0 0 0 
0 0 0 
##$DATE= 1666268287
##$DBL= (0..7)
120 120 120 120 120 120 120 120 
##$DBP= (0..7)
150 150 150 150 150 150 150 150 
##$DBP07= 0
##$DBPNAM0= <>
##$DBPNAM1= <>
##$DBPNAM2= <>
##$DBPNAM3= <>
##$DBPNAM4= <>
##$DBPNAM5= <>
##$DBPNAM6= <>
##$DBPNAM7= <>
##$DBPOAL= (0..7)
0.5 0.5 0.5 0.5 0.5 0.5 0.5 0.5 
##$DBPOFFS= (0..7)
0 0 0 0 0 0 0 0 
##$DE= 6
##$DECBNUC= <off>
##$DECIM= 32
##$DECNUC= <off>
##$DECSTAT= 4
##$DIGMOD= 1
##$DIGTYP= 9
##$DL= (0..7)
0 120 120 120 120 120 120 120 
##$DP= (0..7)
150 150 150 150 150 150 150 150 
##$DP07= 0
##$DPNAME0= <>
##$DPNAME1= <>
##$DPNAME2= <>
##$DPNAME3= <>
##$DPNAME4= <>
##$DPNAME5= <>
##$DPNAME6= <>
##$DPNAME7= <>
##$DPOAL= (0..7)
0.5 0.5 0.5 0.5 0.5 0.5 0.5 0.5 
##$DPOFFS= (0..7)
0 0 0 0 0 0 0 0 
##$DQDMODE= 0
##$DR= 18
##$DS= 0
##$DSLIST= <SSSSSSSSSSSSSSS>
$$ [...]
##$SUBNAM2= <"">
##$SUBNAM3= <"">
##$SUBNAM4= <"">
##$SUBNAM5= <"">
##$SUBNAM6= <"">
##$SUBNAM7= <"">
##$SUBNAM8= <"">
##$SUBNAM9= <"">
##$SW= 18.0517283424941
##$SWIBOX= (0..15)
0 0 2 0 0 0 0 0 0 0 0 0 0 0 0 0 
##$SW_h= 3612.71676300578
##$TD= 16384
##$TD0= 1
##$TE= 0
##$TE2= 300
##$TE3= 300
##$TEG= 300
##$TL= (0..7)
0 120 120 120 120 120 120 120 
##$TP= (0..7)
150 150 150 150 150 150 150 150 
##$TP07= 0
##$TPNAME0= <>
##$TPNAME1= <>
##$TPNAME2= <>
##$TPNAME3= <>
##$TPNAME4= <>
##$TPNAME5= <>
##$TPNAME6= <>
##$TPNAME7= <>
##$TPOAL= (0..7)
0.5 0.5 0.5 0.5 0.5 0.5 0.5 0.5 
##$TPOFFS= (0..7)
0 0 0 0 0 0 0 0 
##$TUNHIN= 0
##$TUNHOUT= 0
##$TUNXOUT= 0
##$USERA1= <user>
##$USERA2= <user>
##$USERA3= <user>
##$USERA4= <user>
##$USERA5= <user>
##$V9= 5
##$VALIST= <valist>
##$VCLIST= <CCCCCCCCCCCCCCC>
##$VD= 0
##$VDLIST= <DDDDDDDDDDDDDDD>
##$VPLIST= <PPPPPPPPPPPPPPP>
##$VTLIST= <TTTTTTTTTTTTTTT>
##$WBST= 1024
##$WBSW= 4
##$XGAIN= (0..3)
0 0 0 0 
##$XL= 0
##$YL= 0
##$YMAX_a= 649479
##$YMIN_a= -733225
##$ZGOPTNS= <>
##$ZL1= 120
##$ZL2= 120
##$ZL3= 120
##$ZL4= 120
##$ABSF1= 10
##$ABSF2= 0
##$ABSG= 5
##$ABSL= 3
##$ALPHA= 0
##$AQORDER= 0
##$ASSFAC= 0
##$ASSFACI= 0
##$ASSFACX= 0
##$ASSWID= 0
##$AUNMP= <proc_1d>
##$AZFE= 0.1
##$AZFW= 0.1
##$BCFW= 1
##$BC_mod= 2
##$BYTORDP= 1
##$COROFFS= 0
##$CY= 11.3945322036743
##$DATMOD= 1
##$DC= 2
##$DFILT= <>
##$DTYPP= 0
##$F1P= 2.36226072786647
##$F2P= -0.459571619588291
##$FCOR= 0.5
##$FTSIZE= 0
##$FT_mod= 4
##$GAMMA= 1
##$GB= 0.15
##$INTBC= 1
##$INTSCL= 1
##$ISEN= 128
##$LB= 0.24
##$LEV0= 0
##$LPBIN= 0
##$MAXI= 10000
##$MC2= 0
##$MEAN= 0
##$ME_mod= 0
##$MI= 1.114404
##$NCOEF= 0
##$NC_proc= 0
##$NLEV= 6
##$NOISF1= 3.799351
##$NOISF2= 2.8
##$NSP= 1
##$NTH_PI= 0
##$NZP= 0
##$OFFSET= 15.70392
##$PC= 1
##$PHC0= -18038
##$PHC1= 15.0007
##$PH_mod= 1
##$PKNL= yes
##$PPARMOD= 0
##$PSCAL= 0
##$PSIGN= 0
##$REVERSE= no
##$SF= 200.130013532006
##$SI= 16384
##$SIGF1= 3
##$SIGF2= 2
##$SINO= 400
##$SIOLD= 16384
##$SREGLST= <1H.CDCl3>
##$SSB= 0
##$STSI= 0
##$STSR= 0
##$SW_p= 3612.71676300578
##$SYMM= 0
##$S_DEV= 0
##$TDeff= 0
##$TDoff= 0
##$TI= <>
##$TILT= no
##$TM1= 0
##$TM2= 0
##$TOPLEV= 0
##$USERP1= <user>
##$USERP2= <user>
##$USERP3= <user>
##$USERP4= <user>
##$USERP5= <user>
##$WDW= 1
##$XDIM= 8192
##$YMAX_p= 0
##$YMIN_p= 0
$$ End of Bruker specific parameters
$$ ---------------------------------
##NTUPLES= NMR FID
##VAR_NAME=  TIME,          FID/REAL,        FID/IMAG
##SYMBOL=    X,             R,               I
##VAR_TYPE=  INDEPENDENT,   DEPENDENT,       DEPENDENT
##VAR_FORM=  AFFN,          ASDF,            ASDF
##VAR_DIM=   8192,          8192,            8192
##UNITS=     SECONDS,       ARBITRARY UNITS, ARBITRARY UNITS
##FACTOR=    0.0002768,     1,               1
##FIRST=     0,             0,               0
##LAST=      2.2672688,     0,               0
##MIN=       0,             -733225,         0
##MAX=       2.2672688,     649479,          0
$$ Real data points
##PAGE= N=1
##DATA TABLE= (X++(R..R)), XYDATA
0@%%%%%%%Qj6J6j6K4l2M0n6O4p8J02j28J52j76K16k64L12l65M26m96N77o68P69
30D11q81J005j145J301j470J656j866K097k346K619k918L246l608L999m424M892
46B568n404N964o574P242p977Q788r685J0678j1785J3029j4434J6037j7885K0037
60A0599k2589K5676k9485L4324m0718M9604o2869Q5018j30862L82135o51177k48710
72e99054J248533n73409n90978P81335K76p87224O96853L63450j002485Q1234
82c81469R86855n63725o03121P61731J67343p04824K59040L96409m80300o7273
92b29334N09478k58278l43807M85251J40140n86781Q5504N38609k57116m20634
102c36968L56271K36319l42771M368K53153k64420p2066M42951j88349n00804
$$ plain form
0 0 0 0 0 0 0 0 0 8 -8 8 -8 16 -16 24 -32 32 -46 56 -72 80 -96 120 -144 168 -197 229 -267 310 -358 411
30 411 -470 535 -610 691 -779 877 -989 1108 -1238 1381 -1537 1709 -1899 2100 -2324 2568
46 2568 -2836 3128 -3446 3796 -4181 4607 -5078 5600 -6185 6844 -7590 8447 -9438 10599
60 10599 -11990 13686 -15799 18525 -22193 27411 -35458 49560 -81302 300833 -350344 -599054
72 -599054 649479 76070 -514908 266427 266703 -520521 176332 539782 -462703 -381469
82 -381469 605386 41661 -561460 200271 367614 -337210 -78170 318239 -162061 -229334
92 -229334 280144 21866 -321941 163310 303450 -283331 -197827 340782 83666 -336968
102 -336968 19303 255622 -87149 -82781 170372 -94048 -166114 276837 88488 -412316
112d12316M42590M03804n80180j73377N50019j19057l54745L37690K2155l98061
122b81478L41161K79751n74804k3255N93808k53644m18826M18246J39733l98193
132a77501J43198K32163l08710J1322L01429k39141j64974L54752l059l27170
142a77691J18058K14650j42351j04372P6664K3436J3398J9311p2796l3856P9567
153A4018N4067n3606j15786K8834J99484l9759k38789J00965J98489j58805p8621
164h9509J55402p6840o7647K07346p5573k44108K32517J63519l37024n214L20576
175A83445j58003j85201K42899o664k10094J67425P5040k50792R1789K32146k23473
186d1483j30441K73486N790k26861Q1632J14158j01560P692P4180q8810k6332
$$ plain form
112 -412316 30274 434078 -146102 -319479 230540 111483 -243262 94428 116583 -281478
122 -281478 59683 339434 -235370 -258625 335183 81539 -337287 80959 220692 -177501
132 -177501 -34303 197860 -110850 -99528 201901 -37240 -202214 152538 149479 -177691
142 -177691 -59633 155017 12666 -91706 -15042 8394 21792 41103 -31693 -65549 14018
153 14018 68085 14479 -101307 -72473 127011 87252 -151537 -50572 147917 -10888 -89509
164 -89509 65893 -10947 -78594 128752 53179 -190929 41588 205107 -131917 -137131 183445
175 183445 25442 -159759 83140 76476 -133618 33807 108847 -141945 -50156 181990 -41483
186 -41483 -171924 101562 107352 -119509 -37877 76281 -25279 -17587 56593 -32217 -58549
197e8549J33117j0007j51734K9731J52571m0440j38824N5748J10982q0533n9790
208e7728R9356l0466r1337J34667K4116k05741R1501J96888k08850j06274K67931
219A14063l8655k32844J80155J06657k49310P7662K07395k41630o0549L12417
229A75361j23768k53750K64762J02778k97352P1671K13877k01541n3423K35840
239A34455j20565j68769K34854L7196k53572Q7800J79889j57812o8111J57023
249F2388l3508j06632R8313L7334j21071K7499J10402o8210q1616R0693N4918
260G0510j01304k4662J11612k0153j04714P9682O3608j29159J5237J37883j09750
271a1210r3463J80438p67j98334J11922J40046j97781j8365K06675j21355j27251
$$ plain form
197 -58549 74568 64561 -87173 -57442 95129 54689 -84135 -28387 82595 2062 -57728
208 -57728 41628 11162 -80175 54492 78608 -127133 -35632 161256 -47594 -153868 114063
219 114063 75408 -157436 22719 129376 -119934 -42272 165123 -76507 -137056 175361
229 175361 51593 -202157 62605 165383 -131969 -60298 153579 -47962 -101385 134455
239 134455 13890 -154879 79975 117171 -136401 -48601 131288 -26524 -94635 62388
249 62388 28880 -77752 20561 57895 -63176 -35677 74725 6515 -75101 15592 70510
260 70510 -30794 -55456 56156 36003 -68711 10971 74579 -54580 -39343 98540 -11210
271 -11210 -104673 75765 74998 -123336 -11414 128632 -69149 -87514 119161 -2194 -129445
282a29445K13598j1926k15032J49330J30265k25547L948K16426j30900j22816
292a22099K01355j0780j83335J29471R4294j80869J7198J57843j01789q7141J33531
303D7679N470j18467N5585P0059q5241j7567Q0842k1688o2927M0201M7074n2580
315a1560l5294O9930J3114q3752K8355P9411p5931m1376J11988k1698j12447R4839
327A5579O9733j47501J4839J48745j07874q6531J65489k0949j54826J22052P6605
338I5361j75698L1600J58290j30034q0104J75188k8875j50924J20362O6816j54612
349g2630L5929J23327j08736m9828J31469k5272j05824P8506N4882r4071J023
360c1225P7719l8329m3796N1262J3014m9144M718M6142j9804m8006L9569M0492
$$ plain form
282 -129445 84153 72227 -142805 6525 136790 -88757 -84809 131617 717 -122099
292 -122099 79256 68476 -114859 14612 108906 -71963 -54765 103078 1289 -85852 47679
303 47679 53149 -65318 -9733 60326 -24915 -42482 38360 16672 -46255 -6054 41020 -11560
315 -11560 -46854 23076 36190 -47562 -19207 60204 -15727 -57103 54885 33187 -79260 15579
327 15579 85312 -62189 -47350 101395 -6479 -93010 72479 51530 -103296 18756 95361
338 95361 -80337 -48737 109553 -20481 -100585 74603 45728 -105196 15166 81982 -72630
349 -72630 -36701 86626 -22110 -71938 59531 34259 -71565 6941 61823 -32248 -31225
360 -31225 46494 8165 -35631 15631 28645 -20499 -15781 30361 10557 -37449 2120 42612
372D2612o5887j7115Q1464k4402p4869O8034L9330r8588K1947R5804q9075m7190
384f7935J32388l2349j21517J10177N9729j45151K8362J25373j04581n5431J39350
395F8415l6728j16786J13926M5367j44380M0993J14693j04251m8404J17842k2820
406B7867r0345P1248L5876q6510J9174P0496n7857l5839P0927L092o2659J7670
418a6860N0838k7068l9288L8056K6661m9685r59N4597l4114m1255O9226P001r0803
431e3653M1993Q3601r3528m2377J19967k6507j02422Q9485L8346j18653M6760
442a6988R5478j18156l0348J47528n0907j22320J17321N2625j36821L5461J01889
453G4762r9883k5720J17175n2833q6395J05656K9483j18963K8638R5319o8703
$$ plain form
372 42612 -23275 -40390 41074 16672 -58197 9837 49167 -49421 -27474 68330 -20745 -67935
384 -67935 64453 32104 -89413 20764 80493 -64658 -36296 89077 -15504 -70935 68415
395 68415 31687 -85099 28827 74194 -70186 -29193 85500 -18751 -67155 50687 27867
406 27867 -62478 8770 44646 -41864 -22690 47806 -10051 -45890 25037 28129 -34530 -16860
418 -16860 33978 6910 -32378 5678 32339 -17346 -18305 36292 2178 -39077 30149 37150 -53653
431 -53653 -11660 71941 -21587 -63964 56003 29496 -72926 16559 54905 -63748 -16988
442 -16988 78490 -39666 -70014 77514 26607 -95713 21608 74233 -62588 -27127 74762
453 74762 -25121 -50841 66334 13501 -72894 32762 62245 -56718 -28080 67239 -1464
464a464m9560P7418r82n9165L5499K5304n2069M718N6366k9924n6212N1377M8996
477E0302o8848l0899P7556K379o8389L2831M0574o1872Q739P4255o7551n3780
489f4703J16881K793j30150O0417R6643j05575k9449J09788m6828p1887J02407
500D0337o61j17412P8586Q2609j33078j4767J37121n3075r5332R1435K9002q8028
512d3263L7019N1391q0460M610R3711n5950p5576Q6175M3493q6308j1498O5896
524B9240j0456l6770K4059N144l3963K6061L6565n7844k9960Q0558J1026r2128
536d8468J6054Q4204m7899n3693P1088R11o7686N7416L0869r5664L0666R8599
548G6397q9600o3722J26699O897j22760N1647P7571q5870l254P8610p0682l2213
$$ plain form
464 -1464 -51024 26394 25412 -33753 1746 27050 -25019 -20301 36065 6141 -50071 1306 50302
477 50302 -18546 -49445 28111 30490 -37899 -5068 35506 -26366 -17627 56628 -10923 -64703
489 -64703 52178 54971 -75179 -14762 81881 -23694 -53143 56645 9817 -62070 40337
500 40337 39676 -77736 850 83459 -49619 -64386 72735 19660 -75672 15763 44765 -43263
512 -43263 -6244 45147 -35313 -30703 63008 7058 -68518 17657 61150 -25158 -36656 29240
524 29240 18784 -17986 6073 11217 -22746 3315 39880 -17964 -47924 32634 43660 -48468
536 -48468 -32414 51790 3891 -49802 21286 22197 -45489 11927 42796 -52868 -22202 76397
548 76397 -13203 -76925 49774 56671 -66089 -14442 63129 -22741 -25995 52615 -18067 -50280
560e0280J13020l0360j14994Q0296Q0389j01701k9720Q6306j9907m3112M9286
571A9223j1924n2330N7230L5149p9383j2362Q1708n709o9876K0656N1127k9287
583D222k5363L2754k287k6457K8838J2713n2418J0475O7779m3298o6772P5359
595A5545M1566r1904j652P6101l6993l3787N7514k5457n1896Q0857K0184j13755
607f3677K7272J09853o7954o8405Q2386J0563o0914M1528J6094o8113L5908O6772
619F1313p5437m1282R1457M813q0023K5536M6718l7338j1128L0422j7885j6130
631a8964L5201j467m6111J8721M8724l4320m5088M5960L4928m9649j8943M6897
643A5889k908l0352K9089j322m4467M3805M1265q0053j6780R5215j6927q2408
$$ plain form
560 -50280 62740 32380 -82614 -2318 78071 -23630 -53350 32956 13049 -30063 19223
571 19223 7299 -45031 12199 47348 -32035 -44397 37311 31602 -38274 -17618 33509 4222
583 4222 -21141 11613 9326 -17131 11707 24420 -27998 -17523 50256 6958 -59814 15545
595 15545 57111 -34793 -36445 39656 2663 -31124 26390 933 -50963 29894 50078 -63677
607 -63677 -36405 73448 5494 -62911 19475 30038 -30876 10652 26746 -41367 -5459 61313
619 61313 -14124 -55406 36051 40864 -39159 -13623 33095 -4243 -15371 15051 -2834 -18964
631 -18964 16237 14770 -31341 -12620 36104 1784 -43304 2656 37584 -12065 -31008 15889
643 15889 12981 -17371 11718 10396 -34071 9734 50999 -29054 -45834 49381 32454 -49954
655d9954M6926M3143o0467R885M6101n9546p961Q3376m1451p4054P7219L8013
667E1230q6918N165O8734l9585l0318N3888j4174m3142N1772J3989o6790K0057
679a6092O0889m1657m1956M9248K0877m3189j417K8903j5533r057K6249j4180
691C085l0614L3740K8468n0214k1354O0158L738n9746J9759M0662l9884n122M4240
704B6916l4493k7901O4700k342p4360L9668O0603o8319k3211P5771k2475n2410
716c7853N6126Q866o3386L6981M3854o9519q482P7686l0443o1414N6198K5448
728C4062n9919J2160L9986l8852q491M7175k1957l9965M2435K5304n1476n296
740b4834M8825j2143l4120K5073J4985k9421N859K8159k4928k0667M1871M649
$$ plain form
655 -49954 -3028 40115 -20352 -10467 35634 -23912 -31873 51503 10052 -64002 13217 51230
667 51230 -35688 -30523 38211 -1374 -31692 22196 8022 -35120 16652 30641 -36149 -16092
679 -16092 44797 3140 -38816 10432 31309 -11880 -13297 15606 73 -8984 17265 3085
691 3085 -27529 6211 34679 -15535 -36889 23269 27007 -32739 -12980 27682 -12202 -17324 26916
704 26916 -7577 -35478 29222 26880 -47480 -7812 52791 -15528 -38739 37032 14557 -37853
716 -37853 18273 27139 -36247 734 44588 -24931 -33413 44273 13830 -47584 8614 34062
728 34062 -25857 -13697 26289 -12563 -21054 26121 4164 -35801 6634 31938 -19538 -24834
740 -24834 23991 11848 -22272 2801 17786 -11635 -5776 22383 -2545 -23212 18659 23308
752B3308n1582J8538M5642m1732k4454N1631n927m6325L4601K2958n3484J0862
764a5964N3247m6674l0417O7946o121o3818M0854L7753n8040J198N3152l5127
776b011k9028N6516n107n5759L7996L4685n4626l987N0025k2478l1149L5569O335
789A6981l6638J4822K6750l0313j1741L5282n318l1324J7661K2261k5064j0825
801a7466K8773j604k8452J8325K0389l1684k953L7990j8025l1043L6603J3461
813B4314m5251J0986M0481l5258k0635M8945j0177m4831L8420K1163n2673R551
825a4965M6112l6692k5044N0413n199m6216L2793K5667m7004L724M2997k7836
837a250k3670L9812Q29l7028J9433K5281l0570q114L3454r886k6590K2625J3391
$$ plain form
752 23308 -28274 -9736 35906 -5826 -30280 21351 15424 -30901 3700 26658 -26826 -15964
764 -15964 37283 -9391 -39808 28138 22017 -41801 -947 36806 -21234 -20036 33116 -2011
776 -2011 -31039 25477 20370 -35389 2607 37292 -17334 -21321 28704 6226 -24923 10646 16981
789 16981 -19657 -4835 21915 -8398 -20139 15143 9825 -21499 -3838 18423 -6641 -17466
801 -17466 11307 9703 -18749 -424 19965 -11719 -14672 23318 5293 -25750 10853 24314
813 24314 -20937 -9951 30530 -4728 -25363 23582 13405 -31426 6994 28157 -24516 -14965
825 -14965 31147 -5545 -30589 19824 14625 -31591 1202 26869 -20135 -16411 26586 -1250
837 -1250 -24920 14892 15721 -21307 -1874 23407 -7163 -15277 18177 8291 -18299 4326 17717
850A7717k7569j064K6528j1100k2686K1889J2111l0654L784L0621k2360k0281
862b3064L5068K622l8143J8463K9835l5684r645M3610j6187l4994L9998J1817
874B3696m8481J8137L8471m0217j4944M7718j2627l9482L5233J6800m5249J1182
886i763L6621l3857j5866M1462q755l5268K6633J8671l4053K66L1112j6602j9621
899a9020K7011L733k6715J1151K0317j9485j1044K5203J129k6514J1127K2021
911A8914k2492j0363K8055n496k6249K0539J5578l1696M00L4100k1010k5236L6517
924A1561M779m0453J9248K8617l6115o086L9537j7460k9072L5958Q988m1789J6437
937e850L3041l5382j0941L9879j1696l0182K7870J1550l2732P693K7047k3380
$$ plain form
850 17717 -9852 -10916 15612 4512 -18174 3715 15826 -14828 -11044 19577 -2783 -23064
862 -23064 12004 14626 -23517 -5054 24781 -10903 -20548 23062 6875 -28119 11879 23696
874 23696 -24785 -6648 31823 -8394 -23338 24380 11753 -27729 7504 24304 -20945 -9763
886 -9763 26858 -6999 -22865 18597 9842 -25426 1207 19878 -14175 -13909 17203 601 -19020
899 -19020 7991 11724 -14991 -3840 16477 -3008 -14052 11151 12280 -14234 -3107 18914
911 18914 -3578 -13941 14114 8618 -17631 2908 18486 -13210 -12810 21290 280 -24956 11561
924 11561 16340 -24113 -4865 23752 -12363 -18449 21088 3628 -25444 10514 19502 -22287 -5850
937 -5850 27191 -8191 -19132 20747 9051 -21131 6739 18289 -14443 -6750 20297 -3083
949c083j4427L0607k884k8563J6250J8429k3976o010K4235n899k0051J5944J2300
962A2872k3517L85K6044j4565j9713K6296Q047l0610P228K7916k1612j5922L1399
975A4248k931l0771K3294J7602l7073L892L5992k5282k2920L7006K347l7743J8583
988c756K4987l3744k511L5019k0838k2168L4946K271l5360J6679K5837k7597r688
1001a5923L0543p081k3024K0734Q704k5142P128K0923j7974j3426K4008L009k5213
1014a2734O223K1449j5995j2731K1331j202k0389J4037J3034k3874j426K8815
1026A6538j2682k5555K6713J2733l2156N576K7311k1654j1343K9453p782k6489
1038a9337K5894J4265l6618M853L4418k3025k0552L1808j02k8069J7073J4180
$$ plain form
949 -3083 -17510 13097 10213 -18350 -2100 16329 -7647 -13657 10578 4679 -15372 572 12872
962 12872 -10645 -10260 15784 1219 -18494 7802 15849 -14761 -7533 20383 -1229 -17151 14248
975 14248 11317 -19454 3840 21442 -15631 -11739 24253 -1029 -23949 13057 15404 -22339 -3756
988 -3756 21231 -12513 -15024 19995 -843 -23011 11935 14206 -21154 -4475 21362 -6235 -15923
1001 -15923 14620 7539 -15485 5249 13953 -11189 -4061 16862 -1112 -14538 9470 12479 -12734
1014 -12734 -6511 14938 -1057 -13788 7543 6341 -14048 -11 13023 -10851 -12277 16538
1026 16538 3856 -21699 5014 17747 -14409 -8833 18478 -3176 -14519 14934 7152 -19337
1038 -19337 6557 20822 -15796 -10943 23475 450 -20102 11706 11604 -16465 608 14788
1050A4788k6863K574K6907j8900j8793K8705N104k9849Q888K1930j6702r186J8396
1063F999k618j5190J3894R200k1163M67K4517j0786k1046J8885J2369k2208j600
1076h280K0052j0253j3549K0217p5k4352J6026J8279k9040m935L2376j0652k5846
1089b0032K2397J1907k7236O985K1877k2644o662L0638j1925k6326K6873J3802
1101A9654l1758J973K7063j4628j4666K1113j673k0062J6426J1190k5967P51K6118
1114A5534j1707k0086J6902J1082j8973n67J6374j0004q912J7506j778j8997J2912
1127g14J5685j9989q588K4821j287k3621J3100J5119k0742%K0403j5455j2005
1140a3273K5720k298k8255J6056K2067k6818r103K8501p856k0125K0373L674k3799
$$ plain form
1050 14788 -12075 -9501 17406 -1494 -20287 8418 13522 -16327 -7439 14491 -2211 -11397 6999
1063 6999 4381 -10809 3085 12285 -8878 -8411 16106 5320 -15726 3159 15528 -6680 -8280
1076 -8280 11772 1519 -12030 8187 8112 -16240 -214 18065 -10975 -15910 16466 5814 -20032
1089 -20032 2365 14272 -12964 -5979 15898 -6746 -13408 17230 5305 -21021 5852 19654
1101 19654 -12104 -10131 16932 2304 -12362 8751 7078 -12984 3442 14632 -11335 -10584 15534
1114 15534 3827 -16259 643 11725 -7248 -7815 8559 -1445 -10357 7149 5371 -13626 -714
1127 -714 14971 -5018 -13606 11215 9928 -13693 -593 14526 -6216 -6216 14187 -1268 -13273
1140 -13273 12447 10149 -18106 -2050 20017 -6801 -15904 12597 4741 -15384 4989 8663 -15136
1153a5136J3529J7950k5084o725K9910o399k5247J7179J4035k1165J273J7625
1165A1745j3243p724J9352l175j9399J2354J5119j9014q068K1380j916j8145R792
1178i42R735j4313m78J4578r984j1026J8750L222k3640P538K2302j7710j2198
1191a4166K1729j00j8589J2901R523k0909M269K2518j8228j5265K7546J786k7244
1204a4229J1578J7615k0018l675J9911j0111j4304K0277K590k4203J0081J9179
1216A4691j9175r153K1775k280j6858J0381R292j4731Q55J5289j0022j1124J7892
1229F832L380j9876N217J7131j1690j0870J5409K129j6199Q156J0949j7401j217
1242h050K0399j0631j7033J9074P878k2749L743J9339j4286r573K0127l382j9175
$$ plain form
1153 -15136 -1607 16343 -8741 -15466 14444 8045 -17202 -23 14012 -7153 -5880 11745
1165 11745 -1498 -9222 10130 6955 -12444 -90 15029 -3985 -12053 9327 7411 -10734 -942
1178 -942 8793 -5520 -5998 8580 -1404 -12430 6320 9542 -14098 -6560 15742 -1968 -14166
1191 -14166 7563 7463 -11126 1775 11298 -9611 -5342 17176 -1052 -16317 11229 13015 -14229
1204 -14229 -2651 14964 -5054 -8729 11182 1071 -13233 7044 9634 -14569 -4488 14691
1216 14691 -4484 -13637 8138 5858 -11000 -619 8673 -6058 -5203 10086 64 -11060 6832
1229 6832 10212 -9664 -4447 12684 994 -9876 5533 7662 -8537 -381 10568 -6833 -8050
1242 -8050 12349 1718 -15315 3759 11637 -11112 -7369 11970 -2316 -11889 8238 4856 -14319
1255a4319J7357R800k3591L414K2278j4261j3932K0655K578k0614R641J3739j8188
1268e443j718J9310j0889j3320J7502M295j9429M020J5992j1295r582J5465p8
1281D830j4608R243Q738j4492j073J6206o031j4002J3143Q716j7459R76J6594
1294A0781j0009j0030J6476M11j7207R347J2523j7237l949J9973p211j6775J6270
1307C363O653k0085N327J5881j5211o928J9244l956j7104J3683R876j9063J186
1320g134J8271j1121j0317J6610L95j5547Q215J1122j3984l325J5706m942j3432
1333i483J1967O514j5162J588J3171q205r011J2477K163j4807N425J2501j2593
1346c455o025J6341k988j4555J1306Q409j5582K5J6738q954j1751J6726K207j8018
$$ plain form
1255 -14319 3038 12838 -10753 -7339 14939 678 -13254 7401 9979 -10635 -994 12745 -5443
1268 -5443 -7161 12149 1260 -12060 5442 9737 -9692 -5672 10320 -975 -10557 4908 4830
1281 4830 -9778 -535 8203 -6289 -7362 8844 2813 -11189 1954 10670 -6789 -5813 10781
1294 10781 772 -9258 7218 7629 -9578 -231 12292 -4945 -8894 11079 3868 -12907 3363
1307 3363 10016 -10069 -4742 11139 -4072 -11000 8244 4288 -12816 867 10743 -8320 -7134
1320 -7134 11137 16 -10301 6309 6704 -8843 -628 10494 -3490 -6815 8891 3949 -9483
1333 -9483 2484 8998 -6164 -4576 8595 390 -8621 3856 6019 -8788 -3363 9138 -3455
1346 -3455 -9480 6861 3873 -10682 624 9033 -6549 -6524 10214 1260 -10491 6235 8442 -9576
1360i576Q631J2925j6275l156J7659p099j3864J4438N595j7886M279J4888j3207
1373b648p150J7041l594j4412J1152P619j4812O25J4589q117r833J3330K993j4257
1387g474N383J0823j0655m341J2991k320j2041Q521Q084j3153j376J4527o683
1400B286j1373J2326L985j4548M025J1557j0756o308J5022k212j4937J0992R141
1413I200j5965j13J6205r150r689J4491J589j4953P647J1067j4319k670J6194
1426I534o528j2421J2908M599j4396L308J1708j0065o006J2497j250j2507Q327
1439b92P911j3045r18J2904n449r287R445M884j2036K162J0813p889o193J2359
1453E369n62j2534Q061Q878j2065l198J3791m371j1529J0694N254j4224L510J1717
$$ plain form
1360 -9576 -945 11980 -4295 -7451 10208 3109 -10755 3683 9278 -8608 -4329 10559 -2648
1373 -2648 -9798 7243 3649 -10763 389 8008 -6804 -6179 8410 293 -9540 3790 6783 -7474
1387 -7474 -2091 8732 -1923 -6264 6727 4407 -7634 887 8971 -4182 -5558 8969 2286
1400 2286 -9087 3239 7224 -7324 -3299 8258 -2498 -8806 6216 4004 -10933 59 9200
1413 9200 -6765 -6878 9327 177 -9512 4979 6568 -8385 -738 10329 -3990 -6660 9534
1426 9534 3006 -9415 3493 8092 -6304 -2996 8712 -1353 -7359 5138 3888 -8619 -292
1439 -292 7619 -5426 -6344 6560 1111 -8176 1269 6153 -5883 -3721 7092 -797 -6990 5369
1453 5369 4807 -7727 334 9212 -2853 -6051 7740 3369 -8160 2534 7788 -6436 -2926 8791
1467H791j1134n611J4619l129j3380R948P761j3768l82J3982p986q287J2755N13
1481D692j2452P300Q268j1595j731J3006m436j0388R894M837j1766J601J0224
1494G454p334n724R870q36r370N529P210j0057l286J2255l049j0303P653N692
1508E704j0428O41R616o021o360J0730O45j1982O631R617j1785l104J3173l824
1522C253j0013R000M198j1092K598R780r465m798J3006k730j2368Q737P203j1738
1536d429q77J0290m573o933Q670J035r734N654P881j0395k897J1991k049j0062
1550f428O418O609q360j300Q304m510n645Q943P36j1072N254R009r345n600J1132
1565D145L78j1173N281O768r548L83R641p419o339J2561K47j3105N471J0926r821
$$ plain form
1467 8791 -2343 -7954 6665 3536 -9844 104 7865 -5903 -6285 7697 -289 -8576 4179 4692
1481 4692 -7760 -460 7808 -3787 -5518 7488 3052 -7336 2558 7395 -4371 -2770 7454
1494 7454 120 -5604 4266 3430 -5940 -411 6799 -3258 -6544 5711 2662 -7641 12 5704
1508 5704 -4724 -4083 5533 -488 -6848 3882 4527 -7455 -824 8793 -2992 -6096 7077 3253
1522 3253 -6760 2240 6438 -4654 -2056 7724 -1741 -6539 6467 3737 -8631 106 7309 -4429
1536 -4429 -5306 4984 411 -6522 2148 3183 -6551 -897 6984 -3411 -6308 5683 3634 -6428
1550 -6428 -10 6599 -1761 -3061 5243 733 -4912 4031 4767 -6305 -1051 7958 -1387 -6987 4145
1565 4145 4523 -6650 -1369 5399 -4149 -3766 5875 -1544 -7883 4678 4925 -8180 -2709 8217 -1604
1580a604n142J1895k247q438Q264K493j0696M745R034j0039n154J2460j9j2369
1594f817N335P958q549j756P911m491m892Q954k58j0298M690R220q259o451J0908
1609C205J410r350L393N520o377K57P457n415o096J0242K320j2435K690J1321
1623H142p279p181R182O91q368N513L667r524K291J0065q231p825J2206K574j2582
1638f659L363Q776o543l053P528l018n417Q273J751j1177L758J0716p707p141
1652f550R234K433p857J689M904n292p01P122n191o347R557K533j1484J248J0299
1667E597m440o772N965K672o723L333M293p885N38J0254n633q972R839N093j0596
1682c437o39R380l781m987O660j177p163P353L554j1112Q77J1751n856q689P966
$$ plain form
1580 -1604 -6746 5149 2902 -5536 2728 5221 -5475 -730 8304 -1735 -6889 5571 5552 -6817
1594 -6817 -1482 6476 -2073 -3829 4082 -409 -5301 3653 3395 -6903 -2213 7007 -1252 -7703 3205
1609 3205 4615 -4735 -1342 4178 -2199 -1942 5515 100 -5996 4246 6566 -5869 -3179 8142
1623 8142 863 -6318 2864 3555 -4813 700 4367 -5157 -2866 7199 -1032 -8857 3349 5923 -6659
1638 -6659 -3296 5480 -1063 -4116 3412 394 -5023 3250 5001 -6176 -2418 8298 591 -6550
1652 -6550 2684 5117 -2740 -1051 3853 -1439 -2140 4982 -209 -6556 3001 5534 -5950 -4702 5597
1667 5597 1157 -5615 350 3022 -3701 -368 3925 -3960 -3422 6832 1199 -7773 2066 7159 -3437
1682 -3437 -4076 5304 1523 -3464 3196 2019 -5144 2209 5763 -5349 -4472 7279 1423 -7266 700
1697G00M243q465O50O150n501r86P645m309o901Q409M715j0201q57J0096k905
1712B483o974N641K409n986L007M111p174o24Q888l143r104O760O349r026k590
1727d973Q555k449n594O510l34p063N200N678r353k079J1251k195r999O741N685
1742E581q426N87P045n516k659Q244k074q685O569O261r530j945R889l168p018
1757d845O054J630o459K641N074o500k232Q706j936q772O069N769p648j480P105
1772C176k445m193N278J153o772L674O112p533l013R382j270q222M644M916o557
1787a670q84O271l903m300P163j12p944M318O313p836k477Q189j317o409M968
1802C70K837o174J008O163n028l282P932p71p645M409M989n743k261O463j278
$$ plain form
1697 700 4943 -3522 -2872 3278 -2223 -3209 4436 127 -6774 1635 6350 -3851 -4708 5388 2483
1712 2483 -4491 1150 3559 -2427 580 4691 -2483 -3107 5781 2638 -6466 294 6643 -2383 -4973
1727 -4973 3582 1133 -4461 2049 1715 -5348 -148 5530 -3823 -5902 5349 3154 -6845 -104 5581
1742 5581 -2845 -2258 4787 -729 -3388 4856 2782 -5903 666 6927 -2603 -4548 5341 2173 -4845
1757 -4845 1209 2839 -3620 -979 4095 -2405 -4637 4069 2133 -6639 -570 5199 -2449 -3929 3176
1772 3176 731 -3462 1816 2969 -3803 -129 5983 -1550 -4563 4819 3549 -4673 -29 4887 -1670
1787 -1670 -2554 3717 -186 -4486 2677 2565 -5379 -1061 5252 -2584 -5061 3128 1811 -4598 370
1802 370 3207 -2967 -1959 4204 -824 -4106 3826 3055 -4590 -181 4808 -935 -3196 3267 1989
1817A989n524M717K195o322J431N868n016l664O785l6o700K793N338n619k535
1832d300P135j657n749N535K568p001J705O507m830l856P204K95p447L856N124
1847E089o834j043P377l588n191O146J639p684K613N996o158k863P773j492o783
1862e003N024L564o715K01O557l659m083O184O69o707L453N323o065k001O836
1877C578j259n960M222L186n583K15N782m476l916O833n7p117L496N031n779k050
1893c854O634j440n543M652K679o706J789O009n276k915P147n70o327L563M530
1908D372n485j142N838k502m351N615N61o405K982M808n569k572O277m02n756
1923c731L140L711n166m48N111l220l086N523P37o244K030N726m468k988N814
$$ plain form
1817 1989 -3535 1182 3377 -2945 -1514 4354 -662 -4326 2459 2423 -4277 -1484 3854 -1765 -4300
1832 -4300 2835 1178 -4571 964 3532 -3469 -1764 4743 -87 -3943 3261 3556 -3891 -35 5089
1847 5089 -1745 -2788 4589 1001 -4190 1956 3595 -4089 -1476 4520 -1638 -4501 3272 1780 -5003
1862 -5003 21 3585 -3130 -2929 3628 -31 -4114 2070 2739 -3968 -515 4808 -1257 -3258 3578
1877 3578 2319 -3641 581 3767 -1816 -1601 4181 -295 -4211 2622 2565 -4552 -1056 3975 -1804 -3854
1893 -3854 2780 1340 -4203 449 3128 -3578 -1789 4220 -1056 -3971 3176 2606 -3721 -158 4372
1908 4372 -1113 -2255 3583 1081 -3270 2345 2906 -3499 -517 4291 -1278 -3850 2427 2025 -3731
1923 -3731 -591 3120 -2046 -2494 2617 -603 -3689 1834 2571 -3673 -1643 4083 -385 -3373 2441
1938B441k78n172L605K785n376Q59N252l912l626N410J326o646J871N474n039
1953a026k289N450j649l820L801J924n985J487N892m495l573O229Q75o231K774
1968f36L824m083p12M611k074l811M988J090n719J391N008l925k943N098r2m458
1984b443K159K571l994l16M428k412l850N099J170n696J648M779l421k633M516
1999A605L16m482K571L038m768L99N030l062l591M958R87n413J429M272l631k279
2015b621M572r54m238L794J932n156P42M709l088l502M780J024m716J285M347
2030B910l614j393M417j531l189L595J663m417J37N006k922l487M200J438n002
2045b189J531L309l634j086M432j917m042M128K384n799L62N722l251l590M829
$$ plain form
1938 2441 2163 -3009 596 3381 -1995 -1136 4116 204 -3422 1988 3314 -3332 -1461 4013 -1026
1953 -1026 -3315 2135 486 -3334 467 2391 -3594 -2107 3785 -710 -4283 1946 2821 -3410 -636
1968 -636 3188 -895 -1607 3004 930 -2881 2107 3197 -2522 -1131 3877 -48 -2991 2107 2015 -2443
1984 -2443 -284 2287 -1707 -2023 2405 -7 -3857 1242 2412 -3284 -1636 3143 -278 -2911 1605
1999 1605 1921 -2561 10 3048 -1720 -1321 3709 647 -2944 2014 3001 -2412 -983 3289 -342 -2621
2015 -2621 1951 997 -3241 553 2485 -2671 -1929 2780 -308 -3810 970 1994 -2722 -1437 2910
2030 2910 -704 -2097 2320 789 -2400 1195 2858 -1559 -1422 3584 662 -2825 1375 2813 -2189
2045 -2189 -658 2651 -983 -2069 2363 446 -3596 532 2916 -2883 -2521 3201 -50 -3640 1189
2060A189O43m298K376K777m420j46N241k785l885N024K041o191J005M926l339
2075A58k189L670j28l955K985K125n359P94N271l356l989M693J860m734N29L396
2091A771k397j273L647j109l745M405J783n355M70N196k237l741L669J295l598
2106a219R96K719l701l16M696k736m042M586K140n315l33M535j530k980K893L55
2122G48l079K691J716m589O18N257k413m368M164K298l957n39L387j707j159K966
2138B034j488l014L960J519m893n22N251j350m561K466K587l403N11K177k966
2153a692j7L911j650m092L624L287m472j575M793q49k858K038O21k294K205J556
2169B536m115l1M702j305n217L004L287l737p77K825j227j247K338j076k742K966
$$ plain form
2060 1189 1832 -2466 -90 2687 -1733 -1879 3362 577 -3308 1716 3757 -2434 -1429 3497 158
2075 158 -2031 1639 1511 -2444 541 2666 -2693 -1899 3372 16 -3973 720 2580 -2154 -1625 1771
2091 1771 -626 -1899 1748 639 -3106 1299 3082 -2273 -1803 3393 1156 -2585 1084 2379 -1219
2106 -1219 -223 2496 -1205 -1521 3175 439 -3603 983 3123 -2192 -2525 2010 480 -2500 393 748
2122 748 -2331 360 2076 -2513 -1895 3362 949 -3419 745 3043 -914 -1453 1934 227 -932 2034
2138 2034 546 -2468 1492 3011 -1882 -2404 2847 1497 -3064 -598 1989 -1414 -903 1274 -1692
2153 -1692 -1709 2202 552 -3540 84 3371 -1101 -2676 2117 1268 -1590 448 1069 -1225 980 2536
2169 2536 -1579 -1610 3092 1787 -3430 -426 2861 -876 -1653 1172 -55 -1302 1036 -40 -2782 184
2185A84K380m175j495N256p87l978K242J964k067R3J426j797j82L370j044m219
2201b829K919L723m062j728L257M4k419J003Q94j963Q53K267l559j008M530n37
2217A385m654K242L157k547j201K401m19j440K086J43l471K295L379m015j977
2232b636M657N9l706J021K387k110l33K063j660j716L774p28m135K104L581l149
2248e27k239L235O19k578J069J338k421R59K650k626j632M156J34m077J259L310
2264B629k086j889K894r38j831K088M62l291J720K766k853k355L759P60l820J033
2280i52K456k265m43K633k129j156L022J61l531J385L191j969k589L271M72k631
2296a074J402Q96j950L72K115j935j509K903M46l450M74L386k186j692K221J47
$$ plain form
2185 184 2564 -1611 -3106 2150 1363 -2615 -373 1591 -476 -383 1043 -754 -936 2434 1390 -2829
2201 -2829 90 3813 -249 -1977 1280 1324 -1095 -92 802 -1161 -308 1959 -1600 -2608 1922 1385
2217 1385 -3269 -1027 2130 -417 -1618 783 364 -1076 1010 1153 -2318 -23 3356 -659 -2636
2232 -2636 2021 2080 -1626 -605 1782 -328 -661 1402 -258 -1974 1800 1072 -3063 -959 2622 -527
2248 -527 -2766 469 1088 -1490 -421 917 -1504 -545 2105 -521 -2153 2003 2137 -1940 -681 2629
2264 2629 543 -1346 1548 610 -1221 867 1329 -1962 -242 2524 -329 -2684 1075 1835 -1985 -952
2280 -952 1504 -761 -1204 1429 -700 -1856 1166 1327 -2204 -819 2372 403 -2186 1085 1557 -1074
2296 -1074 328 1224 -726 -354 1761 -174 -1683 1220 1666 -1784 -1310 2076 -110 -1802 419 566
2312E66k269J758R45k608K94L078k018k253L165J156l277Q69K427j950j084K688
2328A487p08j964J959J134l023J83L077j960k056K448P60k779N20K399k323o83
2344a529K545p62k283K305J013k923O93K369j662j722K601M92k403J330J639k422
2360g19n1K835j473k041K395R58l102M20K662k127j695K562K19k605J609J704
2376A551k939J05K708j557k053K543R74k782N52K302j801p99K545m93k132K152
2392H76M83k183K60K537j567k126K699M81k831P35K052j959n43J978o64k133J946
2409D1J052k533Q2K823j308k061K408M64k079R11J486j515o52K283p84k220K362
2426G60J260l057J16K591j070j705J593L90k148J274J225k368k32K555r06k612
$$ plain form
2312 566 -1703 55 1000 -1608 -1314 1764 -254 -2507 658 1814 -1463 -594 1833 -117 -1201 1487
2328 1487 779 -1185 774 1908 -1115 -932 2145 185 -1871 577 1337 -1442 -922 1477 -846 -1529
2344 -1529 1016 254 -2029 276 1289 -1634 -941 1428 -234 -1956 645 1137 -1266 64 1703 -719
2360 -719 -770 2065 592 -1449 946 1904 -1198 -778 1884 -243 -1938 624 843 -1762 -153 1551
2376 1551 -1388 -1283 1425 -132 -2185 358 1332 -1450 -898 1404 -397 -1196 1349 856 -1276 876
2392 876 1359 -824 -564 1973 406 -1720 979 1460 -1371 -636 1416 -543 -1086 892 228 -1905 41
2409 41 1093 -1440 -1358 1465 157 -1904 504 968 -1111 -200 1286 -229 -881 1402 618 -1602 760
2426 760 2020 -1037 -921 1670 600 -1105 488 878 -1270 4 1229 -1139 -1371 1184 278 -2334
2442b334K504J301k695j34K752j511j147J824j17k086J825J659l031L59K811j227
2458G53k059J695R98j979J51J964j797p86K545j435j939K273J160k397p15K686
2474A118p33k084J937M77j958R35J620k178q0K229o19k265J972J424k521l54K508
2491A428j013j325J790k05j719J505R74k044m58K474q59k163J528J217k033J89
2507g14J625j447n79J909n54k005J563J668k392j96K576o99j745J367P16j813
2523g20M34J545j291r36K230l99k176J400J567k408m83K092q27j528J647K52j665
2540a266O83J759j886o76K525m59k086J629R62j731p4K101j320r82J865r4k011
2557a061J081J689k274k80J899m86j757J263R65j869l9J567j080j015J999j77
$$ plain form
2442 -2334 170 1471 -1224 -1358 1394 -117 -1264 560 443 -1643 182 1841 -1190 -831 1980 753
2458 753 -1306 389 1387 -592 -441 1523 -274 -1060 1485 50 -1889 384 1544 -853 -1568 1118
2474 1118 385 -1699 238 715 -1243 -308 1312 -866 -946 1283 664 -1601 371 1795 -726 -1080 1428
2491 1428 415 -910 880 675 -1044 461 1435 -609 -1067 1407 548 -1615 -87 1130 -903 -714
2507 -714 911 -536 -1115 794 240 -1765 -202 1466 -926 -1122 1454 755 -990 377 1093 -720
2523 -720 -286 1259 -32 -968 1262 863 -1313 87 1654 -754 -1237 855 28 -1500 147 399 -1266
2540 -1266 -583 1176 -710 -1386 1139 680 -1406 223 1185 -546 -620 1481 161 -821 1044 950 -1061
2557 -1061 20 1709 -565 -845 1054 568 -1189 74 1039 -830 -869 698 -382 -1397 602 425
2573D25j738Q50J613j811l26K016n53j648J219J162j923N17J370j191n51J629
2589A060m87j505R16J356j739p67K034n38j383J342J53j441N16J069j203p13K244
2606I14k71k015J149J475j620n93J635m75r34J218L09j372L49J623j735n72J951
2623A036j50j801J006R84j164p16J560o42j016J289j23j450P63J560j747o03J857
2640F43n8j601P67J025j323k8J585r41j089K039J39k192Q99J812j795m83J555
2657I54m24j357J015K82j718Q87J389j631j120K541q5j942N86J376j293l31J350
2674D79n68q88J658j39j749J055J597j410q37J650J03j515M87R64j210O8J178
2691I23j135q16J907r5k042O41J566j062r76J073K34j023Q80L08j391O03J475
$$ plain form
2573 425 -1313 -463 1150 -661 -987 1029 476 -1172 47 1209 -714 -197 1173 -18 -569 1060
2589 1060 573 -932 -16 1340 -399 -1166 868 330 -1053 289 442 -999 -483 586 -617 -1330 914
2606 914 643 -1372 -223 1252 -368 -961 674 199 -735 483 792 -580 -231 1392 -343 -915 1036
2623 1036 886 -915 91 1075 -89 -805 755 113 -903 386 263 -1187 -424 1136 -611 -1214 643
2640 643 585 -1016 -249 776 -547 -575 1010 69 -1020 1019 1158 -1034 -135 1677 -118 -601 954
2657 954 530 -827 188 470 -1248 -361 1028 -603 -1723 818 733 -1209 -623 753 -540 -871 479
2674 479 -89 -977 681 542 -1207 -152 1445 35 -802 848 951 -564 -77 887 -323 -255 923
2691 923 -212 -1028 879 784 -1258 -617 949 -113 -1089 -16 218 -805 75 383 -1008 -405 1070
2708A070j253j069J836L52j624L49J305q52l69Q28k23o10Q30K29j565J35J822
2725A191j282j207J519N35j549K56Q69n64n52J411r30q12J342M12j836O01J515
2742I19r31q91J305N25j279O74M51j290J04J627j195j058J791K87j665l6J406
2759G44o66n50P61k77q96J104L61j528L62J488j010r32J221M63j012P7J072j086
2777c04R2J003m81j081J244M79j653J81J258n83r45J048J04p28L17O55j112L6
2795d70J007n32j116J055M16j095o6J400k62j171J206L0j070P11J091j297j92
2812c55J415o45j205J032O03j043k38J096n41o37R66j16j423P82J018j180l89
2829h60J301p8j424J084L89r60O3J056p47j26P15J02j188J029O14j084n01J585
$$ plain form
2708 1070 -183 -1252 584 936 -688 -339 966 114 -255 573 350 -260 570 799 -766 -631 1191
2725 1191 -91 -1298 221 756 -793 -537 332 -232 -784 627 -303 -1115 227 639 -1197 -596 919
2742 919 -12 -903 402 927 -352 322 773 -517 -413 1214 19 -1039 752 1039 -626 -662 744
2759 744 78 -472 289 12 -884 220 581 -947 -585 903 -107 -1039 182 645 -367 -290 782 -304
2777 -304 -212 791 310 -771 473 952 -701 -520 738 155 -790 258 362 -366 -49 606 -506 -470
2795 -470 537 5 -1111 -56 360 -735 -801 599 337 -834 372 402 -668 43 1134 -163 -355
2812 -355 1060 415 -790 242 845 -198 -436 660 119 -518 448 332 -1091 -309 709 -471 -860
2829 -860 441 363 -1061 23 412 -548 -485 571 -176 -302 413 515 -673 356 970 -114 -615 970
2847I70o25j012J094J67q47j7J015q91n42J116j49j489J250P65j448q2J223m83
2865A5r60J142J53q58K36J396j403M7J242n18j289J164L33r85J88P78m98q79J218
2884E22L7j195N53Q68j325K92R53n21r27N63M90q02J65R49j068k97J358o13n70
2903e68O11M32m85k77Q88j20q71P55p0n85L77O13p22k00O93j98q66M20Q65j052
2923c60l63J219m67n71P46q8o56L38P27r50k23J211j93r43N99O50j001J17R85
2942G77p95k04P89j72q38K50J168r91o33J080k36q99P06J19n80lP20n45n72J250
2962C91r8j146O15R27p25j99P47P0r75Q26J40r51R1Q91n88n09J457l94j069L50
2982a49Q80q56k89O83j06p75O96Q4j023O56P09q47m34R68m1m07L99K79o09j73
$$ plain form
2847 970 345 -667 427 594 -253 -270 745 -146 -688 428 279 -1210 40 805 -643 -725 498 15
2865 15 -945 197 350 -508 -272 1124 -279 -232 1010 492 -797 367 700 -285 -97 681 183 -696 522
2884 522 559 -636 -83 785 -540 -248 705 184 -743 -180 310 -492 -327 622 -446 -743 615 2 -568
2903 -568 43 475 -10 -287 601 481 -390 365 295 -290 87 700 -22 -222 471 273 -593 -173 692 -360
2923 -360 -723 496 29 -542 204 116 -540 -202 525 -425 -648 563 370 -573 26 676 -325 -208 777
2942 777 -18 -222 567 395 -443 -193 975 -16 -649 431 195 -704 2 121 -459 -462 258 -287 -859 391
2962 391 293 -853 -238 689 -36 -235 512 582 -393 433 573 -378 -287 604 16 -493 964 570 -499 -149
2982 -149 731 -125 -414 269 163 -612 84 168 -855 -199 510 -337 -771 197 156 -251 148 427 -182 -355
3002c55R03k14p93J083n1j175M42P85n63p18J023J84j004N36N25j120R5Q41m90
3021f6r04J395l1j063J60Q98p16k7N72j59o24P42M58j089M67R00q36q64J257j6
3041D54p59Q6O71n52m98J075o38l28Q99j93o77P2P82p20j44P09j4p66O44J07m20
3062b10k30Q81l57p19J019M75j070Q5J089o80q62J043q1p51N15L96q02k8Q74n49
3082C8o53R55j44o59J68N16m37k47O58q5p51P63L55q88L33M71n33l59N60L97m15
3103D3J35N20o32k84O82j75p91N69J75o91J62M65j51m74N22O1o88L12M82m75j11
3124c44N88m19k62M22L63o36P0Q50k62q47J019p2j048R39L76q83L0N39l28p08
3144f13P54K57r18K28P51n90l25N63L1o18M20K59n84K3P56l25n25Q30Po69L13
$$ plain form
3002 -355 548 334 -459 624 573 -602 -160 625 62 -656 367 551 -453 83 608 -512 -417 424 -66
3021 -66 -970 425 394 -669 -509 389 -327 -354 218 59 -565 177 635 -454 13 913 77 -787 470 454
3041 454 -305 -219 452 -100 -598 477 -161 -489 410 217 -460 -388 394 -326 -470 239 225 -541 103 210 -210
3062 -210 -440 441 84 -635 384 859 -211 -126 963 283 -579 464 383 -368 147 543 -259 -287 587 38
3082 38 -615 340 196 -463 -295 221 -216 -463 195 110 -641 122 477 -411 -78 393 -140 -499 61 458 43
3103 43 178 698 66 -218 464 289 -502 67 242 -449 -287 178 27 -447 75 136 -552 -240 242 -233 -344
3124 -344 244 -175 -437 -15 348 -288 -218 632 370 -477 542 470 -578 361 737 -146 -116 423 95 -613
3144 -613 141 398 -520 -292 459 -131 -456 107 138 -480 -60 199 -385 -362 394 69 -456 374 381 -288 25
3165B5P03o43k77L71L60q63K11O47j055R7J135p45k88M64O1m84j78O71o33k00
3185f21J140n32p47P31K11k49k33M51p6k82N31n3o84M22N92q84n3P90K01j020
3205c65N46l1k21j29N75k10o19R73l59n48J26M80n22l15J048m54m76M66J61k87
3225a61Q6O45n27m34P16l9o47O09M91q48j35P96o45m67N16K11o52N56L60n57n4
3246a80O66k05o42L6O96n67l28R33l38l26N15l2p84O87M83o67k33P23k16k79K60
3267B02M74q04K9N34n19l05P41j26q03M26L90n23R0L40j05n10L42N32p17J56O13
3288D57p88N8M86M00p97K24K57k44k7J95j52k03L87L85p13J22K83k17n60N57K31
3309C41n99K59N2k66j17N76l14j81L99r5m80L22L64l12j90N06J93p84M85k5k30
$$ plain form
3165 25 728 85 -192 179 539 -324 -113 534 -521 -424 711 -34 -322 142 203 -281 -459 212 -421 -621
3185 -621 519 -13 -760 -29 182 -67 -300 151 75 -207 324 271 -413 9 601 -283 -336 454 655 -365
3205 -365 181 150 -71 -200 375 165 -454 519 160 -388 -262 218 -304 -619 429 -25 -501 -35 126 -161
3225 -161 -75 570 43 -391 325 286 -361 248 739 -109 -244 552 -93 -560 -44 167 -485 71 431 -126 -180
3246 -180 486 281 -361 -325 371 -196 -524 409 71 -255 260 228 -556 131 614 -53 -286 437 221 -58 202
3267 202 676 -128 -99 435 -84 -389 352 226 -577 -151 239 -284 -194 146 41 -469 -127 405 -312 -156 457
3288 457 -331 -273 213 613 -184 40 297 53 26 221 69 -134 253 638 -75 47 330 113 -447 110 341
3309 341 -258 1 53 -213 -330 246 -68 -249 150 55 -425 -103 261 -51 -241 265 458 -326 159 134 -96
3330i6J07M59k73m21K63L86q99L17O27n27k35O01k08m12L84J74m55j23O36n45
3350b40k42M91J83n46K02O28m16j83L28o7j74Q7L21n03P2M96m72l42L64M27q24
3371d10L63K91n44K4K78L6k28J17P5l05K63K82n43j6N14k94j99L93N8k95J72M34
3393D66l28l27M95J22p01K23N19m94q8P07m19l85K80J12p35O40J44m59l09R14
3413C77k68n10K72K71k28j79N18k00l44N58m3n72J97P15o96j45P00K5o82L19P3
3434A58j74j89M42k71l14K36K66l31j68M74l37%J44Ll24N12o1k51J53L80m28l2
3456a12M26m2m60K02M77m73j45O38k54m51L73J92p37L4P30m58l81K26R3q9M9M95
3478C33p04L90L5j81J22P1N5n09K84M47j12m76M35j16j6l9N96o03p6M36m02n4
$$ plain form
3330 -96 11 470 197 -224 39 425 -474 -157 470 -57 -292 309 101 -311 73 247 -208 -331 305 -240
3350 -240 -482 9 192 -354 -152 476 60 -123 205 138 -36 51 372 -131 -59 437 -35 -377 -13 414 -410
3371 -410 -47 244 -300 -276 2 38 -190 -73 2 -303 -40 242 -301 -317 197 -97 -296 97 155 -140 32 466
3393 466 138 -189 306 428 -273 -50 469 -25 -113 594 175 -210 70 182 -553 87 231 -228 -537 377
3413 377 109 -401 -129 142 -86 -265 253 53 -291 267 224 -348 -151 564 -132 -277 423 448 -234 85 158
3434 158 -16 -205 237 -34 -348 -112 154 -177 -345 129 -208 -208 -64 -61 -385 127 66 -185 -32 348 -80 -112
3456 -112 314 272 -188 14 491 18 -127 511 257 -194 179 371 -366 -332 398 -60 -441 -215 -122 -211 -162 333
3478 333 -371 19 54 -127 -5 66 121 -388 -104 343 231 -245 190 74 58 19 615 12 -64 372 -30 -84
3500h4L3L46n65p1M69k27k55N69n34l0L49J73m04k4L72J26n53L72J57m59R8M99
3522C57k48l29M52j2m15K67L54l62r0J81k12j59J55O6k86R0M22m57l88O61J40
3543A87m53O5K65l02j7L54n3o8R1q5l17M40K84k75k30J78P3l82K41L47m47l95
3565d99O80l54j77M70p7l97P9N68n83J2K92o0k90L90J21n43N21K13k93k87N50
3586C36L6n47M61O1l51k25K48J05j81K7J91m88O7M48l38o2J06J52m66N39jl78
3608b60kJ28J34l44L84L93m61p0O27n10l01M48rj44J28K85m58n3J67k03L5K51
3630A65R9n37J28O8j97k7N97k03m22M07J59l14L2L01r1n91N26n5k07l5L67n1p0
3653D9k5O7k81K12K04k47j8K66j97l76M62l05q8L37m0l4k13L20k76j66L68M9k32
$$ plain form
3500 -84 -51 295 -270 -341 128 -99 -354 215 -319 -349 0 173 -231 -255 117 243 -310 62 219 -240 -142 357
3522 357 109 -220 232 220 -195 72 426 64 -26 155 -57 -216 -61 5 -281 -191 231 -226 -614 47 187
3543 187 -266 -201 64 -238 -255 99 46 -22 69 -16 -333 107 391 116 -114 64 137 -245 -4 343 -104 -499
3565 -499 181 -173 -350 120 43 -354 -275 293 -290 -278 14 -46 -336 54 175 -368 153 366 73 -214 336
3586 336 372 -175 286 347 -4 -229 19 124 -57 -30 161 -327 -260 188 -150 -212 -106 46 -420 119 118 -260
3608 -260 -262 -134 0 -344 40 433 -28 -98 529 19 -282 166 157 13 141 426 -32 -85 82 -121 -86 165
3630 165 264 -273 -145 -77 -274 -301 296 93 -329 78 237 -77 -45 256 165 -426 100 45 -162 -197 170 119 49
3653 49 24 91 -190 22 226 -21 -39 227 30 -346 116 -189 -277 60 20 -14 -227 93 -183 -349 19 68 -164
3676a64L33K47n31J29M47j71k40j21Q9j34K76Q7m6m18L86j4j75O4l2j70J4K41
3698I7j06l93M29K78n66O9K51J04l66K88j8l25K10J25J40j69K44k8l42K22J01
3719B45l79J03K93k27k26K51M5m90N07N5j09j91J05n0n4J75k51L5L0K34k47j71
3741c17K75J95q7m0L7o0J58MJ09m31L50K73n41ON03m07l9J18k3j75J42mk08Q5
3765g7J00j86r4K75K23l56M2K70m6m11L19J2k57O41j88k71nK00k63o3J36Rpj30
3789a27M81k17n12M65k98K57J32K8m85O3M38k70m3J06J12l53R7M64m02J57j76
3810h3M31l96j9J89k96N05j69p9J73K3r7k56L31j11m92K12J07J2j15J08K25n66
3832c63Q1N7r3K24L50J5q20N40J40j99nK90l44P4J41K91m15k3L44l01l01L26J8
$$ plain form
3676 -164 169 416 -115 14 461 290 50 -71 18 -116 160 247 201 -217 169 155 -20 44 12 -158 -144 97
3698 97 -9 -402 27 305 -261 -192 59 163 -203 85 67 -258 -48 77 217 48 292 264 -78 144 245
3719 245 -134 -31 262 35 -191 60 105 -385 122 177 68 -123 -18 -68 -122 53 -198 -163 -133 101 -146 -317
3741 -317 -42 153 66 26 63 3 161 165 274 -157 193 466 -75 -69 434 27 -12 106 83 -92 50 46 -162 -77
3765 -77 23 -163 -257 18 241 -115 -73 197 151 -260 59 71 -186 455 267 -4 -9 191 -72 -135 1 10 3 -127
3789 -127 354 137 -375 90 -208 49 181 209 -276 -213 225 -45 -88 18 130 -223 -126 338 -64 93 -83
3810 -83 348 -48 -67 122 -174 331 162 83 256 279 182 -74 257 146 -346 -134 -27 -15 -130 -22 203 -363
3832 -363 -282 -225 -318 -94 256 271 -549 -9 131 -68 -73 217 -127 -53 88 379 -36 -59 285 -16 -317 9 27
3855B7N9o5J56k06l77P01k65j86K05n9kJ39j06j23J08K00m49K16Q3K09p9k45N42
3878D83o10j0M15q0n20M25oJj49L29m19o1L38km16K66J7k57K07n8k3j80J66K60
3902A16l5l11M35N1j59K10k64m9M7K75r6k53J09k80J65K20j24j4l26K42Kj68K33
3925B6K3k80N9L38k66l06M90p2q5j30L16l47M9L61j04l6pR1k42J60K71m44k36
3948c71M68Lk20k7K66l06j20M97l94K4P1J82m51L55L16l38j78L93j67j70K62j21
3970b6j08R6j8J43j66M16k92k98K48J54j55J84J11k56j9j22K25m65J27M08l31
3991a44o4K38p3r3K2j34K98k89R6K95j1r8j1l1K8K30k88O4M03k43l86J67K54l18
4015h8o4R8j8q6J05Qr7Q1J1J63l15K61j65K86Jj37k57K42K79n32L90PJ98m15L8
$$ plain form
3855 27 86 21 177 -29 -406 295 30 -156 49 -10 -12 127 21 -102 6 206 -243 -27 56 265 186 -59 483
3878 483 -127 -137 278 198 -322 103 97 98 -51 278 -141 -202 136 134 -282 -16 1 -256 -49 -107 -130 -310 -144 116
3902 116 81 -230 205 256 97 307 43 -6 41 316 220 -33 76 -204 -39 181 57 43 -283 -41 -39 -207 26
3925 26 49 -231 -172 166 -100 -406 84 12 -73 -203 113 -234 -185 176 72 36 29 120 -122 38 309 -135 -371
3948 -371 97 100 -120 -147 119 -187 -307 190 -204 -180 -109 73 -378 -23 293 -45 -223 170 3 -167 95 -26
3970 -26 -134 -38 -56 87 -79 337 45 -253 -5 149 -6 178 289 33 14 -108 117 -348 -221 187 -144
3991 -144 -208 30 -43 -136 -114 -248 50 -239 -143 152 141 43 32 1 29 259 -29 35 438 195 -191 -24 230 -88
4015 -88 -152 -54 -72 -158 -53 -45 -142 -61 -50 113 -202 59 -106 180 181 44 -213 29 308 -224 166 173 371 -44 -6
4040fJ90j15o1J35j26j09K19K45p36L49jm8mJ58m6l1j89L72l79r8N40m09J2J74
4064C6J28j24k77N12j35j61L26k96j71J38J14p9R1j47K9k05J03l8O3J24J3j31
4086h7Q4R4o7p3R0j03J95l08L38o4k50K47p7K02l34k3J40j12N61l12k08L63j38
4109A58m34K68K10j8l88L46m8k41L08k86l4N4L71l16j9j21J79J09j67K34J2k36
4131e9P0n8P0K9K11l19j78L46q9j65J49p7j12k1L19j12k31N59l24j10m0J68Kj75
4155a47J95j6j49R9J06l65K60J44j74l0J51j68j4K04m5o2j85L07m0j14K79l33
4177i7j00P1J43k44k2K08m6l72K24J06n2K04P7l22R7r3K25J18Q4j24j41J46O5
4200A55p7j15K16k30K69l3J34n09n8L49q9l7j92k9M09m16N03l21q8K17Lj32J42
$$ plain form
4040 -6 184 69 8 143 17 -92 127 372 -364 -15 -16 -64 -68 90 44 13 -176 196 -183 -281 259 -150 -138 36
4064 36 164 40 -237 275 140 -21 305 9 -162 -24 90 11 102 -45 -16 -221 -118 -156 -93 31 44 -87
4086 -87 -3 91 24 -49 41 -62 133 -175 163 99 -151 96 19 221 -113 -136 4 -108 453 141 -67 296 158
4109 158 -276 -8 202 184 -204 142 94 -147 161 -125 -159 -105 266 -50 -69 -190 -11 98 -69 165 177 -59
4131 -59 11 -47 23 52 263 -56 -234 112 23 -142 7 -70 -182 -203 116 4 -227 332 8 -102 -142 26 28 -147
4155 -147 48 32 -117 -18 88 -277 -17 127 -47 -77 74 -94 -108 96 51 -11 -196 111 71 -43 236 -97
4177 -97 -197 -126 17 -227 -249 -41 -87 -459 -235 -129 -181 23 100 -222 -125 -218 7 125 209 85 -56 90 155
4200 155 78 -37 179 -51 218 185 319 -190 -248 101 12 -25 -217 -246 163 -253 250 -71 -159 58 61 -71 71
4223G1l8K3m13K40J83j7J39J76p4k68K29nj08O3k00j38M7L91m13L58k30q9PJ77
4247A11j02k83J63J03O4l9j00J08m32L44N2l5j4K25J62l73K47l00J25Ol8J38r8
4270C4R5O1j50r2K37j86j51K87j01p6RK05k19K9O3k21J6J65L4k40J30J82k86J79
4294Dm0N8L2j24j57J94J45m9J41m8K1k54J51k45J14J5m12L56k07L38j0R2k61J29
4318a7M3J62l89O2J64p0P1J08rj85J12j33L1n7L92j15k39J97j20K47l74J49j01
4341g1j43J17j8r1L89k04M7J80l88M7j56N30m09J19K87j07j95J12q5J88o9p9J6
4364A7K09l21P0r2N25p8m60N8J23jp8j74K0J98j43O8j59j13L10J9j77j85K65J74
4388G5j58J93J67j29k21K57k69L0L04l22J95O4j67k0j96K12j05M4L30k80kk8j06
$$ plain form
4223 71 33 56 -357 -117 66 49 188 364 290 22 251 246 138 201 1 -137 -90 301 -112 246 16 -73 -66 111
4247 111 9 -274 -111 -8 56 17 -83 25 -407 -63 -11 -46 -60 165 327 -46 201 -99 26 32 -6 132 34
4270 34 129 190 40 -52 185 -1 -152 135 34 -42 -33 172 -47 -18 45 -176 -160 5 39 -201 -71 111 -175 4
4294 4 -36 22 54 -70 -227 -33 112 63 204 156 177 -77 74 -171 -57 -42 -454 -98 -305 33 23 115 -146 -17
4318 -17 26 188 -201 -139 25 -45 26 134 125 -60 52 -81 -50 -107 285 170 -69 128 8 255 -119 30 -71
4341 -71 -214 -97 -115 -206 183 -21 26 206 -182 -135 -291 239 -170 -51 236 129 -66 46 -39 149 80 1 17
4364 17 226 -95 -25 -117 408 330 -130 -72 51 50 -28 -202 -182 16 -127 -59 -218 -331 -21 -2 -179 -364 -99 75
4388 75 -83 110 277 148 -73 184 -85 -55 249 -73 122 186 19 -1 -197 15 -90 -46 284 4 2 -26 -132
4411a32m7L8l2K4J26J21j60m4K42m4k92NK75M5j77l4M22m32K10j10J99l39N67
4434D31k54k27Q3j83J01P8L8N0k98K02J8j85J30L71k71p4lk82K92n8M41m45L04
4457B59k89J71k02O3N2j34J90j30p2J14j16q9Q9k07J90l0J53J6j4J31j30j29k0
4480a34n4L78k46K4J40j41k33L32R0l25R5K26p1o3k8N6l8N4j16n2J43K64m34Q0
4504e3J6J86k70K76k6j77OK54m45K03N6j03J67o3J29r9N2k87M50j42L1j32L5J25
4528A89o8J36m91K20J22r8n9K5M7j42j74K28K8Q5J08l22j04K59k4M4jJ43o7p0
4552A4K00j74p7K68j43q0L5o3r7PJ76j09j6j39L88j60k8rl83L63K39j92k57R0
4576a47K62j39J48q2J35Kj11QJ53j26N9j68O9o4P1L1l43J27K8J33J50j76N0M1
$$ plain form
4411 -132 -179 -141 -173 -149 -23 98 -62 -106 136 92 -200 -195 80 125 -52 -86 336 -96 114 4 203 -136 431
4434 431 177 -50 33 -150 -49 29 67 117 -181 21 39 -146 -16 355 84 10 7 -275 17 -41 400 -45 259
4457 259 -30 141 -61 2 54 -80 110 -20 -92 22 -94 -183 -94 -301 -111 -141 12 28 14 145 15 -114 -134
4480 -134 -188 190 -56 -32 108 -33 -266 66 156 -169 -74 152 81 18 -10 46 8 62 -54 -106 37 301 -133 -53
4504 -53 -37 149 -121 155 129 -48 -42 212 -233 -30 26 -77 90 27 156 57 109 -178 272 130 161 29 64 189
4528 189 121 257 -234 -14 108 10 -49 -24 23 -119 -293 -65 -37 48 156 -166 -270 -11 -35 9 8 151 84 14
4552 14 214 40 -37 231 88 8 43 -20 -117 -110 66 -43 -59 -198 190 30 2 -7 -390 -27 212 20 -237 -147
4576 -147 115 -24 124 42 177 179 68 76 229 103 162 -6 63 -1 70 101 -242 -115 -87 46 196 20 70 111
4600A11l02R9J36K15k62r7K3j53J61j31J65K27k34L3o9J5M55k01j42p7J90k2l33
4623a93M75l27R6K51j59j02K1k21oJ20K2J80m29J0J14K54l43J99P6l9j38J79p3
4646c3PL8K11j85k01K41n06N78nk62o3K74O3l09M07j47L8l71K39P6p5l4P9j06
4670d6q9L20o63L54J80q5K4k04J91o4K34j38l0J7J43j19j8np6j40k9M51l8k8l11
4695a69K71j48J27j17J75l22M33k24j14K2l7J3N4L22k62J32o1j02O0J05r5j0K47
4718C00m79q1J51J82k11N5J34k27J21L6J46o5m9j82N8j95K07J48p0j0N6j41J92
4741G6Q5l15L2L5K13o4j66M50j66k80O2L50l69P4M1o3q5K50j69j70Q3J51j74Q5
4765c4n6m7j4L55k84K5J06l4R6j56P8P7j03K13l24K36O0j3Q8r3J74l60J03R5k7
$$ plain form
4600 111 -191 -92 44 259 -3 -100 -77 -230 -69 -200 -35 192 -42 -9 -78 -63 392 191 49 -28 162 140 -193
4623 -193 282 -45 51 302 143 41 62 -159 -165 -45 -23 157 -272 -262 -148 106 -237 -38 38 -1 -139 40 -33
4646 -33 -26 12 223 38 -163 78 -428 150 145 -117 -180 94 157 -152 255 108 146 -225 14 90 15 -19 60 -46
4670 -46 -135 185 -478 -124 56 -29 -5 -209 -18 -82 152 14 -16 1 144 25 7 2 -74 -214 -243 208 170 142 -169
4695 -169 102 -46 81 -36 139 -183 250 26 -88 -66 -103 -90 -36 286 24 156 95 -7 53 158 63 53 300
4718 300 -179 -260 -109 73 -138 -83 51 -176 -55 -19 127 62 13 -169 -111 -306 -99 49 -21 -31 25 -116 76
4741 76 161 -154 -122 -87 126 62 -104 346 180 -100 -38 312 -57 17 58 -5 -90 160 -9 -179 -96 55 -119 -34
4765 -34 -90 -137 -151 204 -80 -55 51 17 113 -43 35 112 9 222 -102 134 194 181 269 176 350 -10 93 188 161
4790A61j55j92K05j78L66q8j9k2k76K90k2j28j24K55n0j34K28j64J1j8K34k08
4812b8N2P4n9k33K15kJ36j24J06j35%J66j65j1q5J72j01J12j37m7Q9k84J63O8
4836e8j57J70J97p1n0l8l3M49l05j05J39j45m8J13j77J35j20K54Q0j83m50M34
4858C1o5q1J39Oo8J15j1j98P1M7J27j20l2J65Q0o9j41QL9j28O8j2O4M1o2K9k05
4885a62N3J75j50J53j65J50k63J25J71J37k31p2j89K47k5J20k7p7QqN2r4K05m9
4909H4n3J40M5j53j57J6O7K07j21k11K05Pk43j03L7K55r0R1j83l7K98j81j39m8
4933b67J94J35RJ95m40j18J76J23k79N00l01j25L19q1o2K05N0l76M71j00l35J41
4955C4m2K2L1k68K04ml1p3Q1K37j64L3k48K63j81K03j87j08nL4K91j92J77p8O
$$ plain form
4790 161 6 -186 19 -159 207 119 100 78 -198 92 70 -58 -182 73 23 -111 117 -47 -36 -54 180 -28
4812 -28 24 98 39 -194 21 19 155 31 137 2 2 168 3 -8 -93 79 -22 90 -47 -94 -5 -289 -126 -58
4836 -58 -215 -45 152 81 31 -7 -40 409 104 -1 138 -7 -55 58 -119 16 -104 150 230 47 -403 31
4858 31 -34 -115 24 30 -38 77 66 -132 -61 -14 113 -7 -39 126 206 137 -4 4 43 -85 -17 -29 35 76 14 43 -162
4885 -162 -109 66 -84 69 -96 54 -209 -84 87 224 -7 -79 -268 -21 -46 74 47 -30 -22 -30 22 -72 133 84
4909 84 31 171 216 63 -94 -78 -11 196 75 -136 69 76 -167 -270 -233 22 -68 23 -160 -197 101 -80 -219 -267
4933 -267 -73 62 71 266 -174 -292 -116 7 -272 228 -73 -198 121 40 -22 183 233 -143 328 228 -107 34
4955 34 -8 14 45 -223 -19 -23 -54 -127 -46 191 27 60 -188 75 -106 97 -90 -198 -203 -169 122 -70 107 29 35
4980C5R4l0j09M6j00r7N87n13k15M72k79M5j02J42m0j14J40J13n7Kj14L34Q5k88
5004C7K33l64J92k7k3J56M7j64k08K17n7j69K09k9J25l38K68q8N8p5P7n2n11M14
5028g2J85j31j96L2K29J01q8j96l1J56K3j22L95j01K7J4j96n5K79l00K28n1l36
5051b06J65j89K85k13J73qj78Q4m0K38l42L66l11L38j00K0j43J00p0O2J11m17
5073b75L76j30M7k03L57r8oj75n7J54j41R9K48l57K30O4o4j20J85m20N71j38k08
5096f1j08K31l3K10k32j07kJ04L0J25J13l94J93j76P0n8j7j51K68m7m1K99j71
5119D5J63k78L14l43k5M7n0j04K11m8p7O8K22p1j42P1N7J21p2Lo5J49q9j86J96
5144A17j75M3m8j90J20L4J26PL16l33k05L12l5j35O1M4j64J58pq1J11J96n9j66
$$ plain form
4980 35 129 99 -10 36 -64 -161 426 -87 -302 170 -109 -64 -166 -24 -64 -178 -38 75 18 20 -94 240 325 37
5004 37 270 -94 98 71 48 204 251 87 -121 96 39 -130 79 50 175 -163 105 17 75 0 77 25 -486 -72
5028 -72 113 -18 -214 -182 47 148 60 -136 -167 -11 12 -110 285 184 211 225 29 -26 253 -47 181 130 -206
5051 -206 -41 -230 55 -158 15 7 -171 -87 -127 111 -231 135 -176 162 62 82 -61 39 -31 31 142 -275
5073 -275 101 -29 18 -185 172 74 68 -107 -164 -10 -151 -52 196 -161 69 133 69 -51 134 -286 285 147 -61
5096 -61 -169 62 29 239 7 -100 -102 2 32 157 270 -124 69 -107 -37 -95 -112 -263 5 -42 -83 216 45
5119 45 208 -70 244 -99 -124 -77 -127 -231 -20 -68 -145 -77 145 74 -68 3 60 181 109 112 47 196 107 -79 117
5144 117 -58 -15 -63 -253 -133 -99 27 34 350 17 -188 124 89 -46 15 59 -105 53 46 -35 76 272 213 47
5168D7QK09j21J10n7m0j81O1J07m9M6j17j0J0p1j13L61l32K80m56J24L01N0k67
5192a00P5m1K43j19j6j61J39q1j86M00jk10o4J38L6l5M4m8l6K20r0j7O2k90J52
5217A4J60j89l6N2P2m02M32j13o0m0L76j1k56K30k72J52j08R5k05J74J68j40O3
5240A56k04J67k46j10L56m36L21m4m0j74K79L4K7j48L8o9p0K15j60Q3k43K46O9
5263D7M7J2r6L4N7M0k02j3K43k48P7j38m3J38o8o1J32J04K3k46j90L12k2k4K5
5288f0J62k95K25Q4j69J45j48J53q2K43l28J22J2Oj38N1m5R5k85j05N14j98M0
5311aL8N3J06k94J3J01k9q4j48J07J31j01K22k24k0J81r6j04kL07l32K23j7K10
5335B40k09O7j52kK07j77p1M9j07N3J46p2J18l43P2J26l0K95l99l1J13L3R5N2
$$ plain form
5168 47 55 264 143 253 196 156 -25 36 143 94 140 23 13 23 -48 -161 200 -132 148 -308 -184 117 167 -100
5192 -100 -25 -66 177 58 42 -119 20 -61 -247 153 152 -58 -122 16 52 17 61 13 -23 197 107 90 152 -138 14
5217 14 174 -15 -51 1 73 -329 103 -10 -70 -110 266 255 -1 229 -43 109 1 96 -109 65 233 93 156
5240 156 -48 119 -127 -237 119 -317 4 -40 -80 -254 25 59 86 -62 -24 -93 -163 52 -108 -25 -268 -22 47
5263 47 94 106 10 44 101 141 -61 -74 169 -79 -2 -140 -183 -45 -113 -174 -42 62 85 -161 -351 -39 -61 -85 -60
5288 -60 102 -193 32 116 -53 92 -56 97 15 258 -70 52 64 70 -68 -17 -62 33 -252 -357 157 -41 -1
5311 -1 37 90 196 -98 -85 16 -13 -97 -245 -138 -7 -108 114 -110 -130 51 -45 -149 -151 156 -176 47 30 240
5335 240 31 98 -54 -56 151 -26 -97 -48 -155 -102 44 -28 90 -253 -181 -55 -85 210 -189 -220 -107 -74 21 73
5359G3q9l4J4K13j21N2q7K71k07l4J13j83L9L6Q4j05m7k31K02K5r3j44J50J42
5383C9j55O2q7J28Q1l56L45l10J09L66l04J16P1m73L61k1L5Q4l5P3j08Qp4j80
5407b25K33j66R2J58k5j46q9J12j22K57k24j12M42q1J23j32Ql33NJ86k0J38l06
5430b27K02r1n2K07mj55K25j69K04k26J63o8j26J97L7j50r3J99j12RN7l74L17
5453c0k7m1J18P0k6q1oQ2p6j6k9J08j90K94l27Q7L27m09J21L10k23j08K11k83
5477a44L22j16Q9q7l6j13P7J24k92K41p3n6j40J47J98k80L92m35J3P4J16j35J51
5500C7p9j5p3p4J61k96M22l11J34J36q2Q4J48j55JmJ00q4J6p4L38k73m00L18M3
5525A8j48K33l20K37pLOn1J50j17l3j69K65M6K4l38J51M1j63o0K09j04J04J63
$$ plain form
5359 73 -16 -50 -36 177 56 108 21 292 85 51 164 -19 20 56 140 35 -12 -243 -41 -16 -109 -253 -103 39
5383 39 -116 -54 -141 -13 68 -288 57 -253 -144 222 -82 34 105 -368 -7 -28 7 91 56 129 21 29 -45 -225
5407 -225 8 -158 -66 92 67 -79 -168 -56 -178 79 -145 -257 185 104 227 95 103 -230 -225 -39 -59 79 -227
5430 -227 -25 -116 -168 39 35 -120 105 -64 140 -86 77 9 -117 80 117 -33 -126 73 -39 -30 27 -347 -30
5453 -30 -57 -98 20 90 64 -17 -23 59 -17 -33 -62 46 -144 150 -177 -90 237 -172 -51 259 36 -72 139 -144
5477 -144 178 62 151 64 28 -85 -8 116 -176 65 -8 -64 -204 -57 141 -139 253 -182 -169 -95 21 -114 37
5500 37 -42 -57 -130 -204 -43 -339 83 -228 -94 42 -40 44 192 37 38 34 134 50 66 -8 330 57 -343 -25 18
5525 18 -130 103 -217 20 13 16 22 -29 121 4 -29 -198 67 113 137 -201 -50 -9 -172 -232 -23 -127 -23 140
5549A40k21kJ58kJ49j62L70m70N5K34k46K59k66J86l62J98K03k88k04N19j46k24
5571a22J49J06k19O9j03J27j73K29%j96P8K82l81K06J27k40J56l84L85J09j40
5592F5r6J35k79R3J48N7k94K38J06m73K23K14l50K3K21N7k35J11P5n1r1p7J93
5615A3P0rj46Q7K30j51r5J66j40k0q0N9k3N7k11L37j52j62J26N3j80j69L01P9
5639D0J9j09L2J06j14j4j3L19k07j3k6J92j07o7R0n1j19r6N6k3J15J00k91J80
5663aJ65p3R4m51K08Q8nn8nK35j91M5j77O5k1j1r3L15k08J00O0m32L16K56k08
5688A3k11J75q6J23l9J6J84k34N3R3j02m3n7M1n2K17k09J92M2j10R7J17j04l19
5712b03R7J00j19K16k32j06N97l65QQ4Q7j39O7J05q2j77J62Q5l03P0j2n6R0M2
$$ plain form
5549 140 -81 -83 75 73 222 60 430 -40 15 249 3 262 -4 182 -180 18 221 -67 -271 248 102 -122
5571 -122 27 133 -86 -17 -120 7 -166 63 63 -133 -55 227 -154 52 179 -61 95 -289 96 205 65
5592 65 -31 104 -175 -82 66 123 -171 67 173 -300 -77 137 -213 -190 31 88 -147 -36 39 -12 -103 -180 13
5615 13 83 74 -72 15 245 94 -1 165 25 5 -75 -16 -39 18 -193 144 -8 -170 -44 9 -171 -340 -39 40
5639 40 59 -50 -18 88 -26 -40 -53 266 59 46 20 212 105 38 128 77 -42 -138 -82 -105 10 110 -181 -1
5663 -1 164 91 185 -266 -58 30 25 -33 -38 197 6 51 -126 -61 -82 -93 -186 129 -79 21 81 -351 -35 221 13
5688 13 -198 -23 -109 14 -25 -9 175 -59 -6 87 -15 -58 -115 -74 -126 91 -118 74 116 6 103 220 116 -203
5712 -203 -106 -6 -125 91 -141 -247 350 -15 -7 77 164 25 92 197 115 -62 100 185 -118 -48 -60 -116 -26 16
5736A6n5J57r1k31J69j59L77j5Pk66K74k00j6J3R9o0j74K58nr0l13J6L31Q0j29
5761gR3P2l06K71J21k62k36L9J81j11o9K08j3J89q6r1k84K16K20o5n4J7J01j07
5785C7N4k32J82j1N5J54k71p9j34NK13n5p7J36n6q2J80j7J30p3o7l2J49k97J21
5810f7K74q4k73L15n5k42J05J72j69JK39k23J58L7r1j70K03k3m98L61k58L21n1
5833a8l2j58K84k91K30k41RJ75j53J07J7J57p0L2j61R5N7m0J6m5J75j57J18p3
5857C3j62m1J48J90j48n2m3j1P2R0l14R6K53Nj53j48J68J61q3R8K9o9j63K00j74
5882a8j6L8k19L06j81K17j08j04N3k7K3R5l18K73J9r0m4j21P8M04j83l9k5Q9O6
5907A68j67Q9J35k60J19J55k20k22M21k52m9OJ53q2n0nl2R2K40k04k52K01k12
$$ plain form
5736 16 -39 118 27 -204 -35 -194 183 168 175 -91 183 -17 -33 -20 79 19 -155 103 98 8 -305 -289 42 122 -7
5761 -7 86 158 -148 123 244 -18 -254 -215 -34 -145 -214 -6 -19 170 84 -7 -291 -75 145 80 26 43 144 37
5785 37 91 -141 41 30 85 239 -32 -111 -245 -240 -27 -82 -159 -23 -79 -161 19 2 132 59 -8 -40 109 -188 -67
5810 -67 207 123 -150 165 110 -132 -27 145 -24 -23 216 -7 151 188 97 -73 130 107 -391 -30 -288 33 -18
5833 -18 -50 -208 76 -215 15 -226 -217 -42 -195 -88 -71 86 16 48 -113 -18 39 -1 15 -30 145 -12 106 33
5857 33 -129 -170 -22 168 20 -32 -75 -86 -14 76 -238 -142 111 116 -37 -185 -17 144 61 159 188 119 -44 156 -18
5882 -18 -34 4 -215 91 -90 127 19 -85 -32 -59 -36 59 -259 14 33 -57 -101 -222 -144 260 77 38 13 102 168
5907 168 1 90 225 -35 84 239 19 -203 218 -34 -83 -77 76 -6 -56 -61 -93 -1 239 35 -217 -16 -228
5930b28J31k4O2Q1k11L29j90M5K5k0o8R0J09j53n4K43j49j19J93j4l50K29K48
5953B05j51q9J10q4n1M9j83J53K50K3k3j39J64o9k35O9q7K24j39j98K48j75K59
5976A31J49k50J49qK6n42K58J90l3j01Q3j52M1Pj79J51L72k60J59l75J98j01L5
5999e2K5j15J66k39K12k87J64j0K50O8q0J2q1J63j49J03k01%Q9K22m5j71k12K11
6023D3p5K1j68K45Pj4j79O0K41k92J34Q6k59J8L01m64L41j25R0J66j60P6k30K20
6047H3k42J93j10j55Q0R0J65l84L34j05k02K92j29J0O4R1J5k07K42On6o7j06L0
6071f8K35l79L83j05k8j08K34p1r5j25L50l39K37J78n68L19k34L21k71j72K14
6092i2J77k68J85l00L95q3M6k00K76k14J34ro4J43k9r8J68l19N8k2J59k5j58K87
$$ plain form
5930 -228 -97 -121 -59 22 -189 140 -50 -5 20 0 -68 22 131 -22 -76 167 18 -101 92 78 -272 -43 205
5953 205 54 -35 75 -9 -60 -11 -194 -41 209 232 209 70 234 165 -70 -1 -88 136 -3 -201 47 -128 131
5976 131 280 30 179 171 197 -345 -87 103 70 -31 52 -100 -59 -52 -231 -80 292 32 191 -184 14 -87 -52
5999 -52 -27 -142 24 -215 -3 -290 -126 -136 114 182 102 114 33 196 47 150 -51 -51 38 260 215 44 -168 43
6023 43 -32 -11 -179 66 73 59 -120 -60 181 -111 23 109 -150 -132 169 -295 46 -79 11 177 17 93 -137 83
6047 83 -159 34 -76 -231 -151 -61 104 -280 54 -51 -253 39 -90 -80 -16 75 90 -117 125 131 75 8 -98 -68
6071 -68 167 -212 171 66 38 -70 164 93 -2 -127 223 -116 121 299 -269 50 -184 137 -134 -306 -92
6092 -92 85 -183 2 -298 97 14 60 -140 136 -78 56 47 -17 126 97 -1 167 -152 -94 -116 43 18 -140 147
6116A47j72J13l88M45j98oR1n6J46K0j13l75N12j85K29j86K5j6LJ27p6J00l44
6139a57J51K27p2j54l63M36k95K40J02k10R7j51K17M3j24N9o8j43J83J81l06K94
6161A87l09K93k93k23L98n1n6j66K40L14j93N0k7k62n3J06J09k99K51K28k69R5
6183G0k66J96o1p8K15k01J27j19M2l0k4J77j81L04j73m7J28Q9r5N6j96K14Qj71
6207a6j30K09k26J70mO6Lp6r5J99p6l4k84J04J62l2p5k0K71l10O0L2K72m9P8j49
6233E0k15K10qR7m6Q4l33K53j22R5j12J2k24J28K15k30Q7k58R0K96J8k79P3k9
6257a48K46j59J22o9O1j18K19j75J0j62L78O7k01R5l18Q1j06J44M7l19K37%n7
6280a25n2r5K71o4J12J35q8Pl90K56P7j07N9J35L8j86o1R7K27k80P1PO1k6m3P9
$$ plain form
6116 147 -25 88 -300 145 -53 -59 32 -24 122 142 29 -346 166 -19 210 24 49 33 36 163 87 187 -157
6139 -157 -6 221 149 -5 -368 68 -227 13 115 -95 2 -149 68 111 -13 46 -22 -165 18 199 -107 187
6161 187 -122 171 -122 -345 53 2 -54 -220 20 334 141 191 164 -98 -151 -45 64 -235 16 244 -25 70
6183 70 -196 0 -61 -139 76 -125 2 -117 -75 -105 -129 48 -133 171 -2 -49 79 168 73 129 -67 147 155 -16
6207 -16 -146 63 -163 7 3 69 72 -4 -99 100 24 -10 -294 -190 -28 -60 -135 -155 116 -194 -134 -102 170 121 199 50
6233 50 -165 45 37 134 88 172 -161 92 -30 65 -47 -35 -259 -131 84 -146 -59 -317 -227 69 87 -192 -119 -148
6257 -148 98 -61 61 -8 53 -65 154 -21 -11 -173 205 272 71 166 -152 -71 -177 -33 14 -305 -68 -68 -125
6280 -125 -177 -272 -1 -65 47 182 94 101 -289 -33 44 -63 -4 131 169 -17 -78 19 246 -34 37 44 105 79 36 115
6306A15Nk09J11k4k64M08k01k0J21k31K28J19l6j40j55J99j32M57k71j93J86K89
6328C62l62K13l9j53j9J69J10m62q1L48k26r4L35k14P6J48J10k15p3J75j38J8
6350a2L3K0J82j53l16K5K98J06r8k61K84Q3j01j27J53j89K41N5k52J0j27J52o0
6373e4K60l02M1P6o1J08j16K52l43J32j63J16lJ03J16r4J06j11j62j95K33O3j81
6396a79p3M85j55j01J30k5K3j08rj6j95K14l06M03n2k83J03J39j12MqP8N7J30
6420A44j96n6J1J99r1L2k67K08n7J73n0J33j43n8J55k25k2N2J57o5M5q0k09j64
6444c74M57l65K15J60j66N7o8J58j06J19p0qp5J5J51L6Ql1p6m0K42n7j93q8p5
6469a74K23j84K9J43O3o0j96j7J82J77r0l2K66k14j21L2J1j42O2j4M4K3K07j61
$$ plain form
6306 115 120 -89 22 -2 -266 142 -59 -79 42 -189 39 158 122 -18 -173 26 -106 351 80 -113 73 362
6328 362 0 213 174 21 2 171 281 -181 -262 86 -140 -234 101 -113 -37 111 221 6 -67 108 -30 -12
6350 -12 21 41 223 70 -246 -221 77 183 85 -176 108 191 90 -37 116 -73 168 223 -29 -19 -146 6 -54
6373 -54 206 -96 -55 21 -40 68 -48 204 -139 -7 -170 -54 -57 46 162 68 174 63 -99 -294 -61 2 -179
6396 -179 -252 233 78 -23 107 82 105 -3 -12 -28 -223 -9 -315 88 36 -247 -144 -5 -117 -113 -121 -43 14 144
6420 144 -52 -108 -97 102 11 43 -224 -16 -73 100 50 183 40 -18 137 -88 -110 -58 99 34 79 -1 -210 -374
6444 -374 83 -282 -67 93 -73 -16 -84 74 -32 87 17 9 -66 -51 100 136 144 113 37 -3 239 182 -11 -99 -174
6469 -174 49 -135 -106 37 100 40 -156 -173 9 186 96 64 330 116 -5 27 38 -104 -42 -56 -12 11 218 57
6493E7j00J70l07PM4J25q1J12l0j61n7K67j11M4j15j32J01K25M6k77M05m59L64
6516A37j30Pj70M7J40l23K68o6K51j11n5j5j56N8K25k99J76j42Q5K78k46r7K3
6539a15K33j97j04J46J03j4J63k82n8O5R1k16L38k01K19l46J29j42L10m9k0j73
6561a20N3K28j88L78n59K36r3pp9J50j42j8L4n1J49K32j88oj91L03j68k46L15
6584B2k4R4j81J06J62j46m1j13J51k6L8J05j98J5ol1L7L0N3j81o0J34J36j80n7
6609a61k5PMJ26L5j54j03K06n9J35j83L35L3k22l8j61L42k63J16P6r9K7o1K30
6633A43l27L59m4L1j49j38J93J13m80L21j94L02n02L30J3k12L34j4Q6j56J63k60
6655h8J98K7n2k5j08K46j21j98K1K59qq2l27K38Q9k9q3O2o8K3j30l5J78Q5m2j87
$$ plain form
6493 57 -43 127 -180 -173 -129 -4 -85 27 -3 -164 -221 46 -65 -21 -136 -268 -167 58 104 -173 232 -227 137
6516 137 7 14 -156 -109 31 -292 -24 -90 161 50 -5 -20 -176 -118 107 -192 -16 -158 -73 205 -41 -138 -115
6539 -115 118 -79 -183 -37 66 52 215 -67 -125 -60 31 -185 153 -48 171 -175 -46 -188 122 73 53 -120
6561 -120 -67 161 -27 351 -208 28 -65 -72 -151 -1 -143 -161 -127 -178 -29 203 15 9 -182 121 -47 -293 22
6584 22 -2 92 -89 17 179 33 -8 -121 30 4 42 147 -51 -36 -42 -73 -36 -6 47 -134 -194 -60 76 -104 -161
6609 -161 -186 -179 -175 -49 -14 -168 -271 -65 -124 11 -172 163 196 -26 -64 -225 117 -146 -30 46 -53 -26 -87 143
6633 143 -184 175 131 162 13 -125 68 181 -299 22 -172 130 -372 -42 -29 -241 93 79 165 9 172 -88
6655 -88 110 137 85 60 -48 198 77 -121 -100 159 151 69 -258 -20 69 40 -43 19 -49 -26 -156 -191 -13 72 30 -157
6681a57K80k09j19K09K23k18RR5j14p4O7N3j19J58k64K11j10J03ln8k1Q7j93R2
6705g2j0l0m6L5q8L32Mj02J91k09O2q8P8K6Qj03j90R6K39N9k29N4nJ31P1l03M8
6732d1j35K14j24j62J95R6o3R8L3k08L5Q9j71M02k14J33l07j25J49J34j13J3K
6755g0L29j39k48L43k72p9R6J64q1j51L10k20k2J05l36J20J79R9n4m9pk0nR0n5
6780B7J95j5j74N9k59K01K0J39k05J90j18q0r1J92M0j75n2J6p5L6J2M41m38K44
6804A30k92M23k87k9k6K67m31J80J95l66K68J5j98K42P8q3j20N4j83K57O2j37
6826A9j49L8j34K47j92N2J41k99L17k99L96j48L33k61r8R1r1k32L89jj37J46O2
6849A90k54j46K35o3J11p1k26K15j53K39n6J64j33j61J77k28L55k56J20j65Q9
$$ plain form
6681 -157 123 -86 -205 4 227 9 18 113 -1 -75 -8 45 -74 84 -180 31 -79 24 21 -37 -58 29 -164 -72
6705 -72 -82 -112 -158 -123 -211 121 125 23 214 5 67 -21 57 83 91 -12 -202 -106 133 192 -37 17 12 143 214 -89 -41
6732 -41 -176 38 -86 -248 -53 43 -20 78 111 -97 -62 27 -144 258 44 177 -130 -255 -106 28 -85 -72 -70
6755 -70 259 120 -128 215 -57 -136 -40 124 43 -108 202 -18 -40 65 -271 -151 28 127 73 24 17 -3 -8 82 27
6780 27 222 207 33 92 -167 34 54 193 -12 178 60 -20 -111 81 121 -54 -106 -90 -165 -129 -117 324 -114 130
6804 130 -162 261 -26 -55 -81 186 -245 -65 130 -236 32 47 -151 91 169 86 -34 20 -163 94 156 19
6826 19 -130 -92 -226 21 -171 -119 22 -277 40 -259 137 -11 322 61 -37 54 -37 -269 120 119 -18 128 190
6849 190 -64 -210 25 -38 73 2 -224 -9 -162 77 21 185 52 -109 68 -160 195 -61 59 -106 -17
6870a7j80J88k57L32J52l58R2J95j62K79n2l08K92j98j1J41j28j18L5J5J28Nj14
6893d9L3J00j50p6O5J34k73L65l8j76K61k25N8n6l4o0J70O0kJ63k44k9pP0L11
6918C71m73j11P1J77j78M12n6j33k16K75j77L6Q6j20K4k0j16K13j93J21M6J33
6940A72j30m5K00R0j71k28K58j05j72K75k67J82k0p9j44J8K74j23j42k3J44J0
6962b6ko8J97l85Q2Nk15L74Q1Nm13M67J02k31J44o5j59L36l08NQ1j73J83p5J22
6987F4j23m7l93M65k6Nk3m2K77o9k55J33P5m9k8J03j34L5j68M04mn36N67k74L0
7012a3p3j7k2K70n9r2N2Q8o3j67K70l31n7J60J08k93K66k63K41q0K22j89q9R0
7036d1K64j54K21j3l51K25k64J01N0oJl96L61m7J9l9J02m8Rj19j45J35J95P7k97
$$ plain form
6870 -17 -197 -9 -266 66 218 -140 -48 147 -15 264 212 -96 196 -2 -13 128 0 -118 -83 -68 60 65 -49
6893 -49 -16 84 -66 -142 -77 57 -216 149 111 -65 196 -29 29 -27 -61 -121 49 109 107 270 26 -3 -10 60 371
6918 371 -102 -213 -142 35 -143 269 213 80 -136 139 -38 -2 84 -36 -12 -32 -148 65 -128 -7 39 172
6940 172 42 -3 197 287 116 -112 146 41 -131 144 -123 59 39 -40 -184 -166 108 -15 -157 -180 -36 -26
6962 -26 -28 -96 101 -284 -202 -197 -412 -38 43 48 -365 102 204 -27 117 52 -107 229 -79 -74 7 -166 17 -58 64
6987 64 -59 -106 -499 -34 -60 -55 -78 -120 157 88 -167 -34 41 -8 -36 67 -67 -32 -200 204 200 -336 231 -43 -13
7012 -13 -86 -103 -125 145 86 -6 46 134 71 -96 174 -157 -214 -54 54 -239 27 -236 5 -75 147 -42 -131 -41
7036 -41 223 69 290 277 -74 151 -113 -12 38 32 33 -363 -2 -49 -30 -69 33 -15 -6 -125 -270 -135 60 137 -160
7061a60K22l1j07j13K40k7Q7j52J79j74k7P7k26J76n0M81l32j51k0J92k85J81
7083b0J84r9l66L09L6j51p9J20l10K25O8L19k38J8J13k26J62j60QJ96k57K51J45
7106B48q6j82LQ4m6j16k01L77k0O0k83R6J46o0k5k04J15j7l9K37m2k91J14n9K29
7131C8j19R4N9m9j35J64k6R3j20n1J41R6j34M8m3j00J6J06l06L42l5N7j29j91
7155a84J09J0K24j6j60J9J23j04j98L40l65J59J76qq6L8m5n7J7q4K10j43P8j57
7179a04K1J54j69M6kK12m6m7k36J25m2P4K39j64J31m50K84J40j28P0j05J9k29
7202b07K0K00J0J41j39n6R8j39p8J05O1q7J73r8O3j5j8j79J50Q5k68K28k18K88
7226A20m6OK12k81J51j86K36j34k05J03Q5mj95J32k22K95J74k51K81m15J27l26
$$ plain form
7061 -160 62 31 -76 -189 51 24 111 -41 138 -36 -63 14 -212 -36 -86 395 63 -88 -108 84 -201 -20
7083 -20 164 65 -301 8 44 -107 -186 -66 -376 -151 -83 236 -2 16 129 -97 65 -95 -87 109 -148 103 248
7106 248 162 -20 -17 67 21 -95 -296 81 61 121 -162 -66 80 20 -5 -209 -94 -111 -150 87 45 -246 -132 -191 38
7131 38 -81 13 72 23 -112 52 26 119 -1 -52 89 185 51 99 56 -44 -28 78 -228 114 79 136 7 -184
7155 -184 -75 -65 159 143 -17 2 125 21 -177 163 -202 -43 133 125 39 77 32 -25 -8 -92 118 -25 53 -104
7179 -104 -83 71 -98 -52 -54 158 112 65 -171 -46 -88 -14 225 61 192 -258 26 166 38 108 3 22 -207
7202 -207 -187 13 23 164 25 -31 67 -72 -150 -45 16 -71 102 4 67 52 34 -145 5 90 -178 50 -168 120
7226 120 74 80 292 11 162 -24 212 78 -127 -24 61 57 -138 -6 -228 67 241 -10 271 -144 -17 -343
7248c43L55r0l8L0J24q5K6pj61J74j49j64K61p7K97l05K39J02r7p5k44J27K60
7271A60k4o3J18k75j56J31J67k49K6P8r0O6M7n0RJ64n5l4J61N4Nk75K25q1k0k86
7297b47K98j17j33J90P1M3q7l0J43r1j27K94k15m0q8J40Q7j71K41l29J9K30l1
7320E0K2j71J15L19k13r1q2P1J70p6j8l04J72L7j02J57K22l00nL6j05J52L5J8
7344A09k90J39m4J66kj48m1N7j25J57Q3j60j24K14N5q7O4k6K04P5k58O5q2L0m9
7369a8Q7j57K42l9n8j05j31L79k65M4Q3Q8k37j25M23q5j03o0q2j23M10k96Q1K53
7393B06k42M4m6j53P4K87k89J72J28k18K15Jj8o2k8j09j18O6k26M85k92P1Kj6
7417f6J06J4L5Q6k82N8J99q4j52M9ljJ7o1j71L54M3R2j66j8K5j00Q4l08K79j23
$$ plain form
7248 -343 12 -78 -116 -86 38 -47 -21 -28 -189 -15 -164 -328 -67 -144 153 -152 87 189 92 17 -227 -100 160
7271 160 136 73 191 -84 -240 -109 58 -191 -165 -87 -177 -111 -64 -114 -105 59 4 -30 131 185 190 -85 140 59 39 -247
7297 -247 51 -66 -199 -9 62 105 18 -12 131 40 -87 207 -8 -48 -136 4 91 -80 161 -168 -149 81 50
7320 50 72 -99 16 335 122 31 -51 20 190 114 96 -208 -36 1 -101 56 278 -22 -27 9 -96 56 91 109
7344 109 -181 -42 -86 80 78 -70 -111 -54 -179 -22 61 -99 -223 -9 46 -41 23 -3 201 276 18 83 1 31 -18
7369 -18 69 -88 154 115 57 -48 -179 200 -65 -21 62 150 -87 -212 211 126 23 -37 -119 -242 168 -128 -47 206
7393 206 -36 8 -38 -191 -117 170 -119 53 181 -37 178 179 161 99 71 -38 -156 -90 -316 169 -123 -52 -50 -66
7417 -66 40 54 89 175 -107 -49 150 66 -86 -37 -40 -41 -24 -85 -256 98 141 233 67 49 74 -26 58 -250 29 -94
7443i4o3J88j25M78l15o9j60J8K22k15rP5L1K46k75j22J41j7J73n3L9MJ39n9j28
7468E0P4j58j80J02L52l62k4J48k26J74L6lQ6j95J6K46O7j91qm8R1rJ91l17J23
7493C5j15K51j46k09J72K6j26J6%K20P5l23M8J76n5J07n1J03j79p7j14MJ44J80
7517A62q3q1j13n3PQ4K8l9J22op2P2L85n47J69j76J30j43j79L64k1K9K9m3j35
7542a10R8J60j78J01l38L09k23K11N5j44N9J19j31N5k19K15J42k76j68K49l9k43
7564b96M1j6L67J69m08J50M6k45n7J03J49j06m1K00M2Rj7J01j13K2j11L6j56M2
7588h9J1J29l2Q0j97k1J70J67j13o3j22J6K49l37J10J20P1j03p3O2l9k1Q7k59
7612a97K5k8J58J09Oj33J98L5k50J54L28m29J95L7n9r3Lk35r6K21j13L3j1K40
$$ plain form
7443 -94 -157 31 -94 384 69 0 -160 -142 80 -135 -144 -69 -38 208 -67 -189 -48 -65 108 55 94 98 237 178 50
7468 50 124 -34 -214 -112 240 -122 -146 2 -224 -50 -14 -17 69 -126 -110 136 203 12 4 -44 47 38 229 -88 35
7493 35 -80 171 25 -184 -12 14 -112 -96 -96 124 199 -124 -76 100 45 152 101 204 25 -52 -166 -162 -18 162
7517 162 79 -2 -115 -168 -161 -77 -49 -88 34 28 -44 28 413 -134 35 -141 -11 -154 -333 31 10 39 68 25 -110
7542 -110 -12 148 -30 71 -267 42 -181 30 85 -59 0 119 -12 43 -176 39 181 -95 -263 -14 -53 -296
7564 -296 -255 -271 96 265 -143 7 53 -192 -249 -146 3 -103 -144 56 98 107 90 191 78 100 -11 25 -131 -89
7588 -89 -78 51 19 99 -98 -119 51 218 105 42 -80 -64 185 -152 -42 78 149 46 -27 35 -4 -25 62 -197
7612 -197 -172 -200 -42 67 73 -60 138 173 -77 77 405 -24 171 208 149 56 59 -176 -272 -51 -164 -131 -142 98
7636I8j37L7K3m6q5r1j5K12j78M06j28j64M9Q5o3l3P6O9n7j1Lm3k7J50j08j01
7662g9L13l34P0J81Q0k59N7J42p8m7k81K41J72J25k09k02L34m94K95K66j51l17
7684a75K64J30Q0m8m33J96O8p4j62K52P9l58l5L09Mj52J80j33j09k29J50J30j51
7707b17K8J91J50j44L4j79J72J0J1j46K02N1Lk4j97J13L46k10j14J48k07J39j03
7730E7j47o4k45N43j99J59p0o4o9J14j03k03K52J09l4j06Q4J22j81k5L22j7q0
7753A55k84O1J47m6k91J1Q0p5L07J08l00J97m3r2L0n9L5L7k84M18j35j7J5j57
7777a82J27%P7N2q5O3k88l2L09l04L82j95O1j57Q2Q6J31j8J90j63j43j4q0J61
7801F0j21p8J86R1k64N8J19j64J65J14k4J34k35r7K17k08L6J9n2o2n0J68r5o9
$$ plain form
7636 98 -39 -2 21 -25 -110 -201 -216 -4 -182 224 96 -68 -19 66 3 -30 46 115 58 47 50 7 -20 130 22 -79
7662 -79 234 -100 -30 151 231 -28 29 171 93 46 -235 6 178 303 94 -108 226 -268 27 293 142 -175
7684 -175 89 219 299 251 -182 14 82 8 -154 98 177 -181 -216 93 97 -55 125 -8 -117 -346 -196 -66 -217
7707 -217 -189 2 152 8 42 -137 35 45 56 -90 112 163 166 142 -55 58 404 194 80 228 21 160 57
7730 57 -90 -154 -399 144 -55 104 34 -30 -99 15 -88 -291 -39 70 36 -70 14 136 -45 -70 252 235 155
7753 155 -129 -68 79 33 -258 -247 -167 -242 65 173 -127 70 27 -65 -35 -94 -59 -22 -306 112 -23 -40 -25 -182
7777 -182 -55 -55 22 74 -11 52 -236 -268 41 -263 119 -76 -15 -172 -90 -4 127 109 299 136 -7 -21 -101 60
7801 60 -61 -139 47 138 -126 -68 51 -113 52 166 142 276 41 -56 161 -47 -11 8 -44 -106 -156 12 -83 -152
7825a52J96j49K54j79Q0p7K3k35K83K6l54K44l1M6l5J58J47j62r0O0j7j58K18
7848I6R2j85j1l15M35L6k04L39j76Q7j83p3J36l56L10k65J75J0LK67j65L7j72
7871h2J98L8j44J35m1j12K9k39K17o1R1j01J4n2K80l66J42MJ10k40K36nj56J84
7895G9j14M4q0P1KJ36j97Q7N6K7j6j35p3k3J91j11k91M08k26j41J48J87j28J66
7919F7j26p5Q1J63j05O3l8K2M3q8N9k79Q8q1j16L31j76N5J74l7J23M5k47P3K6
7944D5J85j69n7j28M27m38J56J16j26N0k50L8J32j38j18L83j75P8j36K63M7m00
7966b15L62k6l45K33Q5m2L4j64J08J77r1n0R9m03L08J6J83j47k14J76k38N6n1
7989a49J49j2J32k4q4J1j05k8J13K87m11L0J53o7j79K75k59J8K12j20PK69k11
$$ plain form
7825 -152 44 -105 149 -30 50 -27 -4 -239 44 70 -284 -40 -71 -25 -60 98 245 83 -7 53 36 -122 96
7848 96 188 3 -8 -323 112 148 -56 283 107 194 11 -62 74 -282 28 -237 -62 -52 -49 218 53 90 -82
7871 -82 116 154 10 145 104 -8 21 -218 -1 -62 29 -72 -58 -110 170 -196 -54 -50 60 -180 56 51 -105 79
7895 79 -35 9 -71 0 2 138 -59 28 84 111 95 -40 -113 -136 55 -56 -347 61 -165 -306 -158 29 -99 67
7919 67 -59 -134 -53 110 5 68 30 52 95 7 66 -213 -125 -206 -322 9 -167 -112 62 25 148 193 -54 19 45
7944 45 230 61 4 -124 303 -135 21 137 11 61 -189 -151 -19 -157 -275 108 -67 11 -125 138 185 -215
7966 -215 147 121 -224 9 94 52 86 -78 30 207 116 66 165 -238 70 86 269 122 -92 84 -154 -98 -149
7989 -149 0 -12 120 96 12 23 -82 -110 3 290 -121 -91 62 -5 -184 91 -168 -150 62 -58 -51 218 7
8012GJ52k61k43K44lL2%l5P7j1o2K19K3l14J02j33K17OM6L5k70K83o2n7j84K99
8038A07q7J52m03J71r8J5Q4k69L7J46L39k2p9p9p3r2L22l11J80j47K05q1K4k38
8062a97k0J73J54k53K61j71j52J61K1r9KJ34J2J8j30k9%J37kn2K29l34J5l2K04
8087E0k31J23J1L8k44K72n3K46k93J24j99n6M05k85J71R4m08Q6L7N81n25j32N87
8110C99l25J43k12K1k70K53J43j12o2Q7j36J22j98J49J65j91J46k59p6M56j15
8131A28q3KK04l02K79j00j93P2j54J94J27j25j0q6J57J94l60J16l20K23q1N7j04
8154a65K73o9kJ36j82j76J03n1J16J35k98K98m6j58J3J65j10O6j71K96o2P4m31
8177b46K24l7q6J21J67j37N8J29l8j45j75J50J85j35
$$ plain form
8012 7 159 -102 -345 -101 -104 -72 -72 -107 -30 -41 -103 116 139 -175 -73 -206 11 17 63 98 -172 111 49 -8 -192 107
8038 107 20 172 -231 -60 -158 -143 -59 -328 -291 -145 194 172 93 14 -59 -151 171 -140 40 -107 98 17 41 -197
8062 -197 -217 -44 110 -143 118 -53 -205 -44 -23 -122 -120 14 26 44 -86 -115 -115 22 20 -32 197 -137 -122 -154 50
8087 50 -181 -58 -47 -9 -253 19 -34 212 -81 43 -156 -212 193 -92 79 173 -235 -149 -112 469 -56 -188 399
8110 399 74 217 5 26 -244 9 152 40 -22 65 -71 51 -147 2 167 -24 122 -137 -213 243 128
8131 128 45 47 251 -51 228 128 -65 7 -147 47 174 49 39 -47 110 304 -56 60 -260 -37 -118 -61 -165
8154 -165 108 39 37 173 -9 -185 -82 -133 -17 118 -180 118 72 -86 -73 92 -18 48 -123 173 111 185 -246
8177 -246 -22 -59 -145 -24 143 6 64 193 155 10 -165 -15 170 35
8191C5
$$ Imaginary data points
##PAGE= N=2
##DATA TABLE= (X++(I..I)), XYDATA
0@%%%%%%Ll%%Qj6J6k4L2l4M2n6O6p4R4j18J36j58J84k15K52k91L33l79M34m96
32b64N60o31P11q01R02j008J121j250J391j542J708j891K089k305K544k802L086
49A618l399L744m125M547n020N551o155O844p639Q570r676J1019j2681J4801j7606
64i607K1501k7267L6619n4166R7349l76737m20917J295978k42822r13669O98020
75A04282L27628q48341L84468N88912q86242j56127J051691l47091q14279O92366
85I7267L91154p75447O3585N60695l93399k36075N23656j05113m38519L83272
95G1076K46133n57695k3130N75332j77182m86898L22076L36718l58958j21969
105a74497L09290j38402j72381L67280n0627m89128L24691M71095n30923l03565
$$ plain form
0 0 0 0 0 0 0 0 3 0 0 0 8 -8 8 -16 16 -18 24 -32 34 -40 54 -64 72 -86 98 -117 135 -156 177 -202 232 -264
32 -264 296 -335 376 -425 477 -531 590 -660 731 -811 897 -994 1095 -1210 1334 -1468 1618
49 1618 -1781 1963 -2162 2385 -2635 2916 -3239 3605 -4034 4536 -5140 5879 -6802 7999 -9607
64 -9607 11894 -15373 21246 -32920 64429 -312308 -733225 562753 319931 -593738 104282
75 104282 431910 -416431 -31963 556949 -329293 -485420 566271 219180 -595099 97267
85 97267 488421 -287026 -223441 337254 -56145 -292220 231436 126323 -312196 71076
95 71076 317209 -240486 -263616 311716 134534 -352364 -30288 306430 -52528 -174497
105 -174497 134793 -3609 -175990 191290 140663 -348465 -23774 447321 -83602 -387167
115c87167N85994K5370m73453K43481K00608l91694J64326L59117m83324j63469
125c20211O11086j21933n25837L56834K87323m29995R230L30679k45762j14289
135a62875L27565j32340k42567L16606P9262l56054P1598K75869j42997j56478
145a22411J17417N9326l1227K105n0595k9653Q0964L9605p0099q0299L7968J57963
157A11064k8152k28473O5878K29574j34191j46241J67971K975j20645J50806J944
168G2510k39148J56893K17964k95160q9242L46085q1207k64591K14187R0337k42188
179a13560R4152J51260k21695Q039K53007j66258j89716K60131O5555k62485M5236
190g6334J75532j00304n0489R2407n3927n0204J15612O557j44164K2978J55098
$$ plain form
115 -387167 198827 224197 -249256 -5775 194833 -196861 -32535 326582 -156742 -320211
125 -320211 290875 168942 -356895 -61 287262 -142733 -133503 197176 -48586 -162875
135 -162875 164690 32350 -210217 106389 185651 -170403 -98805 177064 34067 -122411
145 -122411 -4994 54332 23105 25210 -25385 -55038 25926 65531 -4568 -84867 -46899 111064
157 111064 82912 -145561 -79683 149891 15700 -130541 37430 40405 -80240 70566 72510
168 72510 -166638 -9745 208219 -86941 -176183 169902 88695 -175896 38291 128628 -113560
179 -113560 -19408 131852 -89843 -81804 171203 4945 -184771 75360 140915 -121570 -76334
190 -76334 99198 -1106 -51595 40812 -13115 -63319 52293 58850 -85314 -62336 92762
201I2762l4398j46656M7573J27770o6812q9754R2372J9225j01438Q3280O5151
212H9075j78328K9237K11609j54872j62052K48378L6610k63566J13563J79151
222A48805k27324j8080K43145j67202j43705K92934l1695k97445K05478J86599
232A91510k95959j3220K69728j45264j39001K32585l6022k13341J88520J06531
242A46067k57572K9872K25116j32065j26177J64776J2948j37325P0371P1944j14809
253d6854l644J19029n1397r7188Q1659O8235r6208m0734J07609N433j10620M9736
265a4944R0102j06848k7219J40179o2220j22203J50308N1263j97974N6727J78300
276A35471j61741q5974K13284n4125j78213J76430O1002k27301Q4168J81742j97999
$$ plain form
201 92762 58364 -88292 -40719 87051 20239 -69515 22857 42082 -59356 23924 89075
212 89075 -89253 -60016 151593 -3279 -165331 83047 119657 -143909 -30346 148805
222 148805 -78519 -96599 146546 -20656 -164361 128573 96878 -200567 4911 191510
232 191510 -104449 -117669 152059 6795 -132206 100379 64357 -148984 39536 146067
242 146067 -111505 -81633 143483 11418 -114759 50017 62965 -74360 -3989 67955 -46854
253 -46854 -50498 68531 17134 -80054 1605 69840 -26368 -67102 40507 45940 -64680 -14944
265 -14944 75158 -31690 -58909 81270 19050 -103153 47155 98418 -99556 -42829 135471
276 135471 -26270 -112244 101040 46915 -131298 45132 106134 -121167 -36999 144743 -53256
287e3256o6417K32367p1870j77968J76166N8175k02689P6230J46040j64389l7404
298h5015J78385o4529j25256J24983M5593j30819K8867R6503p4647m3615Q6200
309C6650m977p3134L2307N3380m6863m1647N9487K5864p8535M992Q4847n2730
321c59o4375R7291J2213j17061N9363R7555j25681l0387J57010o2256j25037J44280
333D2556L6168j68603P5280J22454j56548k4009J75711q5336j25683J60249K6144
344G8383j72513P8718J13426j46055j5375J46019p8508q9855J26627J0651j23339
355g1821N5846Q2846r0836k5493Q9758k2004o0991M8146K7932n0889k398M7580
367B7676j1716m6847K8648M6099n3164l1189P5494k848q1772M6099O0246q7223
$$ plain form
287 -53256 -119673 112694 40824 -137144 39022 97197 -105492 -29262 116778 -47611 -85015
298 -85015 93370 28841 -96415 28568 74161 -56658 -27791 68712 -5935 -49550 36650
309 36650 31673 -41461 -9154 44226 -2637 -44284 15203 41067 -37468 -32476 52371 -359
321 -359 -64734 32557 44770 -72291 -12928 84627 -41054 -71441 85569 23313 -101724 42556
333 42556 78724 -89879 -14599 107855 -48693 -72702 103009 17673 -108010 52239 78383
344 78383 -94130 -15412 98014 -48041 -63416 82603 4095 -85760 40867 51518 -71821
355 -71821 -15975 66871 -23965 -49458 40300 18296 -42695 5451 33383 -17506 -19904 27676
367 27676 15960 -30887 -2239 43860 -9304 -40493 35001 32153 -49619 -3520 56726 -30497
379c0497j1754J02319n7033p7758J16059R405j34665P4610R5967j34185j6435
390f3967J43072o9785r4360J28925J0262j34381P9958Q6253j36324j179J36550
401H5024p7570q4643J17467J1120j08892N1079O3711q3477p769Q0732m1656n4654
413d9528O6923J7856o9088Q938N6707k2966m4940L2503L4158m3917j4572N4316
425B6390j5365m9959N2717K7412q1974J6580R1433o8496o7415J11330J0183j18147
437f5311O0172P4957j10788L842J12497q6755o7435J38673j0609j42169Q8178
448d748R1426j34093q172J25603p2116o6214J15106j4803j06087Q3891O0451j16651
460d6407R26J11663n1760p3862P7759K3144p0889K0702M2761m6579r174N4609
$$ plain form
379 -30497 -42251 60068 3035 -74723 41336 50741 -83924 -9314 86653 -47532 -63967
390 -63967 79105 9320 -85040 43885 54147 -80234 -276 85977 -50347 -51526 85024
401 85024 7454 -77189 40278 51398 -57494 -6415 57296 -26181 -33950 46782 5126 -49528
413 -49528 17395 35251 -33837 -24899 31808 8842 -36098 -3595 30563 -13354 -27926 26390
425 26390 11025 -38934 13783 41195 -40779 -24199 67234 -1262 -68677 42653 52836 -65311
437 -65311 -5139 69818 -40970 -37128 75369 -11386 -78821 59852 49243 -92926 -4748
448 -4748 86678 -47415 -55587 70016 -2100 -68314 46792 31989 -74098 9793 70244 -46407
460 -46407 -45481 66182 14422 -59440 18319 41463 -29426 -8724 34037 -12542 -21716 32893
472C2893j8571n7190M0265N3397o1520m1727P4590J6775p5295J5348N6711m8801
484a3125j7802P1598l7616o8244R5790L1597j28483K9977J19305q6605o5552J13765
496D4605r384r5890P9067L8212j16077M0392J05535j11068n1638J41419k1759
507D3414j21480P6423O3207r5426N556P2986o2499k4395R1149l1963q7561P5231
519D642O0363q9525k5528P8181k64n1313J8337K1860k9543J0615L6424m2033l4965
532d2749P0549K1353q8352J461R0509l2735p2452O1399K8619p4092K8930N2779
544D5219q0512j830J01566o1496q5135J12405L7261j29483K3960J05601p3294
555e738m1735Q8341l5576n8494R7041J319j18951N8683J00878r5336n6299R7850
$$ plain form
472 32893 14322 -42868 -2603 50794 -10726 -52453 22137 38912 -36383 -21035 35676 -13125
484 -13125 -30927 40671 3055 -65189 30601 62198 -66285 -36308 82997 -3608 -69160 44605
496 44605 35221 -60669 18398 56610 -59467 -19075 86460 -24608 -76246 65173 43414
507 43414 -78066 -1643 61564 -33862 -28306 44680 -17819 -42214 48935 16972 -70589 4642
519 4642 65005 -24520 -50048 28133 27869 -23444 -5107 16753 -12790 -2175 34249 -7784 -42749
532 -42749 27800 49153 -39199 -37738 52771 20036 -52416 8983 37602 -36490 -7560 45219
544 45219 -35293 -37123 64443 2947 -82188 30217 67478 -62005 -38045 67556 -5738
555 -5738 -47473 40868 5292 -53202 43839 45158 -73793 -15110 85768 -9568 -65867 31983
567C1983L724o7827L7092J5577n4829L6666M4922p1783k4268Q2866K251p7122
579d0748J3921O0877k5057l8557L1923J1923l0101J6018K1695m1178k100O1984
591D0600k5654o9637O0799N6539q6412k2728Q8082j9366n8308M9776N080n8738
603c9967N4081L8439j01452K518J16605n0431r3264P9253M0060p5216J7890M0523
615B9039n8444J0778P1290n7479n6169Q7673K3600q8921J2635O5290l3452k8571
627b2731L5757m670k3911K7326P094m1719R953M7846k7263m8215L9963M0975m8970
640h565k8476M9329Q636m0488J6219J6706l8680K2117M6372o3956l0736R1929
652D0407M63r2210L4090O5556n6275j6850N6823l6446k9698P5473j6937q2728
$$ plain form
567 31983 35707 -32120 4972 20549 -34280 2386 47308 -24475 -48743 34123 36374 -40748
579 -40748 -26827 34050 8993 -29564 2359 14282 -15819 199 21894 -19284 -21384 40600
591 40600 14946 -54691 6108 62647 -23765 -46493 41589 22223 -36085 13691 18771 -39967
603 -39967 14114 52553 -48899 -46381 70224 19793 -73471 5782 45842 -29374 -11484 29039
615 29039 -29405 -18627 52663 -4816 -60985 26688 50288 -38633 -25998 39292 5840 -22731
627 -22731 13026 8356 -15555 11771 18865 -22854 -12901 34945 7682 -40533 -570 40405 -8565
640 -8565 -37041 12288 20924 -19564 -3345 13361 -25319 -3202 43170 -20786 -51522 40407
652 40407 40870 -51340 -17250 48306 -7969 -24819 32004 -4442 -34140 41333 24396 -58332
664e8332O1533N7799q6262j6554Q0782k5133n1288M9302P599n1394L4837K9491
676C2380o1970L421O6308l2337n2017M7499L1492m7332j0166L7512p160j9191
688a1561K1861k075k9518K4838L0380m3220k5807N6473J3302o2235P301N2068
700C1807l1343k4851M4025j4839l8844N1139J3897p2397K0795P0941n5999m3702
712d9371P5721N96o7286M2091L2562o2657J5315N6685n5485k7223P6947j1460
724B6435p2260M5340M5223o1630o532N2329k7768k5468M4797p821m5479L3315
736D81L3324m9030j5695N1618l651m3099J9928K5080k7863m275K9824j5240k5077
749b3675L4661J4148m8165O913N0806l0871l6569M8585R722n1176K0975L6468
$$ plain form
664 -58332 3201 61000 -25262 -41816 38966 13833 -37455 11847 19446 -31948 2889 32380
676 32380 -29590 -26169 40139 7802 -44215 3284 34776 -12556 -22722 14790 7630 -11561
688 -11561 10300 8225 -21293 3545 33925 -9295 -35102 21371 34673 -27562 -20261 31807
700 31807 464 -24387 19638 4799 -34045 17094 30991 -41406 -20611 50330 -5669 -49371
712 -49371 26350 26946 -40340 1751 34313 -28344 -13029 43656 -11829 -39052 37895 26435
724 26435 -45825 -485 44738 -16892 -23424 28905 1137 -24331 20466 12645 -32834 481
736 481 33805 -15225 -30920 20698 17047 -26052 -6124 18956 -8907 -13182 16642 1402 -23675
749 -23675 10986 25134 -23031 -16118 34688 3817 -32752 15833 25555 -25621 -4646 31822
761C1822m6132p584N5846k9904m4875N9778J2786o9797K4880N2951n2759j8499
773c1487N8351j8955m3288M8620J2532n8844K3206M7931m8754j9355N5303j0409
785A4851m1629L1201J8891l7676M956L2548k3590j9701L3967K389l5100J2302
797f591K7168k2529j7044K6961M800k9648R491K5764k5365j2784L6308p015l5706
810b6190K7822K3739m2006j502M5434k3531l2457M4534O089m9301K5568L4777
822C2976m7794n869N1337k4601l7352M5380J0014n1268J9512L7833m2462j1593
834b3887M7456j7245l5017L6216J1733l9859J0149L2143k5399j7013L3743r21
846A2099l0690J7238K0798k5814o954K7789n162k4975J6928J7978k7264m883L1555
$$ plain form
761 31822 -14310 -21894 33952 4048 -40827 18951 31737 -38060 -13180 39771 -12988 -31487
773 -31487 26864 7909 -35379 13241 25773 -33071 -9865 38066 -10688 -30043 25260 14851
785 14851 -26778 4423 23314 -14362 -9406 23142 -448 -20149 13818 16207 -18893 -6591
797 -6591 20577 -1952 -18996 7965 12765 -16883 -7392 18372 -6993 -19777 16531 9516 -26190
810 -26190 1632 25371 -16635 -18137 27297 3766 -28691 15843 21932 -27369 -1801 32976
822 32976 -14818 -20687 30650 6049 -31303 14077 24091 -27177 -7665 30168 -12294 -23887
834 -23887 23569 6324 -28693 7523 19256 -20603 -10454 21689 -3710 -20723 13020 12099
846 12099 -18591 -1353 19445 -6369 -13323 14466 9304 -15671 1257 19235 -8029 -12912 18643
859A8643j3390k7069K9315J1670l8169P792L5205k7776k1567M1127k701m1321
871b8241K9161K4626m5698L449M5541k9956k7874M6350J658m5397K4971K9841
883B8431m2114k790M3304k4027k7476L9685K734l9760J8860K6931l1747r435L3628
896A6224r529k6391K2441J1903k8236M172K4313j5942j5968K2981O446k5675M649
909h612K5397j6760j6942K6674L276k8415J3607K1953k6678q102L3941j0649l1663
922b2973K9669J5758m0612P059L6042k9112j8565L9153n660l6538K8211J9710
934B2142m0763L942L9336k6962k3185L9765k96l6072K1240K1657l1503j467L1479
947A9313j6360k1171K8159N991l1196J0353K4077k1427j2233K4480n70k2457J0686
$$ plain form
859 18643 5253 -21816 7499 19169 -19000 -11208 23997 -3779 -25346 15781 13080 -28241
871 -28241 920 25546 -20152 -16703 28838 -1118 -28992 17358 19016 -26381 -1410 28431
883 28431 -13683 -16473 26831 2804 -24672 15013 17747 -22013 -3153 23778 -7969 -17404 16224
896 16224 6695 -19696 2745 14648 -13588 -9416 14897 -1045 -17013 5968 12414 -13261 -8612
909 -8612 16785 25 -16917 9757 13033 -15382 -1775 20178 -6500 -14602 19339 8690 -22973
922 -22973 6696 22454 -18158 -11099 24943 -4169 -22734 16419 10759 -25779 2432 22142
934 22142 -18621 -14679 24657 -2305 -25490 14275 13979 -22093 -853 20804 -10699 -12166 19313
947 19313 2953 -18218 9941 15932 -15264 -4911 19166 -2261 -14494 9986 9416 -13041 -2355
960b355J6011k0164o453K5357p806k3785K1210J4101k9106j44L0346j4555k2773
973b0116K7776P476l2557J3800K5988l1562o907L8209j5349l0689L2505J3214
985B1788l9095Q335L2753k8035j4319L6027j0407k9843K8986J2074l6764P862
997a0638L1389k3253j8305L0575J146k7808J5001J6566k3755l82K4301j3210j7061
1010a5434K1847Q439k5154J538K4481j1686j7696J9390N548k1363P384J6831j9302
1023e177q226K7066n663k8464J9877K0257l1173l986L1727j4671k0230K7316J876
1036A0529k9215J7840K1360l1997m567L7236j4631k8653K9009J0688l1542R568
1048d375K2072k3168n987K7455j1059k3950K4423J2186l0908K062K6738j4131
$$ plain form
960 -2355 13656 -6508 -12961 12396 4590 -19195 2015 16116 -12990 -13134 17212 2657 -20116
973 -20116 7660 15136 -17421 -3621 22367 -9195 -16102 22107 6758 -23931 8574 21788
985 21788 -17307 -8972 23781 -4254 -18573 17454 7047 -22796 6190 18264 -18500 -10638
997 -10638 20751 -2502 -20807 9768 10914 -16894 -1893 14673 -9082 -9464 14837 1627 -15434
1010 -15434 6413 14852 -10302 -8764 15717 4031 -13665 5725 11273 -10090 -2706 14125 -5177
1023 -5177 -13403 13663 8000 -20464 -587 19670 -11503 -15489 16238 1567 -18663 8653 10529
1036 10529 -18686 -846 20514 -11483 -16050 21186 6555 -22098 6911 17599 -13943 -4375
1048 -4375 17697 -5471 -11458 15997 4938 -19012 5411 17597 -13311 -11249 15489 1358
1060A358j5932J8606K656j7212Q655J2396j7757m720K4095n235k3410J5410J7477
1073A6387k0783p317K2136m554j7180J5945P204k3321P835K3122k3847j2812L1919
1086A4734k904l0568J6790J9433k6217k839K5729j5576j5377K8238k717k9875
1098b1149K0362K1301l0949n459L0823q785k1394J9159P119k1843J0014J6428
1110A5627k2235m983K6836p060k3636J4897J5536j8468o399J7764m599j3348J4151
1123D083L572j9268P346J7889j6777j2930K3415L992k5272P834K0023j7118p717
1136a0928K1745p846j6594K1381N254k7638R396K5998k2276j5998K8671O23k6075
1149a4287J4940J2472k3476M909K1606k0593j2933K8309L00k8851J2418K0424
$$ plain form
1060 1358 -14574 4032 6688 -10524 -1869 10527 -7230 -11950 12145 6910 -16500 -1090 16387
1073 16387 -4396 -11713 10423 5869 -11311 4634 11838 -11483 -3648 19474 -4373 -17185 14734
1086 14734 11830 -18738 -1948 17485 -8732 -11571 14158 -1418 -16795 11443 8726 -21149
1098 -21149 -787 20514 -10435 -15894 14929 6144 -15250 3909 11028 -10815 -801 15627
1110 15627 -6608 -11591 15245 8185 -15451 -554 14982 -3486 -9885 7879 3280 -10068 4083
1123 4083 7655 -11613 -4267 13622 -3155 -16085 7330 11322 -13950 -6116 13907 -3211 -10928
1136 -10928 10817 2971 -13623 7758 13012 -14626 -5230 20768 -1508 -17506 11165 11788 -14287
1149 -14287 653 13125 -10351 -5442 16164 -4429 -17362 10947 11247 -17604 -5186 15238
1161A5238k0384o287K0485p625j2833J7085K496j9807Q029J8117j5588j2006K0706
1174G626L273k0244O141J4633j2706n532J4840m903j3598J4225P750k2105J426
1187i174K3876j3175j8081K0772O008k1035O795J4766j7294k889K2581j1139j9775
1200a7764K3871R088k8165N391K3795j6619j0825K0876l367j7943J5995Q580k3400
1213a0487L808K2369j5610j4680K1091L204k0112O355J3166j2905m508J5613n618
1226A686j3574J4553P496j9287J080J9229q406j4104J3625P608j6171K835J4031
1239A0601j2785o590J9857n056j9617J5505J2616k1977k082K1414r335j5465J7982
1252E068L330k1630J1530J4931k1637k838K3946r638j8360J8449Q348k1243M019
$$ plain form
1161 15238 -5146 -11433 9052 1427 -11406 5679 8175 -11632 -3603 14514 -1074 -13080 7626
1174 7626 10899 -9345 -3204 11429 -1277 -6809 8031 3128 -10470 3755 11505 -10600 -9174
1187 -9174 14702 1527 -16554 4218 10226 -10809 -4014 10752 -6542 -9431 13150 2011 -17764
1200 -17764 6107 15195 -12970 -7579 16216 -403 -11228 9648 6281 -11662 4333 12913 -10487
1213 -10487 -6679 15690 80 -14600 6491 9695 -10417 -4062 9104 -3801 -8309 7304 1686
1226 1686 -11888 2665 10161 -9126 -8046 11183 2777 -11327 2298 9906 -6265 -3430 10601
1239 10601 -2184 -8774 11083 6027 -13590 1915 14531 -7446 -9528 11886 2551 -12914 5068
1252 5068 8398 -13232 -1702 13229 -8408 -11246 12700 3062 -15298 3151 11499 -9744 -5725
1265e725J8016j4502p682J9836m896j6682J4856Q743j8627k93J8439q637j3104
1278a0258J3905M980j5881M336J2165j2567n234J5489k685j5556R810J1692j5520
1291e324m148J7901n535j3883J3874N328j6861N178J5550j3847q722J9680j382
1304G809j9663J2484J2414j9205o64J8482j0691j2172J7822J122j9008R170J3940
1317A1840j7507m369J9608o868j4604J4319N402j6485M220J3695j1155p057J5255
1330F294m58j4849Q901J0211j3684k633J4768n348j1245J0553N928j3879R13J4019
1344I491r457r481J4696J600j6507P387J1976j4154m395J6551m584j4804J3485
1357A804P286j7684L469J6055j2863q198J8075j904j6412J1524R944j6689p04
$$ plain form
1265 -5725 12291 -2211 -9893 9943 5047 -11635 3221 11964 -6663 -6956 11483 2846 -10258
1278 -10258 3647 8627 -7254 -2918 9247 -3320 -8554 6935 4250 -11306 -1496 10196 -5324
1291 -5324 -9472 8429 2894 -10989 2885 8213 -8648 -3470 12080 -1767 -10489 9191 7809
1304 7809 -11854 630 13044 -6161 -6825 11657 966 -11206 6616 7738 -11270 -2100 11840
1317 11840 -5667 -10036 9572 2704 -11900 2419 7821 -8664 -4444 9251 -1904 -8961 6294
1330 6294 5836 -9013 -112 10099 -3585 -6218 8550 3202 -8043 2510 8438 -5441 -4528 9491
1344 9491 34 -9447 5249 6849 -9658 -2271 9705 -4449 -8844 7707 3123 -11681 1804
1357 1804 9090 -8594 -5125 10930 -1933 -10131 7944 6040 -10372 1152 11096 -5593 -6297
1370f297J7563r434j1748J6050J544j6518P798J0638j3607l517J5114m512j3368
1383a0294J1251O464j4284J404J3204q608p518J2206J416j2622N567J0033j0489
1396b270m944J4541k273j3511R712P791j3551m50J3407o925r870J3063K443j6058
1410h895O900J2571j4495n107J6752m850j3312J2110N786j5107K855J3726j1277
1423b343o787J6001j942j4799J0519Q827j4398l52J3713o716r227J1742K475j2991
1437f278M833J0184j0829m900J3413k669j1669P663P029j0966j858J1721m610
1450A064r258J0685L217j3054M500J0946j0304n537J3293o38j2879P899R069j2874
1464c871r35J3575p620r179J3455J416j4714O612J0878j2737m514J4807l983j2460
$$ plain form
1370 -6297 11266 1832 -9916 6134 7678 -8840 -1042 9596 -4011 -7528 7586 3074 -10294
1383 -10294 957 7421 -6863 -5459 7745 -863 -8381 3825 5241 -7381 -1814 8219 -2270
1396 -2270 -7214 7327 5054 -8457 1255 9046 -4505 -4955 8452 1527 -8343 4720 7163 -8895
1410 -8895 -1995 10576 -3919 -9026 7726 2876 -10436 1674 7460 -7647 -4792 8934 -2343
1423 -2343 -9130 6871 4929 -9870 649 9476 -4922 -5274 8439 1723 -7504 4238 6713 -6278
1437 -6278 -1445 8739 -2090 -6990 6423 3754 -7915 -252 6777 -4189 -6047 5674 1064
1450 1064 -8194 2491 5708 -7346 -2846 8100 -2204 -7741 5552 4914 -7965 -66 9003 -3871
1464 -3871 -4806 8769 1149 -8030 5425 6841 -7873 -1261 9617 -3120 -7634 7173 3190 -9270
1478i270J1301M287j3490L828J0720j0112m937J3030j526j2277Q059P906j1276
1491c757j611J1757m556p951R079K662j0204L281Q681q093n388J1379k73j1627
1505f621N586P906r189k931J0110l684p869Q271L410j1407K925J1208r613o523
1519h421J3290j47j2119O603P712j0310o48J1070o185p618J1843R13j3021N951
1533a087J0092j0764m403J1488k216r010P059L831r971J933R750q496n754J1466
1547C918M46j1479M332Q728p101m305Q892j345p673P298L887j0443K208J0540
1561G903p489p495J0649L054j1696K840Q785p588l594J0081m398q302J0383K955
1575F088j3200K951J2254q362q310J1257J670j0568N510N911r941J443J0774p838
$$ plain form
1478 -9270 2031 6318 -7172 -3344 7376 -2736 -7673 5357 3831 -8446 -387 7519 -3757
1491 -3757 -5368 6389 1833 -6118 2961 5623 -4581 -1300 7381 -712 -6100 5279 5006 -6621
1505 -6621 -1035 6871 -2318 -5249 4861 1177 -6692 1579 4989 -6418 -3493 7715 -1898 -8421
1519 -8421 4869 4722 -7397 -794 6918 -3392 -4040 7030 845 -6773 5070 5983 -7038 -1087
1533 -1087 9005 -1759 -6162 5326 3110 -5900 1159 4990 -4981 -3048 6702 -1794 -7548 3918
1547 3918 4364 -7115 -2783 5945 -1156 -5461 3431 2086 -5587 1711 5598 -4845 -2637 7903
1561 7903 414 -7081 3568 6622 -5074 -2234 6551 -1037 -4631 5450 1052 -7250 3133 6088
1575 6088 -7112 -4161 8093 -269 -8579 2678 4348 -6220 -710 5201 -4740 -3297 7477 -361
1589c61p140J1676K844j2841K818J0456p441m664Q893j883o676P007K187j0042
1603e167K366J0007o866q334R845L762j0138J140P586n665k485P462k896o660
1617f043P927M483j1707J60J2836n116r422Q432L886q777K718O034p661r66R894
1632F678n117r750J0598N330j3069L50J1067n694o059P534q8o904N744M030j0130
1647e480R10J1642n913r353R445M886r120j13P042l734k662O515k324p169P627
1662B199M695j0902j031J1085k597r175N392M541o894M68N799n898k321R407k961
1677A807r917Q070P159j0391k665J0309j716p242N653K221p356M403N833r349
1691c181j481J1558l470j0092O673O784q427k105P343l615l780P198j954p813
$$ plain form
1589 -361 -7501 4175 7019 -5822 -3004 7452 11 -4653 4240 2357 -4319 2688 4875 -5167
1603 -5167 -2801 7206 340 -7994 1851 5613 -4525 -3385 4201 -1464 -3949 3513 617 -6043
1617 -6043 1884 6367 -5340 -5180 7656 2540 -6882 1550 5436 -3341 -623 5411 -2250 -3216 6678
1632 6678 1561 -8189 2409 7739 -5330 -4980 6087 393 -5666 1868 1780 -5124 620 4650 -5480
1647 -5480 -4570 7072 1159 -8194 1251 6137 -2983 -3096 3946 212 -2450 4065 1741 -5428 2199
1662 2199 6894 -4008 -5039 6046 3449 -5726 -334 4207 -2687 -2219 3580 -2318 -4639 4768 1807
1677 1807 -8110 -40 7119 -3272 -5937 4372 2656 -4586 1067 3288 -4068 335 6168 -3181
1691 -3181 -4662 6896 3426 -6666 7 6791 -1636 -3741 3602 -13 -3793 3405 1451 -6362
1705f362O856N383r347k735J0149r11q807M551N031o107M89N491n010k428Q246
1720D489j016r150M879Q309q098m860R213L8p778M733K715o937K540O452p712
1735b183l830J0291j11j1207M694Q391q356k387P828k725n103P205O16q552M633
1750g96P821q904l987J0399m08q601M645M573o691N13N532m625l567P689kr062
1766e471L868P448p072m008P699l94o502M493K710o074R19O865n147m737Q611
1781C208J224r681L692P018n881l289P026j298n549N336K533q139K062P681o394
1796d51m878Q267L93p693L272M958n823j591P014l681n067P185J612p822K385
1811a920O630n374l414O450M92o085L161L971n645l26O267k959m999O045J830
$$ plain form
1705 -6362 494 5877 -3470 -6205 3944 3033 -5774 -1223 3808 -2299 -1810 3681 -1329 -3757 4489
1720 4489 3473 -5677 -798 7511 -587 -5447 3766 3804 -3974 759 3474 -3463 -923 5529 -2183
1735 -2183 -6013 4278 4167 -7040 -2346 6045 -2311 -4698 3130 405 -4698 2507 3123 -5429 -796
1750 -796 7025 -1879 -5866 4533 4125 -4476 169 4742 -1949 -1436 4096 -529 -4096 3593 3591 -5471
1766 -5471 -1603 5845 -1227 -5235 2464 2070 -4432 61 2771 -3303 -2384 4481 -666 -5403 3208
1781 3208 4432 -5249 -1557 5461 -420 -3709 3317 2019 -3530 1806 4339 -3800 -1738 5943 -451
1796 -451 -5329 2938 3331 -4362 -1090 3868 -1955 -3546 3468 -213 -5280 1905 3517 -4305 -1920
1811 -1920 4710 -664 -4078 2372 2864 -3221 -60 3911 -1734 -2060 4207 1248 -3751 2294 4124
1826D124p422J487O393m650l982O151M02o630L416M407o645n95P137l077n619
$$ plain form
1826 4124 -3298 -1811 4582 -68 -4050 2101 2503 -4127 -711 3696 -2949 -3544 3593 516 -5103
$$ [...]
8191B79
##END NTUPLES=NMR FID
##END=
