##TITLE=1H_Pr 5055
 CDCl3, 8 sc, 
 6.08.2021
##JCAMPDX= 6.0         $$ Bruker NMR JCAMP-DX V2.0
##DATA TYPE= NMR FID
##DATA CLASS= NTUPLES
##ORIGIN= UXNMR, Bruker Analytische Messtechnik GmbH
##OWNER= root
$$ XWIN-NMR		Version 3.5
$$ Fri Aug  6 11:23:09 2021 Russian Standard Time (UT+4h)  she@DPX200
##.OBSERVE FREQUENCY= 200.131506
##.OBSERVE NUCLEUS= ^1H
##.DELAY= (6, 6)
##.ACQUISITION MODE= SIMULTANEOUS
##.ACQUISITION SCHEME= undefined
##.AVERAGES= 8
##.DIGITISER RES= 18
##SPECTROMETER/DATA SYSTEM= spect
##.PULSE SEQUENCE= zg30
##.SOLVENT NAME= CDCl3
##.SHIFT REFERENCE= (INTERNAL, CDCl3, 0, 15.7039)
##AUDIT TRAIL= $$ (NUMBER, WHEN, WHO, WHERE, WHAT)
$$ ##TITLE= Audit trail, XWIN-NMR		Version 3.5
$$ ##JCAMPDX= 5.01
$$ ##ORIGIN= Bruker BioSpin GmbH
$$ ##OWNER= she
$$ F:/spectra/data/she/nmr/H-F/1/audita.txt
$$ ##AUDIT TRAIL=  $$ (NUMBER, WHEN, WHO, WHERE, WHAT)
(   1,<2021-08-06 11:21:52.29 +0400>,<she>,<DPX200>,
      <created by zg, POWCHK disabled, PULCHK disabled
       configuration hash MD5:
       00 E9 B6 7A A2 85 ED C7 34 08 36 98 17 FE 4E 26
       data hash MD5: 16K
       7D 1E BE 15 45 BE BC E8 D3 8B 91 3E C2 DE FB B5>)
$$ ##END=
$$ 
$$ hash MD5
$$ 61 67 B6 78 93 C6 8A 8D 6F F1 8B 74 52 C1 3F 7B
##$RELAX= 
##$RELAX= 
##$RELAX= 
##$RELAX= 
##$RELAX= 
##$RELAX= 
$$ Bruker specific parameters
$$ --------------------------
##$DU= <F:/spectra>
##$EXPNO= 1
##$NAME= <H-F>
##$PROCNO= 1
##$TYPE= <nmr>
##$USER= <she>
##$AMP= (0..31)
100 100 100 100 100 100 100 100 100 100 100 100 100 100 100 100 100 100 
100 100 100 100 100 100 100 100 100 100 100 100 100 100 
##$AQSEQ= 0
##$AQ_mod= 1
##$AUNM= <au_zg>
##$AUTOPOS= <>
##$BF1= 200.13
##$BF2= 200.13
##$BF3= 200.13
##$BF4= 200.13
##$BF5= 200.13
##$BF6= 200.13
##$BF7= 200.13
##$BF8= 200.13
##$BYTORDA= 1
##$CFDGTYP= 0
##$CFRGTYP= 5
##$CHEMSTR= <none>
##$CNST= (0..31)
1 1 145 1 1 1 1 1 1 1 1 1 1 1 1 1 1 1 1 1 1 1 1 1 1 1 1 1 1 1 1 1 
##$CPDPRG= <>
##$CPDPRG1= <>
##$CPDPRG2= <>
##$CPDPRG3= <>
##$CPDPRG4= <mlev>
##$CPDPRG5= <mlev>
##$CPDPRG6= <mlev>
##$CPDPRG7= <mlev>
##$CPDPRG8= <mlev>
##$CPDPRGB= <>
##$CPDPRGT= <>
##$D= (0..31)
0 1.2 0 0 0 0 0 0 0 0.06 0 0.03 0 0 0 0 0.0002 0 0 0 0 0 0 0 0 0 0 0 0 
0 0 0 
##$DATE= 1628234511
##$DBL= (0..7)
120 120 120 120 120 120 120 120 
##$DBP= (0..7)
150 150 150 150 150 150 150 150 
##$DBP07= 0
##$DBPNAM0= <>
##$DBPNAM1= <>
##$DBPNAM2= <>
##$DBPNAM3= <>
##$DBPNAM4= <>
##$DBPNAM5= <>
##$DBPNAM6= <>
##$DBPNAM7= <>
##$DBPOAL= (0..7)
0.5 0.5 0.5 0.5 0.5 0.5 0.5 0.5 
##$DBPOFFS= (0..7)
0 0 0 0 0 0 0 0 
##$DE= 6
##$DECBNUC= <off>
##$DECIM= 32
##$DECNUC= <off>
##$DECSTAT= 4
##$DIGMOD= 1
##$DIGTYP= 9
##$DL= (0..7)
0 120 120 120 120 120 120 120 
##$DP= (0..7)
150 150 150 150 150 150 150 150 
##$DP07= 0
##$DPNAME0= <>
##$DPNAME1= <>
##$DPNAME2= <>
##$DPNAME3= <>
##$DPNAME4= <>
##$DPNAME5= <>
##$DPNAME6= <>
##$DPNAME7= <>
##$DPOAL= (0..7)
0.5 0.5 0.5 0.5 0.5 0.5 0.5 0.5 
##$DPOFFS= (0..7)
0 0 0 0 0 0 0 0 
##$DQDMODE= 0
##$DR= 18
##$DS= 0
##$DSLIST= <SSSSSSSSSSSSSSS>
$$ [...]
##$SUBNAM2= <"">
##$SUBNAM3= <"">
##$SUBNAM4= <"">
##$SUBNAM5= <"">
##$SUBNAM6= <"">
##$SUBNAM7= <"">
##$SUBNAM8= <"">
##$SUBNAM9= <"">
##$SW= 20.0188882624521
##$SWIBOX= (0..15)
0 0 2 0 0 0 0 0 0 0 0 0 0 0 0 0 
##$SW_h= 4006.41025641026
##$TD= 16384
##$TD0= 1
##$TE= 0
##$TE2= 300
##$TE3= 300
##$TEG= 300
##$TL= (0..7)
0 120 120 120 120 120 120 120 
##$TP= (0..7)
150 150 150 150 150 150 150 150 
##$TP07= 0
##$TPNAME0= <>
##$TPNAME1= <>
##$TPNAME2= <>
##$TPNAME3= <>
##$TPNAME4= <>
##$TPNAME5= <>
##$TPNAME6= <>
##$TPNAME7= <>
##$TPOAL= (0..7)
0.5 0.5 0.5 0.5 0.5 0.5 0.5 0.5 
##$TPOFFS= (0..7)
0 0 0 0 0 0 0 0 
##$TUNHIN= 0
##$TUNHOUT= 0
##$TUNXOUT= 0
##$USERA1= <user>
##$USERA2= <user>
##$USERA3= <user>
##$USERA4= <user>
##$USERA5= <user>
##$V9= 5
##$VALIST= <valist>
##$VCLIST= <CCCCCCCCCCCCCCC>
##$VD= 0
##$VDLIST= <DDDDDDDDDDDDDDD>
##$VPLIST= <PPPPPPPPPPPPPPP>
##$VTLIST= <TTTTTTTTTTTTTTT>
##$WBST= 1024
##$WBSW= 4
##$XGAIN= (0..3)
0 0 0 0 
##$XL= 0
##$YL= 0
##$YMAX_a= 97332
##$YMIN_a= -165946
##$ZGOPTNS= <>
##$ZL1= 120
##$ZL2= 120
##$ZL3= 120
##$ZL4= 120
##$ABSF1= 10
##$ABSF2= 0
##$ABSG= 5
##$ABSL= 3
##$ALPHA= 0
##$AQORDER= 0
##$ASSFAC= 0
##$ASSFACI= 0
##$ASSFACX= 0
##$ASSWID= 0
##$AUNMP= <proc_1d>
##$AZFE= 0.1
##$AZFW= 0.1
##$BCFW= 1
##$BC_mod= 2
##$BYTORDP= 1
##$COROFFS= 0
##$CY= 11.3945322036743
##$DATMOD= 1
##$DC= 2
##$DFILT= <>
##$DTYPP= 0
##$F1P= 2.36226072786647
##$F2P= -0.459571619588291
##$FCOR= 0.5
##$FTSIZE= 0
##$FT_mod= 4
##$GAMMA= 1
##$GB= 0.15
##$INTBC= 1
##$INTSCL= 1
##$ISEN= 128
##$LB= 0.24
##$LEV0= 0
##$LPBIN= 0
##$MAXI= 10000
##$MC2= 0
##$MEAN= 0
##$ME_mod= 0
##$MI= 1.114404
##$NCOEF= 0
##$NC_proc= 0
##$NLEV= 6
##$NOISF1= 3.799351
##$NOISF2= 2.8
##$NSP= 1
##$NTH_PI= 0
##$NZP= 0
##$OFFSET= 15.70392
##$PC= 1
##$PHC0= -13354.95
##$PHC1= 8.80099
##$PH_mod= 1
##$PKNL= yes
##$PPARMOD= 0
##$PSCAL= 0
##$PSIGN= 0
##$REVERSE= no
##$SF= 200.130013532006
##$SI= 16384
##$SIGF1= 3
##$SIGF2= 2
##$SINO= 400
##$SIOLD= 16384
##$SREGLST= <1H.CDCl3>
##$SSB= 0
##$STSI= 0
##$STSR= 0
##$SW_p= 3612.71676300578
##$SYMM= 0
##$S_DEV= 0
##$TDeff= 0
##$TDoff= 0
##$TI= <>
##$TILT= no
##$TM1= 0
##$TM2= 0
##$TOPLEV= 0
##$USERP1= <user>
##$USERP2= <user>
##$USERP3= <user>
##$USERP4= <user>
##$USERP5= <user>
##$WDW= 1
##$XDIM= 8192
##$YMAX_p= 0
##$YMIN_p= 0
$$ End of Bruker specific parameters
$$ ---------------------------------
##NTUPLES= NMR FID
##VAR_NAME=  TIME,          FID/REAL,        FID/IMAG
##SYMBOL=    X,             R,               I
##VAR_TYPE=  INDEPENDENT,   DEPENDENT,       DEPENDENT
##VAR_FORM=  AFFN,          ASDF,            ASDF
##VAR_DIM=   8192,          8192,            8192
##UNITS=     SECONDS,       ARBITRARY UNITS, ARBITRARY UNITS
##FACTOR=    0.0002496,     1,               1
##FIRST=     0,             0,               0
##LAST=      2.0444736,     0,               0
##MIN=       0,             -165946,         0
##MAX=       2.0444736,     97332,           0
$$ Real data points
##PAGE= N=1
##DATA TABLE= (X++(R..R)), XYDATA
0@%%%%%%%%%%%%%Qj6J6j6J6k4L2l2M0m8N6o5P3q8J04j20J37j58J81k05K33k64
35a40K97l34L75m20M68n23N85o48P17p94Q77r67J068j179J298j429J577j739J915
54A004k114K341k596K884l218L610m075M636n334O229p419R095j1646J6047k5757
69a6313Q8777o2640j33692J19729O9447k9533n1901p95j7641J2867L0313M591
81A3209k8342k147j709J5509M8632K0116q1264o4155P1958J05525l3183j01462
93c7313k4845M5168L3989N999k3635l7742p299L8525K3928j2925j7071j3585p78
106b7584M5447L9899l7018o5223J739N4132L5904p079m8231n3493K0741P2874
118C2108Q846n9631k6120K6478K2472O076J912k1795k8549K4300N2740K210m1755
$$ y = [0, 0, 0, 0, 0, 0, 0, 0, 0, 0, 0, 0, 0, 0, 8, -8, 8, -8, 8, -16, 16, -16, 24, -24, 32, -33, 40, -48, 56, -64, 73, -85, 96, -109, 124, -140, 157, -177, 198, -222, 246, -277, 308, -340, 377, -417, 460, -507, 561, -618, 680, -749, 828, -911, 1004, -1110, 1231, -1365, 1519, -1699, 1911, -2164, 2472, -2862, 3367, -4052, 5043, -6603, 9444, -16313, 72464, 9824, -123868, -4139, 65308, 35775, -16126, -16921, -34562, -21695, 8618, 13209, -15133, -17280, -18989, -3480, 45152, 65268, -15996, -80151, -8193, 97332, 64149, -37313, -62158, -16990, 16999, 22998, -637, -38379, -45678, -7153, 16775, 3850, -13221, -26806, -27584, 17863, 57762, 20744, -44479, -42740, 11392, 47296, 40217, -8014, -61507, -40766, 32108, 40954, -18677, -44797, -18319, 4153, 10229, 12141, -9654, -38203, -13903, 38837, 41047, -708]
131g08k7260L735K7037M0903M236o4178m3446N1855N3907k7677m1629M057J3533
144e635N109J9318J911m0072j7432M1674L7441r555l1966k6108M205M0365L1727
157E0982k7119m9870j271L3288J3775r743j5085j5189M4K6259K2111k0942l8340
170c1100L422M0218K7143j3368l6803j9224K1861L3865L522k6174k0189j668R473
183i022J9660M228k9190k1269K1520L2941k62k9075j8794J0245L1904K1811j8015
196A6682l5028o301K3235J9894p64j6529j9731n978K0435K1334j3705k8629j257
209b6342K5078J7665o375j8462j2290P280K9003J7262k0348k9013j591K1107J7869
222B0843k969k1364j7929P907K3755L836j8683j3197M056J6195J4609k511k0076
$$ y = [-708, -27968, -24233, 2804, 43707, 47943, -16235, -59681, -7826, 46081, 18404, -23225, -19168, -5635, -526, 18792, 20703, -19369, -36801, 4873, 42314, 32759, 793, -25315, -21110, 19255, 50982, 23863, -26007, -27278, 6010, 19785, 10042, -5043, -20232, -20188, 6071, 28182, 7240, -31100, -27678, 12540, 39683, 26315, -10488, -29712, -7851, 26014, 29536, 3362, -16827, -18495, -9022, 10638, 14866, -14324, -35593, -14073, 18868, 18606, -10469, -29263, -19018, 12886, 34697, 16682, -18346, -24647, -1412, 18482, 17718, 1189, -18542, -24520, -4085, 17249, 3544, -25085, -26342, -1264, 16401, 10026, -8436, -20726, -13446, 15557, 32819, 12471, -16542, -18133, 2974, 20843, 17874, -3490, -21419, -13512, 10243, 14079, -4604, -17801, -13745, 2450, 17059, 14548, -5528]
235e528j4482J4469K8816P687k1545k3260N04K2024J4664r771k0774r124J2267
248d053J4672j427j2717j1806J956J7673J5080q516k2114o254J8894J9452O4j5907
262D997j7074J481J8447R995j1396j7766m118J1469J0853r47j5182j1965R116
275a2090J9758N874j2292j4731k4J4571J4044J242j5518j4999M562J7267N972
288A3636j2441j6002k57J2287R299m647j5955n169J2985J3959J502q872j0406
301a0081j072J3257J4846k467j7298q635Q621J1847J751j1403j1902K513J1248
314A225O600p479j1489m54R222J1802K498r777j0071K595J4255R593p228j3350
328b058l464O524Q499J82j0807q738K954J1211L553q213q397k39Q907J1534p7
$$ y = [-5528, -20010, -5541, 23275, 30962, 9417, -13843, -13339, 8685, 23349, 13578, -7196, -16320, -4053, 10619, 9192, -3525, -15331, -13375, 4298, 19378, 10862, -11252, -17506, 1388, 20840, 20904, 4997, -12077, -10596, 7851, 17846, 6450, -11316, -15434, -3965, 6888, 5941, -9241, -21206, -12090, 7668, 13542, 1250, -13481, -13505, 1066, 15110, 16352, 834, -14165, -9603, 7664, 13636, 1195, -14807, -15064, -2777, 6522, 1875, -14080, -19249, -6264, 7695, 9197, 325, -10081, -11153, 2104, 16950, 14483, -2815, -11450, -2829, 9018, 10769, -634, -12536, -10023, 1225, 7825, 346, -11143, -11597, -2375, 9427, 11925, 2148, -7923, -5328, 8927, 18520, 11292, -2058, -5522, 1002, 9501, 9683, -1124, -9862, -6908, 4303, 7856, -357, -8754, -8993, -86, 11448, 11371]
343A1371j1868o223N169J1167M218o544r757l554O181Q302k793j0548o183M169
357f893R752J460p343p310J034R335Q462k526q710l530M615Q105K149m971q866
372e237k486P593M972m430q487l748M951P379J415n785o873K991Q932N362k020
387D529o432l680N031P579P89o288o743M4N994L213l659p131k963N631O579J138
403C631o280m849L945Q004L763j889n903k158M841N480p1o279m962Q34L873K954
419D934l302p272j327N473M917K20m449l514K995O274M186l099n640p00L886M412
435G994j181o497l761J307L212J731l472n436j093M237M428J35l068k791J231
450c024O202M302m086n009k41M277L398k554o068k416J532K802j1k302k878j761
$$ y = [11371, -497, -6720, -1551, 9616, 13834, 7290, -2467, -6021, 160, 8462, 5669, -4879, -11062, -6893, 2859, 4319, -3024, -10334, -9300, 35, 8497, 5971, -2739, -6269, -1654, 6451, 8600, 3629, -5237, -7723, -130, 4842, 412, -8075, -11823, -6872, 507, 1922, -3863, -10736, -7745, 1187, 6549, 4529, -1903, -5583, -552, 7027, 7816, 1528, -5215, -5171, 823, 4036, 377, -6754, -9717, -4086, 2493, 3631, -2649, -7498, -3553, 4451, 8214, 6325, 422, -1736, 3105, 8585, 8514, 2235, -2727, -1893, 1980, 4934, 1632, -5640, -6967, -1494, 3423, 3643, -806, -4320, -1325, 4949, 9135, 6036, 396, -304, 3582, 7994, 6813, 316, -3445, -2138, 1074, 2805, -667, -6103, -7196, -2959, 1469, 1604, -1464, -4255, -3024, 3178, 7480, 3394, -1615, -1856, 2421, 5819, 3265, -2803, -5219, -3687, -885, -896, -3198, -6076, -7837]
466g837K624M626J469k265l152P46O082L885l475n160k40N339K380l961m525j246
482d710K012J496j14m26j843k592K258M820K206k489l126J347N375L139k755n884
498a286M06N956R83m103l961o29J876R94L36K70k493k375K184N317J455l153k280
515e03K044L062K727k537n568l6N010K004m292m797J75J394R83P02k19k670j725
532d246K288M377J096l472p87R84K466K082j502n220j805N257L184m671m898m
548d871J219J904J719j265l153j287L346M173m32k133p46P26K230J704j443l882
564b191k333M571M065l839n572r30K840L315M95j711k534L2L955K592p08j945
580A02l47J807J486M96m08l381l273L818N679k447q180k012N918L577j004j831
$$ y = [-7837, -5213, -587, 882, -1383, -4535, -3789, 2293, 6178, 2703, -2457, -2697, 2642, 5022, 1061, -3464, -4710, -2698, -1202, -1316, -1742, -3585, -6177, -3919, 901, 3107, 618, -2508, -1161, 4214, 7353, 4598, -1286, -880, 5076, 6059, 1956, -2005, -2634, -758, 236, 572, 842, -1651, -4026, -1842, 3475, 4930, 1777, -503, 1541, 4603, 7330, 4793, -775, -811, 4199, 6203, 1911, -2886, -2711, -1317, -334, 368, 149, -2521, -4246, -1958, 2419, 3515, 43, -744, 240, 2706, 4788, 3286, -1934, -3739, 1518, 4702, 31, -4867, -4871, -3652, -1748, -29, -1294, -4447, -5734, -2388, 1785, 1353, -780, -1526, -800, 1430, 3134, 1691, -2191, -4524, 47, 4112, 273, -5299, -6229, -3389, -74, 421, -1290, -3824, -3792, 163, 2755, 2047, 102, -245, 1562, 3048, 3544, 3136, -245, -3518, 300, 5979, 3532, -4648, -6660, -742, 2835, 1831, 0]
596@k364L52L753K446r93k198M06J449O90J021Lm824l757N072O293l635r567q91
614f744O830K588j266k057k026P90L221K339j160k737L52J480J474J199k808n039
630c564q57N174M219m378p601k82N043L775j186l034j229J048K811K858j490k569
646a262p50K524L168m39m359l399P07L854L234l203o779j464N672N004j771l602
662b865n22J032L566K574j390l833kM495K805k737m521k000R08M824K359m575
678A18o022k36O512L187j908k224j357J165M356K782k732n012Q91N812J301l531
694C102m370k358K406N088k67m420m252Q83M155L088k95l200k725K421N392J099
710E747m048m391J749N441J411m521n747r19M631L233j009m149l394N24M408L962
$$ y = [0, -2364, -2012, 1741, 4187, 3194, 996, 1402, 2851, 3541, 4562, 4565, -259, -4016, 1056, 7349, 3714, -5853, -6744, 86, 2674, 1408, -649, -2675, -1885, 1336, 3675, 2515, -222, 130, 1610, 3084, 4283, 1475, -3564, -4421, 753, 4972, 594, -7007, -7289, -2246, 1529, 343, -2691, -3920, -2872, -61, 2797, 1307, -1262, -2012, 512, 3680, 3241, -1118, -4517, -3810, 44, 3278, 75, -6704, -8168, -2496, 2508, 737, -2865, -3387, -2355, 1211, 3785, 2395, -1438, -1440, 3055, 5860, 3123, -1398, -3398, -2490, 2334, 4693, 118, -5904, -6140, 372, 3559, 1651, -573, -1930, -765, 3591, 6373, 3641, -1371, -480, 5332, 6633, 3102, -1268, -3626, -1220, 3868, 3601, -819, -5071, -4188, -33, 3055, 2760, -440, -3165, -744, 4648, 5747, 1699, -2692, -943, 4498, 5909, 1388, -4359, -5278, -647, 2586, 1577, -2572, -5966, -5442, -1034, 2928]
726B928r54n505j498M715N118p72m885l794K678N584J588o176n397J252M033K547
742A462p46l782l511J607N225L345k989m380N64M163M063p73n910k475L542N419
758D824M39o284m599J147M603L113j350m785k825L226N404J612l287l440M36M786
774C020M042k350o480j491M658M921j493n906l898J511N101L025l113n080j080
789d613L937M584Q39l962l640J957N703K485m563n422o97N068M242k731n884l869
805f566K465N901J680l792m331p89M554M405j77m866l056L748N378N35m752m786
821d449K62N187L643k990o277k722L278N610Q80l739m778J097N453L589j600n437
837b993j115M326N142m62n332m812J712N996K907l855o520j463M602M760L89m715
$$ y = [2928, 1974, -3531, -5029, -314, 4804, 4032, -853, -4647, -1969, 3615, 5203, -973, -6370, -5118, -1085, 1462, 716, -3066, -6577, -4970, 255, 3600, 611, -3769, -3205, 958, 5021, 4248, -1662, -4137, -595, 4824, 5263, -1021, -5620, -4473, 130, 3243, 1893, -2892, -5717, -2491, 2913, 4525, 1238, -2202, -1766, 3020, 7062, 4712, -1768, -3259, 1399, 6320, 4827, -1079, -4977, -3466, 1635, 4660, 1547, -3533, -4613, -676, 3908, 4747, 785, -2855, -898, 4805, 7290, 2727, -2695, -3392, 1676, 5918, 3187, -2697, -6566, -4101, 1800, 3480, -312, -4643, -5432, -878, 3527, 3350, -1516, -4572, -824, 4554, 5089, 337, -4449, -4187, 1000, 4643, 1653, -4624, -7346, -4068, 1542, 2422, -1317, -6095, -4998, 455, 4044, 2444, -2993, -4108, 218, 5360, 4898, -434, -5246, -3534, 2462, 5369, 1514, -5006, -6469, -1867, 2893, 3282, -1433]
853a433l889K309N816L018l493m770l66M819M702r39o366l983K986N753J568m489
869A243n921m60N220M394j392n030k617L138N875J630m002n199J061N311M098
884G349k838o735k371L369N857L29n597n009O32N464L844k591n407j270L668N887
900D581J39n098m143K181N833K879m144o572j682M594N507q60o138m099J727O228
916I33K705l396n127p73N322N041j000n378l328K777O198J492m598n545p61N271
932a67M659j899n899l205K880O148J691m179m908P61N833M407k087n852k437M058
948a96N719O36n450n424R49N916L336l070n801k187M156N621P31m918m604K092
964b494O338K928l068n881j445M839M983n31o263m130J625N594K311l386n850
$$ y = [-1433, -5322, -3013, 2803, 5821, 2328, -2442, -2808, 2011, 6713, 5774, -592, -4575, -1589, 4164, 5732, 1243, -4678, -5138, 82, 4476, 3084, -1946, -4563, -1425, 4450, 6080, 2078, -3121, -2060, 3251, 7349, 4511, -2224, -4595, -1226, 4631, 4960, -637, -5646, -5014, 450, 4294, 1703, -3704, -4974, -1306, 4581, 4720, -378, -4521, -2340, 3493, 6372, 2228, -4344, -6026, -1432, 4075, 3215, -2923, -7022, -5295, 933, 3638, 242, -4885, -5658, -336, 4705, 3705, -1673, -5001, -2224, 3974, 5466, 868, -4677, -5438, -167, 4492, 2593, -3306, -6511, -3631, 2517, 4208, 29, -4879, -4118, 1715, 6122, 4035, -1817, -4254, -196, 5523, 6159, 709, -4715, -3766, 2150, 5486, 2416, -3385, -5572, -1416, 4205, 4936, 18, -4586, -2494, 3844, 6772, 3704, -2177, -3622, 1217, 6200, 5669, -594, -4724, -3099, 2495, 4806, 1420, -4430]
979d430r36M742M531k39n357l177K811N727K235m177n407k44M908M484j671o606
995b806l762L478N351J152m485n020J073M862L709j635n252k229M121N410R29
1010D896m785m958R93N444L628k754o344k337M086N257J18n537l661K097N121
1025A264K987k764m874n62M161N155j37n674l558K220N024K645l754n983j269
1040e119M795M905j536n337k625K581N420J791l652m247J67M761M485j636n211
1055d58k917K691N207N83l802n295k40N148L794k804n614j532L975N178j26l825
1071c7l624J034N507L013k851n031k071L871L773Rm590m419R42N339K393k846
1087D12n389o53M808M020p66l765l197K245N073K067l303n293m20M047L864j525
$$ y = [-4430, -5366, -624, 3907, 3668, -1689, -4866, -2055, 3672, 5907, 1730, -3677, -3921, 987, 5471, 3800, -2806, -6568, -3090, 2261, 3413, -1072, -6092, -5019, -157, 3552, 1917, -3335, -5564, -1443, 3967, 4896, 111, -4847, -3854, 1590, 5218, 2464, -3880, -6217, -2131, 3126, 3244, -2293, -5954, -3857, 1264, 4251, 1487, -3387, -3949, 212, 5367, 5230, -444, -4002, -1782, 3242, 5887, 2133, -3850, -5119, -324, 4581, 3045, -2292, -4917, -2336, 3084, 4875, 1223, -3024, -2857, 1904, 6389, 4753, -458, -3375, -684, 4523, 5106, 1304, -3991, -4231, 917, 4711, 1907, -3707, -5239, -1264, 3914, 3788, -37, -3661, -2627, 2880, 5893, 3042, -1989, -4060, -189, 3584, 3593, -997, -5416, -4474, 865, 3258, 412, -4977, -5630, -822, 3198, 2432, -1333, -4530, -2285, 2788, 4855, 1552, -3741, -4161, -114, 3750, 2225]
1103B225m677k898K150M600J641l375m773L73N295L639j599m804j656L088N071
1118D300Q73m332m768J335M311K690k508m576j732K843M112Q51l839l834J392
1133b882N001L154k736m250r03L529L996J70m764l491J513M417J954l279m455
1148c026n86K933L719m9m046k899J629N057K290l525l925j41L873L278q46m940
1164a204k708K081M442N99l822l858P33L594K838j502l660k170K551M840Q04l882
1180c24l330J082M037K599j940m598j531K646L603K82m246k822Q03M005K274k089
1196D51l271j324L132M330J04l332l018J252L981J569k399l946p65L025L087m26
1212B450m269k359J780M417Q66k259k943o78L706L321m60l727k369K400L562N00
$$ y = [2225, -2452, -5350, -3200, 1400, 3041, -334, -5107, -4734, 561, 4200, 2601, -2203, -3859, -771, 4300, 5173, 841, -3927, -2592, 1719, 4409, 1901, -2675, -4407, -1564, 2548, 3399, -440, -4274, -2882, 2119, 5273, 2537, -1713, -2616, 913, 4909, 5079, 315, -3176, -1663, 2754, 4708, 1429, -3026, -3612, -679, 3040, 2991, -1055, -3954, -2325, 2732, 5022, 1497, -2428, -2569, 1304, 4582, 3736, -1204, -3912, -1831, 2611, 3210, -612, -4470, -3737, -143, 2695, 1193, -2467, -4637, -2086, 2754, 3558, -324, -3654, -2572, 1465, 4064, 2124, -2474, -4005, -1359, 2244, 2526, -1720, -4542, -3739, 266, 2540, 451, -2820, -4144, -1012, 3318, 3422, 90, -2928, -1676, 2305, 3874, 1475, -2471, -3236, -211, 2876, 2450, -1819, -4178, -2398, 2019, 2885, 626, -2317, -2995, 711, 4032, 3572, -155, -2524, -124, 3438, 3938]
1228C938k894l294j0L376K232j508l899j650K639L593L38k297l006K37L977J936
1244C708j067l715q05J957L047M9l285k721O81L120J798k171l530o12K533K716
1260A703L58l259k331J727L158J541j498l490j94K385K550p93l129k055J286K650
1276F09J318k405l050k10L017K500n26l077j152J694L019J104k596k143R3K509
1292G04K047j145l258j019J577K658L04k146k434L05K895J756q35k527p43J761
1308a00K809J60k075j936N33K466J469k398k348n67J859K120l34k122k043J223
1324a284K452J254j365k060m69K349K002m88k076j296N14K415N8j378k307n04
1340b183K273J330p09j760j405R96K450N82j449j590Q5J765J610o57j929j129
$$ y = [3938, 1044, -2250, -2260, 1116, 3348, 1840, -2059, -3709, -1070, 2523, 2861, 564, -2442, -2205, 1772, 3708, 2641, -1074, -1879, 78, 3125, 3174, -111, -2832, -2151, 969, 2767, 596, -2934, -3546, -1013, 1703, 2061, -1198, -3529, -1802, 1356, 2897, 1399, -2091, -2285, 100, 2650, 1857, -1272, -3327, -2041, 609, 1927, -478, -3528, -3738, -721, 1779, 1253, -1824, -2976, -1282, 1737, 2841, 245, -1898, -1805, 704, 2751, 1606, -1652, -2671, -1094, 1564, 1868, -278, -2712, -2407, 488, 2244, 1409, -1118, -1861, -100, 2709, 2869, 794, -1142, -609, 1857, 3326, 928, -1420, -1987, -128, 1992, 1658, -464, -2507, -1284, 1168, 2422, 1057, -1003, -1472, 877, 2879, 2391, 315, -981, -467, 1948, 2006, 628, -1679, -2183, 90, 1420, 711, -1049, -2454, -1458, 992, 1574, 125, -1465, -1380, 385, 1995, 1338, -591, -1720]
1356a720J037J435P48j868j957J44J903J100j065j476r72J665J721O2j014j452
1372a709O83J534J060p03j750l35R19J166J63j699j411O91J303Q60o58j601Q2
1389a405J126J304L25j534o29R12J348O51j095j437J62J170O79l86j347r00L32
1406g24J465M90p82j364J51J181J239k29j367k04P15J005K53j163p48k46J029
1423G01P24o52j283n56M53Q09O21j091m18k55J339K66l13k86l75M11Q96k21o74
1442I6p19k65R97K42p69q07m98P65Q04L42r31o16K82J083K01r1k84l92O03N02
1462E45j55o05p21K48N82K66k82q47m05O77O87J21k74n35l4J199J52k90k47j01
1482a9M33O02Q7q26n84K20K86K86k51n05m50O78L15L50n09k52J45L89L84J55k45
$$ y = [-1720, -683, 752, 1500, -368, -2325, -2181, -278, 822, -243, -1719, -2691, -1026, 695, 757, -257, -1709, -1026, 508, 1568, 865, -885, -1220, -301, 865, 1028, -671, -2082, -1391, -88, 772, 114, -1487, -1405, -279, 1025, 1350, -184, -813, 99, 1447, 2098, 1003, -434, -272, 898, 1577, 1191, -156, -1056, -724, 741, 1231, 449, -915, -764, 417, 1656, 1427, 60, -144, 571, 1576, 1829, 666, -82, -328, 701, 1425, 773, -510, -1066, -613, 196, 817, -274, -692, -947, 392, 658, 345, 59, -316, 95, 991, 770, 96, -623, -888, 109, 351, -418, -1225, -1723, -958, -154, 188, -743, -1359, -1077, 6, 207, 116, -168, -560, 43, 545, 390, -215, -936, -688, -106, 160, -122, -969, -1374, -697, -10, 111, -163, -698, -732, 467, 619, 329, 82, -19, 414, 1016, 1103, 277, -307, -87, 199, 485, 234, -271, -721, -43, 272, 622, 113, -139, 6, 395, 779, 934, 689]
1503F89j96L02K45P7q15l06j12J59M57k30o48J7Q1L20K78m11r9j2L32O42k31n93
1525e4L7q9N04P1m16o54n99Q70K60l19m33m81L7R37L24M4n51j84M58P30q8m40
1547c6o87L22J63L73n3p70n67N25P16M7q23o58M23O81R42l17m37k42M80P38K89
1568A109j079m81J72N76L41j4j112j91N20Q37K6n87q48M83P71P45l00p78k53O79
1588F16P92K19j298q60N40Q10L91p81r13l05Q89N86qq91n48K03J179P85r65q22
1608c81m6O16J135m28j062p12L90J048N11j511p78j05R20J032l35j303q06P56
1626a059J551M00q09j005j09J359Q29p31j331m53O40J352Q3j279j145j43J718
1643a32M32k73j066n40J078J624L4j094j168M60J181O61o01j332l23Q96J268j04
$$ y = [689, 493, 795, 1040, 1117, 302, -4, -116, 43, 500, 270, -378, -361, -280, 40, 318, -93, -192, -204, 128, 770, 539, -54, -17, -106, 398, 469, 53, -601, -1200, -330, -70, -389, -822, -1303, -1266, -329, -5, 39, -512, -696, -238, 492, 404, -36, -723, -401, -238, 135, 82, -688, -1255, -730, -14, 33, -790, -1448, -1025, -344, 598, 281, -156, -398, 82, 820, 1109, 30, -451, -279, 297, 638, 624, -488, -679, -159, 678, 704, 117, -731, -248, 523, 1268, 968, 190, -63, 616, 1408, 1627, 329, -531, 9, 819, 1210, 429, -484, -789, 100, 686, 678, -213, -761, -558, 621, 1406, 441, -381, -427, 189, 1324, 896, -166, -878, -488, 560, 1071, -440, -1218, -1323, -403, 629, 294, -1009, -1815, -1059, 492, 892, 83, -922, -1031, 328, 1157, 426, -905, -1358, -718, 634, 717, -562, -1707, -1850, -132, 300, 27, -1039, -1579, -501, 1123, 1157, 63, -1105, -645, 536, 1197, 596, -736, -1059, -163, 1105, 1001]
1661A001j601p30M15J439P75r58j157k55J432J145N6j485q70P39J631M29j530
1678D76j283r1J550R39n07j699q20O96J795N41j355j439M41J186J042m33j401
1695c62q63J334J537L0j648j369K55J589Q56q92j861n25J017J556J52j469j176
1712a839Q97J604R57j008j677l63J391J271k34j610j139M42J885M46j317j560
1728a854n29K151J261k53j764j016J132K116J86j117j441j73J546J663p32j860
1744f84p13O38J948K50j484j718J69K187J069o94j638o24J500J401L71j745j418
1761a185N51J982R77j250j971l87J222J458k37j280j627N73K243J044j386j794
1777a067q9J775J658o37j849j098R41J599O17j264k139Q5J675J250l92k188q94
$$ y = [1001, -600, -1330, -915, 524, 1299, 341, -816, -1071, 361, 1506, 1562, 77, -793, -54, 1577, 2006, 476, -807, -898, 652, 1591, 1084, -615, -1435, -739, 1056, 1597, 242, -1197, -756, 430, 1472, 1039, -362, -1225, 109, 1646, 1676, 28, -1341, -1086, 503, 1359, 467, -1394, -1919, -902, 654, 806, -663, -1839, -942, 662, 1619, 611, -1066, -1429, -38, 1233, 999, -611, -1750, -1308, 577, 1023, -294, -1854, -2383, -232, 1029, 776, -988, -2004, -872, 1244, 1430, 313, -1128, -1301, 245, 1908, 1176, -684, -1397, -759, 1189, 1439, -45, -1763, -1594, 593, 1662, 968, -670, -1294, 206, 1607, 1978, 233, -1185, -634, 1348, 2325, 1075, -896, -1283, -61, 1397, 1160, -120, -1747, -1174, 1069, 2113, 727, -1067, -1156, 619, 2277, 1640, -209, -1307, -366, 1233, 1850, 586, -1553, -1468, 207, 1457, 1065, -1123, -2017]
1794b017J220J707O32j457j820L51J890J595j184j794p37R38K171qj914j910N29
1811a808K049Q68j083j793m61J451J872j89j413j444J093J660P85j246j753n2
1827a464J637J279l60j923j186J227J820L68j440j659O7J768J644m59j779j136
1843a596J449J804O21j753j776K24J586J416r84j682p86J269J451M75j800j152
1859a234K3J757J375o64k248n9J127J849k91j442j352O19J387J030j321j847j75
1876a466J389J535m53j845r02J001J560P18j347j510J44J387J517p52j847r04
1892a775R88J696M88j499j854L82J644J071p79j383o52O99J940L23j870j094N41
1909a134J777J141r11j787q18J224J507J4j514j385L49J746J089p43j941j12J255
$$ y = [-2017, -797, 910, 1542, 85, -1735, -1384, 506, 2101, 917, -877, -1614, -676, 1495, 1487, -427, -2337, -1808, 241, 1109, 26, -1767, -2228, -777, 1095, 906, -507, -1951, -858, 802, 1587, 341, -1412, -1464, 173, 1452, 1092, -831, -2017, -790, 1030, 1398, -42, -1701, -1634, 134, 1778, 1319, -460, -1596, -147, 1657, 2278, 525, -1251, -1027, 559, 1975, 991, -691, -1477, -208, 1243, 1718, -82, -1234, -1211, 546, 1921, 1257, -991, -1050, 77, 1926, 1635, 193, -1159, -540, 847, 1877, 556, -1291, -1466, -77, 1458, 1005, -840, -1742, -741, 819, 1537, 190, -1320, -1176, 211, 1728, 976, -871, -1775, -787, 909, 1397, -102, -1956, -1574, 70, 1141, 362, -1021, -1673, -974, 966, 1289, -581, -1675, -1134, 643, 1784, 873, -914, -1732, -508, 999, 1013, -501, -1886, -1537, 209, 1298, 555, -1386, -1498, -243]
1926b43J777o2j485j369P73J628P78j123j479j37R40J494l30j602j149P85J779
1943I75N70j223j525K87J554J396n90j640q57R38J306P12j791j201J99J479O67
1960A256j77j953p61J049J411M88j229j527M18J649J034q15j567n93J318J112
1976A113O0j618j333O93J655O63j040j771q5J137J371J8j944o70O83J910M31q98
1994C75j681L0J460J124m39j643p24N62J811J24j296j271L85J172J122l83j390
2011f62q11R52J799L17j317j146J39J269R70q16j322n09R57J411k51j079q18j41
2029a058J616P95n94j415m7R21J320k32j298q39N28J318N47q12j815p5J455R34
2047A249m05j205r60P87J300N38j116j130N7J233J062l29j456n68N40J181P13
$$ y = [-243, 1534, 1472, -13, -1382, -609, 1019, 1797, 674, -805, -942, -2, 1492, 1162, -440, -1589, -804, 975, 1545, 322, -1203, -916, 638, 2034, 1444, -196, -1053, -115, 1191, 1903, 112, -1089, -890, 589, 1256, 1079, -874, -1635, -586, 825, 1313, 84, -1443, -1025, 624, 1658, 843, -724, -1317, 1, 1113, 1173, -445, -1778, -1085, 570, 1233, 193, -1578, -1663, -526, 845, 863, -1081, -1751, -1068, 842, 1273, 375, -1306, -1276, 184, 1308, 869, -774, -1498, -936, 875, 999, -297, -1568, -1183, -11, 1111, 728, -662, -1473, -521, 1278, 1595, 278, -868, -729, 540, 1510, 694, -628, -1137, -180, 1231, 980, -99, -917, -1058, 558, 1353, 759, -656, -703, 218, 1538, 1306, 8, -831, -303, 1015, 1562, 750, -1065, -1140, 315, 1249, 844, -361, -1321, -534, 766, 1304, 188, -942, -885, 348, 1410, 1081, -375, -943, -403, 778, 1491]
2064A491j326j256j09J225O80l22j347n41Q96J220J76j041r72J70J208P27n88
2081B91j346RP80R26M1j014j059M70J230M68m24j547j81R68J028K73q54j253O00
2100e94J225N67o49j480P2Q02J070j42j036q10N43J131K68j020o42j73Q24J112
2118A068j86j012n07M21J338J44r05r25r4J197K44q6j098m64O20R24M35j072o78
2137f36j62J281O16m77j264j03Q45O80L68j154q38K99R52M65n88j113l22Q53Q74
2156E76n89j49j107P06P56M99p64n18n17R44R67m27p40r38N56J033N01r58p26
2175h95j88Q54P76m28r86Q1L97R99j68n61n35qR34N19l50n87o93L29J234Nq97
2196a68n88J88Q05M99m44p96Q4K70R95j10o40n07K61P40M88m31q00j89N53L47
$$ y = [1491, 165, -1091, -1200, 25, 705, 383, -964, -1505, -609, 611, 787, -254, -1226, -1056, 152, 879, 291, -1055, -1046, -266, 660, 701, -313, -1372, -902, 328, 796, 372, -1175, -1356, -388, 640, 913, 59, -1194, -594, 631, 1198, 549, -931, -859, -57, 1013, 871, -165, -975, -432, 699, 967, -53, -695, -868, -44, 1068, 882, -130, -637, -216, 1122, 1266, 361, -564, -658, 539, 783, 697, -401, -865, -245, 679, 1114, 42, -636, -798, 483, 1099, 622, -642, -745, 100, 780, 1148, -6, -844, -545, 407, 872, 284, -829, -1151, -298, 576, -13, -162, -1269, -563, 193, 692, -72, -590, -1107, -163, 804, 377, -363, -1301, -745, 288, 789, -169, -895, -1083, -229, 547, 119, -867, -786, -389, 610, 442, -119, -654, -662, 272, 791, 441, -146, -839, -510, 724, 729, -168, -756, -568, 237, 736, 292, -504, -420, -150, 845, 735, 95, -412, -151, 589, 1077, 646, -154, -343, 210, 557]
2216E57K14p21o74K87R77J05k74j229K25Q13N51k42n20l43K93O55L13q83n21J07
2236c10N04N32m15m58p47Q89L31m6m51n95K97O49L92j84p42l89O99O76j60p87
2256c15n8j85P11L83l86r81M8M45P81j88p58j94J32P08K93q0q12o5M93L30L11
2277F13q37j16J90N50K1l01o60M7N46M84qp90j79R2P57K24l81m37k4M55L00J24
2299F70q81l58M86N20J78l43n27k13M60O70l14n02k42L70J62M16l10m31j64J008
2319F55J8m82l51k64K14O60no92k22K20M25J98m34l94q3N01J53K60n37l18J41
2340c37N53N6l90n17Q6M78K87K6m65k47J99J33L34l08k40m97R73R1P0n62J4j90
2362d53M66L38n31j54j85L45J68J92o31K7L69K90L04n88k04K63n0N18k13j97J5
$$ y = [557, 771, 50, -624, -337, 640, 745, 471, -758, -533, 280, 831, 589, 69, -274, 19, 674, 987, 104, -417, -310, 194, 726, 311, -147, -894, -5, 326, 280, -171, -766, -469, 180, 572, 388, -354, -743, -44, 632, 472, -315, -373, -558, 153, 536, 150, -831, -783, -338, 443, 255, -503, -697, -565, 143, 436, 356, -456, -521, -28, 302, 613, -224, -340, -150, 400, 421, 120, -540, -493, 53, 537, 529, -261, -440, -348, 409, 633, 252, -185, -209, 246, 546, 670, -211, -569, -83, 437, 615, 272, -255, -468, -8, 662, 348, -154, -396, -26, 136, 552, 242, -189, -353, 655, 673, 191, -160, -424, -210, 450, 445, -247, -469, -249, 176, 374, -60, -454, -537, -36, 117, 377, -160, -478, -337, 216, 272, -118, -635, -549, -71, 216, 242, -223, -470, -271, -138, 196, -112, -352, -849, 124, 215, 285, -277, -263, -453, 13, 351, -180, -334, -519, -174, -6, 186, -445, -418, -49, 241, 545, -43, -247, 16, -34, 484, 271, 74, 89]
2383H9l1J23K68l57p0j61K51K26j7j31l68N2L63J15p9l92L45L6L49n27J6k07N9
2406d8J79J69k92j18J91j13K42l2k29l11M26J46O3j35j58p9N14k96J60k52k40
2427b13K10k46L43k00m01J53L42l02k9Q3J98m30M28J99l29j54j35N42Q2k58P9
2448c8l91J42J02K32j57m61M79J7j60N61m98m03M95J12N8j39P3J9n0J81j3j82
2470b1J52J02P8J95l44l64R0rP27n86j07K40k98N62r7K07l02j20J69L2j35j66
2492Ek63J43M52j81l43j37Q4M95l82J48L4l01L41K61q9j22j84l02L46n9J14J44
2514B04k68j97J02R5Q1j53l03N62J1J63l07k02k2J39J64P1l11P2N5K18l20J99
2536E3j92j65M6L91m48k75J90M47J36pl86j11K61L70j5q6m54J94J66L25j94m77
$$ y = [89, 58, 181, 449, 92, 22, -139, 112, 338, 321, 190, -178, -126, 237, 352, 273, -119, 226, 262, 611, 84, 100, -107, -48, 131, 300, 8, -110, 81, -32, 210, 178, -51, -362, 64, 210, 273, 138, -20, -99, 415, 119, 279, 27, -213, -3, -249, 94, -106, -507, -354, -12, -314, -343, -260, -62, -492, -64, 135, -194, -348, -483, 59, 141, -117, -38, -429, -287, -185, 47, -110, -571, -92, -75, -235, 326, -172, -575, -80, 32, 90, -49, 24, 43, -7, 174, 161, -21, 131, 233, 311, 506, 162, -202, -112, -121, 606, 20, -87, 153, -145, 417, 320, 527, 225, 105, 274, 306, 171, 5, -258, -115, 337, 156, -187, -324, -240, 255, -127, 21, 55, -246, 95, 356, 267, 145, -39, -341, 5, -54, 60, 204, -64, -261, -159, -64, 17, -136, -439, 123, 134, 297, -10, -212, -234, -95, 69, 140, -171, -99, -44, 174, -146, 53, -139, -304, -258, 133, -315, -590, -400, 47, 183, 176, -210, -321, -60, 310, 295, 209, -245, -51, 115, 440, 246, -231]
2558b31r0L10K35J95l65k36J04L18L26j05o31P4R8N24j84j06m18L01J91l8K5m80
2580a83k92K00N01K08k57m08o5L71K17l33j76nM84j8O9k97j4k95K89L21j53l31
2602a67l06M39N16j50m33m82J50L11L14k73j03j94M63J39j5l35n29O32R3R0k73
2623a13m71J22L47M50m02l70P5N2M63J0Nn46l2O54K14p3n88n4L27k9L68l18k21
2646a30l28M52M12k98l65n3K80L73M5l57Ln7K12N13o3p28R3K18J27L3n29j78M56
2669A31K41J21l47n10l0N10K31P7m11l19Q6L84L90n76j05j14K74L48k11m93o0
2690c83j12Q20j35m93k16J61N25K58Mr14J6M46K93J58o93m04m4O33K3K36n67p0
2712d58L18L10k5m33j70J60N82O8j16p84n2M82M59J9n09j75J86K39J46l32r4l81
$$ y = [-231, -321, -11, 224, 419, 54, -182, -78, 240, 566, 461, -170, -96, 2, 526, 342, 236, -182, 119, 310, 272, 297, -183, -475, -275, 226, 434, 177, -231, -296, 75, 292, -41, -217, -222, 262, 244, 313, 16, 2, -293, -4, 317, 164, -167, -473, -34, 482, 332, -101, -583, -433, -122, 192, -81, -184, -378, 85, 224, 209, -126, -655, -23, 70, 160, -113, -584, -462, -115, 335, -67, -437, -362, -310, 153, 163, 168, -378, -410, 244, 458, 385, -203, -257, 70, 41, 409, 91, -130, -458, -6, 406, 108, -257, -310, -30, 343, 388, 31, 34, -23, 189, 702, 639, -89, 4, 222, 349, 382, -147, -325, 131, 372, 493, 146, -364, -394, 116, 347, 424, 13, -306, -220, 164, 554, -22, -127, -241, 33, 381, 170, -323, -383, -495, 325, 190, -303, -519, -358, 167, 425, 429, -485, -469, -23, 270, 428, -265, -669, -713, -80, -57, 179, -388, -458, -140, 170, 145, -288, -458, -298, 284, 352, 236, -548, -600, -118, 341, 360, -149, -324, -138, 101, 247, -85, -179, -560]
2734e60L61Q71n04j09n31J12O89L44o43k43j69M52O00J5p30l04M86J65J31k67
2754A66l58jN38K0j17m00k44M92N37K2n73m61K21M91O9nq82R1L21M86J32q26l9
2777c20L4K70L44J16p55m7L87L88r0k48n34N8P17m1j95p86K0N22M08k26m08Q0
2799c06L24J67L24o74n76K34O57p5J31n29q3K64L86J67m72k56j17M52M47m24k33
2820a92j99M11K96j0m34k0k00R36K00n04l22k07K97M14J66q77q6K60K87L28k65
2841B79n30L8L76L44k73k00l63K33L55M37o34l54R4M05J26m8m21j67K38M18K08
2862E61p76Qj05N78j7q9l52j77K25N91l5k75l92j7M55J20N0q96j25O81P8L46p39
2885c02j43K10O36n6mr03J88K13M07Mn08m36N81PN02o03k87n8N32L02K09p61j23
$$ y = [-560, -199, 672, 168, 59, -472, -360, 329, 673, 30, -213, -382, 70, 670, 685, -45, -349, 137, 302, 433, 166, -192, -193, 345, 365, 248, -152, -396, 96, 633, 655, 82, -379, -158, 333, 402, 397, -485, -394, -73, 413, 545, -281, -320, -286, -16, 328, 444, -311, -358, 29, 417, 327, 79, -455, -397, 320, 279, 84, -702, -682, -160, 248, 22, -386, -306, 18, 185, 509, -165, -741, -507, 150, 75, 206, -323, -406, -142, 244, 411, -61, -317, -434, 18, 465, 41, -192, -391, 20, 316, 306, -128, -148, -348, 588, 788, 284, -38, -245, 52, 466, 632, -245, -331, -71, 216, 544, 279, -251, -213, 163, 507, 234, 34, -329, -96, 259, 696, 62, -292, -198, 207, 333, 285, -136, -303, -65, 353, 561, -215, -207, -312, 266, 249, 160, -192, -369, -144, 447, 412, 137, -255, -272, 183, 303, 353, -543, -668, 13, 91, 437, -302, -445, -235, 401, 345, 341, -562, -374, -161, 246, 250, -258, -694, -113, -106, 396, -207, -494, -552, -20, 282, 491, -270, -393]
2908c93J12O19R2m05n10P5P23J74J30p57r0R2M80J54n12k94L08L8M28j92o06j
2930c35K29P36k87n39k89N27L40J62k89n59J29L85K30l43k55j53M36J35J06k91
2950G5l21j27N34J56q6m92k36M39l9L85k96j60j80K84N6J50m06j07L11K46L06
2971D92m74m68P6N70M8kn49j1K52O30o2m26n35PM26K80k32k67l02L41L46q5j91
2994a36l59K45M31J40j97m83K93K13L27m03l71j1N8M38J14m54Oj93N36K10k01
3015B03m61k90M37L28K97l78l65j6M29K61p1o02J1L12J58k16P9o87L17L94J65
3036C05l3m95K02M7L14K40l51l75k65L11K79j7j64l94M02L42l03l65k55K52O18
3057B95n1m07j80lK16K06Lm51K63r8L44L14n95j9l0L62K21k78m14J34O8J69R1
$$ y = [-393, -281, 338, 430, 25, -485, -410, 313, 487, 617, -140, -230, -138, 342, 496, -16, -310, -2, 36, 464, 272, -334, -335, -106, 630, 343, -196, -485, 42, 382, 544, 255, -304, -175, 210, 440, 97, -158, -311, 125, 260, 366, 75, -246, -373, 161, 317, 231, -261, -497, -58, -97, 288, -8, -168, -348, -64, -8, 142, -264, -371, -60, 186, 492, 18, -450, -374, 196, 244, 242, -307, -318, -66, 564, 502, 76, -459, -452, -26, 254, 22, -245, -547, -206, 140, 55, -136, -495, -250, 181, 321, 124, -359, -66, 147, 474, 71, -300, -311, -253, 185, 299, -155, -149, -342, 194, 404, 203, -258, -548, -111, 217, 514, 136, -229, -245, 184, 445, 374, -228, -217, 95, 253, 37, 116, -571, -254, 140, 305, 272, -223, -21, 26, 340, 580, 229, -146, -411, -100, 179, 162, -2, -396, 6, 348, 45, -320, -575, -323, 295, 244, -163, -343, -346, -130, 76, 79, -372, -109, -207, 137, 451, -144, -163, -193, 169, 390, 112, -302, -168, -100, 69, 160]
3080A60k62j99L38k7J27l0n03qK21K39K92l35k71J18L99m4j1k81j15J96M09j79
3102B34j76j93K25K91rl24k99J26J36M00l52j29N9O1J15q8O2l24j0K90P5r9rM4
3126A06K5oJ15l21k53L44J26K62l24m27J47R4K83K12m75j92J15l1K48J00l74l17
3148e43M65J68O0J9o00qQ21p5k93n45Q6K73M46k47m9l80L78K64k82j91K19j83
3170a97L94p2K08p12O7M23J3J97l78l89M88j64M64n30J4o8J01L95J80n11J06j89
3192a60K32K47l64J76j64J38Q3J09n76J66q0M82l0r5k06p5J05K94oj81j71Q3L08
3215C15l1m21Q1k12J24M17l13l66K1J21L80j66k9j55j01K27L16k53p0l2R8j21
3237a70K38o5r3p7K04P8j62r7q8K50J27l3j23j5j89J33P9j0l27K10J2N12l18k01
$$ y = [160, -102, -301, 37, 10, 137, 107, -396, -404, -183, 56, 348, 13, -258, -140, 259, 215, 204, -77, -192, 4, 413, 234, 58, -135, 90, 381, 372, 48, -251, -125, 11, 411, 59, -70, -11, 50, 165, 77, 139, -185, -195, 95, 170, 71, 62, 106, 131, 125, 240, -81, -334, 10, 136, 398, 74, -353, -206, -112, 171, 383, -92, -284, -169, -200, 48, 148, -226, -543, -78, 90, 150, 169, -431, -439, 382, 307, 14, -531, -445, -172, 274, 27, -22, -402, -24, 240, -42, -233, -14, -197, 197, 125, 333, -379, -312, 111, 124, 321, -57, -446, 42, -122, 342, -188, -174, -242, -141, 254, 434, -77, 29, -160, 72, 319, -45, 131, -33, 105, 188, 297, -279, -113, -193, 289, 259, 164, -42, -117, -12, 282, 276, 95, -76, 7, 315, 284, -137, -56, -268, -144, 273, -40, -406, -385, -264, 116, -50, -79, -234, -335, -108, 208, -45, -115, -147, -49, -170, 68, 3, -90, -167, 37, 115, -47, -144, -232, 18, 145, 112, -11, -26, -215, -82, -3, -13, -340, -130, -118, 394, 76, -125]
3261a25M9J06J37n8m2J49k47j26K94q6k24j15L31M0k29J85J7k22K15K80J47n71
3283i5k8k46L63P4N8r5K15l30J40J71j63j70O4J88kk8p9J40J23j31o2J12l45l6
3307a62M09p9j17k20j03J96P5j09J77j9J20m30L39L3l61R2O9K0L8k50p7K98j38
3330a99J27m30M01P2k40J69Q5Q0j88J71k44K69l21P4K06j12K13j89j60K28J27
3351A39l12K68j58M3j19J61m3N0j58%K70J02k79K4j38J08J72j52K9l69K72J86
3373I6P3j19J31n9k71J61K52j86N4j92J71Q9P6l61J20n0L74k90P8K7q6j73K24
3396A39Jn1j00P3K49m39L13k06n2L7K1J84R1l77L10k89J80q2pj40J89R2j90J09
3420E5p5j42r6J27j6J50L9l63K51P6o8Mm4J9N2l0O9Q3k18Q8J36k7j91k94K77K28
$$ y = [-125, -76, 30, 167, 109, 67, 216, -31, -157, 137, 51, -173, -288, 43, 83, -146, 39, 56, -166, 49, 329, 476, -95, -123, -369, -6, 68, 126, 31, 246, -84, 56, 227, 64, -106, -42, 146, 144, 116, 37, 177, 300, 169, 107, 219, -126, -162, 247, 168, 51, -169, -272, -76, -1, -110, 67, 48, 168, -262, 77, 110, -251, -159, -90, -70, -32, -282, -359, -61, -199, -72, -502, -101, -29, -269, -100, -15, 65, -123, 48, -196, 73, -248, -174, 32, -80, 133, -56, -216, 12, 139, -173, 95, -63, -20, -139, 22, -21, 29, -129, -129, 141, 243, -36, -12, -150, -42, 130, -22, 7, -362, -90, 96, 169, 50, 181, 122, -149, 12, 264, 78, 132, -60, 111, 200, 276, -85, 35, -15, 359, 69, 147, 174, 88, -85, 139, 140, 89, -11, 62, 311, -128, 185, -21, -73, -36, -15, 169, 260, -117, 193, -96, 84, 2, -5, -145, 44, 136, -54, 55, -20, -162, -258, -131, -147, 3, 42, -321, -70, 6, -62, -58, -102, -83, -31, -61, 8, 91, -127, -39, 97, 70, -121, -415, -138, 90]
3446I0K50j89k64o6N7K95qm27K99Q6k42K68pL9k33J02J2n6j98m7L59R9O5k55j65
3471a36n2N06j35j23j01P6J69m12R5j17K08M9m3n6n4M77l31j7K98k66k18K96l85
3494b72L26L1m7l44K64L67k00o1k60L29l49K69k26L85k51l9L30k19j37k7J00j57
3516a88L15j36k2j91L07j82K59j16j21n28P29rK4l45K06l3K00r9J27j95j36J10
3538b4K20j56k9k14K59j65K25J42q8j55j57J48K1m5jM2oK25j11L8j46k32L93j6
3562A68l72j98K19L01j03J28k18N7J77J08l12J4M7lk7J11K17k80k78J31k4k3q9
3585b49J16L9K66q7k51J0K21q5K61k80k64K49K3P3K97k05k75k8J70OP3j49p5K9
3609a15K03p3k2K8j34J72P6j06j57J18l5M3J36l03k07M98J09j21j50M7n8r0L15
$$ y = [90, 340, 151, -113, -179, -122, 173, 165, -262, 37, 123, -119, 149, 142, 181, -52, 50, 62, 6, -192, -239, 120, 219, 284, 29, -136, -188, 318, 183, 60, -41, 35, 204, -208, -113, -230, -22, 27, -16, -72, -126, 351, 20, 3, 301, 35, -183, 113, -272, 54, 85, 38, -306, -42, 325, 125, 64, -196, 133, -216, 53, -173, 212, -39, -78, 252, 33, -104, -131, -31, -188, 127, -9, -31, -222, 85, -97, 162, 46, -75, -603, 126, 117, 141, -204, 2, -31, 169, 70, 197, 2, -134, -24, 196, 40, 11, -203, 56, -109, 116, 258, 170, 15, -142, 6, 27, -18, -19, 23, 17, 242, 131, 169, 23, -209, 184, 168, -204, -402, -183, 118, 15, 143, -75, -18, 159, 267, -45, -31, 16, 13, -14, 97, 314, 34, -244, -113, -137, -160, -249, -133, -94, 172, 85, -166, -156, 65, -20, 241, -39, -303, -54, -31, 42, 339, 134, -141, -169, 1, 7, 80, -69, -144, -115, 88, 15, -7, 21, -113, 59, 135, 29, -128, -10, -45, -2, 134, -169, -376, 122, 231, 110, -40, 7, -51, -141, 174]
3632A74m1J2J6k58M1J30j38k10L66J23J7J02k09l62M72j75k35N6m0L28J66r5r3
3655A47k20M7K9J93J69j06l89p5K69L15m09j70J02M7K09j74J39l75L36O1J33l01
3677b3K1j91M75l40J49r7j1j32K82j34j34J8m1L33K4k5j73j92K21O6l4r6j39%
3701a73j2K12K00j85o9mK31l16J65j53K49k78K50q2k33k6P4J10L32r4j37j15J60
3724A06O1j76L7j49J26J80P9k10n27M71J37m4L07p63M85j46J80K4l65l0J27K7
3746f3K30l08J30J75l3l9O9k94l0L72j91nk95J16L7Q2P3K4j09k86K05K37K37m88
3770a54K04j56J72j77K14m31j99N69K36l02P9j81J64%j09J22j76Nr9M51k46j31
3792a45J1K7L12j50k50R2j20K27J18r2k14J80n2J55j4j65j52J90J14O5Qm28L10
$$ y = [174, 133, 145, 161, -97, -56, 74, -64, -274, 92, 215, 232, 334, 125, -237, 235, 60, -175, -119, -159, 169, 335, 240, 147, -73, -26, 3, 196, 365, 259, -130, -205, 64, 379, -30, -200, -98, -51, 158, -16, 123, -252, 84, 145, 278, -23, -2, -193, 282, -58, 91, -6, -17, -149, 133, -1, -135, -117, -158, 175, 199, 174, 1, -191, 30, 96, 62, -34, -173, -173, -185, 27, 227, 42, -27, -31, 200, -116, 49, -104, 145, -133, 117, 35, -198, -224, -150, -40, 292, 198, 61, -54, 106, 167, -9, 28, -121, 5, 185, 264, 54, -473, -2, 135, 91, 398, -365, 120, -26, 154, 178, -187, -217, -90, -63, 167, -141, -11, 164, 131, 92, 161, -133, -163, 209, 18, 13, -282, -166, -129, -47, 26, 50, -59, -345, -140, 97, 334, -154, 50, -106, 66, -111, 103, -328, -527, 42, 278, -24, 55, -126, 38, 38, -71, 51, -125, -120, -219, 232, -14, -145, -134, -107, 205, 55, -195, -103, -223, 4, 122, 30, -184, -4, -56, 99, 85, -80, -232, -42, 72, 137, 145, -283, 27]
3815B7k52J41J86m2Nj85N50k83j19N1l12K43J94j6j62l34J28J15L08l54J32k73
3837b52J46N41n18M18n88NL49p4j2J5k39mK25O6pj57L23l15L16k72k28J69M42
3860C49j46j10l44n1P4N1L26r4jk13L02L4p1j64m8R3M8J92m15q5J01N4J04N0J1
3885D7l47J81L33j61k76j81L54J53m4k41J13l18L32J70J7j47l5k86M76j38K17
3906B19l60O2K38j07J86o7k49N6J12lj01J99j81N6O6K7j86l78O03k97K54r6k72
3929b19P7L72J8l15q4k76Q5K77K12j14L6O0o7K9on3j64J76q5L2Q4l09K20J22J9
3954A27j25j59N8p8N47o17K75n7j29J25Rj07J54j30K2M02l24L1o3J71j64K37p5
3977A30m00P3J14J37j29J84j42k7J15P7o2r2p3J5L42k3l59q6Q8O84l32k88J73
$$ y = [27, -225, -84, 102, 60, 65, -120, 430, 147, 28, 79, -233, 10, 204, 188, 26, -308, -180, -65, 243, -111, 21, -252, -106, 435, -83, 335, -253, -248, 101, 27, 15, 30, -209, -213, 12, 78, 71, -86, 237, -78, 238, -34, -262, -93, 349, 203, 93, -251, -302, -228, -177, 149, 55, 54, -159, 143, 177, 106, -58, -106, -13, 35, 227, -188, -273, -172, -118, -14, 36, 47, -300, -119, 214, 53, -223, -404, -50, 103, 59, -182, -69, -387, -55, 115, 132, -15, -50, -336, 140, 2, 219, -141, -79, 159, 52, 238, 171, -78, -22, 90, 87, -14, 185, 4, 60, 126, 153, -33, -411, 192, -105, 149, 53, -219, -142, 230, 248, -67, -151, -427, -342, -65, 147, 33, 69, 129, 62, 91, 85, 32, -132, 44, -41, -9, 75, -234, -14, 108, 127, 2, -157, -99, -177, 370, -247, 28, -29, -158, -33, -24, -131, 23, -107, -85, 317, -7, 24, -39, 132, -32, 205, 130, -270, -197, -83, 54, -75, 109, -33, -60, 55, 132, 70, -22, -95, -80, 262, 239, -120, -206, -118, 566, 234, -54, 119]
4000A19j82%N53m42L3j80j52R7K08K6Rpl9K98j70j94J16J58m4p2k66m2N5J17J33
4025A32j9m22Q1Q7K71j10k32K67j40L55j63l38j13K69L02k75k2k57L57K85l42
4046b7J32k19k24K79J99J41l54J9M9M0jJ77k61j84J60K7p9j0j06L16J30j79J20
4069A45M3j06r1j99K54J32n33K00K31j9K15k91J01p7j31J80J6j52o8J29J24j92
4091h9L9j81L88J6q3n4k01q4L39r8J7m3k38L51o2J61r8p7j59L94k06q6NK36n8
4116A29l8o5L9j63J7J63j23K35l97K69O9k15K57m19K01l49O92l16m3l5j68K55
4138eK70k44k45K27j87J81j19N8O6p3J29p4J19j33J8J13J91l34J6j40M55j89M
4161A04j67k34K38J84O2l5M5k99ON3L12l43J1j67K88m5j4r5P2j33L61k88J41j26
$$ y = [119, -63, -63, 490, 48, 81, -99, -251, -154, 54, 80, 89, 82, 43, 341, 171, -23, 93, 251, 207, 135, -131, -173, -118, -1, 132, 113, -309, -228, -141, 130, 20, -212, 55, -85, 270, 107, -231, -344, -75, 227, -48, -70, -327, 30, 315, -27, 105, -114, -338, -59, 140, 281, -73, -54, -5, 35, 34, 211, -50, -234, -74, -47, -126, -136, -242, 74, 204, 25, 145, 188, 82, -9, -208, 46, 178, -355, -155, 76, 57, 272, -19, 82, 5, -126, 54, 70, -82, -150, -21, 103, -89, -50, -231, 157, 173, 90, 36, -165, -249, 90, -8, 9, -34, -272, 79, 17, 178, 80, 3, -156, 238, 32, -54, -49, 187, 129, 91, 26, 65, -98, -81, 82, -41, 194, -203, 66, 135, -80, 177, -242, -41, -390, 302, -14, -57, -92, -260, -5, 265, 21, -224, 3, -184, -3, -122, -64, 2, -71, 58, -16, 103, -30, -12, 101, 292, -42, -26, -166, 289, 100, 104, -63, -297, -59, 125, 187, 152, 197, -102, -96, -43, 269, -74, -63, -230, 58, 13, -1, -96, -24, -157, 204, -84, 57, -69]
4185f9j15M3o2L3K00j16J41M0j14M0k00K67k29L19k49P9K7j38L02P5j40l20M63
4208B77j08l12L3j21K44k65M60k48J10j57J01N1N8J12l72o0J82J12j21P5j71q
4230a28K81j68J59j64J65k86o4L49k17l2l56O88p7N2j08l27L52J4K08k91q9J45
4252A06j77J12j7q1J67N2r0j15o0R4r3p8K05n9k86K09J74J20k77J19K37j30Q3
4275B15k47P9k36l3K86k24M25l24O6K47k77J56j0k05%o7L85j85j33L20m38K00
4297@O2p3q3Q0j01K10OK15l26J96j01o3p1R0K2k33O4M7J9N9l3l4K40l28L30r8
4323I6k2j99Jr2Q6J03q9n7J99j77J37J1Q4k35L43k2J07k73K02m55M01r9k1n3R1
4348F7j63K7J30k12R1l4K06j79r1P4k1J10J01k30K73j33j79K61l45L31K83o56
$$ y = [-69, -184, -141, -203, -170, 30, -86, 55, 95, -19, 21, -179, 88, -141, 178, -71, 8, 35, -103, 199, 274, 134, -186, 277, 169, -143, -110, -231, 13, -252, 208, -40, 70, -87, 14, 65, 123, 235, -137, -197, -15, 97, -24, 51, -120, -128, 153, -15, 144, -20, 145, -141, -205, 144, -73, -105, -461, 227, 150, 202, 94, -233, 119, 133, 341, 50, -39, 106, -71, 41, 24, -57, 110, 162, 72, -43, -103, -9, -102, -180, 25, -34, -320, -111, 63, 183, -94, 25, 262, 132, 215, -32, 47, -189, -222, 64, -160, 265, -59, 7, 254, -23, 133, 123, -82, -82, -149, 236, 51, -82, 238, -200, 0, 62, -11, -94, -14, -115, 95, 101, 316, -10, 186, 85, 22, -49, 41, 63, -170, -106, -59, -40, 19, -14, -48, 192, -136, 194, 96, 74, -125, -124, -216, -130, -27, -116, -173, 26, -151, -14, -3, 81, -154, 189, 167, 274, 1, 203, -252, 149, 50, 29, -24, 67, -96, -69, 61, -151, -60, -94, 112, -67, -158, -84, -105, 5, 106, -124, 149, 16, -163, 98, -247, 84, 367, -289]
4370b89N25j21m9l8j75J95K0KL5j94L21j84j53M2J08j2k1o2L04l57L8N0j03L32
4394B14k27j72j2J03J58j02j81Q4j36L54O9j02k9o1K3J73j3k71n7q1M45o6l63
4417b50K88j06m7K97m06R9lL0K2J16o2R5q9OM2r0J89j16J11j06J65l57K9J81J2
4442E0n7KN2k62K56j4J42j67K10j7l07j93L40R4o7P2n7R0k89R0l7j26J40J41n2
4467C4k24L34j26r2L8L09k52J72k07j68Q9MJ1K08Q7k15p5K90j56k73M0P7K01j04
4491Br0j87K58J5j07J84onj57L17j30k61K85k13M74m29j74R0k00o3P88j89j83
4514A9j8k94J71N0OJ54n0mk2J43N4o10L36kJ27j97o2o6M01n8j32Q5l6m3o5j49
4540b62M53Kl0p8j48j01J34m7k20M31j07K8j63kpJ36M3k45K57P3k64K30p9K14
$$ y = [-289, 236, 115, 66, 28, -147, 48, 68, 70, 105, -89, 232, 48, -105, -63, 45, 33, 12, -50, 254, -103, -65, -15, -118, 214, -13, -185, -197, -94, 64, -38, -219, -135, -271, 83, 152, 50, 21, -40, -17, 156, 143, -128, -185, -266, 179, 113, -250, 38, -68, -115, 182, -224, -125, -128, -98, -76, 40, -22, 73, -16, -10, 32, -58, 131, 15, 126, 20, 185, -172, -143, 38, 50, -7, -5, 47, -215, 41, 27, 169, 2, 212, 195, -112, -305, 35, 129, 62, 134, 77, 167, -122, -32, -69, -195, -55, 86, 34, -190, 144, 18, -74, -36, 273, 21, 193, -14, -182, -93, -89, -78, 130, 217, 2, -73, 217, 61, -212, -172, -95, 106, 2, -88, -275, -17, -2, -109, 75, 69, 64, -93, 224, 94, -167, 118, -95, 379, -50, -224, -134, -334, -397, 391, 202, 19, 1, -293, -122, -72, -66, 88, 38, 34, 12, 155, 209, -401, -65, -67, 60, -137, -199, -265, 136, 78, -54, 31, -5, -48, -113, -262, 191, 193, 163, 85, -63, -164, -30, -77, -297, 134, 27, 55, -108, -110, -117, 19, 62, -183, 74, 147, -117, 113, 34, 248]
4564B48j23n8m5j27j62K34J97k44K71k63K48k76J41J78l36l2O1K10P1l4k70p5
4586a86K09J31M6q7k64o2K45k1Pk56k1J72J02j66J66j53l30N05N6l1J2J5j25r5
4610a31K41k8p6J5M8ljn2J63Rk70Q7J40m06L44q2K35m12J51J96k24K48k45J16
4634F3M2K4j14M6k54P5O0K59k87j08J78j00L20r8n2o3j43L41j54J07k4j27l63
4657c72M68J43k30L21m44K28J9j2j71J4J32j7o4N1m0j79J24K0J87pl54K36l9r3
4681g9j02O4k3o8J59no7n6K2J77p2J26j92m3J38J25j88j17R3r8O4K17j63l5N1
4706g2J65j99J49r9j45M53m81K34J88r1J41m6k41N2j14j12L30L2l49L42j86M8
4728amL12l71J45l6j23R6R1k43K62j77k86J80J36n9p5K68J55j53L8l28J28R8J34
$$ y = [248, 125, 67, 22, -105, -267, -33, 164, -80, 191, -72, 176, -100, 41, 219, -117, -149, -88, 122, 193, 159, -111, -186, 23, 154, 200, 113, -151, -213, 32, 11, 18, -238, -259, -87, 15, -151, 15, -138, -468, 37, 93, 62, 74, 89, -36, -131, 110, 82, 6, 21, 69, 66, 65, 13, 176, 185, -85, 2, 142, -264, 80, -2, 233, -179, -28, 168, -56, 192, -53, 63, 105, 129, 15, 61, -193, -118, -58, 201, -86, -194, -16, -116, 204, 106, 54, -9, -152, 189, 35, 142, 118, -9, -372, 96, 239, 9, 330, -114, 114, 133, 121, -50, -36, 96, 79, 15, 66, 26, -153, -29, -9, 178, 171, -183, 53, 14, -79, -181, -117, -140, -208, -49, -54, -121, -177, -155, 22, -50, 76, -116, -159, -21, 104, -84, -201, -108, -206, -142, 75, -88, -123, -72, 93, -106, 43, -56, -201, 252, -229, 5, 193, 102, 243, 197, -44, 8, -106, -218, 112, 144, -205, 137, -49, -1, -5, 307, -64, 81, 45, -78, 18, 109, -134, 128, -49, -335, -155, -19, -78, -153, 115, 270, 117, 155, -173, -45, 53, 187]
4752A87l09L5J51j88J15q7R2j55N8n8L98k91j22J36M0N9q0Q2J2l49K60N2m22R0
4776b94K89j83K38J56kk89K76k45M8O3j33K97o0K2l45J2n4K79J65k36j09k38L67
4799B4l1L8p3J84l68J52MJ64j98j5N9J84J92m51p8J91j40M06l39J91k62J60K5
4822A9J65o3l23L21j50J49j91K19l75K50J1M8j16O7j05m6K36p0j46L67l35K47
4844A79n9j60JJ43J16j78l5j3k07J21R9lk13L69k90K97j44Q0j58o9J24Q6j43k60
4868c17O1J65L50k01J10k10N4j9J8J65l1l28M94j95j05J74m15L55M2J00l57j89
4890b79K88J49r2j49o9k7K4M21k27k5K32l31K25qJ24k75Q7JQQJ10j87p9M0j60
4915a91K52k29J03R3P7j40K33Pk17L15n37J64K45m70J96L01k99O6j74O3L28l5
$$ y = [187, -122, -87, 64, -124, -9, -96, -4, -159, -101, -159, 239, -52, -174, -38, 2, 61, -19, 63, 75, -274, -14, 38, -384, -294, -5, -188, 50, 206, 204, -85, 191, -54, -6, 57, -76, 221, 161, 183, -162, -150, -204, 75, 240, 4, -105, -343, 24, -7, 31, -42, 142, -226, -74, -70, 94, -104, -119, -60, 124, 316, -135, -213, -22, -162, 244, -95, 96, -166, -6, 19, 184, 121, -202, 119, -31, 118, -73, 146, -229, 21, 32, 80, -36, 31, -74, -120, 116, 46, -100, 267, -68, 179, 120, -40, -39, 104, 220, 42, 7, -6, -213, -92, 7, 4, -209, 160, -130, 167, 23, 103, -55, -124, 0, 86, -57, -317, -256, -91, 259, 58, 168, -42, 12, -7, 11, 176, 145, -183, 311, 116, 11, 185, -230, 125, 167, 267, -90, -279, 9, 158, 66, -83, -152, -179, -155, 266, 39, 14, 246, -85, 140, 132, 256, -19, 68, 69, 77, 85, 195, 8, -71, -31, -191, 61, -168, -65, 28, 105, -35, 198, 205, -12, 303, -234, -70, 175, -295, -99, 202, -97, -31, -205, -142, 186, 151]
4937A51l49K18r0J6L07m80R8M7R3o3J33j24P0P3k80M72l20J26q1%o5J70k49J82
4961E5l64q2M15J68k45K66j29k28L4j64J68J29j40J64M3L0l50K47O5l16RL97j66
4984Fo6M4J07l95M51k78J40Q3R5q8k14K29J43m13K42j5p2j5q8K12j22l13M51j56
5008c2k23j03O78l07j35J30K0k63K88j37K77j9k87j77K55O8N7k22R7NM0k0O2R5
5032A47j52j20m5L45j90j80pL01k22j64R4J95k9P9o4j3M1K50n4k32o1J31k19J67
5056bl9J05k0K36l07N1j34J63j06J22P6p2N8j61j1N4P2O3j90j13j22M27P7k77
5080e0J75j79J57K08k11K0j58L02l19J2O1L4k80K70O2k96N81m07j4j54L24l09
5102a71J42r5J76N0k15J22m2l5O9J94o06L30Kj00J70L0j28p8J10J45oj40K29k47
$$ y = [151, -198, 20, -70, -54, 253, -227, -129, -82, 11, -52, 81, -43, 27, 100, -180, 292, -28, 98, 17, 17, -48, 122, -127, 55, -309, -391, 24, 192, -53, 213, 84, -144, -110, -274, -106, 23, -117, 47, 90, 120, -230, 17, 82, -234, -225, 172, 6, -60, -16, 91, -304, 147, -131, 9, 92, 187, 99, -115, 114, 257, -156, 86, 71, -1, -16, -104, 108, -14, -327, 124, -32, -255, -358, 320, 13, -122, 8, 28, -235, 53, -84, 193, 174, -113, -290, -35, 33, 90, -132, -35, -30, 10, -10, 52, 147, -5, -125, -170, 175, -15, -195, -202, 99, -123, -287, -193, 2, -27, 52, -12, -25, 16, 266, 212, -20, -81, 50, -169, -2, -41, 64, 44, 280, -27, 24, -110, 53, -53, 69, 145, 73, 131, -30, -41, 13, 85, 148, -42, -155, -277, 150, 227, -50, 125, -54, 103, 311, 100, 120, -38, 264, -55, -43, 18, 52, -228, 42, 104, -192, 389, -18, -32, -186, 138, -171, -29, -124, 52, 102, -113, 9, -33, -68, 1, 195, -411, -81, -79, -179, -9, 21, -107, -185, -75, 70, 64, -76, 153, -94]
5126i4J34p9R3j63L7N1j48n5M98j91M5R5q7j43j24p8K80rpj56k20J18M20N8l44
5151f9k0J63J02k36K25n2j11k5j61L05j23k0j90J16J80j12L19j83j45o8K91O9
5173B55k45K2p3o9K46n14K53L01n6K1j88j83j0K65K4kj98J25J74j09M9l5J27j70
5197A0j4J72q5Q0k56O5K22k70K02j23j58K03p6P6m7J14l39K82p7M4J27j84m9L50
5221B69l73K01o8rL7m16M11k12J1m0M9j08N15l94K37QM8j56q9P0m7M9L7L1j69
5246a08L6J00j29N2j83L2K93m7J20j63j1j53J41J3p9K5P4q5N5j46K09m7J7j1J76
5271A81J80k52k0q6R6J2J41k26k22l0R6J71J49J09l78m5J6J20O7k08J74j18J36
5294F3k96L88l2k08k4Q9O6j2J1k39J21NP4j23k3J93p6O5K3p0o9Q6J85j88q9J25
$$ y = [-94, 40, -39, 54, -109, -72, -21, -169, -224, 274, 83, 128, 223, 136, -7, -131, -209, 71, 62, 55, -101, -321, -203, 217, 275, -69, -89, 74, 176, -60, 165, 113, 2, -23, -184, 121, -2, -22, -212, -96, 84, -28, 291, 108, -37, -105, 186, 255, 10, 32, -41, -110, 136, -378, -125, 176, 120, 141, -47, -230, -240, 25, 49, 47, -151, -26, 148, 39, 88, 53, 180, 10, -4, 168, 83, 163, -93, -28, 194, -76, 126, 3, -155, 48, -28, 48, 1, 115, -224, 58, -19, 25, 152, -32, -81, 269, -104, 97, 29, 20, 57, -359, 52, -160, -149, -189, -140, -248, 267, -127, 110, 118, 166, 10, -79, -9, -56, -7, 30, 61, -108, -72, 28, -101, -49, -232, -200, 93, 46, 166, 3, -8, -161, -20, -7, -86, -61, 13, -72, -17, -163, 46, -1, 16, 5, 181, 361, 109, 89, 3, 99, 111, 252, 26, -196, -226, -130, 41, 190, 299, -79, -124, -108, 12, 79, -129, 45, -73, 63, -233, 155, 123, -85, -109, -20, 46, 34, 45, -194, -73, -68, 6, -117, -140, 53, -23, 42, 65, -5, -74, 12, 197, 9, -80, 45]
5320D5On7K67j41r7k75L33j86J72L8j92K80m4k48J53K54m34J59J4k71J82j23L74
5343B09k54K11l47K37Q6j43K77j57j32k15J46K01k60J88P0j37m7J32K68m00j18
5364a85K84m6m8Oj54L85l07K3R8j02J03m28N46k20j57J42O0o3k69K31J64k01K50
5387A12j00K3j88KN7Q4N9k74L58O6l33j64M65k54m0J12K00k60k16K61J98k45l0
5410a07j15R2OJ93l47K3L58O1l58j96M10r9o4K99j87N1j72L3L07M7j5k90K22J45
5434B97k3rk28o5J36M1j01Mk73K42j28K34j19k6l01N57m90J66J03j99J28n8Q0
5457c2L5N0L5k72L34j31p4M3O5P6j3Kk64K52k47M6jj03R0J41o9K32o0j42k15K38
5483A6J83m15J89J49j07L2j21M0%n5MJ89k52l1L77l59j04J17L01K85n23K47k81
$$ y = [45, 51, -6, 261, 120, 23, -252, 81, -105, 67, 105, -87, 193, 149, -99, 54, 308, -126, 33, 47, -224, -42, -165, 209, -45, 166, -181, 56, 142, -1, 276, 119, -13, -228, -82, 119, -141, 47, 117, -20, -67, 65, 333, -67, -185, 99, 53, 5, 11, -143, 242, -65, -42, 56, -46, 57, -371, 175, -45, -202, -60, 0, -63, -332, -101, 63, -138, 112, 12, 35, -153, -151, -94, -10, 49, -225, 133, 199, -134, -298, 167, -87, -127, -15, 185, -75, -291, -30, 168, -77, -107, -222, -130, -124, 69, -278, -255, 103, 164, -194, -390, 20, -79, -143, 156, -31, 20, -152, -119, 188, 235, 220, -70, 152, 297, 274, 265, 37, -28, 108, 149, 48, 52, -221, 21, -107, 127, 8, -18, -319, 238, -252, -86, 17, -182, -54, -112, -32, 3, 53, 88, -184, 150, 19, -55, -12, 53, 129, 116, 118, -146, 106, -141, -95, -96, -199, -109, 32, -37, 195, 135, -7, -222, 16, 199, -216, -27, 122, 15, 47, -74, -34, -34, -89, -85, 104, -148, -179, 198, -161, -265, -148, 153, 438, -85, 162, -119]
5506a19k25P19k67Q2l01P8m3mp7K38o9k04J70k20K77j87J11r9k51j2N85k17j4
5529d9m0O6R2k06k3J46o9L8j49K25Q6l03K83k45J82K66j87k53K12n0Pk4N1j44
5553h8J16j95M1J16j2K73k39p8q1R1N6L22l15J19j63N0n7q6J67M2j20J46k87N28
5577C46j75k51q8kL79l37J89k74J68L52l41r4J70l18K83o2J23m2m3J69k17L1O9
5600C5k04J12j2l2J21q9mQ8pj77M41l32m0O8n9J34L1j67M6K89k62n9Q7M2j10L15
5626B55l74P8j75L28n6J26k41J97J07r9j26K30j58m60M27n3j06M8J22J16k05R0
5648G1k5n7r8K7L34j87J26k35L9K8l9J19k16oJ48k8K49r1k75J05j26j60K2K66
5672ik47K85j64N6L10k3n58M02j6K2Q6m15K37K06k06P2K7L9j08j44L05j95P0k8
$$ y = [-119, -344, 375, 108, 190, -111, -33, -76, -80, -157, 81, 12, -192, -22, -242, 35, -152, -41, -140, -391, -403, 182, -35, -49, -89, -23, 69, -137, -160, -14, -83, -45, -194, 31, 117, -186, 97, -148, 34, 300, 113, -140, 72, 22, 29, 5, 56, -88, 28, -167, -126, -10, -22, 251, 12, -66, -147, -56, 0, 322, 7, 126, -37, 13, -44, -130, 37, 79, -41, 105, -182, 346, 171, -80, -168, -170, 209, -128, 61, -213, -45, 307, -34, -128, 42, -276, 7, -55, 68, 26, -17, 152, -65, -34, 35, -169, -57, -69, -101, 20, -69, -73, 15, 8, -169, 272, -60, -100, -32, -91, 43, 74, -93, -47, 242, -20, -79, 8, 50, -60, 255, -119, -41, -216, 112, 56, 182, -59, 138, 245, 146, 20, 250, 92, -368, 59, 6, -100, -52, 70, 186, -19, 71, 46, -11, -109, -82, 252, 65, 191, -44, -5, 23, -16, 103, -113, -119, 29, 1, 250, 159, -116, -11, -137, -297, -275, -9, -256, 29, -135, -79, 231, 208, -350, 52, 36, 58, 144, -271, -34, 172, -34, 38, 65, 104, -4, -148, 157, -38, 32, 4]
5696DRJ21j48l34M86j69k4m8N1J62k6j38L17k45j42L51k46O5K62l79q6R0N9J99
5720A91m86O3K73j70Q2j80L72j70K61j76m6K50k98o6L08p9j11m9J88K07l47J12
5742A29k94N1R9J1o7K9L2M7k33M96n11Q4K65j01J1K24l35j9J7L4K16k8j57J25
5766A25j28Q4k51J34j72J51J66j11j01J87o4j38O4O2j09j62J02J97J0K14m62j6
5788b18K55R9l4m6pJ83k06m1L38k46p0J72m7n6j37K62j08q6Q0j75j32J07K7N8
5812b8l6J82k63J6J91p9J5j8M3L5K58k39q4k56K92Q5j42K07M0l44R5K8j51L0j4
5837a37l5K98j78J14R3k01Q8j35K11k76K31l38K16P0J32k39Q4L9q9q9O3J38jq3
5861b4J5n9K57O2l64L95r6j86KM2J05m6J50m53L42j31K06j02L6k31Nj63J49J87
$$ y = [4, 13, 134, -14, -348, 138, -31, -55, -103, -52, 110, 84, -54, 263, 18, -124, 227, -19, 46, 308, -71, -157, -67, -8, 191, -295, -232, 41, -129, -47, -227, 145, -25, 236, 60, 14, 264, -34, -100, 208, 129, 18, -31, 157, 364, 17, 129, -165, -114, -15, -4, -71, -42, -10, 37, -196, 300, -211, -127, 138, 37, 48, 272, -63, -82, -65, -31, 185, 157, 0, 125, -3, 81, -170, -36, -208, -57, 109, -2, -103, 84, 20, -118, -54, 8, -101, -263, -161, 36, 46, 260, -202, -218, 37, 136, 102, 56, 49, 232, 26, -15, 323, 77, 7, 179, 132, 76, -61, 201, 93, 7, 87, -88, -220, -113, -86, -28, -64, 118, -145, -129, 62, -17, -2, -20, 23, 58, 316, 77, -7, -263, 29, 114, -28, 179, 219, -125, -30, -2, -153, -123, -137, -172, 126, -52, 62, 155, -46, 42, -93, 118, -158, 73, -265, -49, 21, 153, -86, -2, 37, -52, -141, -78, 60, 59, -24, -9, -68, 189, 251, -113, 282, 186, 0, 2, 44, 149, 103, 253, -200, 142, 11, 217, 115, 151, -80, -75, -238, -89, 98]
5885I8J48k68J32k4j07j06J90J92k70kJ81j55k07K64j85K96j52j46O4O1r2p0P5
5908h3j09L64q5j09j06J06p1K34k13k15N4P9P0O50p13K18o0L2J66k29P5kj45J90
5932I8j7k52L31j61R7j68J49m54L56J08J92k36j22m8K37j73J68l11q5L7K15j65
5954b04K41j17JLj64L41o2p9k4J90o4Mk22K71o7R1l19L9r2K00J11rj27Qk0Q6n4
5981c8K40Q9j60k55K09Jj99R8r6J09J13j61J27J71m19L19k0l30K19j6L46j18l25
6004i6K6P0r1J05n8J76O7k96L66k05k13L57k08J21j55J0K97m11r4L98k07K11j00
6027G0M3r6j66k4K11o3J53j4j96k1M00l54KJ10k04l9q4n8K84J51k27l7K58o3Q1
6052A17p2q7J15o4o5M4K15k67K86j82p2l8P7rn0K03l3J8l48J36J01J06j02P3R5
$$ y = [98, 246, -22, 110, 86, -21, -127, 63, 255, -15, -17, 164, 9, -198, 66, -119, 177, 25, -121, -57, 4, -88, -158, -83, -192, 172, 87, -22, -128, -22, -93, 141, -72, -287, -233, -154, -84, 566, -147, 71, 11, 43, 209, -20, 55, 53, -92, 98, 81, -171, 160, -1, 96, -72, 77, -377, -21, 87, 279, 43, -79, -127, 110, -63, 105, -206, -291, -254, -39, -204, 37, -80, -79, -76, -240, 101, 39, -40, -64, 126, 62, 66, -156, 115, 48, 139, -180, -141, -233, -33, 78, 69, -58, -50, -70, 16, -38, 202, 291, 131, -124, 85, 86, -113, -15, -111, -2, 111, -50, 77, 248, -171, 148, 128, -202, 17, 1, 347, 229, -96, -70, 0, -91, 14, -44, 132, 199, -97, 269, 64, -149, 208, 0, 121, -34, -24, 273, -138, -232, 166, -41, 170, 70, 113, 17, -149, -173, 38, -25, 128, 114, -82, -103, 297, -57, -55, 55, -149, -188, -272, -330, -46, 105, -122, -159, 99, 36, 117, 45, -42, 73, 9, -56, -12, 203, -64, 222, 40, -32, -70, 7, -2, -52, 151, 118, 136, -212, -76, 25, 131, 29, 102, 197]
6077A97k82K45Qk24m6J6K97k12k1OQ8j14j29K40M1k42K23J31j84k73O4K83q0k20
6101a88L74k26n1K8J7k00K29j67L08j24L5J08J39l78NJ48r6J43j63J89j9J23m01
6124a67J32Q1Pq3P2k7K2j05jJ74K2j78N3j04o2J02k61K72O6Q4j51P1j74R3K01
6149A39k30j30K38K08j23j63K5J25j80J56Q5l8k12J43K57m18J71l08N93j80k9
6170A29L6j61k0r5K56k98J63J51l28KK35j84J39L0k93R5K39Pp5K26j48r4l6n8
6194h2L02j34k37M04k99K12k11q7K74l21J82L1n8m8K49l87K24r1o1L46j12m30
6216c34N51j76k38M3K21j85QL50m21L41j7k54O9J71n2lj65K9j4K5O0j15j44J21
6240a29J3N0k42J3K17j6M47l41j56J14R6l40P0K38Q7J5M8M8r7k25J22M9j83J23
$$ y = [197, -85, 160, 168, -56, -102, -86, 211, -1, -22, -16, 72, -42, -171, 69, 110, -132, 91, 222, 38, -235, -171, 112, 32, -188, 186, -40, -91, -63, -46, -246, -17, -184, 124, 0, 35, 143, 282, -96, -91, 57, -39, 104, -59, 130, 111, 234, -167, -35, 46, 53, -30, 42, 15, 37, -68, -69, 105, 127, -51, 2, -102, -164, -62, -323, -51, 15, 99, -52, 19, -155, -62, 139, -91, -221, 17, 225, 102, -61, -36, 89, -91, 65, 150, 112, -100, 43, 300, -118, 53, -255, 338, 158, 129, 165, 4, -16, -111, 145, -153, 10, 161, -167, -165, 70, -114, 25, 55, -238, -143, 96, 103, 28, 254, 106, 12, -24, -82, 220, 86, -151, 253, -46, 166, -45, -132, 142, -179, 3, 34, -24, -72, 177, -210, 14, -77, -138, 208, 96, -334, 217, 41, -197, -154, 67, -118, -110, 240, -181, 160, 143, -111, -42, 129, 77, 74, -91, -62, -76, -51, 9, -106, -250, -129, -116, -66, -308, -295, -78, -94, 353, 12, -144, -30, 66, -274, -204, 34, 121, 136, 184, 232, 135, -90, 32, 81, -102, 21]
6264B1Q5j52k0K9p9O3j7R9J05r6k86K50k75J62j24J17K9K96m3k68J79M7k67J1
6288a34K7k76J08k9K57L8nL6J59o2k16rJ17KJ74l88Q8RK51J41k38j92N41m75J6
6313f0k1J06J93l49J66K07k65R0j49j29R2J75q9r0Q5J71j27l3n8K7q4j21K28K14
6337A79k28m7K05j71Q4J05p2j61n5M17k03n7J37l82J22P9%J81o2m61L65R8j43
6360g0p8P3J81jJ9O4l23K67j73p4J10Q1J7n4k8P3m8j09J90j06M6q7L8O5k40J75
6386HJ1L4k17K7Q4J70j11K9k28J87R6O9j32l7J33l49L87k60M5P8M5m3N7N1j70
6411c6K71N4l18j37J51K47m19J66k8J9J96j34p6L07o05N48j29k21K86k30N0J83
6433A45J70k30k68j24K84J26l45J47j1J84l9m1J10r4l40N22m48M20O2j37k29J43
$$ y = [21, 106, -46, -66, -37, -116, -53, -70, 29, 134, 38, -248, 2, -273, -111, -235, -118, -89, 207, 164, -104, 75, 122, -145, -134, -107, -383, -275, -304, -47, -9, -14, 22, 181, 119, -97, -106, 11, 13, 187, -201, -113, -104, 147, 288, 50, -142, 399, -76, -60, -81, 25, 218, -131, 35, 242, -23, 67, -82, -211, -119, 56, -33, -123, -38, 133, 6, -27, -85, -58, -142, -263, -35, 179, -49, -96, 109, -62, 22, 127, 55, -106, -161, 256, 53, -4, 133, -249, -127, -48, -48, 133, 71, -390, -25, 73, -70, -148, -75, 106, 105, 124, 188, -135, 132, -41, -115, -5, 76, 93, 39, 11, 84, 36, -73, 117, 11, 57, -30, 8, 73, -167, 8, 19, 53, -164, -137, -53, 117, 6, 35, -193, -6, 90, 159, 27, -10, 123, -226, 161, -99, -54, 24, 69, 26, 83, 134, -36, 235, 289, -29, -166, -15, 232, -187, -21, -49, -30, 166, 32, -44, 263, -342, 206, 77, -144, 142, -88, -38, 145, 315, 85, -183, -307, -23, 103, -242, -95, -106, 78, 39, -2, 108, 14, -326, 196, -252, 168, 230, 93, -136, 7]
6455Gp6j32L40R6q6o4j44lP9k14J56J64j25j5nQ3m4lJ50o7R5k66M07k68r5K61
6481B31j20K2k18J24j05m2J03l3L5K24l47J87k1J27q8k99K85N6J34n70K53J83
6503A21m3j80lJ53q0J15oQK2o1j03J07r7Q2J45M4k52J86j96K5j00K39p9L7k79
6528a95J45L99l05k42L21j33j21J9K02l2K1J7j99J74k73K96k10K26k18K43j52
6549a7j3P3k69l5M99n34M50l73l3K32K41k39k17L35j5j00K77m3m38p2M31l05J00
6572f5j8j30K10K2K16m9j01K72l47j83N4K19k18K61O8k94R9r6R3j81J43k09J98
6595c6O0J00k24K50r4L6j23k19J56Q9J03l39L32Q4PR6l86q3K92l3j74J59k87J31
6619a03K71l14O7P5k25K75K97l81K3j16L6QL23j78M4l22K37k5P3j57p9R5J04r4
$$ y = [7, -69, -201, 139, 235, 149, 85, -59, -62, 17, -197, -41, 123, -2, -17, -22, 61, 17, 14, 164, 97, 192, -74, 333, 65, -30, 231, 111, 133, -85, 39, -66, -108, -5, -38, -3, 221, -126, 61, 40, 167, 79, -220, 65, 121, 255, -315, -62, 121, 78, -102, -105, 48, -32, 83, 77, 85, 107, 46, -57, 50, -47, 35, 180, 224, -28, 158, -38, -13, -113, 126, 47, 84, -195, -50, 349, 44, -198, 123, -10, -131, -112, 90, 58, 79, 96, -103, 71, -202, 94, -116, 110, -108, 135, -17, -30, 43, -226, -261, 238, -296, 154, -219, -252, -20, 221, -18, -235, 100, 85, -15, 262, 219, -219, -291, 140, -165, -65, -83, -213, -3, 19, 235, 186, 85, 357, 10, -173, -119, 100, -118, 143, 211, -83, 16, -80, 13, -168, -25, -234, -36, 24, 124, -100, 150, 56, 92, -31, -250, -94, -5, 98, -241, 91, 175, 182, 278, -108, -191, 101, 68, -106, 53, -234, -103, 168, -146, -79, -4, -229, 46, 343, -38, -15, -131, -95, -87, 236, 58, 102, -220, 17, -8, 65, -92, -171, -76, 28, -66]
6643f6j16L80k75m0j05M25j02j63L03k02j78J00J33K5k72K28k36l04M86Q1o5k34
6665a97M32q2j95q4j50L10j43L39r7p6Q1l54J61r1J96j72J41k66L98k31j79K59
6687@M3q4l2J22J42Pj76J66Q3p1k49R3J23j57J31K7j04o8J63k61O6k8k4J91k8
6712G5j76k07M79Nj5Pp9l94K90j20L54l03k48M24k39O6k6K46k47j01K19J33J6
6735A59k23j29K98k7j07OR1m3l2N3n9r7J14p8J49k09p7P6M1J28R9m49K16K86l76
6760a90K58j60k8K8J63j09J53k27J65q1l0L9P1J21L0l13j27J16J77P4r3j40J51
6783D8O0p4K29l87j57J88J47k46M94j90j60M16l60k57L26n0q0J76k00j18K01k7
6805b1J52k38K35J3j49l7K64l14K56j33j0O1j82P2P7K8j93J62Kk3r0J50J64m8
$$ y = [-66, -182, 198, -77, -117, -222, 203, 101, -62, 241, 39, -139, -39, 94, 119, -153, 75, -161, -465, 21, 102, 37, -197, 235, 153, -42, -126, -276, 34, -109, 230, 133, 57, 138, -216, -55, -146, 50, -122, 19, -247, 151, -80, -259, 0, 43, -41, -73, 49, 191, 198, 22, 188, 271, 200, -49, 44, 167, 10, 141, 168, 64, -4, 159, -102, -36, -64, -88, 103, 75, -101, -308, 171, 176, 161, 168, 89, -305, -15, -135, 219, -84, -332, 92, -147, -81, -107, 139, -108, -209, 10, 143, 159, -64, -193, 105, 78, -29, -23, 68, 25, -7, 46, -13, -110, 4, -74, 75, -134, -211, -135, -94, 34, 133, -316, -100, 186, -190, 68, -92, -120, -92, 71, -38, 115, -112, 53, -28, -58, -19, 52, 173, 203, -110, -237, -121, 56, 130, 37, -103, 48, 108, 34, 263, -124, -281, -93, 54, -192, 302, 112, -48, 368, 8, -249, 77, 27, -53, 123, -77, -195, 6, -21, 131, -107, 128, 141, -8, -45, 219, -95, 161, 28, 18, 79, -103, -31, 46, 74, -119, 43, 45, 22, -68, 82, 246, 198]
6829A98R8j65p2l14M27K9K3l52J82k45L05l44R7J12J85M9l70O2L36k79J25l84
6851b97L24k1Q8n1M1o9k11J62j02K73K2k77j3L5K09m09L66K14k93J12K4j57M3
6874A3j92K13p6N4l41M67P3q0l16J11K47N8k84r4LL35j48q6J38o6N2l1pj05%J00
6900C8mK00l77K40k22M7K46j08l8J87q9j09o9J56j76J11O2o8n2l12L92L6l26l9
6924b74L97l10L26l51N30m51K6L87k61m0J97k35K43m52J61L31r3k68J23L4J10
6945A30PJ41k96Mo1J27K2j33M6o0j63L23j11R2m0q1KK71k3l55L52k48J45j63m2
6970a14J80l7J73j90O5o2j64j22L12l0m4jK67l23j62J51J98q9P4L4l01mN46m64
6994a07J4J08R6o0P7j0j50m3L06k41K5N6j64M0j61L34O6j0j60l5N4o0j33J26K12
$$ y = [198, 296, 131, 59, -255, 172, 201, 224, -128, 54, -191, 114, -230, -133, -21, 164, 213, -157, -95, 241, -38, 87, -297, 27, 6, 94, 43, 84, 15, -196, -34, -136, 137, 159, -118, -131, -96, 113, -296, 70, 284, -9, 103, 127, -30, 13, -179, 34, -42, 12, -329, 138, 211, 131, -185, -74, 173, 231, -53, -147, -144, 191, 43, -43, 95, 29, 81, 50, 43, -62, -62, 38, 34, 234, -143, 97, -125, -78, 168, 60, 22, 209, 120, 11, -58, 98, -78, 33, 95, 27, -25, -337, 55, 91, -235, -274, 123, -187, 139, -212, 318, -133, -107, 280, 19, -21, 176, -59, 184, -268, -107, 224, 131, -137, -14, 20, 130, 137, 278, -18, -14, -75, 52, 74, -59, -13, -73, -236, 87, -24, 68, 28, -53, -51, 220, 197, -158, 194, -54, 91, -72, -114, 66, 29, 202, 12, 77, 15, -149, -271, 41, 11, -33, -34, 233, -90, -252, -101, 97, 8, 82, 116, -185, -189, 357, -107, -93, 15, 111, 51, 128, 118, -32, -75, 231, -10, 15, 71, -93, -53, -214, 120, 186, 176, 16, -19, 35, -25, -158, -32, 180]
7019A80k21J2J11j31Q6k3j01k46L45L20j58j72L2k06J14K31k03m3J83j4l46K89
7041C9j30KL47k45p4K37j17j35L71l53J39J56q3l76L14k29R7m9J29R1j63L33j77
7064A24j40l02M21M8o3j07M9j01J36k24J12J29K76k44oj02L8j03m4J32l8m6%M1
7088a4j25K66r0j43J38j09O5Q0k15J05J71l8o8K28l34P3N4q2J40P0n1p6k32K56
7112F9j94J99j06p2K33J45l90J80j39J35j80L48l39K03j14l11P06l99Q8k30J69
7133AO6j72L02l04J79j56L8R3K0m0J72j77J27q4J32j31n3n2M2L32j41j23j07j06
7157a42K7P3j33M98p10N88j22j85J45j19M9q7l7j52K13K92k14K37l72N8oK85k35
7180d9%J66j56p5O9K17j27j1l2j32J81o0O8j21j22O9N9J48r6j79L61Q3j81Nj04
$$ y = [180, -41, -29, 82, -49, 37, 14, -87, -333, 12, 332, 174, 2, 34, -172, -58, 173, -30, -73, 110, 96, -250, 39, -91, -89, 258, 13, -61, 176, 59, -76, 295, -58, 81, 237, 154, -222, 92, -137, -40, -89, 40, 131, -32, 301, 124, -16, -318, 103, 151, 88, -19, 30, -71, 65, -159, -47, 82, 358, 114, 108, 6, 44, -59, -103, 29, -9, -55, -55, -14, -139, 127, 37, -106, 32, -77, -12, 68, -147, -42, 129, 91, 23, 251, -83, -10, 44, -38, 102, 172, 121, 45, -187, 69, -125, 74, -32, -104, 129, 274, -116, 64, -75, 60, -120, 228, -111, 92, -22, -333, 373, -26, 62, -168, 1, 67, -105, 197, -107, 72, -84, -46, 47, 67, 27, 199, 22, 149, 65, 197, 66, 13, -39, 3, 335, 194, 71, -36, -142, -115, -42, -175, 323, -387, 201, 79, -106, 39, -80, -31, -118, -155, -307, -94, 198, -16, 221, -151, -93, -99, 186, -49, -49, 117, -39, -114, -45, 172, 45, 34, 2, -130, 51, -9, 59, -62, -184, -115, -56, 92, -4, -183, 178, 261, 80, 85, -19]
7205a9j08K73j04j02Q8K24o5O8l34r5J94j88K97k5j22L9j82J29l0k3K85m12M06
7228A94j92L8j16K61p0p3l8j20J12m2J70l11K30L0p9j72M9L57l57o8j6K93p5Q6
7252I1l14J41K64j29j30J6Lm5L4J69O0j52P8k34K54J02k49K9j45J19K14p8J38
7275B36j40O8j46j89K87J6j7l52J78J36Q7K6q1j29p0J58k5J3m4K31l00J30j3K9
7299H9n2L7J92j24o8J65k92L03k69j48J67l5Q4l0R4j93J07K7r0O3k1K1p1r2Q4
7324e2j2J88j54J16Oj81J21M2j46J69K21k68j39K93l09j06O5J92k05L8L21nl25
7347a30L23l12L74l80j65L37l30N61j55j32J19k73L84k23Q9k70r0M23j14O0J06
7368B02j01R5l84J1l2O9K34n5M3K11k53K4J65m93K45J58o1o0j85j37M03j58r2
$$ y = [-19, -127, 146, 42, -60, 28, 252, 187, 255, -79, -174, 20, -168, 129, 104, -18, 21, -161, -32, -62, -85, 200, -212, 194, 2, 40, -76, 185, 115, 42, 4, -116, -4, -46, 124, -187, 43, 73, -6, -178, -129, 228, -129, -197, -213, 80, 5, 91, -223, -82, 182, 53, -77, -61, -58, -103, -69, 100, 160, 8, 86, -148, 106, 208, -41, -12, -157, -38, 176, 98, 236, 96, 164, 18, -171, 116, 132, 115, -237, -59, 77, 164, 190, 109, -20, -90, 68, 43, 56, 12, 243, -57, 73, 60, 89, 37, 74, 266, 142, 74, 239, -53, 250, -19, -167, 0, -35, 49, 19, 113, -80, 27, 54, -36, 27, 6, 27, -44, -136, -52, -64, 124, -30, 86, 92, -89, 32, 74, -72, 97, 318, 50, -89, 204, -105, -211, -146, 46, -159, -121, 200, 195, -130, 193, -119, 255, -125, -290, 47, -283, 278, 123, -9, 110, -163, 221, -2, 87, -183, -273, 150, 36, 96, 202, 101, 196, -188, -177, -209, -140, 94, 39, 82, 293, 40, 64, 229, -264, -19, 139, 78, 18, -167, -304, 99, -59, -151]
7391a51K55%j62J68k20J1o4J00O1j17O3J49R8j01k8kj44K06L20n04K31k2j37J04
7415A14k15N9p0L94k23r5m5J24m3J58j52n3J2J00j80ln4L66m61K47O9k7P2l03
7439b09J70r7m4L02k89l7L85j54J93m66L35k6p5J92k65J02J79k29p1J2qK49j93
7462d4P1k27K19j77Q2j02R7n1O8L61l1k25j98L64k35o2q4L56%J2l79L52k96K54
7486A25k41R9L3j02r3R7J12O5j61N0J4k19J36R5L6j19k25L00J12P4l57QK37j95
7510a19J71m3L1ok8j2K6m4K16j78k14K13O4q2J21l16L64o8j52L04l20J20q4j15
7534a51K17q7j48K65o9Q7j54L34k21k36K00L19j79m11O1K59j98R4K0J21J37m56
7556a96L74l31K15o4R3l02Q3K26j94J16o1L28o6k35M5K55j37k42K12j12J23q0
$$ y = [-151, 104, 104, -58, 110, -110, -99, -163, -63, -2, -119, -56, 93, 191, 90, 62, 60, -84, 122, 442, -62, 169, 147, 10, 114, -101, -42, -112, 282, 59, -36, -81, 43, 0, 158, 6, -47, -35, 65, -115, -118, -172, 194, -267, -20, 49, 22, 94, -209, -39, -136, -180, 122, -167, -204, 181, 27, 220, -246, 89, 63, -12, 180, -85, 17, 196, -33, -104, -92, -100, 149, -44, 27, -200, 19, -158, -76, -178, -81, -132, -64, 297, 266, 41, -157, 207, -28, -90, -174, 182, 182, 194, -185, 167, -129, 125, -116, -17, 16, -86, -179, -82, 30, 95, -66, -16, -2, -221, -85, 10, 46, -73, -298, 2, 114, 188, -169, -161, 76, -119, 52, 9, 40, 34, 6, -6, 20, -24, 192, 14, -200, 13, 77, -5, 116, -200, 164, 96, -56, 248, -72, 48, -36, -151, 66, -21, -169, 96, 27, 114, -40, 294, 73, -163, 37, 356, 177, -234, -173, 86, -112, -18, 2, 123, 260, -196, 178, -153, 62, -2, 91, -211, -128, 98, -96, 20, -41, 287, 221, -14, 31, 286, 149, -93, 119, 7, 130, 50]
7578E0o1r8L30p0k71L80k46L74k88L1j47M9J62j18k14O1K29k29j49J86Q1k83N83
7601C42m69J18J22j97j03L77j81J40r3j16RNk53L37j04K41o1r2J01j62J01J9k86
7624b05r1L66j92P7M3J73j93K63l99M35l28L82j25K5pQ7J8l09j74J13n1l4K11
7647H5r6J93k60%J41j22K37l78k9K9K29p7J09K53k56R6l07K37p4M0J11m02R4M0
7671a07p8L0M34l63J6O7k43J54K98r7l48K77j74K18l42J38J88n5j03M0k8R8jN2
7695G1m8j42L1J4p7j8M07k13%r5L09k61p9Mp2n7K51j03K8J02J6o4J9J07J09q8
7721A51k24J75k4J16j18L96n70O1KJ0J35j95J12J75k97j73J49J46L99o44L36k21
7743a03r4J07J29K5o8K00j26k09K78n6j93J53k9p2K66J24k09m58K58n0K69j62
$$ y = [50, -11, -109, 221, 151, -120, 260, 14, 388, 100, 131, -16, 33, 195, 77, -137, -76, 153, -76, -225, -39, 42, -241, 342, -127, -9, 113, -84, -187, 190, 9, 149, 56, -60, -51, -46, -299, 38, -66, 175, 114, 22, 123, -39, 62, 81, -205, -296, 70, -122, -45, -2, 171, -22, 241, -158, 277, -51, 331, 206, 231, 224, 311, 329, 20, -154, -41, -92, -126, 85, -11, 182, -78, -78, 63, -59, 178, -200, -229, -200, 29, -48, 61, 314, 58, 154, -153, 84, 10, 50, 161, -241, -147, -107, -185, -155, 279, -84, -68, -1, -244, -90, 208, 111, -237, 40, -134, 84, -258, -120, 68, 13, -90, -50, -78, 20, 19, 71, 23, -119, -88, -74, -151, -169, 238, 25, 25, -70, 239, -22, -101, -97, -169, -226, 25, -78, -50, 52, 68, 4, 23, 130, 239, 151, -73, 102, 78, 194, 76, 472, -98, -37, -35, -25, 110, -85, 27, 202, -95, -268, -119, 27, 426, -218, 118, -103, -197, -90, 39, 64, -4, 196, 70, -139, 139, 83, -110, 43, 14, -58, 208, 332, 123, -335, -77, -127, 142, -20]
7765b0kP3k26J91k56K27Jn0l06L60R2J46m23K80K1j10J74k69K20p1j51K71l01
7788a29J68k46J29N7o8MK36j41p7L65l93j92J24K44n97O34k11K29o9k30J32K08
7810A77M4j92k26J74J53j24K77l00R9k76L1L12R9l25J51N1j16k06K23R8k01k29
7832c06K36K97n96O17j81l19M29k99K53j77k2j7J17k43J45J92m57M70k84J55m1
7853c1R0J15q4Jl60M59l66P9L4j19J66J41k44rm1J17l7j25L19O3j44mk07L62j91
7878a6J70l18K5K54j95J31J30k59L2K25j0K17o59J84L29K37n20J60k27j4k5K38
7900H9j24k8K02k42K67k78mQ9M3K3J27p3l7O8j15Q1j15Np4L4N6J42n2m8K0N3J46
7927B55m04R5j19j32L22K2J45k84K8n4J05K72k13q3J94j24m0J41k35J27J73k33
$$ y = [-20, -22, 51, -175, 16, -240, -13, -12, -62, -368, -8, 84, 230, -193, 87, 108, -2, 172, -97, 123, 52, -99, 172, -129, 39, -207, -78, -21, -89, -85, 151, 10, -67, 298, -95, -287, -163, 81, -516, 118, -93, 136, 67, -163, -31, 177, 221, 29, -197, -23, 130, 6, 283, -17, 82, -194, -163, 149, 248, -77, 74, 125, 9, -197, 26, 124, -77, -306, -70, 227, -369, 248, 67, -252, 177, -122, 131, -46, -68, -85, 32, -211, -66, 126, -331, 139, -145, 10, -31, 59, 174, 90, 91, -269, 190, -176, -97, -63, -182, -16, 125, -119, -128, -169, -52, -89, -214, 105, 168, 24, 20, -187, 175, -16, 154, -164, -139, 115, -80, 51, 181, -78, -46, 179, 169, 386, -273, -89, 240, 477, -43, 117, -110, -124, -149, 89, -35, -63, 139, -103, 164, -114, -118, -29, 14, 37, 164, 91, 54, 122, 7, 88, -27, -22, -96, -62, -6, 136, 84, 36, 56, 109, 255, -149, -54, -173, -305, 17, 39, 184, -100, -72, -126, -21, 251, 38, -45, 149, 25, -15, 126, -109, 18, 191, -42]
7949d2p8R5j83o7L80k70K26L59j34l58J11J00n6k56K06L8j05J53q3m4q8k32K35
7972i3Nk71M10o5L3J73l86L11p1K3K16k89M2K4nj9Q2j22N5k43J5K7m0j74L07N
7998e0J03j73L3j84K55k12O7Q0L28l89l0O5J91k20K81j38j02K97k41n0O6j42M11
8021B46j63k03K36k95L30k58j06J60P9j39K61l7k46K14k68P9J75j33O22o48J20
8042B6N5j85J4j84K28o8K19p8k1RpN4m14J62J71j40J34k2J51j51j02J34k2J97
8066A60k32k1R3o0k23K27j87L85R1m31K06N3l08N85j93m5Qk7k4j08Q3N4q3k2j18
8091a37J50n5J35K85l13j44N2J51R1k62K41k79Q5m7J09J09l52R2n7o0K49j38J13
8114A8k03r4M39j23J7k08k4N71l93K04q7k47L97l99K73k55pJ03J5j78L95k70Q
$$ y = [-42, -120, -25, -208, -275, 105, -165, 61, 420, 286, -72, 39, 139, 83, -173, 33, 71, -34, 119, 36, -8, -96, -328, -93, -88, -359, 51, -14, 19, 192, -194, 117, 46, 69, 285, -4, 38, 62, 57, 38, 120, -2, 53, -190, -175, -148, -188, -362, -55, -50, 53, -120, -87, -271, -16, -228, -161, -81, 247, -142, -172, -107, 84, -136, 145, 7, -95, 202, -39, -89, -23, -165, 246, 83, -120, 116, -179, 151, -107, -213, -53, 26, -113, 148, 111, -135, 79, -189, -110, 65, -68, 554, -94, 26, 81, -104, -90, -274, -46, -114, 105, 27, 6, 15, 8, 62, -352, -190, -19, -159, -25, -47, 104, -47, -149, -15, -37, 160, -72, -93, 0, -60, -283, -56, -243, 142, 233, -198, 8, 61, -247, 338, 145, 100, 108, 81, 57, -51, 32, 86, 3, -19, -137, 13, -42, 93, 378, 65, -79, -27, 124, 215, -47, 194, -85, 0, -47, 62, 171, -181, -89, -146, -206, 43, -95, 18, -185, -279, 160, 37, 54, -154, -178, 393, 0, 204, 117, -130, 267, -132, 141, -114, -121, -18, -3, -181, 214, -56, -48]
8137d8k0M03k50J16j13m8p9M43m41J08n6Q8m52K40J66k02NJ00K48l19k7J63M4
8160F9l6P7k53L04l56K38l16J74nJ22J23j75J36q0m8P4l90K52K53j71J89l61K92
8183A12k34L88j95j36P5m7J87l08
$$ y = [-48, -68, 335, 85, 201, 88, 40, -39, 404, -37, 71, 15, 103, -349, -109, 57, -145, -140, -40, 208, -111, -138, 25, 69, 33, 110, -143, 161, -195, 43, -273, -99, -104, 18, 141, -34, 102, 22, -26, 48, -342, -90, 163, -8, 181, -180, 112, -122, 266, 71, -65, 10, -37, 150, -158]
8191a58
$$ Imaginary data points
##PAGE= N=2
##DATA TABLE= (X++(I..I)), XYDATA
0@%%%%%%%%%%%%%%%%Qj6J6j6J6j8K6l2L2m0M8n2O0p1Q1r1J05j19J34j51J70j88
38i8K08k33K60k87L17l54L94m34M76n25N81o41P06p77Q57r46J044j156J284j431
58g55J601j803K050k350K727l225L909m908O518r519J6929o7987j09133J51872
72a4074R2443o3082o8302J6347J4065J5593K8088J130l2272l27J5787J2435K2798
85D0629k637p1339m2002P8575Q7110n8679j11917J67P6963L4191j6026l0563k3706
98c9234R667M4019K0001k5831k0977J039J0465L2459J8454m7104n6942K0548O3759
111C0323J8087l5059m7744k5326L7580O8986m109o8643j8961M5827K7748p983
123B0726j1065j5340j4191K6229M2616j3757n2244j7483K4028L1117J9172j5087
$$ y = [0, 0, 0, 0, 0, 0, 0, 0, 0, 0, 0, 0, 0, 0, 0, 0, 0, 8, -8, 8, -8, 8, -10, 16, -16, 16, -24, 24, -28, 32, -39, 42, -49, 56, -63, 71, -80, 90, -98, 110, -123, 137, -150, 167, -187, 207, -227, 249, -276, 305, -336, 370, -407, 450, -496, 548, -608, 676, -755, 846, -957, 1093, -1257, 1470, -1755, 2154, -2754, 3764, -5755, 11174, -56813, -165946, -14074, 78369, 15287, -53015, -36668, -22603, -7010, 21078, 22208, -10064, -10391, 5396, 17831, 40629, 37992, -33347, -75349, 3226, 90336, 31657, -80260, -80093, -3130, 31061, 15035, -15528, -39234, -29567, 14452, 34453, 8622, -12355, -11316, -851, 31608, 50062, 2958, -53984, -33436, 30323, 48410, 13351, -34393, -59719, -22139, 46847, 42738, -25905, -44866, 961, 28709, 20726, 9661, -5679, -19870, 6359, 48975, 35218, -17026, -34509, -10481, 20636, 39808, 24721]
135B4721n7737k6072O1223N2505l9741n0002J5328K9377L120L870k912l0772q352
148b5444M4837K8069k9117l8735j0739J9700L5820J3686l7964m5199J1925M4443
160A1282R365k1717j5756k876R773K3167J1636k4929l0874J4351M2417J1803k9631
173H011l6394m454L1189K8580r725l4053j4968J3016J6974J2370k428k5059j1940
186b8881K8368K9744j1052l2544r630K2028K7581N745k7964l2758N431L1158J4986
199B2212j2927k1416j1406O339K2367J5620j6969k5380Q022K9361J1007j6098
211A0732j9509l321J4924K2670M115k8422k5931Q979K6379J0909j3208k2455q407
224b2545J5820K2818j160k1617q304J3022J6591O482j0329j9317o265J9348K2970
$$ y = [24721, -33016, -59088, 2135, 54640, 14899, -35103, -19775, 9602, 12722, 16592, 13680, -17092, -25444, 19393, 47462, 18345, -20390, -31129, -11429, 24391, 38077, 113, -45086, -33161, 11282, 20647, -1070, -16826, -19702, -9929, 13238, 24874, -55, -30929, -16578, 25839, 37642, 8011, -28383, -32837, -1648, 26932, 17207, -16846, -31814, -18798, -1824, 10546, 8118, -16941, -28881, -513, 29231, 18179, -14365, -23995, -1967, 25614, 31359, 3395, -29363, -23932, 7226, 22212, 9285, -12131, -23537, -17198, 5169, 20789, 3820, -21560, -13538, 15823, 26830, 10732, -8777, -12098, 2826, 25496, 29611, 1189, -24742, -15763, 10616, 21525, 8317, -14138, -22545, -6725, 16093, 14933, -6684, -14988, -1966, 14625, 21107, 10778, -8539, -14804, 4544, 27514]
237B7514n336k8590j7926J0820K3830P361j7040k0013l37J7983J3110o441j4173
250i238m882R012J7026P001j4931j9760J279K2402J3385j0846k0470j0564Q633
263a1953J9207M104j6739j4795L654J5843Q745o152j3071m736J4576J7600j388
276A4895j7019j1561O383J6564P928q241j7322r903J0670J6807O59j5717j2244
289a8101O750J5505O028q260j2516P10J6516J1200n736j2203p160M629J3470P739
303A8571r109j9156l864J3401J0503l380j2861p349P713J2786K784r316q860L997
317d140J2632P111l776j1602p590O491J2704L383j2599j3616J024J0187O172m158
331B223j0250m924Q006J0965R77r884o087N224R717O960n045j3115m061Q906Q900
$$ y = [27514, 22178, -6412, -24338, -13518, 10312, 17673, 633, -19380, -19717, -1734, 11376, 4935, -9238, -14120, -5108, 11918, 18919, 3988, -15772, -14493, 7909, 21294, 10448, -10022, -20586, -11953, 7254, 11358, -5381, -20176, -16522, -679, 8066, 1914, -11157, -15893, -1317, 16283, 14895, -2124, -13685, -7302, 9262, 17190, 8949, -8373, -18276, -7606, 9201, 9860, -5857, -18101, -11351, 4154, 10182, 1922, -10594, -9884, 6632, 17832, 12096, -107, -7267, -2638, 10832, 18571, 9462, -9694, -13558, -157, 10346, 6966, -5895, -13244, -5531, 7255, 10039, 723, -8137, -4140, 8492, 15603, 11827, 225, -7365, -874, 11830, 15213, 2614, -11002, -9978, 209, 6381, 2223, -8027, -12951, -4945, 6020, 6997, -2887, -8974, -3750, 5967, 12927, 7882, -5233, -9294, -388, 8512]
346H512j084j0383q485R62Q243N999n180r488j150Q121Q723o36q299m342N343
361c144R591M211o607r371j322O859O370j986p720o712R16Q852M233p029o324
376i183J324P103P031j250o862k923N212Q933J582o642o590j158N790N829k998
391E198p923n038L292P317J359n284m849J147P334N411j616o007l131N962P246
406A0418l51n918n720o75N371L709l754p383l089L544M964J199l661n158J173
421e331P441M188k101n129j562M260M807M00n559n616M31M483K075l324o335j981
437h853M107L699J001l733l331K363N339L526j130m174j188K418M397J633n968
452A06n490J491M292J697m145n750M37M027L016p3k657r59J121L957M159n75l589
$$ y = [8512, 7428, -2955, -11440, -10478, -2235, 3764, -1416, -10904, -12054, -3933, 4790, 4154, -4145, -8487, -3144, 6447, 10658, 4051, -5320, -6642, 217, 6587, 4601, -3119, -9831, -8915, -63, 4170, -2859, -9183, -7859, -756, 6275, 5025, -1837, -4760, 452, 9385, 10967, 4325, -2265, -3423, 2367, 8196, 5198, -2725, -7763, -4471, 2846, 4205, -1079, -5928, -4781, 2553, 7964, 6348, 341, -2790, 3172, 10418, 10067, 4149, -1571, -2246, 3125, 6834, 3080, -4303, -7392, -3848, 1116, 2315, -1346, -6504, -5331, 2110, 6298, 4197, -932, -2494, 1766, 6573, 6973, 1414, -4202, -3771, 712, 2787, -537, -6872, -8853, -4746, -1047, -46, -3779, -7110, -4747, 592, 4118, 2988, -1186, -2374, 44, 4441, 6074, 106, -5384, -3893, 399, 2096, -2049, -7799, -7362, -3335, -319, -392, -3049, -4008, -2887, 1070, 5229, 4654, 1065]
469A065j739J712M728J144n263n233J211N036J197n418l873J181L926J875p65
484G84m14q09l04K949M452q7l623k620J891L909P22m457n966J072O272k69n635
501b133k694J430L108J251L8o96j391m70K953M111o7m521k489K756K598l32l468
518a6m781M28N159O19m675l970K299L369R91J97K0k294l29L243L649n50m561p64
536a966K220J126k8k539l975k42M836K530m981m738K887L933J401R68j679k421
552b668N77L710L267j759l296o60J719J316J33k478l124o53M543L285m326n169
568e583J403N019L303p73k644j534J079L821J870k469k601r2J511J120j616j399
584D15k229j344L611M430l697o833L08P472L384k958l122o43J472L114J379k263
$$ y = [1065, -674, 1038, 5766, 6910, 1647, -3586, -2375, 2661, 3858, -1560, -5433, -4252, -326, 1549, 784, 370, -439, -743, 2206, 6658, 6571, 2948, 328, 2219, 6128, 6850, 2393, -3573, -2501, 3771, 3502, -2133, -4827, -3397, -289, 962, 1000, 304, -1087, -1557, 1396, 5507, 5440, 919, -1570, 1186, 3784, 3452, -16, -4797, -4369, 790, 1409, -3266, -7236, -4937, -1568, -577, -380, -360, -2654, -2983, 260, 3909, 3359, -1202, -1966, 254, 1380, 1352, -1187, -5162, -5404, -568, 1962, -3019, -7757, -4870, -937, 464, 1432, -247, -2668, -2091, 1619, 4886, 3127, -169, -829, 890, 2206, 2339, -139, -3263, -3916, 627, 3912, -414, -5583, -4180, 839, 4142, 3369, 725, -809, 270, 4091, 5961, 3492, 891, 799, 2310, 3430, 1814, 415, -1814, -3158, 453, 4883, 1186, -5647, -5339, 2133, 5517, 2559, -563, -1206, 266, 3380, 4759, 2496]
600B496k997J93J604j55l46j304l577j686N484M543m625q556K081Q705K388l977
616B71k200l20J720K980J005k540l106Q07J853J48n37l098l650J436N738K384
632B891n069o213K166P585L066k903l629l41K965K531P95k439k973K84K443J534
648B693j664m709j426K795M192J380m047m905J169O997L943k997m669J029L053
663B834J665Q58k866l826N78M280J223m586m300K7L199M129M67m881m500L057
679b642O661K728m044l287M07J804K914P05m149m454J533N335J23n464m118P54
695e194M087L900j305n227k154L396N159J217k086l244j245L283L887j341n053
710a920l441L292M701l71o065l886J694O001K116k533l675q61K857M694J878k499
$$ y = [2496, -501, -308, 1296, 1141, 795, -509, -4086, -5772, -288, 4255, -370, -8926, -6845, 1860, 4248, 271, -1929, -2249, -529, 2451, 3456, 916, -2190, -1383, 470, 618, 81, -3017, -6667, -5231, 507, 2891, -2178, -8391, -6225, 1360, 4426, 1523, -2106, -2447, 518, 3049, 3844, 1405, -1568, -1284, 1159, 2693, 1029, -3680, -5106, -2311, 1881, 3261, -786, -5691, -4522, 2475, 6418, 3421, -1248, -219, 2834, 4499, 5357, 2491, -1335, -757, 3523, 4746, 160, -4140, -4113, -914, 3215, 3682, -1199, -5699, -2642, 4019, 6747, 2703, -584, -177, 1627, 4541, 5246, 1097, -3357, -1824, 3511, 3634, -1830, -5948, -5194, -1107, 2793, 1488, -3739, -5893, -2497, 2662, 3879, 1793, -1451, -2696, 587, 4474, 3133, -1920, -5361, -2069, 2632, 2261, -3804, -7690, -5996, 5, 2121, -412, -4087, -4948, -2091, 2603, 4481, 1982]
726A982m769k02N265L003k918n729j598L791M861r27o317l928L746N717J410k859
742E28l054j318L533N050J297m193m053K103M314J277k699n362j384M660M630
757E329k381o523k146L635N476J325l018m343m15M737M267m62m625k692J774M025
773C963J657m514n782L81N627L504l559o225j529M042N501J196m467m195J702
788b698M661L270k098m244k649K943M850po141m597K000N772K398m298n416q42
804g096M754N513J31n112k982J734N305K660k650n070j427M430M521j813n714
819b816l243K558N416J816m370n328l4N694N193j215m909k533K489N590J879l990
835B197m724J60M854L346l035n608k592L763N729O43n368n139J438O504L888k341
$$ y = [1982, -2787, -2989, 2276, 5279, 2361, -3368, -4966, -1175, 3686, 2759, -3558, -7486, -3740, 1977, 3387, 528, -2526, -3844, -311, 4739, 6036, 1843, -2210, -107, 4207, 5484, 2785, -2577, -3961, 699, 5329, 2948, -3575, -5721, -2086, 3390, 4715, 1697, -2646, -3061, 1676, 5943, 5481, 856, -1836, -62, 3963, 5620, 1106, -4676, -4295, 1332, 4836, 1277, -4948, -6477, -2435, 3066, 4262, -205, -4400, -2698, 1963, 5233, 3135, -1109, -3758, -815, 4035, 4028, -2113, -6710, -4710, 1062, 3460, -838, -6254, -7096, -2342, 3171, 3302, -1810, -4792, -3058, 2247, 4907, 2257, -2813, -4240, 190, 4711, 2898, -2816, -6059, -3501, 1915, 3731, -639, -5967, -6001, -307, 4886, 3671, -1238, -3771, -1282, 4308, 6187, 2197, -2527, -2367, 2487, 5833, 2798, -2810, -5402, -1639, 4090, 4733, -635, -5774, -4336, 2168, 6056, 3715]
851C715m977k400M086N486K9m478m373J248M973K578l486o294k116N424N008p53
867C670n712m424K809O128K628l007m881r94M705M459r47n282l828K724N178J531
883D757m756o416j76N857M435j589o028l190L656N916K190m051n042Q76N005L610
899E054j741o162k546M019N242K31n850m844J203N557L962k666n865k242M528
914b120O175R40m839m453K038N417L096l308n723j406M789M627p21o405m056K041
930c908O221L304m096n751n73N153N224k20n440l227K522N484K391m773n657k63
946c609N184M478k421o441l201L311O179J518m844n042N27N765M362k013n203
961a450k574L333N674P08n509n105M01O056L737l781o029k435M459N644K9m693
$$ y = [3715, -1262, -3662, 424, 5910, 5939, 1461, -2912, -1664, 3309, 5887, 2401, -3893, -6009, -585, 4423, 3670, -2042, -6466, -3657, 2471, 5099, 2092, -2789, -3783, 922, 5381, 4434, -848, -4676, -1952, 3226, 4757, 1, -6415, -6591, -734, 3701, 2112, -3916, -7106, -3450, 2466, 4656, 605, -4437, -3561, 1444, 5054, 3313, -2849, -5395, -1376, 3866, 4097, -1753, -6597, -5394, 163, 4125, 1459, -4406, -6648, -2120, 4055, 4995, 156, -4297, -2259, 3158, 6254, 2946, -2777, -4183, 606, 5233, 4512, -1893, -5949, -3908, 2313, 5617, 1521, -4230, -4803, 350, 5574, 5354, -86, -3313, -791, 4693, 7084, 2311, -3346, -3609, 1575, 6053, 3632, -2809, -6010, -2699, 3480, 4998, 154, -4888, -4361, 1404, 5766, 3753, -1450, -4024, -691, 4983, 5691, 182, -4923, -4522, 1534, 5271, 1490, -4539, -6974, -2515, 3129, 3158, -1535]
977a535m223J459N905L064k679m976j764M389N291q04n642m211J911N667K290
992D142l901n806j232N823M765j107n222l200L135N918J885l749n032J73N021
1007A613L973j636n729l372L255N191J056m038n800K67N793M569k348n530j805
1022d541M056N238Q41m140m391J160M704K950k425n749j977L664M620N87n343
1037g46m554J114N585L852l095n742m58M627M451j89m816l162J390M994K055l540
1053A766n234j352M622L988j540n244l099K302N482K311l845m928L60N492L614
1068D695j912n066k047K784M715Q48l970n018K15M639L292k513m245k315K794
1083c104N525J219m385m181J812N555K609k860m193j268K986M564j45m928l801
$$ y = [-1535, -5758, -4299, 1606, 4670, 1991, -2985, -4749, -360, 4931, 4127, -1515, -5726, -3815, 1852, 4142, 241, -5565, -6797, -974, 3791, 2684, -2538, -5738, -2603, 3315, 5200, 1451, -3581, -3408, 1613, 5586, 3950, -1779, -5151, -1896, 3295, 4351, 313, -5487, -5220, 573, 5142, 2794, -2736, -4541, -485, 4753, 5594, 1454, -2937, -1777, 2927, 5877, 3452, -2297, -4274, -610, 4010, 4597, -746, -5300, -4186, 1399, 5251, 2156, -3586, -4044, 583, 5034, 4845, 29, -3133, -1743, 3251, 5306, 1766, -3468, -4820, -198, 3790, 2250, -2994, -6093, -3791, 1691, 4002, 157, -4771, -4411, 1081, 4695, 2783, -2283, -4330, -1546, 3169, 4017, 47, -4971, -4756, -117, 3175, 662, -3583, -5898, -3104, 2421, 3640, -745, -4926, -3114, 2441, 5050, 2190, -2003, -3271, -285, 4279, 4134, -794, -4595]
1098d595J366M861K407l332m471q42M142M409k67m066l423K235N571J634l338
1113B291m512l19L735L955j326n208l292K621N016J100l986m205N52M677L112
1128D211j120l947k820L006M992J207m266m475Q80M104K931k396n042k475L651
1143a559M298K65m645l225J853M166K247j602m067j703L478M282J59m701l489
1158d243J724L985K069k809m887q97L797L677p54m440k121K328M156J571k196
1173I60l823m23L740L612o93m566k860K558L935J012l678l655R8L935L113j830
1189A435l947j377K659M381R13l121l140L17L623L434j816m621j464K658L559
1204C493l70l774k615P53L728K672k694l639q45L400L515M4l481k492J146L598
$$ y = [-4595, -3229, 1632, 4039, 707, -3764, -4606, -464, 3945, 3678, -388, -3811, -1576, 3995, 5629, 2291, -2221, -2540, 1195, 5150, 3824, -1384, -4676, -2055, 2961, 4061, 75, -4130, -3578, 1099, 4211, 3091, -856, -3676, -670, 4322, 5529, 1263, -3212, -2332, 1772, 4703, 2307, -2735, -5210, -1559, 2739, 3004, -1641, -4866, -3013, 1153, 3400, 1798, -2269, -3972, -494, 3788, 3947, -754, -4243, -2519, 1466, 3535, 726, -4161, -5058, -1261, 2416, 1662, -2778, -4899, -2571, 1585, 3156, 960, -2863, -3286, 454, 4066, 3373, -1193, -4053, -1495, 2440, 3452, -226, -3881, -3783, 152, 3265, 1435, -2512, -3889, -1230, 3151, 4064, 943, -2197, -1880, 1743, 5177, 3361, -1260, -2724, -66, 3493, 3123, -651, -3266, -2513, 1215, 3887, 1193, -2446, -3291, 109, 3624, 3668, 187, -2305, -1159, 2439]
1220B439K100k405l773j321L388K901j150l703k166J281L523J581k725k985j78
1235c193L305L162r73l000k296K101L481P38k666l048n22K852K825k201k979j745
1251d159J866L628L64k758k682Q00L592K244j794k587j422K494K771J63k559k675
1267b714N56L047J804k143l250n49K373K820P1k946k139J618L146J727j846l077
1283a502m0K655K185m81k913k043J305K290J363k389k998L65K334K053k53k827
1299h96j170J641K625J030k093k450K32K398K211j541k470j361J511K030J38k376
1315e41j985M64K243J726q55k882n91J905K701N8k084j849K32K586J103j468k472
1332a709n46J434J786j44k112j926J186K221J077j423j756o4J651K156q6k089
$$ y = [2439, 4539, 2134, -1639, -2960, 428, 3329, 2179, -1524, -3690, -2409, 1114, 2695, -30, -3015, -3193, 112, 3274, 2301, -699, -2995, -894, 2587, 3325, 659, -2389, -2911, -59, 2766, 565, -2414, -4159, -2293, 1335, 1699, -1059, -3741, -2941, 651, 2895, 1101, -1486, -2908, -414, 2357, 2520, -39, -2714, -2158, 889, 2693, 550, -2700, -3249, -876, 1944, 2015, -931, -3070, -1452, 1694, 3421, 1575, -1502, -1542, 1113, 3298, 2817, -96, -2139, -834, 1456, 2819, 430, -2568, -2203, 131, 2184, 1931, -896, -2066, -425, 2200, 3230, 1137, -1313, -1081, 1317, 3528, 1987, -483, -1844, -333, 1697, 1835, -541, -2526, -2062, 181, 1907, 1052, -1830, -2421, -516, 2185, 2243, 159, -1690, -1458, 1128, 2231, 763, -1709, -2255, -821, 965, 821, -1291, -3217, -2031, 190, 1267, -156, -1912, -1976, -325, 1831, 1745, -344]
1348c44j235O72K122K53j682j727q9J713J144l38k125j019J119K404R9q65j278
1365a176j22J777J721p04j583q21O46J881L10j638j516jJ699J126r14j584o65
1382a564J293J863K24j397j244M21J906P32o45j591o03J119J056o4j250j544P92
1399d96J001M41p70j603O9J453R55q4r10j143P74Q72J082j102j149K75N64O88
1417I17k17j215r28M07J107K59q16j276o8J268J063r2q81r52J069R50K63o01j007
1436g50K20O99K55k73j269m25N74R45K11p22q72L52P85Q71o5r29k62M69J011K24
1456A049o22p16j7P50K54p29m40l23M43R29kr36l6j51P95Q55k91o34J41M59L05
1477A083N17r30k70l10L63M43n94j51p40N22M41q1l03q04L67R06L89l52k23k90
$$ y = [-344, -1579, -907, 1215, 1468, -214, -1941, -2030, -317, 827, 489, -1636, -2655, -1536, 868, 967, 102, -1176, -1298, 479, 2200, 1496, -87, -908, -262, 1619, 1929, 291, -1225, -1226, 473, 1599, 685, -899, -1564, -271, 1592, 1816, 419, -825, -404, 1502, 2234, 1589, -2, -605, 514, 1570, 1506, 256, -1288, -496, 505, 946, 176, -1427, -1358, 95, 1050, 966, 56, -1087, -313, 559, 1641, 539, -610, -335, 229, 917, 700, -515, -1443, -1036, 71, 330, -486, -1762, -1830, -562, 501, 409, -472, -1424, -355, 595, 858, 257, -750, -530, 169, 424, 151, -1118, -1543, -969, -24, 187, -535, -1407, -1055, -270, 601, 536, -393, -655, -186, 825, 1049, 427, -289, -306, 444, 698, -31, -471, -794, -351, 578, 576, -360, -396, -547, 248, 1103, 812, 178, 319, 778, 1083, 1600, 670, 400, 90, 453, 896, 302, 151, -589, -67, 374, 293, -10, -814, -447, 459, 848, 496, 273, -17]
1497a7L56K97K28n85m38K0m2M40l45n46m50K00M87Q3j4n93K8L82P00p3j73j96
1519b51J27K80J83l84l34n63L41M49k65m80l19J1O12N59l91k97k37L91R02M65
1539G99n47o62M13L61L60r9p25n29K09N75L8l39p17K39R63L34l89l00k92N28R80
1560A200K04m98o59l3O97L55o00p21o99O33Q83L7o19r95O4J108N43n2r96k33O22
1581B41J155J57j039r33q1J033L64k72j248n48O05P75K27j030o99J91R22P54l63
1600B11q28j97M52R91M28r24j251J05R69O49o20j238q6M32J161M3j390m28K44
1619a277J394P19n59j305o7J140J443m80j245q80M47J355O74j343j162j30R88
1636b88J037l13j361o79J217J399M67r68q25l97J774R42o60j609m57N14J569L13
$$ y = [-17, 339, 636, 864, 279, -159, -139, -181, 259, -86, -632, -1082, -882, -395, -312, -326, -919, -891, -509, 191, 118, -55, -251, -124, 156, 339, -45, -379, -942, -601, -152, -417, -897, -1216, -1205, -593, -34, -425, -722, -959, -568, 334, 799, 252, -410, 3, 364, 724, 625, -100, -629, -420, 155, 193, -146, -863, -624, 339, 673, 284, -16, -308, 220, 1200, 1404, 906, 247, 214, 911, 1266, 666, -55, -754, -121, 762, 799, 180, -815, -751, 357, 900, 848, -148, -381, 241, 1396, 1553, 514, -419, -500, 533, 897, 625, -623, -1171, -566, 209, 436, -594, -1293, -1102, -180, 574, 211, -617, -814, -362, 629, 1057, 133, -1118, -1013, -44, 605, -15, -1253, -1339, -907, 254, 297, -1093, -1521, -1277, 117, 836, 277, -1028, -1095, 45, 1488, 1008, -237, -1117, -670, 685, 1359, 16, -1146, -1276, -288, 749, 436, -925, -1604, -387, 1012, 1479, 511, -314, -711, 1063, 2005, 1345, -264, -721, -207, 1362, 1675]
1654A675j602j026mJ425P13k86j633l61J106J548j46j266q18L07J592O01j009
1671H16j263n46J211J304n05j381j206O75J469N28j160j347k12J979R73l69j326
1688c60j022Q01J483P52j434j760l8J610J018q98j380q32R20J570L44j022j723
1705a971O33J622J121o83j676n47J066J676J50j195j822M55J668Q05q79j889m46
1722a912J456J396N07j845j343P67J628J306j109j800k16J851J235l55j787q57
1738a078N31J689M84q73k193p9J970J380m91j885o22N95K040P77j367j881L56
1755f47J690J143j004j863p11J322J399L41j551j963M61J881J111j132j480q92
1771a895J487K001j14j339j600L57K027O41j041j719l67J107J696k66j751j551
$$ y = [1675, 73, -953, -957, 468, 1181, 895, -738, -1099, 7, 1555, 1409, 143, -675, -368, 1224, 1825, 816, -447, -993, 218, 1522, 1017, -364, -1570, -895, 574, 1102, -58, -1405, -1617, 362, 1335, 966, -360, -1382, -581, 902, 1654, 220, -1540, -1578, 32, 1050, 152, -1228, -2060, -1140, 430, 774, -248, -1971, -1338, 284, 1405, 722, -954, -1501, -435, 1241, 1391, 196, -1626, -1171, 497, 1302, 423, -1466, -1912, -456, 940, 1447, -398, -1741, -974, 654, 1960, 851, -949, -1165, 686, 1921, 1566, -221, -1078, -547, 1142, 1626, 753, -1440, -1519, 451, 1831, 1340, -545, -1167, -572, 1468, 2245, 878, -1003, -647, 1043, 2186, 1182, -681, -1392, -70, 1329, 1670, 119, -1844, -1383, 498, 1609, 477, -1003, -1895, -408, 1593, 1479, 140, -1460, -1103, 924, 1565, 524, -1195, -1562, -455, 1241, 975, -776, -2327]
1787b327P06K379K26r21j575k74J802J643n87j827p70O22K003N00j631j701O1
1804a671J592J514o31k039p68R59J915O96j834j354M08J572J493p12j979l93J226
1821fJ615k2j577j584M29K105O65r14j724n10J449J585j43j613r33O29J802R61
1839B214j274j692l06J452J425j74j956j290Q03K076K82j542j538J77J556J329
1855A542k82j931r82J096J942L75j140j761j05J617J292p01k208p40J042J763
1871H19L65j798j465N99J525J416r48j705p51J493J836N6j984r33K71J906Q09
1888A511j168j736m97J509J537l42j449j233O62J914Q58j383j381j32J912J186
1904A768m15j855p76O33J952L28j373j663J65J529J300m82j839o58P91K112J75
$$ y = [-2327, -1621, 758, 984, 63, -1512, -1786, 16, 1659, 1072, -755, -1525, -903, 1100, 1600, -31, -1732, -1671, -79, 1435, 804, -1235, -2003, -1044, 871, 1567, -267, -1621, -1213, 359, 1852, 1140, -839, -1232, -6, 1609, 1587, 10, -1574, -1145, 960, 1625, 711, -1013, -1523, -74, 1511, 1368, -245, -1178, -549, 1253, 2214, 940, -752, -1058, 394, 1819, 1645, -311, -1601, -798, 1278, 1560, 18, -1520, -1343, 213, 1542, 1260, -671, -1653, -557, 1385, 1760, 620, -1141, -1246, 371, 1663, 962, -1246, -1986, -944, 819, 1184, -614, -2079, -1480, 45, 1461, 513, -1192, -1943, -450, 1386, 1442, -542, -1475, -1204, 702, 1511, 343, -1393, -1890, -381, 1156, 814, -635, -1868, -1206, 708, 1566, 183, -1198, -1330, 582, 1768, 1353, -502, -1278, -645, 1307, 1635, 262, -1401, -1236, 293, 1593, 1111, -728, -1386, -595, 1517, 1692]
1921A692j482j267L41J710Q32o99j571r15J516J413J01j611j363L04K078K42r13
1938D08j584k02J447J495k87j633r65N50J879Q24j304j621l96J290J235k17j643
1955g24j450J119K000J71j472j280Q3J597J013l15j664p84J311J419L42j551j510
1972a695M54J443Q63n77j589o87J092J615J73j365j491M87J596J179p06j921k22
1989a351J268J459j02j443r99N02J415M64q85j421l35J392J203J81j581j048R43
2006c38J500K45o95j424j49J333J220l07j663j110R70J454K69j027j355j48J355
2023A30R53k91j241p52Q58J487M49j529r56K60J289R99q95j192o77J091R93j34
2041H42j187j207M08J416R46j172j077l63J030J442k18j185j019O29J270N03q26
$$ y = [1692, 210, -1057, -716, 994, 1826, 1127, -444, -1359, 157, 1570, 1671, 60, -1303, -999, 1079, 1321, 408, -1176, -1378, 69, 1564, 1277, -356, -1321, -771, 1108, 1932, 628, -993, -1389, -99, 1136, 919, -724, -2174, -1055, 945, 1116, -356, -1636, -1553, 44, 1057, 742, -922, -1706, -395, 1024, 1366, -185, -1695, -1241, 202, 1065, 488, -1101, -1788, -696, 919, 1092, -273, -1764, -1277, 319, 1498, 792, -1129, -1351, -83, 1376, 1274, -169, -1168, -666, 749, 1213, 328, -1093, -1428, -36, 1167, 1348, -233, -1281, -338, 1162, 1407, 712, -712, -861, 472, 1692, 1385, -278, -1388, -418, 1036, 1305, 278, -1077, -1225, 130, 1083, 792, -449, -1201, -343, 1144, 1593, 64, -892, -632, 657, 1656, 761, -431, -1108, -17, 976, 842, -345, -1552, -1144, 272, 1218, 46, -1031, -1394, -364, 1078, 860, -325, -1344, -715, 555, 1058, 232]
2058B32j511m19J495J155l63j327q38O04J295L19o16j089l87J438J042k69j418
2075f57o73N86J585L85j022j321J34J000J045k65j313n78O55J421J58q08j457
2092a125O36J114M89m54r49o31J081J237l02r56q52J40J245M76o55j134j92O33
2110a99J389q6j322o85O50J205L25o56j164k82J115P13j26j085q99P10Q31M99
2128I33r58r86k35J014R34k64q57o89O47J049K56n69j066M4P14P76l31j125m39
2147a152N42J058L76j252o77K67O86Q16l08j021l00N29J025J97r11q62M66J087
2165E66K39p33n51m94P84P38j6o42q43O80O85M95n14q97MQ21P88k10o82p72N12
2186d2R30l4p47l41l30O39O11J86j141l29N70O60M25o88p90k09J112O40n04o29
$$ y = [232, -1279, -1698, -203, 952, 589, -738, -1576, -972, 323, 642, 26, -1063, -1450, -12, 1030, 761, -657, -1330, -744, 841, 1226, 204, -1117, -983, 17, 1062, 797, -516, -1094, -439, 982, 1140, 332, -1125, -489, 625, 1114, 660, -289, -920, 161, 1398, 1096, 140, -712, -572, 673, 1149, 494, -640, -832, -199, 1190, 1104, -218, -903, -253, 952, 1277, 621, -543, -825, 290, 1003, 877, -208, -1107, -397, 434, 933, -25, -1011, -1246, -232, 702, 438, -419, -1108, -461, 588, 844, 275, -791, -747, -33, 743, 412, -713, -1152, -610, 448, 824, -428, -1105, -838, -152, 664, 356, -665, -965, -436, 589, 786, -125, -987, -521, 566, 805, 72, -479, -973, -189, 549, 533, -109, -952, -272, 413, 908, 394, -503, -499, 322, 1110, 900, 218, -554, -42, 888, 854, 107, -234, -564, 75, 686, 872, -269, -598, -28, 632, 1057, 369, -421, -630, 482, 1122, 618, -11]
2206a1m71L88P89o4p84q4l72J070J62m10o26m20Q33N92q3r11j85M40K22P44p32
2227H7n95r7O31M43k51p37m76M56P68P0k73q87j35P85P04K6n82o17L41O99J51
2248E11m54o92J55Q11J80l47o49k73L25N40L36l34q32mJ108K35j01r92J07M98
2268A28O24K69r41k93L3N10M38k91q68j67M64L45J78n33l01K58M58M82n14l19
2288d0l8M67M63l87k83k75Q3L23J58m01l83k8j3O59J1p41K4QO79L45m06m30l77
2311e82M78P45m97k43n17K43O07j33l58k67k08Q25K83n30k71l24P23K15j07k39
2331a57m47M4P68J2j20n01j74L55K70j38k10j52O4J39Q15m80l52K3J97M74M1l92
2353G9m22M67M19K2l34m47k20K01L54K25k18k98J90L34M12n71l15j79O13L94k88
$$ y = [-11, -482, -94, 695, 631, -153, -237, -609, 461, 623, 213, -413, -833, 0, 592, 509, -402, -587, -147, 75, 819, 87, -508, -605, 26, 469, 218, -519, -995, -539, 229, 299, 26, -861, -996, -211, 493, 519, -63, -680, -339, 360, 511, 57, -635, -480, 331, 511, 164, -485, -758, -433, 107, 443, 109, -723, -727, 381, 616, 515, -477, -370, 128, 752, 1021, 80, -213, -180, 330, 768, 477, -391, -558, -94, 251, 429, -104, -405, -147, 311, 793, 279, -40, -78, 389, 852, 465, 182, -93, -10, 313, 471, 70, -313, -341, -354, 305, 316, -425, -401, -393, 286, 631, 225, -205, -582, -104, 641, 144, -99, -616, -373, 234, 101, -257, -524, -732, 93, 376, -154, -425, -749, -26, 189, 82, -157, -604, -560, 208, 220, 100, -401, -575, -220, 50, -88, -298, -450, -386, -247, 568, 88, -264, -241, -44, 430, 471, 79, -343, 124, 543, 565, 231, -216, -436, -235, 119, 344, 126, -172, 18, 352, 764, 193, -122, -301, 312, 706, 418]
2374D18l62k56K58M97j2k07m71L6N4J66J43j38l86J94L69j39J08n99o0K64O49
2395E26Oo00J22k52N52O1n52k09K20rJ26Ok73k47J71K43L46o48o0K53J32J32K00
2418B46l19j31MK76P5j87k94O3R1L16r6k36j23M28J24j66j49j24n0K03K05p2j4
2441G0k79L24J24k66j75K59m22J72L51M7rl80K70Q8L16j48n04l5L95J67K27n53
2463C9j96L97P8m3j40l44N30p4o5P3k71m58L92K32k3J84m94J33J81m6J91L6m15
2486a03J31N8P0l8k35k06N3M20pk95K7j64Q1M50l00q7J42j25L95q8k80l42J02
2509c41K20K14q5M1l14J61k4L47m69k47J22J95N73l69k08J94NP9K4P4l44J38L79
2532C65j15l8m48P5M0K21P4j18k14K65J09J00m8n27J41L24L01J08l52l7j33K18
$$ y = [418, 56, -200, 58, 555, 543, 336, -135, -99, -45, 121, 264, 126, -260, -66, 303, 164, 272, -327, -387, -123, 526, 532, -68, 54, -198, 354, 415, -137, -346, -126, -135, -9, -3, -276, -523, -352, -109, 237, -411, -471, -218, -86, 46, 246, -73, -204, -200, 76, 151, -36, -330, -267, -176, 140, 44, -192, -315, 113, 237, 71, -78, -202, -252, -49, 156, 84, 70, -209, 115, 239, -27, -202, 57, -365, -193, 158, 205, 196, -184, 86, 174, 490, 342, -162, -197, 198, 365, 592, 39, -157, 240, 318, 275, 135, -209, 321, 247, 182, 255, -16, -474, -82, 150, 127, 311, -183, -50, 131, 85, 276, 312, -103, 28, 86, 156, 118, -117, -323, -270, 150, 143, -152, -125, -289, -208, 242, -58, -145, -3, -128, 267, 179, -101, -443, -341, -121, 93, 8, 49, -265, -104, -128, 219, -250, -497, -375, -180, 393, 24, -184, 10, 15, 94, 118, 192, -152, -14, 365, 250, 212, -236, -161, -121, 100, 174, 56, -158, 107, 216, 316, 268, -259, -118, 206, 507, 615, 263, 226, 93, 311]
2554C11Pj04n12J76K38K79n3p02N23j93L64Q9r0n38L19n0N55m95k36k7j30K74
2576Ej48L0k26O2J9K62k20P2m61J58M07K67o36j50K89O5O66m25m44k5L53J27Q5
2599A32n36j2K63L8K29l83j36j11N80J56r4l66j77M71m2M30m57k36j05M45N4J19
2621B62j67k47r9M77K54n93J13p4l7L77N3m45Q2Q7J13J83n0o21m5O99J24m8q51
2644d53K99K54M25lm48l84J18L14N24j62k17n86K7P32L1n44l17J10K96M68n10
2665b6k03m52N54L95J2k49l91p9P64J22k45l82k46L38M29j83k73n13K00L02L98
2686B72m49j74k86M01J87N2k65k42J86N25L2j72m62K0K78M88k18l77k04L00K62
2707A54J34l49k36o7K90L81j17j39p02P60K39M48p63j89o0M86N1k04l71M0J81
$$ y = [311, 318, 214, -298, -122, 116, 395, 342, -360, 163, -30, 334, 423, 333, -205, 114, 64, 619, 124, -112, -139, -269, 5, -143, -113, -339, -277, -258, 4, -216, -144, -605, -447, -40, 227, -409, -559, -270, -205, 461, 36, -408, -433, -80, 47, 132, -404, -416, -153, -115, 114, -269, -405, -516, 64, 220, 126, -240, -417, 54, 12, 442, -15, -251, -356, 89, 143, 262, 95, -152, -251, 226, 480, -113, 0, -74, -111, 266, 319, -126, -44, 43, 156, 339, 289, -332, -377, 322, 446, 398, -453, -154, 100, 525, 522, 74, -310, -192, 122, 646, 484, 267, -319, -292, 440, 471, -73, -390, -280, 16, 484, -26, -229, -681, -127, 268, 280, 31, -360, -439, 325, 447, 202, -180, -426, -88, 341, 158, -115, -628, -428, -126, 272, -177, -351, -637, -236, -49, 3, -262, -504, -318, 207, 239, 67, -395, -375, -97, 391, 173, -204, -408, -108, 154, 288, -61, -297, -364, -74, 307, 190, 51, -651, 109, 348, 796, 33, -156, -216, 270, 321, 117, -254, -214, -33]
2728c3L90J75n68j29K77K60Q5%p22q2M81M68j70n84j29J3N14L29n44l23L4L71
2750A13L90k44k35k78J0O66J6l07l11oM89N2k26j99l41J99K11J65R8n59k43M99
2772d1M47l15m63jJ84N04L6m28j94K10J88K28k05m04n9K65M80k84j80m68L19N13
2794C32J55j27p61J93J85N01j05m31m12L55N97k61Q4o21o5P57L76m03m39m34M68
2815e6L36L1j5m56M5L91J92j10n55k66O98L05j81k17n90J18L40K81J79o30o9K65
2837C6M42j19j96l95LM37O27n68n90J23J24N76k95n10l62N18L17L06o03l28J9
2858d38m5J029k18m02m86K90M67L75l18q04L4O42N29l83l42l72L3P20N6m78l13
2879d24L9L38M25o2m11Mk29Q27j37m46l29J18N43L68n93m24J0M07L27O5m41k24
$$ y = [-33, 357, 532, -36, -165, 112, 372, 457, 457, -265, -347, 134, 602, 432, -152, -281, -268, 246, 575, 31, -292, -258, 113, 503, 259, 24, -254, -244, 422, 438, 131, -180, -186, 303, 355, 129, -70, -411, -212, -1, 164, 262, -297, -540, -41, 406, 91, -372, -373, -189, 315, 351, -77, -271, -61, 127, 355, 150, -254, -313, -48, 432, 148, -32, -500, -181, 332, 487, 360, -401, -208, -23, 478, 373, -58, -470, -115, 482, 221, 305, -316, -381, 376, 752, 349, -90, -524, -56, 280, 311, 296, -160, -115, 276, 468, 358, -197, -463, 235, 540, 359, 142, -448, -330, 10, 291, 470, -160, -229, 36, 478, 359, 163, -232, -229, 208, 835, 267, -323, -200, -76, 500, 205, -305, -667, -149, 168, 474, -129, -457, -438, -483, 546, 328, -74, -560, -270, 197, 572, 254, -550, -516, 126, 655, 272, -70, -442, -409, 311, 367, -111, -424, -385, -47, 378, 316, -95, -91, -320, 507, 370, -76, -405, -287, 256, 624, 31, -393, -383, 24, 351, 416, -25, -249]
2901b49j63M66M72l52o37K08K72N39j64n65m2k23O94L68m18m44J06M64K21k1p29
2922a97k79M61L38J31m50m89L27K40N19k07o43k36O78J87j59q8o24p0M76M56j20
2943B51p48j3K18N79P0n26j19p3L06L62m49L1p60P22O33q4n57n38K78M03J78k80
2965a16k45k01N31M90n2r27N3K86N60j6k23m99q7M98M89q3p36j69L41J70L19m69
$$ y = [-249, -412, 54, 526, 174, -463, -255, 17, 556, 392, -173, -215, -438, 256, 624, 206, -238, -132, 332, 553, 532, -197, -476, -15, 323, 454, 4, -485, -158, 82, 601, 394, -249, -485, 193, 380, 221, 133, -491, -561, -85, 371, 251, -497, -510, -292, 287, 357, -169, -288, -361, -55, 307, -142, -111, -871, -149, 484, 400, -157, -695, -417, -14, 164, -116, -361, -562, -31, 459, 407, -520, -467, -181, 379, 363, 140, -359, -446, 52, 541, 458, -278, -447, -106, 64, 383, -86]
$$ [...]
8191a14
##END NTUPLES=NMR FID
##END=
