##TITLE=1H_Pr 5055-37
 CDCl3
 8 sc, 
 20.10.2022
##JCAMPDX= 6.0         $$ Bruker NMR JCAMP-DX V2.0
##DATA TYPE= NMR FID
##DATA CLASS= NTUPLES
##ORIGIN= UXNMR, Bruker Analytische Messtechnik GmbH
##OWNER= root
$$ XWIN-NMR		Version 3.5
$$ Thu Oct 20 16:05:22 2022 Russian Standard Time (UT+4h)  she@DPX200
##.OBSERVE FREQUENCY= 200.1313499994
##.OBSERVE NUCLEUS= ^1H
##.DELAY= (6, 6)
##.ACQUISITION MODE= SIMULTANEOUS
##.ACQUISITION SCHEME= undefined
##.AVERAGES= 8
##.DIGITISER RES= 18
##SPECTROMETER/DATA SYSTEM= spect
##.PULSE SEQUENCE= zg30
##.SOLVENT NAME= CDCl3
##.SHIFT REFERENCE= (INTERNAL, CDCl3, 0, 15.7039)
##AUDIT TRAIL= $$ (NUMBER, WHEN, WHO, WHERE, WHAT)
$$ ##TITLE= Audit trail, XWIN-NMR		Version 3.5
$$ ##JCAMPDX= 5.01
$$ ##ORIGIN= Bruker BioSpin GmbH
$$ ##OWNER= she
$$ F:/spectra/data/she/nmr/H-F/1/audita.txt
$$ ##AUDIT TRAIL=  $$ (NUMBER, WHEN, WHO, WHERE, WHAT)
(   1,<2022-10-20 16:04:16.09 +0400>,<she>,<DPX200>,
      <created by zg, POWCHK disabled, PULCHK disabled
       configuration hash MD5:
       00 E9 B6 7A A2 85 ED C7 34 08 36 98 17 FE 4E 26
       data hash MD5: 16K
       F1 7D 74 1A 3D D1 F7 03 EB 83 A5 59 E6 2D 7B C7>)
$$ ##END=
$$ 
$$ hash MD5
$$ B9 CE 1C C3 36 8F AA 4D 16 20 CF 90 3C 27 F6 0A
##$RELAX= 
##$RELAX= 
##$RELAX= 
##$RELAX= 
##$RELAX= 
##$RELAX= 
$$ Bruker specific parameters
$$ --------------------------
##$DU= <F:/spectra>
##$EXPNO= 1
##$NAME= <H-F>
##$PROCNO= 1
##$TYPE= <nmr>
##$USER= <she>
##$AMP= (0..31)
100 100 100 100 100 100 100 100 100 100 100 100 100 100 100 100 100 100 
100 100 100 100 100 100 100 100 100 100 100 100 100 100 
##$AQSEQ= 0
##$AQ_mod= 1
##$AUNM= <au_zg>
##$AUTOPOS= <>
##$BF1= 200.13
##$BF2= 200.13
##$BF3= 200.13
##$BF4= 200.13
##$BF5= 200.13
##$BF6= 200.13
##$BF7= 200.13
##$BF8= 200.13
##$BYTORDA= 1
##$CFDGTYP= 0
##$CFRGTYP= 5
##$CHEMSTR= <none>
##$CNST= (0..31)
1 1 145 1 1 1 1 1 1 1 1 1 1 1 1 1 1 1 1 1 1 1 1 1 1 1 1 1 1 1 1 1 
##$CPDPRG= <>
##$CPDPRG1= <>
##$CPDPRG2= <>
##$CPDPRG3= <>
##$CPDPRG4= <mlev>
##$CPDPRG5= <mlev>
##$CPDPRG6= <mlev>
##$CPDPRG7= <mlev>
##$CPDPRG8= <mlev>
##$CPDPRGB= <>
##$CPDPRGT= <>
##$D= (0..31)
0 1.2 0 0 0 0 0 0 0 0.06 0 0.03 0 0 0 0 0.0002 0 0 0 0 0 0 0 0 0 0 0 0 
0 0 0 
##$DATE= 1666267455
##$DBL= (0..7)
120 120 120 120 120 120 120 120 
##$DBP= (0..7)
150 150 150 150 150 150 150 150 
##$DBP07= 0
##$DBPNAM0= <>
##$DBPNAM1= <>
##$DBPNAM2= <>
##$DBPNAM3= <>
##$DBPNAM4= <>
##$DBPNAM5= <>
##$DBPNAM6= <>
##$DBPNAM7= <>
##$DBPOAL= (0..7)
0.5 0.5 0.5 0.5 0.5 0.5 0.5 0.5 
##$DBPOFFS= (0..7)
0 0 0 0 0 0 0 0 
##$DE= 6
##$DECBNUC= <off>
##$DECIM= 32
##$DECNUC= <off>
##$DECSTAT= 4
##$DIGMOD= 1
##$DIGTYP= 9
##$DL= (0..7)
0 120 120 120 120 120 120 120 
##$DP= (0..7)
150 150 150 150 150 150 150 150 
##$DP07= 0
##$DPNAME0= <>
##$DPNAME1= <>
##$DPNAME2= <>
##$DPNAME3= <>
##$DPNAME4= <>
##$DPNAME5= <>
##$DPNAME6= <>
##$DPNAME7= <>
##$DPOAL= (0..7)
0.5 0.5 0.5 0.5 0.5 0.5 0.5 0.5 
##$DPOFFS= (0..7)
0 0 0 0 0 0 0 0 
##$DQDMODE= 0
##$DR= 18
##$DS= 0
##$DSLIST= <SSSSSSSSSSSSSSS>
$$ [...]
##$SUBNAM2= <"">
##$SUBNAM3= <"">
##$SUBNAM4= <"">
##$SUBNAM5= <"">
##$SUBNAM6= <"">
##$SUBNAM7= <"">
##$SUBNAM8= <"">
##$SUBNAM9= <"">
##$SW= 18.0517283424941
##$SWIBOX= (0..15)
0 0 2 0 0 0 0 0 0 0 0 0 0 0 0 0 
##$SW_h= 3612.71676300578
##$TD= 16384
##$TD0= 1
##$TE= 0
##$TE2= 300
##$TE3= 300
##$TEG= 300
##$TL= (0..7)
0 120 120 120 120 120 120 120 
##$TP= (0..7)
150 150 150 150 150 150 150 150 
##$TP07= 0
##$TPNAME0= <>
##$TPNAME1= <>
##$TPNAME2= <>
##$TPNAME3= <>
##$TPNAME4= <>
##$TPNAME5= <>
##$TPNAME6= <>
##$TPNAME7= <>
##$TPOAL= (0..7)
0.5 0.5 0.5 0.5 0.5 0.5 0.5 0.5 
##$TPOFFS= (0..7)
0 0 0 0 0 0 0 0 
##$TUNHIN= 0
##$TUNHOUT= 0
##$TUNXOUT= 0
##$USERA1= <user>
##$USERA2= <user>
##$USERA3= <user>
##$USERA4= <user>
##$USERA5= <user>
##$V9= 5
##$VALIST= <valist>
##$VCLIST= <CCCCCCCCCCCCCCC>
##$VD= 0
##$VDLIST= <DDDDDDDDDDDDDDD>
##$VPLIST= <PPPPPPPPPPPPPPP>
##$VTLIST= <TTTTTTTTTTTTTTT>
##$WBST= 1024
##$WBSW= 4
##$XGAIN= (0..3)
0 0 0 0 
##$XL= 0
##$YL= 0
##$YMAX_a= 460919
##$YMIN_a= -802889
##$ZGOPTNS= <>
##$ZL1= 120
##$ZL2= 120
##$ZL3= 120
##$ZL4= 120
##$ABSF1= 10
##$ABSF2= 0
##$ABSG= 5
##$ABSL= 3
##$ALPHA= 0
##$AQORDER= 0
##$ASSFAC= 0
##$ASSFACI= 0
##$ASSFACX= 0
##$ASSWID= 0
##$AUNMP= <proc_1d>
##$AZFE= 0.1
##$AZFW= 0.1
##$BCFW= 1
##$BC_mod= 2
##$BYTORDP= 1
##$COROFFS= 0
##$CY= 11.3945322036743
##$DATMOD= 1
##$DC= 2
##$DFILT= <>
##$DTYPP= 0
##$F1P= 2.36226072786647
##$F2P= -0.459571619588291
##$FCOR= 0.5
##$FTSIZE= 0
##$FT_mod= 4
##$GAMMA= 1
##$GB= 0.15
##$INTBC= 1
##$INTSCL= 1
##$ISEN= 128
##$LB= 0.24
##$LEV0= 0
##$LPBIN= 0
##$MAXI= 10000
##$MC2= 0
##$MEAN= 0
##$ME_mod= 0
##$MI= 1.114404
##$NCOEF= 0
##$NC_proc= 0
##$NLEV= 6
##$NOISF1= 3.799351
##$NOISF2= 2.8
##$NSP= 1
##$NTH_PI= 0
##$NZP= 0
##$OFFSET= 15.70392
##$PC= 1
##$PHC0= -18039.34
##$PHC1= 14.6007
##$PH_mod= 1
##$PKNL= yes
##$PPARMOD= 0
##$PSCAL= 0
##$PSIGN= 0
##$REVERSE= no
##$SF= 200.130013532006
##$SI= 16384
##$SIGF1= 3
##$SIGF2= 2
##$SINO= 400
##$SIOLD= 16384
##$SREGLST= <1H.CDCl3>
##$SSB= 0
##$STSI= 0
##$STSR= 0
##$SW_p= 3612.71676300578
##$SYMM= 0
##$S_DEV= 0
##$TDeff= 0
##$TDoff= 0
##$TI= <>
##$TILT= no
##$TM1= 0
##$TM2= 0
##$TOPLEV= 0
##$USERP1= <user>
##$USERP2= <user>
##$USERP3= <user>
##$USERP4= <user>
##$USERP5= <user>
##$WDW= 1
##$XDIM= 8192
##$YMAX_p= 0
##$YMIN_p= 0
$$ End of Bruker specific parameters
$$ ---------------------------------
##NTUPLES= NMR FID
##VAR_NAME=  TIME,          FID/REAL,        FID/IMAG
##SYMBOL=    X,             R,               I
##VAR_TYPE=  INDEPENDENT,   DEPENDENT,       DEPENDENT
##VAR_FORM=  AFFN,          ASDF,            ASDF
##VAR_DIM=   8192,          8192,            8192
##UNITS=     SECONDS,       ARBITRARY UNITS, ARBITRARY UNITS
##FACTOR=    0.0002768,     1,               1
##FIRST=     0,             0,               0
##LAST=      2.2672688,     0,               0
##MIN=       0,             -802889,         0
##MAX=       2.2672688,     460919,          0
$$ Real data points
##PAGE= N=1
##DATA TABLE= (X++(R..R)), XYDATA
$$ plain form
0 0 0 0 0 0 0 0 0 8 -8 8 -8 16 -16 24 -30 32 -43 56 -64 80 -96 119 -137 162 -192 224 -261 303 -350 399
30 399 -456 522 -595 673 -759 856 -963 1080 -1206 1347 -1499 1667 -1850 2049 -2266 2503
46 2503 -2763 3048 -3358 3700 -4076 4490 -4950 5459 -6028 6673 -7402 8237 -9206 10343
60 10343 -11705 13363 -15438 18117 -21734 26901 -34919 49131 -81750 315033 -262955 -694941
72 -694941 446882 279867 -328408 923 195758 -301198 44198 383813 -241480 -386281
82 -386281 360517 184046 -391580 -10248 326954 -110461 -89998 186387 -124791 -182728
92 -182728 291856 77961 -346898 57328 295037 -194009 -155364 251049 -40568 -283467
102 -283467 153525 200751 -171587 -19016 162682 -133788 -64433 258192 -37165 -281237
$$ packed form
0@%%%%%%%Qj6J6j6K4l2M0n4O2p5R9j20J44j76K15k56K99l54M16m85N64o53P49
30C99q55R78j117J268j432J615j819K043k286K553k846L166l517L899m315M769
46B503n266N811o406P058p776Q566r440J0409j1487J2701j4075J5639j7443J9549
60A0343k2048K5068k8801L3555l9851M8635o1820Q4050j30881L96783n77988m31986
72f94941J141823j67015o08275L29331J94835m96956L45396L39615o25293j44801
82c86281P46798j76471n75626L81332L37202m37415K0463K76385l11178n7937
92a82728M74584k13895m24859M04226K37709m89046L8645M06413k91617k42899
102b83467M36992M7226l72338J52571J81698k96470O9355L22625k95357k44072
$$ plain form
112 -281237 150449 241759 -197878 -127959 198213 -17626 -188241 75148 81049 -122205 28487
123 28487 119115 -128436 -95792 174536 51297 -172137 -7737 139918 6265 -49579 14814
134 14814 -8022 -8183 31816 -30872 -35465 82816 34401 -115227 -24628 121485 9549 -108627
146 -108627 -8841 62564 8962 6955 8552 -60781 -23123 83710 5154 -108748 8710 110155
158 110155 -31274 -100736 44152 69729 -53668 -37644 36189 -848 8754 59411 -34248
169 -34248 -80963 70154 82380 -92240 -50099 110838 13148 -100141 28270 68799 -57643
180 -57643 -31754 44651 -30736 -19715 82721 -19282 -114972 49399 100879 -79951 -66252
191 -66252 81252 12470 -55181 43038 14139 -72313 39854 71295 -89357 -36604 129526
$$ packed form
112b81237M31686R1310m39637O9919L26172k15839j70615K63389N901k03254J50692
123B8487R0628k47551L2644K70328j23239k23434J64400J47655j33653n5844O4393
134A4814k2836j61L9999o2688m593J18281m8415j49628R0599J46113j11936j18176
146a08627R9786P1405n3602k007J597o9333L7658J06833p8556j13902J17458J01445
158A10155j41429o9462J44888K5577j23397J6024P3833l7037R602N0657r3659
169c4248m6715J51117J2226j74620M2141J60937r7690j13289J28411M0529j26442
180e7643K5889P6405p5387J1021J02436j02003r5690J64371N1480j80830J3699
191f6252J47504o8782o7651R8219k8899q6452J12167L1441j60652N2753J66130
$$ plain form
202 129526 1493 -121834 45107 88372 -71549 -28423 75275 -34604 -52052 84593
212 84593 8067 -106713 36894 83139 -87766 -47367 104929 -5448 -95489 46496 51291
223 51291 -72762 4337 68655 -60091 -38184 101077 689 -101654 45227 76844 -72123
234 -72123 -25562 82142 -20933 -55861 64057 16800 -79414 30681 67141 -70519 -35155
245 -35155 84697 -11447 -76905 47205 37703 -77557 209 72818 -44620 -50951 68234
256 68234 8767 -71127 35104 52218 -65898 -14833 81949 -17700 -64483 52154 37765
267 37765 -61204 5468 56345 -39556 -28432 62374 -5494 -64870 36633 44530 -60061 -17698
279 -17698 58474 -19364 -44870 42372 10935 -56797 19568 46085 -48649 -24514 59737 -5381
$$ packed form
202A29526j28033j23327J66941M3265j59921M3126J03698j09879j7448J36645
212H4593p6526j14780J43607M6245j70905M0399J52296j10377r0041J41985M795
223E1291j24053P7099O4318j28746K1907J39261j00388j02343J46881L1617j48967
234g2123M6561J07704j03075l4928J19918m7257r6214J10095L6460j37660L5364
245c5155J19852r6144o5458J24110r502j15260P7766P2609j17438o331J19185
256F8234n9467p9894J06231J7114j18116N1065R6782r9649m6783J16637j4389
267C7765r8969O6672N0877r5901J1124R0806o7868n9376J01503P897j04591M2363
279a7698P6172p7838k5506Q7242l1437o7732P6365K6517r4734K4135Q4251o5118
$$ plain form
291 -5381 -53138 35064 33204 -49706 1011 54181 -27465 -34597 52451 12169 -54286 19348 44466
304 44466 -40701 -19735 50257 -10306 -46549 32774 23964 -50860 -2851 45786 -25853 -35206
316 -35206 38223 8357 -44396 14772 32896 -34694 -12858 44109 -9187 -36255 31726 22951
328 22951 -37858 3212 39758 -20487 -22918 37106 4356 -37443 18927 28319 -35197 -10434
340 -10434 39362 -13432 -35747 28484 16452 -41228 380 35083 -23607 -24115 33392 1559
352 1559 -36514 18748 27467 -33643 -8774 41171 -7798 -32593 27320 21046 -31401 3030 31882
365 31882 -19041 -17139 33308 771 -34797 16644 26357 -30691 -12580 31313 -9313 -28087
377 -28087 21711 10404 -33317 3617 27731 -22156 -18616 30180 513 -30018 17936 22318
$$ packed form
291e381m7757Q8202j860q2910N0717N3170q1646p132Q7048m0282o6455P3634K5118
304D4466q5167K0966O9992o0563l6243P9323q810p4824M8009M8637p1639r353
316c5206P3429k9866n2753N9168J8124o7590K1836N6967n3296k7068O7981q775
328B2951o0809M1070L6546o0245k431O0024l2750m1799N6370R392o3516K4763
340a0434M9796n2794k2315O4231j2032n7680M1608L4703n8690n08N7507l1833
352A559l8073N5262Q719o1110K4869M9945m8969k4795N9913o274n2447L4431K8852
365C1882n0923J902N0447l2537l5568N1441R713n7048J8111M3893m0626j8774
377b8087M9798j1307m3721L6934K4114m9887L540M8796k9667l0531M7954M382
$$ plain form
389 22318 -29004 -4664 35851 -8859 -26623 25110 16434 -27386 4677 25935 -19721 -12489
401 -12489 31921 -3726 -34637 17897 25109 -29252 -13480 26762 -6930 -21800 18155 3290
413 3290 -28671 11909 25388 -28162 -17008 35196 3038 -31914 12748 22902 -20428 -3341
425 -3341 26391 -11099 -17725 27383 8586 -30496 8379 28073 -20261 -16541 26291 112 -26088
438 -26088 12682 13605 -25170 -1366 23304 -17867 -19192 27202 3389 -34206 10296 29485 -22626
451 -22626 -18375 27929 3812 -21765 13886 12149 -21585 7043 27432 -18974 -18815 30330 8908
464 8908 -29080 6805 20536 -19265 -5826 22700 -14270 -22121 27383 9522 -37904 1032
476 1032 33112 -16734 -24580 23453 6119 -26520 11278 21106 -22260 -9368 26955 -1370 -17512
$$ packed form
389B2318n1322K4340M0515m4710j7764N1733q676m3820L2063K1258m5656P232
401a2489M4410l5647l0911N2534P212n4361J5772M0242l3692j4870L9955j4865
413C290l1961M0580J3479n3550J1154N2204l2158l4952M4662J0154m3330J7087
425c341K9732l7490o626M5108j8797l9082L8875J9694m8334L720M2832k6179k6200
438b6088L8770R23l8775K3804K4670m1171j325M6394k3813l7595M4502J9189n2111
451b2626M251M6304k4117k5577L5651j737l3734K8628K0389m6406J59M9145k1422
464H908l7988L5885J3731l9801J3439K8526l6970p851M9504j7861m7426L8936
476A032L2080m9846p846M8033j7334l2639L7798R828m3366J2892L6323k8325j6142
$$ plain form
489 -17512 15934 6968 -19895 12565 22149 -24132 -13464 32543 3592 -29275 7516 17759
501 17759 -16379 -2407 16477 -19085 -15644 31987 5877 -42589 -1418 36709 -5926 -25519
513 -25519 5623 5741 -2542 14885 -2811 -28506 13486 36989 -18870 -30534 26174 22036 -22153
526 -22153 -4077 16889 -9632 -3626 21372 -10389 -26794 21034 23044 -29094 -17495 24969
538 24969 3595 -20475 3634 7124 -12087 2295 9776 -12569 -2941 17171 -8205 -16039 21104
551 21104 14025 -25508 -3297 28267 -3349 -19156 13573 10028 -14645 5410 14059 -17004 -6935
564 -6935 24073 -3469 -27350 9895 21029 -15810 -13894 10771 -1304 -6560 10357 -6110 -18506
577 -18506 15547 18470 -23759 -12037 28090 3620 -25406 8640 21297 -12130 -7491 15094
$$ packed form
489a7512L3446q966k6863L2460R584m6281J0668M6007k8951l2867L6791J0243
501A7759l4138J3972J8884l5562L441M7631k6110m8466M1171L8127m2635j9593
513b5519L1142J18q283J7427j7696k5695M1992K3503n5859j1664N6708m138m4189
526b2153J8076K0966k6521O006K4998l1761j6405M7828K010n2138J1599M2464
538B4969k1374k4070K4109L490j9211J4382P481k2345R628K0112k5376p834L7143
551B1104p079l9533K2211L1564l1616j5807L2729l545k4673K0055Q649l1063J0069
564f935L1008k7542k3881L7245J1134l6839J916K4665j2075n256J6917j6467j2396
577a8506L4053K923m2229J1722M0127k4470k9026L4046J2657l3427M639K2585
$$ plain form
589 15094 -1935 -8671 14189 2835 -19164 6770 19350 -13855 -14229 15293 3023 -15733 3819
602 3819 6359 -11970 1768 10686 -15586 -9046 23714 475 -29625 7662 27940 -13657 -18582
615 -18582 18560 8338 -15041 6099 10644 -12146 2941 18491 -13006 -14956 24270 9526
627 9526 -27857 -1431 23081 -6892 -13625 9973 -3276 -12716 14791 5493 -27457 537 29041
640 29041 -11948 -26304 18030 15764 -19919 -3141 15920 -6898 -3581 17091 -7168 -15992 20909
653 20909 12890 -25558 -959 27045 -8893 -18872 17125 7052 -19855 4952 12789 -17934 -3300
666 -3300 22349 -11965 -25121 21034 16671 -28301 -8098 24432 -4091 -14889 12692 1254
678 1254 -14706 14501 12756 -23420 -2045 29887 -5183 -23523 15529 15014 -16766 536 15131
$$ packed form
589A5094j7029o736K2860j1354k1999K5934J2580l3205l74K9522j2270j8756J9552
602C819K540j8329J3738Q918k6272O540L2760k3239l0100L7287K0278m1597m925
615a8582L7142j0222k3379K1140M545k2790J5087J5550l1497j950L9226j4744
627I526l7383K6426K4512k9973o733K3598j3249r440K7507r298l2950K7994K8504
640B9041m0989j4356M4334k266l5683J6778J9061k2818L317K0672k4259q824L6901
653B0909q019l8448K4599K8004l5938r979L5997j0073k6907K4807P837l0723J4634
666c300K5649l4314j3156M6155m363m4972K0203L2530k8523j0798K7581j1438
678A254j5960K9207j745l6176K1375L1932l5070j8340L9052n15l1780J7302J4595
$$ plain form
691 15131 -13319 -6687 21526 -4902 -23593 13597 15290 -22087 -6061 20688 -8179 -17886 15781
704 15781 6216 -20269 4294 15779 -14367 -5863 20030 -4436 -18022 17154 13906 -21123 -2136
717 -2136 23237 -5368 -14445 14071 4961 -14482 7982 11373 -18294 -4579 22004 -5786 -22166
730 -22166 11486 12745 -17742 -4573 14329 -8504 -9343 14966 -953 -18515 10567 15849 -17529
743 -17529 -7394 21605 -909 -16731 11462 10859 -14227 1802 15785 -10468 -9033 18487 1337
756 1337 -20124 7900 15489 -15476 -8817 16446 -3454 -15516 10287 6251 -17349 1481 15620
769 15620 -12354 -11180 17654 1973 -18261 8203 14477 -14136 -4449 18620 -3778 -13945 14774
782 14774 8428 -17635 3571 17859 -12057 -10583 18513 874 -19549 7651 13357 -16674 -6007
$$ packed form
691A5131k8450O632K8213k6428j8691L7190J693l7377J6026K6749k8867r707L3667
704A5781r565k6485K4563J1485l0146Q504K5893k4466j3586L5176l248l5029J8987
717b136K5373k8605r077K8516r110j9443K2464L391k9667J3715K6583k7790j6380
730b2166L3652J259l0487J3169J8902k2833q39K4309j5919j7562K9082N282l3378
743a7529J0135K8999k2514j5822K8193o03k5086J6029J3983k6253J435K7520j7150
756A337k1461K8024P589l0965O659K5263j9900j2062K5803m036k3600J8830J4139
769A5620k7974J174K8834j5681k0234K6464O274k8613R687K3069k2398j0167K8719
782A4774o346k6063K1206J4288k9916J474K9096j7639k0423K7200N706l0031J0667
$$ plain form
795 -6007 16971 -7291 -15318 13986 5390 -20110 3598 17186 -13767 -10482 18834 608 -17712
808 -17712 11090 12889 -16346 -780 19916 -7977 -13162 17915 6082 -19300 6042 16948
820 16948 -14788 -8526 19200 -3167 -18788 11745 9779 -19705 -1428 17698 -11447 -13886 17007
833 17007 2959 -20367 7169 15463 -15722 -6148 19867 -3542 -16084 14634 9853 -17692 2348
846 2348 18822 -10903 -10629 18807 1817 -18939 9508 13458 -17354 -4669 18724 -6999 -16390
859 -16390 13843 5688 -19662 3488 15511 -14812 -9727 18788 -1185 -18645 10792 12795 -16708
872 -16708 -1846 18783 -7308 -12253 17254 5481 -18111 6839 16821 -13832 -7894 18836 -1362
885 -1362 -17044 10530 10154 -17528 -1361 16493 -10336 -13402 15132 2515 -18978 5464 13822
$$ packed form
795f007K2978k4262q027K9304q596k5500K3708J3588l0953L285K9316j8226j8320
808a7712K8802J799k9235J5566K0696k7893n185L1077j1833k5382K5342J0906
820A6948l1736O262K7726k2367j5621L0533j966k9484J8277J9126k9145k439L0893
833A7007j4048k3326K7536Q294l1185R574K6015k3409j2542L0718m781k7545K0040
846B348J6474k9725K74K9436j6990k0756K8447L950l0812J2685K3393k5723r391
859a6390L0233q155k5350K3150J2023l0323N085K8515j9973j7460K9437K003k9503
872a6708J4862K0629k6091m945K9507j1773k3592K4950R982l0653N938K6730k0198
885a362j5682K7574l76k7682J6167J7854k6829l066K8534j2617k1493K4442Q358
$$ plain form
898 13822 -14790 -6749 17887 -3425 -15904 12881 9519 -16543 1630 17430 -9753 -9796 18093
911 18093 2572 -18020 8515 15206 -14836 -6219 17800 -4745 -14559 12393 5784 -18195 2919
924 2919 15558 -13661 -11271 17190 165 -18618 8348 11748 -16138 -2073 18130 -7780 -14113
937 -14113 16807 7261 -18757 4105 17385 -11307 -8094 17621 -501 -15746 10788 10604 -16587
950 -16587 -1574 16477 -8435 -12467 14059 1868 -18086 6907 12924 -16593 -6950 18309 -3863
963 -3863 -16745 11434 9104 -15844 1241 16075 -10285 -9530 18118 2388 -17185 8145 13958
976 13958 -12644 -3908 15554 -5251 -11434 13597 3973 -17735 4682 15062 -13756 -10025 16384
989 16384 -469 -17463 7557 10340 -15071 -3155 15342 -6447 -12116 12780 4972 -14508 4436
$$ packed form
898A3822k8612Q041K4636k1312j2479K8785l362k6062J8173J5800k7183m3K7889
911A8093j5521k0592K6535O691l0042Q617K4019k2545r814K6952o609k3979K1114
924B919J2639k9219K390K8461j7025j8783K6966L400k7886J4065K0203k5910o333
937a4113L0920r546k6018K2862J3280k8692L213K5715j8122j5245K6534j84k7191
950a6587J5013J8051k4912m032K6526j2191j9954K4993O017k9517R643K5259k2172
963c863j2882K8179k330k4948J7085J4834k6360P55K7648j5730j9573K5330N813
976A3958k6602Q736J9462k0805o183K5031r624k1708K2417J0380k8818L731K6409
989A6384j6853j6994K5020K783k5411J1916J8497k1789n669K4896p808j9480J8944
$$ plain form
1002 4436 13550 -10284 -5961 15467 -326 -12841 9826 8273 -12868 1359 13988 -9346 -9643
1015 -9643 15300 2112 -18105 4543 13713 -12196 -8925 13010 -1391 -13216 8028 6189 -13988
1028 -13988 868 14251 -8630 -10043 13878 3615 -14032 5784 11406 -10482 -2946 14735
1040 14735 -4475 -11574 12854 6852 -16022 1846 15572 -9437 -11241 13415 2260 -14978
1052 -14978 4302 9253 -11591 -3570 12315 -6103 -10763 11892 4005 -15466 3393 14293 -9915
1065 -9915 -8133 14332 849 -12382 8371 8775 -12707 466 16156 -7362 -12006 14241 6180
1078 6180 -15913 1260 12963 -8565 -7087 10797 -2733 -11149 9336 4901 -15803 959 14937
1091 14937 -9025 -12056 12986 4075 -13337 4548 10080 -9982 -2346 14470 -4512 -11412 12925
$$ packed form
1002D436R114k3834M323K1428j5793j2515K2667j553k1141J4227J2629k3334k97
1015i643K4943j3188k0217K2648R170k5909L271K1935j4401j1825K1244j839k0177
1028a3988J4856J3383k2881j413K3921j0263j7647J9816N622k1888P536J7681
1040A4735j9210p099K4428o002k2874J7868J3726k5009j804K4656j1155j7238
1052a4978J9280M951k0844Q021J5885j8418m660K2655p887j9471J8859J0900k4208
1065i915J782K2465j3483j3231K0753M04k1482J3173J5690k3518m644K6247q061
1078F180k2093J7173J1703k1528J478J7884j3530q416K0485m435k0704J6762J3978
1091A4937k3962l031K5042q911j7412J7885N532k0062P636J6816j8982o900K4337
$$ plain form
1104 12925 7950 -14818 691 14863 -6591 -8978 10884 1456 -11264 5751 6712 -12381 -1368
1117 -1368 12865 -7387 -12200 11281 5652 -14971 252 12182 -6783 -6981 10802 -610 -10129
1130 -10129 8868 7325 -13227 -223 15521 -4638 -11346 10419 6101 -10475 1710 8689 -8372
1143 -8372 -3069 11872 -4324 -11916 9316 7607 -14164 -2540 12503 -5186 -10159 8246 2417
1156 2417 -10836 3775 7794 -9691 -2520 12691 -3103 -10856 9258 7794 -10977 -359 11875
1169 11875 -3975 -6060 8654 734 -9285 6362 6581 -11424 -2549 13010 -3964 -11919 7247
1182 7247 5863 -10727 -590 7515 -6528 -4608 9607 -1803 -11073 7217 8243 -10521 -2866
1195 -2866 12211 -1634 -8554 7369 4659 -7911 2746 8149 -6995 -3268 11171 -1623 -10604
$$ packed form
1104A2925m975k2768J5509J4172k1454k387J9862r428j2720J7015R61j9093J1013
1117a368J4233k0252m813K3481n629k0623J5223J1930j8965j98J7783j1412r519
1130a0129J8997j543k0552J3004J5744k0159o708K1765m318j6576J2185O979j7061
1143h372N303J4941j6196p592K1232j709k1771J1624J5043j7689m973J8405n829
1156B417j3253J4611M019j7485P171J5211j5794p753K0114j464j8771J0618J2234
1169A1875j5850k085J4714p920j0019J5647K19j8005Q875J5559j6974p955J9166
1182G247j384j6590J0137Q105j4043J920J4215j1410r270J8290J026j8764P655
1195b866J5077j3845o920J5923k710j2570J0657N403j5144L727J4439j2794q981
$$ plain form
1208 -10604 6269 7381 -9866 -3108 8962 -3512 -7147 6008 720 -9011 3484 6945 -9367
1221 -9367 -4029 10783 -922 -9969 5462 6904 -7395 -707 8555 -3535 -4497 8592 1238 -9012
1235 -9012 4798 8461 -7727 -4144 9490 -555 -8695 4623 4417 -8056 -416 6893 -5874
1248 -5874 -5568 8008 306 -9965 3346 7368 -7368 -3698 8549 -940 -6659 5755 3615 -7295
1262 -7295 2422 8127 -5563 -4519 9839 1519 -9135 3823 7094 -6583 -2660 7588 -2573
1275 -2573 -6645 6205 1982 -9123 1164 7597 -6334 -5942 7556 620 -8481 3593 5417 -6831
1289 -6831 -750 7894 -3076 -5425 7768 2892 -7956 2876 8362 -5274 -3899 8423 424
1302 424 -7418 4647 4563 -7678 -480 7498 -4785 -6433 6711 1502 -9193 1640 6528 -6397
$$ packed form
1208a0604J6873J112j7247O758J2070j2474l635J3155n288r731J2495L461j6312
1221i367N338J4812j1705r047J5431J442j4299O688R262j2090r62J3089p354j0250
1235i012J3810L663j6188L583J3634j0045q140J3318k06j2473P640P309j2767
1248e874L06J3576p702j0271J3311M022j4736L670J2247r489n719J2414k140j0910
1262g295R717N705j3690J044J4358q320j0654J2958L271j3677L923J0248j0161
1275b573m072J2850m223j1105J0287O433j3931L92J3498o936r101J2074J824j2248
1289f831O081Q644j0970k349J3193m876j0848J0832N486j3636J375J2322p999
1302D24p842J2065q4j2241P198P978j2283j648J3144n209j0695J0833M888j2925
$$ plain form
1316 -6397 -3794 7384 -1328 -6702 5226 3997 -7394 807 8117 -3812 -4784 7710 1892 -7167
1330 -7167 3389 6527 -5660 -1799 7098 -2046 -6051 5607 2780 -7719 525 6065 -5653 -4692
1344 -4692 6365 -587 -7526 2724 4552 -6483 -1561 6715 -2467 -5417 5798 2888 -6392 1746
1358 1746 6464 -4096 -2958 7077 411 -5752 3544 4806 -5585 -798 6173 -2640 -5013 4739
1372 4739 1313 -6790 839 4819 -4992 -3750 5410 -759 -5924 3165 3302 -5471 -570 5683 -2752
1387 -2752 -4146 5640 2026 -5372 2194 5779 -3682 -2194 6016 -3 -4872 3504 3306 -5404 -427
1402 -427 5414 -2731 -4546 4328 1449 -6267 988 4348 -4617 -2926 4685 -1015 -5317 3294 3011
1417 3011 -5244 -169 5894 -2479 -3638 5314 2106 -5030 1866 5226 -3440 -1711 5481 -293 -4586
$$ packed form
1316f397K603J1178q712n374J1928j229j1391Q201P310j1929r72J2494n818r059
1330g167J0556L138j2187L861Q897r144m005J1658k827j0499Q244N540j1718R61
1344d692J1057o952o939J0250J828j1035M922Q276r182k950J1215k910r280Q138
1358A746M718j0560J138J0035o666o163R296J262j0391M787O971q813k373R752
1372D739l426q103P629L980r811J242R160o169n165R089J37q773M901O253q435
1387b752j394R786l614p398P566L585r461J488Q210o019m869Q376j98q710M977
1402d27N841q145j815Q874k879p716P255L360q965J691P611n700m302Q611k83
1417C011q255N075O063q373j159Q952l208p136O896L360q666J729P192n774m293
$$ plain form
1432 -4586 3805 2963 -5436 -264 5155 -3308 -4222 4184 681 -5837 1227 3497 -4917 -2107 5144
1447 5144 -1531 -5217 4057 2847 -5179 322 6068 -2471 -3271 5505 1777 -4773 2410 4559 -3930
1462 -3930 -1379 5630 -1170 -4466 3976 2366 -5679 -144 4706 -3455 -3863 4048 11 -5678 2146
1477 2146 3208 -5071 -1380 5462 -1552 -4817 4210 3193 -4664 750 5300 -2719 -2263 5152 540
1492 540 -4334 3370 3578 -4714 -639 5188 -2296 -4577 4126 1529 -5846 663 3985 -4143 -2994
1507 -2994 4282 -567 -5391 2320 2952 -5041 -891 5328 -1712 -3610 4001 2101 -4306 1557 4336
1522 4336 -2762 -1340 5205 -718 -4267 3529 3343 -5006 -313 4845 -2397 -3997 3614 951 -5097
1537 -5097 881 3367 -4305 -2118 4721 -1304 -4879 2947 2878 -4429 -207 4768 -1784 -2627 4470 1101
$$ packed form
1432d586Q391q42q399N172N419q463r14Q406l503o518P064K270q414K810P251
1447E144o675l686R274j210q026N501N746q539q00Q776l728o550P183K149q489
1462c930K551P009o800l296Q442j610q045N535M850q161m08P911m037n689P824
1477B146J062q279L691O842p014l265R027j017p857N414M550q019M56P415m612
1492E40m874P704K08q292M075N827p484k281Q703k597p375O509L322q128J149
1507b994P276m849m824P711O32p993M150O219p040j898P611j900o407N863K779
1522D336p098J422O545n923l549P796j86q349M693N158p242j600P611k663o048
1537e097N978K486p672K187O839o025l575P826o9p307M222M975o552q43P097l369
$$ plain form
1553 1101 -4168 2694 4152 -3900 -1326 5624 -452 -4464 2963 2737 -4287 -481 3869 -2872 -2986
1568 -2986 3231 -172 -5175 1312 3339 -4301 -2303 4556 -624 -4085 2860 2415 -3861 533 4297
1583 4297 -2615 -1984 5368 901 -4800 2427 4606 -3547 -1887 4916 -653 -4106 2923 1997 -4527
1598 -4527 230 3825 -3361 -3351 4205 -202 -5342 1920 3306 -3930 -1858 4352 -1103 -3713 3605
1613 3605 2127 -4564 1362 4974 -2932 -2733 5562 1108 -4430 2326 3676 -3639 -933 4452 -1856
1628 -1856 -3633 3792 1204 -5703 674 4279 -3743 -3136 4385 -383 -4927 2208 2939 -4584 -168
1643 -168 4978 -2003 -3382 4921 1795 -4858 1749 4807 -2877 -1701 4933 -60 -3855 3179 2575
1658 2575 -4517 127 5028 -2878 -3885 4118 519 -5380 1185 3405 -3937 -2093 4219 -1142 -4281
$$ packed form
1553A101n269O862J458q052K574O950o076m012P427k26p024L806M350o741j14
1568b986O217l403n003O487K027p640J998O859n180l461O945m45o276M394L764
1583D297o912O31P352m467n701P227K179q153J660O803n569l453P029r26o524
1598d527M757L595p186J0P556m407n140P262J386p236K072O210n455k610P318
1613C605j478o691N926L612p906J99Q295m454n538O756J350p315K706N385o308
1628a856j777P425k588o907O377L605q022O07P521m768m544P135P31p523M416
1643a68N146o981j379Q303l126o653O607L058p684J176O634m993l795P034o04
1658B575p092M644M901p906j007Q003l599n899O565K220p342J844O312n361l139
$$ plain form
1673 -4281 3346 2530 -4586 292 4805 -2374 -2719 4441 1279 -3985 2193 3659 -3387 -948 5051
1688 5051 -1270 -4077 3628 2307 -5016 270 4472 -3093 -3395 3994 -17 -4966 1643 2722 -4563
1703 -4563 -1162 4861 -1667 -4295 3855 2293 -4614 692 4733 -2532 -1854 4834 345 -4126 2933
1718 2933 3620 -4149 -430 4824 -1693 -3850 3777 1260 -5068 712 3704 -3809 -2594 4355 -1107
1733 -1107 -4722 3001 2315 -4851 -557 4885 -2031 -3401 4283 1401 -4191 1813 4202 -3275 -1032
1748 -1032 4849 -607 -3649 3623 2780 -4640 152 4490 -2606 -2988 3832 485 -4848 1587 3176
1763 3176 -4255 -1798 4422 -1562 -4343 3009 2043 -4529 178 4260 -2424 -2296 4542 498 -4030
1778 -4030 2721 3604 -3738 -731 5049 -1106 -3335 3673 2007 -4503 549 4061 -3018 -2796 3998
$$ packed form
1673d281P627q16p116M878M513p179l45P160l162n264O178J466p046K439N999
1688E051o321k807P705j321p323N286M202p565l02P389m011m949O609J079p285
1703d563L401O023o528k628Q150j562o907N306M041p265O78O688m489m471P059
1718B933O87p769L719N254o517k157P627k517o328N780K992p513J215O949n462
1733a107l615P723o86p166M294N442o916j370P684k882n592O004K389p477K243
1748a032N881n456l042P272q43p420M792M338p096l82O820l347n333O435J589
1763C176p431K457O220n984k781P352r66o572M707M082o684J28O838m044m528
1778d030O751Q83p342L007N780o155k229P008j666o510N052L512p079K22O794
$$ plain form
1793 3998 -338 -4837 1896 2553 -4455 -1268 4050 -1866 -3671 3642 1489 -4229 947 4261 -2889
1808 -2889 -1745 4752 86 -3934 3086 3298 -3951 -108 4909 -1860 -3223 3779 1212 -4577 1018
1823 1018 3611 -3541 -2346 4369 -951 -4900 2381 2175 -4587 -557 4190 -2488 -3240 4222 792
1838 792 -4581 2110 4153 -3834 -1018 4969 -932 -3852 3656 2453 -4159 738 4270 -2639 -2786
1853 -2786 3978 -232 -4685 2140 2963 -4510 -1539 4312 -2199 -4118 3157 1592 -4571 929 3886
1868 3886 -3153 -2118 4277 122 -3827 2637 3289 -3418 -210 4374 -1659 -2779 3794 1416 -4135
1883 -4135 1274 3652 -3321 -2046 4080 -681 -4367 2192 2116 -4168 -610 3724 -2566 -3193 3740 701
1899 701 -4166 1569 3415 -3001 -1588 4284 -449 -3212 3216 2565 -3693 351 4341 -2396 -2268 3997
$$ packed form
1793C998m336m499O733O57p008L187N318n916j805P313k153n718N176L314p150
1808b889J144O497m666m020P020K12p249L843N017o769j363P002k567n789N595
1823A018K593p152J195O715n320l949P281k06o762M030M747o678p52P462l430
1838G92n373O691K043p987K816N987n901k920P508j203o612M897L532o909j47
1853b786O764m210m453O825Q23p473K971N851o511j919P275j565o163N500K957
1868C886p039J035O395m155l949O464O52o707L208M584o033j120O573k378n551
1883d135N409K378o973J275O126m761l686O559p6o284L558M334o290o27O933l039
1899G01m867N735J846o416J413N872m733k763O428o51o258M044L990o737J28O265
$$ plain form
1915 3997 471 -4301 1591 2887 -3620 -1305 3642 -1346 -3935 2872 1069 -4523 513 3415 -3110
1930 -3110 -2456 4038 92 -4069 2206 3095 -3273 -513 4369 -1291 -3177 3744 1606 -3757 1301
1945 1301 4039 -2853 -2024 4075 -63 -3987 2068 1952 -3871 -613 3474 -2570 -3343 3382 611 -4549
1961 -4549 1040 3076 -3204 -1749 3861 -740 -3440 2948 2090 -3683 652 4153 -1705 -2441 4011
1976 4011 955 -3673 1655 2867 -3135 -1256 3467 -1079 -3424 2715 1473 -4049 -71 3461 -2392
1991 -2392 -2652 3363 281 -3793 1767 2513 -3182 -693 3801 -1102 -2820 3079 1734 -3388 985
2006 985 3617 -2062 -1603 3615 170 -3228 1952 2368 -3454 -587 3481 -1912 -2738 2898 820 -3729
2022 -3729 498 2869 -2738 -2084 3219 -6 -3283 2309 2138 -2802 -181 3789 -1328 -2196 3182 1438
$$ packed form
1915C997l526m772N892J296o507K315M947m988k589O807j803n592N036K902o525
1930c110O54O494l946m161O275Q89o368K760M882n660j886O921k138n363N058
1945A301K738o892Q29O099m138l924O055j16n823L258M087o044p73O725k771n160
1961d549N589K036o280J455N610m601k700O388q58n773M335L501n858p36O452
1976D011l056m628N328J212o002J879M723m546k345O139j242n522L978L532n853
1991b392k60O015l082m074N560P46n695K489M494m903j718N899j345n122M373
2006I85K632n679M59N218l445l398N180M16n822K867M068n393q26N636k078m549
2022c729M227K371n607O54N303l225l277N592j71m940K621L970n117q68N378j744
$$ plain form
2038 1438 -3199 1201 3494 -2183 -992 3597 -671 -3127 2362 1568 -3622 -458 3272 -2233 -2733
2053 -2733 2765 341 -3818 887 2410 -3087 -1231 3348 -1027 -2889 2540 1630 -2894 538 3365
2068 3365 -1700 -1834 3330 286 -2755 1842 2204 -2851 -309 3332 -1506 -2851 2636 1356 -3499
2083 -3499 37 2780 -2292 -1860 2594 -411 -2963 1781 1770 -3249 -56 3613 -1473 -2559 2792 1313
2099 1313 -2755 1110 2546 -1835 -913 3145 -244 -2659 2180 1896 -3180 -496 3118 -1315 -2388
2114 -2388 2032 493 -2996 448 1503 -2681 -1091 2947 -1069 -2777 2107 1647 -2825 33 2608
2129 2608 -834 -1463 2648 848 -2536 1666 2306 -2396 -576 3290 -284 -2621 1894 1169 -2417 -60
2145 -60 2117 -1877 -1476 2679 -239 -3121 1608 1817 -3049 -880 2800 -780 -2353 1586 1205 -2284
$$ packed form
2038A438m637M400K293n677J191M589m268k456N489p94n190L164L730n505n00
2053b733N498k424m159M705J523n497J856M579m375j862N429r10m524L432K827
2068C365n065j34N164l044l041M597L62n055K542L641m838j345N487j280m855
2083c499L536K743n072M32M454l005k552M744j1n019L193L669n086j086N351j479
2099A313m068L865J436m381R22M058l389k415M839k84n076K684L614m433j073
2114b388M420j539l489L444J055m184J590M038m016j708M884m60m472K858K575
2129B608l442o29M111j800l384M202O40m702J820L866l574k337M515p25l586K357
2145f0K177l994M01M155k918k882M729K09m866K169L680l580j573L939l81l489
$$ plain form
2161 -2284 857 2463 -1821 -905 3072 240 -2535 1701 2419 -2137 -643 2582 -598 -1858 1643
2176 1643 313 -2666 647 1748 -2353 -1372 2420 -451 -3181 992 1592 -2195 -353 2137 -946
2191 -946 -1423 2044 487 -2376 1292 2320 -1456 -906 2707 330 -2268 1210 1686 -1741 -116 1861
2207 1861 -1575 -1330 2070 139 -2856 828 1987 -1910 -1585 2004 -209 -1966 1194 815 -2106 179
2223 179 2257 -1579 -1324 2466 567 -2149 902 2262 -1350 -572 2272 -240 -1560 1905 980 -2201
2239 -2201 265 1987 -1699 -1760 1874 114 -2419 406 1289 -1964 -826 1523 -1152 -1921 1852 623
2255 623 -2398 371 2440 -1296 -1202 1981 646 -1641 1136 1649 -1678 132 2250 -1035 -1634 1803
2271 1803 748 -2516 133 1740 -1353 -1138 1485 -478 -1960 889 1016 -2179 -126 1994 -1008
$$ packed form
2161b284L141J606m284R16L977k832k775M236P18m556J494L225l180j260L501
2176A643j330k979L313J101m101R81L792k871k730M173O00l787J842K490l083
2191i46m77L467j557k863L668J028l776N50L613k377k598L478M76l427J625J977
2207A861l436K45L400j931k995L684J159l897L25L589k213j757L160l79k921K285
2223A79K078l836K55L790j899k716L051J360l612P78K844k512j320L465r25l181
2239b201K466J722l686o1L634j760k533K825Q83l253J138K349k675p69L773j229
2255F23l021K769K069l736R4L183j335k287K777N13l327J810K118l285n99L437
2271A803j055l264K649J607l093K15K623j963j482K849J27l195K053K120l002
$$ plain form
2286 -1008 -1534 1999 831 -1783 694 1848 -1015 -491 1660 -538 -1653 1639 1192 -1849 275 2116
2302 2116 -625 -1481 1380 252 -1869 402 813 -1683 -795 1437 -701 -1957 1136 736 -1951 84
2318 84 1712 -852 -1183 1732 688 -1540 1071 1593 -1090 -179 2300 -360 -1473 1452 966 -1612
2334 -1612 -50 1447 -1007 -1064 1264 -31 -1672 716 956 -1585 -555 1374 -644 -1860 1113 728
2350 728 -1565 207 1598 -1087 -980 1805 213 -1289 1068 1600 -992 -256 1737 -410 -1142 1556
2366 1556 547 -1735 408 1342 -1192 -725 1331 -142 -1945 505 1027 -1745 -510 1683 -634 -1540
2382 -1540 1225 540 -1370 409 1331 -765 -612 1670 117 -1136 1187 1031 -1384 -242 1618 -666
2398 -666 -1092 1162 440 -1481 184 1191 -1375 -749 1154 -198 -1811 742 855 -1426 -564 1592
$$ packed form
2286a008n26L533j168k614K477J154k863N24K151k198j115L292m47l041K124J841
2302B116k741q56K861j128k121K271M11k496Q88K232k138j256L093m00k687K035
2318H4J628k564l31K915j044k228K611N22k683R11K479k660j113K925m86k578
2334a612J562J497k454n7K328j295j641K388K40k541J030J929k018j216K973l85
2350G28k293J772J391k685J07K785j592j502K357N32k592P36J993k147p32K698
2366A556j009k282K143R34k534M67K056j473j803K450N22k772J235K193k317r06
2382a540K765o85j910J779R22k096J53K282j553j253K323j56k415J142J860k284
2398f66m26K254p22j921J665J007k566O26J903j352j613K553J13k281Q62K156
$$ plain form
2414 1592 -448 -1000 1158 494 -1126 574 1326 -865 -338 1745 199 -1182 1188 1160 -1120 -285 1535
2431 1535 -872 -1207 1274 96 -1858 584 953 -1334 -775 1442 -365 -1715 733 599 -1566 86
2447 86 1291 -712 -947 1341 449 -1363 983 1449 -1089 -362 1886 -126 -1138 1141 560 -1443 247
2464 247 1489 -998 -1037 1113 -124 -1706 400 1026 -1359 -913 998 -596 -1292 1081 381 -1310 311
2481 311 1499 -940 -478 1629 317 -1103 771 1235 -943 315 1552 -301 -859 1263 253 -1554
2497 -1554 515 1359 -1406 -1006 1204 -151 -1702 376 445 -1498 -438 907 -893 -953 1264 503 -1482
2514 -1482 226 1714 -893 -379 1364 235 -967 1084 1078 -968 262 1154 -324 -864 1347 258
2530 258 -1560 75 1022 -1132 -906 1122 -326 -1268 735 639 -1616 -57 1242 -748 -971 1483 451
$$ packed form
2414A592k040n52K158o64j620J700P52k191N27K083j546j381K370k8k280Q35J820
2431A535k407l35K481j178j954K442L69k287N59K217j807j350K448j34k165J652
2447H6J205k003k35K288q92j812K346M66k538P27K248k012j012K279n81k003J690
2464B47J242k487l9K150j237j582K106O26k385M46J911j594o96K373p00j691J621
2481C11J188k439M62K107j312j420J874M64k178J258J237j853n58K122j010j807
2497a554K069Q44k765M00K210j355j551K078O9j943J060J345j800o0K217p61j985
2514a482J708J488k607N14J743j129j202K051ok046J230Q92j478n40K211j089
2530B58j818J635R47k154K26K028j448r42K003r6k255J559J299j990k23K454j032
$$ plain form
2547 451 -1194 789 1320 -896 -412 1350 -163 -997 1226 742 -1189 377 1474 -848 -1068 1175
2563 1175 -55 -1368 214 1108 -1472 -738 1141 -438 -1434 859 323 -1423 -60 1346 -872 -846
2579 -846 1292 340 -1132 803 1027 -957 -70 1921 -202 -905 1359 612 -1661 368 1349 -790 -920
2596 -920 902 -370 -1523 593 775 -1274 -549 1339 -697 -1286 1239 172 -1591 184 1190 -844
2612 -844 -740 1183 -98 -839 1003 1049 -998 178 1621 -522 -1129 1257 554 -1431 156 988 -1073
2629 -1073 -875 1091 -370 -1390 914 547 -1450 -296 1157 -708 -1398 927 258 -1020 652 1080
2645 1080 -814 -8 1802 -229 -1189 1295 756 -1422 156 1559 -388 -646 1074 -4 -1414 462
2661 462 767 -1405 -273 1017 -543 -1459 750 459 -1455 -24 1138 -861 -681 1131 55 -1112
$$ packed form
2547D51j645J983N31k216M84J762j513q34K223m84j931J566J097k322k20K243
2563A175j230j313J582Q94k580P34J879j579r96K293n36j746J363J406k218K6
2579h46K138r52j472J935K24j984Q87J991k123p03K264p47k273K029R81k139j30
2596i20J822j272j153K116J82k049P25J888k036n89K525j067j763J775J006k034
2612h44J04J923j281p41J842M6k047J176J443k143o07K386p03j985J587Q32k061
2629a073J98J966j461j020K304l67j997J154J453j865o90K325o69j278J672M28
2645A080j894Q06J810k031r60K484n39k178J578J403j947k58J720j078j410J876
2661D62L05k172J132J290j560r16K209k91j914J431J162j999J80J812j076j167
$$ plain form
2677 -1112 702 970 -1186 -35 1761 -78 -790 1103 711 -1159 388 1246 -658 -418 1170 -422
2693 -422 -1427 779 1057 -1451 -608 1172 -490 -1404 425 207 -1234 391 856 -874 -435 1547 -153
2710 -153 -1147 743 973 -1062 -129 1413 -201 -683 1184 342 -1107 291 1039 -1281 -515 1429 -626
2727 -626 -1429 336 453 -1440 -82 722 -954 -607 1131 -5 -1479 313 1148 -1108 -516 1653 -115
2744 -115 -947 1022 1011 -943 272 1212 -740 -478 1500 219 -1361 290 1062 -1159 -662 891 -321
2761 -321 -1290 749 262 -1313 92 999 -1082 -775 1243 -157 -1476 883 1169 -1064 266 863 -384
2778 -384 -732 1115 682 -1022 824 1262 -1068 -629 1221 21 -1205 467 631 -1276 -275 1048
2794 1048 -684 -1079 926 -23 -1368 283 921 -923 -538 1480 -136 -793 857 480 -787 250
$$ packed form
2677a112J814K68k156J151J796j839p12J893l92j870J547Q58j904K40J588j592
2693d22j005K206K78k508Q43J780j662r14J829k18j441J625M65j730M39J982j700
2710a53r94J890K30k035R33J542j614m82J867q42j449J398P48k320P66J944k055
2727f26q03J765J17j893J358Q04j676L47J738j136j474J792Q35k256N92K169j768
2744a15q32J969j1j954J215R40j952K62J978j281j580J651P72k221M97J553j212
2761c21r69K039m87j575J405R07k081L07K018j400j319K359K86k233J330N97j247
2778c84l48J847m33j704J846M38k330M39J850j200j226J672J64j907J001J323
2794A048j732l95K005r49j345J651O38j844L85K018j616o57J650l77j267J037
$$ plain form
2810 250 1372 -599 -441 1399 222 -1073 487 737 -1018 -301 1035 -215 -1036 628 214 -1395
2826 -1395 -12 740 -892 -816 613 37 -1071 585 944 -727 -140 1092 -337 -734 1139 703 -1074
2843 -1074 396 1207 -734 -394 1405 348 -858 714 639 -1181 -180 1106 -890 -1003 714 20
2859 20 -1232 263 953 -749 -745 781 -40 -1092 665 763 -948 3 1157 -501 -347 1218 462 -624
2877 -624 649 1065 -837 -267 800 -125 -971 604 325 -1081 -353 823 -991 -821 739 179 -1182
2894 -1182 113 680 -819 -314 974 -274 -878 772 440 -1000 405 1553 -347 -615 1265 300
2910 300 -806 831 810 -738 -108 702 -356 -818 668 284 -1212 -103 575 -882 -1029 667 -124
2927 -124 -846 563 329 -733 -179 969 -520 -728 1097 463 -1029 555 1152 -554 -411 911 152
$$ packed form
2810B50J122j971J58J840j177j295J560K50j755P17J336j250q21J664m14j609
2826a395J383P52j632P6J429n76j108J656L59j671N87J232j429l97J873m36j777
2843a074J470Q11j941L40J799j057j206J572p5j820J001J286j996j13J717o94
2859B0j252J495O90j702MJ526q21j052J757R8j711R51J154j658J54J565p56j086
2877f24J273M16j902N70J067r25q46J575k79j406P28J176j814J70J560n60j361
2894a182J295N67j499N05J288j248o04J650l32j440J405J148j900k68J880r65
2910C00j106J637k1j548O30Q10j058m62J486l84j496J109O78j457j47J696p91
2927a24p22J409k34j062N54J148j489k08J825o34j492J584N97j706J43J322p59
$$ plain form
2944 152 -882 849 383 -1134 246 821 -403 -992 574 51 -1090 120 615 -889 -185 805 -277
2961 -277 -816 859 406 -935 254 1076 -388 -565 992 435 -826 596 981 -418 -171 900 -296
2978 -296 -728 745 592 -1011 -206 875 -889 -722 769 -204 -1067 318 438 -1014 -124 988 -412
2995 -412 -865 856 417 -841 509 779 -330 -237 815 -65 -517 840 516 -695 -76 939 -504
3012 -504 -749 722 358 -978 92 642 -758 -183 826 -420 -738 609 377 -1049 -447 1143 -235
3029 -235 -550 767 514 -863 290 916 -552 100 1152 -139 -692 786 776 -626 -408 698 -371
3046 -371 -629 308 -25 -694 426 646 -795 -546 617 -389 -1002 408 200 -911 144 885 -604
3063 -604 -206 1006 100 -792 572 627 -679 33 980 -269 -813 540 151 -757 -16 738 -492 -429 581
$$ packed form
2944A52j034J731m66j517J380N75j224n89J566n23j141J210M95j504P04R90j082
2961b77n39J675m53j341J189Q22j464j77J557n57j261J422L85j399K47J071j196
2978b96m32J473j53j603Q05J081j764J67J491r73q63J385J20j452Q90J112j400
2995d12m53J721m39j258J350K70j109R3J052q80m52J357l24j211O19J015j443
3012e04k45J471l64j336J070N50j400N75J009j246l18J347k32j426O02J590j378
3029b35l15J317k53j377J153O26j468O52J052j291n53J478j0j402K18J106j069
3046c71k58R37l33o69J120K20j441K49J163j006o13J410k08j111J055P41j489
3063f04L98J212r06q92J364N5j306P12R47j249n44J353l89r08P41P54j230O3J010
$$ plain form
3082 581 -152 -1152 474 315 -985 -274 635 -205 -506 602 174 -875 298 544 -538 -262 861
3099 861 -3 -854 655 657 -567 196 672 -332 -567 807 -260 -773 133 435 -789 -428 745 -294
3117 -294 -702 400 500 -941 -20 419 -276 -385 476 11 -850 415 768 -552 -167 858 111 -436
3135 -436 578 566 -628 152 585 -517 -149 503 -247 -742 311 429 -726 -531 535 -208 -544 592
3153 592 149 -878 11 790 -448 -71 910 -66 -636 807 271 -487 -107 728 -224 -450 584 212 -472
3172 -472 222 662 -698 -461 537 62 -983 236 364 -711 -168 325 -700 -549 526 -68 -760 135
3190 135 624 -611 -329 611 201 -302 500 587 -356 111 645 -190 -333 737 276 -686 -114 590 -470
3209 -470 -404 306 -204 -705 549 170 -580 -2 567 -419 -432 897 69 -478 180 506 -365 59 754 74
$$ packed form
3082E81p33j000J626j59j300P11R09q40l01J108m28j049J173K46j082K76J123
3099H61q64q51J509Kj224P63M76j004k35J374j067n13R06L02j224L61J173j039
3117b94m08J102J00j441R21M39o95j09Q61m65q61J265L53j320L85J025p47n47
3135d36J014j2j194P80M33j102L68O52p50m95J053J18j155J95J066p43l36J136
3153E92m43j027Q89P79j238L77R81r76n70J443n36p58L80Q35r52k26J034l72o84
3172d72O94M40j360K37R98m75j045J219J28j075N43M93j025J51J075n94o92Q95
3190A35M89j235K82R40m10n03Q02Q7r43M67N34q35j43J070m61r62N72P04j060
3209d70O6P10n10n01J254l79p50N78N69r86j3J329q28n47O58L26q71M24O95o80
$$ plain form
3229 74 -425 499 606 -306 213 503 -145 -263 408 -13 -440 -6 205 -462 -305 359 -600 -512 392 108 -706
3250 -706 -60 432 -462 -516 402 140 -522 350 498 -377 -17 754 -347 -320 683 292 -393 110 526 -319
3270 -319 -275 624 -110 -566 205 103 -623 40 534 -450 -447 241 198 -521 64 406 -325 -195 676 -137 -409
3291 -409 396 413 -587 -53 685 -96 -219 513 121 -467 367 329 -735 24 465 -135 -770 258 332 -663
3311 -663 -76 364 -343 -539 376 5 -353 194 562 -394 218 407 -188 -518 481 253 -499 100 507 -260
3331 -260 -207 696 336 -309 150 317 -442 -199 306 -156 -655 217 46 -539 -151 373 -486 -46 439 -40
3351 -40 -339 306 382 -358 -13 573 -80 -282 675 220 -351 291 398 -356 -163 437 -243 -436 132 134 -483
3372 -483 -225 228 -357 -599 275 143 -505 51 286 -292 -198 337 -35 -417 229 295 -307 362 549 -53 -361
$$ packed form
3229G4m99R24J07r12N19K90o48j18O71m21m27M34K11o67J57O64r59Q8R04k84q14
3250g06O46M92q94n4R18k62o62Q72J48q75L60P71j101K7J003l91o85N03M16q45
3270c19M4Q99p34m56P71j02p26O63M94r84LO88m3p19N85L42p31J30Q71q13k72
3291d09Q05J7j000N34P38p81j23P32l92n88Q34l8j064P59M41o00o35J028P4r95
3311f63N87M40p07j96R15l71l58N47L68r56O12J89n95l30R99k28p52N99M07p67
3331b60N3R03l60o45M59J67p59K43N05m62m99Q72j71n85L88N24q59M40M85m79
3351d0k99O45P6p40L45N86o53k02R57m55n71O42J07p54J93O00o80j93N68Ko17
3372d83K58M53n85k42Q74j32o48N56K35n78R4N35l72l82O46O6o02O69J87o02l08
$$ plain form
3393 -361 338 54 -156 -4 350 -384 -79 443 -268 -733 8 228 -512 -91 367 -424 -539 227 -194 -481
3413 -481 145 473 -542 -208 529 87 -228 543 386 -268 -45 318 -233 -451 370 75 -507 160 166 -278
3433 -278 -597 391 -348 -319 262 7 -353 18 346 -360 -418 178 -24 -357 344 439 -461 -64 474 -135 -73
3454 -73 568 216 -489 38 333 -587 -65 671 92 -702 23 303 -110 -269 166 -420 -283 280 -142 -764
3474 -764 205 344 -379 -324 394 22 -168 352 450 -181 170 332 -220 -72 478 114 -491 140 289 -371 -288
3495 -288 223 -25 -518 -199 113 -596 -50 518 -451 -470 383 -271 -579 148 390 -358 59 457 -98 -436
3515 -436 361 185 -445 60 440 22 -346 263 321 -161 12 229 -380 -177 359 -291 -364 194 -46 -346 -157
3536 -157 309 -399 -394 354 -44 -416 101 282 -343 -50 359 -70 -373 399 305 -293 243 457 -147 -168 94
$$ packed form
3393c61O99k84k10J52L54p34L05N22p11m65P41K20p40M21M58p91j15P66m21k87
3413d81O26L28j015L34P37m42l15P71j57o54K23L63n51k18Q21k95n82O67Om44
3433b78l19R88p39K9N81k55l60L71L28p06n8N96k02l33P01R5r00L97N38o09O2
3454g3O41l52p05N27K95r20N22P36n79p94P25K80m13j59M35n86J37N63m22o22
3474g64R69J39p23N5P18l72j90N20R8o31L51J62n52J48N50l64o05O31J49o60Q3
3495b88N11k48m93L19L12p09N46N68r69j9Q53o54l08P27K42p48M17L98n55l38
3515d36P97j76o30N05L80m18l68O09N8m82J73K17o09K03N36o50p3N58k40l00J89
3536a57M66p08NP48l98l72N17J81o25K93M09m29l03P72r4n98N36K14o04k1K62
$$ plain form
3557 94 38 -17 161 211 -425 -188 347 -323 -621 171 100 -396 -84 417 -155 -414 269 26 -343 360 280 -245
3579 -245 -58 275 1 -145 482 121 -215 343 550 -446 -70 241 146 -225 258 162 -567 -289 358 -432 -479
3600 -479 225 41 -496 43 92 -288 -127 404 -124 -308 455 370 -146 -38 473 -2 -188 426 -112 -379 288
3621 288 494 -323 76 627 -514 -308 -8 208 -478 -164 268 -452 -489 236 20 -392 258 144 -353 -122
3641 -122 415 -335 -132 235 308 27 137 558 -107 -147 728 -91 -418 20 200 -413 80 389 -420 -325 300
3662 300 0 -429 61 314 -238 -120 197 -18 -471 198 272 -420 85 576 -312 -447 354 143 -179 423
3682 423 497 -190 -90 448 -34 -538 228 78 -239 -11 339 -322 -258 256 189 -581 -42 340 -408 -145 176
3703 176 -148 -419 177 119 -427 186 435 -176 -25 586 20 -376 275 448 -329 -79 418 -205 -258 288 -56
$$ packed form
3557I4n6n5J78N0o36K37N35o70k98P92p1m96L12N01n72k59O83k43l69P03q0n25
3579b45J87L33k74j46O27l61l36N58K07r96L76L11r5l71M83r6p29K78O47p90m7
3600d79P04j84n37N39M9l80J61N31n28j84P63q5n16J08N11m75j86O14n38k67O67
3621B88K06q17L99N51j141K06L00K16o86L14M32p20l7P25k16m12O50j14m97K31
3641a22N37p50K03L67P3k81J10M21o65m0Q75q19l27M38J80o13M93L09q09R5O25
3662C00l00m29M90K53n52J18L17k15m53O69P4o92N05M91q88j35Q01k11l22O02
3682D23P4o87J00N38m82n04P66j50l17K28L50o61O4N14o7p70N39L82p48K63L21
3703A76l24k71N96n8n46O13K49o11J51O11n66l96O51J73p77K50M97o23n3N46l44
$$ plain form
3724 -56 -585 213 320 -351 -299 273 68 -428 47 470 -409 -274 464 -146 -259 265 86 -76 110 488 -220
3745 -220 -261 434 102 -369 229 463 -361 -115 403 -219 -399 172 -47 -459 2 97 -539 -231 297 -124 -266
3766 -266 204 198 -201 167 432 -503 -159 385 98 -355 78 318 -139 1 343 -110 -85 120 101 -265 161
3787 161 322 -55 -261 183 18 -329 211 38 -186 -57 89 -262 -370 252 -59 -273 62 338 -72 -318
3807 -318 507 220 -364 276 450 -351 -61 300 -45 -84 472 -22 -395 77 257 -253 -404 328 70 -332
3827 -332 371 266 -140 130 539 -313 -237 165 -52 -459 238 543 -128 -47 430 128 -209 352 228 -72 -142
3848 -142 426 -368 -279 382 101 -442 -31 237 -283 -434 166 -259 -458 147 -7 -471 88 454 -190 -280 242
3869 242 177 130 90 390 -246 100 389 -153 -9 272 257 -164 114 303 -368 -341 156 -114 -591 194 -39 -379
$$ packed form
3724e6n29P98J07o71N2N72k05m96M75M23q79J35P38o10j13N24j79j62J86L78p08
3745b20m1O95l32m71N98K34q24K46N18o22j80N71k19m12M61R5o36L08N28m21j42
3766b66M70ol99L68K65r35L44N44k87m53M33K40m57J40L42m53K5K05j9l66M26
3787A61J61l77k06M44j65l47N40j73k24J29J46l51j08O22l11k14L35K76m10k46
3807c18Q25k87n84O40J74q01K90L61l45l9N56m94l73M72J80n10j51P32k58m02
3827c32P03j05m06K70M09q52P6M02k17m07O97L05o71Q1M77l02l37N61j24l00p0
3848a42N68p94Q9O61k81n43M11K68n20j51O00m25j99O05j54m64N59L66o44r0N22
3869B42o5m7m0L00o36L46K89n42J44K81j5m21K78J89o71K7M97k70m77P85k33l40
$$ plain form
3891 -379 -158 67 -269 -326 48 346 -185 20 545 2 -76 332 389 -218 243 29 -209 199 511 -37 -394
3912 -394 261 -169 -236 -25 308 -78 -466 325 -107 -300 91 -152 -450 -29 262 -167 -272 235 222 -115 183
3933 183 204 -50 -178 368 109 45 163 171 -239 -56 458 -61 -124 378 -39 -298 -67 -77 -547 -84 131 -362
3955 -362 -227 122 70 -364 28 342 -166 -8 31 -45 -425 128 -14 -324 99 292 -84 -189 327 22 -233
3976 -233 215 83 -214 57 147 -89 -277 216 193 -381 -147 179 74 -287 -65 250 -189 94 167 -224 -142
3997 -142 201 190 -295 386 74 -308 1 486 182 -229 130 -35 -217 -168 -83 -294 -191 90 16 -262 248
4018 248 25 -154 -6 -73 -50 -214 308 -269 -169 172 137 -141 -19 322 12 -125 286 47 -81 -10 16 112
4040 112 -163 324 -122 -346 507 365 -353 -169 68 16 -173 190 352 -256 58 405 -272 -104 157 -321
$$ packed form
3891c79K21K25l36n7L74K98n31K05N25n43p8M08N7o07M61k14k38M08L12n48l57
3912c94O55m30o7K11L33l86l88P91m32j93L91k43k98M21K91m29j05N07j3l37K98
3933A83K1k54j28N46k59o4J18Qm10J83N14n19o3N02m17k59K31j0m70M63K15m93
3955c62J35L49n2m34L92L14n08J58L9p6l80N53j42l10M23J93l76j05N16l05k55
3976b33M48j32k97K71R0k36j88M93k3n74K34L26j05l61K22L15m39K83P3l91Q2
3997a42L43j1m85O81l12l82L09M85l04m11L59j65j82M9Q5k11J03K81p4k78N10
4018B48k23j79J48o7K3j64N22n77J00L41l5k78J22L41l10j37M11k39j28P1K6R6
4040A12k75M87m46k24Q53j42p18J84K37n2j89L63J62o08L14L47o77J68K61m78
$$ plain form
4060 -321 -104 149 158 -7 62 228 -50 79 448 227 -282 -7 446 36 -105 191 -340 -359 205 76 -402
4081 -402 -62 38 -213 -388 203 -59 -291 11 -72 -256 -171 115 145 -241 287 246 -37 240 299 -284 -91 217
4103 217 -4 -298 65 309 -90 6 241 -58 -320 73 165 109 -5 -40 -358 -108 209 -171 -137 426 296 123
4125 123 -184 280 -194 -385 380 371 -244 182 258 -23 37 243 6 -47 4 51 -91 -36 320 -7 -159 173 110
4148 110 -379 -102 74 -277 -336 367 218 12 77 292 -92 252 383 -214 -39 187 -191 -204 235 282 22
4169 22 -102 202 66 -124 132 -157 -164 -30 81 26 -170 -22 -108 -102 -226 199 -100 31 444 -83 -293 193
4191 193 277 -131 242 196 -5 -175 232 105 -170 132 155 -51 -104 284 -110 -129 323 186 -136 65 97 -198
4213 -198 -182 104 -137 -478 -220 -144 -311 145 299 76 -164 366 269 -191 -11 41 80 -38 143 149 -98 -135 251
$$ packed form
4060c21K17K53Rj65O9J66k78J29L69k21n09K75M53m10j41K96n31j9N64j29m78
4081d02L40J00k51j75N91k62k32L02q3j84Q5K86L0l86N28m1k83K77N9n83J93L08
4103B17k21k94L63K44l99R6K35k99k62L93R2n6j14l5l18K50L17l80L4N63j30j73
4125A23l07M64m74j91P65ro15M26P6k81O0K06k37n3N1M7j42N5L56l27j52L32o3
4148A10m89K77J76l51n9P03j49k06O5K15l84L44J31n97J75K26l78j3M39M7k60
4169B2j24L04j36j90K56k89pJ34J11n5j96J48q6Oj24M25k99J31M13n27k10M86
4191A93Q4m08L73m6k01j70M07j27k75L02K3k06n3L88l94j9M52j37l22K01L2k95
4213a98J6K86k41l41K58P6j67M56J54k23k40N30r7m60J80N2L9j18J81Ok47l7L86
$$ plain form
4236 251 80 167 19 329 10 -183 -202 -71 91 370 -335 68 51 176 -148 -18 168 -64 142 -27 -152
4257 -152 -142 55 81 180 -36 388 -50 -12 196 -14 -416 1 73 -217 -54 289 -89 -394 -1 -206 -91 -385
4279 -385 101 -164 11 77 -96 -131 60 104 -155 -137 50 69 17 474 169 -97 -17 377 25 38 -5 20 -124
4302 -124 241 86 -170 77 293 -115 -323 32 5 -271 -62 72 -141 -201 5 -224 -101 253 90 73 -41
4323 -41 116 -146 -71 -13 54 -78 48 328 -73 -167 163 121 -247 -87 -47 -93 -129 310 -146 -165 130 -44 -57 94
4347 94 -217 54 -77 64 -83 -54 189 326 -285 185 280 -21 38 131 -155 -171 -80 130 -12 -51 142 20 75
4370 75 81 46 -65 -234 -4 -270 -214 -20 -42 -79 17 27 126 19 302 111 -144 117 -102 -40 145 81 -85 -7
4394 -7 359 296 -25 16 2 -145 -145 -81 17 -84 497 -18 -38 -93 59 -260 12 340 -259 -150 339 -144 -225 250
$$ packed form
4236B51j71Q7j48L10l19j93j9J31J62K79p05M03j7J25l24J30J86k32K06j69j25
4257a52J0J97K6R9k16M24m38L8K08k10m02M17P2k90J63L43l78l05L93k05J15k94
4279c85M86k65J75O6j73l5J91M4k59J8J87J9n2M57l05k66Q0L94l52J3m3K5j44
4302a24L65j55k56K47K16m08k08L55k7k76K09J34k13o0K06k29J23L54j63j7j14
4323d1J57k62P5N8O7j32J26K80m01r4L30m2l68J60M0m6l6M39m56j9K95j74j3J51
4347I4l11K71j31J41j47K9K43J37o11M70R5l01N9R3k86j6R1K10j42l9J93j22N5
4370G5Ol5j11j69K30k66N6J94k2l7R6J0R9j07K83j91k55K61k19O2J85o4j66P8
4394gL66o3l21M1j4j47%O4R8j01N81n15k0n5J52l19K72L28n99J09M89m83q1M75
$$ plain form
4418 250 105 146 15 310 -51 -58 309 214 202 136 207 -199 -91 -117 -84 -23 -118 114 -210 97 282 -48 -2 65
4442 65 66 -72 -49 -42 -84 -205 118 296 45 213 293 -153 151 343 120 -124 190 31 -38 -115 31 -205 -99
4465 -99 -105 -1 -287 -132 100 -48 -364 -124 58 -70 131 167 -378 -98 319 -85 -70 241 -17 -313 36 97
4487 97 13 11 69 237 -41 23 -104 -131 -39 -53 -58 109 -116 -5 -311 -36 45 -325 -14 72 -119 71 29 -52 57
4512 57 221 27 -96 232 105 -36 -60 -23 153 200 -265 251 35 -547 -45 -122 -310 50 66 -128 38 -73
4534 -73 26 -261 37 212 -283 -23 112 -325 48 -18 68 72 41 315 50 116 394 388 -17 147 -11 167 -35
4557 -35 158 -343 -278 77 37 -46 75 123 -124 -254 73 -48 -51 81 56 46 -160 269 -55 -82 74 179 45
4580 45 293 -8 -122 -38 39 -207 -55 313 173 -45 232 45 -36 -132 -183 105 90 176 70 -252 -327 71 100
$$ packed form
4418B50j45M1j31K95l61pL67r5j2o6P1m06J08k6L3O1r5K32l24L07J85l30M6O7
4442F5Jj38K3Pm2j21L23J78k51J68Q0m46L04J92k23k44L14j59o9p7J46k36J06
4465i9oJ04k86J55K32j48l16K40J82j28K01L6n45K80M17m04J5L11k58k96L49O1
4487I7q4kN8J68k78O4j27k7R2j4nJ67k25J11l06K75Q1l70L11Q6j91J90m2q1J09
4512E7J64j94j23L28j27j41k4L7J76M7m65N16k16n82N02p7j88L60J6j94J66j11
4534g3R9k87K98J75m95K60J35m37L73o6Q6Ml1K74k65O6K78om05J64j58J78k02
4557c5J93n01O5L55m0q3J21M8k47j30L27j21lJ32k5j0k06M29l24k7J56J05j34
4580D5K48l01j14Q4P7k46J52L68j40k18K77j87q1r6n1K88j5Q6j06l22p5L98K9
$$ plain form
4603 100 -132 -225 -150 -286 -3 151 181 -63 256 2 -147 169 109 10 78 205 16 -274 160 29 -208 -87
4625 -87 119 -158 -377 142 -273 -366 3 -103 83 -120 110 -326 -206 -13 -116 -164 381 212 7 -300 338
4646 338 176 -31 229 164 62 117 49 4 -172 26 -115 -387 -59 124 -181 -138 39 -23 -427 -44 -4 74 14
4669 14 51 170 -132 27 97 -100 -24 40 160 -154 216 -185 156 141 -178 -86 10 236 38 -38 149 -26 -273
4692 -273 28 150 -108 -337 37 -197 -351 -147 4 -203 110 19 119 -382 77 -155 -200 7 156 186 104
4713 104 67 137 -58 51 -46 -178 74 36 -146 -91 -37 4 -227 192 -137 -183 -7 -187 -81 -148 124 154 -159
4736 -159 -140 -40 158 190 34 3 -115 367 88 171 38 86 131 97 276 16 1 49 119 -56 194 144 -86 12
4760 12 -117 -135 -74 38 -153 -411 -344 235 51 -90 67 58 1 194 174 -74 113 83 217 -66 -135 -13 -156
$$ packed form
4603A00k32r3P5j36K83J54L0k44L19k54j49L16o0r9O8J27j89k90M34j31k37J21
4625h7K06k77k19N19m15r3L69j06J86k03K30m36J20J93j03m8N45j69k05l07O38
4646C38j62k07K60o5j02N5o8m5j76J98j41k72L28J83l05M3J77o2m04L83M0P8o0
4669A4L7J19l02J59P0j97P6O4J20l14L70m01L41j5l19R2R6K26j98p6J87j75k47
4692b73L01J22k58k29L74k34j54K04J51k07L13r1J00n01M59k32m5K07J49L0q2
4713A04l7P0j95J09r7j32K52l8j82N5N4M1k31M19l29m6J76j80J06o7K72L0l13
4736a59J9J00J98L2j56l1j18M82k79Q3j33M8M5l4J79k60j5M8P0j75K50n0k30R8
4760A2j29j8O1J12j91k58O7N79j84j41J57rn7J93k0k48J87l0J34k83o9J22j43
$$ plain form
4783 -156 -1 173 -66 -212 38 2 -128 -135 208 -11 -198 -93 -216 -313 -286 -18 -136 -259 9 174 37 21
4805 21 153 117 33 11 -194 109 78 -80 -261 -122 46 -98 -60 -21 -255 -237 -47 357 -96 -188 16 -24 -113 15
4829 15 32 -52 -134 63 -158 103 169 146 51 161 49 -21 125 165 -120 -292 371 -263 5 68 98 -201 232 -61
4853 -61 66 -358 -103 -82 -303 -87 156 22 101 178 94 -40 136 291 255 197 99 37 -183 111 -58 -44 27 106
4877 106 118 159 269 -38 -214 105 -25 -28 17 27 -13 84 -219 106 -44 -66 47 -28 -50 18 125 -112 80 119
4901 119 -190 22 205 120 72 6 140 204 -6 -84 142 -241 13 -36 -273 60 -7 -169 -27 -48 17 -65 285
4924 285 164 -271 68 40 -101 -40 109 -12 -197 180 95 23 322 -136 -150 4 247 -98 262 90 108 -2
4946 -2 -166 219 -152 -11 26 -39 -208 -86 150 105 -10 84 43 -69 -157 8 211 192 112 -157 77 69 84 -83
$$ packed form
4783a56J55J74k39j46K50l6j30pL43k19j87J05j23r7K7K68j18j23K68J65j37j6
4805B1J32l6q4k2k05L03l1j58j81J39J68j44L8L9k34J8J90M04m53r2K04m0q9J28
4829A5J7q4q2J97k21K61O6k3r5J10j12p0J46M0k85j72O63o34K68O3L0k99M33k93
4853f1J27m24K55K1k21K16K43j34P9P7q4j34J76J55l6n8r8o2k20K94j69J4P1P9
4877A06J2M1J10l07j76L19j30lM5J0m0R7l03L25j50k2J13p5k2O8J07k37J92L9
4901A19l09K12J83q5m8o6J34O4k10p8K26l83K54m9k37L33o7j62J42k1O5q2L50
4924B85j21m35L39k8j41O1J49j21j85L77q5p2K99m58j4J54K43l45L60j72J8j10
4946bj64L85l71J41L7o5j69J22K36m5j15R4m1j12q8J65K03j9q0k69K34qJ5j67
$$ plain form
4970 -83 -51 120 -87 -196 145 87 36 87 261 -77 -117 129 -67 -191 43 39 -96 155 -139 250 -184 -103 85
4993 85 -98 399 179 -195 -92 -11 83 143 -257 -113 -25 44 172 88 81 152 -94 -218 25 137 -312 -183 108
5016 108 -57 61 146 -1 -374 201 -42 -11 22 114 -117 78 304 -163 104 186 -130 263 -125 -22 -15 32 -40
5039 -40 182 68 -107 -150 111 -28 6 45 -43 -185 4 -202 -196 -38 -51 -339 -99 107 -79 -354 305 225 15
5062 15 -39 227 -107 179 57 -15 77 -95 -31 -35 110 -170 -306 28 181 -92 129 109 -138 -65 325 118 206
5085 206 -230 -87 -27 -290 280 243 -64 43 -153 -58 -286 -128 -76 -115 -8 -22 -102 116 37 -318 28 -55 -66
5108 -66 -346 50 2 -98 -81 91 180 -155 -254 102 -147 -48 -84 -152 -12 61 191 97 140 41 -101 -7 246 158 -76
5133 -76 -178 175 99 -37 82 -151 53 -70 189 -126 -110 164 49 -82 57 -114 -174 28 -39 -169 94 224
$$ packed form
4970h3L2J71k07j09L41n8n1N1J74l38m0K46j96j24K34mj35K51k94L89m34Q1J88
4993H5j83M97k20l74J03Q1R4O0m00J44Q8O9J28q4pP1k46j24K43J12m49J29K91
5016A08j65J18Q5j47l73N75k43L1L3R2k31J95K26m67K67Q2l16L93l88J03PM7p2
5039d0K22j14j75m3K61j39L4L9q8j42J89k06OJ58j3k88K40K06j86k75O59q0k10
5062A5n4K66l34K86j22p2R2j72O4mJ45k80j36L34J53k73K21k0k47P3L90k07Q8
5085B06m36J43O0k63N70l7l07J07j96R5k28J58N2l9J07j4q0K18p9l55L46q3j1
5108f6k80L96m8j00J7J72Q9l35r9L56k49R9l6o8J40P3J30r4M3r9j42R4K53q8k34
5133g6j02L53p6j36J19k33K04j23K59l15J6K74j15j31J39j71o0K02o7j30K63J30
$$ plain form
5155 224 57 130 -47 21 132 196 147 -214 -9 57 -133 -145 109 56 -16 199 -19 -75 -36 177 16 -162 392
5178 392 -102 85 119 -175 15 -177 147 140 -79 -20 -218 -97 33 222 -111 20 -85 91 30 23 262 35
5200 35 -268 150 98 234 -16 -77 3 37 134 53 -71 37 -27 -161 100 101 110 -89 214 28 -48 -107 61 -91 32
5225 32 416 269 -47 204 18 -33 18 97 147 -13 50 -126 28 232 -223 -123 64 7 -24 -149 -37 53 109
5248 109 110 105 161 125 99 -61 -25 -26 28 -154 -71 -12 -86 -285 4 38 22 9 299 -183 -158 4 20 -193 -72 -195
5274 -195 -53 18 119 -54 -40 -83 -227 80 -39 -37 58 -63 50 19 -57 19 328 -83 96 120 111 -37 353 189
5298 189 -102 12 11 -55 -143 115 -196 -130 -69 83 22 -479 0 21 -114 18 -205 -100 104 -118 109 68 -118
5321 -118 56 -260 30 -43 -7 84 113 15 -92 40 81 -185 -70 -70 0 19 -38 -89 -283 -117 -32 -172 3 -96 -159
$$ packed form
5155B24j67P3j77O8J11O4m9l61K05O6j90j2K54n3p2K15k18n6L9K13j61j78N54
5178C92m94J87L4k94J90j92L24pk19N9j98J21J30J89l33J31j05J76o1pK39k27
5200C5l03M18n2J36k50o1Q0L4R7q1j24J08o4j34K61JRj99L03j86p6n9J68j52J23
5225C2L84j47l16K51j86n1N1P9N0j60O3j76J54K04m55J00J87n7l1j25J12R0N6
5248A09JnN6l6k6j60L6jN4j82Q3N9p4j99K89L4j6j3K90m82K5J62J6k13J21j23
5274a95J42P1J01j73J4m3j44L07j19KR5j21J13l1p6P6L09m11J79K4rj48L90j64
5298A89k91J14jo6q8K58l11O6O1J52o1n01M79K1j35J32k23J05K04k22K27m1j86
5321a18J74l16K90p3L6R1K9r8j07J32M1k66J15%P0J9n7n1j94J66Q5j40J75r9o3
$$ plain form
5346 -159 46 192 48 -166 -48 25 -70 165 103 39 -64 -141 219 -2 58 61 -255 -2 382 -265 -232 185 -131
5369 -131 -39 11 -24 -6 -23 -164 -86 -216 -153 43 -70 34 13 56 3 169 -134 -154 175 129 37 125 -46 276 50
5394 50 113 8 -68 -91 -144 63 59 -148 27 47 19 -150 42 -177 -74 -160 -139 43 -10 -120 -169 -121 -177 -83 31
5419 31 90 -64 243 -58 46 -4 161 -156 -18 107 -106 34 -30 51 -34 -100 72 76 29 -188 -40 -168 28
5442 28 119 21 -9 298 -5 -133 66 17 64 85 -65 188 85 110 190 59 192 -6 -167 77 22 56 -262 -32
5466 -32 -44 -197 -187 23 19 -213 -33 -92 5 112 34 396 72 20 196 -200 -48 58 80 78 81 -59 -92 42 27
5491 27 -169 -79 7 -35 -221 -113 -157 -103 -192 -186 -90 -87 16 -10 36 -72 38 -50 -78 27 -241 -113 94 -143 217
5516 217 164 -108 -205 176 79 -18 -35 192 133 42 221 90 79 -167 -51 -30 -78 -132 69 -107 -93 -31 175 -25
$$ packed form
5346a59K05J46j44k14J18P3r5K35o2o4j03p7L60k21O0Ll16K53L84o47L3M17l16
5369a31R2N0l5J8j7j41P8j30O3J96j13J04k1M3n3J66l03k0L29m6r2Q8j71L22k26
5394E0O3j05p6k3n3K07mk07J75K0k8j69J92k19J03q6K1J82n3j10m9M8n6R4J14
5419C1N9j54L07l01J04n0J65l17J38J25k13J40o4Q1q5o6J72Mm7k17J48j28J96
5442B8R1r8l0L07l03j28J99m9M7K1j50K53j03K5Q0j31J33j98j61K44n5L4l18K30
5466c2j2j53J0K10mk32J80n9R7J07p8L62l24n2J76l96J52J06K2kLj40l3J34j5
5491B7j96R0Q6m2j86J08m4N4q9OR6LJ03k6M6j08J10q8k8J05k68J28K07k37L60
5516B17n3k72r7L81r7r7j7K27n9r1J79j31j1k46J16K1m8n4K01j76J4O2K06k00
$$ plain form
5540 -25 -63 134 12 200 74 -93 -76 111 93 -71 -23 166 17 -77 229 6 -30 158 42 -70 163 200 -107
5563 -107 44 -323 -28 -151 -256 410 94 96 332 329 117 -204 103 -161 65 21 66 -89 124 243 16 -164
5585 -164 91 151 136 32 223 -127 34 73 -277 19 -85 -49 -172 -83 38 -134 13 71 -2 -30 -69 -95 -11 -26
5609 -26 117 -148 -115 -34 -58 34 -197 37 -88 209 316 -119 -44 -107 114 163 -59 79 88 294 -65 123 -205
5632 -205 132 -80 -88 -10 -65 -146 50 123 156 -102 -72 36 25 -169 14 61 6 -77 -98 -75 222 79 -50 -46 77
5657 77 16 -16 232 -155 -19 26 -23 97 126 -101 102 -111 -122 -161 -162 -39 21 147 216 167 174 -156 -51 7 -99
5682 -99 30 94 -136 -99 -282 -5 -137 -54 101 -225 -152 -134 -115 -32 44 37 76 63 30 -55 -64 -72 -57 131 -51 338 -124
5709 -124 297 -79 -85 -32 68 163 6 151 131 -17 3 22 126 -25 -66 199 -118 -27 -135 -80 -75 -92 94 -53
$$ packed form
5540b5l8J97j22J88j26j67J7J87j8j64M8J89j49r4L06k23l6J88j16j12K33L7l07
5563a07J51l67K95j23j05O66l16KK36lk12l21L07k64K26m4M5j55K13J19k27j80
5585a64K55O0j5j04J91l50J61L9l50K96j04L6j23Q9J21j72J47N8p3k8l9k6Q4j5
5609b6J43k65L3Q1k4R2k31K34j25K97J07m35P5o3K21M9k22J38RK06l59J88l28
5632b05L37k12qP8n5q1J96P3L3k58L0J08j1j94J83M7n5q3k1K3K97j43j29MJ23
5657G7o1l2K48l87J36M5m9J20K9k27K03k13j1l9jJ23O0J26O9m9Pl30J05N8j06
5682i9J29O4k30L7j83K77j32Q3J55l26P3J8J9Q3P6pL9j3l3q5rqJ5J88j82L89m62
5709a24M21l76oN3J00R5j57J45k0j48K0J9J04j51m1K65l17R1j08N5Nj7J86j47
$$ plain form
5733 -53 94 170 -140 57 -185 127 -150 208 -157 -127 -74 143 88 0 219 82 -197 -6 332 27 101 -95
5755 -95 -48 138 22 -49 -67 201 80 83 93 28 -84 -164 -109 98 -177 -116 18 125 -231 -62 394 8 54 36
5779 36 129 2 204 -24 -131 -136 -23 133 25 11 -100 -91 77 302 -88 -82 148 129 -191 9 -93 106 60 129
5803 129 252 -255 130 -207 -300 -15 63 -34 -119 -77 -1 -38 49 -53 -88 117 -255 -241 -44 5 -194 -39 -38 -41 -167
5828 -167 372 248 152 -101 89 17 58 152 225 97 -71 55 -159 -14 -132 184 -112 57 -19 -183 44 -128
5850 -128 44 28 126 14 20 103 53 -79 7 218 94 -88 80 -17 29 47 -136 151 277 72 33 95 64 -104
5874 -104 -154 -5 67 -180 -155 -198 -98 -155 -97 72 -42 -77 47 -15 -180 40 107 179 48 161 -20 15 -79 150
5898 150 -147 -182 223 -52 14 -108 215 -96 84 -125 -176 -80 36 76 40 74 50 15 -12 -180 51 144 69 86
$$ packed form
5733e3J47P6l10J97k42L12k77L58l65L0N3K17n5q8K19j37k79J91L38l05P4j96
5755i5M7J86j16p1j8K68j21LJ0o5j12q0N5K07k75O1J34J07l56J69M56l86M6j8
5779C6R3j27K02k28j07nJ13J56j08j4j11RJ68K25l90OK30j9l20K00j02J99m6O9
5803A29J23n07L85l37r3K85P8r7q5M2P6l7Q7j02l5K05l72J4J97M9j99J55Jlj26
5828a67N39j24r6k53J90p2M1R4P3j28j68J26k14J45j18L16k96J69p6j64K27j72
5850a28J72j6R8j12OQ3n0j32Q6K11j24j82J68r7M6J8j83K87J26k05l9O2l1j68
5874a04n0J49P2k47K5m3J00n7N8J69j14l5J24o2j65K20O7P2j31J13j81L5r4K29
5898A50k97l5M05k75O6j22L23l11J80k09n1R6J16M0l6L4k4l5k7j68K31R3p5J7
$$ plain form
5922 86 -56 -118 34 -99 -145 28 -126 95 10 -67 -21 145 35 211 240 119 -56 65 10 140 72 67 -57 42
5946 42 75 -446 -235 24 5 -60 -204 222 62 -39 -50 166 247 1 30 3 116 -181 193 104 109 -67 -115 205
5970 205 -5 10 -106 -51 -71 52 122 56 56 -50 -5 257 -56 -256 -111 -141 -28 201 -7 -238 45 -9 -173
5993 -173 -231 -27 114 -80 -8 -128 17 212 -222 -52 -106 -222 -36 188 227 -119 -131 -221 -21 49 -193 41
6015 41 -33 57 29 21 -122 73 3 -22 -70 -65 -36 77 158 -30 254 22 -177 -27 169 -167 -134 61 -12 209 -198
6040 -198 224 -96 108 -172 -266 60 -158 -84 76 179 -24 24 183 -70 5 65 229 -82 -49 -12 7 101 71
6063 71 74 38 64 138 174 16 -76 -23 43 54 -26 -15 2 -2 -64 -416 2 62 -145 -144 -25 94 -119 -105 108 85 106 -35
6091 -35 59 45 77 71 68 7 100 -68 88 54 -76 151 50 141 -16 -70 345 -85 -169 56 15 -82 59 8 9 -109
$$ packed form
5922H6j42o2J52j33m6J73j54K21q5p7M6J66j10J76K9j21j75J21n5J30o8nj24R9
5946D2L3n21K11K59j9o5j44M26j60j01j1K16Q1k46K9k7J13k97L74q9Nj76m8L20
5970B05k10J5j16N5k0J23P0o6%j06M5K62l13k00J45l0J13K29k08k31K83n4j64
5993a73n8K04J41j94P2j20J45J95m34J70n4j16J86K24L9l46j2r0K00P0k42K34
6015D1p4R0k8qj43J95p0k5m8NK9J13Q1j88K84k32j99J50J96l36L3J95p3K21m07
6040a98M22l20K04k80r4L26k18P4J60J03k03M8J59k53P5O0J64l11L3L7J9R4l0
6063G1Ll6K6P4L6j58r2N3O6J1q0J1J7mo2l52M18O0k07JJ19J19k13J4K13k3K1j41
6091c5R4j4L2olo1R3j68J56l4j30K27j01R1j57n4M15m30q4K25m1r7J41n1Jj18
$$ plain form
6117 -109 -216 84 175 25 391 34 13 134 -79 -34 145 115 -55 85 -18 -21 273 101 -124 292 296 -13 1
6140 1 121 78 -159 -53 -86 -240 -189 -280 277 247 266 -52 32 -5 5 114 212 -39 -193 -126 -34 2 268 -162 161
6165 161 111 -97 191 -110 -125 -69 -77 119 154 178 88 -165 43 50 19 -119 -55 -66 -53 129 37 150 -63 43 4
6190 4 57 -30 -58 -83 -17 299 51 38 -158 90 -47 -64 -164 149 -213 176 73 -23 -3 236 204 -192 -99 -48 65
6215 65 -145 -39 -50 -120 132 42 108 101 -123 -2 -43 16 216 -22 384 114 -14 -194 83 -83 94 -233 -156
6238 -156 35 164 66 -2 75 -28 51 -203 14 11 -9 -161 180 82 219 7 129 196 61 162 -49 -162 -218
6261 -218 309 177 -130 -165 -114 -16 72 19 224 -133 -316 -63 27 -89 72 -79 101 84 140 21 -200 -129 48
6284 48 -61 44 141 -135 95 -48 202 -250 331 -13 68 86 227 -185 -72 246 -83 -92 -38 256 46 24 25
$$ packed form
6117a09j07L00R1j50L66l57k1J21k13M5J79l0j70J40j03lK94j72k25M16Ml09J4
6140AJ20m3k37J06l3j54N1r1N57l0J9l18Q4l7J0J09R8k51j54O7R2L6K66m30L23
6165A61n0k08K88l01j5N6qJ96L5K4r0k53K08Pl1j38O4j1J3J82r2J13k13J06l9
6190DN3q7k8k5O6L16k48j3j96K48j37j7j00L13l62L89j03r6K0K39l2l96R3N1J13
6215F5k10J06j1p0K52r0O6pk24J21m1N9K00k38M06k70j28j80K77j66J77l27P7
6238a56J91J29r8o8P7j03P9k54K17lk0j52L41r8J37k12J22O7j35J01k11j13n6
6261b18N27j32l07l5N1R8Q8n3K05l57j83K53R0j16J61j51J80j7N6j19k21P1J77
6284D8j09J05R7k76K30j43K50m52N81l44Q1J8J41m12J13L18l29rN4K94k10k2J
$$ plain form
6307 25 -54 -28 48 128 145 59 -370 72 116 -27 -25 -38 58 -54 61 105 3 129 157 64 271 84 16 127 -101
6332 -101 109 124 -151 -70 -88 7 -243 -140 169 -134 -47 25 32 -131 73 58 -85 -120 -143 263 -223 206 56 105
6356 105 -103 168 -106 117 -56 146 -240 -168 -98 -20 225 -232 94 281 47 97 -35 -27 -51 -121 -125 -223 116 -364
6380 -364 49 121 198 -27 -13 -62 195 -22 -157 -92 309 -67 -65 -61 -206 -86 -82 63 -48 5 -57 142 102 30 -122
6405 -122 -98 83 49 131 -137 -269 -155 -99 60 136 -138 -6 212 -84 76 -68 -16 48 -16 191 -36 -77 39
6428 39 -179 99 -221 -235 189 -157 -150 132 143 124 -86 -72 73 -241 -62 56 214 85 -90 43 -16 109 142
6451 142 265 -85 110 -214 108 150 -19 -222 -42 -53 75 -78 -254 -109 152 212 -237 80 -23 -173 -310
6472 -310 -9 -79 -38 -59 -107 -137 80 10 50 -157 188 128 -171 -37 42 -10 -70 92 -4 212 16 299 -62 -18
$$ packed form
6307B5p9K6P6Q0J7q6m29M42M4j43Kj3R6j12J15M4j02J26K8r3K07j87o8J11k28
6332a01K10J5k75Q1j8R5k50J03L09l03Q7P2Pj63K04j5j43l5k3M06m86M29j50M9
6356A05k08K71k74K23j73K02l86P2P0P8K45m57L26J87k34N0j32Qk4p0mr8L39m80
6380c64M13P2P7k25J4m9K57k17j35O5M01l76KMj45J20MJ45j11N3o2J99m0p2j52
6405a22K4J81l4Q2k68j32J14N6J59P6k74J32K18k96J60j44N2O4o4K07k27m1J16
6428C9k18K78l20j4M24l46PK82J1j9k10J4J45l14J79J18J58j29j75J33n9J25L3
6451A42J23l50J95l24L22M2j69k03J80j1J28j53j76J45K61O0m49L17j03j50j37
6472c10L01p0M1k1m8l0K17p0M0k07L45o0k99J34P9n2o0J62r6K16j96K83l61M4
$$ plain form
6496 -18 -176 -166 -239 -73 21 213 35 151 190 6 -75 -115 -49 -37 143 29 227 -8 -1 -40 39 4 3 -65 -103 -165
6522 -165 -67 -18 -65 65 -106 12 244 84 273 183 -132 91 46 39 220 -142 -15 -86 -220 -92 125 231 -83
6545 -83 177 95 -117 127 -255 -53 207 -159 -219 202 -4 29 -45 68 33 102 -84 -65 -80 -193 62 -107 207
6568 207 117 -84 -24 214 -188 -112 196 149 21 65 -285 -112 10 -233 20 141 -65 -124 56 -16 -283 8
6590 8 30 189 -39 0 -388 -219 26 -131 -83 -57 -64 -62 32 -24 -66 106 261 -234 -72 -251 -26 52 31 250 34
6615 34 -43 -81 101 -158 163 27 -91 72 429 23 76 -198 -128 -189 -146 0 14 58 7 230 140 194 221 -2
6639 -2 -46 98 36 53 328 30 -92 76 23 153 -11 -337 48 307 124 49 186 -84 -2 -40 15 -235 -2
6662 -2 26 83 -102 -42 24 58 3 -149 111 -111 -111 -140 218 77 -128 -20 -69 279 -5 128 58 226 -31 56 -303
$$ packed form
6496a8j58J0p3J66R4J92j78J16L9j84q1m0O6J2J80j14J98k35Pl9P9l5jo8l8o2
6522a65R8M9m7J30j71J18K32j60J89r0l15K23m5pJ81l62J27p1j34J28K17J06l14
6545h3K60q2k12K44l82K02K60l66o0M21k06L3p4J13l5O9j86J9j5j13K55j69L14
6568B07r0k01O0K38m02P6L08m7j28M4l50J73J22k43K53J21k06n9J80p2k67K91
6590HK2J59k28L9l88J69K45j57M8K6pKR4n6m2J72J55m95J62j79K25P8k1K19k16
6615C4p7l8J82k59L21j36j18J63L57m06N3k74P0o1M3J46J4M4n1K23r0N4K7k23
6639bm4J44o2J7K75k98j22J68n3J30j64l26L85K59j83p5J37k70Q2l8N5k50K33
6662bK8N7j85O0O6L4n5j52K60k22%k9L58j41k05J08m9L48k84J33p0J68k57Q7l59
$$ plain form
6687 -303 -100 -219 303 -93 -45 172 -53 -65 224 -143 164 38 -32 104 -66 320 -222 57 58 82 187 50
6709 50 -155 129 -88 -9 -189 -97 -135 104 -90 113 149 188 -65 -179 30 -80 0 -70 -1 67 60 97 -215 238
6733 238 -82 -97 -47 -12 -192 58 397 -32 36 -91 37 -68 -10 94 189 92 -61 50 -120 -60 -102 -2 107
6756 107 -144 292 -57 -293 25 -98 -3 -22 -139 -97 -166 177 55 -151 -219 81 2 65 20 -7 -184 209 -162
6779 -162 113 93 67 28 165 179 -75 196 -320 -30 45 96 162 -217 46 121 -133 -76 102 -91 -71 120 -56
6802 -56 33 -110 -182 71 -127 -265 109 -268 149 -195 -205 34 14 247 258 43 156 226 -12 -65 212 -47 34
6825 34 -184 87 -59 143 20 -64 63 52 38 -143 24 84 -161 -272 7 51 -70 -92 -208 -39 142 -80
6847 -80 160 132 -103 26 133 -2 -132 -181 159 75 -400 41 38 91 -45 215 269 -158 181 102 18 -15 -179 -44
$$ packed form
6687c03K03j19N22l96M8K17k25j2K89l67L07j26p0J36j70L86n42K79JK4J05j37
6709E0k05K84k17P9j80R2l8K39j94K03L6L9k53j14K09j10Q0p0O9O8pL7l12M53
6733B38l20j5N0L5j80K50L39m29O8j27J28j05N8J04R5r7j53J11j70O0m2J00J09
6756A07k51M36l49k36L18j23R5j9j17M2o9L43j22k06o8L00p9O3m5k7j77L93l71
6779a62K75k0k6l9J37J4k54K71n16K90P5N1O6l79K63P5k54N7J78j93K0J91j76
6802e6Q9j43p2K53j98j38L74l77M17l44j0K39k0K33J1k15J13P0k38n3K77k59Q1
6825C4k18K71j46K02j23q4J27j1j4j81J67O0k45j11K79M4j21k2j16J69J81k22
6847h0K40k8k35J29J07j35j30m9L40q4m75M41lN3j36K60N4m27L39p9q4l3j64J35
$$ plain form
6871 -44 -156 -118 202 9 62 89 -88 -1 61 -93 104 25 13 -90 136 52 36 -230 11 200 -198 -143 -155 51
6895 51 111 -14 -25 -63 -81 -64 -103 327 -116 -84 3 -198 -150 -88 66 41 -11 -143 -109 197 -17 -194 80 81 64 -90
6921 -90 2 228 152 -113 101 -156 -151 22 -65 -51 -187 264 17 -239 -10 -88 -79 -12 21 87 -11 -373 202 14 -37
6946 -37 -64 9 104 126 -68 49 73 -101 79 -70 253 -168 33 -54 -201 -215 -221 47 -127 -40 -41 -165 -43 -103 -115
6971 -115 98 -237 140 30 70 -279 19 -195 -42 -88 -27 -19 -207 1 -59 184 -45 135 32 -228 -319 153
6993 153 -110 20 133 25 -27 15 -171 251 180 69 -99 -192 299 -142 -192 277 -322 -151 -80 -131 158 10
7015 10 -31 138 57 128 22 98 103 -139 -225 96 172 -16 106 -313 78 143 189 -57 57 -280 191 260 -133 -163
7039 -163 20 -84 79 101 -359 -76 18 62 88 134 43 -29 92 321 -167 48 26 17 120 249 149 -92 10
$$ packed form
6871d4j12L8L20j93N3K7j77Q7O2j54J97p9j2j03K26q4j6k66K41J89l98N5j2K06
6895E1O0j25j1l8j8J7l9M30m43L2Q7k01M8O2J54k5n2j32L4L06k14j77K74Jj7j54
6921i0R2K26p6k65K14k57NJ73q7J4j36M51k47k56K29p8RO7L3O6r8l62N75j88n1
6946c7k7P3R5K2j94J17K4j74J80j49L23m21K01q7j47j4oK68j74Q7jj24J22o0j2
6971a15K13l35L77j10M0l49K98k14J53m6O1Qj88K08o0K43k29J80j03k60r1M72
6993A53k63J30J13j08n2M2j86M22p1j11j68r3M91m41n0M69n99J71P1n1K89j48
7015A0m1J69q1P1j06P6Nk42q6L21P6j88J22m19L91O5M6k46J14l37M71O9l93l0
7039a63J83j04J63K2m60K83R4M4K6M6r1p2J21K29m88K15k2rJ03J29j00k41J02
$$ plain form
7062 10 -54 206 -64 -105 114 -267 -137 87 101 253 -131 1 -112 27 4 143 97 20 57 -11 86 -34 -39 41
7086 41 -109 249 24 69 -50 -72 -120 -92 -132 153 -24 47 42 -80 -73 -286 10 33 158 84 -185 -212 20 -46 35
7111 35 44 -50 -61 -66 35 -54 -10 -1 -170 -262 6 4 -108 8 -250 -212 40 -176 138 109 -5 -177 136 167 -49 -210
7137 -210 -38 24 -313 35 88 9 124 -46 59 -4 -19 161 389 308 250 -77 -4 52 266 -172 4 -90 156
7160 156 -259 -74 125 -34 15 -151 -14 157 60 -28 217 28 -23 -183 213 -68 -82 156 91 -95 -102 -67 392
7183 392 -137 -272 123 201 62 147 168 9 20 -180 -239 74 -48 110 149 -44 -156 -112 35 16 -208 -58 8
7206 8 225 -61 103 211 -49 -253 -361 188 -89 39 -13 -43 -266 -29 153 131 122 -236 -6 -58 85 -4 -108
7229 -108 -188 149 -9 -157 56 -25 -6 -111 12 93 12 -19 -115 -74 -34 -82 3 -110 34 289 -147 97 -45 54
$$ packed form
7062A0o4K60k70m1K19l81J30K24J4J52l84J32j13J39k3J39m6p7L7o8R7j20nQ0
7086D1j50L58k25M5j19k2m8K8m0K85j77P1nj22Pk13K96K3J25p4k69k7K32o6Q1
7111C5Rr4j1nJ01q9M4Rj69r2K68kj12J16k58L8K52k16L14k9j14j72L13L1k16j61
7137b10J72O2l37L48N3p9J15j70J05o3j5J80K28q1n8l27P3N6K14m38J76r4K46
7160A56m15J85J99j59M9j66J37J71r7q8K45j89n1j60L96k81j4K38o5j86pL5M59
7183C92n29j35L95P8j39Q5K1j59J1k00n9L13j22J58L9j93j12M4J47j9k24J50O6
7206HK17k86J64J08k60k04j08N49k77J28n2l0k23K37J82k2rl58K30n2J43q9j04
7229a08q0L37j58j48K13q1J9j05J23Q1q1l1r6M1M0m8Q5j13J44K55m36K44j42R9
$$ plain form
7253 54 -134 184 -69 112 -212 -255 -137 -233 188 -57 66 -101 49 -247 18 -46 110 81 -108 -182 30 -82
7275 -82 148 133 -122 -70 125 -47 -128 -18 14 63 -202 -87 77 -65 -154 -65 -88 81 7 -113 177 229 79 -56
7299 -56 -122 81 279 18 152 138 -9 7 124 -28 -1 44 -83 229 111 273 -122 23 -275 -20 49 22 15
7322 15 -145 -41 189 19 81 48 -52 29 -112 -84 31 -249 -74 9 -16 250 -23 102 135 41 -88 -26 -50 6
7346 6 106 107 118 -57 62 56 -202 -334 -188 -58 190 72 67 -207 108 113 270 -120 18 -142 186 37 -58 263
7370 263 -31 132 -13 85 -150 89 -23 163 -149 -141 -67 -216 84 45 -14 -191 300 180 156 -98 -65 126 165
7393 165 81 -124 -160 88 21 -94 -186 176 240 94 -60 -10 -148 -102 -235 -38 -60 126 175 -425 121 108 -60
7416 -60 -223 50 -17 120 99 -4 97 73 -7 304 29 26 -287 -296 -102 3 -60 121 -198 19 -169 -32 250
$$ packed form
7253E4j88L18k53J81l24m3J18r6M21k45J23j67J50k96K65o4J56k9j89p4K12j12
7275h2K30j5k55N2J95j72q1J10L2M9k65J15J64j42q9Q9k3J69p4j20K90N2j50j35
7299e6o6K03J98k61J34j4j47J6J17j52K7M5j27L12j18J62l95J45k98K55O9k7p
7322A5j60J04K30j70O2l3j00Q1j41K8J15k80J75Q3k5K66k73J25L3r4j29O2k4N6
7346FJ00JJ1j75J19ok58j32J46J30K48j18nk74L15NJ57l90J38j60L28j49r5L21
7370B63k94J63j45R8k35K39j12J86l12QP4j49L00l9n9j77M91j20k4k54L3J91L9
7393A65q4k05l6K48o7j15r2L62O4j46j54N0j38M6j33J97k2J86M9o00N46j3j68
7416f0j63K73o7J37k1j03J01k4q0L11k75ll13rJ94J05o3J81l19K17j88J37K82
$$ plain form
7439 250 -14 -4 9 -176 138 -19 79 -96 -262 66 -101 96 -67 -48 -89 -67 31 163 -65 217 -108 110
7461 110 -73 -165 -66 102 81 -103 13 212 -188 131 52 11 135 -106 -195 -31 26 -24 153 -7 5 6 100 -73
7485 -73 11 108 81 -77 133 -3 132 42 60 51 218 258 87 149 54 2 57 -130 -55 -54 -287 -120 -13 18 -146 129
7511 129 -123 -53 -137 -126 -17 47 128 169 -63 -270 159 -67 -86 -239 -334 73 54 -141 -156 290 -3 -172 -180 -322
7535 -322 -175 -73 147 -180 48 48 -112 -233 -58 -136 318 187 -115 -17 62 71 -28 -107 86 -218 -15 -81 -62 -100
7559 -100 50 111 88 75 -60 127 -1 -222 -149 -41 66 -72 75 67 -179 15 -151 51 1 200 -93 223
7581 223 26 13 -60 86 -179 -85 -217 -65 -23 -35 -4 -161 160 98 392 -90 32 237 31 -225 85 -140
7603 -140 47 -60 -144 39 46 -19 144 188 -36 -163 81 -29 -81 90 -179 -69 -74 -19 -103 32 -73 62 94 67
$$ packed form
7439B50k64J0J3j85L14j57R8j75j66L28j67J97j63J9m1K2R8J32k28K82l25K18
7461A10j83r2R9J68k1j84J16J99m00L19p9m1J24k41q9J64N7n0J77j60J2JR4j73
7485g3Q4R7k7j58K10j36J35r0J8rJ67M0j71O2r5n2N5j87P5Jk33J67J07L1j64K75
7511A29k52P0q4J1J09O4Q1M1k32k07M29k26j9j53r5M07j9j95j5M46k93j69qj42
7535c22J47J02K20l27K28%j60j21J75p8M54j31l02R8P9Rr9p9J93l04K03o6J9l8
7559a00J50O1k3j3j35J87j28k21P3J08J07j38J47qk46J94j66K02n0J99k93L16
7581B23j97j3p3J46k65R4j32J52M2j2L1j57L21o2K94m82J22K05k06k56L10k25
7603a40J87j07q4J83Po5J63M4k24j27K44j10n2J71k69J10nN5q4J35j05J35L2k7
$$ plain form
7627 67 -25 183 61 20 97 -11 233 88 162 27 147 170 -156 142 33 -270 33 62 25 -70 15 -37 280 -149
7651 -149 -66 -24 21 -119 -152 112 -37 -63 -188 143 1 -53 70 49 -124 155 -220 -58 -105 -126 0 -110 197
7674 197 -215 -157 248 149 118 12 -159 -28 -60 60 200 -57 122 28 -84 53 -42 -337 6 -6 -21 -139 65
7697 65 -81 -295 -64 -81 -217 -14 -5 -5 13 -143 121 -166 -102 33 -295 1 -112 -147 76 39 130 12 117 61
7721 61 -74 143 118 -45 -6 -174 -26 -84 42 119 59 -131 54 -110 147 -162 40 -175 -113 -151 55 -40 206
7744 206 -132 -103 89 -43 34 87 -229 117 -201 64 -78 188 -12 -51 -67 -39 131 -22 -169 49 -204 -86
7766 -86 -94 -144 131 86 -111 163 45 6 -260 -118 92 69 56 64 76 65 254 -65 -100 -55 -2 -10 7 -222 -151 42
7792 42 202 -33 -115 -12 -366 -37 40 -73 -54 -176 113 62 166 32 30 -128 29 73 -14 -185 0 126 135 6
$$ packed form
7627F7r2K08j22m1P7j08K44j45P4j35J20K3l26K98j09l03L03K9l7r5Q5n2L17m29
7651a49Q3M2M5j40l3K64j49k6j25L31j42n4J23k1j73K79l75J62m7k1J26j10L07
7674A97m12N8M05r9l1j06j71J31l2J20J40k57J79r4j12J37r5k95L43j2j5j18K04
7697F5j46k14K31j7j36K03R%J8j56K64k87O4J35l28K96j13l5K23l7R1j18J05n6
7721F1j35K17k5j63L9j68J48n8J26P7o0j90J85j64K57l09K02k15O2l8K06r5K46
7744B06l38K9J92j32P7N3l16L46l18K65j42K66k00l9j6K8J70j53j47K18k53J18
7766h6qn0K75m5j97K74j18l9k66J42K10k3j3QJ2j1J89l19l5M5N3qJ7k29P1J93
7792D2J60k35q2J03l54L29P7j13J9j22K89n1J04j34kj58J57M4q7j71J85J26Rj29
$$ plain form
7816 6 -47 -78 34 -92 148 -253 -26 8 -190 -228 -2 27 -29 110 -112 16 60 -143 -138 112 8 124 16 42
7840 42 119 211 218 -142 85 -21 -39 97 -127 4 -270 275 111 27 -7 -41 -11 -74 -180 -137 -87 182 88 116 159
7865 159 -76 -26 -128 -65 -68 -68 125 -98 35 29 -90 142 -95 -142 -98 76 -87 174 69 -234 -85 121 260
7888 260 -100 187 -125 -84 105 286 -33 98 43 39 255 79 355 -57 159 71 72 28 -83 119 105 -42 -17
7911 -17 136 66 -18 -45 67 229 41 -66 -133 225 -2 -19 36 105 40 -143 -295 -115 -175 71 -85 -246 -130
7934 -130 -103 48 107 -21 109 207 -48 -37 -102 16 -47 117 105 -25 -82 -199 109 -174 27 -184 -51 -94 -8
7957 -8 -170 3 78 -2 -241 205 219 -11 11 152 316 21 82 -16 -219 -140 60 -119 -38 144 111 -70 -32 -68
7981 -68 40 -21 1 -12 107 -112 -133 -54 45 166 -134 -112 181 -27 -55 -87 -15 -91 44 -103 79 183 96 199
$$ packed form
7816Fn3l1J12j26K40m01K27L4j98l8K26K9n6J39k22J28M4k03NK50j04J16j08K6
7840D2P7R2Pl60K27j06j8J36k24J31k74N45j64q4l4l4L0o3j06M3N0K69r4K8M3
7865A59k35N0j02O3l%J93k23J33oj19K32k37m7M4J74j63K61j05l03J49K06J39
7888B60l60K87l12M1J89J81l19J31n5mK16j76K76m12K16q8Jm4j11K02j4j47K5
7911a7J53p0q4k7J12J62j88j07o7L58k27j7N5O9o5j83j52J80o0K46j56j61J16
7934a30K7J51N9j28J30R8k55J1o5J18o3J64j2j30n7j17L08k83K01k11J33m3Q6
7957hj62J73P5q0k39M46J4k30K2J41J64k95O1r8k03P9K00j79Q1J82l3j81L8l6
7981f8J08o1K2j3J19k19k1P9R9J21l00K2K93k08k8l2P2p6J35j47J82J04q7J03
$$ plain form
8005 199 42 231 25 14 63 31 75 -56 0 186 -34 -192 -221 144 -30 -105 138 78 106 -135 192 53 -99
8028 -99 -191 76 17 -176 227 77 137 -58 -185 216 29 -114 99 -63 -23 186 236 65 -80 -135 -92 120 -147
8051 -147 124 -42 -71 -49 19 -123 -49 -74 111 164 115 85 92 226 9 195 -111 149 47 70 230 154 121 -61
8075 -61 148 -220 18 -115 66 219 194 10 -95 41 75 -129 204 -1 -57 -100 72 138 75 126 60 238 -167
8098 -167 140 90 -115 -148 16 48 214 79 -5 -85 -20 -27 -22 49 24 89 -84 -125 172 52 107 242 243 -213 98 -156
8124 -156 -58 -173 -110 -150 -15 213 7 81 -129 40 148 -237 42 150 24 5 24 -169 132 301 316 -87
8146 -87 103 -33 136 -80 -336 -87 49 -160 -95 -63 -178 134 -30 66 135 163 -320 -166 -90 13 98 -256 -164
8169 -164 313 316 170 -64 156 11 195 -103 -154 -154 -9 -205 -130 56 -24 -16 -43 3 -1 50 34 -124
$$ packed form
8005A99j57J89k06j1M9l2M4j31N6J86k20j58k9L65j74p5K43o0K8k41L27j39j52
8028i9r2K67n9j93M03j50O0j95j27M01j87j43K13j62M0K09N0j71j45n5M3K12k67
8051a47K71j66k9K2O8j42P4k5J85N3m9l0PJ34k17J86l06K60j02K3J60p6l3j82
8075f1K09l68K38j33J81J53k5j84j05J36L4k04L33k05n6m3J72O6o3N1o6J78m05
8098a67L07n0k05l3J64L2J66j35q4q0O5pNP1k5O5j73m1K97j20N5J35Jm56L11k54
8124a56R8j15O3m0J35K28k06P4k10J69J08l85K79J08j26j9J9j93L01J69J5m03
8146h7J90j36J69k16k56K49J36k09O5L2j15L12j64R6O9K8m83J54P6J03Q5l54R2
8169a64M77Lj46k34K20j45J84k98n1%J45j96P5J86q0Qk7M6mN1j6j58
8191a24
$$ Imaginary data points
##PAGE= N=2
##DATA TABLE= (X++(I..I)), XYDATA
$$ plain form
0 0 0 0 0 0 0 0 8 0 0 0 8 -8 8 -16 16 -20 24 -32 33 -41 54 -64 72 -86 100 -117 135 -156 178 -204 233 -265
32 -265 300 -336 380 -429 479 -535 596 -666 739 -820 907 -1003 1107 -1222 1349 -1486 1635
49 1635 -1801 1986 -2187 2412 -2664 2949 -3273 3643 -4072 4577 -5181 5917 -6839 8026 -9621
64 -9621 11875 -15299 21067 -32521 63588 -314215 -802889 397029 460919 -390961 -150364
75 -150364 282616 -172468 -68509 359767 -138726 -401526 326425 303959 -371934 -82991
85 -82991 389732 -54056 -215032 151914 -25317 -205156 213656 129764 -340753 -22923
95 -22923 325617 -141484 -242329 222497 52844 -276902 113485 261088 -165350 -110344
105 -110344 179352 -58092 -115335 208576 18989 -277003 100807 272645 -181272 -193077
$$ packed form
0@%%%%%%Qq%%Qj6J6k4L2l6M4n6O5p4R5j18J36j58J86k17K52k91L34l82M37m98
32b65N65o36P16q09R08j014J131j262J405j559J727j910K110k329K571k835L121
49A635l436L787m173M599n076N613o222O916p715Q649r758J1098j2756J4865j7647
64i621K1496k7174L6366n3588R6109l77803m88674J199918O3890q51880K40597
75a50364M32980m55084J03959M28276m98493k62800P27951k2466o75893K88943
85h2991M72723m43788j60976L66946j77231j79839M18812q3892m70517L17830
95b2923L48540m67101j00845M64826j69653l29746L90387J47603m26438N5006
105a10344K89696k37444n7243L23911j89587k95992L77810J71838m53917j1805
$$ plain form
115 -193077 200749 50471 -199751 54656 143692 -100653 -24571 125516 -83712 -111353
125 -111353 156470 72679 -180637 -29178 158533 1092 -102355 -1469 10819 -19909
135 -19909 21155 -8823 -34173 59529 38289 -98919 -25987 126081 21523 -112437 -2048
146 -2048 95399 14699 -25262 65 -37216 -18911 72606 14060 -99497 -1349 108284 -24105
158 -24105 -112358 33970 82399 -54637 -56723 47182 19239 -15439 30290 -22784 -74288 52687
170 52687 86672 -80039 -65954 106804 35270 -105695 10704 88963 -43916 -49378 57888
181 57888 4187 -32075 59749 656 -103884 33428 110474 -68649 -88748 81433 37473
192 37473 -74706 13557 32959 -64925 9729 74247 -66452 -56575 113423 20671 -129747
$$ packed form
115a93077L93826j50278k50222K54407Q9036k44345P6082J50087k09228k7641
125a11353K67823q3791k53316J51459J87711j57441j03447J00886J2288l0728
135a9909M1064k9978k5350R3702k1240j37208P2932J52068j04558j33960J10389
146b048R7447q0700l9961K5327l7281J8305R1517n8546j13557R8148J09633j32389
158b4105q8253J46328M8429j37036k086J03905k7943l4678M5729n3074n1504J26975
170E2687L3985j66711J4085J72758p1534j40965J16399P8259j32879n462J07266
181E7888n3701l6262R1824n9093j04540J37312P7046j79123k0099J70181m3960
192C7473j12179Q8263J9402r7884P4654O4518j40699R877J69998r2752j50418
$$ plain form
203 -129747 23923 110947 -58459 -56798 80494 -254 -63488 65406 34022 -98609 15519
214 15519 100398 -63204 -66618 100248 20373 -105992 25605 73802 -65574 -27248 71213
225 71213 -36626 -58824 81461 18017 -107895 21529 92019 -61248 -51911 81865 3887
236 3887 -70148 47177 40891 -72461 9692 79689 -49760 -50698 83024 14101 -83203 30789
248 30789 58966 -65676 -19920 77253 -25332 -66407 56305 28404 -75232 10917 61717
259 61717 -54515 -36625 75587 -2980 -77254 35899 52961 -58618 -15553 62962 -21797
270 -21797 -41834 55689 14644 -63346 24860 58896 -48267 -30359 63323 -10 -53436 32099
282 32099 28282 -52977 2843 51547 -37993 -39541 53829 7041 -61287 18656 42870 -45551
$$ packed form
203a29747J53670Q7024j69406J661J37292q0748o3234J28894l1384j32631J14128
214A5519Q4879j63602l414J66866p9875j26365J31597M8197j39376L8326R8461
225G1213j07839k2198J40285o3444j25912J29424P0490j53267R337J33776p7978
236C887p4035J17325o286j13352Q2153O9997j29449r38J33722o8923r7304J13992
248C0789K8177j24642M5756R7173j02585m1075J22712k7901j03636Q6149N0800
259F1717j16232J7890J12212p8567p4274J13153J7062j11579M3065P8515q4759
270b1797k0037R7523m1045p7990Q8206L4036j07163J7908R3682o3333n3426Q5535
282C2099l817q1259N5820M8704q9540j548R3370m6788o8328P9943K4214q8421
$$ plain form
294 -45551 -17719 53765 -15049 -45853 42557 25603 -53716 5535 53344 -28950 -30840 49637
306 49637 7226 -48235 24364 38144 -42392 -13257 50553 -12446 -42389 32554 21058 -44941
318 -44941 1595 38271 -28088 -26400 38744 -293 -43913 19744 29464 -37206 -10636 40941
330 40941 -11554 -31653 31476 16049 -36999 9891 36533 -25683 -17894 40741 590 -37207
342 -37207 22850 27970 -35668 -8482 38944 -13451 -32071 27952 11272 -38472 6419 30748
354 30748 -29469 -20634 37009 -1011 -39583 17569 27351 -30895 -8634 34195 -10372 -24117
366 -24117 29180 11301 -33380 10690 34044 -22693 -18401 34076 2552 -30114 16664 20108
378 20108 -29142 -3991 30564 -15260 -26150 25218 7960 -33681 6710 25498 -25674 -15565
$$ packed form
294d5551K7832P1484o8814l0804Q8410j6954p9319N9251M7809q2294j890Q0477
306D9637m2411n5461P2599J3780q0536K9135O3810o2999k9943P4943j1496o5999
318d4941M6536L6676o6359J688O5144l9037m3620O3657R720o6670K6570N1577
330D0941n2495k0099O3129j5427n3048M6890K6642o2216P789N8635m0151l7797
342c7207O0057N120o3638K7186M7426n2395j8620O0023j6680m9744M4891K4329
354C0748o0217Q835N7643l8020l8572N7152R782n8246K2261M2829m4567j3745
366b4117N3297j7879m4681M4070K3354n6737M292N2477l1524l2666M6778L444
378B0108m9250K5151L4555m5824j0890N1368j7258m1641M0391J8788n1172J0109
$$ plain form
390 -15565 32506 -3172 -33148 17665 22687 -26744 -4769 29092 -10913 -18151 29094 6996
402 6996 -32456 13206 32644 -22894 -18575 29924 3819 -25009 13121 12436 -25612 3034 26808
415 26808 -22559 -24232 30654 8443 -36455 3410 26736 -18581 -14295 24164 -4137 -23406
427 -23406 20898 14994 -28964 1403 32269 -13059 -21107 26044 10474 -25566 7918 22030
439 22030 -18930 -7489 25582 -8772 -22549 22543 10564 -33004 1706 31216 -19028 -26532
451 -26532 24434 9785 -27640 4039 16871 -19125 -3083 25807 -12707 -23107 26706 16058
463 16058 -29404 853 27770 -11540 -12288 23672 -2707 -22218 22525 17082 -33376 -4567 36293
476 36293 -9952 -31132 19457 14444 -27660 797 22499 -19592 -17804 24525 2844 -24185
$$ packed form
390a5565M8071l5678k9976N0813N022m9431K1975L3861m0005p238M7245k2098
402F996l9452M5662J9438n5538M319M8499k6105k8828L8130o85l8048K8646K3774
415B6808m9367j673N4886k2211m4898L9865K3326m5317M286L8459k8301j9269
427b3406M4304n904m3958L0367L0866m5328q048M7151j5570l6040L3484J4112
439B2030m0960J1441L3071l4354j3777M5092j1979m3568L4710K9510n0244p504
451b6532N0966j4649l7425L1679J2832l5996J6042K8890l8514j0400M9813j0648
463A6058m5462L0257K6917l9310p48L5960k6379j9511M4743n443n0458K8809M0860
476C6293m6245k1180N0589n013m2104K8457K1702m2091J788M2329k1681k7029
$$ plain form
488 -24185 8432 12732 -18330 3140 22515 -17764 -17148 30976 10706 -30404 3748 26404 -10861
501 -10861 -9447 18618 -7528 -16234 26712 11128 -39142 -4268 39984 -3880 -33406 4889
513 4889 14395 -6395 3340 -1488 -24454 6664 32927 -17006 -35462 23155 27181 -24513 -12428
526 -12428 21568 -1903 -9192 18085 -1669 -23212 17811 27484 -24816 -19928 28250 11108 -23086
539 -23086 187 13562 -9351 -3705 10219 -9280 -8725 13719 -4195 -18710 13589 14115 -25039
552 -25039 -9772 27210 -106 -23971 9166 15737 -13568 -727 16502 -10257 -9517 22844 3508
565 3508 -25108 8087 26136 -12671 -17464 13989 6113 -9541 5370 -690 -16611 9237 17625
578 17625 -21520 -17325 25024 6558 -28590 1649 23487 -11208 -15198 14482 3491 -11817
$$ packed form
488b4185L2617M300l1062K1470J9375m0279O16M8124k0270m1110L4152K2656l7265
501a0861J414K8065k6146q706M2946j5584n0270L4874M4252m3864k9526L8295
513D889R506k0790R735m828k2966L1118K6263m9933j8456N8617M026n1694J2085
526a2428L3996k3471p289K7277j9754k1543M1023R673n2300M888M8178j7142l4194
539b3086K3273J3375k2913N646J3924j9499N55K2444j7914j4515L2299N26l9154
552b5039J5267L6982k7316k3865L3137O571k9305J2841J7229k6759P40L2361j9336
565C508k8616L3195J8049l8807m793L1453p876j5654J4911o060j5921K5848Q388
578A7625l9145M195M2349j8466l5148L0239K1838l4695l990K9680j0991j5308
$$ plain form
590 -11817 9668 6980 -16050 3780 21747 -8944 -16091 16176 9972 -15037 1427 12281 -8139
603 -8139 -2710 11497 -9437 -11331 18929 3768 -28876 1877 28267 -12651 -25463 15523 12764
616 12764 -18265 -1827 13274 -9422 -3891 17048 -7122 -16458 20331 14525 -25140 -3689 28111
629 28111 -1365 -17938 9893 6122 -11461 9847 9654 -22424 -3362 28529 -7602 -29792 14184
642 14184 19895 -21413 -10959 17401 -3583 -11559 11915 -2044 -17862 14463 15871 -23278 -6491
655 -6491 28184 -2588 -22312 15064 15082 -18079 330 18453 -11136 -7697 21766 -4072 -24884
668 -24884 16784 21273 -26264 -13627 26328 801 -21821 7390 6823 -15909 5471 13480 -20328
681 -20328 -8363 27462 -1850 -27600 11314 20967 -16173 -6226 18133 -5894 -9812 19715 2228
$$ packed form
590a1817K1485k688k3030J9830J7967l0691p147L2267o204k5009J6464J0854k0420
603h139N429J4207k0934j894L0260j5161l2644L0753K6390m0918j2812M0986k759
616A2764l1029J6438J5101k2696N531K0939k4170r336L6789n806l9665K1451L1800
629B8111k9476j6573K7831l771j7583K1308j93l2078J9062L1891l6131k2190M3976
642A4184N711m1308J0454K8360k0984p976K3474j3959j5818L2325J408l9149J6787
655f491L4675l0772j9724L7376J8l3161J8409J8123k9589L439K9463k5838k0812
668b4884M1668M489m7537J2637L9955k5527k2622K9211n67k2732K1380Q009l3808
681b0328J1965L5825k9312k5750L8914R653l7140R947K4359k4027l918K9527j7487
$$ plain form
694 2228 -22327 10495 20811 -17952 -10905 22262 -1423 -20691 11551 11391 -20035 -2231 17507
707 17507 -11259 -13087 16634 -260 -20950 10156 15803 -20135 -8294 23337 -1183 -19340
719 -19340 10903 11164 -13684 3079 14943 -12180 -6784 22220 482 -21860 9573 18420 -15086
732 -15086 -8921 16392 -2809 -13130 11263 3305 -18993 4637 16721 -15970 -13068 19238 2355
745 2355 -20470 6149 14127 -13325 -4367 16164 -5335 -12257 16204 6527 -18440 4617 19838
758 19838 -11188 -11409 17691 3307 -16028 7128 11363 -14673 -2828 16360 -8128 -15310 14345
771 14345 5724 -20067 1768 15917 -12631 -10673 16498 -307 -17535 9527 11950 -16085 -2014
784 -2014 19281 -6951 -13781 17186 7452 -18422 4931 18321 -12032 -9070 17887 -315 -16798
$$ packed form
694B228k4555L2822J0316l8763P047L3167k3685j9268L2242j60l1426J7804J9738
707A7507k8766j828K9721j6894k0690L1106N647l5938J1841L1631k4520j8157
719a9340L0243K61k4848J6763J1864k7123N396K9004k1738k2342L1433Q847l3506
732a5086O165K5313j9201j0321K4393p958k2298K3630J2084l2691K902L2306j6883
745B355k2825K6619P978k7452Q958K0531k1499o922K8461r677k4967K3057J5221
758A9838l1026k21K9100j4384j9335K3156M235k6036J1845J9188k4488p182K9655
771A4345q621k5791K1835J4149k8548J958K7171j6805j7228K7062K423k8035J4071
784b014K1295k6232o830L0967r734k5874K3353J3390l0353K962K6957j8202j6483
$$ plain form
797 -16798 10909 10383 -18593 -1618 18365 -10126 -15607 15548 4523 -20033 4476 14923 -15090
810 -15090 -7894 18481 -3723 -16957 14114 10633 -18361 1205 20069 -9560 -12194 18817 3819
823 3819 -18471 8816 15783 -15885 -5590 19457 -5537 -16879 14219 7846 -20441 1011 17289
836 17289 -13151 -12659 17345 202 -19409 8966 13143 -17264 -3908 19178 -6533 -14813 16310
849 16310 7292 -18351 5268 17972 -12780 -8312 19758 -438 -17225 11468 12077 -17393 -1730
862 -1730 17909 -9879 -14397 16583 3443 -20295 5145 14986 -15405 -8542 17487 -3456 -16963
875 -16963 12452 9148 -18255 1044 18621 -10208 -12243 18168 4455 -17610 7391 15190 -13833
888 -13833 -4907 18408 -4104 -15539 13280 8389 -18049 835 16109 -11616 -11407 15936 457
$$ packed form
797a6798K7707n26k8976J6975J9983k8491n481L1155j1025k4556K4509J0447l0013
810a5090P196K6375k2204j3234L1071l481k8994J9566J8864k9629k634L1011j4998
823C819k2290K7287O967l1668J0295K5047k4994j1342L1098o373k8287K1452J6278
836A7289l0440M92L0004j7143j9611K8375M177l0407J3356K3086k5711q280L1123
849A6310r018k5643K3619J2704l0752M468K8070k0196j6787K8693O09k9470J5663
862a730J9639k7788m518L0980j3140k3738K5440R841l0391O863K6029k0943j3507
875a6963K9415l304k7403J9299J7577k8829k035L0411j3713k2065K5001P799k9023
888a3833Q926K3315k2512j1435K8819m891k6438J8884J5274k7725K09K7343j5479
$$ plain form
901 457 -18744 7089 12349 -16370 -4923 17151 -6281 -14395 14490 7038 -18199 3907 17918
914 17918 -11367 -9746 18022 1830 -15802 9511 11667 -15092 -815 17884 -8353 -14108 16256
927 16256 5488 -19338 3558 14882 -13715 -8286 16755 -3963 -17676 11712 9974 -18902
939 -18902 -1759 18871 -7817 -13228 15570 4581 -16916 6904 14833 -13169 -5124 18436 -2618
952 -2618 -14493 12827 7781 -16247 2607 16241 -12233 -10431 17649 865 -19357 6927 12532
965 12532 -15204 -4844 15987 -6977 -14100 14075 5686 -18595 2819 16413 -10649 -8700 15470
978 15470 368 -13557 10732 9253 -15079 1290 17711 -8913 -12514 16246 5143 -17537
990 -17537 4088 14136 -12360 -7903 15104 -2621 -15320 8921 7590 -15639 -992 14068
$$ packed form
901D57j9201K5833N260k8719J1447K2074k3432q114K8885p452k5237K2106J4011
914A7918k9285J621K7768j6192j7632K5313K156k6759J4277J8699k6237n755L0364
927A6256j0768k4826K2896J1324k8597N429K5041k0718j3713K9388j738k8876
939a8902J7143K0630k6688n411K8798j0989k1497K3820P929k8002Q045K3560k1054
952b618j1875K7320n046k4028J8854J3634k8474J802K8080j6784k0222K6284N605
965A2532k7736J0360K0831k2964p123K8175q389k4281K1414J3594k7062J949K4170
978A5470j5102j3925K4289j479k4332J6369J6421k6624l601K8760j1103k2680
990a7537K1625J0048k6496M457K3007j7725j2699K4241j331k3229J4647J5060
$$ plain form
1002 14068 -8467 -10565 13155 2768 -14622 5613 11600 -11033 -2903 14821 -4378 -11279 13637
1015 13637 7282 -16230 1728 17358 -8160 -11549 13072 3533 -13918 4615 9286 -12322 -3366
1028 -3366 13749 -5922 -13480 10786 6222 -15207 205 12673 -8781 -7543 13337 -581 -13131
1041 -13131 9418 10121 -14222 -2031 17355 -4616 -12810 12502 7858 -14103 1723 12917 -8229
1054 -8229 -6665 12583 -1509 -12721 8631 6823 -15576 -1354 14779 -7792 -12429 11709 3883
1067 3883 -14490 3895 10903 -11125 -4356 15930 -3520 -14041 12205 10479 -14731 -1283 15933
1080 15933 -4605 -9386 10649 2693 -10889 6312 8212 -13223 -2449 15582 -5714 -14616 10561
1093 10561 7194 -14666 -472 11283 -8580 -7292 12286 -1490 -13608 9050 10131 -13813
$$ packed form
1002A4068k2535k098K3720j0387j7390K0235N987k2633Q130J7724j9199o901K4916
1015A3637o355k3512J7958J5630k5518l389K4621r539j7451J8533M671k1608Q956
1028c366J7115j9671p558K4266m564k1429J5412J2468k1454J238K0880j3918j2550
1041a3131K2549P03k4343J2191J9386k1971q194K5312m644k1961J5826J1194k1146
1054h229J564J9248j4092j1212K1352j808k2399J4222J6133k2571m637K4138p826
1067C883j8373J8385P008k2028O769K0286j9450j0521K6246j726k5210J3448J7216
1080A5933k0538m781K0035p956j3582J7201J900k1435J0774J8031k1296q902K5177
1093A0561l367k1860J4194J1755j9863J288J9578j3776j2118K2658J081k3944
$$ plain form
1105 -13813 -3179 15685 -3092 -11605 9974 6604 -10739 2952 10260 -8584 -3883 13475 -2679
1118 -2679 -13290 9632 8663 -14217 -3538 13422 -4458 -10944 8180 2342 -11498 4095 8333
1131 8333 -11806 -4516 14642 -2125 -13805 8074 9533 -10598 -1482 11181 -4364 -5357 11136
1144 11136 644 -11694 7725 10700 -11730 -4773 13999 -1379 -11817 6669 5925 -10600 -167
1157 -167 8870 -8112 -6137 10776 -964 -12480 5916 8874 -11285 -4320 11840 -1686 -8723
1170 -8723 7511 4127 -8734 3621 9143 -8357 -3827 13306 113 -12123 6065 9337 -9033
1183 -9033 -3295 9363 -3373 -6778 7939 809 -11327 3979 9058 -9926 -7016 11076 282
1196 282 -11261 4355 6867 -7930 -829 8330 -4713 -5212 10124 1841 -10249 4795 10241 -7555
$$ packed form
1105a3813J0634J8864j8777q513K1579l370j7343J3691P308j8844M701J7358j6154
1118b679j0611K2922r69k2880J0679J6960j7880o486J9124n838j3840J5593M238
1131H333k0139P290J9158j6767j1680K1879J459k0131R116J2663j5545r93J6493
1144A1136j0492j2338J9419K975k2430O957J8772j5378j0438J8486p44j6525J0433
1157a67R037j6982J975J6913j1740j1516J8396K958k0159O965J6160j3526p037
1170h723J6234l384j2861J2355N522j7500M530J7133j3193j2236J8188L272j8370
1183i033N738J2658j2736l405J4717p130j2136J5306N079j8984K910J8092j0794
1196B82j1543J5616K512j4797P101R159j3043m99J5336q283j2090J5044N446j7796
$$ plain form
1210 -7555 -4738 10186 135 -8080 5195 4252 -8213 1136 8030 -7215 -6603 9730 989 -11516
1224 -11516 2527 7908 -7717 -4189 7966 -1766 -6839 6421 3080 -9126 2313 9578 -6162
1237 -6162 -6090 9686 2501 -8649 3280 7394 -6022 -1786 8113 -2714 -6476 7163 2729 -9889
1251 -9889 1208 8148 -6547 -6541 7590 534 -8604 2629 4867 -7241 -1151 8046 -4099 -6519
1265 -6519 8122 3455 -9327 1865 9117 -4801 -4586 8364 994 -6687 5267 5113 -7256 -45
1279 -45 8759 -3857 -7170 6979 2783 -8912 939 6219 -6258 -4250 7147 -1718 -7703 5550
1293 5550 4035 -8482 -289 8479 -3958 -5984 7508 2639 -7342 3121 7075 -5602 -2113 8571
1307 8571 -1395 -6693 6274 4333 -8226 302 7898 -4618 -5909 6829 753 -8070 2644 4926
$$ packed form
1210g555K817J4924j0051q215J3275r43j2465R349O894j5245O12J6333q741j2505
1224a1516J4043N381j5625L528J2155r732n073J3260l341j2206J1439P265j5740
1237f162P2J5776p185j1150J1929M114j3416M236R899j0827l762J3639m434j2618
1251i889J1097O940j4695OJ4131p056r138J1233K238j2108O090R197j2145k420
1265f519J4641m667j2782J1192P252j3918K15J2950p370p681J1954j54j2369P211
1279d5Q804j2616l313J4149m196j1695R851N280j2477K008J1397q865n985J3253
1293E550j515j2517Q193Q768j2437k026J3492m869r981J0463L954j2677L489J0684
1307H571r966n298J2967j941j2559Q528P596j2516j291J2738o076q823J0714K282
$$ plain form
1321 4926 -7349 -2302 7454 -2712 -7013 5555 3513 -7765 845 7215 -4276 -3615 7607 524
1335 524 -6374 4443 5373 -6195 -325 7796 -2832 -5567 5851 2270 -7314 1590 5856 -5527
1349 -5527 -3786 6193 -995 -7127 3603 3660 -7087 -866 6313 -3105 -5283 5590 1851 -6350 2118
1364 2118 5934 -4389 -2325 6717 -181 -5160 4630 3751 -5646 366 6483 -2873 -4395 5211 1289
1379 1289 -6223 1204 4273 -4874 -2742 4990 -1824 -5549 3673 2324 -6105 -257 5817 -3006 -4045
1394 -4045 4906 1254 -5328 2613 4954 -4096 -1424 6379 -409 -4662 4315 3693 -5151 77 5464
1409 5464 -2861 -3893 4366 962 -5768 1589 3588 -5275 -2366 4982 -1915 -5689 3559 2541 -5785
1424 -5785 -25 5421 -2576 -3425 5198 1111 -4693 2782 4558 -4045 -959 6170 -1016 -4763 4102
$$ packed form
1321D926j2275N047R756j0166m301J2568k042j1278Q610O370j1491O61J1222p083
1335E24o898J0817R30j1568N870Q121j0628k735J1418l581r584Q904M266j1383
1349e527J741R979p188o132J0730N7j0747O221P179r418k178J0873l739q201Q468
1364B118L816j0323K064R042o898m979R790q79r397O012O117r356j522R606l922
1379A289p512P427L069r147K132P732o814l725R222j349q429N848O074q823j039
1394d045Q951l652o582P941K341r050K672P803o788m253Q977o22q844N228N387
1409E464q325j032Q259l404o730P357J999q863K909P348o897l774R248j018q326
1424e785N760N446p997q49Q623m087n804P475J776q603L086P129p186l747Q865
$$ plain form
1439 4102 2823 -4855 273 5009 -3578 -3386 4748 -493 -6031 2295 3418 -5652 -1912 5573 -2064
1454 -2064 -5195 3725 2758 -5260 724 5152 -2947 -2559 5428 544 -4709 3485 4105 -4450 -681 6009
1470 6009 -1601 -4206 3933 1806 -5134 922 4312 -4046 -3051 4726 -586 -5899 2411 3145 -4930
1485 -4930 -1475 4590 -2041 -4027 4078 1438 -4692 1986 4685 -3652 -1844 5840 -99 -4844 3812
1500 3812 3624 -4775 -34 5586 -2234 -3749 4621 1187 -5606 1258 4033 -4567 -2708 4735 -1002
1515 -1002 -5379 2428 2449 -4911 -404 4222 -2361 -2705 4534 583 -4615 2764 4358 -3716 -1289 5726
1531 5726 -389 -4190 3749 2806 -4143 374 4679 -3184 -3360 4323 368 -5461 1716 3519 -4185
1546 -4185 -2055 4134 -1282 -4033 2792 1657 -4680 695 4357 -2957 -2341 4915 674 -4462 2550
$$ packed form
1439D102j279p678N128M736q587J92Q134n241n538Q326J123r070L740P485p637
1454b064l131Q920r67q018N984M428q099L88P987m884n253Q194O20q555L769O690
1470F009p610k605Q139k127o940O056L390q358R95P777n312n313Q310P34q075
1485d930L455O065o631j986Q105k640o130O678K699q337J808P684n939m745Q656
1500C812j88q399M741N620p820j515Q370l434o793O864K775q600J859P443n737
1515a002m377P807K1p360M507M626o583l44P239l951n198P379J594q074K427P015
1531E726o115l801P939r43o949M517M305p863j76P683l955n829P177J803p704
1546d185K130O189n416k751O825j135o337N375L662p314O16P256m241n136P012
$$ plain form
1561 2550 4332 -3483 -1022 5083 -600 -3418 3226 2010 -4206 881 3890 -3152 -3188 4184 68
1576 68 -5128 1364 2787 -4099 -1446 3670 -2097 -3740 3742 1641 -5093 694 4835 -2908 -2931 4888
1592 4888 1218 -4255 2583 3728 -3210 -494 4864 -1644 -3798 4043 1855 -5018 451 4158 -3263
1607 -3263 -3141 3842 -658 -4642 2338 2497 -4744 -960 4583 -2412 -4169 4429 2174 -5054 1066
1622 1066 4520 -2696 -1950 4702 -3 -3726 3428 3050 -4502 60 5314 -2138 -3776 4233 1353
1637 1353 -4972 710 3383 -4089 -2099 4319 -1420 -4966 3186 2427 -5532 -320 4916 -2273 -3351
1652 -3351 4065 1546 -3865 2304 3846 -3785 -734 5412 -931 -4055 4196 2871 -4968 330 4562
1667 4562 -2579 -3072 4069 142 -4715 1881 2832 -4750 -1506 4646 -1856 -4540 3178 2028 -4644
$$ packed form
1561B550J782p815K461O105n683k818O644j216o216N087L009p042l6P372m116
1576F8n196O492J423o886K653N116n767j643P482k101o734N787M141p743k3P819
1592D888l670n473O838J145o938K716N358o508k154P841k188o873N469L707p421
1607c263J22O983m500l984O980J59p241L784N543o995j757Q598k255p228O120
1622A066L454p216P46O652m705l723P154l78p552M562N254p452j638Q009k880
1637A353o325N682K673p472J990O418n739l546Q152p59p959N212N236p189j078
1652c351P416k519n411O169J542p631L051O146o343l124Q251j325p839N298M232
1667D562p141m93P141l927m857O596R51p582L244O152o502k684P718j150o672
$$ plain form
1682 -4644 512 4447 -2858 -2371 4693 212 -4325 3000 3816 -3929 -526 5347 -1171 -3527 3929
1697 3929 2216 -4544 799 3785 -3395 -2553 4439 -582 -5327 2384 3066 -4924 -1257 4547 -2066
1712 -2066 -3816 3738 1171 -4842 1501 3924 -3269 -2004 5457 -26 -4090 3581 3236 -4040 209
1727 209 4921 -2149 -2921 4287 877 -4786 1720 3700 -4350 -1982 4470 -1460 -4480 3017 2076 -4773
1743 -4773 -65 4030 -2779 -2879 4516 548 -4805 2336 3891 -3877 -856 5203 -1020 -3377 3847
1758 3847 2325 -4017 828 4647 -2960 -2499 4306 -22 -4627 2021 2993 -4467 -1230 3963 -1951
1773 -1951 -4093 3244 1300 -4785 759 3819 -3431 -2333 4483 125 -3987 2936 3376 -3804 -519
1788 -519 5059 -1487 -3309 4130 1317 -4264 1144 3663 -3431 -2149 4182 -441 -4600 2235 1981
$$ packed form
1682d644N156L935p305M87P064m481m537P325Q16p745L403N873o518k356P456
1697C929j713o760N343K986p180Q42O992n021m745P711O82p990L667N804o613
1712b066j750P554k567o013O343K423p193J265P461n483m064P671l45p276M249
1727B09M712p070p72P208l410n663O506J980q050K368O452n930l020P497r41o849
1743d773M708M095o809j00P395l968n353P141J555p768L021O059o223k357P224
1758C847j522o342M845L819p607M61O805m328m605O648R72p460L237N193n914
1773a951k142P337j944o085N544L060p250J098O816m358m112O923M40p180L285
1788e19N578o546j822P439k813n581N408K519p094J282O331m623m159O835k54
$$ plain form
1803 1981 -4675 -887 3924 -2118 -3144 3800 1080 -4851 1440 3810 -3409 -1880 4847 -223 -4075
1818 -4075 3311 2729 -3766 274 4801 -2144 -2565 4506 897 -4712 1797 3351 -3888 -1609 4158
1833 4158 -1499 -4529 3215 1567 -4742 502 4030 -3133 -2886 4283 195 -4413 2184 3436 -3854
1848 -3854 -164 4735 -1287 -2746 4080 1809 -4229 1352 4245 -3098 -2017 4398 -338 -4332 2444
1863 2444 2459 -4468 -845 4340 -2365 -3795 3581 622 -4738 1202 3331 -3335 -1822 4219 -251
1878 -251 -3602 3211 2238 -3999 538 4641 -1940 -2729 4368 1063 -3995 1776 3358 -3117 -1364 4232
$$ packed form
1803A981o656L788M811o042j026O944k720n931O291K370p219J529O727n070l852
1818d075P386n82o495M040M527o945m21P071l609n609O509J554p239K279N767
1833D158n657l030P744j648o309N244L528p163K47P169m088m608O597J252p290
1848c854L690M899o022j459O826k271o038N581K893p343J081O415m736l994O776
1863B444J5o927L623N185o705j430P376k959n360N940K129o666J513O041m470
1878b51l351O813r73o237M537M103o581p89P097l305n058N771J582o475J753N596
$$ [...]
8191a56
##END NTUPLES=NMR FID
##END=
