##TITLE=1H_Pr 5054-2
 CDCl3, 8 sc, 
 5.08.2021
##JCAMPDX= 6.0         $$ Bruker NMR JCAMP-DX V2.0
##DATA TYPE= NMR FID
##DATA CLASS= NTUPLES
##ORIGIN= UXNMR, Bruker Analytische Messtechnik GmbH
##OWNER= root
$$ XWIN-NMR		Version 3.5
$$ Thu Aug  5 10:44:46 2021 Russian Standard Time (UT+4h)  she@DPX200
##.OBSERVE FREQUENCY= 200.131506
##.OBSERVE NUCLEUS= ^1H
##.DELAY= (6, 6)
##.ACQUISITION MODE= SIMULTANEOUS
##.ACQUISITION SCHEME= undefined
##.AVERAGES= 8
##.DIGITISER RES= 18
##SPECTROMETER/DATA SYSTEM= spect
##.PULSE SEQUENCE= zg30
##.SOLVENT NAME= CDCl3
##.SHIFT REFERENCE= (INTERNAL, CDCl3, 0, 15.7039)
##AUDIT TRAIL= $$ (NUMBER, WHEN, WHO, WHERE, WHAT)
$$ ##TITLE= Audit trail, XWIN-NMR		Version 3.5
$$ ##JCAMPDX= 5.01
$$ ##ORIGIN= Bruker BioSpin GmbH
$$ ##OWNER= she
$$ F:/spectra/data/she/nmr/H-F/1/audita.txt
$$ ##AUDIT TRAIL=  $$ (NUMBER, WHEN, WHO, WHERE, WHAT)
(   1,<2021-08-05 10:43:42.31 +0400>,<she>,<DPX200>,
      <created by zg, POWCHK disabled, PULCHK disabled
       configuration hash MD5:
       00 E9 B6 7A A2 85 ED C7 34 08 36 98 17 FE 4E 26
       data hash MD5: 16K
       D6 51 29 28 64 22 46 48 F6 43 6E 36 93 E9 93 78>)
$$ ##END=
$$ 
$$ hash MD5
$$ 6F 0E 03 19 8C C4 52 FA 38 3E 2B 02 1D D0 18 94
##$RELAX= 
##$RELAX= 
##$RELAX= 
##$RELAX= 
##$RELAX= 
##$RELAX= 
$$ Bruker specific parameters
$$ --------------------------
##$DU= <F:/spectra>
##$EXPNO= 1
##$NAME= <H-F>
##$PROCNO= 1
##$TYPE= <nmr>
##$USER= <she>
##$AMP= (0..31)
100 100 100 100 100 100 100 100 100 100 100 100 100 100 100 100 100 100 
100 100 100 100 100 100 100 100 100 100 100 100 100 100 
##$AQSEQ= 0
##$AQ_mod= 1
##$AUNM= <au_zg>
##$AUTOPOS= <>
##$BF1= 200.13
##$BF2= 200.13
##$BF3= 200.13
##$BF4= 200.13
##$BF5= 200.13
##$BF6= 200.13
##$BF7= 200.13
##$BF8= 200.13
##$BYTORDA= 1
##$CFDGTYP= 0
##$CFRGTYP= 5
##$CHEMSTR= <none>
##$CNST= (0..31)
1 1 145 1 1 1 1 1 1 1 1 1 1 1 1 1 1 1 1 1 1 1 1 1 1 1 1 1 1 1 1 1 
##$CPDPRG= <>
##$CPDPRG1= <>
##$CPDPRG2= <>
##$CPDPRG3= <>
##$CPDPRG4= <mlev>
##$CPDPRG5= <mlev>
##$CPDPRG6= <mlev>
##$CPDPRG7= <mlev>
##$CPDPRG8= <mlev>
##$CPDPRGB= <>
##$CPDPRGT= <>
##$D= (0..31)
0 1.2 0 0 0 0 0 0 0 0.06 0 0.03 0 0 0 0 0.0002 0 0 0 0 0 0 0 0 0 0 0 0 
0 0 0 
##$DATE= 1628145821
##$DBL= (0..7)
120 120 120 120 120 120 120 120 
##$DBP= (0..7)
150 150 150 150 150 150 150 150 
##$DBP07= 0
##$DBPNAM0= <>
##$DBPNAM1= <>
##$DBPNAM2= <>
##$DBPNAM3= <>
##$DBPNAM4= <>
##$DBPNAM5= <>
##$DBPNAM6= <>
##$DBPNAM7= <>
##$DBPOAL= (0..7)
0.5 0.5 0.5 0.5 0.5 0.5 0.5 0.5 
##$DBPOFFS= (0..7)
0 0 0 0 0 0 0 0 
##$DE= 6
##$DECBNUC= <off>
##$DECIM= 32
##$DECNUC= <off>
##$DECSTAT= 4
##$DIGMOD= 1
##$DIGTYP= 9
##$DL= (0..7)
0 120 120 120 120 120 120 120 
##$DP= (0..7)
150 150 150 150 150 150 150 150 
##$DP07= 0
##$DPNAME0= <>
##$DPNAME1= <>
##$DPNAME2= <>
##$DPNAME3= <>
##$DPNAME4= <>
##$DPNAME5= <>
##$DPNAME6= <>
##$DPNAME7= <>
##$DPOAL= (0..7)
0.5 0.5 0.5 0.5 0.5 0.5 0.5 0.5 
##$DPOFFS= (0..7)
0 0 0 0 0 0 0 0 
##$DQDMODE= 0
##$DR= 18
##$DS= 0
##$DSLIST= <SSSSSSSSSSSSSSS>
$$ [...]
##$SUBNAM2= <"">
##$SUBNAM3= <"">
##$SUBNAM4= <"">
##$SUBNAM5= <"">
##$SUBNAM6= <"">
##$SUBNAM7= <"">
##$SUBNAM8= <"">
##$SUBNAM9= <"">
##$SW= 20.0188882624521
##$SWIBOX= (0..15)
0 0 2 0 0 0 0 0 0 0 0 0 0 0 0 0 
##$SW_h= 4006.41025641026
##$TD= 16384
##$TD0= 1
##$TE= 0
##$TE2= 300
##$TE3= 300
##$TEG= 300
##$TL= (0..7)
0 120 120 120 120 120 120 120 
##$TP= (0..7)
150 150 150 150 150 150 150 150 
##$TP07= 0
##$TPNAME0= <>
##$TPNAME1= <>
##$TPNAME2= <>
##$TPNAME3= <>
##$TPNAME4= <>
##$TPNAME5= <>
##$TPNAME6= <>
##$TPNAME7= <>
##$TPOAL= (0..7)
0.5 0.5 0.5 0.5 0.5 0.5 0.5 0.5 
##$TPOFFS= (0..7)
0 0 0 0 0 0 0 0 
##$TUNHIN= 0
##$TUNHOUT= 0
##$TUNXOUT= 0
##$USERA1= <user>
##$USERA2= <user>
##$USERA3= <user>
##$USERA4= <user>
##$USERA5= <user>
##$V9= 5
##$VALIST= <valist>
##$VCLIST= <CCCCCCCCCCCCCCC>
##$VD= 0
##$VDLIST= <DDDDDDDDDDDDDDD>
##$VPLIST= <PPPPPPPPPPPPPPP>
##$VTLIST= <TTTTTTTTTTTTTTT>
##$WBST= 1024
##$WBSW= 4
##$XGAIN= (0..3)
0 0 0 0 
##$XL= 0
##$YL= 0
##$YMAX_a= 71518
##$YMIN_a= -120454
##$ZGOPTNS= <>
##$ZL1= 120
##$ZL2= 120
##$ZL3= 120
##$ZL4= 120
##$ABSF1= 10
##$ABSF2= 0
##$ABSG= 5
##$ABSL= 3
##$ALPHA= 0
##$AQORDER= 0
##$ASSFAC= 0
##$ASSFACI= 0
##$ASSFACX= 0
##$ASSWID= 0
##$AUNMP= <proc_1d>
##$AZFE= 0.1
##$AZFW= 0.1
##$BCFW= 1
##$BC_mod= 2
##$BYTORDP= 1
##$COROFFS= 0
##$CY= 11.3945322036743
##$DATMOD= 1
##$DC= 2
##$DFILT= <>
##$DTYPP= 0
##$F1P= 2.36226072786647
##$F2P= -0.459571619588291
##$FCOR= 0.5
##$FTSIZE= 0
##$FT_mod= 4
##$GAMMA= 1
##$GB= 0.15
##$INTBC= 1
##$INTSCL= 1
##$ISEN= 128
##$LB= 0.24
##$LEV0= 0
##$LPBIN= 0
##$MAXI= 10000
##$MC2= 0
##$MEAN= 0
##$ME_mod= 0
##$MI= 1.114404
##$NCOEF= 0
##$NC_proc= 0
##$NLEV= 6
##$NOISF1= 3.799351
##$NOISF2= 2.8
##$NSP= 1
##$NTH_PI= 0
##$NZP= 0
##$OFFSET= 15.70392
##$PC= 1
##$PHC0= -13365.63
##$PHC1= 26.80099
##$PH_mod= 1
##$PKNL= yes
##$PPARMOD= 0
##$PSCAL= 0
##$PSIGN= 0
##$REVERSE= no
##$SF= 200.130013532006
##$SI= 16384
##$SIGF1= 3
##$SIGF2= 2
##$SINO= 400
##$SIOLD= 16384
##$SREGLST= <1H.CDCl3>
##$SSB= 0
##$STSI= 0
##$STSR= 0
##$SW_p= 3612.71676300578
##$SYMM= 0
##$S_DEV= 0
##$TDeff= 0
##$TDoff= 0
##$TI= <>
##$TILT= no
##$TM1= 0
##$TM2= 0
##$TOPLEV= 0
##$USERP1= <user>
##$USERP2= <user>
##$USERP3= <user>
##$USERP4= <user>
##$USERP5= <user>
##$WDW= 1
##$XDIM= 8192
##$YMAX_p= 0
##$YMIN_p= 0
$$ End of Bruker specific parameters
$$ ---------------------------------
##NTUPLES= NMR FID
##VAR_NAME=  TIME,          FID/REAL,        FID/IMAG
##SYMBOL=    X,             R,               I
##VAR_TYPE=  INDEPENDENT,   DEPENDENT,       DEPENDENT
##VAR_FORM=  AFFN,          ASDF,            ASDF
##VAR_DIM=   8192,          8192,            8192
##UNITS=     SECONDS,       ARBITRARY UNITS, ARBITRARY UNITS
##FACTOR=    0.0002496,     1,               1
##FIRST=     0,             0,               0
##LAST=      2.0444736,     0,               0
##MIN=       0,             -120454,         0
##MAX=       2.0444736,     71518,           0
$$ Real data points
##PAGE= N=1
##DATA TABLE= (X++(R..R)), XYDATA
0@%%%%%%%%%%%%%%qJ6j6J6j6K3l1L2m0M8n6O4p2Q8j03J18j34J51j70J93k18K45
36A30k76L10l48L89m33M80n34N94o56P26q03Q82r70J072j183J303j435J581j745
55i16J930k140K378k653K977l362L826m403N143o130P517r629J3286k1384P5762
70F2202m3190p8511J16648J4369p3051j7033O4123J457l1987j9643n32J4295L4258
83D3405j8333m1863J6442M3156l7605n7557L2264O0217l2103m9522K1207K8452
95H160k3466j7887J6132J5550k66n359k0159j3348K1418J1685k4790j310K6201
108g439n156k7521Q94J5153J513Q083O445j8780n115J9659r244k2770J9899K8704
122D325j6889k5892J3658J5586j2753j287J8130K387n802K880o482j3914J5753
$$ plain form
0 0 0 0 0 0 0 0 0 0 0 0 0 0 0 0 -8 8 -8 8 -8 15 -16 16 -24 24 -32 32 -40 48 -55 63 -71 80 -90 103 -115 130
36 130 -146 164 -184 205 -228 252 -282 312 -344 382 -421 461 -509 563 -620 683 -752 829 -916
55 -916 1014 -1126 1252 -1401 1576 -1786 2040 -2363 2780 -3350 4167 -5462 7824 -13560 62202
70 62202 19012 -59499 57149 71518 -1533 -18566 45557 47014 15027 -4616 -5148 9147 43405
83 43405 25072 -16791 -349 42807 5202 -52355 -20091 40126 8023 -41499 -20292 8160
95 8160 -15306 -33193 -17061 -1511 -1777 -7136 -27295 -40643 -19225 -7540 -32330 -33640 -7439
108 -7439 -12595 -40116 -39222 -24069 -22556 -14473 -8028 -26808 -31923 -12264 -21508 -44278 -24379 4325
122 4325 -12564 -38456 -24798 -9212 -21965 -23252 -5122 -2735 -8537 -5657 -12139 -26053 -10300
135a0300K4654j6915j8979K7385J1287l6532n263M0824Q424k7992L727K1404j4172
148G552j5718J5293R325n744N277K695j3824k852J4298np991J3158R634j8061
162A3037j0328J3643N437j0704K355J3771n376j7339K675R872l716j380P282J774
176B1003o894o180k518J288P395J700q600M05N241j0303j0001R958J1437o041
190G890p913L867m98p666j294M453K556K650m202r076j829N514N60n264N085Q162
206B995q345j1971M947P105m230k771P192K089j0230l725N189O3j48N625O00m189
222i804j626K8k613K195P950r04n796K688J019n853L79Q309L823m891j766L045
238c817j720l110L475N604J610k038k649j115j76K445K584M08L129R43n217k219
$$ plain form
135 -10300 14354 -2561 -21540 5845 17132 -19400 -24663 16161 24585 -3407 320 21724 7552
148 7552 -8166 7127 16452 10708 15985 18680 4856 2004 16302 16297 8306 21464 31098 13037
162 13037 2709 16352 21789 11085 13440 27211 21835 4496 7171 17043 13327 11947 19229 21003
176 21003 14109 7929 5411 6699 14094 15794 7194 7599 12840 2537 -7464 2494 13931 7890
190 7890 -23 3844 3346 -4320 -5614 -1161 1395 4045 -157 -9233 -11062 -5548 -4988 -10252 -5167 2995
206 2995 -5350 -17321 -12374 -5269 -9499 -12270 -5078 -2989 -13219 -16944 -11755 -11692 -11840 -6215 -5615 -9804
222 -9804 -11430 -11402 -14015 -11820 -3870 -4774 -10570 -7882 -6863 -12716 -12337 -4028 -205 -5096 -6862 -3817
238 -3817 -5537 -8647 -5172 432 2042 4 -2645 -3760 -3936 -1491 1093 1501 4630 5573 356 -1863
254a863L279L337o69J121L543l048l916J704J082j68L727K546l203l095M78J198
270F053q98K597K661j672j579r41k811O97L586J562j922r14O99j678m307J678
286B811N596M6l243j765J284j944k408K328J705J70q6l412k549K347R67j900k95
303c48L850p37o315p21L502j77l79O70l7j296k502o76P93J535J708j193k268L56
321d235o22j311J84K186J943k589j286O30r00j086K211J629p34p21k97m59j373
338f830K133J480j003L20L21j619r9Q91N07Q71R78O88k321j063J806P38R3J557
356e52J83Nj658o12K003N21Q1J160p7l21j66j62O43Q62J409l46j273O16J007j830
376A493Q43K203m0n91j33j82j08l3J327j22L6P35j192r37R33L55O53j12p9Qr51
$$ plain form
254 -1863 1416 4753 4084 5205 8748 5700 1784 3488 4570 4402 8129 10675 7472 4377 4855 6053
270 6053 5155 7752 10413 8741 7162 6221 3410 4107 7693 9255 7333 6419 7118 5440 1133 2811
286 2811 8407 8453 5210 3445 4729 2785 377 2705 4410 4580 4494 1082 -1467 880 1847 -53 -348
303 -348 3502 2765 -3550 -4271 -769 -946 -1325 -655 -692 -1988 -4490 -5166 -4373 -2838 -1130 -2323 -4591 -4235
321 -4235 -4857 -6168 -5984 -3798 -1855 -4444 -5730 -5100 -6000 -7086 -4875 -3246 -3980 -4701 -4998 -5457 -6830
338 -6830 -4697 -3217 -4220 -3900 -3579 -5198 -5297 -4406 -3899 -3028 -2050 -1362 -3683 -4746 -2940 -2202 -2109 -552
356 -552 -369 -364 -2022 -2634 -631 -110 -29 1131 1054 733 567 405 1048 1910 3319 2973 1700 2316 3323 1493
376 1493 2336 4539 4499 3908 3775 3593 3485 3452 4779 4657 4693 5428 4236 3299 4232 4587 5240 5128 5049 5057 4106
397D106k13m8J79M22p8k68n80p66O39N02j627P07M38r64r40J30K03j66n37J33
417A272q04k77M21j632J65J094l00j595j07j8J81p15n42O5J47N57j413j060J100
436c461J10p32p90L4J254j53j783M27J120jj402j1J128L25n10k17j008J199J743
455b728j654j124J994J413j277j749J693K090p89j411L00K252P26k321l95K165
471h15J383n72p64k32K188O83k225j0K478K267k152k427K813J669j264j498J739
488C261K212l42k557J47J956J060j347j144J470N62n05p57o72J841K352l168j906
505B463K478J218k283j560K049J723k277j504P11P29m81j005O60M77j263q24p8
522A233j094L31J069k81j865m44J323j841j337J913M54j433m22R5r65q56O09J441
$$ plain form
397 4106 3893 3845 4024 4446 4368 4100 3520 2754 3393 3895 2268 2975 3413 2449 1509 1639 1842 1676 1139 1272
417 1272 468 191 612 -1020 -855 239 -61 -1656 -1763 -1781 -1600 -2315 -2857 -2792 -2645 -2088 -3501 -4561 -3461
436 -3461 -3351 -4083 -4873 -4839 -3585 -3738 -5521 -5094 -3974 -3975 -5377 -5388 -4260 -3935 -4445 -4662 -5670 -4471 -2728
455 -2728 -4382 -5506 -3512 -2099 -3376 -5125 -3432 -1342 -2131 -3542 -3242 -990 -264 -2585 -2980 -815
471 -815 568 -4 -768 -1000 1188 1871 -354 -364 2114 4381 2229 -198 2615 4284 3020 1522 3261
488 3261 5473 5131 2574 2721 4677 5737 4390 3246 4716 5278 4773 4016 3344 5185 7537 4369 2463
505 2463 4941 6159 3876 2316 4365 6088 3811 2307 3018 3747 3266 2261 2921 3398 2135 1311 1233
522 1233 139 470 1539 1258 -607 -1051 272 -1569 -2906 -993 -539 -1972 -2394 -2299 -3264 -4120 -3511 -2070
540b070j104j473P89O81j917j621K668K552l284j564K457l5k414K16K228K60l51
557c982O7j319r73K563J292k369m1L058O20l879j318M852K627m051p82L593N04
574D62l216l09L051J425k27m60j132j11K847J41k741J915L716l41m848m66N221
591D927J101l233j378M025K036m393k668L420K945j125j956J6J254M06j715j234
607B428J659L421j227m549m26L695O54l747j174N126J465o845k561M923K126l833
623A135j612K663O07k490j408m05R99K577p97l896q6K894p44m193R37N401j356
640B26n394J60L052l58k657J154K662j405k352K95n23N00J755L76j646k04J351
657c008j127k252K115L026j083j210k39L94m2m18O56J776K67p73o42j51L14R73
$$ plain form
540 -2070 -3174 -4647 -3858 -3177 -5094 -6715 -4047 -1495 -4779 -6343 -3886 -3921 -6335 -6119 -3891 -3631 -3982
557 -3982 -3915 -5234 -6207 -3644 -2352 -4721 -4762 -1704 -1084 -4963 -6281 -1429 1198 -2853 -3635 -42 462
574 462 -2754 -3063 -12 1413 1186 726 -406 -517 2330 2471 -270 1645 5361 5020 172 -294 4927
591 4927 6028 2795 1417 5442 7478 3085 417 3837 6782 5657 3701 3717 4971 5377 3662 2428
607 2428 4087 7508 6281 1732 1306 5001 5655 1908 734 5860 7325 480 -2081 2842 4968 1135
623 1135 -477 2186 2793 303 -1105 -1510 -511 2066 1269 -2627 -2713 181 -563 -4756 -3819 1582 226
640 226 -5168 -5008 -1956 -2314 -4971 -3817 -1155 -2560 -4912 -4617 -5140 -4640 -2885 -2509 -4155 -4359 -3008
657 -3008 -4135 -6387 -4272 -1246 -2329 -3539 -3778 -3384 -3426 -3844 -3188 -1412 -1145 -1918 -2560 -2711 -2397 -1424
675a424J075J48k74L05p4j076Q70J243J394o30j141P35L32j208N55K466N69j257
693B608p45Q47j187j55K377O82j314L31K0r56j082J305J966r24o14P46j027j124
711A754O53J353o26j77J006j030k712O62J780m83n08N23M00j857j227R06N85J66
729A168L54p70j154L3k61p36O59J308n0k158m73K34o8j63P17P34l75j154p25r0
749b970J96J228j27k55j34m05r63L79Q58N42k67J31p1j179o03R76J041N1N82j18
769a108o64r44M58R26J46Q23J52r99l51L39P9O7J412P66r21j179M65M60k49R93
789F71R29o7n68p28J89J1N04J045n25k37O21r35n56O94Q38O94p43m8j27r82K74
810I54R01M43m8m09m86l54j30Q02p4Q5N57n52j031m86L5Q27L38L75n94q64K88
$$ plain form
675 -1424 -349 -201 -475 -170 -244 -1320 -450 793 2187 1557 416 1151 1483 275 830 3296 3865 2608
693 2608 1863 2710 1523 1368 3745 4427 3113 3444 3464 2508 1426 2731 4697 3773 3159 3905 2878 1754
711 1754 2407 3760 3134 2957 3963 2933 221 883 2663 2180 1672 2195 2595 738 -489 417 1002 1168
729 1168 1522 752 -402 -369 -630 -1366 -707 601 551 -1607 -2080 -1846 -1914 -2077 -1360 -626 -1001 -2155 -2880 -2970
749 -2970 -2774 -1546 -1673 -1928 -2062 -2467 -3430 -3051 -2193 -1651 -1918 -1787 -1858 -3037 -3640 -2664 -1623 -1572 -990 -1108
769 -1108 -1772 -2716 -2258 -1332 -1186 -363 -211 -1210 -1561 -1222 -1143 -1076 336 1102 181 -998 -533 -73 -322 671
789 671 1600 1533 965 237 426 437 941 1986 1461 1224 1845 910 354 1048 1886 2580 1837 1789 1662 680 954
810 954 1855 2298 2250 1841 1355 1001 871 1673 1599 1684 2241 1689 658 172 207 1034 1372 1747 1153 289 577
831E77n48mN70O44l65m94p37J13J35l47N85M30l48k07r91K45J22L59L15l83r1
852d20k61p86j70Q50M94J41o48J33j80j019M67O67J54M06q80l37K6P1k04O67J85
873f44L33q73n49K63M08M88r1N79k14n87m85L11mM82L63P3n50j93k38J16N66L03
895a43M55m75K3m62OJ92P63KJ89k74k65o63K79P63K56J72m8m16q3k31J67P11K05
918A123J54l21l60k02N6m3J036l4J52n11n47L70K2J40N34k32pj47p02K90J17Q19
940A707j78j57j66p08j38L49L03R0K25l19m98J19l55L74J79R0j19l68r7k65k61
961a93L42L18pl79o08p9k31j14J48Q40l24k03n12m19K28j05K55J74k22K26n41
982a406n71O84J46J56n07K46l34l39J47L68L21K35j85o45K22j19K72j78K61M33
$$ plain form
831 577 29 25 595 1239 874 380 -357 -244 -109 -456 129 559 211 4 -987 -742 -620 -261 54 -329 -420
852 -420 -681 -1467 -1637 -787 -293 -152 -800 -667 -847 -1866 -1399 -732 -578 -172 -1052 -1389 -1363 -1292 -1496 -829 -644
873 -644 -311 -1184 -1733 -1470 -1062 -574 -665 -86 -300 -887 -1372 -1061 -1065 -583 -220 -147 -697 -890 -1128 -1012 -446 -143
895 -143 312 -163 -140 -602 -596 -404 359 361 550 276 11 -652 -373 390 646 818 770 354 271 40 207 918 1123
918 1123 1277 956 596 394 450 407 1443 1409 1561 1050 503 873 895 1035 1569 1337 1330 1183 481 771 888 1707
940 1707 1529 1372 1206 498 360 709 1012 1102 1327 1008 510 629 274 648 827 917 798 430 333 68 -193
961 -193 149 467 460 81 -527 -606 -837 -951 -803 37 -287 -490 -1002 -1421 -1193 -1298 -1043 -869 -1091 -865 -1406
982 -1406 -1977 -1293 -1147 -991 -1498 -1252 -1586 -1925 -1778 -1410 -1089 -854 -1039 -1684 -1462 -1581 -1309 -1487 -1226 -793
1002g93n8n15n38R57N26l36OM36L47n65n18N63M91K50L4l94L02N5l0M3M66M20
1024A149qj60j15j17Q87q1n45M81Q37q50n88N83R89o09R2R0j08j79Nj77J80K73
1046B029j75j95k55K0M33p07J50M29L12p78o41L40k2k67L0N18m98l65r7m25K49
1067H5k09M48l73o40K84k66k07k0N4N14o43j96J48n68j35M14O7l42k54K7K49p38
1089b301K47P29n09l22K41L32j83n93L98N12j97j28K01j89L48k59P58j73m06O40
1109h54L08p28K82Q12Q6p93L93R06j20p62J30Q15J09q0p4L53j51pN75k55L0O22
1131A597o4n51K16O05P3m72O7O09l28m66L63L87K06p05MN18k55k09J71k09k73
1152A284Q28n10l42r7N72k20r89N84K40n60m10K2M63l13n58L7K60k43m93K62k43
$$ plain form
1002 -793 -851 -1366 -1904 -947 -421 -757 -751 -315 32 -533 -1051 -488 3 253 287 -107 195 250 220 263 729 1149
1024 1149 1141 981 866 749 1636 1555 1010 1491 2328 1478 890 1473 2462 1853 1945 2035 1927 1748 1753 1576 1756 2029
1046 2029 1854 1659 1404 1424 1857 1150 1300 1729 2041 1263 622 962 940 673 703 1221 723 358 261 -164 85
1067 85 -124 324 -49 -689 -405 -671 -878 -898 -844 -330 -973 -1169 -1021 -1589 -1724 -1310 -1243 -1585 -1839 -1812 -1563 -2301
1089 -2301 -2054 -1325 -1834 -2156 -1915 -1583 -1766 -2359 -1961 -1449 -1646 -1774 -1573 -1762 -1414 -1673 -915 -1088 -1494 -854
1109 -854 -546 -1274 -992 -180 -94 -887 -494 412 292 -470 -340 475 584 504 430 783 632 625 1200 945 975 1597
1131 1597 1533 982 1198 1803 1876 1404 1471 2080 1752 1286 1649 2036 2242 1537 1541 2059 1804 1595 1766 1557 1284
1152 1284 2112 1602 1260 1163 1735 1515 526 1110 1350 790 380 402 865 552 -6 31 291 48 -445 -183 -426
1173d26k92J91L2k51j21o0p0m46K97J92N9p83j13O17l15l87O7N07l49k68N22o2
1195a459m16L07J19m72L03K42L5K44m48L79K8k29J96L40m29L40R6L27K85j50k1
1216c83K01K2oK2J61M2M13J84l39m4K99qK22J91j88K17k04J80J42n6L06q2J36
1239A428m30J66oO5K13n0J05l24J44k5k16j48j73M41M06o32k50K65k23l5j72L99
1261I48j35l34J40mn62p0O01k42l62K23k7j91n42J75r4L9M38m16l46J22r8K60
1283d77k73J26K14n13k64J80L94k76L0N8q9l62L84L17m58K07M53m01k90K55J7
1304g68r3q2M23K3j49R5p2K50K4Mm6R3J88j14j3J15K52K4k81J59J91l52K29R4
1328A94J71q9J49j0k57L09j16J90K19l09J25j18m18N00K8oM5n7L20l41l73N76
$$ plain form
1173 -426 -718 -527 -495 -746 -867 -927 -997 -1443 -1146 -954 -895 -1678 -1791 -1174 -1489 -1876 -1809 -1302 -1651 -1919 -1397 -1459
1195 -1459 -1875 -1568 -1449 -1921 -1618 -1376 -1341 -1097 -1545 -1166 -1138 -1367 -1171 -831 -1260 -920 -824 -497 -212 -362 -383
1216 -383 -182 -160 -166 -144 17 59 472 656 317 273 572 564 786 977 789 1006 802 982 1124 1068 1374 1292 1428
1239 1428 998 1164 1158 1223 1436 1386 1491 1167 1311 1286 1070 922 749 1190 1596 964 714 979 756 721 549 948
1261 948 813 479 619 615 53 -17 584 342 -20 203 176 -15 -557 -382 -476 -437 1 -415 -761 -639 -737 -477
1283 -477 -750 -624 -410 -923 -1187 -1007 -613 -889 -859 -801 -890 -1252 -868 -551 -1009 -802 -349 -750 -1040 -785 -768
1304 -768 -861 -943 -520 -497 -646 -551 -623 -373 -349 -345 -391 -298 -110 -224 -237 -122 130 154 -127 32 223 -129 100 194
1328 194 365 276 425 415 158 467 351 541 760 451 576 458 40 540 568 562 607 550 870 529 156 732
1350G32k49L89m7q5k6j66j07m3J78O0l02m96N04k12j41K14L6j59K06k8l25n1J51
1373C3J47j85J66P9l78q4J07J83l04N12k55k22J0J55M8k59L80r5j08j59m34L40
1395c23J12p8O6J16r4j80K52N6j74R4N7j53l0N2j27N3J31J21j41K13n31J64P8
1418b66L5L06k51L8q7l70JM26K9K09l41O3K9l52M08k00L80l39l1J4j50K13J16
1441a20j75M54l87J87l07J90m5P1M82n73K69k62O6K00j99L67j2J32j54r6q4J91
1463A95k9K71j38kj57L9j84J11m3N76l33%L13o89N43L2M8K5j14p4Qk39N52l55
1487C56L10L2k54k29L59l05K86L22l11j42l79l2J90j35L99k18M6l7j74k12K63
1508A35l19O2K94m30J72l31o4M48l09M19k52j50k52j70K07J68k11K92m27J15k73
$$ plain form
1350 732 483 872 825 740 714 548 441 398 576 636 334 -162 342 130 -11 203 239 80 286 258 -67 -118 33
1373 33 180 -5 161 240 -138 -222 -115 68 -236 276 21 -201 -191 -36 12 -247 133 38 -70 -229 -663 -323
1395 -323 -211 -289 -223 -107 -201 -381 -129 -73 -247 -153 -96 -249 -279 -227 -354 -301 -170 -49 -190 23 -508 -344 -266
1418 -266 -231 75 -176 -138 -225 -595 -594 -168 -139 70 -271 -208 -179 -531 -123 -323 57 -282 -313 -299 -449 -236 -120
1441 -120 -295 159 -228 -41 -348 -158 -203 -132 350 -223 46 -216 -150 50 -149 218 206 338 184 88 4 195
1463 195 166 437 299 297 140 179 -5 106 63 639 306 306 619 -70 473 505 553 578 464 390 398 159 711 356
1487 356 666 698 444 215 574 269 555 877 566 424 45 13 203 68 467 249 295 258 84 -128 135
1508 135 -184 -122 172 -258 -86 -417 -481 -33 -342 77 -175 -325 -577 -747 -540 -372 -583 -291 -718 -603 -876
1529h76J85j11q8M27Kj50J08l25J30k8K71K0k16r3j27r2N56j50L60j40k36K48
1551c25j68j5Q1K05K07q0n7K46l04J75K38J9J6j91M08m11J80R6j00L31q6m6J99
1574F18k47n5J65R1K98p6k17L6J9M1J87K5P1j27j94K89j84R2k03L87m38Q7k2q9
1598E54j91j7K42J49n7l05m85J43N8J00L28l18m36L87l29j59l22N45q4j91o2K45
1620b05j54k56K54N4k37k0l48J46LLL83m56J61o7l02K70j47J07J19j77p5P5j68
1643a037L82Oj14L54P2m37M38O4k47L06J52P7k29J69P9m56N19Kj83J8j45O10m12
1666a2K52K47K9J9J94k85PJ5K48Q5k68Q5K69k24l35L85J61j55J36j12l4p0j0J41
1690G68j84J90r4j8lp3K92m17j07J24j08J31k56j31L60r0m39N02k58k60j18L41
$$ plain form
1529 -876 -691 -802 -890 -463 -461 -611 -503 -828 -698 -726 -455 -435 -651 -744 -871 -963 -407 -557 -197 -337 -573 -325
1551 -325 -493 -508 -427 -222 -15 -95 -152 94 -210 -35 203 222 238 47 455 44 224 320 220 551 465 419 618
1574 618 371 316 481 572 870 794 577 613 632 673 860 885 956 829 635 924 740 832 629 1016 578 665 643 554
1598 554 363 346 588 737 680 375 -110 33 91 191 519 201 -235 152 -177 -336 -658 -113 -197 -388 -450 -205
1620 -205 -359 -615 -361 -307 -544 -564 -912 -766 -763 -760 -377 -833 -672 -739 -1041 -771 -918 -811 -692 -869 -944 -869 -1037
1643 -1037 -655 -649 -763 -409 -337 -774 -336 -272 -519 -213 -61 16 -213 -44 35 -421 98 100 -83 -65 -210 400 -12
1666 -12 240 487 516 535 729 444 451 466 714 799 531 616 885 661 326 711 872 717 853 741 707 637 627 768
1690 768 584 774 680 662 659 586 878 461 354 478 370 501 245 114 474 384 -55 447 189 -71 -189 152
1712A52k74N6j50j19K35k37P9K3m5j51j87P4q9n5J65k20Q7j28J06J46l32L18j18
1735f64M7r6K18l48L63p6j78L1m7L64j80l89P38k11L0L00k76J96p1j9K06p9K09
1758F8J82k24k02J93J62j60l8M25l31qL75q5Q2k3k34M6J22K59k62J94K3j76J66
1781E54n7j22OK11j36p2K69j70q4J36r1k28K9M9kJ43k20q5M3M3K24l59r2J25j20
1806fJ43j35j58M42m74K04J54n64K83n4NR2k66K94k46K07P3n67J09L42k50J19
1828b53l3k66J08K06l81M40r9j3k07K25N2l7N7J18j10j28K05j84M5L10j88P1R4
1851C2K36j46k56K88l6k6rO8j72K72kr9K95l92K09j54M7P3P1J89l31J98l76K40
1875B19j4J58k11j51O8L16l18J04n3K39j81J59k73J90j64o9J84J9k63J88l3k48
$$ plain form
1712 152 -122 -66 -216 -335 -100 -337 -258 -235 -280 -431 -618 -544 -633 -688 -523 -743 -656 -784 -678 -532 -864 -546 -664
1735 -664 -617 -713 -495 -843 -480 -556 -734 -703 -750 -386 -566 -955 -217 -428 -398 -98 -374 -178 -249 -268 -62 -141 68
1758 68 250 26 -176 17 179 19 -19 406 75 67 442 357 439 416 182 228 350 609 347 541 564 388 554
1781 554 497 375 381 592 456 384 653 483 399 535 444 216 245 294 292 435 215 130 173 216 440 81 -11 114 -6
1806 -6 137 2 -156 286 -188 16 170 -394 -111 -165 -160 -68 -334 -40 -286 -79 -6 -573 -464 -122 -372 -253
1828 -253 -286 -552 -444 -238 -619 -179 -278 -291 -498 -273 -221 -258 -201 -83 -193 -321 -116 -300 -255 55 -133 -62 32
1851 32 268 122 -134 154 118 92 83 151 -21 251 249 150 445 53 262 108 155 228 299 488 157 355 -21 219
1875 219 205 363 152 1 69 385 67 171 118 357 176 335 62 252 88 19 203 222 -41 147 114 -134
1897a34K56R8j64l80M20l11K57o7k25K73j35p0K61k90N8J31k48L47P1k52J2m1
1919a33j16J73j30n9J76K15q1j68R1oLj03K37P4k26Q2j44R8J67L1j34j36J86j12
1943a5K41j65j21O1k22L29Q6J24k53p7K64k0r7L2lo7k3Q8K8k63L70q0r1j76J67
1968A17k03J91p4K55l09j68J78q0K01k24J7J02l03K07K0j6j62K67l07jK17k39
1990c14k39K52R4K8j70J73J88l37p9K01p9J66j0j12K05J6j48N6J25K4k35r4J50
2013a39k09N37Pk01J92j00l8J2r9J06J24J47o9M6j68p4o4J96J2j09j82L95Q8%
2037D10q7q3Q0j67K21j61K31k69K7k79L80j50J94p5n5J25k68k52M55k26M5K0l5
2060H1Q2l19L3L13l71K06k02n4N9j9N8%N8k02M0L3K04j43l58K3J90j47J48j53
$$ plain form
1897 -134 122 220 56 -324 96 -215 42 -25 -250 23 -112 -182 79 -211 -153 -22 -270 77 148 -104 -92 -133
1919 -133 -249 -76 -206 -265 -89 126 45 -123 -32 -38 -35 -138 99 173 -53 29 -115 -17 150 181 47 -89 97 -15
1943 -15 226 61 -60 1 -221 108 194 318 65 -12 252 232 135 167 164 97 74 162 190 -73 297 217 126 -50 117
1968 117 -86 105 31 286 -23 -191 -13 -93 108 -116 -99 3 -300 -93 -73 -89 -251 16 -291 -292 -75 -314
1990 -314 -553 -301 -207 -179 -349 -176 12 -325 -404 -203 -282 -116 -126 -238 -33 -17 -165 -109 16 40 -195 -289 -139
2013 -139 -348 189 196 -5 187 87 49 61 -38 68 192 339 270 316 148 74 10 206 218 109 -73 322 410 410
2037 410 323 240 320 153 374 213 444 175 202 -77 303 153 347 272 217 342 74 -178 277 51 96 116 81
2060 81 163 -156 -123 190 -181 25 -177 -231 -172 -191 -133 -133 -75 -277 -237 -204 0 -143 -501 -478 -288 -435 -287 -440
2084d40J39J52K1k50L23k85J50J22k89J74J18j09p7O6K41m50K96J4k72J64K35
2105D3k01J41M1l7K56l35K14m4K9j71N94k14k1k67L71p7r8M0p9K5k4J46M1K60
2129F33l93K12j50K60k89o5J94P3k63K00j12k38K43m9j10K83K7L3k85j32P4p1
2151G5L9j56q7K35PR7j34q1k05m0J56j94rK52m55O06j27l11k28M37j66O0K58m17
2175c88J97o1j69J34j76j75N20k71K58j73J53q9k41K78k74J59o7K70q8j48K3L43
2197A5m0mK20m12K3J38J16J73p1J41j83l8n0K69k31M4n6J9L44n6P1n8k99P6L96
2222E47m69J1K05j20K25m39K31J07q0Q1j67J18p0j20K53k93K66k25K18k15n5K38
2244B47j90R0p3j11J96Q8m64K38k08P0Q0L16n27L27l11k4L05l00K45j05j65J34
$$ plain form
2084 -440 -301 -149 -128 -378 -55 -340 -190 -68 -357 -183 -65 -174 -251 -185 56 -394 -98 -84 -356 -192 43
2105 43 -158 -17 24 -13 243 -92 122 78 107 -64 530 316 295 28 399 322 224 264 185 210 186 332 373 633
2129 633 240 452 302 562 273 208 402 475 212 412 300 62 305 256 146 429 456 489 204 72 146 75
2151 75 114 -42 -129 106 113 210 76 -5 -210 -250 -94 -288 -297 -45 -500 106 -21 -332 -560 -123 -289 -229 29 -388
2175 -388 -191 -252 -421 -287 -463 -638 -118 -389 -131 -304 -151 -240 -481 -203 -477 -318 -385 -115 -203 -351 -328 15
2197 15 -25 -29 191 -221 -198 -60 56 229 158 299 116 78 28 297 66 110 54 73 417 361 432 374 75 151 547
2222 547 78 89 294 174 399 -40 191 298 218 299 132 250 180 60 313 20 286 61 279 64 9 247
2244 247 57 147 74 -37 159 247 -217 21 -187 -117 -37 279 -248 79 -232 -256 49 -251 -6 -111 -276 -142
2266a42q2ON9l95J69L43k16j06N05m61P6j30K84j97p2MO3j06N8K53k66M56j37
2289c4m8J27J4K23j18k62L36j56O3Q9p0k4m8k48K32%K40j74k09L39q7O5P1j24
2313A97K33j57J63m24L12k30P9M0j87K81j17k83K93o4o3P9qj44k2J84q0j58n4
2336a30K23k99L20Q4l01k6J54l35K98l4j34Q8r7m6J64r1k5K28l23J2K7Q6O6n8
2360a49j00j63J90L1K40J66n71j09M64j36K80k14j10J62j84L25l99K6L21k42J59
2381a3Q5o1j13J76j13J98m06J65K39k77L8n3K71k10M70m7j73qP7pN1m22M48k47
2405F8J23k3P2J2l53R3K35m7k12K46k08K12M9l77M11l87Q5P6J55o9j83J55J3R5
2429B41q2j75j14O7p9R4j87J12J83k34K44k18J37j72K0J39k90J77o3J9k96N74
$$ plain form
2266 -142 -224 -218 -159 -554 -385 -42 -258 -364 141 -320 -244 -374 -90 -287 -359 -355 -292 -398 -340 -87 -353 103 -34
2289 -34 -82 45 59 282 164 -98 238 82 145 234 164 140 92 -156 76 76 316 142 -67 272 185 250 321 197
2313 197 430 273 436 12 324 94 173 213 26 307 190 -93 200 136 73 152 144 0 -22 162 82 -76 -130
2336 -130 93 -206 114 198 -103 -129 25 -310 -12 -46 -180 -92 -189 -235 -71 -162 -187 41 -282 -270 -243 -157 -91 -149
2360 -149 -249 -412 -222 -191 49 215 -356 -465 -1 -137 143 -71 -181 -19 -203 122 -277 -251 70 -172 -13
2381 -13 72 11 -102 74 -39 159 -247 -82 157 -120 -82 -135 136 -74 396 349 176 168 245 238 289 -133 315 68
2405 68 191 168 240 252 -101 -8 227 180 -32 214 6 218 267 -110 301 -86 -1 75 230 161 -22 133 146 241
2429 241 159 -16 -130 -63 -142 -48 -235 -123 60 -174 70 -148 -11 -183 -163 -24 -314 -137 -200 -181 -477 97
2451I7m80P1K37j52N5J69j35K4J02k26J12r7J26J57j24K53m42P7K32q4N8O9K12
2474C11k72j25J32L84j17k6j49N6j16N8J8L68j81r7O6p4k7Q8q7R1M1oJ50n98J05
2499gRR4om6k32L39j01Q7j27N0j12pkQJ38k46J02Pj22P9J93r7O6n8k09j33L67
2526C4l89K59q1L1q3m9L21k89K09k67J96j30mK3KJ59j50k6J31k9j38K93j22NJ81
2551H7j56J08j08j8k55K43O6J6J19kr1k0j20R0K1J04p6RNn3R2M7R5j51l11M73
2577B14k03J1n1O7K39p2N5L2J74j58j32J00j01j05j35K36l35R0N11k29q0O2j9
2600A71J4k23K11j29j01r8O8J36j53J03j52L4O2J8k64j4O7R2k16K29m7K4K71n7
2624D6j69n17P27l74J28k86K85m5M1J56k40J00k29K98L25l52Q9j54j08K05q0j17
$$ plain form
2451 97 -383 -312 -75 -227 -172 -3 -138 -114 -12 -238 -126 -223 -97 60 -64 189 -253 -176 56 -28 30 99 311
2474 311 39 -86 46 430 313 287 138 194 78 136 154 522 341 244 310 236 209 297 210 301 342 336 486 -112 -7
2499 -7 2 96 90 44 -188 151 50 137 10 60 -52 -59 -61 -53 85 -161 -59 -52 -174 -95 98 1 67 9 -200 -333 34
2526 34 -355 -96 -177 -146 -229 -278 43 -246 -37 -304 -108 -238 -242 -219 -217 -58 -208 -234 -103 -132 -270 23 -99 -94 87
2551 87 -69 39 -69 -87 -342 -99 -33 -17 102 100 9 -11 -131 -41 -20 84 8 17 22 -31 61 108 203 52 -259 214
2577 214 11 22 -29 38 277 205 260 292 466 308 176 276 175 70 -65 171 -164 -74 437 208 128 190 171
2600 171 185 -38 173 44 -57 -155 -87 49 -104 -1 -153 -119 -57 -39 -303 -317 -250 -158 -374 -145 -192 -168 103 46
2624 46 -123 -640 87 -287 -159 -445 -160 -205 -164 -8 -248 -148 -377 -79 246 -106 -17 -171 -279 -74 -154 -271
2646b71M08j92R5O1J32k68p3J05N1J12o7jl1o7j1J28k8q1om3L49j90M7M8j4k57
2672f4KL77j92R3K3M4j60M8k22J21j41M39l52J9l0RM8Q0k07J90q9p9K25k41L4
2697b5p3J74R6j03n2J44k88K08j86j1L6J71q2j64K87k57k40M6K59P4j83J17N0
2720bl10K14L7q7l01N55Rm61R3K0J67L5m29M45q6N9K45m21n0J14n4J05q7j09K35
2745f4l04N02o0k00J43q7j47M32k13p5L50k45R4r1J96k31J64J7k57L4J96K3m21
2768b44K26P2J57j83K71k7k89K51j40K66m72K88k25M0MK01k48J15Q9l37Q5K45
2790A45q6n3j04J42p3J1%l6N0kK7j19j74K32N3k54O0Q5J81o8n1lj53J76Oj53J
2817a60R2j58M1L1K2J57k55K26j20L5J93l94K28J10Q3Q6m88J94r5K26mj40J48
$$ plain form
2646 -271 137 -55 40 101 233 -35 -108 -3 48 160 93 92 61 -6 -17 111 83 2 -4 -47 302 112 159 207 193 -64
2672 -64 -62 315 123 216 239 283 123 171 -51 70 -71 368 16 35 5 14 62 142 -65 125 36 -43 182 -59 -25
2697 -25 -98 76 172 69 17 161 -127 81 -105 -116 -80 91 9 -155 132 -125 -365 -319 -60 14 -169 -52 -2
2720 -2 -312 -98 -61 -148 -449 106 115 -346 -253 -233 -66 -31 -460 -15 -101 -42 203 -218 -268 -154 -208 -103 -190 -299 -64
2745 -64 -368 134 74 -126 17 -70 -217 215 2 -73 277 32 126 35 231 0 164 181 -76 -42 154 177 -244
2768 -244 -18 54 211 28 299 272 -17 234 94 360 -112 176 -49 -9 -5 196 -52 63 152 -185 -100 145
2790 145 59 6 -98 44 -29 -18 -18 -54 -4 -6 21 -98 -272 -40 13 -241 -181 -96 85 17 -34 -37 -190 -14 -8 -161 -160
2817 -160 -68 -226 -185 -154 -132 25 -230 -4 -124 -89 104 -290 -62 48 131 217 -271 -77 -172 54 50 -90 58
2840E8j71K97l29J47k10L08k20Q5QJ93nj35J70l88N7J31N7K32l70Q3J51j78K94
2863B65J6j3j88n3j39J95k04J0J42j52L28l71L12k0m86M65j84j01J86p7P3r3N1
2886c8J11j35K39j17j02m3J9j1r8j48Q7P1J52J66n4j13j06P5M2K16m13J0J67P0
2910D7j79J30mr5k4k27L55p9m6MJ31k1j10N7J90l59J70L14k37qP2J86l17J24n6
2935A8k2q3M93l35j99K93l4Lk7j70jK17k85M92Ok71l6M54m44j70N7R2j16M1K2
2960eL02k67J49j14j32L37m12K7J86m3j81J88%j28K2R3o1j67J36Q6j51O1J72m2
2984E6j03j11QK01k4m6P3m30J06J31J54O5K5l82P7k3J20r6L90l9l88M32l48J95
3008D3l64L89l17K53L9j30L40l85K23j55J1J12K95k66N2J77Q1l20K8l7r7q0L39
$$ plain form
2840 58 -113 184 -145 2 -208 100 -120 -35 -27 166 161 26 196 -192 -135 -4 53 285 -85 -2 149 -29 265
2863 265 281 268 80 27 -112 83 -121 -111 31 -121 207 -164 148 128 -358 107 -77 -178 8 -69 4 -89 -38
2886 -38 73 -62 177 60 -42 -85 -66 -77 -175 -323 -236 -165 -13 153 99 -14 -120 -45 -3 213 -200 -190 -23 47
2910 47 -132 -2 -6 -101 -125 -352 3 -76 -122 -118 13 -8 -118 -61 129 -230 -60 254 17 9 81 267 -50 74 18
2935 18 -4 -87 406 71 -128 165 131 134 107 -63 -64 153 -132 360 366 95 59 513 69 -101 -44 48 -68 -27 -5
2960 -5 297 30 179 65 -67 270 -142 -115 71 28 -153 35 35 -93 -71 22 -39 -206 -70 16 -135 -74 98 56
2984 56 -47 -158 -150 51 27 -19 54 -376 -270 -139 15 80 105 -277 -200 -223 -103 -199 191 152 -236 196 -152 43
3008 43 -321 68 -249 4 43 -87 253 -132 91 -64 -53 59 354 88 140 317 398 78 106 69 -28 -108 231
3031B31n7l0L3q0m2J00k9q0K47k66l6R4J52%l34J43R2r4K9j58L57o2l22M01n64
3056b75J21L40o4o1q5K9L9r0L9J33l46Lj60J85j32J00J14J58j01K60k61M4m6K0
3080c6k83J55L3K44l23k40L82J17j30K12L6n46nM56r7j13K52q7j74L4P3R3j39
3103h6J36j1J23k09K2J86j84j05L01m1K7j38o9K71j90J05J18k01J8J75l37J89
3125A00K90l74K03J14j4k17P2M9k5p6r0j0j6L65m30J07P7k36J81k50m0K62l56
3148c14M62l93M54j62k8k1K7k61k0J12K16j33j29m4K11K28j1k51p7k57K02Q6k12
3171c15L04p2j58K62j30J29l19L23k82K57j04q9K57l96L70j2l33K65N3k43K92
3192E9J05j53k54L7J70N2J8K11k38J47j4k9j24j09K40j88j02L22p3k78J81L45
$$ plain form
3031 231 174 144 177 97 55 155 126 46 293 27 -9 85 237 237 -97 46 138 44 73 -85 272 210 -112 289 -275
3056 -275 -154 186 122 61 -24 5 44 -46 -7 126 -220 -217 -377 -192 -324 -224 -110 48 -53 207 -54 -10 -56 -36
3080 -36 -319 -164 -131 113 -210 -450 -68 49 -81 131 167 -379 -384 72 -25 -138 114 27 -147 -113 -40 53 -86
3103 -86 50 39 162 -47 -25 161 -23 -128 173 132 159 21 -48 223 33 138 256 55 73 248 -89 100
3125 100 390 16 219 333 319 102 174 223 198 122 32 22 6 371 -59 48 125 -111 70 -180 -220 42 -314
3148 -314 148 -245 209 47 19 -2 25 -236 -256 -144 72 -61 -190 -234 -23 205 194 -57 -134 -391 -189 -103 -315
3171 -315 -11 -83 -241 21 -109 20 -299 24 -258 -1 -105 -194 63 -333 37 25 -308 -43 10 -233 59
3192 59 164 11 -243 -206 -36 16 34 245 7 154 140 111 -13 -122 118 -70 -172 150 77 -201 -20 325
3214C25K2m47J01J25J36j50J58k15J64qj10j00m9J06L8p7j07K71n0j8q0J99l13
3237g9j4Q0L32k72j0K49j59r3m1M3L4k10K09l01K06n5k0J79k31j01K61p4o6q1
3261b14K00N5j63O4j38J50J4rk6j4j45J84j86K93l40R1L32m39L34K35j40m70K90
3284d2K15l96P7J07J45k77L2R8n9J15J59l46k94L11K21l2j28J33on0K65j28k68
3307a48K70ok9j4K03l62L0l5R0K2J76k40J57l0L9M0l24L79l44L63j44j41R0k8
3331A4j08J08J73k06j53J33K16k86N0L32l52J32j09j3J09K5j61O0J04l20K67k88
3353b73K01P2K0j90j3K10k44K66j66Q4N6Q2j17j92J62J93j39r7L72k61N8j26K15
3376A73k22J37l3k96J61J08j11MK12P1l0j27J56k23J94k74K11rK35l01k46M49
$$ plain form
3214 325 347 -100 1 126 262 112 270 55 219 211 101 1 -48 58 96 19 -88 183 133 115 35 234 -79
3237 -79 -93 -13 319 47 37 286 127 34 -7 36 70 -140 69 -232 -26 -81 -101 78 -153 -254 7 -67 -133 -214
3261 -214 -14 41 -122 -58 -196 -46 -32 -41 -67 -81 -226 -42 -228 65 -275 -184 148 -291 43 278 138 -332 -42
3284 -42 173 -223 -146 -39 106 -171 -139 -41 -100 15 174 -172 -466 -155 66 34 -94 39 33 -17 248 120 -148
3307 -148 122 116 87 73 276 -86 -56 -91 -1 21 197 -43 114 84 123 163 -161 218 -126 237 93 -48 42 14
3331 14 -94 14 187 -19 -172 -39 177 -109 -59 273 -79 53 -56 -69 40 65 -96 -36 68 -252 15 -273
3353 -273 -72 0 20 -170 -183 27 -217 49 -117 -33 23 105 -12 -204 -42 151 12 -85 287 26 84 -42 173
3376 173 -49 88 55 -241 -80 28 -83 -79 133 204 174 47 203 -20 174 -100 111 102 337 36 -210 239
3398B39j19l07J96M7J43L5k23J50l77J09r6K02l22M64k64P9o4j2L07J5k14J64
3420A52j27j06P2k34O1L82k54MQk4j77L62m48J58J31L8k24N15l61J05o0l09K96
3443d0j65K34j14l7j71J42J80q8K36j91Kj15R4J44k56%J35k26K98j5k09J40K35
3466B13l47L45j14o9n0j64l1J34L96Q7m21J86r5j77K36N7j81k3O4q6N8M4J52j35
3490G9l9j17K14n7J04k41J77k87K92k07n2M62k00j80J05Jj12j56L21k32K91l77
3512b11l6L97m9j78k31M83j90O3j67R7p4k74M40p9l34K74k64L88j68N1o6p1L78
3535A79k17Jk87J28K77o6r0J24k59J19k43J49J34j20R2k4o8R8J03O3op1k45K45
3559A6mn5L73j20k70J53j41N9n7P7m8K28j66N4q9O8p8L13l44J48J71k17o1j4J70
$$ plain form
3398 239 120 -187 9 56 199 234 11 161 -216 -107 -203 -1 -323 141 -123 -44 -108 -120 187 202 -12 152
3420 152 25 -81 -9 -243 -182 200 -54 -50 -42 -66 -243 119 -329 -171 -40 -2 -226 289 -72 33 -27 -336 -40
3443 -40 -205 29 -85 -122 -293 -151 29 -59 177 -14 -12 -127 -33 111 -145 -145 -10 -236 62 47 -162 -22 213
3466 213 -134 211 97 28 -22 -186 -217 -83 313 400 -21 165 70 -107 129 186 5 -18 46 -40 18 62 214 79
3490 79 40 -77 137 80 184 -57 120 -167 125 -82 -134 328 128 -52 53 54 -58 -214 107 -125 166 -211
3512 -211 -247 150 101 -77 -308 175 -15 48 -119 -22 -96 -370 70 -9 -343 -69 -333 55 -113 -62 -128 -199 179
3535 179 -38 -37 -324 -196 81 15 -75 49 -210 -91 -334 -185 -51 -171 -79 -103 -171 -73 30 93 87 16 -229 16
3559 16 12 -43 330 210 -60 93 -48 11 -46 31 -17 211 45 99 10 78 0 313 -31 117 288 71 10 -4 166
3584A66L9k43L0M5j19J12J1LK32l79K40p8q8M61l77o5J27k24n1Q9N9R1n9J00L4
3609A56j84K6n9o7Q2M1KO5N1k58o2j11J04K02j06j28K20n3J37J0k1j18p1J4rn
3635a42K50k78J47n5j32J00J08O5Q2k22m6PJ22m8J41J06k62J93l25J92n1P5J61
3658A88j42n3M8j19L12j00Q6j52M9p9n7P1J8o2L73k63k86K3J7OJ39J22j39J04
3682A04j72J6j75M99j09k00O2K44l24K61k06l0J44j97k1J19j76J87k5j9n1m5K92
3705A78j30j23q0J92j67K40k80Q0p0M3R0K63l62Q3j83J40J19l45J77K75j81K9
3727a2n8O5l1J8q4k4j46K46J13j20L44l03L67k35j1j9q7J9R1L3k13K06n6j24r6
3752a17K13O7j39J56k17M9J23j73K70j52j81O2j26K61o3j4M8M7j4J75J87m31n5
$$ plain form
3584 166 205 -38 -8 37 -82 30 41 44 276 -103 137 59 -29 432 55 -10 117 -107 -158 -69 -10 81 22 122 156
3609 156 -28 -2 -61 -128 -46 -5 -3 62 113 -145 -207 -318 -214 -12 -118 -246 -26 -79 58 68 47 -71 -142 -128 -137 -142
3635 -142 108 -170 -23 -78 -210 -110 -2 63 145 -77 -123 -116 6 -42 99 205 -57 136 -189 3 -48 27 188
3658 188 46 -7 41 -78 234 134 220 68 117 38 -19 52 70 8 381 118 -168 -145 -128 -122 17 139 0 104
3682 104 -68 -52 -227 272 163 -37 25 269 -55 206 0 -30 114 -83 -104 15 -161 26 1 -18 -69 -114 178
3705 178 48 -75 -155 37 -130 110 -170 -90 -160 -117 -27 236 -126 -43 -226 -86 33 -312 -135 140 -41 -12
3727 -12 -70 -5 -36 -18 -102 -126 -272 -26 87 -33 311 8 375 140 129 110 23 42 133 166 -47 159 103 -21 -117
3752 -117 96 163 24 180 -37 12 135 -38 232 80 -101 -39 -165 96 33 19 67 114 100 275 462 31 -24
3775b4k89L23N2R5j74q9K58r0j12O4R2l2ol19M80r8j21p2q9Q7K38j79J71k89M27
3800C04l09q8r9K06O7j67L33m62J56O9jJ05j02l33M04P3j52K16j32j34k55K10
3822i1k0K23l45J67J96j05J01l97J85J89J02l09l1j68K18p0J70Jj37K67l89N94
3844C51k43J22l03O9Q3O3r6j89K82o2K16l62L17J3o59K97K12j96K12K0m21K63
3866a1j07J18l24L75j2J70J62m95J67j79j2K39p0k34J02j47j2K27j14J85j66K47
3888A09k16K09j03j9Q9J23j78K04l06Mj24L52m47K12k3m1m5K95j46q6Q1n2k40
3911c48O62p2k82j20j0K89l6R9j83M0j99p6J51K44k73L40j47j66J02k84L81m01
3933b89L12J17j18K62l83K81m23K54J34p3J74m09K25J91j89j51J14K33k19j53
$$ plain form
3775 -24 -313 10 62 157 -17 -106 152 62 -50 14 106 74 68 -251 229 131 10 -62 -151 -64 174 -5 166 -123 304
3800 304 -5 -93 -192 14 81 -86 247 -215 -59 10 9 114 12 -321 83 156 4 220 88 -46 -301 -91
3822 -91 -111 112 -233 -66 130 25 126 -271 -86 103 205 -104 -135 -303 -85 -155 15 16 -121 146 -243 351
3844 351 108 230 -73 -4 79 142 46 -143 139 77 293 -69 248 261 -398 -101 111 -85 127 147 -274 -11
3866 -11 -118 0 -324 51 39 209 371 -124 43 -136 -148 91 21 -213 -111 -258 -270 -43 -157 28 -138 109
3888 109 -107 102 -1 -20 69 192 14 218 -88 -84 -208 144 -303 -91 -114 -155 -200 95 -51 -137 -56 -108 -348
3911 -348 314 242 -40 -160 -170 119 83 182 -1 39 -160 -236 -85 159 -114 226 79 -87 15 -269 112 -289
3933 -289 23 140 22 284 -99 182 -241 13 147 74 248 -161 64 255 66 -85 29 262 43 -110
3953a10J16l27K45K35k99J52Q9J74k12j60o9J27j29L94k12m4K51Nk15m6K2o4K30
3976A53j87r3J12k12P7K00L3k19J5J54L01m92m5K8J21J00j87J64k52J89L7p6l02
3999c81N04j56k21L26r3N1j64R6P8Nj69J06M0J41k60R0J2j60K18L4l12K47K6j43
4023h5K16j28J51k29J43n7J30J85O8k16k53j14M87k99J34jj94L35q7K29l95q3
4045f3M8K27l10KJ20J72j85l23L51J4k2J11m48K27q2K16j73j81N29j95j02J26
4067E9j34K37l81O35l37l07O0PK58k33P0J35j05l8j5N8j21R8M1j61L36r7j01J79
4091A43j6J72k60k07M24j57j60L60l52o4J82p0O0j43M92k06m09K92L31k50k58
4112i6J53k45Q1L44P0j66k41J45M0r9j83K29M1P3N4j39J00r6k32L27p1m9J10o2
$$ plain form
3953 -110 6 -321 -76 159 -140 12 101 275 63 -97 -166 -39 -168 226 14 -30 221 226 11 -35 -13 -77 153
3976 153 -34 -127 -15 -227 -150 50 83 -136 -121 33 334 -158 -203 -175 -54 46 -141 23 -229 -40 -3 -79 -381
3999 -381 123 -33 -254 72 -21 30 -134 -38 40 45 -124 -18 22 163 -97 -7 5 -155 63 97 -215 32 58 -85
4023 -85 131 3 154 -75 68 11 141 326 394 178 -75 -189 298 -1 133 132 -62 273 186 415 20 -63
4045 -63 -15 212 -98 -96 24 196 11 -312 39 53 31 142 -306 -79 -161 55 -118 -299 230 35 -67 59
4067 59 -75 162 -219 416 79 -228 -168 -161 97 -136 -66 69 -36 -74 -89 -31 -152 -54 -13 -174 162 65 -36 143
4091 143 127 299 39 -168 256 99 -61 299 -53 -117 65 -5 55 -88 404 198 -211 81 412 162 -96
4112 -96 57 -188 -107 237 307 141 -100 45 85 -14 -197 32 73 146 200 61 161 65 -167 160 89 40 150 88
4136H8q7L7N5j97J38J26k41K11k4k9l10K46lj74K46k56n2oK72k22R0r9K20K2p1
4161b0nj92J42j39j11K11K3K17k8k1L7n1J42k69p1k8N3KK54k43J77J63mk55N3
4186C7J39l72M0J37M0n1j93K30O2j86J24L3J30j37o2q4q4J45J91n9j25O3J10J21
4210B49m07K78j17K78j21o5n1M4Kp1jj6O7j39K77p5l22K20L8k8j49j29L39o1k8
4235A2r1J8j02M1J28O5n8m6j14q6K05MJ79k15J44k37J60L4l86K02J75p5PJ59L8
4260A61k50L6q2l7Q7j8L1R4K8q5k3L21l47n4J19k3K98n23K14lP3l3L4j9j32N6
4286g7N3J5q4q7K51j28R2k7J96j34o8j53l9N93l43J32j05j03K60j42J85l48J21
4309F0j92L80j07J44m34N2J40r7L55k59K38j63l17J49R7K3r7j50k22K83K53j65
$$ plain form
4136 88 1 38 93 -104 34 160 -81 130 106 77 -233 13 10 -164 82 -174 -226 -232 40 -182 -92 -191 29 51 -20
4161 -20 -25 -217 -75 -214 -325 -114 -91 126 98 77 114 63 205 -64 -135 -163 -110 -108 146 -97 80 243 239 -16 37
4186 37 176 -196 -156 -19 21 -30 -223 7 69 -117 7 40 170 33 -29 -113 -197 -52 139 80 -45 18 128 249
4210 249 -158 120 3 281 160 95 44 88 90 19 18 2 69 -70 207 132 -190 30 68 40 -109 -238 101 40 12
4235 12 -79 -61 -163 -122 6 71 13 -33 -147 -233 -28 -24 155 -60 84 -153 7 41 -345 -143 32 -43 -36 123 161
4260 161 -89 -53 -135 -172 -85 -103 -72 22 50 -35 -58 263 -84 -138 -19 -42 256 -267 -53 -56 17 -16 18 -1 -133 -77
4286 -77 -24 -9 -93 -180 71 -57 35 8 204 70 2 -151 -190 403 60 192 87 -16 244 102 287 -61 60
4309 60 -132 248 141 285 -149 -97 43 -54 301 42 280 117 -200 -51 46 69 -28 -178 -400 -117 136 -29
4331b9n6P4K18j19m00L42l5Q4o5ON6R3q3o8q9K73l30O4n2L5qO0l2j16L21m14K84
4358A4N0r6p6M03l14L5O9k12K56k23L6L2j5P3M9j15r1R2L5k5O7J31j29m4j38J95
4384E9j7l1k76L08k03J85o5M7n1n9J85k10J68L66l93j01J36p7P9j58K9O0P2N0
4408A03K11l48J9J31m7K00r6n05K97j57J37m5J8o8K08r1J08n5N5J3l48L26M7l77
4432b64K04J19j43J33k25M9O9J87k44N6J56m7rJ90l22J27j56j66M50m7Kj96R0
4455A3k99O6K67J31m3j16Q0j35r9K32r2o6Np5L4J10J93j98j36J0K49k46K9J19
4479C3q6J38j14N1j05J26j67J00R6K96m79K11j75R6P6K07j93n0k34JJ91Pj50J43
4503A9j21J86n0O8q3j02M36k92J83k61O5m3p4m1J89J01l20PK38j95K12j54j48
$$ plain form
4331 -29 -85 -11 207 88 -312 30 -5 79 14 20 76 169 86 18 -71 202 -128 -64 -116 -81 -89 -29 -61 -177 144 -270 14
4358 14 64 -32 -108 295 -19 16 85 -127 129 -94 -58 -26 -41 32 81 -34 -125 -33 2 -23 44 175 46 2 -136 59
4384 59 42 11 -265 43 -160 25 -40 7 -44 -103 82 -128 40 406 13 -88 48 -29 50 -108 -79 -19 53 103
4408 103 314 -34 -15 116 69 269 173 -332 -35 -192 -55 -100 -82 -150 58 -33 75 20 75 88 -260 66 113 -264
4432 -264 -60 59 -84 49 -176 -127 -58 129 -115 -59 97 50 41 231 -91 36 -120 -286 164 117 119 -77 13
4455 13 -286 -220 47 178 135 19 99 -36 -135 97 5 -61 -56 -131 -97 13 206 8 -128 -118 131 -115 -86 33
4479 33 -53 85 -29 22 -83 43 -124 -24 72 368 -111 100 -75 21 97 304 111 61 -173 -172 19 26 -124 19
4503 19 -102 84 34 102 19 -83 353 61 244 -17 48 5 -69 -110 79 180 -140 -133 105 -90 122 -32 -180
4526a80K09j94L68o16O58l07K29K9m55K51k57L12P8q0r0K01j65j25N4j17n2J21
4548a28J61j13L26l38m2qK70l08L06j52J61p9O4j71N0J19j72j5L42k75O3J42j43
4571F0R7Kj18j9n5j44J27M0K8o0L97k96r1J26j12k7P9j78L28oj1j14J7j1j91K33
4597A01R1qj77QK08k50Q5k78J56r6K58l07K61l2Ol5M6j93J04j47M5k9j23J82j9
4622a43J33j7j2p5j50R7K15L1k42j1J92R9k16L77k96P1n1J36nl13J66J95k82K91
4646A90j87pJ35k21J55K3K1k43K08j71J81k6J00m4p1K8K3o5m8m8J87J40r8J98
4670C60k47l08N57k53k64rM20j63j79O5j32P8K61k7k97K72k7r9q5P6K3n9J88k00
4694d9K38m01K47o7j05K0k1R8L3R5k50l0r8M4N02l33n9K06K1j89nm6M4L0J1J25
$$ plain form
4526 -180 29 -165 203 -413 245 -62 167 196 -259 -8 -265 47 125 45 -45 156 -9 -134 -80 -197 -249 -128
4548 -128 33 -80 246 -92 -134 -142 128 -180 126 -26 135 56 120 -51 -1 118 -54 -69 273 -2 61 203 60
4571 60 157 159 41 22 -33 -177 -50 -10 18 -42 355 59 -32 94 -18 -45 34 -144 184 178 167 53 70 59 -132 101
4597 101 192 184 7 15 223 -27 58 -220 -64 -160 98 -209 52 20 26 -9 37 -156 -52 -199 -154 -183 -306 -124 -143
4622 -143 -10 -27 -39 -114 -264 -167 48 79 -163 -174 18 117 -99 278 -18 53 2 138 133 -180 -14 181 -101 190
4646 190 3 -4 131 -90 65 88 109 -134 74 -97 84 58 158 114 43 71 94 29 -19 -67 120 260 162 360
4670 360 113 -195 362 109 -155 -164 256 93 -86 -21 -153 -75 186 159 -138 134 107 8 -77 -1 22 -37 151 -49
4694 -49 189 -212 35 -32 -137 -117 -138 -40 -7 88 -162 -192 -290 -246 256 -77 -136 70 91 -98 -103 -149 -105 -75 -64 61
4720F1J31k33k5pO5J30j56N9o9P1j58K5k7J16j10R3K77n80K48J00J4J25J4r2J22
4745A94k35K89j25Q7o1r1m0j34O19p64J31O1O5j95O4K06J11j47K0J13j60j14O3
4768d3L5m8J49l10J94J65Jk89K73q8J96N9m04R4J16j5L1K7k35Q1n9j4ql7m2J56
4794a5J46j39K00k04l53L72l2m7J34LM8m26L76j12j32K21K66l76O6n4O6Q9Q6q5
4818I8j44K38j45L0O6q1J92j36q9P1p4N1j40p7L94k25k95M07j59j88l6J89lJ81
4842A25j26q2J35o4K70k27J06l64L21J4j08R9k48J83k06J58k6J42n1K02j79j02
4864b8P6l21K87J0j05J55q7ll1K12Mk47J42On5k98O1K58K34m19L51l64K65j21
4888a8p3P6rR2q6p4Q8n6J5P4r3L8k4j42J32oJ40J37j52k48J87j14M17k38o4j47
$$ plain form
4720 61 192 -41 -66 -73 -8 122 -34 25 -44 27 -131 -106 -133 -17 -127 -34 243 -337 -89 11 25 150 164 72 194
4745 194 -41 248 123 210 149 58 18 -116 503 -261 -130 -69 -4 -199 -135 71 182 35 55 168 8 -106 -43
4768 -43 -8 -56 93 -217 -23 142 143 -146 127 39 235 294 -110 -16 100 85 116 143 -92 -11 -70 -84 -92 -129 -171 -15
4794 -15 131 -8 192 -12 -365 7 -25 -72 62 65 113 -313 63 -49 -181 40 306 -70 -4 -58 8 97 183 98
4818 98 -46 192 47 77 143 62 254 118 29 100 26 77 -63 -140 254 29 -266 141 -18 -206 -242 -53 -56 125
4842 125 -1 -83 52 -12 258 31 137 -227 94 108 0 99 -149 34 -172 -14 -40 102 51 253 74 -28
4864 -28 48 -273 14 24 -81 74 -13 -16 -47 165 169 -78 64 70 15 -283 -222 36 270 -149 202 -162 103 -18
4888 -18 -91 -15 -24 68 -18 -92 -4 -60 -45 29 -64 -26 -50 -192 -60 -66 74 211 59 -189 -2 -116 301 63 -1 -148
4914a48J81O5j54o9M97l94J26k12L22l40L4j32K92j64k7j27J18Q8l25L40n5O8
4936a6N7J69j68J11j67j09J02J1l5J15j25K76J8j63l47L14j39R5q1J06J04l3p2
4959B3j82l7K14nM7j36j4J35J54m5m10J75J98j38n6L9J53J00l75j91L93Kk65J57
4983f4mj5jk94N22j9l48K60q8j43K62q2n1j77L00o0o7m4Q1j09L86k87l8K7l2O9
5009a6j54J22l01L89N9j96N0K24j47N6M9j53P0mq6L69j68l74J74o4K69p5j54J45
5033H4r1J42k19O7QL11l00K24l97J33j06jJ05J51J09j44Q8j67O7J38k63J89j19
5056Ij90J37n6K89k16l6J22j54K51r8Jr7o0P5J95M5l69p3l9K31J03n2j58Q8J48
5081I6J33n47M83o13O31k63J53p8k3j52K23k7k42K69K5J18rMk05J71j11K1o6k
$$ plain form
4914 -148 33 98 -56 -125 372 -22 104 -108 214 -126 -92 -224 68 -96 -123 -250 -132 -44 -369 -29 -84 -16
4936 -16 41 210 42 153 -14 -123 -21 -10 -45 70 -55 221 239 76 -271 43 -96 -1 -82 24 128 95 23
4959 23 -159 -196 18 13 60 -76 -90 45 199 154 -256 -81 117 -21 -77 -38 115 215 -160 -351 42 44 -221 -64
4983 -64 -68 -83 -84 -378 144 125 -223 37 -51 -194 68 -14 -65 -242 58 -2 -69 -113 -32 -141 245 -42 -80 -53 -85 -16
5009 -16 -170 -48 -349 40 99 -97 -47 177 30 86 135 -18 52 48 -38 331 163 -211 -37 -101 168 93 -61 84
5033 84 -7 135 -84 -17 -9 302 2 226 -171 -38 -144 -145 -40 111 220 76 164 -3 64 202 -61 128 9
5056 9 -181 -44 -100 189 -27 -63 59 -95 156 58 59 -38 -98 -23 172 217 -152 -225 -264 -33 70 18 -140 -52 96
5081 96 229 -318 165 -448 183 -80 73 -5 -28 -180 43 16 -226 43 68 186 177 181 -24 147 36 57 -9 -11
5105a1J24M22m37j10J05J55l91L85k94L80l21l2Q6M5n4o9K02k66L3LK75p4m9j27
5129b0j03K80j72Qk4j68Q7J89K68k49k23L78l5q1j07N4k04q4L9l7o8L69K2j44
5153b5K5LJ15k53L9J81o9k32J43Q6n0K15k25O7r2J96j85J9j04J85r2K3M2M7J6
5178G5r3J1j62L05k7K7l68R8L5p9K37r5J37j8j18j77L52L4j51qK1r3q1M11K3m70
5204a74L22l2j07J4o3J06K42n17L92j35j67L19j28j23J76J14O2j54j02q0J99k62
5226i8M5J5j65O6M5L82m14JJ11q6n1L74l29Mj26K03j59L33j56O2L4j79j14J76
5250b6j6j30J49k2K70m55M83l84J79j42O7M0j55R5j00J68p3Nj82K04N6j81J91
5273D1m9k24N16m60K33j60J68P6R3l02L3J82%k28J24J21l6k42O1OJ85k04Q2j03
$$ plain form
5105 -11 113 535 98 -12 93 248 -143 242 -52 328 7 -25 61 106 52 -17 185 -81 -48 -45 230 156 107 -20
5129 -20 -123 157 -15 -7 -31 -199 -112 77 345 96 -127 251 216 135 28 82 -122 -206 -167 -204 -272 97 119 -25
5153 -25 0 3 118 -135 -96 85 16 -216 -73 13 -37 178 -47 20 -72 124 -61 -42 -146 39 -53 -30 12 59 75
5178 75 -18 -7 -169 136 109 136 -232 -134 -99 -178 59 -36 101 83 -35 -212 140 174 23 15 36 -57 -138 273 296 -174
5204 -174 148 116 9 23 -40 66 308 -209 183 48 -119 200 72 -51 125 239 301 147 45 -35 164 -98
5226 -98 -53 -38 -203 -137 -92 290 -124 -123 -12 -98 -149 225 -104 -100 -226 -23 -182 151 -5 57 91 -88 -202 -26
5250 -26 -42 -172 -23 -45 225 -230 253 -131 48 -94 -27 13 -142 -47 -147 21 -52 -47 -229 -25 31 -150 41
5273 41 -8 -232 284 -176 57 -103 65 141 234 -68 -35 147 147 -81 43 164 128 -114 -53 -47 138 -66 16 -87
5297h7j31M61l52K91j38j46J43M7rj76j04N9J85j8j23K27q0J62N4j69j01q0J26
5320D1p1k0J47r1K81m64j30K56p5r4J51K34k01j72K1J81K4k80J30J30N0o5Q8l07
5344b36K13j76N83l67k76J72k7J34L1L4j84O7O0j10J18N3q1j24j38J25J94k5p2
5367c2j3L54l30k24L70n3p9k32L36n9k3J12k44J2K62L9j62k58J49M87n30Q7j4
5390d5K98k16J8J2j23J61j63j01R6k1k8K3J62l19K41j80K11P6q6Q0j26k02K43
5413A1O9j27k3J31lk38K15m2K0J4k97J62o5J79nj80L87j89o9J70l11Q5K29J67
5437B90j75k22p4J08P1Q0L3j5M7K4%k83P2j06J84j66L30j81k38J17nK10p8m5j93
5462b15J37J88q5k02j5J56J01r1n9L10m95N01k83K71k10K59j90J28k53k4%K14
$$ plain form
5297 -87 -218 243 -109 182 44 -102 41 88 79 -97 -201 -142 43 25 -98 129 49 211 265 96 -5 -85 41
5320 41 -30 -50 97 6 287 -177 -307 -51 -126 -220 -69 165 -36 -208 -187 -6 18 -262 -132 -2 48 -17 71 -236
5344 -236 -23 -199 384 17 -259 -87 -114 20 51 85 -99 -32 28 -82 36 89 8 -116 -254 -129 65 40 -32
5367 -32 -45 309 -21 -245 125 72 -7 -239 97 38 15 127 -117 -105 157 196 34 -224 -75 412 -118 -31 -45
5390 -45 253 37 55 67 -56 105 -58 -159 -63 -84 -112 -89 73 -246 -5 -185 26 102 16 96 -30 -232 11
5413 11 80 -47 -70 61 58 -180 35 -7 13 27 -270 -108 -173 6 1 -179 208 19 -50 120 -191 -106 123 290
5437 290 115 -107 -181 -73 -2 78 111 96 143 167 167 -116 -44 -150 34 -132 198 17 -221 -104 -109 101 23 -22 -215
5462 -215 -78 110 25 -177 -192 -36 65 -26 -85 225 -270 231 -52 219 9 268 78 206 -47 -71 -71 143
5484A43j17j50K29k01J42j49M41m07Q9mp8l41N53m5M6k4j31K1K74m11p6n2l3N09
5508B28l92O9j50J55N4j00L68j64J18l1o6m2J9p2J65j24J61j74k46K15j9k0k00
5531b48J40R6l0Q7j09l3k00M00j97R9n1p6q8K88j96L56k88R3R3P2l29J66Lk46
5555a98Q3j14Q4J29j09J8M76l86K55o0l38J73P0j43J69j00J16q1j07o5r1L34k30
5578a15K01J09k38j58J2L03j59K45m47J76O0O3J39j73k2j7j28J24K30p2m5l05
5600b17L91l67P0k00J54qJ96J0P2R9J61l05J63k25j09J79l9j39q4K10o4P1j42
5623a23J69J84k68L2j21J39j29J73j03j94L97N2k01J04l6k25J42K03l1k6J80k24
5645I4J36k40p3L39k76j37J62K3o0K80Km31M89k64m8O6R0j89j3%K94l74O4M03
$$ plain form
5484 143 26 -124 105 -96 46 -103 338 -69 20 16 -62 -403 150 105 151 127 -4 17 291 -120 -196 -248 -281 228
5508 228 -164 -95 -245 -90 -36 -136 232 68 186 155 89 47 66 -6 159 35 196 22 -224 -9 -28 -48 -248
5531 -248 -108 -12 -42 45 -64 -97 -297 103 -94 5 -46 -122 -210 78 -118 238 -50 43 136 208 -121 45 48 -198
5555 -198 -115 -229 -145 -16 -125 -107 369 -17 238 178 -160 13 83 -60 109 9 125 44 -63 -128 -219 115 -115
5578 -115 86 195 -43 -201 -189 114 -45 200 -247 -71 -11 52 191 18 -4 -21 -149 -25 205 133 88 -217
5600 -217 174 -193 -123 -323 -169 -177 19 29 101 200 361 56 219 -6 -115 64 25 -114 -198 12 -52 19 -123
5623 -123 46 230 -38 -6 -127 12 -117 56 -47 -241 156 208 7 111 75 -150 -8 195 164 138 318 94
5645 94 230 -10 -83 256 -20 -157 5 28 -32 248 250 -181 308 44 -4 62 152 -37 -50 -50 244 -130 -66 337
5669C37k59o9J48l87J74M2j12J0J91j52P9jJ69L7j77m4r7J54j9P6l28J14j84K46
5693e2K32j96k26L72k81J38M7m08O2L13j15o4O9r9K66j52J00l3lk42K83k5l8N0
5717bo8J85k09J62Q8R9j17j06p0K64l86M64j07r2k42J02O3L90l94j72K87j62j28
5740a51j5M59m03o8J39Q7j74K14J86j94J13k02N0j0j34J17q6K64l36L21k97R5
5762b5K16n5k6q5j18l3L12k99J64J37q1j78J63L2k6j85J25rp9K5J6J99m53J98
5786f5K06k47q4J68m4Q6J11l63K35p4K86j33j76J8J23J4N3j15k95N01j47k16N11
5809C53l17k73L59j24L11k25J01k82J04J28l9k69K31M6K38l10kN7n6r0L03k72
5831b8R1J61m16J73o6J23P6k1R5j03L6l1J33m00K51J86k30J37k85L87j62k65k9
$$ plain form
5669 337 78 9 157 -230 -56 -14 -126 -116 75 -77 2 1 170 207 30 -14 -111 43 24 100 -228 -114 -298 -52
5693 -52 180 -16 -242 130 -151 -13 34 -374 -312 1 -114 -178 -109 -208 58 -94 6 -27 -30 -272 11 -14 -52 -2
5717 -2 -70 115 -94 68 156 255 138 32 -38 226 -160 304 197 105 -137 -35 28 418 24 -148 139 -23 -151
5740 -151 -166 293 -110 -178 -39 48 -126 88 274 80 193 -9 41 31 -103 14 -72 192 -144 177 -120 -25
5762 -25 191 136 110 25 -93 -126 186 -113 51 188 107 -71 92 124 98 -87 38 29 -50 -25 -9 190 -263 -65
5786 -65 141 -106 -190 -22 -66 20 131 -232 3 -71 215 82 -94 -76 47 61 114 -1 -296 205 58 -158 353
5809 353 36 -237 122 -2 309 84 185 -97 7 135 96 -173 58 104 342 32 30 87 31 -59 244 -28
5831 -28 63 224 -192 -19 -85 38 114 93 188 85 121 90 223 -177 74 260 30 167 -118 269 107 -158 -187
5854a87K83M4l95J76O8K09l24J1J51K33l75j0j25K24K06j89J4Q9j10J64j08k65
5876b16K93j49P5k88Q5L96k81k04M16n9k02j61K58J7Q7r9L69k17j27j67%L17m90
5899c47N03Lj40J49j25r9Q0M6J02k49R7j21J62k9Jl12K85j2j0K24m6k62K29k40
5923a11M16k96m2J4R6Q5j46J24j95k7j4M2QM2K07j97J9J82r0j02N9n4K6r3l1J00
5949B2J1q2L79k27j22m2r2Q7J54j82Q6O9j08l6o7j6K27%j41n6o2K88mj93J59K48
5975C00n27L05k33O5OQ8N6mR3o6o7k69R2J2J21L04l86J37oJ52j38M7O3J6k32J63
6001I2j31J88P6m0r9j61L04k63j27K77j16j4J1j04L03J44l75MpL18m68K41k10
6024a57L75k10k9P5J20k04j79J67J47k23K20j5j34j03j81L70l8j04J2K2k6j82
$$ plain form
5854 -187 96 140 -255 -79 -11 198 -126 -115 36 269 -106 -116 -241 -17 189 0 14 103 -7 157 49 -216
5876 -216 77 -72 3 -285 -200 196 -85 -289 127 68 -134 -295 -37 -20 67 -32 337 120 -7 -174 -174 143 -347
5899 -347 156 159 19 168 43 -56 24 70 172 -77 20 -101 61 32 33 -279 6 -6 -16 208 162 -100 129 -111
5923 -111 305 9 -33 -19 77 162 16 140 -55 -82 -96 -54 -46 -4 203 6 25 207 117 15 74 20 46 -47 -78 22
5949 22 33 -49 330 103 -19 -61 -153 -66 88 -94 -8 61 -47 -83 -150 -166 61 61 -80 -136 -198 90 86 -107 52 300
5975 300 -227 78 -155 -90 -84 4 60 56 149 83 16 -253 -161 -149 -28 276 -110 27 21 173 35 82 145 161 -71 92
6001 92 -39 149 225 185 86 -75 229 -34 -161 116 0 -14 -3 -107 196 340 -35 -31 -38 280 -188 53 -157
6024 -157 218 8 -21 54 174 -30 -209 -42 105 -118 102 87 -47 -150 -331 39 1 -103 -91 -69 -95 -277
6046b77K82K1J55J1j34k67j46M00k1l60L70J77j17j60p7J17K3l6K23l7j86l5o9
6069a43J11J2l24O30j48R4j90k1m38M32J04j86r7j23M72j83j4j43K26j34q8J56
6091Ek3o3J34p6j79K91j55K43r7K6k5J74O4j15l92L2K98j21J98k0l72L05j55J12
6115H9j21j92J64k58M55j66m8L3j39K1J45J06lN3q7j85J10K37j96j4l6o5j15K42
6139C0J81j49p7k7J75j02n2lL1J3J70l38P5J8L36m57R0K20l12N00l93J56m06M21
6163A00j68%jJ14j60J06J5j08j1J95R5k87Q6j55N5q3K45O7K6J4m16L22P0n8J88
6188B51j32j27j1J32k12R4L7J08M7r3j66m0K65m72J80K41j02M53l65j11j02p5
6210b00L83k66K43k52M8J5j06O0M77m61L48k73nj01l9J79K4j33J68N4k59k28L72
$$ plain form
6046 -277 5 26 181 192 58 -209 -355 45 24 -336 34 211 94 -66 -143 -26 -3 -39 184 147 -39 -74 -143
6069 -143 -32 -20 -344 286 138 232 42 21 -417 15 119 -67 -164 -287 185 2 -12 -155 71 -63 -151 5
6091 5 -18 -81 53 -23 -202 89 -66 177 80 106 81 255 319 204 -188 -156 142 21 219 199 -173 132 -23 89
6115 89 -32 -224 -60 -318 137 -29 -77 -44 -183 -162 -17 89 86 139 52 -133 -23 214 18 4 -32 -97 -212 30
6139 30 211 62 -15 -42 133 31 -21 -24 7 20 190 -148 -73 -55 281 -176 -86 134 -178 322 -71 85 -321 100
6163 100 -68 -68 -69 45 -115 -9 6 -102 -113 82 177 -110 -24 -179 -124 -207 38 105 131 145 -271 51 121 63 251
6188 251 119 -8 -19 113 -99 -5 32 140 187 94 -72 -112 153 -319 -139 102 0 453 88 -23 -125 -200
6210 -200 183 -83 160 -92 -44 -29 -135 -75 402 -59 289 16 11 -90 -129 50 74 -59 109 163 -96 -324 48
6233D8Q5N1k37N3J85m39M01l92L39J72k85r0O9m7J63l17J56n6m0J53r1K07J40
6256B28J38l73Q4j32L7J93l97J8K02o0r2kj25M91k33rM4J14k61K50l36J44J78
6279A01l11K19j17J48J6p3K02j94N4r8M01j1j59q3m7k57J27J00K20l2k19JK06
6302A94l38J17l4L7J41l84M45k94oP4J55j38j78L36j87Qk4j89K57j05%J88j21
6325d6J11j20j29J77j49l3L52j21j22j94O3J71j09J73J55m12J31K93k03J27j6
6346I9nj98J76r4J39l9k72oK31J8k26Q0J79j86Q1k2K52k75j40J92k88K70j00O1
6370g3M3K30k47J86l09K48J1r6J84l97K63L61m01m9J09M3j24J37L4mJ23k07m2
6393B3L0r9m6J64J4j49K30j98nO4j86K81r9j3Pl31L45K27j74O2k45j24J59J46
$$ plain form
6233 48 133 184 -53 0 185 -254 147 -245 94 266 -19 -109 -40 -87 76 -241 -85 -141 -181 -28 -119 88 228
6256 228 366 -7 77 -55 -18 175 -222 -204 -2 -62 -154 -156 -281 210 -23 -32 12 126 -135 115 -221 -77 101
6279 101 -210 9 -108 40 56 -17 185 -9 45 -53 348 337 178 95 48 -209 -82 18 238 206 -13 -12 194
6302 194 -144 -27 -61 -24 117 -267 178 -116 -122 -48 107 -31 -209 127 -60 -52 -76 -265 -8 -113 -113 75 -46
6325 -46 65 -55 -184 -7 -156 -189 163 42 -80 -274 -211 -40 -149 24 179 -233 -102 191 -12 115 99
6346 99 94 -104 72 -22 117 78 -194 -200 31 49 -177 -97 82 -104 -23 -45 207 -68 -208 -16 -304 -34 -134 -73
6370 -73 -30 200 -47 139 -170 78 89 -7 177 -220 43 404 3 -46 63 106 -18 119 153 149 272 65 23
6393 23 53 -46 -92 72 86 -63 167 -31 -36 28 -158 123 24 11 18 -313 32 259 85 147 -98 -222 -63 83
6417H3q7n4J21j8p1j00K97j04J1j58L01l01r5l4J89J98l04Q8L5M4j46J77L0j98
6441i6P9L12k78l21K02L3K43m94M55l2K07m32r4N2L8K44o5J53j47L8j67J94m92
6464c68L54K72k38r4J49j26M6l9J23J00k70K62j49j05L9q1J09J33l20J78N1Q5
6486A11p2K55O1o07L57k08L93m6m39J48J89k78J67P3l4j03R0n2M8J18m44L90j43
6509b6L9lj53K80q6p0n6R1m2K4J47k5j14r6j42J55j59K88N3k11J07l34L60N3k35
6534a55J64m4O6j72Q5j11K50l00L97m1j88l8J15N1M4J93k65j52K89p8J60m28L2
6557a26M5nK5j22L27j40j64Q6L22l04K53l34K47m1R0O8m44K57p5J59p5l17O36
6580C68j77j11J22j99j30j5q3K21J17j62L68n26k0m2NO5K58k69M9M24l73j41K92
$$ plain form
6417 83 -4 -58 63 45 -26 -126 171 67 78 -80 221 -80 -175 -209 -20 178 -126 -38 -3 41 -105 72 102 -96
6441 -96 -17 295 17 -304 -102 -69 174 -320 135 103 310 -122 -216 -164 -126 118 53 206 59 97 -70 124 -368
6464 -368 -14 258 20 -74 75 -51 -5 -44 79 179 -91 171 22 -83 -44 -125 -16 117 -203 -25 26 111
6486 111 39 294 355 -252 105 -103 290 244 -195 -47 142 -136 31 104 70 -33 57 5 53 171 -273 117 -26
6509 -26 13 10 -143 137 51 -19 -75 16 -26 -2 145 120 6 -90 -232 -77 -236 52 105 -106 1 -333 27 80 -155
6534 -155 9 -35 31 -141 -56 -167 83 -217 180 139 -49 -87 28 79 123 316 51 -101 188 110 270 -158 -126
6557 -126 -81 -86 -61 -183 144 4 -160 -74 248 -56 197 -137 110 69 159 227 -217 40 -35 124 49 -268 368
6580 368 191 80 202 3 -127 -142 -225 -4 113 -49 319 -207 -227 -269 -264 -199 59 -210 -161 263 -110 -251 41
6603D1p7K70m23k4J99k5q7J51L6R7k93K06K2K2j7r9r3l5J5J62J51j30J0J94n50
6628b77K11j70Q9J51k45L58j92J69j30M4O3j81Q5L30m20R7j7j7q5K94k99K08R8
6651A64j77M4J64j6l71K51p5J91p6k90K40l49L27R8m8o4o7J99l8l4j50J1J91j49
6675b4k38L57Qj69j35L23l12K28M9k08L96n36K54r6Q9j01n9L0Q0k47L04L12k3
6698B82k71R7l64J53L04j04p0Or2P0K17k35J21Q3j66l34K59J64j03j31P9L1J16
6721A12k85J9J35J6m6Q1k31L76m7J9Q9R1j88Qk04J22j56J86j45J9p1N2K07J47
6745C06l68J32J00o4N6k46k93L57m43M13M03l23n1M2j89k14M45L9j5j64K22l91
6767b46K02K5j26J69J6J8M1n6o4r4K39j24k38J4L25J21j0l97L01k84J78J28l35
$$ plain form
6603 41 -36 234 -189 -213 -14 -39 -126 25 61 158 -135 71 93 115 98 -1 -94 -129 -114 48 199 69 79 273 -277
6628 -277 -66 -236 -147 4 -241 117 -75 94 -36 8 71 -110 -25 305 -115 -18 -35 -52 -137 157 -142 66 164
6651 164 -13 31 195 179 -192 59 -16 175 99 -191 49 -300 27 125 77 13 -54 145 107 73 -77 -66 125 -24
6675 -24 -262 95 103 -66 -201 122 -190 38 87 -121 275 -261 -7 -103 -14 -115 -174 -144 -64 -311 -7 305 282
6698 282 11 108 -256 -103 201 97 27 33 -59 11 228 -7 114 197 31 -303 -44 120 17 -114 -35 -4 112
6721 112 -173 -154 -19 -3 -49 32 -199 177 130 149 238 329 141 149 -55 67 -89 97 -48 -29 -100 -48 159 306
6745 306 -62 70 170 106 162 -84 -377 -20 -463 -50 353 30 -21 21 -168 -382 63 102 87 -77 145 -246
6767 -246 -44 -19 -145 24 40 58 99 43 -21 -115 124 0 -238 -224 101 222 212 -185 116 -168 10 138 -197
6790a97K62j62K16l88M46l5j15N5n2O1j07j95M8J78R9L4j87Ll0J20q1J51k41J25
6814Hj7K9J14l11K26R0l04pK22PQ8k55J29J96k55Qj53K51N6Q3j23m33L29J69k32
6839h5J6p8K32qj80J77J02k36J64N8Kj4l57K54m9J10r5l8jM8r9j26J21J12j34
6864a04J99k84K24l4M9J09l77J94M8n1m4J33j38N2j76J54J25j23j27L12j69M9
6886B1j09j50J60j41K81j21P1J88k72J29k7k35K27k9Ll9j65K9N0K78l4o9O8j85
6910g1J45L2L2l3J55k20j07J95k50m2J88k6o1M59j04l12N8L7n5P6j75J22pJ78
6934B14j83O6o5J10Qn4j92N4j22J18K11k3p3k48O3m1J71L0O4o9l87L82p6J93j72
6959b1J07r9M5P0j1n8k09R0K27j88KO1O0q1J23k27K07p1k1L8R2k08l3O9k9j8K1
$$ plain form
6790 -197 65 -97 119 -269 177 142 27 82 30 91 -16 -211 -163 15 114 148 -39 -36 -66 54 -27 124 -117 8
6814 8 -9 20 134 -177 49 139 -165 -172 50 57 145 -110 19 215 -40 -32 -185 66 122 205 82 -351 -22 147 -85
6839 -85 -69 -147 85 77 -103 74 176 -60 104 162 164 150 -207 47 -2 108 13 -25 -26 22 -77 -203 -82 30 -104
6864 -104 95 -189 35 1 50 159 -218 -24 24 -27 -71 62 -76 -24 -200 -46 79 -44 -171 141 -28 21
6886 21 -88 -238 -78 -219 62 -59 12 200 -72 57 30 -205 22 -7 -4 -43 -208 -179 -129 149 115 46 114 -71
6910 -71 74 106 138 105 260 40 -67 128 -122 -164 24 -2 -63 396 292 -20 38 75 20 96 -79 43 36 214
6934 214 31 97 32 142 150 96 -96 -42 -164 -46 165 142 69 -179 -116 -157 14 44 108 39 -348 34 -42 151 -21
6959 -21 86 -13 32 102 91 33 -176 -86 141 -47 -45 16 76 -5 118 -109 98 27 6 44 136 -72 -105 -36 -65 -83 -62
6986f2J06l02K58K53l7k01k90m4L74k1k4J28j74K16l23L38n01L01K05k95J9J77
7008A01p4L4O8l1j01p6J5k66J35K41K43m48N1J39J17l6O2k08Q7Nq3N5%j47M8j57
7034b26J04L9j44L16k24M33j49j18l51N83j57o9p0R8j61J88p5j6Mj44K80j55K8
7057A4L12l31L7kL1Lj88N1p3R0O9J43l22J41J4M00o88K38M8j99K47q2n1J68k16
7082a46M33k48J64m50J29J19j47K19j45J2j13J16O5R2k58J26J64j2j10o0j3K32
7104A69k40J00J27j67j28J78P2Q9j88j01J76l7J52k82k26O82n37q6L33k1j70K55
7126A50m9J16k22P8J08J07k83j21J46J83k16l08J38O8O4n6N13m32J5L5K89l01
7148B2o8m4J88r7j5m9K35k11J69oj12J84k04K5j62J9P4K17j25j26k40N04j48l2
$$ plain form
6986 -62 44 -258 0 253 216 15 -275 -319 55 34 10 138 -36 180 -143 195 -306 -5 200 -95 -76 101
7008 101 27 61 129 98 -3 -79 -64 -330 -195 46 289 -159 -108 31 148 112 174 -34 53 58 -25 30 30 -117 -69 -226
7034 -226 -122 -83 -227 89 -135 298 149 31 -320 263 106 37 -33 65 -96 92 17 1 5 -139 141 -14 14
7057 14 326 -5 32 30 61 64 -124 -73 -146 -56 13 156 -166 -25 -11 389 -299 -61 -13 -212 35 -47 -98 70 -146
7082 -146 287 39 203 -247 -118 1 -146 73 -72 -60 -173 -57 8 100 -158 -32 132 120 10 -50 -63 169
7104 169 -71 29 156 -11 -139 39 111 200 12 -89 87 50 202 -80 -306 376 -161 -247 86 65 -105 150
7126 150 101 217 -5 73 181 288 5 -116 30 213 -3 -311 -173 -105 -41 -97 416 -16 -1 34 323 22
7148 22 -46 -90 98 1 -14 -63 172 -39 130 124 12 196 -8 17 -145 -126 -52 165 40 -86 -326 178 30 -2
7172bkm6q8J39J17m7L8k50O1J32o6K48j98K16k59l05K95m1L55n60K48J04q4J56
7196A61j98K25k53J62r3R0m0P5L7k52M18k48p9Q5k7m7J44k70J83P1k74L27m28
7219b31J93p8J5L1q3J31j02L63j85O3r1J5l68L82J0j38o0j09L63k01O1RJ52j97
7243e5J40j17R6P9j96J1L2J22j71j90J73Jk1M05k41l0j89J34L24k69P1k16R2L27
7267C12l32R5q0q3L05l19j44J53J50j89M01k93J66k50K16k59K02R9j05J29j43
7288C1j1j91J52p5K71k68o1j75R3K65m4P2j65K43O6j81J20j18J48j49J41j45J07
7311A26N9j81r2J36J9q5k9m7j91L05j5L2j25K58k17L3J18m02K50L6Q0J2j41r3
7335a54j47L7L3K71j0j51Q6j34J32J97k15J86J86l95l4L28k76J61j31J64j6k32
$$ plain form
7172 -2 -4 -50 -138 1 118 71 109 -141 -80 52 -14 234 36 252 -7 -312 -17 -58 297 -263 -15 89 5 161
7196 161 -37 188 -65 97 4 94 54 129 166 -86 332 84 5 90 63 16 160 -110 73 144 -130 197 -231
7219 -231 -38 -116 -101 -70 -153 -22 -124 239 54 117 26 41 -327 55 65 -73 -133 -242 121 -80 -19 -10 142 -55
7243 -55 85 -32 64 143 -53 -42 -10 112 -59 -249 -76 -75 -96 309 68 38 -151 -17 307 38 109 -107 -15 312
7267 312 -20 75 -5 -88 217 -102 -246 -93 57 -132 269 -24 142 -108 108 -151 51 150 45 174 31
7288 31 20 -171 -19 -94 177 -91 -152 -327 -234 31 -13 59 -106 137 203 22 142 24 172 23 164 19 126
7311 126 185 4 -88 48 67 -18 -47 -94 -285 20 5 37 -88 170 -47 -14 104 -298 -48 -12 68 80 -61 -154
7335 -154 -301 -264 -231 40 30 -121 -35 -169 -37 160 -55 131 317 -78 -112 216 -60 101 -30 134 118 -114
7357a14j72K66K15k08K57l03J88L5k1m2j2J82M7n54L39j72K60Rn56L66r3K76k18
7380b5J74j55n5K86l93K59K9o2k02j03M05j58pPl23L42k47J84n9K9j1K61j29M
7404E1J87j42l32K12Q0l03L84j69j0q1J63n8j67M04k71L4N1J93k96l9j2K14m78
7427c85J70J80j42J47j1L39j99k37L12k30j27J09nM4K77J39n74L06j77K46p7k96
7449a91K85r9J56j86K12M9l67O02p20P02l59K4o6j67L04Kl28J53j19J51j1M7k96
7472b22L76j65J12J81m28K89k36p7J61j5K13j35j94J97k00K08K06l57J91l59K33
7493b1q5Q5j27K00k09L6J30q8j05L38p6j49j52N15m10j72L21j33J30k10K45o9
7515fk6L8k6P5j91J01j5k28L20J73k37L0O3k69K87l23K65j85J3J25m6j51M54k95
$$ plain form
7357 -114 -286 -20 195 -13 244 -59 129 164 143 101 89 271 318 -236 103 -69 191 200 -356 10 -83 193 -25
7380 -25 149 -6 -61 225 -168 91 120 58 -144 -247 158 0 -7 0 -323 19 -228 -44 -103 -74 -85 176 47 51
7404 51 238 96 -236 -24 56 -247 137 -32 -42 -123 40 -18 -185 219 -52 -18 33 226 -70 -109 -121 93 -385
7427 -385 -215 -35 -177 -30 -41 298 99 -138 174 -56 -183 -74 -79 -35 242 381 -193 113 -64 182 105 -191
7449 -191 94 -5 151 -35 177 226 -141 461 -259 443 84 108 42 -125 179 181 -147 6 -113 38 27 74 -222
7472 -222 154 -11 101 282 -146 143 -93 -170 -9 -24 189 54 -140 57 -143 65 271 -86 105 -254 -21
7493 -21 -106 -21 -148 52 -157 -121 9 -79 -184 154 78 -71 -223 292 -118 -290 31 -102 28 -182 63 -6
7515 -6 -32 6 -20 55 -136 -35 -50 -278 42 215 -22 8 71 -198 89 -234 31 -154 -141 -16 -62 -213 241 -54
7539e4K12j11L1r7l1J74m0j36L9O8p4J80j33K3j47L30k38k48K43J01N4l55R4J46
7563C1J63L7l45L75k95o4j08kj29L97O4j50M6l4k14J71R8j03P8N5nr2J59j67m1
7588g5PK8k8O9O7j6P2j34j66O4p2L23k08K8J38K8j17p5J97j9k01J30r0P6q1J04
7614D9M6Q0L8l53J69k5K5J38k63K68k34J98m62N15r5j11J19l4k30J27K54j78M5
7637H6qJ7n5j24q6P8L2m0O1N4j95K80N7n1j16N5j1J02q6j76o5L60j27o6J54j95
7663f5K0n7J48j69L44j17n8j01k55M67k31J7p2o2O2J38o3Q6o3J2p9N0j85J30K8
7688g5q6J60J8r9o6j08J26L0K00R4k04J18o9m4l7j83K52k81k9L14l4J68n0j66
7712e1j10L76j40j94J58R3j52j24M0Q6k77L05L48nk09q7j81J9j56M21n9m19J90
$$ plain form
7539 -54 158 47 78 -19 -50 124 84 -52 -13 55 -19 161 28 51 -96 234 -4 -252 -9 92 146 -209 -115 31
7563 31 194 231 -114 261 -34 -98 -206 -208 -337 60 124 -26 20 -14 -228 -57 41 -62 16 71 66 -26 133 -34 -75
7588 -75 -68 -40 -68 1 68 52 124 -10 -176 -112 -184 139 -69 -41 97 125 8 -67 130 111 -90 40 -50 26 -55 49
7614 49 95 175 213 -140 29 4 29 167 -96 172 -62 136 -326 189 94 -17 102 68 -162 -35 219 41 86
7637 86 78 95 40 -84 -170 -92 -60 -100 -39 15 -180 100 157 106 -10 45 34 136 50 -126 -191 169 42 -24 130 -65
7663 -65 -45 -102 46 -123 221 104 46 -55 -310 157 -74 -57 -129 -191 -129 9 -54 32 -31 -19 -98 -48 -233 -103 -75
7688 -75 -161 -1 17 -82 -148 -256 -130 -100 100 194 -10 108 39 -5 -42 -225 27 -254 -283 31 -3 165 115 -51
7712 -51 -161 215 75 -119 39 132 -20 -144 -104 -18 -295 10 358 353 144 57 -124 -105 -261 160 101 -318 -128
7735a28M36m03K50k3k87J83j49n9L26j09q9J21R9l23J84O3p1J8j40o8J53K08q1
7758A11q2j81o6J41J52j13R0k56K38j07J66j67Q2J89k42K8J14k83J72J82j30M8
7780H6q2J01k07L28k04j80J58mq1J64R7k27m7J49K2K32m37J24J91L67o54J98k39
7803a45L5K34k88L7K13J75j89L4J08J15j81Rj16K8J2n0J3NK4o1q3Q9j69L35j67
7828A7j99P8K74j47J58l38K45p4K5j34R6j56J37k20J29K00p7K43k22lk23K20J32
7851A61j92L2Q5Q8o9j45j00K08k79K79J10l48n7L16l87L22k8M9j15J86J85l21
7873b0m7J00l8j26O0K35k78K76m13J92J69M0j7q5k4j16kPJ95q8j3j33K0j76J42
7898a40n1K23j38J67j71P4J18Lk65K74k24K28k35m5K72k47K46N5j41j20J89J21
$$ plain form
7735 -128 308 -95 155 132 -155 28 -121 -180 146 37 -52 69 168 -155 29 92 21 39 -101 -169 -16 192 111
7758 111 29 -152 -218 -77 75 -38 52 -204 34 -73 93 -74 8 197 -45 -17 97 -186 -14 168 38 86
7780 86 4 105 -102 226 22 -158 0 -4 -85 79 176 -51 -98 51 73 305 -132 -8 183 550 -104 94 -145
7803 -145 -110 124 -164 -127 86 261 72 106 214 329 148 157 41 69 81 31 44 49 73 12 -71 18 -151 184 17
7828 17 -182 -104 170 23 181 -157 88 14 39 -95 1 -155 -18 -238 -109 91 14 257 35 32 -191 29 161
7851 161 -31 1 86 174 105 -40 -140 68 -211 68 178 -170 -227 89 -298 24 -4 45 -70 116 301 -20
7873 -20 -67 33 -5 -131 -71 164 -114 162 -251 -59 110 150 133 48 24 -92 -94 -87 108 20 7 -126 -106 -282 -140
7898 -140 -191 32 -106 61 -110 -36 82 85 -180 94 -130 98 -137 -182 90 -157 89 144 3 -117 72 193
7920A93l29J88k41K23p1J47L3J06k33J37j93k46M16k83K78k95Q2J21J7k38K39
7941E1J71q6K6J31k36O3J90n45j04M10r9j26M76m40P5j8j40K74j07L97k61j95
7963i3j21K14o6q6j8M23l31k8K53o5j55J6k5j48K15M9K05k25R1j26J46J78l73
7986g0k02L38j96J76K8k00J35L4J82j87K36k10o2n4O7j9k6m1J97j21m1M4M6J5
8010F9j7m3J45l52Q5J41k4J25j16J41k63N32n54J24j60R4J45j58J1p2J11L6L7
8033C7n0m6J58j37J65j71n4n0j6K37k67j47K14L37q9k33P1K6r3J81L27n10K08
8056I8J4k11M9L86l07K62m62J11J40N0j20K46k25K18k86J45k87n9K62J76k33N6
8078B3k9J00j22j39J89M8p9k36J04L6JO3J77k62K45q8ok0j49J65k41M9K69L4k40
$$ plain form
7920 193 -136 52 -189 34 -37 110 143 249 16 153 -40 -286 130 -153 125 -170 -88 33 50 -188 51
7941 51 222 136 162 293 57 120 310 -235 -339 71 -28 -154 322 -118 -43 -61 -201 73 -34 363 102 -93
7963 -93 -214 0 -66 -152 -170 253 -78 -106 147 82 -73 -57 -82 -230 -15 34 239 14 105 -21 125 303 -70
7986 -70 -272 66 -130 46 74 -126 9 43 225 38 274 64 2 -52 15 -4 -30 -71 126 5 -36 8 54 69
8010 69 52 9 154 -198 -113 28 4 129 13 154 -109 423 -131 -7 -167 -73 72 -86 -75 -147 -36 0 37
8033 37 -13 -59 99 -38 127 -44 -98 -148 -164 73 -194 -341 -127 210 121 -112 -41 -15 -108 73 400 -110 98
8056 98 112 -99 -50 336 29 291 -171 -60 80 130 10 256 31 249 -37 108 -179 -238 24 200 -33 23
8078 23 -6 94 -28 -167 22 70 -9 -245 -141 -105 -104 -41 136 -126 119 31 25 5 -144 21 -220 -171 98 132 -108
8103a08J65R7k61J32oJ36j53K37r5k29j9J4N6j74L77m77K18J41j7j45K33j34m8
8126f0J59l4j5p9j7j22Q8J37k90o5L94J05j26J29r1k38L00j45k46K32J51j53K3
8149C7n76L32L25m3l64L53k17k02J38J61K63j82l35K26K11m91K02P8J13j51J51
8170B9l37K92J11m5j58j29J27R9j8J21Q0k08J56j30o0K88qo7j28RP6
$$ plain form
8103 -108 57 154 -107 25 19 155 2 239 144 -85 -104 -90 -34 -208 169 -308 -90 51 34 -111 122 -12 -60
8126 -60 99 65 50 -29 -46 -168 -80 57 -233 -298 96 201 75 204 113 -125 175 30 -216 16 167 14 37
8149 37 -539 -207 118 75 -289 64 -153 -355 -217 -56 207 25 -310 -84 127 -364 -162 -84 29 -122 29
8170 29 -308 -16 95 50 -108 -237 -110 -11 -29 92 172 -36 120 -10 -70 218 210 143 15 24 100
8191A00
$$ Imaginary data points
##PAGE= N=2
##DATA TABLE= (X++(I..I)), XYDATA
0@%%%%%%%%%%%%%%%%%qJ6j6J6j6J6k4L2l2L9m7M9n7O7p5Q8j00J09j22J38j55J75
39I3j96K18k42K69k99L30l63M00m41M86n37N91o51P18p93Q75r68J077j201J344
59G10j512J716j965K280k695L262m089N416p874J3898n5096p4505J26363L4304
73D0213q6824j9285P2554M352m7217j2576J8136J5932K0641j8154m0362J3349
85c9241M1735k8547m8890L5809O2282l2346n5931K6446M0453k1801k0303K1645
97a8689J7645r354j1617j1058m310K3098J6121k1512n322K6702j635k6620N529
110b1022K4890L378k328L103j4700o603K0686P9j9440J7076K7542j8382k7198
123a2919J6046K2855j0931o279J7211J099j3058n01q56p555J2951K0861j6069
$$ plain form
0 0 0 0 0 0 0 0 0 0 0 0 0 0 0 0 0 0 0 -8 8 -8 8 -8 8 -16 16 -16 23 -24 25 -32 35 -40 48 -52 57 -65 73 -82 93
39 93 -103 115 -127 142 -157 173 -190 210 -231 255 -282 309 -342 376 -417 458 -510 567 -634 710
59 710 -802 914 -1051 1229 -1466 1796 -2293 3123 -4751 9147 -45949 -120454 5909 40213
73 40213 -46611 -65896 6658 11010 -36207 -48783 -30647 -14715 5926 -12228 -52590 -39241
85 -39241 2494 -26053 -74943 -39134 23148 -9198 -65129 -38683 1770 -20031 -40334 -18689
97 -18689 -1044 -10398 -22015 -33073 -37383 -14285 1836 -19676 -24998 1704 69 -26551 -21022
110 -21022 3868 7246 4918 8021 -6679 -13282 7404 7483 -11957 5119 32661 14279 -12919
123 -12919 3127 25982 15051 8772 25983 27082 14024 13523 12667 5112 18063 38924 22855
136B2855k3022K1662J5008l2119p058M0634P544l5363m469K2462r757j8996J5495
149A4876J2635j1198k726K369j1141l200J4511K061j1515N552O956j8321j1669
162a0810J6162P378j2432k055J0652n758j7219L719J3937l047n620M463j38q802
176i570n410J933M137M743M95r333k466O473n300q046J1509J1295p996j0814L733
191a4617L639o047J99P287J956o52m478o394J821Q362K191l989K663O442p158
206h775j0550P525J0788l471m000N617K888r001k862R277K845j353L616N01m855
221a810j380K897L97K231O306j310p524J988L564l572P16Q343K338o822k942L266
237F686M20k156L522M117o43m307k794J83J607K421K349j237k27l12m952j391
$$ plain form
136 22855 -167 21495 36503 4384 -2674 37960 45504 10141 5672 28134 18377 -619 14876
149 14876 27511 16313 13587 15956 4815 1615 16126 18187 6672 12224 19180 859 -10810
162 -10810 5352 12730 298 -1757 8895 3137 -14082 -10363 3574 527 -5093 -630 -768 -9570
176 -9570 -14980 -13047 -8910 -4167 -3672 -13005 -15471 -8998 -14298 -22344 -10835 460 -7536 -18350 -14617
191 -14617 -10978 -17025 -16826 -9539 -7583 -8235 -12713 -19107 -17286 -8924 -6733 -10722 -8059 -1617 -8775
206 -8775 -19325 -11800 -1012 -4483 -8483 -2866 22 -8979 -11841 -2564 281 -1072 2544 3045 -1810
221 -1810 -3190 -293 104 2335 8641 7331 -193 1795 5359 1787 2503 10846 13184 6362 3420 6686
237 6686 7106 4950 8472 12589 11946 7639 4845 5028 6635 9056 11405 10168 9941 9629 4677 3286
253C286M423K874k153j064J190k690m597J980L269j209J587P15m163l668J282
268A062J957n58O10J587k836l147m95j029J406L642R3l105k729R74n81k998K053
285d094M848o66n254j942K029j77j742K501K077j466r84k590j426L065K175j733
301e379p11K172j94n547j76N509O46j467O83n7j204j091M93K277J291Q18j145
318c082k565O71J117n60J294K221P78j858j881J898M03n91K578J434j532r28K12
335c91L30l85J751K222j135q24Q81j450J60K336K26L9M43j47j511r41K615R37
353E156m04L37J65r32j023j40K007R52j131L61l17j059J12j87P53N22k1k20k079
372B852N15J291j690K06J868r65j434o13K16K6l08P20m35j000N20j390q97J228
$$ plain form
253 3286 7709 10583 8430 7366 8556 5866 1269 3249 6518 5309 6896 7611 3448 -220 1062
268 1062 3019 2461 3071 4658 1822 -1325 -1820 -2849 -1443 2199 2292 -813 -3542 -2568 -3149 -6147 -4094
285 -4094 754 88 -5166 -7108 -5079 -5256 -6998 -4497 -2420 -3886 -4870 -7460 -8886 -5821 -3646 -5379
301 -5379 -6090 -3918 -4112 -9659 -9835 -4326 -3680 -5147 -4464 -4521 -5725 -6816 -6323 -4046 -2755 -1937 -3082
318 -3082 -5647 -4976 -3859 -4419 -3125 -904 -126 -1984 -3865 -1967 -1564 -2155 423 1857 325 -603 -391
335 -391 -61 -446 1305 3527 2392 1568 2449 999 1159 3495 3721 3760 4203 4056 2545 1604 4219 5156
353 5156 4752 5089 5254 4322 3299 3159 5166 6118 4987 5348 5031 3972 4084 3897 4650 5172 5151 4931 2852
372 2852 3367 4658 2968 3174 5042 4077 2643 2030 2246 2272 1964 2684 2249 1249 1769 379 -518 710
390G10m9%n65n01j00r57l14L38n1L6l81r14j59l19J41N36j292K65P96j378n69
411d727K13O22np09K77m29j96Q46q91k88J696Lj364J10L56M34j66q8K38M78M64
432c126l59q18J191Q87p71J68L65J059L89j330K50J995j81o78m9J551O09o91j5
451D46l6J064J735j498r73K255J232j861j285K033K050j122j437P38J625J90j638
468C518p68K547J100j336j240J48J186O54k032k90J958J341k309k859K702K046
484F366k301k000J490J308p18l170J70K805m36j628j041P46N06j400j011l49J407
501G44J116k895k342J855J919k694j398K156J466k746k237J139J207m36r36J78
517c904O40j477o02R10p24L02J415k67j890k98J552o37j085K188R39j875m81J008
$$ plain form
390 710 661 661 96 -405 -505 -1462 -1776 -1438 -1489 -1453 -1834 -2748 -2907 -3226 -3085 -2549 -3841 -3576 -2780 -4158 -4727
411 -4727 -4514 -3892 -3897 -4606 -4329 -4758 -4954 -4108 -4999 -5287 -3591 -3588 -4952 -4842 -4486 -4052 -4218 -4306 -4068 -3590 -3126
432 -3126 -3485 -4303 -3112 -2225 -2996 -2828 -2463 -1404 -1015 -2345 -2095 -100 -281 -959 -1008 543 1152 461 446
451 446 410 1474 3209 1711 738 2993 4225 2364 1079 3112 5162 4040 2603 3341 4966 5156 3518
468 3518 2750 5297 6397 5061 3821 3969 5155 5809 3777 3487 5445 6786 4477 1618 4320 6366
484 6366 4065 2065 3555 4863 4145 975 1145 3950 3514 1886 845 1591 2097 697 -314 -663 744
501 744 1860 -1035 -3377 -1522 397 -2297 -3695 -1539 -73 -2819 -5056 -3917 -2710 -3146 -4082 -3904
517 -3904 -3264 -4741 -5343 -4433 -5157 -4855 -3440 -3707 -5597 -5895 -4343 -4980 -6065 -3877 -2938 -4813 -5294 -4286
535d286M0n75R96K028p59j745R37J658j709m07L001K273l052k186L290J090k232
552a638N92K730M21r15%m87l35K263J995k528o30K915M29l306r40M775K392m418
570C315j622L759P84l303l90L151J223j658j032r50N8K168N20k807L13L196j411
587E314m747K38M685R01m267j603L322J140m176k897L977K833k827k507J25J057
603E68L88k393m55J422J980j574m719L11M295J28m006j122M590Q74o370k160N948
620b295K244m099k205L136P21k945p12J595J113J396r57l554M17L891n27l371
636f152J420M723j134n329P84M248j62k400J265K879j255k611J504Q15N96J376
652E67Q6j598j2J658o14j196J980K786j404j787L35J135L18l07Q54J082j46j252
$$ plain form
535 -4286 -4246 -4821 -3825 -1797 -2556 -4301 -3364 -1706 -3415 -3822 -821 1452 -1600 -3786 -496 594 -1638
552 -1638 -1046 1684 2105 1190 1190 703 368 2631 4626 2098 1468 4383 4812 1506 566 5341 7733 3315
570 3315 1693 5452 6236 2933 2543 5694 6917 5259 4227 3277 3335 5503 6023 3216 3529 6725 5314
587 5314 567 805 5490 6391 2124 521 3843 4983 807 -2090 1887 4720 1893 -614 -489 568
603 568 956 -1437 -1892 -470 1510 -64 -4783 -4472 -177 -49 -4055 -5177 -587 287 -6083 -8243 -2295
620 -2295 -51 -4150 -6355 -3219 -2498 -5443 -6155 -4560 -3447 -2051 -3008 -6562 -6145 -2254 -2781 -6152
636 -6152 -4732 -9 -1143 -6472 -5688 -1440 -1602 -4002 -2737 142 -1113 -3724 -2220 -1405 -809 567
652 567 653 -945 -957 701 87 -1109 871 3657 2253 466 801 1936 2254 1947 2801 3883 3737 2485
670B485m5J23L53J251M26l68q37k34K7m49M41J062Q63j103j771K62Q89q03K49
689B821J898l86j887j009M61k17l78J722K43j898m03J23n07j074J519J182j478
706G32j602M83n14r95J023R26p90p62L88p06j827L77K640n01j560N16j56j066
724c394q20J440J092n61q4n65r10J02M17L77P03P72l87j856k89J374N60j63Q10
743a382K88m81r41k87O64J088N51K26p62L27j40n61P96J142M82p42q3J30o87j40
763e12J504J079n45q2l82o93j41R16J177oK6J85j508l73J050N08k89Q54K38j172
783A834j326J097M44lK95M56n26r06k78L5N82O56J13r69o22P7n41j76R29N50J11
804A832j319o22J43l76J74R19K22l08p93p85m23N32P03M53o28J89q85q79J22Q04
$$ plain form
670 2485 2440 2563 2916 4167 4593 4225 3388 3154 3181 2732 3173 4235 5098 3995 2224 2486 3375 2572 2821
689 2821 4719 4333 2446 1437 1898 1681 1303 3025 3268 1370 967 1090 583 -491 1028 2210 732
706 732 -870 -387 -901 -1896 -873 53 -737 -1499 -1111 -1817 -3644 -3267 -627 -1128 -2688 -2172 -2328 -3394
724 -3394 -4214 -2774 -1682 -2243 -2327 -2892 -3802 -3700 -3283 -2906 -2203 -1431 -1818 -3674 -3963 -2589 -2029 -2192 -1382
743 -1382 -1094 -1575 -2516 -2803 -2139 -1051 -500 -274 -1036 -709 -849 -1410 -614 528 1010 268 185 315 -372 -512
763 -512 992 2071 1526 1444 1062 369 228 1144 2321 2315 2341 2526 1018 645 1695 2203 1914 2768 3006 1834
783 1834 508 1605 2049 2046 2341 2797 2271 1365 1087 1122 1704 2360 2473 1504 882 959 418 242 1171 1721 1832
804 1832 513 -109 34 -342 -168 751 973 665 -128 -913 -1336 -804 -101 352 -276 -87 -972 -1851 -1729 -925
824i25P02j53m64p5q81q4M25J90M53L83j99j010m28K26N92L77K69M41j001n43
844a705q6N0Q04J45J82j99o24J43m94J59J285M37q26L9l86O5l0M33P96N9o2m60
866b75o22n4Q98L8N24R3m71k40n30L71N30M79J72k38l13j06n38N21O73N22m1o51
888G42n02K99k18R3R40L62m14l37n41K30j21N10N55m78M66r66j70K95K82M50O7
909A544j77o63n1o2q0J61P27J39q46M3m82j1L41M33rJ7m20k86m61k03R04j39L99
932H18o06k88k07p9j98Q06K07n23l50n27N4J90j76L28N1K00m88m42j34K9K07M22
954g06j65n9m48j82j35M05L40O6k95m13J50m45O75k23K16N82l36k80l00j01R44
975g10j42L3K94o26K22l9k74R54M15l27q8j62M04j30k24P15L25q2k50m15L74N39
$$ plain form
824 -925 -223 -376 -840 -915 -1796 -1880 -1455 -1265 -812 -429 -628 -1638 -2066 -1840 -1248 -871 -602 -161 -1162 -1705
844 -1705 -1791 -1741 -937 -792 -610 -809 -1433 -1290 -1784 -1625 -340 97 -729 -690 -1076 -1011 -1041 -608 188 247 185 -275
866 -275 -897 -951 -53 -15 509 602 131 -109 -639 -268 262 741 913 675 362 256 -282 239 912 1434 1393 742
888 742 240 539 321 414 1354 1716 1302 965 424 654 533 1043 1598 1120 1586 620 450 745 1027 1477 1544
909 1544 1367 704 653 591 511 672 1399 1538 692 735 253 242 583 1016 1007 1024 604 318 -143 -346 558 419 818
932 818 212 -76 -283 -362 -560 246 453 -70 -420 -947 -893 -703 -879 -551 -500 -300 -788 -1230 -1364 -1335 -1128 -706
954 -706 -871 -930 -1378 -1560 -1695 -1290 -950 -884 -1179 -1592 -1442 -1887 -1212 -1435 -1219 -637 -973 -1253 -1553 -1654 -710
975 -710 -852 -819 -525 -1151 -929 -968 -1242 -288 127 -200 -288 -450 -46 -176 -400 315 640 558 308 -107 267 806
997H06R2R6j48L37J48n65O9M20N82Rm55K28K01p64K17L1Q27P8l93m14J70N2j30
1020A494K46j08M51k47o41J6J8M80l7p30O17q5r77o7J82N33j47n10k27j41j60
1041d0j16j68l4M80o62l12j18J08K99l28m74O47Q6n87o28M19J82m11k0K28k28
1062a677l50K11j86p8J63O05m76n28M91L44n13j69N53L61k25l90K16J07R5O04
1082h42k27j42j18M27L80n38L49P57l32l64M35M27J20l34L01O71j34o77P67k38
1102F88K09R6O28Q0n62M67L84n75o1R46j40q09J53O61K57j204L30Q59o25l31J4
1123A465K90j08k41O03n40K18P7j87n17k08N79L7r68n8R79n70r44k1P45k94l35
1144Bk09K53k1l69k50l7q2O0j63m23j53Q21j05j171L65Q10q03n23J69L97N7o11
$$ plain form
997 806 898 994 846 1183 1331 766 835 1255 1837 1846 1391 1619 1820 1056 1273 1304 2131 2209 1816 1402 1572 1624 1494
1020 1494 1740 1632 2083 1836 1195 1211 1229 1709 1672 942 1559 1474 497 430 612 1145 998 488 261 120 -40
1041 -40 -156 -324 -358 122 -540 -852 -970 -862 -563 -891 -1365 -718 -632 -1219 -1847 -1428 -1246 -1657 -1677 -1449 -1677
1062 -1677 -2027 -1816 -2002 -2080 -1917 -1312 -1788 -2316 -1825 -1481 -1994 -2163 -1610 -1249 -1474 -1864 -1648 -1541 -1446 -842
1082 -842 -1069 -1211 -1329 -902 -522 -1060 -711 46 -286 -650 -215 212 332 -2 299 970 836 159 926 688
1102 688 897 993 1621 1701 1139 1606 1990 1415 1354 2300 2160 1351 1504 2165 2422 1218 1548 2407 1782 1451 1465
1123 1465 1755 1647 1406 2009 1469 1687 1764 1577 1060 852 1431 1468 500 442 1421 851 -93 -114 631 337 2
1144 2 -207 46 25 -344 -594 -631 -713 -653 -816 -1239 -1392 -571 -676 -1847 -1482 -672 -1475 -1998 -1829 -1432 -1375 -1986
1166a986J09O12m27n7K35k03l9J77r3K81m96M75M82j059N92L91J67m96K44N86
1186e05m3m53J71P06j56l79O73R5j12j57Q77l11MJ68R4k34j59L74M68l24P3P41
1208A611p21J97K06o8l6Q6K41K67o61K19J00j21J83R2Rm03OK82k01l67M64j31
1230A254l15L73k33r2j93p5L42n19j21J02p7k9j39n85L85R3o50P7m3j03J99j84
1252e33J40r4r6l1k84K02l53K22Q5k30k64L69l03Q3L41m99P8K43l14N5K96j90
1274a077L41l08R8k09J23mJ87L3Q2J4J11O4k77N00K02j26L7R5l30O4P0N05j79
1297A6j11M08j32k43K92o9K18J88P5L0k93Q6n4m8P46o9m26n9R4J69m94N67M7m8
1321H90l52J78o7j44J56K04K74n23J20Qn52K31J71j53j33K71m04j10K59J82J36
$$ plain form
1166 -1986 -1877 -1265 -1692 -1749 -1514 -1717 -1756 -1579 -1672 -1391 -1887 -1412 -930 -1989 -1397 -1006 -839 -1335 -1091 -505
1186 -505 -548 -1001 -830 -124 -280 -659 14 109 -3 -160 717 406 410 578 672 438 279 653 1121 797 870 1611
1208 1611 890 1087 1293 1225 1189 1275 1516 1783 1122 1341 1441 1320 1503 1595 1604 1201 1207 1489 1288 921 1385 1254
1230 1254 939 1312 1079 987 794 719 1061 542 421 523 446 417 278 -307 78 171 -479 -402 -445 -548 -349 -533
1252 -533 -393 -487 -583 -614 -898 -696 -1049 -827 -742 -972 -1236 -867 -1170 -1087 -746 -1245 -1167 -924 -1238 -1183 -887 -1077
1274 -1077 -736 -1044 -946 -1155 -1032 -1036 -849 -816 -734 -720 -609 -545 -822 -322 -120 -246 -209 -114 -444 -380 -310 195 16
1297 16 -95 313 181 -62 230 161 379 567 642 672 379 465 411 363 1109 1040 614 555 649 818 324 891 938 890
1321 890 538 716 649 505 661 865 1139 616 736 744 192 423 594 441 308 579 175 65 324 506 642
1342F42j64m9m23J37r5nk0J71l15Q3%l49P3J21q7j15J99K50m53j34L76r7J12j2
1366a54k75n6J97k63K14J89j91j28m0K06j83p2K97j62K6M7k9k00j97L02O7N0L14
1389d1l10O6K3j81L12K00k9k66J45j50J35l5n6K96j46K0m1k63L90k72K10M66k65
1412B08m94R0q1L14m0J44j5r0Ok43j3L24J60j67M3o8j36lm4K48m5J67m0k40J11
1437I6k6J02L21J12k92j0k92K42k13K17K18J05l09J30l81K28j27N40k88j5J72
1458E30k26l9O6J4J33m6j85k7K1l0k16L38L9j08K05l32O1n14L97L09j43k32Nk14
1482a94K66k76N3L06m02M15k95k51rQ8J2K70k86O5m84K75P4j42M8M19l15l01k46
1505i10J18K54q7J31k26J49l81J93L00k4r9P9M41r38L24J58M0J51O8k9K38l41
$$ plain form
1342 642 478 429 6 143 48 43 23 194 -121 -38 -38 -387 -314 -193 -280 -395 -196 54 -399 -533 -157 -254 -142 -154
1366 -154 -429 -485 -288 -551 -337 -148 -339 -467 -507 -301 -484 -556 -259 -421 -395 -348 -377 -577 -774 -472 -405 -355 -41
1389 -41 -351 -285 -262 -443 -131 69 40 -226 -81 -231 -96 -131 -187 109 -37 -17 -58 -321 69 -203 7 473 208
1412 208 -286 -196 -277 37 -3 141 126 36 42 -201 -214 110 270 103 146 78 -58 -61 -105 143 98 265 225 -15 96
1437 96 70 172 493 605 313 303 11 253 40 257 475 580 271 401 20 248 121 661 373 358 530
1458 530 304 265 331 345 478 432 247 220 241 211 -5 333 372 264 469 137 198 -316 81 390 247 15 20 -194
1482 -194 72 -204 -151 155 -247 168 -127 -378 -387 -299 -287 -17 -303 -238 -722 -447 -373 -515 -467 -48 -363 -664 -910
1505 -910 -792 -538 -625 -494 -720 -571 -952 -759 -459 -483 -582 -503 -62 -1000 -676 -518 -478 -327 -259 -288 -50 -391
1527c91n2J63j54P46l24J19k79J34J26mm9L30P6J30k21J6m2M0R3k07N60k32J77
1550G55l28K5M80k50J73m7L2l43KK85J7k15K58j71O7k12K87r0j4k37R0N8m04J1
1574B29K71P6J75k64j65ol20J55k27L48k63k57M09l64l3O0k06K52k62J8K2j81
1596e33N8L17o36K49R2m17j06L84n8m4N6l07K68j95P2J44k76L56k28p9K78n16
1618a121L55J55M0n2q7K48p1J50n7q5J39K61k18k3K17j13J09J87R8O7Nj59L86
1641D31j73n8M27m73J77K72l56L28P4k94L63q2K57j86J2pj30L47J97l89k5Q5j1
1664G86J7j02k25K97pj62K4m0K52m34J72j44k28K27kj89k42J70K31m23j05p9M1
1687a65k12N82k88o5P0j65J1m57J29K28j28j13n4k0j64M05k85K92m04O1Q7j09
$$ plain form
1527 -391 -443 -280 -434 312 -12 107 -172 -38 88 84 35 365 441 571 350 366 324 364 457 250 810 578 755
1550 755 427 452 932 682 855 808 840 497 499 784 801 586 844 673 740 528 815 725 711 474 564 622 218 229
1574 229 500 576 751 487 322 316 -4 151 -76 272 9 -248 161 -203 -236 -176 -382 -130 -392 -374 -352 -533
1596 -533 -475 -158 -794 -545 -453 -870 -976 -592 -650 -694 -638 -945 -677 -872 -800 -656 -932 -576 -804 -883 -605 -1121
1618 -1121 -766 -611 -571 -623 -710 -462 -533 -383 -440 -525 -386 -125 -343 -366 -149 -262 -153 34 132 199 204 45 431
1641 431 258 200 627 154 331 603 247 575 649 355 718 636 893 707 719 712 582 929 1126 737 712 797 786
1664 786 803 701 476 773 766 604 628 588 840 406 578 434 206 433 431 242 0 170 401 -22 -127 -206 -165
1687 -165 -377 205 -83 -148 -78 -243 -232 -689 -560 -332 -460 -573 -627 -647 -811 -406 -691 -399 -803 -742 -655 -764
1709g64n0J41j70K97k8j6j16n9K39k06L73k50J59J13k31j90L24N7j4L99k84K01
1731g5l7j21K59l6M6J5J60j47J89k68K67J67K0L5L7j18K07j8k9q0K26k43M4M1
1755E41K01k82MM10l42K6K1J8q2K53l31K95k61j83N3K35k86J86j65M1j29M2J41
1778D06k48L78j03m02J92k52l1M6j46J88k57k1K33l97n2j07K14L64n67L24j13
1799c51k00K9M1L23M4j45l52J79j18L07j46j06J72n4J6k24J70K86k80O4L6j01
1821d10O18l67j51M38p2k05P8N3J87k29j64K76K14j86q1k03MO78l27n8L5J75K81
1844E84l39q6K72k26J31N2o9j96J2l3L18m01K31R7l83M32j43l51L95n0l8j30J42
1867B21l8j27p7K6J08J7p8L7K2j13l5m0J07Q1q1n1k30J66p7J81o9n5J45m89N58
$$ plain form
1709 -764 -814 -673 -843 -546 -574 -590 -706 -765 -526 -732 -359 -609 -450 -337 -568 -758 -434 -377 -391 8 -276 -75
1731 -75 -112 -233 26 -10 36 51 211 64 253 -15 252 419 439 474 511 393 600 582 553 473 699 456 500 541
1755 541 742 460 464 874 532 558 579 597 515 768 437 732 471 288 341 576 290 476 311 352 223 265 406
1778 406 158 536 433 31 223 -29 -60 -14 -160 28 -229 -250 -17 -414 -466 -573 -359 5 -562 -238 -351
1799 -351 -551 -522 -481 -158 -114 -259 -611 -432 -550 -243 -389 -495 -323 -377 -361 -585 -415 -129 -409 -345 -309 -410
1821 -410 208 -159 -310 128 56 -149 -71 -18 169 -60 -224 52 266 80 -1 -204 -200 478 151 93 128 303 584
1844 584 245 159 431 205 336 388 319 123 135 102 420 19 250 347 -36 396 253 -98 297 247 209 79 221
1867 221 183 56 -21 5 113 130 52 89 111 -2 -37 -77 30 111 30 -21 -251 -85 -162 19 -50 -105 40 -449 109
1892A09j30l32P0n6K82j40j3o4L77k88J29j07P1l02K58j03j41K01J18K66j58k33
1914a86J79n4J55J06j88j24j84L88L4K84n55K42j7q3L01k52J15J97n0j61J91k75
1936F3K21k39J37j25L6QJ8j87K21n1p5N8j70J63p1j39O6o9J41J62o8O9j08k18
1960a57j8N6o5p1J42P6j51J42k10R2k29J48J47l99P6L55o5j72p2J39M3N7m5k77
1984d58N10l74J73J34J0r9J08J2N6j88L44l15K87q4Q7J76l88N54l10Q1k38q8K62
2007B52n9Or3j19K18m0q2J86k8J44j49j6R0k29Q8O2q4r2L1K01m92P6J56M83l55
2032A55k40K10k67K46l31L12K7k95N1o0j14J47J76l08J94j56l0J89j56J62j84
2053b72J76k63J68o4o3n9o4J38o8J09J81l09J28j50K74l06r5M97j05j76J65k42
$$ plain form
1892 109 -21 -353 -283 -339 -57 -197 -210 -274 103 -185 -56 -163 -92 -394 -136 -239 -380 -179 -61 205 47 -186
1914 -186 -7 -61 94 200 12 -112 -296 92 126 410 -145 97 80 -3 298 46 161 358 308 147 338 63
1936 63 284 45 182 57 93 101 119 -68 153 102 27 85 -85 78 7 -132 -66 -135 6 168 100 169 61 -157
1960 -157 -175 -119 -184 -255 -113 -37 -188 -46 -256 -164 -393 -245 -98 -497 -421 -66 -131 -303 -375 -236 -193 -136 -181 -458
1984 -458 52 -322 -149 -15 -5 -104 4 16 72 -116 228 -87 200 116 203 379 -9 545 235 316 78 -10 252
2007 252 193 199 106 -13 205 165 83 269 241 385 236 220 310 81 169 231 147 55 86 287 -205 -129 27 510 155
2032 155 -85 125 -142 104 -227 85 112 -183 -132 -192 -306 -159 17 -291 -97 -253 -283 -94 -250 -88 -272
2053 -272 -96 -359 -191 -255 -318 -377 -441 -303 -371 -262 -81 -390 -262 -412 -138 -444 -539 -42 -147 -323 -158 -400
2075d00K66l04J35R1J46j3L04m03J77j1j93O59n97J99k8J08p5K85m01K49K6n8
2097A62n8K88j35J05K8l90L60L3k55J24k04L41j88L27l01j72L87k28K55j55N7
2118C81j18J6LK67r7k88j35J73j96o7L09n3l63L38k53n9n4K33j20o7m4J27M08
2141C41p16J50J92O4k64L5Pj82J26JR2l00K86k46j7J88j90K24P9k14L01k85R2
2164b36k90J96m7Q6J88j39J08k37M43k67L44k55J92k51J53m8J52k05M4J22J84
2185B37l05o9J77P0K19r5M9M6k71K41j08J02J7k8l0J74j94R2j18j15K20LM7N6
2209D17k07L2k42J26K61k41r6Q0J57k64L89j73k25K89j49k24J36j79K68n0k02
2230i7J39j0k08K36m16J96j42K49k97K47k24Q5j37O5N2q7J89p6n9K85k24q7J04
$$ plain form
2075 -400 -134 -438 -303 -212 -66 -79 225 -178 -1 -12 -205 454 -143 56 28 136 61 346 -55 194 220 162
2097 162 104 392 257 362 390 0 360 393 138 262 58 399 211 538 237 65 452 224 479 324 381
2118 381 263 279 282 549 452 164 29 202 6 -61 248 195 -168 170 -83 -142 -196 37 -83 -150 -194 -67 341
2141 341 -375 -225 -33 31 -233 -198 -191 -373 -247 -246 -154 -454 -168 -414 -431 -243 -433 -209 -130 -344 -43 -328 -236
2164 -236 -526 -330 -377 -291 -103 -242 -134 -371 72 -195 149 -106 86 -165 -12 -60 92 -113 -69 53 237
2185 237 -68 -137 40 110 329 234 283 329 58 299 191 293 310 282 252 426 232 324 206 91 311 314 361 417
2209 417 210 242 0 126 387 146 50 130 287 23 412 239 14 303 154 -70 66 -113 155 105 -97
2230 -97 42 32 -176 60 -356 -160 -302 -53 -350 -103 -327 -242 -379 -314 -262 -349 -160 -236 -295 -10 -234 -321 -217
2253b17j20L6J94k08K7J0M4K15p0m1rr2Q5J12j8J44rl12J83p4K41P7j57Q7N1j97
2279a8K02j12j5J50j00O5K72l75K25N9m8p1k08L08j83J91kk15P1N4L4n6k63J18
2303H3j13N24k93Q8j74k03J88M8P3k43K59O1l55j62K6J51k9j77J49j08M9M8m8
2326a58J29n6J50j10L3K10k80j79O7J22j15K72J1j68L0l0k53J83j20J1K05k52
2348b98M92l00k06L64l43M70k80k07J24L47l10K81k29J73m67N29k77K87j74K79
2368B55j07k74K43k57Q1K6NJ24J8p8K9n8K73j87K1o5l6M7q3j7L82j1l16K80k35
2393F0J66J43l71m2R3P7n1k72K30J0l17O42m70J45J01j00J09j55Rl0m9J27k81
2416b26R3l7j38K50q5K4j86L78j94k31J85P4J01m07N16l57R5N8l0k78L08l30J37
$$ plain form
2253 -217 -337 -301 -107 -315 -288 -278 -234 -19 -89 -130 -139 -231 -146 -34 -52 92 83 -229 -46 -120 121 198 41 128 179 -18
2279 -18 184 72 57 207 107 172 444 69 294 353 305 234 26 334 151 342 340 125 196 250 284 228 -35 83
2303 83 -30 494 201 289 115 -88 100 148 221 -22 237 298 -57 -219 -193 -42 -71 -248 -99 -207 -158 -110 -158
2326 -158 -29 -85 65 -45 -12 198 -82 -261 -194 -72 -187 85 96 -72 -42 -72 -325 -142 -262 -251 -46 -298
2348 -298 194 -106 -312 52 -291 179 -101 -308 -184 163 -147 134 -95 78 -389 140 -137 150 -24 255
2368 255 148 -126 117 -140 -59 -33 -28 96 114 36 65 7 280 93 114 49 13 60 -23 -40 342 331 15 295 60
2393 60 226 369 -2 -44 49 126 75 -197 33 43 -274 368 -102 43 144 44 153 -2 7 -23 -72 55 -226
2416 -226 -133 -170 -308 -58 -143 -119 -305 73 -121 -352 -167 -93 8 -399 117 -240 -145 -87 -117 -395 -87 -417 -280
2439b80Q5J80j55L09oj87L2K2O6p0p4M00k44n0J85k7j30l6N8N6Rj65K43q3k39
2464a01L69l88K77l05L24K17j35M1j22J12j47j49J40R5l42O95n55J11J58k32n1
2485A2Rj20K46j14J37j60m5q3K04k06j40K55k19p9K63j2n0K3K47j54m48M25o1
2508g0j03J10j46J32Q7k90L57l24L69j13k57J67m04J18K58J65m8j52j54P9o1K7
2530b53K84j89J22K27l68MM4K11j40M9K02j83o9o6o1M36l59M54k39kk39R6N04
2553D65j44K8l53J03R4j15K82J02k51j90K34j7M4j75nJ0J2o2j39K69%n23M00j6
2577E3k86L13pj45K7j14L24j81L42k52k46m9J50o7J21Om28M08lj75j8j4M3J32
2601f6l50j15M73j4N2l54J95L0j81K32j4q1k0J07q4O5J83q4J85k98P7m4L3L5q5
$$ plain form
2439 -280 -195 -15 -170 139 133 -54 -22 0 66 -4 -78 322 78 28 213 186 56 20 78 134 143 -22 221 138 -101
2464 -101 268 -120 157 -148 176 393 258 299 177 289 142 -7 133 228 -114 581 26 137 295 63 12
2485 12 21 -99 147 33 170 10 -35 -118 86 -120 -260 -5 -224 -303 -40 -52 -102 -79 168 14 -434 -9 -70
2508 -70 -173 -63 -209 -77 10 -280 77 -247 122 9 -248 -81 -485 -367 -109 56 8 -144 -298 -219 -280 -253
2530 -253 31 -158 -36 191 -177 -173 -129 82 -58 -9 193 10 -59 -125 -186 250 -109 345 106 104 -135 -39 465
2553 465 321 349 -4 99 193 78 360 462 211 21 255 238 282 107 102 112 124 62 -77 192 192 -331 69 53
2577 53 -233 80 73 -72 -45 -159 165 -16 326 74 -172 -221 -71 -138 -17 -11 -439 -31 -34 -209 -227 -241 -198 -66
2601 -66 -416 -531 -58 -72 -20 -374 -179 -149 -330 -98 -112 -193 -213 -106 -190 -125 58 -26 159 -139 -62 -106 -73 -38 -123
2626a23nK36l99M32k57N1J88J35j65n0n3L99m87Q1J28J6K0J43k50M26m71J54L98
2649E47l54m8q6K46j80oJ3J66k00L9J91j96N2K1j25Kj78M05m34K10m3k21J91J37
2673A49k77K68j93j71J58j76J44J85l39J70l1K5l3nQ2j99j51K36j2j27K36k25
2695b86R6J12k4j81J55j39Q7m56M39K71m16L67l77K30Q2j39N2K97m16N14n51M09
2717A26k01m56O41l8J75j96j82k20N42Jj72r9N1P2O0j1O8n7R7J52m05LJ24r2O2
2742D5J61M7k7l18M9L22n5m97M87N6l10Q3K56k80J3K07j86j06L8O8N7q8K65l96
2766a09K66j36K65j97l3l23L60k92k4l1J83p5J3K09k84L32l47R4O6k22M30kl17
2789a74K2P6j03J09J80j47p3J65m11L29n0J15o5k8J48l20O06l72j90m1J80L4M3
$$ plain form
2626 -123 -128 108 -291 141 -116 -65 123 258 93 43 -10 389 -98 -17 111 127 147 290 40 466 -5 149 547
2649 547 193 145 59 305 125 119 132 298 98 137 328 132 184 205 80 82 -96 309 -125 85 42 -179 12 149
2673 149 -128 140 -53 -224 -66 -242 -98 87 -252 -82 -113 -88 -121 -126 -44 -243 -394 -158 -170 -297 -61 -286
2695 -286 -190 -78 -102 -283 -128 -267 -180 -636 -197 74 -342 25 -352 -122 -40 -179 -127 170 -246 268 -283 126
2717 126 -75 -531 110 72 247 51 -131 -351 191 192 20 -79 -28 44 104 93 161 104 201 353 -52 -49 75 -17 45
2742 45 206 253 226 -92 -43 279 224 -273 214 270 -40 43 299 19 32 239 53 -53 -15 53 110 22 287 -109
2766 -109 157 21 286 89 56 -267 93 -199 -223 -254 -71 -146 -133 76 -208 124 -223 -129 -63 -285 145 143 -174
2789 -174 -152 -76 -179 -70 110 -37 -110 55 -356 -27 -77 38 -27 -55 93 -227 379 7 -183 -224 -44 -10 33
2812C3p0q3J17n7K5J52m1m7n3j0ON5mK65k35K17k28j03k4K81k7j25LJ30l9j20
2838A8J24O1J9k30J86j20j7J54j07K0r0K0nj2r0l3L62l54p2J36k49M14P3m54M95
2863B49l93J21m0O3j30j44P1J82k75M1J78k3J79Q0j99n9j17J55N4J13j81p3J09
2886c9m5R9N4O9l73J19J09L9j53J89j31j90J45N8L10l27j5K42n6l27K19J57k51
2909i8M19l53P5p7M8j21M78j67N9j04l20J50J03Q5n4j24M5K48R4n04N2M24m02
2932d4J16L5j81l5K74k61R3J78L2j40Pj05J82r7k92L16l56J32N02k83m7j30k87
2955c91M29j62K89k09J12o6m8r1OK3j03K9K04K75p38J61K77k36N1J69m9j40J61
2978d7K42l8j81Lk23R7J43O5K4j29J29o3r0J27K4k19N70l56j07J67q4j99M18l64
$$ plain form
2812 33 -37 -120 -3 -60 -35 117 76 29 -24 -34 -28 27 23 288 53 270 42 -61 -85 196 169 44 47 177 138 18
2838 18 142 203 222 -8 178 58 41 195 88 108 18 38 33 21 -69 -102 260 -94 -166 -30 -279 135 208 -246 249
2863 249 -144 -23 -63 0 -130 -274 -203 -21 -296 -255 -77 -100 79 159 -40 -99 -216 -61 -7 106 -75 -148 -39
2886 -39 -84 15 69 138 -235 -116 -7 32 -121 68 -63 -253 -108 -50 260 -67 -82 160 104 -223 -4 153 -98
2909 -98 321 -32 43 -34 14 -107 371 204 263 159 -161 -11 92 177 123 -1 44 292 386 -118 -66 358 -44
2932 -44 72 107 -74 -109 165 -96 -3 175 207 67 74 -31 151 54 -238 78 -278 -146 356 73 26 -104 -391
2955 -391 38 -124 165 -44 68 2 -46 -137 -131 -108 -211 -182 22 297 -441 -280 -3 -239 -188 -19 -68 -208 -47
2978 -47 195 157 -24 -21 -244 -147 -4 61 85 -44 85 22 -68 59 83 -136 434 78 -29 138 54 -145 273 -91
3002i1k3j10L22O2m2r1J07L44l47j09K27j77R7p0J86j16L5j41n7K91l70L02M5
3025B74k19j81L50k03m3np5J12l0r7L4J68j17j44J99m3j75L6J24M7M4k30l9J46
3049f7P1l26K75j06j30K19J84k54K15k41p7K06K9p8K45j57k17K39j12k1J22K6
3071D5j28l4K63j68m34O63l01K69n0k46K35q9m6L19l73J54K22k50Q2k34P3J34
3093A06r7K06L1j36N9J56j62J99k50M0J7j90N16m27K10r5j81l0L02K9p7j51j73
3116i8K14P4l61J5M21l30Q5j49K79j46ok03M69k95k55L07r7k26J49L51n4j82L7
3139aR8m49K81J18m9k4n1K5P4N6l79K18P6m4k3k19K79o9J39k42q1K81M3m65L80
3164b8l62J66K79r0k60L99j38n3J34J21k75m9L46l14K54k67O06o73N44j64Q1q0
$$ plain form
3002 -91 -114 -224 98 160 118 27 134 478 131 22 249 72 169 99 285 169 204 63 6 297 -73 229 274
3025 274 55 -126 224 21 -22 -27 -102 10 -20 -117 -83 85 -32 -176 23 -20 -195 -159 -35 12 56 -174 -213 -67
3049 -67 4 -322 -47 -153 -283 -64 120 -134 81 -160 -237 -31 -2 -80 165 8 -209 30 -82 -103 19 45
3071 45 -83 -117 146 -22 -456 207 -94 175 125 -121 114 25 -21 298 -75 79 301 51 133 -101 -28 106
3093 106 9 215 246 110 169 325 163 362 112 152 169 -21 495 68 278 183 2 -28 274 303 226 75 -98
3116 -98 116 190 -171 -156 265 -65 20 -129 150 4 -2 -205 264 -31 -286 21 -76 -302 -153 198 144 -38 -1
3139 -1 97 -352 -71 47 -2 -26 -77 -52 22 78 -301 -83 -7 -51 -74 -293 -14 -83 56 -186 -267 14 57 -408 -28
3164 -28 -390 -224 55 -35 -295 104 -34 -87 47 168 -107 -156 190 -124 130 -137 469 -204 340 176 257 177
3186A77m6r4l1O7n2J18l06L81k85K93K09k88m00N14r3j7k04J77j15J02o7M2j00
3209a8N3J53r3r9r4M60m50rK10j05j18J67k59M44j17j81p4m3L47l82J6K92m48
3232c48N64%j83kn2J64k15j78M4J11o7K68Q9j85k40J3K0K14l53o3L57l05R6J71
3256h0n1J13P0j81J44l3K3m8l4J23R3q1K5m2j4K18k27k1q6J58j89J82K05l33o5
3281a31K50j20rL25k36k6N1M8m9r8K97k64J2J67Nl26L60j06r3j1r9Q5K6j5j26
3306h3n2k8L26k26okm4J14P8k33K61O0k20o3J12j82J04P6PO4l9r9j24Q8K79j72
3332dj2k48K37R0m4j50J68N3m08N27l06M04l45mj83n5K38N4j50j59J77q4J26J17
3356C9R7k96K65q7k2o3K99n2r6k96L35k1j28Q2p1J12K91l71K6L51l66N5N3p1Q7
$$ plain form
3186 177 131 37 6 73 21 139 -167 214 -71 222 431 143 -257 257 164 147 -57 120 5 107 40 82 -18
3209 -18 35 188 95 -4 -98 362 -88 -97 113 8 -110 57 -202 242 125 -56 -130 -173 174 -208 -192 100 -348
3232 -348 216 216 33 31 -21 143 -72 -250 -206 -95 -162 106 195 10 -230 -217 -197 17 -336 -399 -42 -347 -251 -80
3256 -80 -131 -18 52 -129 15 -18 5 -43 -77 46 139 58 83 41 27 245 18 -3 -89 69 -120 62 267 -66 -131
3281 -131 119 -1 -10 315 79 53 104 152 103 5 302 38 50 217 222 -104 256 150 57 46 -53 32 58 43 -83
3306 -83 -135 -163 163 -63 -69 -71 -115 -1 77 -156 105 165 -55 -118 -6 -188 -84 -8 -1 63 24 -75 -199 -111 168 -4
3332 -4 -16 -264 -27 63 19 -131 37 90 -318 209 -97 307 -38 -42 -225 -280 -42 12 -138 -297 -120 -204 -78 39
3356 39 136 -160 105 18 -4 -67 232 180 84 -212 123 102 -26 56 -15 97 388 17 43 394 28 83 136 65 152
3381A52j17J07J08M2k01k07j4K72j30k03M61k01m0j57L2p0J9J27J22k24r9R9J84
3404F2L2k77J30k66N15m68M16m13J73N6m4K06m41K68NO1J9j18K52l6l50J24J69
3427G5j62R0kl2L8j66K79k17Q9q7J93R6l89L58j29j92j46J97J1L70j44j91L01
3450B40q6L0nj77rK67k83M6j85K04J31k50K07k4l29J43L58j44j39m0K35J01l20
3473b9J2O3P3K01o06N88l20j0L6J23o4l8j72mK53m38K26P7r4L7O4j72K75j82J03
3498BJ22k89J57P3qk04N1m9J47k8J21J80n46L25l73M29Ml35K26L6m02L67j0r5
3522i9J67L9k26j49Q0J54O2J69j7k43n3L74j06J28l62p7L67M3j40j39J61R9k38
3545fj44J51k2n6K60L2j54j24K54J76n59J01L31n5j42Mn8J91J37l37J5q4K90o0
$$ plain form
3381 152 35 142 250 292 91 -116 -130 142 12 -191 270 69 29 -128 -96 -166 -147 -20 102 -122 -221 -122 62
3404 62 94 -183 -53 -319 196 -272 144 -269 -96 -40 -84 122 -319 -51 -46 15 34 -84 168 132 -218 -94 75
3427 75 -87 3 1 -31 7 -159 120 -97 -8 -95 98 194 -195 163 34 -158 -304 -107 -96 274 130 -61 240
3450 240 154 184 179 2 -7 260 -23 23 -162 42 173 -77 130 106 -223 -80 278 134 -5 -45 190 291 -29
3473 -29 -17 46 119 320 -286 302 -18 -28 8 131 67 29 -143 -147 106 -332 -106 -29 -123 -86 -22 -194 81 -101 2
3498 2 124 -165 -8 65 57 -147 -96 -145 2 -26 95 275 -271 54 -319 110 114 -221 5 41 -361 6 -4 -99
3522 -99 68 107 -119 -268 -188 -34 28 197 180 -63 -116 258 152 280 -82 -159 208 251 111 -28 133 232 -6
3545 -6 -150 1 -21 -77 183 215 61 -63 191 367 -192 -91 240 185 43 47 -11 180 317 -20 -5 -89 201 141
3569A41j1j82K49k20j33K86k20J5m5r3K29j22K04K0q6j88R5M5l4J93k09q9J49
3592fj31J11p5j62K4J28R9k51J80R5j42n3J71J9J31j1j80l6M2KJ25j17Lj04M5
3617i3K35j68p7N4o9J02J19m04K62j70L06j44j23O1j78N93k62K83l12%o4J05J58
3640B14J4m2k85L62j65M0n3J49m2m91L77j95K13j12J0LJ31K18k87k7j47J25J8
3663B8j3L7l00K18J33k98Q4J55j10L72j8l21o5J48m21N11n7j13Q6j19J12r8K10
3686A61j86Mj05m5J28O6j22K18k21OK18j76l23L75o5k0j05K0L80k86j36J47jQ9
3710B1O8j6j26K5J78j71n4k12J54J37K5k29K41J7k20oJ20L39k17j61p9K89L5n08
3734c50M81j16J28L04l49q2J8K5q3k0O5P4j43M40m96M3O5K92j42j54j9R9m9k47
$$ plain form
3569 141 130 -52 197 -23 -156 130 -90 -75 -120 -213 16 -106 98 118 32 -156 -61 -16 -50 143 -66 -155 -6
3592 -6 -137 -26 -101 -263 -239 -111 -12 -263 -83 12 -130 -183 -12 7 138 127 -53 -89 -47 -45 80 -37 -34 -138 -93
3617 -93 142 -26 -103 -49 -118 -16 103 -301 -39 -209 97 -47 -170 -109 -287 306 44 327 15 15 -49 56 214
3640 214 228 186 -99 263 98 138 85 234 192 -299 78 -117 96 -16 -6 -3 128 346 59 32 -115 10 28
3663 28 15 52 -248 -30 103 -195 -111 44 -66 306 288 -33 -98 50 -371 140 83 -30 56 -63 49 -49 161
3686 161 -25 -21 -126 -171 -43 23 -99 119 -102 -96 122 -54 -377 -2 -67 -87 -192 -172 208 -78 -214 -67 -68 21
3710 21 89 73 -53 -28 150 -21 -75 -287 -133 4 29 -200 41 58 -162 -168 -48 291 74 -87 -166 123 158 -350
3734 -350 131 15 143 447 98 16 34 59 -24 -44 21 95 -48 392 -104 -61 4 296 154 0 -19 80 31 -216
3758b16M8K67k49J97j11J63j03J25j62Q3j85K56Ok26K68k68l5K0L01k55J67r5
3780dJ48k89j83N07j91J15j32K21j07m6j54k65K56K71k08K44l04K8L51k94p7J71
3802E8m8k09J10N1j05K22j88J5o2K47k9M4q3L4q8j43L85m8q2o7R3K26P9l66p3
3827b7J25l10N4l5O6L62l53K31Q4rl21R2K3r2N1k2L80k06k16J59k6J95n95J42
3851b48J84R2n2O8J89n02L03l9j63M27j84j72J4P6k35K69J13j59J53j33m7L2K37
3874B23k38q9K8j16K78k49K44l7K1m6k75L55O1l09L46k75R4J03j29j3n3R1J92
3897B07j5p5r9J60j66j96K77r8J01n0l1n0L58k36n9J83j45j07J34l6j13Q2J0J18
3921A54k66J85j51q8K38j81K07O4j87r1L71k24J19k67PO4JL40k54J73j99q3k20
$$ plain form
3758 -216 -168 99 -150 47 -64 99 -4 121 -41 42 -143 113 119 -107 161 -107 -142 -122 179 -76 91 -4
3780 -4 144 -145 -328 179 -12 103 -29 192 85 39 -115 -380 -124 147 -61 183 -121 -93 258 -36 -113 58
3802 58 10 -199 -89 -38 -143 79 -109 -94 -156 91 62 106 23 57 -31 -174 211 163 81 14 107 333 412 46 -27
3827 -27 98 -212 -158 -193 -127 235 -118 113 197 188 -133 -41 -18 -110 -59 -81 299 93 -123 36 10 205 -390 -248
3851 -248 -64 28 -24 44 233 -269 34 -5 -168 259 75 -97 -83 -7 -242 27 140 -19 134 1 -46 -14 223
3874 223 -15 -104 -76 -192 86 -163 81 44 65 19 -256 99 160 -149 197 -78 16 119 -10 -23 -76 15 207
3897 207 192 117 18 178 12 -184 93 -5 96 46 15 -35 323 87 28 211 66 -41 93 57 -56 26 36 154
3921 154 -112 73 -78 -166 72 -109 98 162 -25 -116 255 31 150 -117 -110 -46 -45 295 41 214 15 -68 -288
3944b88M57J11l24l18M07j05j18R4j6K6qJ07J41m23K64J91r1l19J25N6m7M6K7
$$ plain form
3944 -288 169 280 -44 -362 45 -60 -178 -84 -100 -74 -82 25 166 -257 7 198 107 -212 -87 -31 -78 -32 -5
$$ [...]
8191F1
##END NTUPLES=NMR FID
##END=
