##TITLE=1H_Pr 5053-Eth
 CDCl3
 8 sc, 
 27.09.2022
##JCAMPDX= 6.0         $$ Bruker NMR JCAMP-DX V2.0
##DATA TYPE= NMR FID
##DATA CLASS= NTUPLES
##ORIGIN= UXNMR, Bruker Analytische Messtechnik GmbH
##OWNER= root
$$ XWIN-NMR		Version 3.5
$$ Tue Sep 27 13:50:42 2022 Russian Standard Time (UT+4h)  she@DPX200
##.OBSERVE FREQUENCY= 200.1313499994
##.OBSERVE NUCLEUS= ^1H
##.DELAY= (6, 6)
##.ACQUISITION MODE= SIMULTANEOUS
##.ACQUISITION SCHEME= undefined
##.AVERAGES= 8
##.DIGITISER RES= 18
##SPECTROMETER/DATA SYSTEM= spect
##.PULSE SEQUENCE= zg30
##.SOLVENT NAME= CDCl3
##.SHIFT REFERENCE= (INTERNAL, CDCl3, 0, 15.7039)
##AUDIT TRAIL= $$ (NUMBER, WHEN, WHO, WHERE, WHAT)
$$ ##TITLE= Audit trail, XWIN-NMR		Version 3.5
$$ ##JCAMPDX= 5.01
$$ ##ORIGIN= Bruker BioSpin GmbH
$$ ##OWNER= she
$$ F:/spectra/data/she/nmr/H-F/1/audita.txt
$$ ##AUDIT TRAIL=  $$ (NUMBER, WHEN, WHO, WHERE, WHAT)
(   1,<2022-09-27 13:49:39.21 +0400>,<she>,<DPX200>,
      <created by zg, POWCHK disabled, PULCHK disabled
       configuration hash MD5:
       00 E9 B6 7A A2 85 ED C7 34 08 36 98 17 FE 4E 26
       data hash MD5: 16K
       9C 10 B7 8A F6 78 29 F0 F2 1A 50 3B 97 E3 5A AA>)
$$ ##END=
$$ 
$$ hash MD5
$$ 16 F9 38 6B 73 A1 F1 3F 2E 44 6E F7 22 0C 43 73
##$RELAX= 
##$RELAX= 
##$RELAX= 
##$RELAX= 
##$RELAX= 
##$RELAX= 
$$ Bruker specific parameters
$$ --------------------------
##$DU= <F:/spectra>
##$EXPNO= 1
##$NAME= <H-F>
##$PROCNO= 1
##$TYPE= <nmr>
##$USER= <she>
##$AMP= (0..31)
100 100 100 100 100 100 100 100 100 100 100 100 100 100 100 100 100 100 
100 100 100 100 100 100 100 100 100 100 100 100 100 100 
##$AQSEQ= 0
##$AQ_mod= 1
##$AUNM= <au_zg>
##$AUTOPOS= <>
##$BF1= 200.13
##$BF2= 200.13
##$BF3= 200.13
##$BF4= 200.13
##$BF5= 200.13
##$BF6= 200.13
##$BF7= 200.13
##$BF8= 200.13
##$BYTORDA= 1
##$CFDGTYP= 0
##$CFRGTYP= 5
##$CHEMSTR= <none>
##$CNST= (0..31)
1 1 145 1 1 1 1 1 1 1 1 1 1 1 1 1 1 1 1 1 1 1 1 1 1 1 1 1 1 1 1 1 
##$CPDPRG= <>
##$CPDPRG1= <>
##$CPDPRG2= <>
##$CPDPRG3= <>
##$CPDPRG4= <mlev>
##$CPDPRG5= <mlev>
##$CPDPRG6= <mlev>
##$CPDPRG7= <mlev>
##$CPDPRG8= <mlev>
##$CPDPRGB= <>
##$CPDPRGT= <>
##$D= (0..31)
0 1.2 0 0 0 0 0 0 0 0.06 0 0.03 0 0 0 0 0.0002 0 0 0 0 0 0 0 0 0 0 0 0 
0 0 0 
##$DATE= 1664272178
##$DBL= (0..7)
120 120 120 120 120 120 120 120 
##$DBP= (0..7)
150 150 150 150 150 150 150 150 
##$DBP07= 0
##$DBPNAM0= <>
##$DBPNAM1= <>
##$DBPNAM2= <>
##$DBPNAM3= <>
##$DBPNAM4= <>
##$DBPNAM5= <>
##$DBPNAM6= <>
##$DBPNAM7= <>
##$DBPOAL= (0..7)
0.5 0.5 0.5 0.5 0.5 0.5 0.5 0.5 
##$DBPOFFS= (0..7)
0 0 0 0 0 0 0 0 
##$DE= 6
##$DECBNUC= <off>
##$DECIM= 32
##$DECNUC= <off>
##$DECSTAT= 4
##$DIGMOD= 1
##$DIGTYP= 9
##$DL= (0..7)
0 120 120 120 120 120 120 120 
##$DP= (0..7)
150 150 150 150 150 150 150 150 
##$DP07= 0
##$DPNAME0= <>
##$DPNAME1= <>
##$DPNAME2= <>
##$DPNAME3= <>
##$DPNAME4= <>
##$DPNAME5= <>
##$DPNAME6= <>
##$DPNAME7= <>
##$DPOAL= (0..7)
0.5 0.5 0.5 0.5 0.5 0.5 0.5 0.5 
##$DPOFFS= (0..7)
0 0 0 0 0 0 0 0 
##$DQDMODE= 0
##$DR= 18
##$DS= 0
##$DSLIST= <SSSSSSSSSSSSSSS>
$$ [...]
##$SUBNAM2= <"">
##$SUBNAM3= <"">
##$SUBNAM4= <"">
##$SUBNAM5= <"">
##$SUBNAM6= <"">
##$SUBNAM7= <"">
##$SUBNAM8= <"">
##$SUBNAM9= <"">
##$SW= 18.0517283424941
##$SWIBOX= (0..15)
0 0 2 0 0 0 0 0 0 0 0 0 0 0 0 0 
##$SW_h= 3612.71676300578
##$TD= 16384
##$TD0= 1
##$TE= 0
##$TE2= 300
##$TE3= 300
##$TEG= 300
##$TL= (0..7)
0 120 120 120 120 120 120 120 
##$TP= (0..7)
150 150 150 150 150 150 150 150 
##$TP07= 0
##$TPNAME0= <>
##$TPNAME1= <>
##$TPNAME2= <>
##$TPNAME3= <>
##$TPNAME4= <>
##$TPNAME5= <>
##$TPNAME6= <>
##$TPNAME7= <>
##$TPOAL= (0..7)
0.5 0.5 0.5 0.5 0.5 0.5 0.5 0.5 
##$TPOFFS= (0..7)
0 0 0 0 0 0 0 0 
##$TUNHIN= 0
##$TUNHOUT= 0
##$TUNXOUT= 0
##$USERA1= <user>
##$USERA2= <user>
##$USERA3= <user>
##$USERA4= <user>
##$USERA5= <user>
##$V9= 5
##$VALIST= <valist>
##$VCLIST= <CCCCCCCCCCCCCCC>
##$VD= 0
##$VDLIST= <DDDDDDDDDDDDDDD>
##$VPLIST= <PPPPPPPPPPPPPPP>
##$VTLIST= <TTTTTTTTTTTTTTT>
##$WBST= 1024
##$WBSW= 4
##$XGAIN= (0..3)
0 0 0 0 
##$XL= 0
##$YL= 0
##$YMAX_a= 363722
##$YMIN_a= -465613
##$ZGOPTNS= <>
##$ZL1= 120
##$ZL2= 120
##$ZL3= 120
##$ZL4= 120
##$ABSF1= 10
##$ABSF2= 0
##$ABSG= 5
##$ABSL= 3
##$ALPHA= 0
##$AQORDER= 0
##$ASSFAC= 0
##$ASSFACI= 0
##$ASSFACX= 0
##$ASSWID= 0
##$AUNMP= <proc_1d>
##$AZFE= 0.1
##$AZFW= 0.1
##$BCFW= 1
##$BC_mod= 2
##$BYTORDP= 1
##$COROFFS= 0
##$CY= 11.3945322036743
##$DATMOD= 1
##$DC= 2
##$DFILT= <>
##$DTYPP= 0
##$F1P= 2.36226072786647
##$F2P= -0.459571619588291
##$FCOR= 0.5
##$FTSIZE= 0
##$FT_mod= 4
##$GAMMA= 1
##$GB= 0.15
##$INTBC= 1
##$INTSCL= 1
##$ISEN= 128
##$LB= 0.24
##$LEV0= 0
##$LPBIN= 0
##$MAXI= 10000
##$MC2= 0
##$MEAN= 0
##$ME_mod= 0
##$MI= 1.114404
##$NCOEF= 0
##$NC_proc= 0
##$NLEV= 6
##$NOISF1= 3.799351
##$NOISF2= 2.8
##$NSP= 1
##$NTH_PI= 0
##$NZP= 0
##$OFFSET= 15.70392
##$PC= 1
##$PHC0= -18040.33
##$PHC1= 21.20069
##$PH_mod= 1
##$PKNL= yes
##$PPARMOD= 0
##$PSCAL= 0
##$PSIGN= 0
##$REVERSE= no
##$SF= 200.130013532006
##$SI= 16384
##$SIGF1= 3
##$SIGF2= 2
##$SINO= 400
##$SIOLD= 16384
##$SREGLST= <1H.CDCl3>
##$SSB= 0
##$STSI= 0
##$STSR= 0
##$SW_p= 3612.71676300578
##$SYMM= 0
##$S_DEV= 0
##$TDeff= 0
##$TDoff= 0
##$TI= <>
##$TILT= no
##$TM1= 0
##$TM2= 0
##$TOPLEV= 0
##$USERP1= <user>
##$USERP2= <user>
##$USERP3= <user>
##$USERP4= <user>
##$USERP5= <user>
##$WDW= 1
##$XDIM= 8192
##$YMAX_p= 0
##$YMIN_p= 0
$$ End of Bruker specific parameters
$$ ---------------------------------
##NTUPLES= NMR FID
##VAR_NAME=  TIME,          FID/REAL,        FID/IMAG
##SYMBOL=    X,             R,               I
##VAR_TYPE=  INDEPENDENT,   DEPENDENT,       DEPENDENT
##VAR_FORM=  AFFN,          ASDF,            ASDF
##VAR_DIM=   8192,          8192,            8192
##UNITS=     SECONDS,       ARBITRARY UNITS, ARBITRARY UNITS
##FACTOR=    0.0002768,     1,               1
##FIRST=     0,             0,               0
##LAST=      2.2672688,     0,               0
##MIN=       0,             -465613,         0
##MAX=       2.2672688,     363722,          0
$$ Real data points
##PAGE= N=1
##DATA TABLE= (X++(R..R)), XYDATA
0@%%%%%%%%%%qJ6j6J6k4L2m0N6o4P2q8J07j31J53j78K10k47K87l30L80m36M98
32B65n68O46p31Q24r26J038j164J300j447J611j788J982k196K429k681K956l259
49a709L588l950M354m799N293n844O463p161P958q881R961j1242J2791j4714J7173
64I281k0446K5041l2005M3932o9772K25620k44525l83659N03611K38484k73933
75B1629k14686J66818Q3515J6173O571j10331j73160J53389K67481r2453l29084
86b04138L6452L18855M5329k94269j08837K03398J52153r3618j18784o485O1504
97h440P1117J2426j21637p9182J40622J35216j24109j35946R3848Q9580p8974
108e479k2271O3440n4056n1799J38529N4737k04393p9744K22189Q5041k07205
$$ y = [0, 0, 0, 0, 0, 0, 0, 0, 0, 0, 0, -8, 8, -8, 8, -16, 16, -24, 32, -32, 40, -48, 59, -72, 81, -97, 113, -134, 153, -177, 203, -233, 265, -303, 343, -388, 436, -490, 548, -616, 684, -763, 848, -940, 1042, -1154, 1275, -1406, 1550, -1709, 1879, -2071, 2283, -2516, 2777, -3067, 3396, -3765, 4193, -4688, 5273, -5969, 6822, -7892, 9281, -11165, 13876, -18129, 25803, -43969, 181651, -62874, -446533, 57078, 295562, 21629, -193057, -26239, 57276, 73449, 80020, -30311, -203471, -50082, 217399, 124946, -204138, -167686, 151169, 196498, -97771, -206608, -3210, 148943, 55325, -63459, -69944, -8440, 62677, 75103, -46534, -125716, 14906, 150122, 26013, -109933, -16085, 73495, -5479, -27750, 35690, -18366, -70165, 68364, 123101, -81292, -161036, 61153, 146194, -61011]
119f1011o3881J81371K7714j38276K3928Q1846j00034l8811J80607K6202k26416
130a06761k1345K42645K0034k36251l0639K02710M7414j36904m3627O5991J5561
141A8828j3669J4579k6712m9397N2805R0382n6163j24855L6488J31151k2302j17912
153f6777J8087R6850j4892n9480J4994Q025k3922M1644L6012p2898l0007R5614
165D3250J3540j07766M954J03783k8691q6150N8299P1930q1679o2655Q5136M5071
177E9022q0057k6370O9216P869n0643J1916K6588m2250j1150P2291Q455r3251
189d8364r093J08231J5883j14506k7580J06051L9993p7675l8619M4237K6737j0390
201A4905p992k2182j8075M7353M8786n8519p5511N4105Q7386m5864q8590L2347
$$ y = [-61011, -124892, 56479, 84193, -54083, -30155, 51691, -48343, -87154, 93453, 119655, -106761, -128106, 114539, 134573, -101678, -132317, 70393, 117807, -19097, -62724, 3267, 18828, 5159, 19738, -6974, -56371, -3566, 86816, 30653, -94202, -57714, 73437, 51135, -66777, -48690, 48160, 33268, -26212, -11218, -3193, -27115, 14529, 50541, -22357, -52364, 43250, 56790, -50976, -46022, 57761, 29070, -57080, 1219, 73149, -8530, -71185, 13951, 59022, -21035, -47405, 21811, 29680, -20963, -9047, 17541, -24709, -35859, 36432, 44887, -48364, -57457, 50774, 66657, -47849, -75429, 30622, 70615, -7060, -45679, -1442, 25295, 14905, 6913, -15269, -33344, 14009, 62795, 4276, -71235, -17130, 70256, 24392, -64198, -31851]
213c1851P5444j6858m9068L788J0709J844K6743q43n5895o39P7093N246q3733
226c8020r226P6747J1243n7612o328L8097o23j8115Q939L42j9817R877K9558j4038
240A1024l6409J2124L7267j1952l6425J1535L0133j4185k0577J9494Q575k6600
252a5996J948L3066j0014l4583J8043L3474k0306k6553K0901J6268j7896l013
264d661J6127r464j3829K0435J1853k9338j2376L3439J2372l4935j2893L1142
276G872J0218k6669p142J8576J237j0355O578J641j4320O376K2086j1638k6558
289b2098J6096K9694j5688k8274J4415K5338j1308j8246P626J0221l945k389J848
302C290o743j873J3592K184k0452m369K2961N597k4576p170K3204N827j9516k650
$$ y = [-31851, 43593, 26735, -22333, -18545, -7836, -5992, 20751, 19908, -35987, -36626, 40467, 45713, -38020, -47246, 29501, 40744, -16868, -23196, 14901, 14278, -3837, 5102, 5444, -14373, -4496, 25062, 11024, -25385, -13261, 24006, 12054, -24371, -12836, 17297, 3112, -17465, 2029, 10604, -15996, -14048, 19018, 9004, -25579, -7536, 25938, 5632, -20921, -20, 16248, -1648, -4661, 11466, 2002, -11827, 8608, 20461, -8877, -21253, 12186, 24558, -10377, -23270, 7872, 18090, -8579, -15721, 2855, 4092, -6263, 315, 1956, -12364, -5988, 16098, 4460, -22098, -6002, 23692, 8004, -20270, -5855, 19483, 8175, -10071, -2445, 7776, 3831, 1442, 3290, -3453, -5326, 8266, 10450, -10002, -14371, 8590, 14187, -10389, -17559, 5645, 11472, -8044, -10694]
316a0694J3333q18n995N728j82q609O524J2073r597j2973J2440J3021j1875j1949
330i573J0583R828q952p597P272L927o719j163M820k648n219N439L843q547l558
345h264J0868J928j1766M21J1184j872q800L486P453m399l197N606J011n226J575
360HN473k724m769L273M139l911l860L530J971m271k43L689k775m946M653M615
376C852p013n007P489M901o313l447L594K825K06q37k446J26N334J944m553l247
392b592J999M871J937n668n488O161Q139n823j0032K066P949O39m242m380j719
407f183P629N156j0221r366J1049J0559q511p518N794L110k123K320n90p121M895
422a121J1719l784j3524J023J2613J535r955m262O338P953k768j0371j883P891
$$ y = [-10694, 2639, 1821, -4174, 1554, 1372, -7237, -713, 11360, 1763, -11210, 1230, 14251, 2376, -9573, 1010, 10838, 1886, -5711, 1561, 5488, -1231, -2394, 2426, -222, -5441, -2, 3841, -4706, -8264, 2604, 4532, -7234, -6813, 4371, 2499, -6301, -2815, 4638, 239, -2958, 2648, 3659, -1567, 8, 5481, 2757, -2012, 1261, 5400, 1489, -2371, 1159, 3130, -1141, -1384, 2305, -470, -5416, -763, 3852, -3161, -8168, -679, 4222, -2091, -5538, -1944, 881, 1087, 250, -2196, -2070, 3264, 5208, 655, -2592, -593, 4278, 6215, 547, -4941, 1220, 9359, 3536, -6496, -4430, 3519, 4158, -84, -4464, -6183, 1446, 6602, -3619, -12985, -1936, 8623, 112, -7406, -1612, 1498, -625, 1695, 1105, -6016, -1121, 10598, 6814, -6710, -5687, 6926, 8461, -1494, -5756, 582, 8535, 5767, -4604, -6487, 1404]
436A404K043n966L34L461k863j451N470k629j0355L969J5328k671j4660K558J3276
451G248j896j0988j74P866L481j270k722j622J794n50l550L713M188o795k404
466c681J3107j349k1744J054K3449k936k2031P910J9976j0239j7032P770R814
479D068p275j871R301J913p193l989M364N987m179r275Q139J6702r386k0379J0540
494b533J7803j6984j5544K1645J4091k1088q793J8095Q2j9323J598J6800J08r516
508c559j80N473P30n980o360N692J2123l302r900Q740Q135j8420r407K4130Q592
523A6507k5715j702L1117l029l4522J536K8410k564k0940M666J6989k920j2633
536d800k995M711J805l340K821J0497l058j7293M137K0558j1336k5648K0266L1899
$$ y = [1404, 3447, -2519, -2185, 1276, -1587, -3038, 2432, -197, -10552, -6583, 8745, 6074, -8586, -6028, 7248, 5352, -5636, -5810, 2056, 5537, 4267, 1545, -77, 1717, 1167, -2383, 1330, 5518, -1277, -3681, 9426, 8077, -13667, -12613, 10836, 7900, -14131, -6221, 13755, 3516, -13516, -5746, 4068, -3207, -5078, 4223, 6136, -1057, -5046, -682, 5305, 1126, -8149, -10, 16692, 7306, -13073, -2533, 15270, -1714, -17258, 4387, 18478, -2610, -11403, 6692, 6774, -12549, -10951, 5849, 5957, -3559, -3739, 1734, 2464, -3516, -9876, -4184, 7939, 4637, -5263, 3477, 11612, -6808, -16215, 7915, 16507, -9208, -10910, 20207, 17178, -17344, -15808, 12602, 10038, -10902, -6236, 10753, 7833, -4800, -7795, -3084, -1279, -4619, -1798, 8699, 5641, -11652, -7515, 13043, 1707, -23941, -3675, 28224]
550B8224k0563k8972K1575K0548k5129j4096K2791R637j3481l04O327p105o110
563f658L228K605L669J084p114J451J0705r750j8641J3195J9991j4308j2663K0507
577G301Q043k5323n705K2048J429j6813O210J7698m872j6880j825J1216N477q686
591f82p271J1866J2030j2902j5642J0000Q701j2681n19J8021l809j9387R326J6268
605A3319j8597j7171K2696J8473j8460j3173J5211P320j1530n522M542L820N272
618F200J444o833k455L812l100k937O993O56p669O638R432j3825j3434J3181J0586
633H689j1392m812J0672K010p200r73n83l175N043O578j883k216n16l435K961
648b32N971q068p838J5995J1985j7579j2963J4742P468j2586k976Q904j49j854
$$ y = [28224, 7661, -21311, 264, 20812, -4317, -18413, 4378, 14015, 534, 230, 6557, -548, -6658, -3430, -825, 2844, 3928, -3186, -1735, 8970, -780, -19421, -6226, 13765, -543, -13206, 7301, 15344, -9979, -15684, 6364, 7793, -9020, -2810, 14888, 10016, -6864, -8689, 2527, 8004, -682, -7953, 3913, 15943, 3041, -12601, -2601, 6100, -6581, -7100, 10921, 7112, -12275, -2949, 13319, -5278, -22449, 247, 18720, 260, -12913, 2298, 9618, -1912, -7434, -2892, 928, 6200, 7644, 811, -1644, 2168, -932, -3869, 3124, 3780, -3889, 2749, 12181, -1644, -15078, -1897, 8689, -2703, -7515, 3157, 5167, -2033, -3006, -3589, -6764, -1721, 4857, 2974, 758, 242, -3193, -232, 5739, -2329, -10167, 5828, 17813, 234, -12729, 2013, 9481, -3105, -6081, 2823, 2674, 820]
662H20M953n921j1510O826J2760n416j0577M161Q599n32o076o059J342J0616M554
677H540j0607m941J0761N044r849n709N309N353J198j037m826k344N889K590q384
692c013l306P766L690m136k997n43j77K741Q21m923J12Q216k85q633k06P242j370
709I99l940L416K587k935R29J981l229j899M485N48l848J800K757l069k393K175
725C64J2j853J698Q59k423K18J694k224j968K976J116k480J106K605k249j152
741a701K141J45j492K065O81j495M43J403j743p08K275L35k872M11K372j168k220
758a128K75J36m2P27n2k112K79K578n57k615O0K572N00j054j123N99K071J012
776B126j853j922K152K812j141k843J95K260P87j955j548P74J624j83j642j201
$$ y = [820, 5773, -148, -11658, -4832, 7928, 2512, -8065, -3904, 4695, 4163, -1913, -7972, -6630, 3986, 8540, -2067, -7008, 3753, 8797, -1052, -6761, -1452, 3901, 5099, 4062, -764, -3108, 2781, 5371, -3013, -6319, 1447, 5137, 1001, -1996, -2539, -2716, 25, 846, -4077, -3965, 4251, 3966, -4667, -4873, 2369, 999, -2941, 475, 3062, 127, 1056, 3037, -192, -2091, 2394, 2942, -906, 894, 3651, 582, -1811, 364, 376, -1477, 221, 1080, -1343, -1125, 569, -1655, -3623, -647, 469, -2011, -905, 1700, -549, -1701, 440, 585, -907, 1158, 1839, 344, 787, 2190, 447, -261, 2014, 2349, -523, -112, 2260, 1092, -1128, -853, -717, -759, -32, -84, -2196, -1917, 661, 104, -2511, -2451, 121, 621, -433, -1556, -957, 1114, 2126, 273, -1649, 503, 3315, 2174, -669, -474, 1786, 2573, 618, -930, -156, 1468, 1285, -357, -1558]
792a558P90J458q22j837m11J801P30j119j070M04J640O70j706m82J811J547j466
809C80j333J614J708j497n68O94O17l73k50o61k10O88L98j345r22J85J001l53
827b27j238k30J244K62o93j051O35J157K77l05p97M62J305M86j282m69J637P71
845A944j464j02Q39m31l14J226p55j938L51K067l25k658k12J993K62j697m52N32
863a134P3L62N74r17j242J878K298j116k990J226L167j1k442K2J044J120L14j222
881A004k136J50L280Q17l768k473L072L438k782m376J497L637r24k179O69J32
897i42j025K510J731m788k727P144L588o256l660N207L245l020j704O88O86J626
913B303O47k714k925K819K814j823k735p5J373J989L11m385l022M811M877l818
$$ y = [-1558, -768, 690, -132, -1969, -2380, -579, 151, -968, -2038, -1634, 6, 676, -1030, -1512, 299, 1846, 380, -953, 661, 2369, 872, 304, 998, 1615, 1242, 992, 331, 121, 809, 1207, -138, -1060, -875, 126, -227, -1465, -1695, -451, -189, -882, -1933, -1298, -141, 136, -169, -966, -504, 801, 1287, 5, -464, 1173, 1944, 480, 378, 1217, 786, 472, 1698, 943, -995, -644, 1423, 1098, -1560, -1772, 221, 483, -1214, -1666, -1134, -1061, -699, -125, -1042, -2284, -406, 1892, 776, -2214, -988, 2179, 2168, -274, -252, 792, 1912, 2226, 1004, -1132, -982, 2298, 3115, -653, -3126, -54, 3384, 602, -3774, -2277, 1360, 436, -1743, -1074, -942, -1967, 543, 2274, -2514, -5241, 1903, 5491, -765, -4425, 782, 4027, 1007, -697, -9, 677, 2303, 2950, 236, -2689, 130, 2944, 1121, -1614, -1689, -316, 1673, 1984, -2401, -5423, -612, 4265, 447]
929D47n514K140N699M1n452j935M403L934j661l419J116J047r34J789J813n404
945a890k565R482M122j2496o251J2749N689j2303m537J0740K513p850k07L874
959A070m127j129O849J066p603n87P206J289o121l824M222P268K5p796k143P369
975C034K123o843j917N249J368k007J181j033m638P11N077j48m619p37M020L337
991D158l095p848n56J1215K878j1551k046J2614O96j2642J657R685n314n210J1685
1006F326L085j5192j576J5572r65j6261K528J5469j090j1801p10N847K70l432
1020a930j295K465K430j040r13J156k444n197M276R072m248q522O024Q378p632
1035E80q321N824N925j570q50J27k134J735J418n203j985P021J308m875K724J969
$$ y = [447, -5067, -2927, 2772, 2813, -2639, -4574, -171, 3763, 2102, -1317, -201, 846, -88, 1701, 3514, -1890, -4455, 5027, 9149, -3347, -9598, 3151, 8840, -3463, -8000, 2740, 5253, -2597, -2804, 1070, -3057, -4186, 2663, 3729, -3874, -4461, 2745, 4034, -2087, -5911, -1689, 5579, 5604, -2192, -4335, 3034, 5157, -1686, -3603, 1646, 3014, 1007, 2188, 1155, -3483, -2772, 2305, 2157, -2462, -3199, 821, 4158, 1063, -6785, -7341, 3874, 6752, -4799, -6845, 5769, 6465, -6177, -4520, 5165, -149, -5359, 6326, 9411, -5781, -7357, 8215, 7250, -9011, -6483, 8986, 7896, -3905, -4615, 1232, 1502, -1930, -3225, -760, 1670, 630, -283, 873, -1571, -6768, -2492, 6580, 2332, -6190, -166, 8212, 580, -7741, -1917, 4008, 2438, 1588, 1715, -419, 1316, 2734, -2469, -4454, 2567, 3875, -1000, 1724, 3693]
1051C693r311j731J2715j260j3406N304J5037p176j4536O681R964p339n081R472
1065C026K933p432l75N607l157n841L697P602n47o816j284N390J522p671l104
1080f450Q343L995o800j139N453l792n727M949L702n489K63Q567k812q470K072
1095c335N173l218l49N312j951l073N365m18r470K077R854l138o548O671L596
1110F548r012k342P307j849n845N804N437o025m968M566J967m538j005L635K921
1125B601q62k610p2J567j604k728M552M002m374k086N591r20p940K008Q104l482
1141A747n248O180K958p976j679O568k406n357N771M822o893k830N893q73n940
1156e263L491N231l740k129M977q05n420J681M604k110j904L556J767l821j225
$$ y = [3693, -5618, -7349, 5366, 4106, -9300, -3996, 11041, 3865, -10671, -3990, 5974, -1365, -6446, 3026, 5959, -1473, -1848, 3759, 602, -5239, -1542, 6060, 5513, -1303, -2587, 2803, 4325, -3346, -6450, 1893, 5888, -912, -2051, 3402, -390, -6117, -1168, 2534, -2955, -2692, 5875, 3063, -5407, -3335, 1838, -1380, -1729, 3583, 1632, -1441, 3924, 3506, -5964, -3887, 5967, 2829, -3719, 2952, 6548, -2464, -4806, 2501, 652, -5193, 611, 6048, 23, -4945, -379, 1588, -2950, -3955, -320, 2601, 1739, -871, -943, 624, -980, -3708, 844, 4846, 472, -1614, 3977, 3057, -4883, -2875, 5229, 1747, -3501, 2679, 5637, -2339, -4018, 2550, 144, -5213, 558, 5380, -1513, -4343, 1550, 677, -5263, -1772, 3459, -281, -2410, 2567, 1762, -3658, -1977, 2627, 517, -1387, 2169, 3936, 115, -1110]
1171a110J245M29r71Q17R75J18j241j495J244L41k709J35M147l57m525J660M155
1188B858m529l453O006K346n693O72O001l502n059M887L346n805m39O721j007
1203C350o378K743L903l839k839M624J221l831j46K986k151k388J962J899j599
1218d83j315J899Q16j727j011J675J259j444n69K111L84k204k44K803j191j902
1234a143J836K816l722j734L909J37m400J175L761k184l257L408J722m128r93
1249b797M239m56l651J700L023k734k215L507J010l143R8L289m00k589J152J749
1265A782j023j906J839J560k277r32K099K07k045m77K321m13k323Q66J873j939
1281g88j647K545J237k738n14K815k06k359R38K215j257j691J963J228j815o73
$$ y = [-1110, 135, 564, -407, 410, 1385, 1503, 262, -1233, 11, 352, -2357, -2222, 1925, 1568, -2957, -1297, 2858, -1671, -5124, 882, 3228, -2465, -1793, 4208, 706, -4353, 534, 3880, -1925, -2364, 4357, 3350, -3028, -285, 3618, -221, -3060, 1564, 2785, -1046, -1192, 1794, -357, -2745, -783, 1116, -483, -1798, 101, 917, -810, -1821, -146, 1113, -331, -900, 1211, 1595, -609, -853, 1950, 759, -1143, 693, 3509, -213, -1947, 1962, 2099, -2301, -1126, 2635, 451, -2806, 602, 2324, -1804, -2797, 1442, 986, -2665, -965, 2058, -676, -2891, 616, 1626, -1517, -1419, 1870, 1470, -1119, 33, 1782, 759, -1147, 692, 2252, -25, -957, 1142, 1349, -696, -1173, 1148, 735, -1588, -722, 1151, -788, -2435, 110, 1347, -1391, -1905, 910, 704, -1655, -717, 1498, 241, -1450, 513, 1741, -74, -747]
1297g47K238m03j275K98J827j446j435J540Q22j707q39J630m0j709O14J329j478
1314g81q17J535N25j873J81J694j55j658O37J630m98j165J074J073j188o48J295
1331H61P16j903k71J946k01j991K46J994j099j605J150O55j355j23O63M75j139
1348i81J92P83m34m00K00Q96k97k22J43O85n92M43N57o21k39Q19J2j140L87P32
1368I23l95q78J90P77n31o58M64N4l17m31M00jm98k87J066K47q36q5R93L99j094
1389d98J25J102k51m19M15K82l52J29k36J35l35N28n62l69P35r9j313L72J387
1408G76j012j035J146O79j482k97J123O3q66M26O00L2m22K62k60O94P1p82M27
1427A43J492r13j610J266J567j792j657K356J006k525k93J638n04j845O83J711
$$ y = [-747, 1491, 1088, -187, 111, 1938, 492, -943, 597, 1419, -288, -1127, 503, 463, -1246, -632, 697, -781, -1598, -63, 462, -1411, -1230, 464, 309, -1349, -712, 918, 420, -745, 329, 1402, 214, -434, 861, 1577, -326, -597, 1349, 1148, -843, -597, 1397, 298, -1307, -157, 498, -857, -980, -317, 158, -981, -789, -6, -440, -840, -640, 256, -41, -263, -120, 565, -27, 416, 973, 352, 113, 932, 944, -196, 191, 923, 528, -350, -160, 617, 86, -572, -108, -54, -371, -802, -402, -403, -901, -1188, -122, 125, -711, -796, 197, 596, -498, -373, 729, 478, 59, 474, 756, 404, 533, 297, 432, 97, 625, 63, -306, 429, 330, -983, -611, 776, -236, -1271, -125, 554, -928, -1225, -102, -39, -905, -479, 121, 153, -269, -7, -267, 427, 498, -284, 143, 1635, 722, -888, 378, 1945, 153, -1504, 852, 1858, -667, -960, 678, 174, -1671, -988, 723]
1443G23o10j044K40Q25n6j081m85J288J544j367j227K017J013k705o11L294J48
1460A906l239J163L075k166k771K150J750k610l19J952N18j879j97M1k11O91l32
1477d78m56J571Q15k875l78K842o51k949K052L660k530k857L217J068l107o39
1493a695L192M68j702j0O78n50p38o94J59J706M57k410M61K411k528k808L481
1510a22K512l920j098N172m20n275J172L795j765j981L063J722k799o36J388n69
1526B39o48Q71K27K2J202j579j984J617O90k424J84L865l21m057Q35K219k257
1543a299j912L160J393j767K44J221j118j246Q05K20P27J350n99j562J628K4l380
1560b111M08M371j152l377K691K342m074k487M028O14l883J711M064k667l183
$$ y = [723, 113, -931, -691, 134, 78, -1003, -1488, -200, 1344, -23, -1250, 767, 1780, -925, -1536, 1758, 1906, -1333, -170, 2905, 739, -2032, 118, 1868, -742, -1061, 891, 1409, -470, -667, -626, -837, -146, -478, -934, 637, 1452, -1423, -1801, 1041, 390, -2559, -507, 3153, 623, -2234, 983, 2051, -1056, -1695, 1497, 1965, 263, 253, 931, 381, -357, -1051, -892, 814, 1271, -1139, -678, 1733, -795, -3603, -122, 2390, -1530, -2628, 2544, 2124, -3151, -1979, 1816, 51, -1930, 1133, 2855, 56, -580, 808, 239, -409, 462, 689, 711, 1913, 334, -1650, -33, 657, -1767, -1583, 2282, 1961, -2096, -1261, 958, -1299, -3211, -51, 1342, -425, -181, 1040, -78, -1324, -519, -299, 428, 1778, 1179, -383, 1245, 1269, -2111, -1703, 2668, 1516, -1861, 830, 3172, -902, -3389, 639, 1253, -2630, -919, 3145, 478, -2705]
1575b705K330O05k343J033K576p49r57J102r07j012J335%j047K002J431k533q45
1592f84K195j531k512K319K338k293j97K009j700k503J632J148j348J442J246
1607A561k098j056J869r73j969K576K369k556k12K971j738l418K046K998k490
1622a20o78L262k50l286Q6K090j169j505K481L72j534j61O12j091o42J073K50
1639b10K41M87l39j007O69O9j187P35K183j015j139J808Q3k412K21K031q59r47
1657e88K500q6l136N47J865j776j128K962J12k594P05K077k686j029K550L46k319
1674a678J638J791k047j499J748M72j130O73J530q17p66P79m06o76N83K80j46
1691C29P39n30j090N36L90j346KJ729k37j627Q59Q48j552n63J759J05j504J030
$$ y = [-2705, -375, 230, -2113, -1080, 1496, 747, -210, 892, -15, -1027, 308, 308, -739, 1263, 2694, 161, -684, 1511, -20, -2532, -213, 2125, -168, -365, 1644, -56, -2559, -927, 221, -1127, 315, 1561, -537, -1593, 276, -697, -2666, -90, 2279, -277, -489, 2482, 744, -2674, -628, 2370, -120, -798, 2464, 2214, -1072, -986, 1104, -65, -1570, 911, 1283, -251, -412, 200, -891, -1533, -460, -210, 31, 518, 179, -828, -159, -90, -1277, -542, 1641, 626, -513, 1295, 1378, -1034, -813, 1218, 359, -588, 1912, 1826, -1310, -763, 1102, -674, -1802, 1160, 1272, -1322, -617, 1460, -1226, -2255, 295, 641, -1678, -40, 1751, -296, -1795, -47, 425, -705, -32, 1498, 681, -85, 694, 288, -388, 195, 475, 329, 1068, 538, -552, -16, 374, -972, -970, 759, 522, -1105, -246, 602, -950, -1513, 246, 351, -1153, -123]
1709a23J538j486q41J260K16j217N90J615j020r84J165J13j524K08J498p03p67
1726d62J142Q2j303j12Q76l60n65M08M49o01nj63L05J20J64%K94K56q22O8Q22
1747E93m13k68Q63J04q53l45J089k21j312P56J021r48o66J165K2j564O78M70o73
1766e02n96J076N68j143j03J129n59p10M56J046n36n74O64L74l80l83Q38J78o25
1785B18l32Q01l98n55K30N89l08o39N11J18n16k55N38j86m46J76L80l5m18K94
1805b33M30m11l66J003j28p86O93N10m00m52Q46K5p99j05J079k03j301N78O12
1824E92n69q75P89P22j073k92Q27J00j089JJ131k36q47M60P50l41m53J94R31p33
1844a1q5N69L19r12L54M98m02k28L8L72n70pK54j63n78K81M28m54j75K36L72p61
$$ y = [-123, 1415, -71, -912, 348, 564, -653, -63, 1552, 532, -452, 713, 826, -698, -490, 1008, 305, -462, 680, 762, -541, -653, 223, -137, -702, -294, 155, -446, -451, -614, -309, -189, -25, -25, 269, 525, -297, -229, 593, 180, -88, 775, 879, 26, -319, 770, 549, -763, -7, 1014, 66, -600, 565, 587, -977, -299, 171, -502, -1098, -22, 546, -597, -700, 429, -130, -840, -384, 662, 126, -448, 216, 590, 210, -173, 665, 843, 218, -114, 687, 289, -266, -36, 553, 245, -394, 117, 235, -281, -536, 2, -184, -630, -454, -74, -109, -527, -233, 197, -214, -580, 423, 295, -491, 202, 712, 312, -140, 706, 731, -68, -173, 906, 703, -598, -20, 592, 23, -852, -63, 659, -414, -706, 121, 221, -868, -867, 264, 28, -819, -359, 391, 50, -403, -209, 722, -11, -96, 473, 792, -120, 234, 732, 330, 102, 140, 512, -58, -65, 189, 26, -552, -271, 157, -297, -472, -236, 136, -625]
1866f25K60N87j81q44N86R70p24n63P28N55p61k20Q27K28p09j90P19k39p00n5
1886c51J020m26m68J93K24j87l25K74J52j81n32K81M08n59K80k2l5J1K15L05p02
1907d25O04L24m72R5M56Q3r81M11P56m43q01L42Q94r79m76J005r3r10n9Q27m40
1928b82k33j00L41K99m94j07O48L73p17k89P53M66j190L2J356j76j174O51O47
1947H04r72m00R34L79p71N2J06J42n20p4O8K3O70o11m71N52L54j150k3J539m05
1968B26p41R25M78j165p72J353O07j117l48J582p34n83M52q2R7K68j66j9j6R5
1988C40j022j2J169q62p59J021J296j702r02J978j30j451M60J546o23o36M72R8
2006B81o16J13M45K40K73o2p34J13L86r11l84J324N17j632J75J287p68j872J585
$$ y = [-625, -365, 222, 41, -803, -217, 753, 29, -534, 194, 749, -12, -232, 595, 823, 114, -76, 643, 404, -296, -351, 669, 243, -225, -32, 192, 5, -320, -46, 106, -75, -607, -326, 82, -477, -197, -219, -254, -243, -28, 277, -425, 179, 503, 31, 126, 582, 665, -316, 95, 851, 408, -393, -51, 843, -136, -612, 393, 300, -610, -669, 158, -282, -515, -615, -274, 25, -469, -576, 72, 445, -272, -561, 192, 658, -532, -500, 856, 680, -494, 157, 804, -168, -568, 366, 745, -26, 26, 132, 274, -246, -320, -252, -229, 441, -170, -641, -89, 265, -885, -908, 631, 226, -515, 410, 888, -277, -1049, 304, 911, -206, -554, 1028, 294, -289, 163, 81, 178, 446, 280, 261, 245, 340, -682, -694, 475, -387, -1146, -125, 1171, -531, -1433, 545, 415, -1036, -576, 970, 347, -289, 183, 281, -335, -222, 223, 463, 736, 674, -60, 53, 439, -472, -856, 468, 985, -647, -472, 815, 47, -1825, -240]
2025b40J081j411k58J537k01j626P34P91o47l01J182j84n31N14m71p78Q33O22
2043F46q18N2J434m95j840Q22O37p62m84J380L06j285l8N69o49l87P71J59L7J94
2063B49l45m40J23K32q39R82J196q06j023J309K82k177N44J970n33j701J706R66
2081A695k435o07J653k61q94J124P79j332l19P37o80o57J090L53o47P52O16j506
2099e39j79J127m78o17J084R48j065k64R1l17m89O18M45Q8J40j62n82m59Q15n44
2119c39k92J179K81j486L19P80r49j272J707J052j350n4J594m97k082J162J131
2136H84j157m24J797k8j421K67P34j226J52R68k72l08M97m48q93N22M31m51j03
2155d79J027k93r32O89l89k31N60L38k50N0P07o80q23R11J9p13P40J251j202q11
$$ y = [-240, 841, -570, -828, 709, 508, -1118, -384, 407, -240, -541, 641, 457, -74, 440, -31, -809, 24, 646, -172, -120, 1314, 819, -1021, -199, 438, -324, -808, 572, 878, -407, -445, 124, -525, -912, -141, 18, 55, 249, -96, -536, -413, -181, -1020, -38, 1158, 352, -671, 638, 920, -1257, -713, 1257, 724, -977, 729, 1695, -740, -1347, 306, 45, -849, 275, 1054, -278, -597, 140, -540, -1197, -107, 246, -401, 351, 967, -539, -718, 409, -69, -686, 398, 1346, 281, 17, 108, -209, -698, -80, 365, 453, 593, 431, -151, -610, 205, -339, -631, 548, 829, -657, -338, 442, -507, -1779, -72, 980, -370, -424, 1170, 673, -1409, -247, 884, -273, -697, 1100, 1072, -349, -82, 652, -574, -422, 546, 274, -34, 463, 15, -878, -356, 75, -376, -479, 548, 255, -677, 12, -377, -608, -48, 290, 40, 90, 797, 117, -706, 205, 224, -489, 251, 1502, 300, -511]
2175e11P79N25j542J72J555l31j351J027K26j270m41J189p5p23Q62M32n25n08
2193e10M36l9r0L79J63j5j69N2j66r0J66J68k34K51K89l39l75J0k93L3P44n24
2215a53j63M35J8q24J97Q44n43m41J135J20r37j95R17k53p90O71Q06r04n38Q01
2235B03N37r29J0R39o58k30M11K08p51R4J77j65n7j52J85K17j90j94j15M35p7
2256a02n4J40j2j74PL25l39Q9M08k21j30K75L88o18ON26k86m12J45N77m25k15
2278a02J54Q4k50m77O47p5m93J61M81Ko45L99K19j99M4J04K89n57K4L46l5k8M6
2301A39K86m46J13Q6P4j94j71K46j08l68M16j51J2r2k05K76k30PM19k75j11J6
2323b61N26k76k78L41L89m68j49J19M48k83kL30l09l98N93r0j95Q0J0j27P0l15
$$ y = [-511, 268, 793, -749, -577, 978, 647, -704, 323, 549, -721, -1162, 27, -48, -771, 91, 523, -2, -510, -74, -113, -203, 176, 339, 324, 155, 207, 41, -49, 117, 285, 51, 302, 591, 252, -123, -113, -406, -373, 371, -153, -316, 119, 137, -687, -490, 354, -189, -630, 505, 625, -312, -507, 410, 157, -633, 38, 844, -60, -598, 203, 740, -189, -179, 760, 102, -128, 283, 491, -260, -166, 11, -154, -211, -363, -178, 39, -151, -345, -460, -25, -102, -156, -16, -28, -202, -195, 130, -209, -120, 288, 67, -63, 212, 600, -18, -12, 514, 228, -184, -39, 538, 113, -102, 52, 136, -114, -591, 56, -19, -512, -351, 130, 132, -513, -114, 105, -94, -50, 54, 343, -214, -190, 156, 121, 93, 139, 425, -21, 92, 178, 252, 58, -113, 133, 25, -343, 73, -78, -66, -158, -363, -87, -317, -310, 109, -166, -277, -261, 265, -11, -289, 52, 441, -27, -176, -57, 391, 108, 106, 436, 127, -271, 322, 232, 37, 117, 127, 0, 70, -245]
2345b45J40J53n57P28k26j90k67N67l10J8L64J56m16j55L38q0J20l11O26j30k92
2366C1j57M73k30n0q7M25j15n28J49N72m42l98N85j15n57K33K81m1n16K91M83
2387B87r8n33O36j92j76J18r4Q2r7K27M6k84K92O8j62j70P2q6J24j85J72o7k22
2410b42J73o7j2K9J24p4Q8n48M50K59k20l77M66K25k97q3L59j29l57J80N14j41
2432C20l11K10L21m84l9J28N4j38J17l58Q3K43k05k96K05J02p4j19L08o0m52K55
2454a90L12j70k11L82r3J46j90O9K00k49K51j02J33O0j87n04N08k66j04k46P33
2475B82j30o28M36L01n23k67R55m17k77L82J85l01k7m34M30J5K47R0m08K20j9
2496A12l27j0M78j21l36M49K32q29m13R16J7o72L80N07m30m42L16J34k58K37P8
$$ y = [-245, -105, 48, -509, 219, -7, -197, -464, 103, -207, -189, 175, 331, -85, -240, 98, 18, 138, -173, 453, 323, 31, -126, 347, 117, 67, -20, 405, 290, -238, -89, 483, 41, -357, 228, 113, -444, -211, 70, 29, -487, -196, 287, 189, -344, 292, 100, -76, 42, -52, 30, -67, 160, 206, -78, 214, 282, 120, -50, 22, -64, 60, -125, 47, -20, -242, -69, -136, -148, -119, 5, -69, 19, -529, -79, 180, -40, -417, 49, 274, -23, -106, 253, 124, -233, -53, 461, 320, 9, 219, 540, 56, 17, 145, 199, 61, 178, -180, -97, 146, -59, -355, -150, -48, -122, -241, 67, 7, -445, -190, 122, -48, -259, 123, 30, 176, -14, 55, 255, 6, 257, 155, 288, 348, 161, -343, 165, -101, -205, -451, 282, 152, -476, -40, 261, -262, -529, 426, 9, -268, 114, 299, -2, -29, -463, -33, -18, 229, 319, -89, 131, 112, -215, -225, 253, 132, -204, 245, 477, -352, -765, 151, 168, -504, -124, 383, -47, -489, -173, -39, -297, -60, 18]
2517A8N7J88k01j8k55K81j31j71L47M29p76O3M90k78n41N47M39k74k85L31k41
2538A9o07J69M40k03j12O25n14j65L70o1n04K79O79m26l3Q92p13n68L75M72o43
2559b29mR42j36j024M72J81k67k05M34J14k91J12k27j42o6M19m49N03L81l82m39
2580c03J82N0l83L9J030j74o33L86L75r32k2P88k02r0N27m4q12j7M60m35k21R17
2602D86l49l09q9O37q18l86R47P7n23J95P77p86k90M67l16r4L19M32l58K83l6
2623B66k90l21N50J6l90N84K47j073K80K33k62m19O28O24q21K5N10n87o77R00
2643B3J63n30K57N18k03p98P31j41m18K12Q87k76p59N62J8n42o7M91J47l55L58
2664B78k8n94L10j0l19K11P7Q6J32nm35k96L90K28l55M89L41o19l43N02K40m96
$$ y = [18, 75, 263, 62, 44, -211, 70, -61, -232, 115, 544, -232, -169, 321, 43, -498, 49, 488, 214, -71, 260, 19, -588, -419, 21, -182, -294, 331, -183, -348, 22, -39, -543, -264, 415, -11, -44, 848, 135, -433, -58, 414, -229, -233, 709, 573, -451, 21, 202, -65, -270, 164, 278, -13, 99, -128, -270, -336, 83, -366, 137, 518, 136, -303, -121, -71, -454, -415, 615, 441, -192, 194, 569, -363, -385, 403, 201, 111, 638, 594, -218, -235, 225, -210, -431, 486, 137, -172, -261, 376, -442, -828, 119, 196, -327, -132, 645, -141, -431, 36, -280, -374, -55, 377, 19, 302, 266, -24, -345, 205, 221, -169, 415, 662, -411, -131, 102, -160, -579, 49, 673, -148, -123, 387, -200, -877, 23, 186, -344, -87, 431, 228, -570, 161, 20, -398, -186, 701, 425, -334, 228, 246, -296, -363, 128, 275, -80, 278, 250, -344, -34, -44, -363, -152, -75, 11, 143, 138, -297, -593, -203, 25, -330, 159, 500, -119, -462, 40, 280, -216]
2686b16Q9P98m41m66O79o8o63k00J058m67n34M76M42q61r8P59l84n2K52K09o16
2707c04K05L05l55k31M62Nj53O3L21l24j22J38N8K11k49o0J28j35K04k64j02K86
2729H7k54q6M91o2p16L26L96j57l47P02m9n73m6P38m70m97N38L32j87l57L36j25
2751B0l35K85M57k59l12M72j96j95p4oJ27J7J95j12k84l4L07k40K49n01K56K35
2773G2j04q9K99N5m38q1L56L1l05J96M00m64k49L49L13m65J27K25K59o71L34o9
2795H1j02m23M63P6l72J81L02k48j70M2M6k48J81L69j7l45k7N02k60j58L87jq2
2818A77p5q2J89j41k86P67l31k07P4R0k76j23M12j31k35k11M66J41m02k1K5M42
2840B62n14L38nk83J63J24J8m01J12M54k66r5J99J31l34Q4M6q7ML10n1k88l91
$$ y = [-216, -127, 671, 230, -236, 443, 375, -288, -488, 570, 103, -431, 45, 487, -374, -472, 287, -97, -149, 103, 312, -304, -99, 206, -149, -380, 82, 87, -66, -3, 318, -6, -128, 10, 68, 279, 30, -30, 98, -37, 167, -97, -199, 87, -167, -253, 238, 176, -540, -214, 182, 25, -322, 380, 331, -242, -288, 450, -20, -517, 21, 353, 166, -191, 145, 20, -315, -30, 427, 168, -144, 328, 132, -63, -137, -143, -16, 1, 196, 84, -200, -234, 73, -167, 82, -419, -163, 72, -32, -121, 178, 233, -205, -286, 70, 101, -204, -8, 392, -72, -321, 28, 341, -124, 3, 228, 487, -184, 150, 81, -21, -444, 19, 95, -277, -96, 206, -42, -212, -170, -124, -372, -191, 178, 161, -184, -211, 291, 31, -127, 260, 259, 177, 102, 20, 209, 68, -218, 549, 218, 11, 85, 175, -101, -224, 188, 57, -178, -389, 77, 218, -184, -205, -180, 262, -252, 86, 81, -202, -39, 85, 103, -298, -186, 268, 2, -93, 106, 237, -97, -13, 33, -54, -50, 260, 209, -79, -470]
2863d70L35N89m69m9O0J52m53K21J08n3l50L26L18j73l80j02O20k90L6M52k49
2884A79j50J5J88M2l33Q6N7j01J30j0j6n42L99K38j40N9l36Q2k88K58L04k79J7
2907a41L85l9l30K7J68Km2M2L41l57MJ85j53%l11K3M34p0o6r2K09l84m2K50K7
2932G0m59J99P30m33m39K99J98J68o90M43K12m41K42j28J70J0P5j51L1r2M4j18
2954f0j12J21r1J31J90m4j80j0K38l67J93k5K5j2k57L21j38N0K53k52j98O05j14
2977B67o03L21N60o49O6L99j04m40L49J84l56l17N12J0k36q2J49P8o86Q36r7k35
2999g4Q5m3k40j13M61l40K06L06Q7m57K25P4k04k34L81M1l36J36K75k34k70L30
3021F2j06l12L85J24l65R5K74n56J90L31J03n24N74R7o53q2L39J51n11M03M89
$$ y = [-470, -135, 454, -15, -64, -4, 148, -305, -84, 24, -29, -379, -53, 265, 92, -288, -390, 230, -60, -24, 428, 179, 29, 44, 232, 274, -59, 27, 84, -17, 113, 103, 87, -455, -56, 182, 42, 101, -235, -153, -441, -183, 121, -158, -141, 244, 205, -125, -98, 70, 72, 30, 72, 413, 56, 60, 245, 92, 92, -219, -196, 238, 168, 102, 10, 219, -165, -207, 43, 70, -389, -190, 540, 107, -332, -33, 165, 333, -357, 86, 298, -143, 99, -29, 141, 151, 226, 75, 106, 14, 58, -60, -172, -51, -142, -11, 179, 135, -45, -55, 183, -184, 9, -16, 9, -3, -260, 61, -77, -27, 226, -26, -224, 381, 267, -336, -15, 545, -104, -38, 361, 257, -183, 166, 350, -6, -323, 189, 199, -37, -119, 30, 108, -578, 258, 161, -74, 11, -32, -272, -385, 76, -264, -58, 248, 335, -122, 103, 177, -27, -261, 120, 161, -175, -39, 236, 2, -268, 62, -44, -356, 29, 153, -212, -117, 157, -399, -209, 122, 225, -299, 275, 372, -281, -363, -24, 127, -384, 19, 508]
3042E08l95r2O2p6m80N23pN1j69L80k69k24M44k51l05J5N50j72l32N43l20n43
3064e59L11M37k91J39P2L3m97N78k60k43J27O64o17J49M92m50p12M47M54j78k10
3085a14O59K3r57K67J87k17j03N50J69q89M43L7k27J2P9l1j68O46r9p92K03N92
3107B70n29l16R70j90k50K01K85m33n72P39J13m74K99O05q71l54N57k01j27L79
3127A01Q6j47k31m9p1l48P78j7l51N28K19m88l68N55M8o43M39J06m1q4N5m78Q3
3150c18L58K74l81J34J65k55m02O03j66l87L80M10p08o9N41m21k34K34O07r6k84
3171a5j7L84p55M47L61m55o3M27j16k45J59L09l85j59K83j5k20J71p6n09L72K82
3193A65m97L93L35l16m21K03L41k48k05N08k92j80N82j60m83M7N66l49P4O8J30
$$ y = [508, 113, 21, 83, 7, -473, 50, 43, 94, -75, 305, 36, -188, 256, 5, -300, -285, 265, 93, -239, 304, -16, -559, -248, 189, -102, 37, 109, 142, -355, 223, -37, -280, -153, 511, -106, 43, 535, 85, -627, -180, 274, 96, -114, 545, 568, -389, -122, 65, -152, -255, 295, 464, -425, 18, 55, -172, -160, -81, -112, -280, 366, 267, -525, -322, 270, -259, -575, 395, 205, -45, 156, 441, 8, -564, 175, 288, -186, 113, 718, -153, -507, 50, -151, -278, 101, 187, 40, -191, -240, -311, -659, 119, 102, -249, 279, 498, 10, -358, 197, 245, -398, 41, 147, 106, 22, 77, -401, -318, 40, 314, -67, 67, 232, -23, -425, 178, 12, -375, 5, 415, -293, -362, 179, -242, -476, -242, 365, 269, -15, -32, 352, -403, 44, 405, -50, -113, 314, 198, -47, 112, 421, 36, -123, 160, 145, -75, 96, 20, -489, -117, 165, -332, 61, 396, 80, -341, -138, 203, -45, -250, 258, -34, -214, 368, 208, -275, -228, 338, -11, 63, 131, 261]
3214B61l92q8N35l31m06O90k80l23K16L23k23j86L01j96R0J38j11K31l37q6J4
3235a60J47K24j62l5L32m13j33L14J47j76j61J0R6k64K40J20n0k15K24Q9j60q
3257FJ83l06o9K28r7jm8K31j63o8j53L31j64Q7K70k60j37K77j08j50J86n5k70
3280b50K8L40J2o2l02RJ32J27n7J43j86K10k28j30M05l13o5K18q6Q5p4J24N5j22
3304A3k4K56j76j96J79J7m1n7J52j99R4o1J57k25k40L31K8o4J30om9j83L5L39
3328B10j43j63M35k99p1k13K05k0J34k52J57LR5J3pJ71m51Q8R1j26o6K2N1J8K49
3353A31k52J74l96M03J61k84j23K75j22K84k37J93l7j25m7J77l95L60N7j16N4
3374A35j52J53jkj93J37j99J2P28n22k59O4N3m8q2Q9J30M5j6l89L48N0k00P1K43
$$ y = [261, -131, -219, 316, -15, -421, 269, -11, -334, -118, 205, -18, -204, 97, -99, -9, 129, 18, 249, -88, -174, -160, -13, 211, 49, 14, 346, -67, -200, 114, 261, 85, -76, -66, 30, -234, 6, 126, 76, -139, 85, 174, 14, 6, 189, -117, -186, 42, -55, -56, -104, 127, -36, -104, -257, 74, -90, -3, 267, 7, -130, 147, 39, -111, 75, 20, -250, -222, 118, 130, 68, -234, -225, -93, 34, -23, 120, -66, 144, -84, -214, 191, -122, -187, 31, -55, 30, -44, 80, 135, 13, -11, 245, 69, -127, 52, 69, 28, -29, 123, -76, 18, -43, 114, -111, -351, -20, 8, -56, 74, 68, 19, -164, -129, 210, 67, -96, 339, 40, -31, -244, -39, -59, 75, -177, -20, -17, 78, 91, 84, 255, -196, -108, -17, -143, -209, -187, -136, -118, 131, -121, 53, -343, 60, 221, -63, -186, 89, -33, 251, 14, 207, 170, 45, -2, 175, -220, 140, 197, 81, 135, -17, 136, 135, 133, -60, 77, -122, -110, 618, 96, -163, -99, -46, -94, -176, -87, 43, 88, 72, -317, 31, 81, -119, -48, 195]
3399A95j25l41M08m60J63K23J53k98L41j86o8j17J98r6p0MN3K23j93o3K9j01j31
3422b59J37m8K28O9j2P6r7l7j10K41l07J04N2J8j03n8K48j45j45Q8J60k94k39
3445d33L29J86j61J73j55k53J34J01J60l65K64R9j75k60K55j0J46l13M87l6j95
3466b2M4R3l77L51K21j85rJ78k74l27L05K23k93K13J79j86l71K75j58k09K65Q0
3488A6J7M3L04k90l61J28M76k71l01M80j1k12J20n4j22l10N46q9P8l4j89k18K26
3511b8J60o5k30O20m56j35j16L36k15l68N49j86p9K81M13r27L40K98k51N3K63
3532B57k28k1k49L59j95l25P96K1n74L26l37q3j30J69K88m09O31l8k07j74K43
3553A20j44m3L2N70p50K09J62m2o91O12J32k76J51K89j36o97O45k86k54K76M25
$$ y = [195, 70, -271, 137, -323, -160, 63, 216, -82, 259, 73, 5, -112, 86, -10, -80, -76, -23, 200, 7, -56, -27, -128, -259, -122, -170, 58, 127, 115, 191, 94, 57, -53, 188, -119, -15, 37, 55, -48, -106, 142, -3, -148, -60, 100, -194, -433, -104, 82, -79, 94, -61, -314, -180, -79, 81, -284, -20, 79, -96, -356, -101, -111, 35, -278, 209, 173, -22, 22, 115, -262, 89, 310, 125, 116, 294, 20, -307, -2, 221, -72, 141, 320, 134, -237, 38, -120, -329, -64, 16, 33, 76, 380, 90, -271, -143, 333, 62, -239, 241, 230, 18, 138, 84, -38, -348, 198, 109, 187, 153, -36, -254, -28, 132, 67, -163, 457, 1, -134, -250, 86, -129, -497, 52, -134, -213, 68, 481, -446, -106, 192, -59, -6, 257, 29, 8, -241, 118, -77, -402, 394, 415, -159, 167, -170, -253, -383, -214, 74, -335, 296, 258, 51, -123, 120, -24, -67, -35, 535, -215, -6, 156, 114, -577, 35, 167, -109, 42, 331, 195, -502, 143, -143, -397, -121, 304]
3574C04m50K31L78n64m94P12j83n5o1K38jm18K20K99p63M82M07k40r5M13k24m78
3596c42J72N65m26l5O24l54l74J03M7l73M06N40m56k08j99N57r53M72K07j43n2
3617b22M67N6p37K62M73o03K9N15j77j01L60k12n35O8N72k31k5M76j20m88Q0K44
3639A51l54J66M66k72k46k4L14m27j57N01o2j66K38L15o75j00M48l93l3N35J83
3660D08m45J21J51m96k3N18k36l43O86J60o55k85L90J84p55Q49L0m09j23N96l94
3681g1k26J50M02l79K70J70o61K16N4K67m65K86Q5j80k7P67o85K14r6n9p9qN00
3704D45o82J45J09j06j3J31L6n1k83J13J03j59L63j43k16K15J94j37k28M90J03
3725D29o13J17K85K4l47j34K20j89O2J99k20J32M6K39m71l3K03M7q5K15j71J04
$$ y = [304, -146, 85, 463, -101, -595, 117, -66, -121, -182, 56, 55, -363, -143, 156, -607, -125, 282, 42, -53, 360, 136, -342, -170, 395, -31, -66, 558, 204, -170, -67, -20, -393, 13, 553, 97, -111, -310, 247, -706, -234, -27, -170, -222, 245, 301, -436, -174, 299, -304, -275, 240, 63, -38, 322, 110, -425, -357, 215, -16, -41, 435, 315, -173, -93, 151, -203, -37, 429, 157, -89, -113, 201, -226, -383, 118, 56, -110, 128, 443, -232, -332, 116, -277, -310, 225, 408, -37, 84, 235, -261, -284, 234, -2, -345, 341, 501, -154, -439, -49, 135, -620, 229, 259, -150, -273, 323, -71, -297, -147, 255, -124, 146, 316, -345, -129, -75, 192, -273, 13, 98, -82, -109, 658, -27, 187, 91, 32, -47, -55, 445, -237, -92, 17, -89, -102, 29, 65, 14, -269, -156, -53, -212, 151, 8, -208, 7, 201, 64, -164, 326, 429, -184, -67, 218, 242, -105, -239, -19, -208, -146, 53, -167, -35, 11, 250, -221, -254, -51, -4, -89, 126, -45, 59]
3747E9j41Rj68Q8L06o3j63M3K7j01j73L01M3j80L18k75J0Q5k9J48l64J02J75j00
3771d3rJ57j52r7K41k6j74O3K66k39J77j15K0m8j18m7K14l30L05k84M80m8n5m3
3795I5j29J18q7O7k09R9Q5k50N5L8J24l40K85J38Q3m18J95P2J80k74k29M69l95
3818b28J48Q9N2p1L9J92M4r8l44J60j4O9Q3J22m58J62K37l2k03j69L76j20o5O3
3842C4j18q4J68mK65j94M7j44j42J98J62j37p6P7N1K2p8K40j75j96J14j08N02
3865D24k25p9q5Mj45J91L8m14jO1K73O3j72n9R0rl58K32J78q5J38l46L28j4j6
3890A2J17q0j3P1j3k16P2Q8J57j2j2j89j2k4j32J91k64L12k53Q8j94Q7L18j37
3914c8n6j10J85mJ3L25k50r7J57p0K7j16J67L6l0J05q0M0k77Nj43J49%K85m4k38
$$ y = [59, -82, -73, -241, -153, 153, 90, -73, -30, -3, -104, -277, 24, 67, -113, 205, -70, -60, 25, -4, 144, -220, -118, 57, -43, -52, 105, -47, -144, 97, 71, -103, -40, 226, -13, 164, 49, 69, 21, -97, -144, 70, -260, 45, -239, 241, 193, 138, 95, -34, 84, -3, 64, -145, -46, 39, -211, -156, -118, 6, -334, -49, 89, 172, -246, -51, 21, 201, -73, -302, 167, -228, -80, 9, 61, -10, 29, 221, 265, 167, -177, -17, -31, 38, 121, 243, -215, -53, 184, 152, -51, -220, 156, 36, -29, 34, -84, -168, 0, -4, 261, 67, 114, -30, -172, 26, 188, 51, -25, 52, 103, 125, 47, 287, 112, -84, 30, -78, 424, 199, 120, 35, 39, -106, 85, 123, -291, -292, -231, 42, 105, -67, -126, -36, -45, -403, -171, 7, -78, 60, -286, 42, 28, 12, 129, 49, 36, 107, 94, -122, -50, 38, 195, 183, 171, -18, -30, -54, -186, 5, -259, 53, -200, -112, -306, -219, 99, -38, -94, -204, -19, -23, -10, 315, 65, -32, 125, 55, 82, -34, 133, 169, 139, 244, 164, 204, -73, -68, -211, -62, -62, 223, 179, -59]
3940e9J36q7p1j8K17j63J91k83Q6J04m7l8J37M2K2j55R4l06j72K49M48k09j06
3963A2K7J59j57k08KK57m2n0L70m99L3J38N2j62n0L55j60n2J93k37J4J58o8PK82
3988C74j36k29o5J77l4j23j08J25p8J25J69m21MJ4K99j66l5L27m66K51n2k6M9
4011b5n1L61k17p1K46k38k58K21K88j88k6L03l73J1J39J64m72O5K88j20j7O2m1
4034E1j97M9L04k05j68K95K00m63j80M55k95k6K93J4l14P1K07k28J60K00j11n6
4056E6J21K7k70j35K06k4j50M54r2k32j14L92m84j40M28M61n95N9K2j37k2J30
4078c9j86J00L62L91m90j10K87p20K16K87k19j8J11K38k85J18J51l33j59M19J10
4099B31k54p8J97k98K4J2J60J50j18M51k90m53N88l62p2K05L66k71l13N75n18
$$ y = [-59, 77, -10, -81, -99, 118, -45, 146, -137, -51, 53, 6, -32, 105, 147, 169, 14, 108, -198, -370, -121, 327, 118, 12, 39, 198, 41, -167, -165, 92, 50, 0, 370, -129, -96, 42, 94, -68, -118, 237, 77, 25, 218, -19, -5, 153, 85, 92, 374, 238, 9, -56, 121, 87, -36, -144, -19, -97, 28, 197, -224, -220, -206, 93, -73, -108, 219, -247, 4, -48, -74, -25, -76, 285, 68, -3, 243, 5, -253, -32, 256, 68, 42, 345, -28, -17, 122, 286, -186, -121, 167, 47, 30, 92, 51, -146, -97, 207, 2, -166, 129, 329, -134, -314, 141, -154, -180, 113, 127, -187, -116, 91, -137, 23, 223, 112, 56, 177, 204, -66, -201, 5, -19, -169, 285, 193, -39, -153, 239, -245, -385, 43, 504, -91, -32, -10, -147, -169, -39, -225, -125, 237, 628, 138, 28, 315, -405, -189, 98, -121, -139, -28, 210, -75, 43, 194, -139, -298, 121, 231, -23, -101, 96, -202, -178, -166, -6, 144, 26, 477, 187, -266, 322, -40, -112, 93, 459, 188, -125, 450, -68]
4120f8k29K32N49j77n17N96j94o44K68M05k86P8K73Q3n30J24Q0m05J52K95L8k51
4142a28K67k2o79K01O40k42k06M13l0n08L49L6k32j08M64o0J2j66L0j47o2K36
4164E8j19q2K88R7k46j66J85j56m3K66J8l44J19M99n97L79K31k5m98J10K31l34
4186a29j93L55M2j83K17R0l17L2K81m31J56P6k9o9L27p7j13l15N04m94J81J61
4208G2M35m66nJ32l70R0J27P9j39J04O9j66j69pJ69l26J70L13k4j46K36l49j17
4231b88K68L70n44K99J56l47J02p5Q2j55K64K22j16l23K48m7j19m5J3p0RL09n3
4254A60l31M57km92J93J78l16K55nm45J77J10J46j63j31L11k90j15M89l30j9N6
4276a07K45m7k86K41J73N4j31K1m4j06j1m4j57K91l6J69m96M69j00l03K36L19
$$ y = [-68, -297, -65, 484, 307, -210, 386, 192, -452, -184, 221, -65, 13, 286, 369, -161, -37, 43, -362, -210, 85, 123, -128, 139, 117, -562, -361, 279, 37, -169, 244, 214, -294, 55, 91, -141, -249, 215, 155, 167, 1, 31, -116, -178, 58, -61, -143, 145, 242, -4, -170, 15, -141, -184, 82, 100, -244, -125, 374, -223, 156, 387, 362, -136, -26, 205, -129, -322, 33, 75, -108, 109, 199, -118, -86, 195, -236, -80, -4, -33, -102, 225, 148, 35, -280, 224, -270, -89, 72, 507, 41, 36, 168, -202, -112, 15, 94, -45, 59, 128, -38, -207, -214, -45, -371, -201, 112, 88, -58, 178, -171, -288, -20, 350, -194, 105, 261, -86, 16, -59, 23, -132, 132, 354, 238, -85, 163, 116, -3, -48, -35, -105, -96, 213, 160, -171, 286, 284, -208, -15, 163, -153, 102, 97, -348, -171, -61, 85, -78, -209, 102, -188, -303, 186, -144, -163, -107, 138, 91, -195, 46, 219, 273, 142, 163, 119, 13, 2, -42, -199, 92, 56, 225, -271, 198, 98, -205, 31, 350]
4298C50l19J5P5j02k40O5qK32k84L7O7J57K88m33J99q2O7k10M54n46K84k37J05
4321f6l1Q6jp2J11j78J35q3J14k9o5k40K37r8j56O4N88n02L66j78K41l50K35j02
4345B6K30k24k60J01K96j9m7J0l6ll22M78J24k58k54P9Q9o8j53J13J64k17J4K08
4369G1q5j09Q7J8pMK95k48K12k25J56qN3j45R8j55m2K24l49j81J85K76k92N05
4393C38m44l5L84J7k92J28L0m9k95J52K2J32n3j68M4Q6r8K45L6j94J20j90K14
4416A30k5J38m14L78l71N3N8J54O0k29m1Q4j13J49j89L08k39j7K28j45M8k63J80
4439g8K8J81j17k28K42J02o8k26K96l48K48r5nm2M17m27J11P8q1p9K89k16l21
4462c39L13N7r6N8jM6K0K0j32K32j20j47L14j10J41M9q0l18k34N29k19P1j87K06
$$ y = [350, 31, 46, 121, 19, -221, -156, -164, 68, -216, -179, -112, 45, 333, -100, 99, 17, 84, -126, 328, -218, 66, -171, -66, -97, -11, -12, -84, 27, -151, -16, -99, 15, -14, -79, -319, -82, -180, -336, -272, 316, -186, 180, 2, 243, -107, 128, 26, 256, 32, -228, -127, 169, 150, 103, 113, 77, 74, -248, 230, 354, 96, -158, -79, 10, -58, -211, -98, 66, -151, -137, 71, -14, -123, -36, -18, -25, -21, 274, 26, 238, 13, 169, 161, 214, 69, 167, 12, -30, 194, -155, -336, -151, 125, -167, 338, -106, -141, 243, 260, -32, 96, 126, 77, -218, -66, -44, 88, 35, -133, -89, -3, -101, 144, 180, -14, 106, -84, 130, 105, 243, -171, 207, -164, -111, -53, 101, 161, -68, -109, -25, -138, 11, -178, 130, -109, -126, 102, -43, 5, -258, -78, -50, 131, 14, -214, 28, 130, 62, -164, 132, -216, 32, -63, -68, -110, 307, -120, -9, 69, -12, -91, 198, -18, -339, -26, 31, -65, -7, -8, 38, 58, 78, -54, 178, 58, -89, 225, 115, 256, 305, 225, -93, -327, 202, -17, 54, -133, 73]
4486G3J76l64J10J32k46j93N55l09k59K64R4L6k86M08j88r4L07K11l74J97j97
4507E3n3k0K79M2k31r1r1M2j12J97N9k33J14K08l85K56k17j26K58Q2K50o66K91
4530i4K06j32k53L27J29j51j65L32j96l04N08j53j18R6k1J86k39J59n2l68j2L83
4552F8k97N2N08l70k7j37J92q8O2L77j96l55L06j44j04m9N88n65o7L52j19j76
4574a89Q4K28l76K93K36j21l33J42J51l61Q4M34k31j95K67J51m32p8N01m88N7
4595a76N87j66n93L17K47O8m58O1P8P6O8J78k35l4j44M2J91r1P4j72P9j96r3O7
4619b25M67j95l61M84m5k57j01L54k2k94M29n7m27L62n3p7j94L44J29m21K13J95
4641B48k67k60K56J66l70L55J96m06j18L70j86m3r1m5J04J00L08m08l12L88l9
$$ y = [73, 249, -115, -5, 127, -119, -312, 243, -66, -325, -61, 33, 69, -217, 191, 3, -91, 216, 427, 53, 250, 53, 0, -20, 259, 301, 70, -21, -112, -70, -182, 15, 74, -159, -45, 163, -222, 34, -183, -309, -51, 31, 281, -385, -94, 112, -20, -273, 54, 183, 32, -133, 199, 3, -301, 207, 54, -64, 32, 11, 197, -42, 117, 65, -303, -315, 68, -229, -177, 331, -39, -66, -203, -11, -99, -37, 340, 144, -211, 95, -49, -153, -202, 386, -179, -246, 106, -13, -189, -105, 123, -253, 40, 276, 155, -178, -36, 115, -246, -162, 272, 41, -154, 113, 264, -168, -246, 255, -233, -176, 411, 245, -348, -31, 216, 284, -174, -113, -35, 41, 109, 287, 52, 18, -126, -84, 107, 16, 90, -82, -3, -199, -292, -225, 242, 47, -314, 170, 125, -132, -233, 121, 99, -195, 234, 177, -250, 112, 59, -18, -212, 132, 261, -160, 53, 248, -19, -279, -23, 143, -227, 128, 324, -82, -200, 170, -16, -59, -150, -195, -91, 9, 317, -91, -403, -15, -54]
4662e4k40K51J89k26m0K60J3k50n2L12j58r3L44k87j97K08L18j06k19J33j57j36
4684a87N5K2K7K27j35R3j05J90K9j89m10N01m49J51L62j56j62P4L39l70r4L63
4706A76k5j23k56K05k50k9L40r0K09n8j52J71pK54k91j62J20p8q0L51M3m27O9
4729i0K11o5j65J74K42k13Q0k4j78rLJ25k29J15J59l24P5J18l9R1j76J97j72N8
4753c6R3l10L53k77k6L55j71q2J81N4r0J7P8jJ6k40q7Q4qJ9j7L12k23j20L64j71
4779F7M6k50ol2K06j62j2Q0K77m38P6J53L9m7j00K2J5N4J25K5k87J70m7j28K59
4804A05j28L04l33J29j51K41n6r0Q1k03J88J9k78L3o7P7L9J59k1J3p3r0J6J71
4828H5j67O1R5j73J0L36k48j17J71p3J83k58o0J70K05k82J47o1n7k78J08k2K07
$$ y = [-54, -294, -43, 146, -80, -120, 140, 153, -97, -149, 163, 5, -88, 256, -31, -228, -20, 298, 192, -27, 106, -51, -187, -132, -110, -83, 144, 9, 102, -3, 187, 216, 27, -383, 118, -331, -180, 182, 26, -136, -62, 277, -93, -187, 176, 151, 28, -228, -23, -273, -302, 38, -52, 157, 99, -53, 118, 111, 365, 74, -88, 32, -46, -126, 225, 268, -159, -90, 121, 56, -109, 65, 307, 94, 174, 150, -28, -37, -34, 91, -138, -23, 136, -188, -113, 5, -34, 57, -119, 78, -94, -36, 57, -253, 100, -177, -203, 152, -19, -101, 80, 134, 44, 61, 139, 138, 154, -86, -173, -89, -97, -78, -95, 217, -6, -126, 238, 67, 113, -137, -143, -175, 31, -131, -143, -63, 214, -224, -148, 5, 44, -3, -103, -81, -66, -12, 113, 138, -149, 21, -26, -154, 105, -23, 281, -52, 77, -74, 167, 111, 21, 102, -101, 87, 106, -172, -139, -206, -129, -90, 69, 48, 61, -12, -102, -86, 85, -82, -21, 74, -99, -89, 247, -1, -118, 53, -20, 163, -95, -155, 15, 220, -62, 85, 24, -33, -311, -203, -225, -18]
4851a8K11m7m5Q9l46P3N0O0K27k17n8j09J34m5R8o9QK79l74P5j28qP8K17k55Q9
4877c1K03j61R6j03J7k14N4J00j71L42j01Q8K17r8k86j17J92J28k20j00K6L6r
4900a12K93j08J69J44k95j09l1o0L3K48m06K39j60R9j9m7P2K07j6k51r6J64j06
4923a48L3L5P3LJ78k70J5J94Mj33q0K01N5J4k08M15p2k50K1j7m3O2j30L4n9J10
4949C7j42p0J99N6J61l05K18M4k62j21O6K85N6l02K64j61k70K54j0m0Q9j25N6
4972b3j4K79k86P5J04M8l58J34J17R7k28K6k44K50J19j94q4p6M05m86N41P4j21
4995A55k42Q1R4l7n8P9j4p8j05q4J66J14Q6j52M0r6J80j14l56K35J02J20l14K69
5019G1O9m4n8mk24M60j85r9Mn4j12L56l8k41OK93m3j59J35j54k73Q7J99qO7j47
$$ y = [-18, 193, 146, 101, 190, -156, -83, -33, 27, 254, 37, -21, -130, 4, -41, 57, -12, -4, 275, -99, -24, -152, -160, -82, 135, -120, -31, 172, 11, 107, 4, 21, -193, -139, -39, -210, 132, 31, 119, 336, 238, -48, -165, 27, 155, -65, -165, -139, -103, -112, 181, 73, 242, 386, 91, -18, -49, -109, -76, 172, -234, 5, -155, -56, -75, -122, -50, 157, 141, -110, -206, -42, -148, -115, -80, -7, -4, 174, -96, -81, 113, 117, -16, -96, 105, 160, 174, -34, 381, 309, 59, 80, 63, 20, 82, -48, -14, -73, 37, -105, -175, 24, 80, 241, -64, 154, 198, -64, -185, -119, 166, 222, -80, 184, 23, -247, 7, -3, -43, 46, -79, -23, -37, 242, -44, 31, 135, 183, -175, -41, 76, 173, -55, -29, -273, -23, 96, -98, -182, -258, 147, -339, 202, 276, 155, -87, -6, 88, 51, -7, 72, 58, -20, -125, -209, -43, 71, 157, 5, 45, -51, 129, 15, -341, -106, -4, 116, -198, 71, 140, 96, 38, 34, -190, 270, 85, -14, -10, -64, -176, 180, 142, -99, -93, 200, 157, -2, 133, -21, -294, -207, -8, -16, 51, -96]
5045i6K64l65M8J59j39J36p0J20O9k61K48j41k25L76jk4l0J66l95j11J49J9K18
5068A14j72K82O3m03J54K9l33J52K28k36J54Q6j93q8P0J49j68n7N38k99l5J48
5090A83j88L2j19L22m68J13L89k93k55K51J24r5k09K99P8m10L83pk47o7K90J13
5112B19l22J34O0k23Q8j06L1M7N65l10l58J32J28j43k4K47R8n12M92l39k95J95
5134a96K24N3k87J39K50j69k96K06j32K35k6R0l69K78l3n5j4QJ66l32M13J33n83
5157b97K8K02q0l6K46K1o1j06K29l02j88M05K0k35q4M46l36P2K40k09l05K93O9
5180C2J55j20q9K55l79J18K61p9j54J63l67q8N35k02j67N7K93k72K29l67n7J6
5202b27P9N4p0J04J91j54k70L41K4l71K87J38j20j65L23l2m5k09J29j12J16J21
$$ y = [-96, 168, -197, -149, 10, -129, 7, -63, 57, 126, -135, 113, -28, -253, 123, 122, 98, 68, 234, -161, -272, -123, -104, 114, -58, 224, 287, -116, 38, 67, -266, -114, 114, -122, 32, 118, -75, -163, -93, 56, -112, -169, 369, 70, 35, 183, -5, 27, -92, 230, -238, -125, 264, -29, -284, -33, 91, -4, -213, 86, 164, -246, 137, 130, -117, -184, 106, 219, -103, 31, 91, -132, -44, -150, -119, -72, 493, 183, -175, -43, 85, -58, -82, 165, 263, -249, 243, -96, -391, -196, 28, 81, -206, -67, 183, 14, -282, -76, -208, 27, 1, 91, -278, 0, -33, -88, -102, -94, 72, -260, 153, 286, -297, -269, -67, -147, -183, 63, 84, 23, -83, 146, -156, -344, 61, 81, -154, -238, 208, -128, -56, 184, -25, -330, -37, 32, 187, 67, -22, 233, -146, -28, 233, 154, 0, 163, -204, -292, 243, 41, -126, -69, 224, -48, 181, -186, -243, -227, -148, -94, -164, -60, 131, -23, -293, 48, 72, -299, -12, 126, 6, -159, 164, 132, 87, -122, 7, -105, 11, 132]
5224A32q5n6J37k32JL4O1O0k51K21q9m0j42K13Rj18k1q1J21q7K27k11K76J2j24
5249c3QQ6N5k69J15L06k72j61L8L24k27J69j82l4J03o6L8J8J60j56j66N3L11j53
5273F5j89M7P8J0j00J8J11l01L40J11n8j58L07l40rN7o3J84j26M5r4o8P3J09k39
5298a90K62Mr2j08J73j78J12J28j30K49j60RO4j66P7P3l9j60L34k54k38J01J26
5321cn0J20k21K49k83L43j41l40M62n7j53k35L20q5J47j50K6K14k86J06N6j17
5343g8J04m5O3K33l19K63l85L37l43Q3j5N4K88k85L3j26P4O7k41K02K8j11J16
5366cm9n5J07l9Q6q4K15M3j29M7k17KK5k5j05K50p2K2L6k3j19K40k14L86m78n1
5392b04J21p2J92J83j73J53k42l9L4Q7j99K65j40J45K3j00n2J09Q1j03L14n12
$$ y = [132, 47, -9, 128, -104, -103, -69, -8, 52, -199, 22, -67, -107, -249, -36, -27, -145, -166, -247, -126, -213, 14, -197, 79, 91, -33, -25, 61, 116, -153, -38, 268, -4, -165, -127, 197, -30, 139, -43, -77, 26, -40, -2, 16, 176, 20, -146, -93, 218, 65, -124, -77, 1, 11, -89, -71, 40, -261, 79, 190, 132, -26, 281, -59, -68, -11, -74, 110, -16, 29, -65, -133, -60, 49, -190, 72, 76, -16, -124, 49, -129, -17, 111, -19, 230, 70, 79, 143, -23, 54, 127, 88, -72, 262, 8, -230, -129, -3, -53, 67, -154, 95, -188, 155, 14, -326, 136, 79, -74, -309, 11, -74, 73, -77, -51, 163, -123, -17, 39, -78, 26, -19, 44, 277, -42, 221, -164, 173, -170, -87, -102, -48, 240, -45, -12, -138, -64, 3, -238, -36, -8, -119, -3, -52, -107, 0, -39, 47, -37, 178, 221, 92, 139, -78, -76, -51, -76, -181, 69, -3, 19, 55, 32, -87, 153, -61, 325, -153, -204, -83, -155, 37, 220, 47, 200, -42, -81, -47, 40, -159, 106, -34, 111, 134, 34, -18, 91, 172, 69, 383, -129]
5414a29K58r9K85k37M0q0j1M7j87K21j48l5K7q4L52l08K23p5l6j93j2J06J83N3
5438A61j89K02r5j21K21j00j04J91k13J51j7j71J76k10J58p6j70K02J37k53l03
5459d23M28n9j45L25J58k88P7m25N37k20J22j44r2K7P2J03k55LR8J75J80l34K4
5482e6j04J80R8m6j22O7R9j58k8K99k88q7K17j17Q1n2l2J37j55j38K65j55j08
5505b03m5O00j14m7l5Lk58l6K31j6n8j18lj40K67j38m9K88n0j59J88j45j10J36
5529a1p8K20o5j50L7rK1l3k9K52j37j03K85plj53k8K13j00j50L03l36l9L38k30
5554Hm53M84K00l02n9K09K5o5j76J2L4k06L16j63n8J8L41k25pK9J89j32l0L13
5578C02l73P8n0j57L19J08k3l97L90k75k0l04M60m7p0J40J00l03J32J04m9j18
$$ y = [-129, 129, 30, 315, 78, 118, 38, 27, 74, -113, 108, -40, -75, -48, -132, 220, -88, 135, 60, 24, -169, -181, -75, 108, 161, -28, 174, 79, -42, 179, 79, -25, 166, -47, 104, 87, -84, 92, -118, 40, -36, -206, -4, 133, -120, -423, 5, -54, -199, 126, 284, -4, 73, -352, 185, -35, 87, -57, -149, -122, -50, 53, -202, -199, -101, 74, 254, -80, -56, -160, 20, 118, 72, -50, 17, 116, -42, -70, 229, -59, -146, 71, -46, 35, -17, -49, 88, -67, -205, 60, -95, -203, -248, 352, 238, 191, 156, 159, -99, -135, 96, 80, 22, -96, -99, -239, 28, -110, -159, 129, 79, -80, 108, -37, -147, -11, -89, 131, 66, -84, -47, -56, -35, -68, -97, 155, 18, -85, 200, 193, 190, 37, 9, 222, 122, -28, 275, -61, -100, 238, 8, -445, 39, 239, -63, -122, 87, 112, 47, -129, -117, -83, -289, 27, -136, -194, -176, 165, -60, -67, -38, 151, 19, -11, 302, -71, 7, -43, -200, 119, 227, 204, -193, 197, -78, -98, -402, 58, 11, -59, 81, 181, -122, 10, 114, 65, -53]
5600e3N1J11k7l14J82k0q3K31J91l91PM53m61K1N3J65j19Rj6K26k80N1K7j74J82
5625B2o2p1k00L23j38J94j01J09J38r9j5j41L4q4L13m13Q0M69l16k67L27k32j87
5648c17L20n3j31J89nN3k45L54k85L7J11Jo5J45r3j44j42J14L53j04k6R7J0j80
5672fj18K78m72N59J70l71K2J06j19m85L7O67k62M1r9M40o77L23N3k75K47n5k37
5695b33M4M35P9l01l0J5J09j84J89o2l74L85p9k90K15J75K6j46L26l53l9k5O9
5718d9K83m76Q8L83k59j50JR7l4K52k94J30L7k7K95m53j8K23l1J57k77J16LK22
5742B19k40j47J98K22l28J88p9J85k60N8Pj03j9J0l5J32J36n2L9o1J82l15o4K42
5766A15KK99p24K32J19l1n8J60q6l8J0j89K34j51K23l13K06k0j59KL19j18j26
$$ y = [-53, -2, 109, 82, -232, -50, -70, -153, 78, 269, -122, -115, 338, -123, -102, -49, 116, -3, 6, -10, 216, -64, -13, 14, -160, 22, -40, -111, -311, 12, -126, 68, -33, 76, 214, 115, 100, -41, -7, -91, 222, -191, -111, 358, 42, -225, 102, -130, -317, 3, -50, -181, 8, 3, 56, -189, 165, -120, -83, 28, 29, -36, 109, 16, -128, -270, -156, 197, 93, 67, 164, 174, -6, -124, 154, -318, 241, 411, 40, 62, 168, 49, -436, -399, 268, 6, 47, -52, 388, -289, 34, 87, -188, 59, 4, -233, -189, 246, 325, 24, -6, 9, 118, -66, 123, 61, -313, 72, -7, -297, -82, 93, 119, -27, 299, -54, -93, -118, -49, 234, -242, -154, 229, -30, -180, -179, -82, -116, 136, -158, -28, 9, -18, 277, -176, -194, 29, -2, 155, -122, -6, -3, 219, -21, -168, 30, 252, -76, 112, 33, 218, -42, 16, 23, -80, -99, -89, -124, 8, 144, 92, 131, 70, 252, -63, -127, 115, 117, 416, -308, -76, 43, 12, -46, 114, 28, -10, 0, -189, 45, -106, 117, -196, 10, -10, -169, -167, 152, 34, -92]
5789i2K09p9J74j85k71L47j34K98j41o3L5r2K34q1Ql02K92J13j44k09R3J02O8
5812A80j27j96j74K89L8k5o5j4M3P6Q9j29R4O6k81J4L52pj77Q3l46L08k1l04J85
5837d9K04j75N7N1r2rj59J36k5Q9j03K13j85Mj28L29l28J11J82k01J15p6j01K01
5861F1m0o3J82j80kK41p8j02j46K00M0J0l6m72M99o7J8j26L42l15O6j53K02o0
5885B1Q4K18o0j98K9mm5J8j37K39j40K20q0J9k99O7P1k58K05j84K98r2p7M06k72
5910D9LJ31j82K21m73K77q0R4J05j52k92M42l2k22M05l04K49k05j06J59j91j1
5932a15L98j90j61J61O3Q7n36K68o5J4J61l45K87j18M0Pj9j01N3L00k28l3m8O8
5956e2l2J89R6j95J15o4j48J97K4j48j0o0J61O6j00J70k45l00P18k66K4q5J67
$$ y = [-92, 117, 38, 212, 27, -244, 103, -31, 267, 126, 63, 98, 6, 240, 159, 167, -135, 157, 270, 126, -83, 10, 112, 180, 53, -143, -317, -28, 10, -15, -80, -94, -51, 25, 114, -15, 79, 145, -136, -122, 230, 223, 46, 129, -217, 91, 70, -234, -49, 155, -20, 37, 88, -4, -13, -172, -36, -61, 28, -75, 138, -47, -43, -171, 158, -170, -59, 123, -78, 37, -39, -140, 61, 21, -42, 140, -40, -42, 199, 121, 19, -127, 73, 113, 123, 87, -385, 114, 47, 65, -61, 281, -34, 32, -121, 81, 21, 105, 323, 263, 65, 94, 90, 45, 63, -74, 165, 25, 245, 165, 184, -115, -48, 23, -235, -30, -214, 84, -8, -85, 321, 49, 52, 183, 1, 222, -251, 26, -54, 40, 145, -7, -299, 143, 111, -111, 294, -10, 239, 34, -72, 87, -104, -115, 283, 93, -68, 93, 156, 243, -293, -25, -90, -76, 85, -260, 27, -91, -51, -44, -63, -164, -111, 189, -39, -72, -120, -52, -84, 105, 201, 6, 121, 57, -91, 106, 130, -18, -28, -88, 73, 139, 39, 209, -36, -336, 382, 116, 140, 55, 222]
5979B22k12k68K65Mj49j01kK19J18k9j29L6L94o10L23Nj45q9J24l8K02nk88J46
6003gQl3QJ30j47J41j45j21R3J66j65J31k21J37o8K23j59K9J50n4j98L82j32j15
6027C3J23j07m9k53rJ91L19n11k5K58j76J04O7K65l40K8JQ3l53K89L44j97j50
6050f5K54j24j97N1j31M19k36K8j04O7o5j45J67J63K3o2k5r4J47lo8J51l56L08
6074A03J39j68l98M97rj50j59R6k35J90P9P8j80j56M00m9O7Rj94r7J07J32k87
6097a85l1L77K51n67K91j80j3M7m2J68k27K10J28l34Q1P5k66J93K48j95j5K2P0
6120A06k60R7N2L29j52r0j78J7q1jn6n1J63J73n8j11M59p01K67K6Q9J5jl2k87
6145b66J20K56j78J77J9p1q4n2K78k06j92M9O36l73r0Q2k28K3R6K06n03L30K4
$$ y = [222, 10, -258, 7, 11, -138, -239, -241, -22, 96, 67, -62, -26, 368, -242, 81, 86, -59, -148, -24, -62, 140, 135, -153, -7, 1, -32, -24, 106, -41, 100, -45, -166, -73, 93, -72, 59, -162, -25, -93, 130, -29, 0, 150, 96, -102, 280, 148, 33, 156, 49, 0, -253, -262, -71, 248, -263, -288, -30, -206, -102, -35, 230, -110, -82, -81, 2, -351, -62, 282, 85, -65, 189, 65, -132, -81, -212, 207, -29, -1, -105, -38, -103, -248, -81, 82, 105, 43, 18, -76, 71, 68, 0, 151, -205, 103, 242, 74, -324, 173, 164, 14, -145, -49, -284, -94, -15, 63, -117, -273, 127, 78, 145, 154, -40, -137, -30, 102, -185, -216, 161, 412, -155, 136, -44, -57, -10, -52, 116, -111, 99, 227, -107, -26, 49, -217, -24, 224, 29, 14, 36, 106, -154, -57, -5, 324, 172, 82, -96, -79, -160, -161, -217, -268, -105, 68, 10, -101, 358, -343, -76, -50, 39, 54, 53, 21, -266, -146, 110, -68, 109, 128, 57, -27, -79, 199, -7, -199, -150, 486, 113, 23, 105, -123, -100, -4, 202, -301, 29, 53]
6168E3L1l67O65n90L65n6l0j09j28O23o33P7J56N1J26L4l20k0J02J42j35j4J24
6191A47K4j75k11L33o4l30K42O2j20lJ19J75j21N9l78j60L75J64l36R8NK6p1J51
6215A1k3%k34L65k09J0K3J8j3j98N19l59L14P2m41j38N5J88j47J62O5NM3J36j62
6240F2j26K0O3Nl4J62j07k86P1P5j32L39P8r3j84J24O4j21R2Nk2j26R0J93m20
6265b08J56L08k17k11J73r8M0J51P2j88k92M18J39k58Q0N0p2k29J62K79k89j13
6287a47K18k0j47j4K40Oj88J35J2POk27o4J66R7M2j47j17J66k9k2j72K01R3j49
6312e4o5J59j80M15k07k66J91O7P7j88l5m9N8K57q2J23r5l98R6J65M7m6j6J19
6336I3j90K00Kl01K65Mj63K2P5Rk5j8L5j09j03L43k41M04k34J20k19K21k53J37
$$ y = [53, 84, -283, 382, -208, 157, 101, 71, -38, -166, 457, -176, -99, 57, 108, 234, 268, -52, -72, 30, 172, 37, 23, 147, 171, -4, -215, 118, 54, -276, -34, 28, -92, -95, 24, 199, 78, 137, -241, -401, -26, 138, -198, -100, -95, -69, -140, 11, -12, -12, -246, 119, -90, -80, -57, -39, -52, -250, 269, -90, 224, 296, -145, -283, -228, -40, -187, -25, 40, 45, 88, 224, 62, -64, -44, 19, 24, -10, 152, 45, -241, -170, -95, -227, 112, 190, 97, -87, 37, 101, -20, 72, 77, 55, -71, 19, 212, -208, -52, 256, 39, -172, 1, -97, -57, 94, 166, -22, -314, 104, 243, -15, 65, 115, 43, -186, -24, 255, -34, -147, 71, 51, -96, -110, 130, 136, -52, 83, 95, 102, 108, -119, -183, -17, 80, 122, -25, -142, 24, -5, -27, -199, 2, 95, -54, -119, 40, -140, 275, 68, -198, -7, 60, 137, -51, -86, -135, -77, 180, 98, 221, 126, -272, -176, -11, 36, -10, -26, 93, -97, 103, 105, -196, 69, 73, -90, -68, 7, 16, -9, -27, 8, -101, -204, 139, -102, 302, 68, 188, -31, 190, -63, 74]
6360G4K16l3j03k21R7j37J54L09m04oNJ5N5M9j91J13j20K51M2p1R2j7k02q1J7
6385i7M3J25O6nk59J30l04L67j68pk21J54K29j14l6J54j38j49K19l3J42J62k15
6408D5K7j6m3k3R9q0M4J00k58P9J24l2j44j92L36M0l17J63N0o6K5j52K6m1P2j70
6434c04K75J21k81K04O6l2j54J92m5m7rj47J55J86j11j20J61p8l9J5J62p6Rn2
6458E1L2m9k49J01J87q3LR7j78K34O6q8Lk05J75j0kJ12k20Q7j7J52k95J01O2j18
6484e1l2J95J30k55R4J55j90k5K09j13j17M2M2j46J39j14j46K61j34M9k18J12
6506a13J05nR5J54k69O9O8J14k07P5J68N7l9j64k17J61k10J27J00r4OJ68l76L13
6530H6j5p8M3m2K19l30K80m5o2r5O2P9j77j52K51k0J34q7l4n8R7p5L6%l0K45k39
$$ y = [74, 290, 257, 154, -67, 30, -107, 47, 356, -48, -54, -49, -34, 21, 70, -121, -8, -128, 123, 165, 94, 186, 169, -33, -114, -97, -54, 71, 137, 132, -127, 3, -301, 66, -102, -109, -330, -176, 53, -61, -97, 57, -81, -230, -11, -44, 98, 260, 45, 72, 56, 13, -10, 89, 9, 53, 153, -105, -26, 98, 66, -78, -270, 66, 106, -211, -48, 2, -64, -39, -191, -165, -206, -134, -304, -29, 92, -189, 15, 81, 49, -105, 87, 42, -5, -14, -161, -6, 180, 69, -51, 110, 32, -7, 8, 170, 94, 103, 51, 83, 34, -215, -114, 73, -10, -7, 90, -88, 146, 212, 124, 127, -78, 97, 87, 85, 197, -23, 64, 47, 199, -96, 5, 67, -51, -83, 112, 242, -13, 81, 236, 46, 21, 230, 117, 0, 42, 84, -62, 77, -37, -183, 78, -56, -7, -225, -113, -8, -13, 82, 236, -33, 36, 104, 218, 11, 86, 254, 311, 272, 108, -109, 52, -158, -31, 69, -25, -19, 149, -227, 86, 71, -7, 36, -6, 213, -117, 163, 118, 56, -39, 23, 102, -75, -227, 24, 4, 138, 51, 17, -41, 56, -19, 17, 17, -13, 232, -7]
6557gJ07k74j21J88K84j68m2J65k78K56m2Q1j49K3J77j43j63K16%R1Q6j67J6j25
6581A1K48l76l5J4R3m5K09J1k0m49L96l56M86l15n1J36J7j29J94k43L9L60k25
6604c0L6q4J83o4J14m9k02K14k88J85J6j21O8Q6p0k2J32k09J04q8P5j11J04J07
6628H6j98O3K32l3J49j91j28j3J5k4J11J76P0l46J11j69r3L77o5J00k03q7J68
6651A08j05J18l03QK54k27K39q1N7k3j79J07N9R8j7j73mP4j85j63L59K60l72L17
6675B26k79N6O8L2k24M3J8N2K33k04J37j82R8l1p6p6K87o5Kk92j62L59q0O9j59
6700a50J47J68j57%M1R5j80J17m1j5rJ63o8O1j06k7k17j3L40O8l11m7LK23k01
6725a16R5M3j42J65N5k24M5J68L7o5J6j6k56L64R0k75J9K19m28Q4K30k24L97m09
$$ y = [-7, 100, -174, -295, -107, 177, 9, -33, 132, -146, 110, 68, 149, 0, 23, 200, 57, -106, 110, 110, 201, 287, 120, 136, 11, 259, -117, -152, -138, -45, -90, 119, 130, 110, -339, 57, -299, 187, -128, -179, -43, -26, -155, 39, -204, -165, 195, -30, 6, -78, 105, 41, 155, 106, -96, 118, -170, 15, 31, -90, -22, 64, -6, -28, 104, -105, -1, -89, -14, -125, -21, 86, -112, -49, 183, 150, 299, 108, -20, -33, -18, -42, 69, 245, 315, -31, 80, -89, -182, 195, 130, 230, 27, -60, 108, 3, 121, -182, -174, 80, -147, 92, 11, 68, 45, -134, -27, 32, 130, 113, -60, -64, 10, -175, -338, 21, 281, -91, 226, -53, 3, 71, 103, -121, -78, -60, -8, 225, 21, 158, -24, 74, 43, -33, -109, 178, 113, 115, -177, -339, 20, -60, 9, -150, -3, 165, 8, 8, 49, 144, -36, 81, 40, 25, 16, 179, 111, 172, 66, 39, -178, -191, 149, 217, -94, -141, -138, 85, -116, -21, 22, -120, 45, 100, -124, -79, 89, 126, 61, 77, 61, -195, 169, 259, -16, 3, 222, -206, -122, 108, -116, 281, -128]
6749a28K26k39P2J4k54K61j67K41Q7j17j27K14mj07J29j5j10L17l70J34r3kr2
6772a30J02p3M7K0k11J90k79L37J15l9L3k95K34p3m28M17k0O6j0l5K3q1J49j9
6796D0k25L75k75J06O2j86k0M49l05K0j76K41J82j44J4l52K36j31q9J96nj27K59
6819A45l27Q4K61l27K86j00k65L24J22k37J57k17m9L21q1M4j8k68Q9J5j54M76
6841B81j97J8O1k85j08K35k08N39m07m5j18K88J00k19L5K7j1j55J52M4mj66k03
6864c46K59R3k05N24j61l98J89NKK21j67L93m01mq2J73J16j09n2j37j87K64j22
6887a32J27K27n70L97j40K58m7m80M31j01j48L35m1nL1Q3m26M10J4j32m8p8j04
6910a39K41j83l4k7L20j53k9K6l90N24j4j11j56N9K36j86J70m5r5J15q3k70K5
$$ y = [-128, 98, -141, -69, -55, -309, -48, -215, 26, 113, -4, -131, 83, 79, -28, 101, 86, -24, 293, -77, 57, -36, -38, -130, -28, -101, -54, -34, -245, -55, -334, 3, 118, 79, 112, -183, 51, -22, -450, -33, -53, 13, 3, -32, -9, -90, 59, 40, -185, 190, -85, 21, 83, -103, -123, 326, 21, 41, -135, 106, 288, 144, 158, -194, 42, -89, -178, 18, 13, -114, 145, -182, -98, 163, -164, 122, 22, -243, 81, 203, -34, 123, -94, -143, 178, 97, 141, 123, -145, -56, -41, -195, 281, 84, 102, 163, -122, -230, 5, -203, 336, -71, -116, -234, 54, 154, -65, -30, -3, -14, -169, -17, 27, 23, -143, -346, -87, 6, -199, 325, 164, -234, -45, -40, -38, 183, 16, 409, 8, 4, -78, 95, 211, 102, 50, -87, -274, -10, -132, -5, 222, -348, 49, -91, 167, 120, -360, 71, -30, -178, 157, 116, 111, 142, 225, -201, 209, 223, 91, 43, -35, -139, 102, -81, -115, -142, 178, 25, -4, 22, -368, 156, 142, 31, -125, -66, 170, -16, 154, 109, 14, 129, 46, -224, -199]
6933a99L33m22M32J7j67J10k0O6j48k33L58q0j56j47L83k3J34j36k29l9R3J47
6955G4j18N9j46K38m5j56j33L49NL5K7l33L01k16K02j03j71P3J36p6K1j1k62J93
6979e7M7j44J16K20j99j5P0k46L06j5k31L64l15L37j39l46M2J45L19k58j18M00
7001B83N1k44j98J31p3Q3O0n2k05O2O4J14J09p5L4j87n1j34L28%j38mJ6o8Q4J33
7027A23o2o8j29J30N5K7j92Kl0J02j12J55k26P9M6K6j14K56q5j25L12J41l62R0
7051C9l19J08L04j38k35K63k59J85J46p2p1n7K34j02O8j05L6M8j9P9p3K1j35M7
7075gR2J70j22o9q3p2PQ4j1Jj39K82k69L01q6n5M4Mq2J9j26j5K25j12qJ89j41
7102B1j79J72j35J69j75J71l2j00M05l47P2p8K42k94Q1J18k95J46j59J55j5m9
$$ y = [-199, 134, -288, 144, 161, -6, 104, 84, 150, 2, -231, 127, 47, -109, -256, 127, 104, 238, 102, -127, -166, -73, 74, -44, 15, -131, 107, 62, -94, -227, 122, 127, 162, 189, -144, 157, -59, 143, 40, -131, -58, 78, 2, 23, 12, -250, -57, -10, -154, -38, 182, -17, -32, 38, -208, 98, 83, -148, 216, -99, 238, 99, -247, -205, -60, 259, 1, -117, 283, 334, 90, -108, 23, -50, 33, 93, 41, -164, -102, -38, 76, 185, 110, 144, -43, -94, -228, 100, 100, -38, -42, -26, -94, -10, 123, 61, -7, -136, -6, 49, 76, -116, -114, -144, -42, -154, 1, -225, -146, -100, -74, -188, 68, -17, -142, 170, 311, -51, 39, -280, -172, 132, -6, -241, 22, -237, -52, 94, 22, -49, -106, 128, 26, 94, -11, 25, 73, 54, 133, 60, 81, -54, -7, 85, 255, 133, 64, -19, -91, -84, 0, -11, -10, -149, 133, -136, 165, 79, 24, 68, 72, -10, 9, -117, -132, 93, -19, -27, 162, 21, -158, 14, -121, 48, -127, 44, 12, -88, 317, -30, 42, -36, 206, -88, -7, 111, -184, -38, -197, -42, -57, -106]
7124a06J04K5m6j27K59j04K30l24J02lK17l89Q7MK70n1j84Q5j27J22k88K85l6
7147EL7j73O6L0j00j34k5O3K38J00j32L3r5J08J3J66l15m5L61m76L84j51n9L6
7171f5M7O0J3r9N9o5m8p2J73p2K12j90p9K20k40L36n51J98J99p2J62Mk58M0J49
7196F1k49J36p8M3K6j3k17L30N8r2J31n9l04N4O7J6l14M54j79k1M6J01j72N1M70
7221C46m37K45k49P5k37K05KJ01P3j67R7k19m3L14p3r8J72Pj77M3j95J2J25p4
7245a52K62j75J2kQ3J99k19J67j47R9J8j67J14j39l4L0K36k74J01O1k15J58P8
7268I4p4o5j86K95k23l2J33p2L13l92K33Jk7j43K25k10J23J70k16J76l17L34J3
7291A53k26J62p9kN6o2j52O7K12o8j78K73j94K51j62j8J80l66J54J48m1q4j90
$$ y = [-106, -2, 23, -23, -150, 109, 5, 235, -89, 13, 10, 227, -162, -75, -71, 199, 148, -36, 49, -78, 44, -244, 41, 5, 42, -131, -65, -35, -135, -269, -294, -231, 7, 107, -25, 8, -87, 21, 34, 200, -115, -160, 201, -275, 109, -42, -101, -65, -18, 42, 55, -44, 15, -50, -98, -170, 3, -69, 143, -47, -126, 94, -146, 190, -361, -163, 36, -36, 126, 130, -128, -88, 61, -188, -52, -130, -87, -61, -74, -291, 39, 97, 5, 136, 77, -227, -173, -106, -90, -404, 50, -129, -150, -104, -3, -175, -124, 346, -91, 154, -95, -20, -257, -52, -50, 51, 124, -43, 54, -165, -208, 106, 33, -65, 107, 114, -63, -20, -215, -203, -78, -152, 110, -65, -53, -55, 28, 227, 8, 175, 28, 127, 145, -22, 92, -47, -81, -51, 185, -89, 12, 73, -142, 16, 94, 20, -45, -231, 64, -159, -191, -58, -130, 183, -209, 24, 25, -2, -145, 80, -130, -7, 163, -53, 123, -194, 140, 153, -73, 89, 10, 8, 64, 2, -150, -83, 129, 61, -117, 156, -38, 213, 51, 33, 213, -153, 1, 149, 108, 24, -166]
7314a66O0N2J58k66L37k01q4J61j05N6M5J43m42L53l32J40K33k05J31J66m15P0
7336a11J69K91m37R7j28J29L3j50K23l17K85j47J88j16J63j77Noj34J55O0j89
7358a14L03k2J30j87o4r0M3M9m5MJ21k09J38K4j17J01R1k31K03k74J1j08K59J32
7382A48o7J52m62K30P3J26j72q8j09L17j54M5l9J61k27j13J34k10K64k5N5j24
7404h5m8j9N7K26j90j10M67k07k53L2K9J00k65J93r3J10p5M68m85p0K30j27k7
7427a42J40j64K00j0J23L3l12J05k88L80j50j14K78j34J39r1q4L80k04L1J6q5
7449D7j35P9J69m90P82k79j52J62n4k99J54k1R8j44P4K9K01m73K06k6j01j54J30
7472a97K10P6j65P1J72J15j14k24j56R2pL87k86O1M7J0J16j88j33O6n2J6J54j23
$$ y = [-166, -106, -54, 104, -162, 175, -26, -110, 51, -54, 2, 47, 190, -252, 101, -231, -91, 142, -63, 68, 234, -181, -111, 58, 349, -88, 9, -119, 10, 43, -107, 116, -201, 84, -63, 125, 9, 172, -5, 0, -6, -140, 15, 75, -114, 189, 167, 297, 110, 46, -44, -1, 48, 3, 7, 128, -81, 57, 81, -36, 65, 156, -75, 128, -146, -135, -243, 16, 148, 81, 233, -229, 1, 74, 200, 28, -60, -169, 148, -6, 39, 0, 161, -66, -179, -45, -255, 9, -16, 39, -85, -133, -152, -95, 131, -59, -169, 298, 91, -162, -130, -101, -1, -266, -73, -166, -56, -131, 337, -148, -218, 12, -115, -142, -2, -166, 34, 24, 147, 180, -132, -27, -315, 65, -85, -199, 79, -55, 84, -7, -91, 289, 85, 116, 132, 47, -88, -9, 160, -330, 452, 173, 21, 183, 129, -170, -16, -37, 61, -83, -9, 20, 221, -252, -46, -72, -173, -327, -197, 13, 89, -76, -5, 167, 282, 168, -56, -212, -120, -127, 260, -26, 35, 82, 92, 208, 20, -113, -47, -99, -83, 71, -52]
7496e2J0p9p4K20m8K3m6Q1k47L97j03j77J43j93N7k17K86k1j01P9M16j45j10l8
7520F1j03N1R1j07j3o1P7p3J3m2J27n7M9j7k84M31j32P8j29P1N9M4l12L2J90N0
7546I4Q4k74J51N2m38M93q6j69j46L8K71j77j47K20j03J40J52r7J55l20J11k08
7568b04K10J06J47l92l3K48j46K60l71M07j20m4p8J60m88K79N3n6j29kO9j09K81
7591D8m72M72O0m9J7l61J06M11j71nj27K76j21j45J22m8j83K10m4N7P0j38K3l3
7615b5QJ15j22j33K14j51l2R7k1J3J35k61J47n8j7n9J9J58k71K68J45k87Q5k37
7639b70M42l01J3Q4q1L5J54j23%P3j07L55l81j28M61p9l7j19Q9j96q9J61j63j4
7663b21N30m84L9K58j8l11K10j93J39K16k07k74L05L12m4k39k33K80J3p9Q9j13
$$ y = [-52, -42, -121, -195, 25, -23, 0, -46, 35, -212, 185, 82, -95, 48, -145, -88, -305, -19, -40, -141, -62, 354, 209, 99, 61, -42, 9, 100, -7, -20, -81, -4, -77, -64, -106, 21, -36, 13, -4, -288, 143, 11, 89, -40, 31, 90, 134, -178, -146, 44, 94, 178, -96, 55, 107, -331, 162, 76, -93, -239, -201, 70, -107, -254, -34, -137, 3, 155, 58, 213, -107, 4, -204, 6, 112, 259, -133, -166, 82, -64, 196, -175, 232, 112, 68, -10, 150, -338, -59, -6, -62, -191, -193, -124, -233, 48, -424, 48, 108, 59, 76, -285, -179, 232, 61, 56, -71, 205, 84, -61, 61, 13, -170, 40, -4, 53, 123, -15, 8, -25, -17, 98, -24, -157, 57, -94, -126, -29, -50, -37, 98, -163, -16, -74, -91, -150, -131, 27, -244, 24, 169, -118, -33, -270, 172, -129, -116, -32, -113, -78, 76, -47, -47, 26, -81, 274, -107, -235, 226, 147, 110, -9, 80, -116, -205, -44, -207, -221, 309, -175, -136, 122, 104, -207, 3, -190, -51, 165, -42, -316, -11, 301, 257, 18, -215, 65, 78, -1, 88, -25]
7685b5K76l08pj53K09J79j54mp0P4l12M88l7q1k40O1M61m49K08n8L6j89K02p1
7709C6j04J37MO3j15o0j8J80j58K57k97k67K91L5o6J01j82J25N6j73J87l1N4j41
7733h6M5o9J17Q1k4L6J80k09j03J66m9j62R0r9J34j38l0K16j63R6l93L33J13k21
7757a39n9L70j53Q9m6oj3k76L69J02j76R3j03K5m1o5J53K9j13J1K5N3j00Q1kl4
7783G4j55j7N4J1J04j32J64p5k19J60J80j02m3m3J87M9k42O7N5j24K2Pj06K99
7807A75j31J15j74p7K2J99N6k47K8j67L90j62J95k50lm2j14k4J7K57j95L29m53
7830b56K99j33J89m0M6KJ58k94N5J82l10L77j42k51R0L7J08k36L7l6r1RO3J50
7854A3J16k7j70J03l5j70O7O9o2K53J6k64J87q6qK60l17J28JL4p9j22j63L79r5
$$ y = [-25, 251, -57, -64, -217, -8, 171, 17, 13, -57, 17, -295, 193, 156, 75, -165, -104, 357, -92, 116, 58, 94, -95, 107, 36, -68, 69, 73, 136, 21, -39, -57, 123, -35, 222, -75, -342, -51, -16, -82, 19, -163, -38, 18, -155, 32, 1, 55, -86, -41, -110, 7, 88, 64, 100, 280, 71, -32, 134, 85, -77, 13, -86, 48, -90, -120, 96, -67, 29, -364, -31, 82, -139, -198, 172, 19, 108, 62, 56, 43, -233, 136, 238, 62, 155, 52, 77, 36, -29, 124, 153, 40, 51, 76, 129, 29, 110, 108, 74, -81, -98, -44, -33, 71, -61, 103, 28, -191, -31, 149, 47, 4, -39, 148, 197, -45, 22, 77, -47, -25, -18, -124, 175, 44, 159, -15, -92, -70, 129, 185, -62, -34, -201, 189, 27, 222, -28, -31, -73, -187, -211, -194, 63, -132, 197, -256, 43, -90, 99, 59, 105, 107, 265, -29, 26, 208, -102, 275, 133, -118, -28, 9, 117, -119, -82, -118, -209, -200, -137, 13, 129, 102, -68, 35, 0, -170, -103, -34, -96, 157, 173, -91, 96, 10, 2, 262, -55, 73, 74, 108, 29, -93, -256, 123, 28]
7879B8J14l29N3J63k81K47j50J69K7l41K07K69l85M88k34J63k07j37K26k93K94
7900I1K8l70L95j15Q7k00mK55k02K19o4l07J53Q4L98l51l33J27O9n4j73L43K44
7923C20l75J87n1k30K64j4p5R7n9Q4o7k93K88q1K04j0j74l78J77K43Pn2oM0J87
7948B33l99K18j38o3K85r4M6p1j9K38n0j2j84j37J01N3j1Rn8J80m06J07L22j56
7972fJ03J19k72K28k28K24q6p8j03R3mK1p8J05j24L8r2J85J1l51M17P1l74K60
7996G9R5n5n7p0p4K75k12N3J51j58Q6j90l3M01l12O8k47L33l71K66L5k58j7J27
8020h5N2M3J07j23K7l52J13O3p2K53N2k7J26j55r4P7p5j57J2J64km8M0R4k09N3
8046a23L13j82Q6N5kj26j0J2K5J04k60P5k61M29l69J04J22K00l1k66K24n2j71
$$ y = [28, 142, -187, -134, 29, -252, -5, -155, 14, 41, -300, -93, 176, -209, 279, 45, 208, 1, -136, 90, -203, 91, 119, -251, 144, 29, 116, -84, -88, 167, -35, 184, 120, -187, -34, 50, 448, 97, -236, -109, -40, -94, -267, 76, 320, -55, 132, 81, -149, 115, 101, 26, 123, 64, 148, 81, -212, 76, -5, 199, 189, 15, -363, -186, 57, 64, 12, 6, 46, 233, -166, 52, -86, -149, 136, 42, 88, 17, -2, 236, 186, 174, -10, -147, -46, 7, -4, 5, -53, 127, -279, -172, 150, -6, 97, 216, -56, 172, -56, 168, 82, 4, -99, -6, -10, 11, -67, 38, -86, -48, -140, 45, 56, -295, 122, 193, -181, 79, 174, 119, 62, -8, -82, 193, -19, 34, 185, 27, 113, -77, -110, 291, -21, 47, -200, 133, -238, 28, 63, -195, -212, -85, -33, 10, 117, -6, 21, -331, -218, -155, -227, 26, 78, 51, 177, 22, -72, 5, -70, -227, -215, -51, -53, -101, -61, 33, -176, -123, 190, 8, 94, 149, 147, 21, 11, 23, 48, 152, -108, -33, -294, 135, -234, -130, -8, 192, 161, -105, 119, 67, -104]
8069a04R0q7m1J99j04K2O2L1r5K54l3j61KJ47k46Jm3K90k97J62kl8P1j5l74M86
8095A77j15J19o8j13j18J31K35j82m3j28J83j23J33l31M39K8k53N0j45n7mL58
8117A73o2Q3m77J47PQ5J38n4K69k29Q3l23O6K19q4j22j25L19j22J73K43n38M2
8140h9nk2j31M44j19k59P4k4J60j69o9L05k14J02l9j8J04k20J37K74k04j8J64
8163A64m57M72k89P8j03J4R2K92l65J90q4J12q8Q2Q8k28J36n77L00L21l54K55
8185E1K52l22l4L17k37j13
$$ y = [-104, -14, -101, -142, 57, -47, -25, 37, 68, -27, 227, 194, 33, 35, 182, -64, -63, -106, 184, -113, 49, 47, 9, 80, 65, -309, 177, 62, 181, 113, 0, -118, 13, 248, 66, 23, -105, 78, -45, 88, -243, 196, 224, -29, 21, -124, -181, -185, 173, 111, 194, -283, -136, -129, -44, 94, 40, 309, 80, 163, -160, -94, 125, 41, -81, -206, 113, -9, 164, 407, -131, -89, -94, -116, -247, 197, 78, -181, -107, -131, 29, -140, -209, 96, -118, -16, -55, -73, 31, -189, -52, 222, 18, 0, 164, -293, 179, -110, -32, -135, -121, -29, 263, -102, 88, 4, 116, 28, 110, 198, -30, 106, -471, -171, 150, -204, 51, 303, -19, -53, 264, 27, -86]
8191h6
$$ Imaginary data points
##PAGE= N=2
##DATA TABLE= (X++(I..I)), XYDATA
0@%%%%%%%%%%%%Qj6J6j6J7k5L2l7M5n1N9p2Q8j01J16j35J54j75K00k29K60k94
34a56L31l72M18m68N20n78O44p16P94q78R70j071J182j302J433j580J742j918
52a005K113k333K583k863L179l544L973m482N096n856O823q098R861j2465J6700
67I682k4699M4776j83795l11577N41544K87791l66769k42250K32131J42680o6520
78F2994n0152o6232r4431J47768K23938j25949l09783O6675L24557M760l14876
89a30731p8059K52775J38913j51385j42117L8209R2733M0860k3681r9085m4506
100a06074J35794J13109j35507j41846J08646J18399q4315n6202P1896j3534n6480
111d6114R6558M9832j76466o7308K18730Q5512k17486p7816J94707M6024j63392
$$ y = [0, 0, 0, 0, 0, 0, 0, 0, 0, 0, 0, 0, 0, 8, -8, 8, -8, 9, -16, 16, -21, 24, -27, 32, -40, 48, -53, 63, -72, 82, -93, 107, -122, 138, -156, 175, -197, 221, -247, 273, -305, 339, -377, 417, -461, 509, -562, 620, -682, 751, -829, 913, -1005, 1108, -1225, 1358, -1505, 1674, -1870, 2103, -2379, 2717, -3139, 3684, -4414, 5447, -7018, 9682, -15017, 29759, -154036, -465613, 75931, 363722, -3047, -245297, -13166, 129514, 62994, 12842, -53390, -147821, -53, 223885, 97936, -211847, -145172, 179385, 184145, -130731, -208790, 43985, 182898, 31513, -110604, -72395, 20338, 61198, 37517, -61568, -106074, 29720, 142829, 7322, -134524, -25878, 92521, 8206, -47996, 23900, 10366, -46114, 50444, 100276, -76190, -143498, 75232, 160744, -56742, -134558, 60149, 106173, -57219]
122e7219n464J09584o0111n6483J41809K9685k08357k3469K37887J9894k41510
133a13754k2762K24771M0799j71673m8249J00327L1280l6392Jp252l0758M1830
145H168O8800n7747j10632M6726J31166k8665j26672J8880J07989j7872q1155
156d1014J3603L4398j8588J8370L1702n9039l5166Q5297K2958j02952m042J09437
168E4964j5499r4851M4072P8657p1758o7311Q5899N4930q3115l5602P5160J6535
180D2081o1523L16L7873k7088j7431N7601P420q4100q737J00959J1484j13231
192e4376k1030J12855L5348r3535m0875O1813L4372k6936j7449n615l129L6561
204A8004L3883n4860o3083N7833Q2850n0226q9547L9463Q3104k4902o4768Q675
$$ y = [-57219, -62683, 46901, -13210, -69693, 72116, 101801, -106556, -130025, 107862, 127756, -113754, -136516, 88255, 129054, -42619, -90868, 9459, 40739, 4347, 4348, -2904, -33662, 8168, 76968, 19221, -91411, -44685, 86481, 57816, -68856, -49976, 58013, 40141, -41014, -27411, 6987, -11601, 6769, 38471, -20568, -55734, 29563, 52521, -50431, -54473, 54964, 39465, -55386, -11314, 67343, -4415, -71726, 14173, 69103, -14012, -49614, 25546, 42081, -19442, -19126, 18747, -8341, -25772, 31829, 39249, -44851, -53588, 47371, 58855, -54376, -75406, 37449, 72797, -20738, -61613, 200, 34572, 7636, -9813, -15428, -18557, 18004, 51887, -2973, -66056, -8223, 74627, 24401, -65146, -25683, 57421, 32519, -32249, -23574]
216b3574L0312m16P689k204m2551k96O7544K501q2483p290Q2213J1265o7871q761
230c3922M8121L844k7569N209Q957j3518O710K5114j2185l3648J3282L7036j1624
243A5807l7747J1459L3319j2726k6191J5289J4221k3255m003L0052o782l4452
255b5009J3978L4581j9718l0418K0966K2176j8857r544J7305k925j3865J5630
267D300J3137k5040j1424L2063J2777l4380j3143L3436J1655k9313r467K2342
279F943M274j5180J903N496j0805J964J7834r223k5198J4130K8621j6238k9175
292b4654J5491K7498j2555k1547R495J5226n342n846L116j922q74J0206J964j6880
306f624l434K1665M954k4282o831K3587N617k1334m727J5721J098j0537L116K806
$$ y = [-23574, 6738, 6322, 14011, 11807, -30744, -31040, 36504, 39005, -43478, -50768, 31445, 42710, -25161, -33922, 14199, 18043, -9526, -4317, 4640, -8878, -2168, 22946, 10761, -22887, -9605, 27431, 15807, -21940, -10481, 22838, 10112, -16079, -790, 13431, -9824, -13827, 16225, 9443, -25009, -11031, 23550, 3832, -26586, -5620, 16556, -2301, -11845, 5460, 2535, -11330, 4300, 17437, -7603, -19027, 13036, 25813, -8567, -21710, 11726, 23381, -5932, -15399, 6943, 11217, -3963, -2060, 3436, -7369, -5405, 12429, 3206, -21992, -7862, 20759, 4521, -24654, -9163, 18335, 5780, -15767, -6272, 8954, 3612, -2234, 882, -1040, -1914, 8292, 10256, -6624, -10058, 11607, 16561, -7721, -14552, 9035, 14652, -6682, -11409, 4312, 5410, -5127, -2011, 795]
320G95p582L352J0560q445j1924J1433J3404j2010j2011J1801J1391r612q299
333g147Q482N990o407k882O071q18n096M028M588p705m135R318K049j1738r97
348f399J1119j317j0550K490Q128m171n175N006K370n408O14N785j606m866L284
363f96M918k964l881M070L024l504j148M245j269m928L400M870o317n282P284
378A822M580p712m886M742L188k174k080j220O91L681Q44m600k608M145M773O3
394C249n052l283O295P547o035r375M491R542o49o654k289Q78N509L695r850q040
410a0021J0698J0456j0489r876O544N435m190n45P46m445L081R826m428j2979
424a0187K804J3877N58j0682k541Q458O286m322r415K32R919K227o997j195M557
$$ y = [795, -6787, -3435, 7125, -1320, -13244, -1811, 11593, -417, -12428, -627, 10764, 1152, -7147, 1335, 7325, 918, -1964, 4107, 3289, -1807, 2221, 6809, -896, -5031, 4287, 6336, -5402, -6399, 4720, 3403, -7147, -4657, 3471, -700, -5875, -869, 1501, -3907, -3293, 2492, 886, -3980, -696, 4222, 1258, -2623, 1447, 4471, 967, -181, 4064, 2795, -2133, 1267, 6137, -180, -5462, 1822, 6402, -1310, -6196, -1454, 1734, -440, -2520, -3740, -3049, 632, 1476, -3124, -5732, -1587, 3186, 3249, -1803, -5086, 1209, 8756, 2721, -6654, -2163, 7379, 6730, 76, -2213, -1335, 4174, 7869, -1981, -10021, 677, 11133, 644, -9232, -2688, 2747, -1443, -1988, -1242, -5687, -2606, 7220, 2792, -10187, -7383, 6494, 7052, -3630, -6171, 2287, 8573, 4251, -5164, -4932, 4987, 7214, 217, -978, 3579]
439C579k095k888L727r96q671L679J3005l922j5641K131J4216l062j1991J211
453g718J0249K245m613l192n92K727J255j712K547M459m804l604R601K29j7276
468a0199J098K3267j094k3709M942K0875j0343j9429Q860J3722p764n399P967
481B794J476r198l077N892M542l055o844O908J2911q690j8914R595K0044j2981
495A403j6361K0080J5463k1805j2455J9369M110j8882J579J8464j044j3611p43
508d433O230n33n552l486O003R983m015j1680M887Q833j3835q328K2414J0071
522A6559k4102n554K8690j607l3214K769L2726j282k4319M200J8411m910j5754
535g387l11Q391L159l071K85O000l718j4965K918J8516p288k2128J6207K9294
$$ y = [3579, 1484, -1404, 2323, 1327, -7344, -3665, 9340, 5418, -10223, -8092, 6124, 3062, -8929, -7718, 2531, 4776, 163, -3029, -3621, -894, 361, -1351, 1196, 5655, 851, -2753, 6848, 7077, -10199, -9101, 14166, 13072, -10637, -5695, 15180, 4837, -14592, -5732, 7990, 226, -5173, 2794, 4270, -4928, -8005, -2113, 2429, -626, -7470, -562, 12349, 3659, -15255, -5660, 14384, 1403, -14958, 5122, 20585, -1220, -13675, 5694, 9804, -9078, -7499, 10965, 9921, -3690, -4433, 1797, 1264, -4288, -7774, -1771, 8212, 4197, -7483, -2596, 6237, -7598, -15926, 6488, 16559, -7543, -13097, 15593, 13986, -19228, -16459, 16267, 14985, -9334, -5134, 13277, 8367, -7387, -7698, 693, 3852, 781, 1066, 7066, 3348, -11617, -8699, 9817, 2529, -19599, -3392, 25902]
549B5902k1017l1704K1005K4930k3187j6256K5433J2864j8459n006R118m261n960
562f598O931M990M63o84n876j157Q255o077j4751J1529K0278j3490j7229J6716
576C300R104k3878o673K4451M035j8554K684J7054o551j7679J827J4657M611r093
590g05n238J0294R513j3191j4566J1354J2875j0194m087J5228k153k0150N617
603e403J7466j4070j6541K1230J8621k1618j6896J6417R650j3735n820Q975N282
616C558Q76r09p129k407N687Q40l194N978K964p930L001Q306j1165j1777J4072
631G71J2621j2172p561J0771K417j0116j804K872j031L845N195l960n400K0o58
646d190J590N300m729o451J2517J0304j7316j2634J6107J0957j3317m471J1482
$$ y = [25902, 4885, -26819, -5814, 19116, -4071, -20327, 5106, 17970, -489, -5495, 3623, -638, -6598, 333, 5323, 5786, 5102, -774, -1931, 6324, 247, -14504, -2975, 17303, 3813, -13416, 3300, 12404, -11474, -18147, 6304, 10339, -8215, -5531, 11523, 4972, -12707, -10880, 3777, 8388, -705, -5943, 4351, 13864, 673, -13893, -2539, 10336, 142, -3945, 11283, 9130, -11020, -5403, 12063, -2007, -18548, 2682, 21303, -315, -17211, -794, 8856, -4879, -10699, -1724, 3558, 4434, 3525, -3604, -6011, -324, 516, -2678, 3300, 6264, -1666, 1335, 9641, -1524, -13301, 771, 13392, 1220, -6341, 4430, 6847, -3269, -5073, -2201, -3232, 613, 5808, 1848, -3552, -3532, -4190, -2600, 2700, -2029, -8480, 4037, 14341, -2975, -15609, 498, 11455, -1862, -6333, 5149]
659E149J171n475K021k736q361O942J2569o472j2361M690R443l096q256k839L814
674c797Q617J945j0601n434J0640N239j0787m945Q403O125j871k899l380p42N879
689B392K587o555k574Q062L788o156m010J528Q69J866M89m040l05N927k52q877
705e261o44P949m18n263K357L267l154q68K334j950j786M756J518l974P07L656
721C226k667k504K751J699j687O47J337k388o93J818j495k054K446J321l060K7
737a276J915j359k011J728O40j495J088J248j630m20J976o96j080K606P52k446
753d60K02K812o91k243O68J308j58K65n66j655L36J836n90l092M00K432l0j994
771a220j141O18J721M76k278j249K466K070j239k675R85K548O80j864q99J493
$$ y = [5149, 6320, 845, 2866, 130, -8231, -1289, 11280, 4808, -7553, -2863, 6580, 3484, -4772, -7611, -3797, 4820, 6765, -3836, -9270, 1370, 6609, -4178, -9123, -720, 5405, 3534, 635, -2745, -3487, 2392, 4979, -1576, -4150, 3912, 7700, 1544, -2466, -938, -69, 1797, 2286, -1754, -2059, 3868, 3616, -5261, -5905, 2044, 1626, -3637, -1280, 1987, -1167, -2035, 299, -1651, -3437, 1319, 2837, -1137, -430, 3226, 559, -1945, 806, 2505, 818, 1465, 2802, 414, -279, 1539, 44, -2010, 436, 1757, -1303, -1276, 639, -720, -2731, -1003, -363, -1858, -770, 478, -1152, -1572, 404, -292, -1372, 1234, 1986, -460, -258, 2554, 1863, -380, 288, 1596, 1438, 1703, 1137, -518, -182, 1654, 1064, -2028, -1628, 804, 774, -1220, -2361, -1743, -22, 454, -1824, -3073, -607, 1463, 224, -2451, -1466, 1082, 1762, -102, -1001, 492]
787D92J781l77j785k59J196J378q01k191o2J696K90j616j213L47J645k11j598
804a288q97J510J350j702j542J833J470q98j247J024R49j59P4l31L33N12O37o21
822A007p35N75J026o76j236j49R60L10j349q20M77P76m26r68k62K47R83M1j447
841a666m62J743R07j166l20Q55L25k09J182k13j388P62K031k60k585k23K574M70
859B357k492o24J146J69j94j52r67j403J580K019j715k955J284K941l07k836N7
876b092K305N99r8j027j141J149L154m4l267j657L716K808l152l834J788M063
892C270j225l395N61Q42r39J167J421m010k195N893L045o786l586N943L610m081
908d65k533K154J316Q51M09k641j696L460L009k408k586R71J772J036m79l912
$$ y = [492, 2273, 1896, 111, -148, 1048, 2426, 1625, -566, -628, 1068, 1358, -258, -1471, -1124, 521, 310, -1288, -2185, -675, 675, -1027, -2569, -736, 734, -164, -1411, -387, 562, 403, 477, 146, 479, 991, 1628, 1007, 272, 847, 1873, 1197, -39, -188, 772, 1082, -267, -1087, -610, 166, -260, -1228, -1490, -1243, -260, -219, -1666, -2128, -385, 522, -644, -964, -109, 216, 7, 1189, 976, -412, 350, 2381, 2121, -464, -687, 1887, 2357, -135, -759, 387, 556, 362, 210, -757, -2160, -580, 1439, -276, -3231, -1947, 994, 687, -2149, -2092, 213, 812, 714, -313, -1454, -305, 2849, 2805, -462, -2119, 1597, 4405, 1253, -2581, -793, 3270, 2045, -1350, -789, 53, -886, 281, 1702, -2308, -4503, 1390, 4435, -2351, -5937, 6, 3616, -465, -2998, -844, 472, 1323, 1732, -909, -2605, 855, 3864, 1456, -1130, -159, 1613, 2649, 2170, -1742]
924a742j353M529L870m526n682K744N140p75n898r66M746L244k966l865J300K632
940D32j312Q31J494l112j598P392L172j1331m901J3011O310j2540m929J1293L308
955G520r243j755N516k082k234N586N55p661r85P162O07o746k237N730N207j889
971C051p678j251P792K445o878j746O337K024l556k31L19l002R81N251P0n240
987a312k23M158J214l736n986J382R992J517j1625k844J1886J269j3007K26J1814
1002D725l108p266Q515M281j3569k748J5809P98j5800K028J6822k026j3922m62
1016e923Q777Q76m189p08K967J579j940k576K80o92k788L408P569m434r015M777
1032b032Q156p285q087O715Q131l058l599P13j016J052J703l173j470P036J930
$$ y = [-1742, -3095, 1434, 5304, 778, -4904, -2160, 2980, 2205, -3693, -4659, 87, 3331, 365, -3500, -2200, 432, -880, -49, 1445, -1667, -3265, 4127, 7299, -4032, -8933, 4078, 10388, -2152, -7081, 4212, 7520, -1723, -3478, 2038, -44, -2278, 3308, 3863, -3798, -4783, 2379, 2986, -3760, -5997, -267, 4940, 3051, -4627, -5878, 1914, 4359, -2519, -4265, 2072, 4096, 540, 309, 628, -2374, -1393, 3858, 3928, -1312, -1535, 2623, 3837, 101, -5885, -4503, 5489, 7006, -4619, -7463, 4423, 5692, -7315, -7089, 4725, 1617, -5649, 2866, 7147, -6422, -9170, 6639, 7437, -8363, -6335, 10487, 8461, -5461, -5923, 2854, 3730, -459, -1167, 1800, 3379, 1439, -1137, -857, -1549, -4337, -929, 6640, 2206, -6809, -2032, 6124, -1161, -9248, -2533, 5598, 2540, -1059, -346, -1362, -310, 1393, -1780, -3250, 3786, 5716]
1047E716n873n5K871o185j614J1157L94j2754K801J3962o992j5213O576J2734
1061G525o736p398Q562L708q778j847O281j748m706M101O817j969o769q93N862
1076B012J278n989j931Q487M144q216l020N505j077n869M311N537n630j846O841
1091D537j955r651K608P073k690k245M490j049m454L624J394p710J508J0755k257
1106C978q348N067M834q177k927Q243J162o123L820N102o170n899N081L056l696
1121i97j418M124J652k371l737o8K152j59j935L106L658m403l312M860O61o766
1137d953J799Q629k326p040N064L934p033k633P353M9n464M150N057p229m071
1152d714O347M76n872K421N613l955l579L782N22n205J257N223j996k718L198
$$ y = [5716, -157, -212, 2659, -3526, -5140, 6017, 6411, -6343, -3542, 10420, 3428, -11785, -5209, 7525, 789, -6609, 1953, 5661, -3117, -4964, 1317, -431, -5137, -1036, 5781, 3812, -2957, -3850, 2012, 3290, -2699, -4630, 3857, 8001, -215, -3235, 2270, 1193, -4676, -365, 5172, -458, -2304, 4537, 2582, -7069, -4461, 2612, -78, -2323, 2167, 1118, -3336, 288, 1682, -6028, -4520, 6235, 3978, -4370, 697, 5531, -2646, -5573, 2670, 3832, -2291, 1529, 6631, 461, -5438, -357, 2699, -997, -2415, 1709, 3361, 990, -2747, -2815, -663, -822, -2757, 349, 4007, -396, -3708, 1152, 1813, -4953, -3154, 5475, 3149, -3891, 1173, 5107, -1926, -4559, 2794, 2843, -2621, 1529, 6586, -643, -4714, 1633, 2109, -3763, -1342, 4271, 316, -3263, 519, 1041, -4164, -2907, 2316, 320, -2398, 800]
1167H00J642m204j109K840R16l88L34Q01r0j329j254J345J190j772m20L727l61
1184B668n081J032M054l656l571N598K787n974q97N673k396n575M376M640n366
1199a688j830O774l02o675K099M959l293k873M816J958m688o01L218j109k526
1214a761J873K401k123j547J231R49k053r48J570J425j484j031J850L47k482R5
1230a688K729n64k195J662K792k730k348L584J044l583j1M620j614l726K801K418
1246C191l945j340L987Q2m190J295L029k221k855K994J449l144p3K925l91l045
1262b252J256K296j539j527J895J666j600r91J797P08k078j94K256Lk530O67J821
1279A654j069k155J944J304k290o70K073Qk516J29K599j323j743J449J567j614
$$ y = [800, 2442, -1762, -2871, -31, 885, 497, 831, 1632, 1542, 213, -1041, 304, 1494, -278, -698, 3029, 2668, -2413, -1381, 2673, -983, -4554, 1044, 3831, -2143, -3040, 2633, 237, -5338, -962, 3678, -1688, -3518, 3256, 2954, -3721, -1622, 3337, 44, -2829, 1987, 3945, -743, -1344, 1874, 765, -1761, 112, 2513, 390, -1157, 74, 1023, -1030, -1978, -408, 1017, -467, -1498, 352, 699, -1783, -1688, 1041, 477, -1718, -56, 2736, 6, -2342, 1242, 2286, -1297, -1308, 3312, 1698, -2028, 773, 3191, -754, -2094, 1893, 1975, -2215, -920, 2109, -112, -2967, 27, 1476, -1668, -1741, 1184, 793, -2252, -996, 1300, -239, -1766, 129, 1795, 195, -796, 1001, 1709, -369, -563, 1693, 1696, -834, -167, 1654, 585, -1570, 374, 1678, -612, -1282, 791, 799, -1717, -1588, 1011, -312, -2055, -606, 961, -653]
1295f53j042K156R3j476K00K136r13j674J822R80j854j09J587J00j856K75J468
1312A240r89j018J194N14j892P6J412k13j839M84J535p05j628J135J178q21j222
1329a559J594J095j933N9J899m25j434N80J771p85j619P60J667j346q12J072l4
1346E50q68k04R43j42j023K67N29o07l58M32J47k37N3P6K15l36P31J88p77J39
1366b82J018n2p28L85P13o39j79N61J40o13m20M07Q7n72j23N04J58q52m66P03
1386b50J37o68pP74k55k93J43M71m01K92J58Q8K4L39j23k73P53k02j000M25J181
1407A313m10j292P82N90j122r60J242J35j321N58N28m76k00l20J85L21Q3j83n2
1426e99J481n23j618Q36J773j414r13J801J096k225n39J903j34j615L52J926r27
$$ y = [-653, -1695, 461, 554, -922, -722, 1414, 501, -1173, 649, 1629, -225, -334, 1253, 1353, -503, -228, 1240, 251, -767, 427, 941, -951, -875, 537, 324, -1515, -1031, 504, -201, -1829, -694, 484, -337, -1559, 35, 1130, -803, -744, 1155, 730, -704, -124, 1647, 862, -757, 3, 1670, 324, -488, 584, 550, -318, -522, 421, 279, -744, -477, 52, -555, -913, -481, -334, -571, -518, -442, -227, -563, 168, 356, -421, -282, 736, 684, -44, 341, 1054, 415, 236, 797, 937, 324, -96, 311, 398, -174, -297, 207, 365, -487, -953, -250, -113, -781, -788, -14, -269, -562, -419, 52, -349, -57, 101, 189, 213, 552, 429, 156, 909, 707, -293, 132, 1313, 903, -389, 393, 983, -139, -1099, 143, 278, -1043, -485, 43, -433, -633, -953, -768, -447, -364, -547, -599, 882, 359, -1259, -423, 1350, -64, -977, 824, 1920, -305, -844, 1059, 925, -690, -338, 1588, 661]
1443F61j133J25P35k74r11m98J246R43j342j509J721J220k892n28L487M63l143
1460a629Q31L155j975l003K879K049k142r47K271M63k002m42O23P9J13J47o38
1477a68R96R5k213q55K527L84k837J066L482k206l372K748J927k961p08L539O98
1494B142k338n55J650o46n49K44M03J376j66k257o7K544j601k884K977K921l803
1511f09k019M435K3n327O62M923j545k634K246J815l145r63J914N21o87O55O93
1528I58l01L41p54j857J382J927k021k52L373o83m196O61K769j592j954L088J291
1545B180k416j145J759j035j139J083O51L18P77p97j729J240P16k277L93M158
1561B737k70l975J435K919l587k315M349J673l945L85L883k598l689K293J770
$$ y = [661, -472, -347, 388, 114, -797, -1295, -49, 894, -448, -1957, -236, 984, -1908, -2436, 1051, 1514, -1629, -798, 2357, 382, -2621, 258, 2307, 165, -782, 1489, 1952, -50, -492, 131, 210, 323, 470, -168, 828, 923, -1290, -2145, 382, 766, -2071, -1005, 2477, 271, -3101, -353, 1574, -1387, -2095, 1444, 2142, -196, -751, 899, 253, -296, -52, 351, 1727, 1561, -696, -763, 1781, 180, -2704, 273, 3194, -609, -2628, 1807, 1830, -3497, -2835, 2088, 543, -2091, 155, 1970, -1175, -2138, -224, 297, -390, 265, 958, 657, 998, 244, -1613, -231, 1696, -325, -577, 2796, 2113, -2083, -1422, 1347, -245, -2199, 889, 2180, -236, -1381, 378, -657, -1796, -713, -62, 256, 1033, 236, -1493, -253, 463, -1814, -1421, 2737, 2467, -1508, -73, 2846, -741, -3056, 1293, 2966, -979, -594, 3289, 691, -2998, -705, 1065]
1576A065k156P6K636o43k102N07k38j018J386J104j281J155J350k329r77J880
1592D15j4j927K078K495k452j249K058j208k162K345J507j845M41J411k231j683
1608b021K098j4k443K422K442k815j466K434p09l398K157L649k084j568L102l14
1624A472l445M11K931m91j649J673J253k031o22O38p9m91Q65L86k23j51q18p03
1642a074J78Q58r65M11J885j146j515J468M55k170M36K630n90j798K043L21k887
1659a460M3K913j055j439K731L21k886J43K319k222j253K698Q09k661L45K263
1675A609j943j990J929Q65j493O00J473j115j058Q20J06m69O49M28j13N60j55
1692G03j374P19Q12r67j39J490j55j575L06J005j238q82K012J80j636L7J878j869
$$ y = [1065, -1091, -1015, 1621, 978, -1124, -617, -855, -1873, -487, 617, -664, 491, 1841, -488, -1465, 415, 401, -1526, 552, 3047, 595, -654, 1404, 196, -1966, 379, 1886, 41, 482, 1893, -338, -2021, 77, 63, -2380, 42, 2484, -331, -1797, 637, -72, -3470, -1313, 2336, 252, -1316, 1786, 1472, -1973, -1562, 1369, 878, -771, 902, 2155, 124, -498, 140, 61, -430, 435, 821, 598, 447, -371, -1074, -896, -38, -1003, -592, 1293, 147, -1368, 100, 555, -1615, -1179, 1451, 861, -937, 1106, 1427, -1460, -1417, 1496, 441, -998, 1733, 2054, -832, -689, 1630, -592, -1845, 853, 1662, -999, -654, 1609, -334, -2324, -395, 470, -1023, -423, 1050, -65, -1123, -303, -197, -666, -17, 411, 298, 858, 703, -671, 48, 860, -107, -246, 1244, 1089, -486, -180, 825, -413, -1295, 717, 897, -739, -702, 1176, -693]
1710f93j085J243R28j162J19J742j115j283J154Q26j143lJ659k15j606Q38Q22
1727A026j238k60J476N6j217J31P63n76o69K88J34P3l32K28K4j06r6k47P61l29
1747a10o11P48M25q20k31P61L06j093N74J152p63p95J364r4j332M78J102r37o90
1766e66Q21N45j228n58J477m31j077M75R73o33o12N77L40o94p4N26O24r94J38
1785c71N96L13p82L96M94j73o76L14M38m22j05K50m3o44Q9Q21m16o20K93L59m59
1806c48L2K69j29l31K1O08n03k79N42P43o28m31J399m72r10N28R04n21j041R71
1826D24M43q26k86M75K68q41j22R94l50p88K48M42k22q90J035M94o93n85N35L08
1846F3l61r3O99k84k98N38R8l08k9M24J6o20L02M76o42J8P1L03r98L54N44r8r80
$$ y = [-693, -1778, -535, 393, -769, -650, 1092, -23, -1306, -152, 674, -469, -472, 1187, 972, -634, 204, 1026, -212, -472, 1004, 1060, -157, -26, 737, 161, -508, -220, -86, -13, -345, -117, -93, -199, -295, -542, 219, -110, -721, 27, 452, -368, -599, 162, 468, -625, -51, 1101, 338, -457, 907, 813, -519, -41, 1061, 124, -566, 255, 800, -428, -986, 491, 60, -1017, -542, 431, -202, -814, -237, 103, -591, -665, -139, 485, -509, -371, 225, 538, -244, 152, 646, 473, -203, 111, 549, 127, 22, 272, 229, -415, -326, 495, 79, -541, -248, 111, -348, -316, -47, -176, -507, -486, 122, -381, -660, -118, 625, -3, -434, 965, 493, -417, 111, 1015, 494, -547, 424, 867, 41, -245, 230, 498, -343, -465, 529, 179, -609, -361, 81, -141, -1031, 4, 498, -195, -780, -245, 63, -298, -391, 308, 24, -274, 264, 362, 54, 25, 449, 465, -155, 147, 623, -19, -1, 70, 373, -625, -271, 273, 175, -805]
1869h05J88R26o38m26L12P98o07l33P12m1o40J03Q93k73m79K16N18R6o85J87M47
1890D69k19l73L18J45j60j98N5L21l27n1l4P7k58J93l71q1K91K77k08m31P29R2
1912B56r33K67J247n51q51J061N86j214l29J080J09r33J56P13l70o34L07K95J3
1931B75m29k67M17M4o98k85N87M52o76P2J067l00r72L39Q26o16k32R60M61q84
1951A41n79O47J07j96nJ98l79P44l46p55K56L78r48j26J364j32j295L10J018q77
1971d75r75J549P53j072l32Q77k45m00R4K68J19o1J26j89K10po28O8R56Kj443
1992h05J162R24j674j027J434O07j539K19J177m21o88J26M81o47Q2O46J93r0K51
2011D11m94J06L59o40m20J613M03j628p3J441r47j379J133J560j312p15J027n2
$$ y = [-805, -617, 309, -329, -755, -443, 355, -252, -585, 127, 86, -554, -451, 442, 169, -310, -94, 424, 520, -165, 22, 469, 250, -123, 195, 340, 180, -18, 37, 358, 31, -20, -54, 23, -235, -42, -413, -494, -203, 74, -134, -565, 164, 256, -677, -410, 837, 286, -565, 496, 1082, -132, -461, 619, 728, -205, -49, 664, 294, -340, -33, 262, 275, -154, -421, -4, 40, -658, -943, -356, 96, -580, -508, 559, 259, -713, -374, 452, -164, -396, 564, 1025, 141, -438, 209, 316, 120, 115, 313, -66, 678, 332, -423, -167, 211, -737, -863, 501, 369, -926, -616, 402, -475, -1450, 99, 852, -220, -552, 325, 80, -320, -226, 42, 161, 100, 226, 37, 247, 240, -388, -320, 636, 638, -805, 357, 1281, -393, -1420, 14, 621, -918, -699, 478, 57, -631, -505, -24, -671, -589, 57, 250, 160, 411, -83, 23, 382, -258, -678, 935, 1338, -290, -363, 1078, 131, -1248, -115, 1445, 133, -582, 445, 393]
2029C93j770N48J424m55o25Q45J53p82j50K53o32L02J051n31l32J117j97j754
2047a142O97J432p87m51J225K52j583j56R24o08p16J238L47o35k4l06o15N54L72
2066A8n44L30J316q17j575J065R36j860q8K825p51j593J051J312k322o64K029
2083F68Rj034J012O16j462n57R75l80m62J036M56j022K58J08q86p00J175J36o37
2102f91O64Q71j028o49P67k96m8O54N58n00k76L12p09R7O08j73m02J046O5j208
2122c38l53J127n02j206J613R85j676n98J455m14j618P17J862r47q98J369r2j443
2140i57M99J081q69k82J467p5j171M61K76j104M59P03l73j12N47j09j133L34K83
2159g5l94J23Q29m57l29L82l59p29J067J47m19J92R79p57r46P36O78j118N0J787
$$ y = [393, -1377, -829, 595, 140, -485, 360, 513, -269, -419, -166, -798, -496, 555, 24, -308, 809, 612, -1142, -445, 987, 200, -251, 974, 1226, -357, -513, 411, -197, -913, 325, 672, 37, 13, -293, -908, -354, 18, -526, -196, 1120, 303, -1272, -207, 729, -1131, -1219, 1606, 855, -738, 313, 1625, -697, -1361, 668, 677, -357, 655, 1271, -191, -748, 227, -153, -615, 421, 877, -145, 113, 221, -665, -1365, -190, -54, -691, -27, 844, -184, -833, -66, -362, -410, 244, 802, 302, 26, 338, -371, -274, 334, 161, -241, 805, 870, -338, -691, 436, -66, -1272, 341, 1326, -350, -948, 507, 93, -1525, -808, 1054, 107, -791, 578, 486, -957, -458, 623, -246, -528, 939, 864, -307, 154, 430, -674, -215, 488, 115, 3, 550, 441, -692, -358, -75, -469, -346, 483, 26, -303, 79, -280, -1009, 58, 205, -214, -22, 957, 200, -746, -10, 668, -450, -400, 1387]
2179A387m99j294O49N22q88p92J504J13r73R7O32m93m77L68L24o49J12N09j29
2198B3n39L59Q5j39R8L95n9P8p1m21j61M69J54j54R9J39m22K61J21l70j04O10
2220D51m92o66R89K06q40l61J000j72r91P72R42j348P1P35Kp57J97Q30k04p91
2240d27P36Q6m04j12N94k98k26K4K87j28o4l00J77q8K13j70J6K6l06L64O1m01
2262c40JL95J66n33J0M98k57l17M08L42o21L87K73p4p85N23O60o15j74P01n47
2283A01j66j64M56J56p37M43NJ0o05K52L38k89j74M98j70j06N5L63k94n6M73k61
2305A28k12j81O17j05j36j89L82q3j46J14K56o45P7K01k39j38J33L99k37l66J66
2326b04N3k45j24N14J55n34J00P72k34l54R7M57m88ML22n2q2l4K50m94j30N67
$$ y = [1387, 888, -406, 243, 765, -123, -915, 589, 702, -271, -174, 458, -35, -512, -144, 180, -469, -357, 152, 23, -516, -157, -72, -211, -113, 282, 223, 301, 230, -191, -352, 117, 271, 117, 216, 355, -67, 194, 315, -55, -159, 451, -41, -707, 282, 488, -352, -713, 287, 115, -876, -104, 838, -510, -439, 296, 298, -459, -262, 568, 364, -427, 309, 395, -9, -121, 473, 175, -51, -27, 260, 132, 68, -232, -55, -143, 70, -100, -84, -58, -364, 0, 61, -340, -339, 56, 222, -311, -301, 197, -60, -377, 31, 373, -248, 139, 412, 338, -447, 76, 736, 121, -53, 648, 101, -65, -229, 227, 383, -354, 89, 94, 104, -501, -249, 89, -200, -374, 124, -46, -152, -97, 266, -28, -84, 389, 128, -84, -265, 352, 247, 111, -78, 304, 221, 75, 189, 445, -200, -123, 78, -161, -299, -166, 233, -4, -370, -204, -151, -396, -520, -6, 149, -385, -285, 487, 253, -101, -4, 453, -35, -31, 291, 239, 157, 123, 373, -121, -251, 316]
2348C16P5m83J7K15j45l8j62P7J19j77J42J24k89o6L14K20j78k91O40m04n25L40
2370a59M44j23m74M90K13l92j75L12K10k22k81K42j23m3LL15N0l35k6L50m40J19
2392d5j67k1J80K1J6q4K10K8j19K12J2M6l35L27j71J54j31j00K31l22J10L8m9
2415D1l6j32rL90o06k77O28J66n78j43O66J81p77K25M56j87k42L27K12k34j44
2436g3Q4K55j66r1K19K9M7j66k90K70M40o34j05N57m53l44J06L81k02k40K95L87
2458C06o18j08L86km0M4J65O3r5k4j67N4J54o6k46O39P0r19K8Q09j85o52M14M83
2482D93p06n8P06o34l25L10M46o20L71Q4k34r8N29p43K5R80k25n26K92O68p05
2503C0l47O02J55o82K76M82m57k97o6M60k31O8K38j25m93J17j07p1K87j14J9N19
$$ y = [316, 391, -92, -75, 140, -5, -43, -205, -128, -9, -186, -44, 80, -209, -275, 39, 259, 81, -210, 430, 26, -499, -159, 285, 162, -312, 178, 391, -1, -176, 136, 346, 124, -157, 85, -38, -81, -78, 237, 287, -48, -74, 276, -164, -45, -212, -233, -53, -32, -16, -100, 110, 138, 19, 231, 243, 289, -46, 281, 110, 264, 133, 33, 264, -58, 52, 90, 41, 5, -127, -136, 254, -352, -629, -1, 165, -413, -556, 110, 291, -486, -261, 195, 8, -234, 93, 305, 71, -73, 11, 266, 100, 9, 228, 257, 304, 138, -152, 118, 558, -76, -181, 376, -77, -421, -315, 66, -136, -376, -81, 306, -312, -420, -34, -36, -76, -32, 133, 196, 101, 77, -90, -36, 118, 52, -194, 445, 515, -404, -376, 433, 248, -404, 10, 493, -213, -271, 435, -199, -524, -214, 232, -388, -17, 67, -167, -265, 264, -479, -454, 526, 301, -225, 67, 735, 30, -317, 285, 440, -242, 34, 516, 59, -238, -304, 156, -75, -7, 231, 106, -387, -270, -377, -448, -161, -275, -256, 263]
2525B63R2q31q4O19n8n89P22N27n13k46L64j93j01O5N42l55j70J93k8p45N31O
2547A1o14O46M39n74l33O20o8j047J58J419o76JL88J0o58L5N19m32O6N81q2m43
2569c4J49q8l34j2O98n08J12M63m25r23Q86L22o90J42R52m73q90O23L75j093K8
2590g20J174k08l62N73j50m12p4K81j84l36R76Kr57J37O58m30n31Q59M35p97m4
2611a10N57n60l15J61K94n3J12L25m51l14K82k21j16P24jl17K77j92k24l16R12
2632D54m74l79P50N64r59m12Q10n51n53Q22N01m31l09N88m33n45K30M51o83K89
2652b70Q38p25k56N30J06o48M59N19l45j85J1N2m96J62N39k84J14K85m00J2l7
2673a9m34P6M07J22l76N6L42j37n99N99P2k34l8L72m3n38L86P9n21J27Q41j85
$$ y = [263, 355, -476, -560, 59, 1, -588, 134, 661, 148, -98, 266, 73, -28, 37, 579, 224, 54, 247, 219, -526, 5, 11, -603, 43, 482, -92, -425, 195, 127, -920, -762, 657, -19, -18, 370, 380, -278, -243, 276, -156, -90, 491, 409, -34, 115, 27, -307, -319, 379, -129, -17, 446, 21, -902, -16, 306, -384, -242, 710, 237, -653, -30, 345, -748, -720, 454, 246, -116, 457, 307, -105, -179, 102, -82, -418, 558, 560, -397, -260, 398, -32, -563, 296, 731, -66, -110, 447, -113, -428, -267, 27, -26, 86, 411, -40, -354, -72, -293, -409, 315, 314, -3, 274, 82, -142, -458, 454, -20, -399, 351, 915, -44, -456, 354, -197, -750, 72, 573, 142, -167, 421, -12, -557, -327, 124, -559, -270, 568, -157, -413, 117, 223, -425, 34, 553, 208, 23, 34, 86, -410, -248, 291, 7, 121, 406, 6, 18, -19, -453, -377, 30, 152, -224, -168, 174, 37, -562, 37, 109, -125, -163, 209, 166, -372, 14, 93, -428, -301, 540, 355]
2695C55n97L58K88m55l20N37l6k87L73J97m26m98N07P3k38K12J67m41K3K61j15
2716f2k56L28J91l67K41n9n7J40j41L4J49k1J13k36J78k09l05K53M60k77k47J61
2738A1K16n54q8O84k96l08J47N05l38m44K97M41m64J11L47m93k1L56K79m08j57
2759a77N68o52K42M2J86k62l0K32J53l97m6p7M21j98k44K48J45m95K33P1j6o5
2781a18P2L55n60Q2J90J42j29k30L69J40n59M23j6l35p7M83K72r22K97N47j99
2802B27k74Q2j07j23Q7P2j45J06J33r9j28K9N9J20L6m31L98N1m86L87K02j41N0
2825A05j43L18j70LK29k05n44L15L14j33l13j3L80m10K87j66M05m41j21N91k66
2846B2j51j8J82OJ9l33M02l96J09L02o2j0j37M06l55j42K41K84n46J20J78K48
$$ y = [355, -242, 116, 404, -51, -371, 166, 130, -157, 216, 413, -13, -511, -4, 69, -169, 43, 210, -231, -208, 53, -62, -318, 10, 201, -166, 75, 16, -41, 99, -42, -8, 141, 120, 233, -3, 175, -34, -339, -86, 374, 97, -150, 11, 227, -327, -415, 269, -27, -335, -188, 317, -21, -465, -168, 273, -191, -80, 267, -226, -247, 109, 388, -20, -177, 391, -261, -19, 23, 209, -53, -83, 149, 302, -95, -141, -218, 203, 5, -239, 9, 154, -341, -108, -37, -53, -118, -46, 309, -251, -169, 21, 163, 34, -196, 173, 313, -246, 177, 161, -174, -251, 232, 504, -418, -121, 426, 227, -47, 35, -72, -195, -108, -36, -181, -75, 58, -41, -169, -140, -81, 39, 75, -356, 42, 93, -393, -6, 196, 55, 105, -38, 280, 110, 113, 342, 137, -407, -92, 222, 89, -224, -237, 143, -267, 20, -146, 259, -182, -303, 288, 22, -129, -147, 35, 41, 60, -273, 129, -267, -158, 144, 82, 72, -65, 341, -14, -156, 85, 369, -177, -57, 121, 369]
2868C69m93J51R5j9l55K47M95l80k72l3J40M0j26Q6L25q14P13j38K06l59J91n2
2890A7J05l4J07k03M5P0J81l65j65K10K75l28r6J15J10k52M80k45j73j43K06K04
2912A21j76K8k08K65p2M2Q4J72j24j02K06k43n2J47Jq7j58L29p2j57k80L73Q4
2935A21j45J14L3o3l10J34R6k38n6K46L79m59L50l68j08K36K72k26J45L59l34
2956A78k15J5K60o51M30J71n8m65L86J69p33L38L1M1l1J37L3k86L34j39l66R8
2978c23N03l10p4L13l7l24J80K79l12l90Q79q1l88n0L75k41n6J66O6j61n9K56
3000B11k13p0P9k09j35O58k60k75J31J63l21l27N51K00k14O9K02j36l95L47l8
$$ y = [369, -124, 27, 122, 103, -252, -5, 490, 110, -162, -195, -55, -15, -141, -55, 270, -544, 169, 31, 237, -122, 69, 17, 122, 88, 195, -8, 37, 107, 288, -77, -242, -32, 243, -85, -181, -66, 44, -208, 272, 27, -146, -289, -83, 121, -55, -27, -235, 30, -42, 0, 84, 256, 132, 30, 236, -7, -59, 88, 89, 2, -156, 173, 101, -56, -336, 37, 121, -24, 90, 123, 60, -250, -116, -20, -258, -314, -68, 311, -148, 202, -166, -274, -38, 234, 8, 153, 512, 178, -37, -22, 238, -413, 17, 188, 130, -335, 51, 220, -513, -175, -144, -103, -134, 3, 36, -250, 84, -55, -421, -323, 180, -130, -204, 109, 72, -252, -72, 207, -105, -495, 384, 303, -85, -135, 240, -1, -57, 109, 175, 14, -45, 211, -2, -72, 7, -202, -337, 321, 61, -214, -83, 80, -241, -568, -17, 183, -31, 38, 240, 104, -291, 56, 18]
$$ [...]
8191e6
##END NTUPLES=NMR FID
##END=
