##TITLE=1H_Pr 5053
 CDCl3
 8 sc, 
 8.12.2021
##JCAMPDX= 6.0         $$ Bruker NMR JCAMP-DX V2.0
##DATA TYPE= NMR FID
##DATA CLASS= NTUPLES
##ORIGIN= UXNMR, Bruker Analytische Messtechnik GmbH
##OWNER= root
$$ XWIN-NMR		Version 3.5
$$ Wed Dec  8 11:50:40 2021 Russian Standard Time (UT+4h)  she@DPX200
##.OBSERVE FREQUENCY= 200.131346
##.OBSERVE NUCLEUS= ^1H
##.DELAY= (6, 6)
##.ACQUISITION MODE= SIMULTANEOUS
##.ACQUISITION SCHEME= undefined
##.AVERAGES= 8
##.DIGITISER RES= 18
##SPECTROMETER/DATA SYSTEM= spect
##.PULSE SEQUENCE= zg30
##.SOLVENT NAME= CDCl3
##.SHIFT REFERENCE= (INTERNAL, CDCl3, 0, 15.7039)
##AUDIT TRAIL= $$ (NUMBER, WHEN, WHO, WHERE, WHAT)
$$ ##TITLE= Audit trail, XWIN-NMR		Version 3.5
$$ ##JCAMPDX= 5.01
$$ ##ORIGIN= Bruker BioSpin GmbH
$$ ##OWNER= she
$$ F:/spectra/data/she/nmr/H-F/1/audita.txt
$$ ##AUDIT TRAIL=  $$ (NUMBER, WHEN, WHO, WHERE, WHAT)
(   1,<2021-12-08 11:49:33.46 +0400>,<she>,<DPX200>,
      <created by zg, POWCHK disabled, PULCHK disabled
       configuration hash MD5:
       00 E9 B6 7A A2 85 ED C7 34 08 36 98 17 FE 4E 26
       data hash MD5: 16K
       10 CA 90 FD EC 8A A6 AA 1E 49 FA A7 A2 E3 BD E6>)
$$ ##END=
$$ 
$$ hash MD5
$$ 7C 30 08 AE E7 D0 33 AD 7C F9 F9 A9 23 6B 07 D1
##$RELAX= 
##$RELAX= 
##$RELAX= 
##$RELAX= 
##$RELAX= 
##$RELAX= 
$$ Bruker specific parameters
$$ --------------------------
##$DU= <F:/spectra>
##$EXPNO= 1
##$NAME= <H-F>
##$PROCNO= 1
##$TYPE= <nmr>
##$USER= <she>
##$AMP= (0..31)
100 100 100 100 100 100 100 100 100 100 100 100 100 100 100 100 100 100 
100 100 100 100 100 100 100 100 100 100 100 100 100 100 
##$AQSEQ= 0
##$AQ_mod= 1
##$AUNM= <au_zg>
##$AUTOPOS= <>
##$BF1= 200.13
##$BF2= 200.13
##$BF3= 200.13
##$BF4= 200.13
##$BF5= 200.13
##$BF6= 200.13
##$BF7= 200.13
##$BF8= 200.13
##$BYTORDA= 1
##$CFDGTYP= 0
##$CFRGTYP= 5
##$CHEMSTR= <none>
##$CNST= (0..31)
1 1 145 1 1 1 1 1 1 1 1 1 1 1 1 1 1 1 1 1 1 1 1 1 1 1 1 1 1 1 1 1 
##$CPDPRG= <>
##$CPDPRG1= <>
##$CPDPRG2= <>
##$CPDPRG3= <>
##$CPDPRG4= <mlev>
##$CPDPRG5= <mlev>
##$CPDPRG6= <mlev>
##$CPDPRG7= <mlev>
##$CPDPRG8= <mlev>
##$CPDPRGB= <>
##$CPDPRGT= <>
##$D= (0..31)
0 1.2 0 0 0 0 0 0 0 0.06 0 0.03 0 0 0 0 0.0002 0 0 0 0 0 0 0 0 0 0 0 0 
0 0 0 
##$DATE= 1638949772
##$DBL= (0..7)
120 120 120 120 120 120 120 120 
##$DBP= (0..7)
150 150 150 150 150 150 150 150 
##$DBP07= 0
##$DBPNAM0= <>
##$DBPNAM1= <>
##$DBPNAM2= <>
##$DBPNAM3= <>
##$DBPNAM4= <>
##$DBPNAM5= <>
##$DBPNAM6= <>
##$DBPNAM7= <>
##$DBPOAL= (0..7)
0.5 0.5 0.5 0.5 0.5 0.5 0.5 0.5 
##$DBPOFFS= (0..7)
0 0 0 0 0 0 0 0 
##$DE= 6
##$DECBNUC= <off>
##$DECIM= 32
##$DECNUC= <off>
##$DECSTAT= 4
##$DIGMOD= 1
##$DIGTYP= 9
##$DL= (0..7)
0 120 120 120 120 120 120 120 
##$DP= (0..7)
150 150 150 150 150 150 150 150 
##$DP07= 0
##$DPNAME0= <>
##$DPNAME1= <>
##$DPNAME2= <>
##$DPNAME3= <>
##$DPNAME4= <>
##$DPNAME5= <>
##$DPNAME6= <>
##$DPNAME7= <>
##$DPOAL= (0..7)
0.5 0.5 0.5 0.5 0.5 0.5 0.5 0.5 
##$DPOFFS= (0..7)
0 0 0 0 0 0 0 0 
##$DQDMODE= 0
##$DR= 18
##$DS= 0
##$DSLIST= <SSSSSSSSSSSSSSS>
$$ [...]
##$SUBNAM2= <"">
##$SUBNAM3= <"">
##$SUBNAM4= <"">
##$SUBNAM5= <"">
##$SUBNAM6= <"">
##$SUBNAM7= <"">
##$SUBNAM8= <"">
##$SUBNAM9= <"">
##$SW= 18.0517287032376
##$SWIBOX= (0..15)
0 0 2 0 0 0 0 0 0 0 0 0 0 0 0 0 
##$SW_h= 3612.71676300578
##$TD= 16384
##$TD0= 1
##$TE= 0
##$TE2= 300
##$TE3= 300
##$TEG= 300
##$TL= (0..7)
0 120 120 120 120 120 120 120 
##$TP= (0..7)
150 150 150 150 150 150 150 150 
##$TP07= 0
##$TPNAME0= <>
##$TPNAME1= <>
##$TPNAME2= <>
##$TPNAME3= <>
##$TPNAME4= <>
##$TPNAME5= <>
##$TPNAME6= <>
##$TPNAME7= <>
##$TPOAL= (0..7)
0.5 0.5 0.5 0.5 0.5 0.5 0.5 0.5 
##$TPOFFS= (0..7)
0 0 0 0 0 0 0 0 
##$TUNHIN= 0
##$TUNHOUT= 0
##$TUNXOUT= 0
##$USERA1= <user>
##$USERA2= <user>
##$USERA3= <user>
##$USERA4= <user>
##$USERA5= <user>
##$V9= 5
##$VALIST= <valist>
##$VCLIST= <CCCCCCCCCCCCCCC>
##$VD= 0
##$VDLIST= <DDDDDDDDDDDDDDD>
##$VPLIST= <PPPPPPPPPPPPPPP>
##$VTLIST= <TTTTTTTTTTTTTTT>
##$WBST= 1024
##$WBSW= 4
##$XGAIN= (0..3)
0 0 0 0 
##$XL= 0
##$YL= 0
##$YMAX_a= 59000
##$YMIN_a= -73338
##$ZGOPTNS= <>
##$ZL1= 120
##$ZL2= 120
##$ZL3= 120
##$ZL4= 120
##$ABSF1= 10
##$ABSF2= 0
##$ABSG= 5
##$ABSL= 3
##$ALPHA= 0
##$AQORDER= 0
##$ASSFAC= 0
##$ASSFACI= 0
##$ASSFACX= 0
##$ASSWID= 0
##$AUNMP= <proc_1d>
##$AZFE= 0.1
##$AZFW= 0.1
##$BCFW= 1
##$BC_mod= 2
##$BYTORDP= 1
##$COROFFS= 0
##$CY= 11.3945322036743
##$DATMOD= 1
##$DC= 2
##$DFILT= <>
##$DTYPP= 0
##$F1P= 2.36226072786647
##$F2P= -0.459571619588291
##$FCOR= 0.5
##$FTSIZE= 0
##$FT_mod= 4
##$GAMMA= 1
##$GB= 0.15
##$INTBC= 1
##$INTSCL= 1
##$ISEN= 128
##$LB= 0.24
##$LEV0= 0
##$LPBIN= 0
##$MAXI= 10000
##$MC2= 0
##$MEAN= 0
##$ME_mod= 0
##$MI= 1.114404
##$NCOEF= 0
##$NC_proc= 0
##$NLEV= 6
##$NOISF1= 3.799351
##$NOISF2= 2.8
##$NSP= 1
##$NTH_PI= 0
##$NZP= 0
##$OFFSET= 15.70392
##$PC= 1
##$PHC0= -15513.47
##$PHC1= 12.0008
##$PH_mod= 1
##$PKNL= yes
##$PPARMOD= 0
##$PSCAL= 0
##$PSIGN= 0
##$REVERSE= no
##$SF= 200.130013532006
##$SI= 16384
##$SIGF1= 3
##$SIGF2= 2
##$SINO= 400
##$SIOLD= 16384
##$SREGLST= <1H.CDCl3>
##$SSB= 0
##$STSI= 0
##$STSR= 0
##$SW_p= 3612.71676300578
##$SYMM= 0
##$S_DEV= 0
##$TDeff= 0
##$TDoff= 0
##$TI= <>
##$TILT= no
##$TM1= 0
##$TM2= 0
##$TOPLEV= 0
##$USERP1= <user>
##$USERP2= <user>
##$USERP3= <user>
##$USERP4= <user>
##$USERP5= <user>
##$WDW= 1
##$XDIM= 8192
##$YMAX_p= 0
##$YMIN_p= 0
$$ End of Bruker specific parameters
$$ ---------------------------------
##NTUPLES= NMR FID
##VAR_NAME=  TIME,          FID/REAL,        FID/IMAG
##SYMBOL=    X,             R,               I
##VAR_TYPE=  INDEPENDENT,   DEPENDENT,       DEPENDENT
##VAR_FORM=  AFFN,          ASDF,            ASDF
##VAR_DIM=   8192,          8192,            8192
##UNITS=     SECONDS,       ARBITRARY UNITS, ARBITRARY UNITS
##FACTOR=    0.0002768,     1,               1
##FIRST=     0,             0,               0
##LAST=      2.2672688,     0,               0
##MIN=       0,             -73338,          0
##MAX=       2.2672688,     59000,           0
$$ Real data points
##PAGE= N=1
##DATA TABLE= (X++(R..R)), XYDATA
$$ [...]
1308c47Q3K20k22r5K75L5k29J27K45l1j17J71K33o0j81J34K17j79j10Q2p5j25
1330E1J80N8k78m0q9K05k95N6M4M9l90nM27p6k39L17L1j82r0L73J13j96J5R5K50
1355C84k54Q5Q8R7k97Q0Q4j26j48pJ17k33j24J85l11p0K15J08K5k94K44J08j05
1378a49lJ77oo3J10K20p9j84P6J68J31j77r2M7j45%j8No8k2K02j89j78P3J24k25
1404b65r4J18N0m7o9J61P6nJ49N4r2J77j7J9kJ61j30K2m3ln7m8l1%k20O6Qpo6
1433a35j77K3J85k2j94J80J03J01k69j61N25j52p7J64K4K16k49p8L00j98M1RK61
1456D20k06k57J87j14Nk81r0K58Rq1k9q6PN8J0K25j60J9J10K79j34l08L24L05
1480D70k98r7J6L67k45o4o3J01O9l27r1K47k0j54j07J00j54j75J98J70j39j77
$$ plain form
1308 -347 -264 -44 -266 -361 -86 -51 -280 -153 92 61 -56 115 348 288 107 241 458 279 169 251 176 51
1330 51 231 289 11 -29 -118 87 -208 -152 -108 -59 -449 -454 -27 -103 -342 -25 6 -176 -266 107 220 24 39 134 384
1355 384 130 215 303 400 103 183 267 141 -7 -14 103 -130 -254 -69 -380 -450 -235 -127 -102 -396 -152 -44 -149
1378 -149 -152 25 19 -44 66 286 207 23 99 267 398 221 129 176 31 31 13 18 -50 -72 130 -59 -237 -164 -40 -265
1404 -265 -359 -241 -191 -238 -307 -146 -70 -75 74 128 36 213 196 215 213 374 244 266 223 220 163 115 84 84 -136 -70 -62 -69 -135
1433 -135 -312 -289 -104 -126 -320 -140 -37 64 -205 -366 159 7 -70 94 118 334 85 7 307 109 150 159 420
1456 420 214 -43 144 30 35 -246 -336 -78 -69 -150 -179 -265 -258 -200 -190 35 -125 -106 4 283 149 -159 165 470
1480 470 172 75 91 458 213 149 86 187 256 -71 -162 85 65 -89 -196 -96 -250 -425 -227 -57 -196 -373
1502c73J63K32L5k61K28K6N8k00K14L69l55O1L0J99l15M5j45K44j43k81J41J30
1524A02j40l05J64L02l44j98L05J6j40k6L52kj63p1K08R3j63M8J33M0M2Nr5K08
1548C71p8k62m7R9R6k82l7J90j47q2m0J56j97K7Q9P6n2l05L36J46M3k57K54mm3
1573E0J9K7Kj8J59m1Ljl12M16j50j98K7L7J23j75m6n6jm6j51J85L7l8j3J52J1
1600Bj37J06J12j02J66q6J62O9Qk27J87k5k02l6MJ29m8k64k0l7J25n8o9L80k43
1625a04p8L0J77j53P6J49P7j22k78M92l21R3R7O0P5k30J68O5m0j89j0j34lJ52
1649D9j98O6j33J02j08N7O7j16O0m2j4J59J13l3n4J07k2QO7K2Q4j72J96j80p9
1674FP9J31j00m9j15K10k29j27Q6m4k8J8N7l1Nk2Q2p5L2J18J12j65l9J51O1q1
$$ plain form
1502 -373 -210 22 57 -204 24 50 108 -92 122 491 136 197 227 426 111 156 11 255 112 -169 -28 102
1524 102 -38 -343 -179 123 -221 -419 -114 -98 -238 -264 88 86 -77 -148 60 153 -10 38 171 211 253 258 163 371
1548 371 293 31 -16 83 179 -103 -140 50 -97 -179 -219 -63 -260 -233 -144 -68 -120 -425 -89 57 100 -157 97 93 50
1573 50 69 96 98 80 239 198 201 200 -112 304 154 -44 -17 20 143 -32 -78 -134 -135 -181 -332 -147 -110 -148 -161 -9 2
1600 2 -135 -29 83 -19 147 61 223 292 300 73 260 235 33 -3 1 130 82 -182 -202 -239 -114 -172 -241 139 -104
1625 -104 -182 -152 25 -128 -52 97 174 52 -226 266 -55 38 135 195 270 40 208 273 233 44 34 -100 -103 49
1649 49 -149 -83 -216 -114 -222 -165 -98 -214 -154 -196 -210 -51 62 29 -25 82 60 68 135 157 241 69 265 85 6
1674 6 85 216 116 67 -48 162 -67 -194 -108 -152 -180 -162 -105 -136 -131 -153 -71 -146 -114 4 116 -49 -88 63 124 43
1700D3N5K30j60j03jJ30Lp8J18k77k1l7J26j85o8P7K7q1K3J02j44p7P0K33j04
1725i9k8L9J97o9j8J36N1P3j70Q7N8j00j05O1J22j90r9L9rqj25Q4r1M2r7O0J22
1752c7k30L02j05J8p4J74p1P8q4N2J01j54P2J01p0Q1j0J44k91P5o2N6r9oL5Kj44
1779a46L6J42j06k39J34R5q0J59n4M8q4J51j51J67k6j06R3MN8J34k5j86P9O8j06
1804E9j88N4O3j90j08K74Nk10J23J17j45p6J99j30J65p1N5Q2r4j3J68j0P8k39
1828c2J39q6J8J09l8J40k62J5j04j6J39j88P0j23J29K32j17J4j44M6j18J30K0
1851b7N8m3PJ98J2J5j29R5j58O8j20J51P5k07n1Q7j5kP0j06k58K31ko5r6K4J15
1878g3m0j22J05K38j66k5J03O0j49J73m6m7K58l6k8Lo1k4N0j04O7k83J29k00K23
$$ plain form
1700 43 98 328 168 65 64 194 197 119 237 -40 -61 -98 28 -157 -225 -148 -121 -202 -179 -77 -221 -298 -228 5 -99
1725 -99 -127 -88 109 40 22 158 209 282 112 199 257 157 52 113 235 45 -54 -15 -24 -32 -157 -73 -164 -122 -219 -159 -37
1752 -37 -267 35 -70 -52 -126 48 -23 55 -29 23 124 -30 42 143 73 154 144 288 -3 72 10 66 -33 -39 -4 -2 -146
1779 -146 -110 32 -74 -313 -179 -84 -164 -5 -59 -11 -95 56 -95 72 46 -60 33 37 95 229 204 18 97 165 59
1804 59 -129 -75 -12 -202 -310 -36 -31 -241 -118 -1 -146 -222 -23 -153 12 -59 -4 78 -16 -29 139 129 207 -32
1828 -32 107 21 39 148 110 250 -12 3 -101 -117 22 -166 -96 -219 -90 142 25 39 -105 -59 -177 -47 -27
1851 -27 31 -12 -5 193 205 220 91 186 28 96 -24 127 202 -5 -56 31 16 14 84 -22 -280 -49 -51 -116 -212 -188 -73
1878 -73 -113 -235 -130 108 -58 -83 20 80 -69 104 58 11 269 233 205 208 147 123 173 69 136 -147 -18 -218 5
1903Em9J0N5q2j41j6K08J6m7k17K72j33k3J17O3J63k32N8J50j29k8N6k9J83l04
1928g4O8K09j23K1k47J06P7j86k5qK8P1q1N9M5J20j73q7L03j13J6R0J23k7o2k
1954A28J68k03N7o7N2j84P1p8O1pj16K9J2N6j19N9J80k18j5R5J4j7j38J45j8J01
1980D8%n0P1mJ4j34J34J38k54Q3Q3k84L8J36J44k32r2Q9kR8j51L8J42j52j90J66
2006a23J09j08J20j06J66l9o7O0J1O8k1J06j30P8j75J34J89j67j23N2Q2q3j33
2029a00j41J81r0P5q4Q4J2j83J95J37k0k06J53K4p9O9K4N4n9K01j17J2j14P3m0
2054F1j90O8M4r5N0QR1j69Rj2P0j17J27J26j97N8J08q8J26JJ41l5j02k15K76j1
2080A33k8n0j61L62k52m8J77o3j98P0J55q4j85J78k2j24j0O2N7q6j05J47J64j16
$$ plain form
1903 5 -44 -34 21 -61 -202 -218 -10 6 -41 -258 14 -119 -142 -25 38 201 -31 27 177 48 20 76 47 230 -74
1928 -74 -6 203 80 101 -146 -40 37 -149 -174 -182 -154 -83 -164 -105 -60 60 -113 -200 103 -10 6 96 219 192 130 128
1954 128 296 93 150 83 135 -49 22 -56 5 -2 -118 -89 -77 -21 -140 -81 99 -119 -134 -39 -25 -42 -180 -35 -53 48
1980 48 48 -2 69 65 79 -55 79 217 -37 46 129 -155 -117 19 163 -69 -161 -72 -74 24 -127 -89 53 -99 -289 -123
2006 -123 -14 -122 -2 -108 58 19 -48 12 23 91 70 176 46 124 -51 83 272 105 -18 34 116 33 -100
2029 -100 -241 -60 -150 -75 -159 -75 -63 -246 -51 86 66 -140 13 37 -42 27 51 105 46 247 130 142 28 101 61
2054 61 -129 -61 -17 -112 -62 -54 37 -132 -123 -135 -65 -182 -55 71 -126 -68 40 -48 78 79 220 185 83 -132 144 133
2080 133 105 55 -106 256 4 -44 133 70 -128 -58 97 13 -172 6 -16 -140 -150 -88 -31 -117 -222 -75 89 -27
2104b7J06lN5m8k09K86j31j0m1J41o6j36J80p4k1l6o7J79j74k5o5J80k8r1J8j37
2130b44N7K79k56Q2R4n0J3K8Q7k5l6J04o2n5J69k09J71j82lJ11j56R2K3M8K9l11
2156b02J95P7j18j6j40R6P4r2K6J05J9q9J84m5j21Q6M6K7r9qJ01r8M1J85j68o9
2182cl0Q7pj35n2J12k7j48J15N1O2j20P1j22l0K77l8j7K3K8M8p3j36J43L7j9k17
2209a20L50l6k98K12q1j35R1j6J64l3l29J32K2p6J03ol7l5O8n1J4J00j1J46k06
2234f8J57Q8j04o8Pk0P2k57R4K33j88n6R6l0j9j98J26o0K10J2j56K24j90o5J47
2259a3n7O3K67k03j11M2J80j30J58j6r7j21J41o2m8N3L6n4P2p2o7r3K03k44R2
2284h1J54j12n5J42j43m3M9J48q7j03J30J38j39K2J23o5K9q5K6J77k40J92k5n
$$ plain form
2104 -27 79 76 131 83 -126 160 29 19 -22 119 53 -83 97 23 2 -34 -101 78 -96 -121 -186 -6 -34 -125 -107 -244
2130 -244 -187 92 -164 -82 12 -38 -25 3 90 65 29 133 71 16 185 -24 147 -35 -38 73 -83 9 32 80 109 -202
2156 -202 -7 70 -48 -64 -204 -108 -34 -126 -100 5 24 -65 119 74 -47 39 85 112 13 5 106 8 49 234 66 -3
2182 -3 -33 54 47 -88 -140 -28 -55 -203 -88 -37 25 -95 -24 -146 -176 101 63 46 69 97 145 72 -64 79 116 97 -120
2209 -120 230 194 -104 108 27 -108 -17 -33 131 98 -231 -99 -77 -153 -50 -56 -93 -128 -60 -111 -97 3 -8 138 -68
2234 -68 89 177 73 5 12 -8 64 -193 -99 134 -54 -110 -14 -44 -63 -261 -135 -195 15 27 -129 95 -95 -160 -13
2259 -13 -70 -7 260 57 -54 -12 168 38 196 180 83 -38 103 41 -7 46 82 28 100 28 -39 -132 71 -173 -81
2284 -81 73 -39 -94 48 -95 -138 -89 59 -28 -131 -1 137 -2 20 143 78 107 22 48 225 -15 177 152 147
2308A47n4k97L13j84J09l5j07J14k4j3j39J30j48rR4J18Q6Mr2L9j94J36K04j02
2332I6N9j03p7J51j8j82m5K32j43m6J12m4J10k54J39j07K0n0Q1L9J20k90K09j4
2356eqjR3J37k01j9J58j56J77j57J3K0J58k57J30k2m9m1j06j26L15k45n6J27J16
2381eM4j11P5J03j01q2RO2O1j99R5P2N2j6L2M3j02J2NR5k34J54j39J43o2o9P9
2408A6j11J43j55o9RM7kJ94j19L4M8l7q7J44p0J63j15M6j08K18j03k07J34p3K51
2433A91j27nlM7o9r1O3o0k5m0m8NO7M9k5QP1Q9J6k11J42j29P6L0N5K28p9j22j76
2462g3J9J01q2J17k2j30J19R7l64J39M2Jj64O9P0J2j5nRJ63j46J21l7l4M9n4J35
2489A37j76O8O1N5j90R9L1p1j6M4m5m8k7k6J0K5J07j1j27J8K4l6J31K4j29P2J17
$$ plain form
2308 147 93 -204 109 -75 34 -1 -108 6 -18 -31 -170 -40 -188 -197 -103 15 101 105 13 52 -142 -6 198 96
2332 96 155 52 -25 126 108 -74 -119 113 -30 -76 36 -8 102 -152 -13 -120 -100 -150 -69 -30 90 -200 9 -5
2356 -5 -13 -14 79 216 15 -4 154 -2 175 18 31 51 209 -48 82 60 11 -30 -136 -262 53 -192 -248 -121 -5
2381 -5 39 -72 3 106 5 -77 -68 -6 55 -144 -49 23 75 59 91 134 32 44 49 144 -90 64 -75 68 6 -63 16
2408 16 -95 48 -107 -176 -167 -120 -122 72 -47 -13 35 -2 -89 55 -15 148 33 79 -29 189 86 -121 13 -60 191
2433 191 64 59 56 103 34 -57 6 -54 -79 -119 -167 -162 -95 -46 -71 -63 8 97 113 -98 44 -85 -9 21 76 304 225 103 -73
2462 -73 -54 47 -35 82 60 -70 49 146 -218 -79 -37 -36 -200 -131 -61 -49 -64 -69 -60 103 -43 78 41 7 56 2 137
2489 137 -39 29 90 145 -45 54 85 14 -2 42 -3 -51 -78 -104 -94 -69 38 27 -100 -82 -58 -94 37 61 -68 4 121
2516A21m2L5K7j18J5N2Lr4M3j35J20o9J51k66J50k0j12J88j27Q7l9j4j10K06q8
2541c6N5j18j9K19p2n6j49J97M4K8r0O5R2j56o4J65pL9j52j51L11q8j90J06n0
2566g7Jj39J60j20j04K00KKJ10q5J17k06N0m4K20o6R4k3N4m0M3l3j81R9L8m2j20
2593i0L6Q4J07j72P1nj03r0J45M0nj22K12j82o8K32M1j35Mj0K54j13o0j28K04
2618A47m3j94K72j64j28N1K26j31K4j49P6K2P0k00O5o8J04r2K5R3L4pP3PJ44k00
2644E7j3rJK0M9r5o4J93j46N6J2k0j14M7O2k29K97q6n7j5p5R1K8J4O1K0k6j51
2672i2J80o8M3l7J08r2L2m1K7j81J57N7N0O6k56J12j26R4r2J8K2l4j16J58l6k95
2698c42L01O5n7j49J29p0J39L9P9q7n0n6K55L7l1k31O2P7j34on7J5jQ5n8q8J08
$$ plain form
2516 121 79 114 141 23 38 90 93 -1 42 -93 27 -42 109 -157 -7 -27 -139 49 -78 9 -30 -44 -154 52 -36
2541 -36 19 -99 -118 101 29 -27 -176 21 65 93 3 68 160 4 -60 105 98 137 -15 -166 145 57 -133 -27 -77
2566 -77 -76 -215 -55 -175 -279 -79 -77 -75 35 -50 67 -139 -89 -133 87 21 115 92 146 106 149 116 -65 34 72 30 -90
2593 -90 -54 30 137 -35 36 31 -72 -162 -17 23 18 -104 108 -74 -142 90 131 -4 0 -10 244 131 71 -57 147
2618 147 104 -90 182 18 -110 -59 167 36 60 -89 -13 9 79 -121 -56 -124 -20 -112 -87 6 40 33 106 113 257 57
2644 57 44 35 36 56 105 10 -54 139 -7 49 61 41 -73 -26 36 -193 104 18 -39 -54 -129 -38 -10 4 65 85 59 -92
2672 -92 88 20 63 26 134 42 74 33 60 -121 36 93 143 209 -47 65 -61 33 -59 -41 -19 -53 -169 -11 -47 -342
2698 -342 -41 24 -33 -182 -53 -123 16 55 134 47 -3 -59 196 233 202 -29 33 110 -24 -30 -87 -72 -73 12 -46 -134 -26
2725b6J2j18J26l7nJ26l1j14J15q3nO3j1j00N6L6j92K01J59r8O4j15j3k3P3j16
2751e6J77p9j6q1M8Kj55K34j07q7J30r6J29K6L0j2q4j44J93P7J0k53J05jM4Rj38
2778i5M0J60n7O9k10L1j04J13J8J25k59O1K06m0j28M0L4J88j57j97J69P5R6q5
2802I3j17K14j41m2N9J63j19k8j67K30m3j85m5J47j46P3l1jL2m5j9p8K21k5m2
2827d2K1m9Q2L2J0mJ5NM6n9J03r8j86J37K7L9Q2j47j61J27m4O4j06j9K57j51J8
2854aJ9n1o3R1NM2j6P2k36K13j95J12r3jJK16L7qk71J15j0k3K19j80j07j8J74
2881D3j09L5n1J1k6k9Q6o8P8O6K9p9J39j65N6Jm5J33O4j10P4L7j09K5k58J69j25
2908a28m5Q8q7P4J3ql9M8k5m2O7J96k06P7L0m8Q6o5L2P9M4j40L4n4J65j53K8J4
$$ plain form
2725 -26 -14 -132 -6 -43 -48 78 47 -67 48 -35 -40 23 12 -88 -32 4 -188 13 172 74 138 23 10 -13 60 -56
2751 -56 121 42 26 -55 -7 -5 -160 74 -33 -120 10 -86 43 69 99 87 3 -141 52 129 139 -114 -9 -10 34 43 -95
2778 -95 -55 105 48 117 -93 -62 -166 -53 -35 90 -169 -108 98 58 -70 -30 4 192 35 -162 7 82 178 93
2802 93 -24 190 49 7 66 229 110 82 -85 145 102 -83 -128 19 -127 -54 -85 -86 -54 -99 -118 -196 25 0 -42
2827 -42 -21 -70 12 44 54 50 65 70 116 57 160 62 -124 13 40 79 161 14 -147 -20 -64 0 -106 -125 132 -19 -1
2854 -1 18 -33 -96 -5 0 42 26 98 -138 75 -120 -8 -101 -102 -101 115 152 144 -127 -12 -22 -45 174 -6 -113 -131 43
2881 43 -66 -31 -82 -71 -97 -126 -40 -108 -30 36 65 -14 125 -40 16 17 -28 105 169 59 133 170 61 86 -172 -3 -128
2908 -128 -173 -85 -172 -98 -85 -93 -132 -84 -109 -151 -84 112 -94 -17 13 -35 51 -14 18 97 141 1 35 -19 146 -7 21 35
2936C5p1LJ18j29P2r8l3P9o0n2J85mOj75O9J01j6k3J4P2K4m9j36R9J24j29k1L0
2964C5J08j74J7N2m8o5J56Kr3k1Rm6Q7j39J39qj68L75j48J1j22q8K03r1R0n5q9
2991g1K6J46K90m29J36JM2n0n2rj9j17N1m1Q0oj36K26K1k52K25p7k36J23J56q8
3017f0P1M5q5J90j57J2J86j59L9J21n4Qo1j02J6j60K08j06o4nn2J27o7R3J13j75
3043g8O5p7PJ51q5J05o1j70K87m8k6o5J67j02j10J25K8j52J4K5O2q2j33K31k83
3068b05K06J24l66K19l6J79j05l7j03R9J70k84J26j17J67M5J03o6j22J6k0N6n2
3091cQL5l8N0o8R7j66P6p0M1J4j07Q6O0l6M3j62K22j41R1q0n4P4j8J73j59k8Q7
3119B7M6r0L8L5j69J95k55J82q8%Lj0j2j4L4J5P0k0nk5N0O7j3j58O8nK0J7M9R6
$$ plain form
2936 35 -36 -33 85 -44 28 -70 -103 -24 -84 -136 49 45 51 -124 -55 46 30 7 21 93 117 68 -68 31 155 26 5 35
2964 35 143 -31 -14 38 -10 -75 81 83 -10 -31 -22 -68 19 -120 19 11 -157 218 70 81 -41 -129 74 -17 73 18 -71
2991 -71 -45 101 391 -38 98 99 141 91 39 30 11 -106 -55 -96 -16 -22 -158 68 89 -163 62 -15 -251 -128 28 -60
3017 -60 11 56 -29 161 4 16 202 43 82 203 149 157 96 -6 10 -150 58 -48 -112 -117 -169 -42 -109 -16 97 -78
3043 -78 -13 -90 -83 68 -17 88 27 -143 144 96 70 5 172 70 -40 85 113 -39 -25 0 62 -20 -153 78 -205
3068 -205 1 125 -241 -22 -58 121 16 -21 -124 -25 145 -139 -13 -130 37 82 185 119 -3 13 -7 49 -3
3091 -3 5 40 2 52 -16 81 -85 -9 -79 -38 -24 -131 -45 15 -21 22 -140 82 -59 32 -48 -102 -28 -46 127 -32 -60 27
3119 27 73 -17 21 56 -113 82 -173 9 -79 -79 -76 -86 -98 -112 -78 -63 7 -13 -18 -43 7 74 61 -97 -29 -34 -14 3 52 148
3149A48L0K0k65m3J50M1j68J47o6NJ6k18P2J15j27K0L2j8J41m9n2O7q3N0q8R0
3175c3RR3j2m7R2j59J88q2N9q5Q1k36J55J65k42o4R8Mk11J04J39n9K1k9J5L3n8
3202f1j27K69j99J37NO8r7P5Kk8J40n2k3m1KL8k9n6m4OJ01j89o9K21J0r5O2j84
3230a58K50l36J28PO3j16K27j68J76n2K5J1j58J59l0N3m0Q9j51N9j1p5P6p3rN7
3256Ck1k18K08qp4J30RL9Pj23p5J92j62j35J32J66r2M4L8K3J20j00L8k25R4j52
3282a42nJ34m9O2J09r8m2j19j8J42Rk6o8j1O0k3J17l7J25q2l0L3M4o5N7J08p3
3309A12o8j14j0p0K01n0q3K85j39j35k3m0O5J39J9k25m6K20j20N9j41J74J08M8
3333A66p6m1kM2R6l44K85q8P0o5j29Q0k2J44j11l8l2J07Rj16k2J09q4j5J54p8
$$ plain form
3149 148 178 198 -67 -110 40 81 -87 60 -6 -1 15 -203 -131 -16 -143 -123 -91 -109 32 -17 -69 -2 -85 -35 -123 -33
3175 -33 -24 69 57 10 102 -57 131 49 108 23 104 -132 23 188 -54 -118 -20 -16 -227 -123 16 -43 -22 -51 -36 -3 -61
3202 -61 -188 81 -118 19 24 92 -5 70 72 44 184 132 109 68 70 108 79 23 -21 -15 86 -103 -172 49 59 -36 26 -158
3230 -158 92 -244 -116 -109 -46 -162 65 -103 73 21 46 57 -101 58 28 81 41 130 -21 38 27 -48 28 -45 -54 3
3256 3 -18 -236 -28 -36 -110 20 29 68 75 -48 -123 69 -93 -228 -96 70 -22 22 60 83 203 103 141 -84 10 -142
3282 -142 -147 -13 -62 0 109 11 -31 -150 -168 -26 -17 -43 -111 -122 -62 -85 32 -5 120 38 8 41 85 20 77 185 112
3309 112 44 -70 -80 -150 51 1 -82 203 64 -71 -94 -134 -69 70 89 -136 -182 38 -82 -23 -164 10 118 166
3333 166 90 49 47 89 185 -159 126 38 108 43 -86 -6 -28 116 5 -33 -65 42 51 -65 -87 22 -62 -77 77 -1
3359aj00Q5j3N4l7R2j44K16n7K6j43N5p1pN9l1k7K3j15J99r7J13l25K52l6Oj17
3386a41K49j67n2J66q7n1J7J63k39O4k8J63J01J15j91K1r2J08q1l0O7j54K15j
3410A35j71M3j40M2J34J5k00Q3j16J11P8l9k5j5j1K22l47K38J31j93J06j04k2
3433d5M4J84k27K3M2o5P8j28L1M0O8k09J28j23m8K47j47lM1RP8k2K0J59k27M4
3459hK00o8j62N7J8Q3j55N0m9q4j3K52kj16j8j67K76j20o8Q3Lj0m1O2o1k6J46
3486F2l5o7R9mk2J43j06K8j02K5N7J3r2nJ08Jq1l9%J43j16L4j18N0O0j81J26p3
3514i2O0J8O1L9q5r4K88j69jm9kO9J5N2j78M9l2o9O8L9k0J47l26J98J6OJ13rj28
3543a6K0O0m4j11P3j19P8J95j77r2K46j5n0o8k3M6r4J60pQ2k02J74p5m0k9N3j79
$$ plain form
3359 -1 -101 -16 -29 25 -12 80 -64 152 95 121 -22 33 -38 -45 14 -17 -44 -21 -136 63 -34 79 -246 6 -30 -24 -141
3386 -141 108 -59 -111 55 -32 -83 -66 97 -142 -78 -106 57 158 273 82 103 11 119 38 8 75 -79 136 135
3410 135 -36 7 -133 -91 43 58 -142 -59 -175 -64 14 -25 -50 -65 -76 146 -201 37 168 -25 81 -23 -45
3433 -45 -1 183 -44 -21 21 -44 34 -94 -63 -23 45 -164 -36 -159 -207 40 -107 -110 -69 -60 18 -4 16 175 -52 -8
3459 -8 192 124 -38 19 37 120 -35 15 -34 -118 -131 121 119 3 -15 -182 94 -26 -94 -11 -8 -18 -59 3 -58 -84 62
3486 62 27 -40 59 55 33 176 70 98 -4 21 78 91 -1 -6 102 103 22 -17 -17 126 10 44 -74 -24 36 -145 -19 -92
3514 -92 -32 -14 47 86 1 -93 195 26 25 -24 -26 43 58 110 -68 -19 -51 -120 -52 -13 -33 114 -212 -14 2 8 121 112 -16
3543 -16 4 64 20 -91 -18 -137 -59 136 -41 -133 113 98 48 -20 -43 3 -91 69 62 144 -58 116 41 1 -28 25 -154
3570a54J25M9j48N3J4j9J80k70J72j99R0J68Kl8j5j2L6R0j81N2P0M0m4j01J25
3595H5k9l6nM4n7L6j25J19l9k4J87k05K5J05k00J70r8J54r1n6Q4k2L5K0Pk12k3
3622a51Q2N9R7j52J31M8k14J10kn0J28p0K7p0J34k12lJ76j38J28n0JNp2p8J54
3648A8m5j8J44j27J28m7j2Q2j87N5p9O6K3oJ20j68J1O6j79J32J0Mp5J62l9q8O2
3675A3J03j03L7K9j44R5K1j8J51j78J27k9j61M9k4J89q3j8o6J03k2j58K2j42J14
3700i3N4l8k6J28j1o6N1j73J72Q9n8P9P1j75m8m3O8Q1m9J02l8j14J74o4j7%j08
3727e2K1k25L26m4p6O5j08p1J09L7rm2k5N9m3k4L8Q8Q0l4j03K38j03n4J1r1J3
3754a9L4P7q8r6N1M7n6j33J19o1J17j40Q3pJ41k95L86j99P6k4Lo9L7J40k6K6j21
$$ plain form
3570 -154 -29 20 -128 -75 -61 -80 100 -170 2 -197 -107 61 63 25 10 -2 34 124 -57 -5 65 105 61 -40 85
3595 85 56 20 15 59 2 38 -87 32 -7 -31 156 -49 -24 81 -119 51 -47 107 16 -40 44 22 57 77 84 -128 -151
3622 -151 -69 -10 87 -65 66 114 -100 10 8 -42 86 16 43 -27 107 -105 -108 68 -70 58 8 9 14 -58 -136 18
3648 18 -27 -45 99 -28 100 53 41 123 -64 -9 -88 -22 1 -5 115 -53 -42 24 -155 -23 -13 -9 -84 78 39 -49 13
3675 13 116 13 50 79 -65 30 51 33 184 6 133 104 -57 -8 -32 157 74 56 -10 93 71 -87 -65 -207 -93
3700 -93 -39 -77 -103 25 14 -52 -1 -174 -2 87 29 108 179 4 -44 -87 -19 62 13 115 77 -37 137 73 56 56 -52
3727 -52 -31 -256 70 26 -50 15 -93 -164 -55 -18 -27 -69 -94 -35 -78 -102 -64 24 104 70 -33 205 102 48 59 -32 -19
3754 -19 15 92 4 -92 -41 6 -50 -183 -64 -125 -8 -148 -65 -72 69 -226 160 -39 37 13 16 -53 -16 124 98 124 3
3781CN4P5j47N9O5r1J3l9K6J00j90Q0Mj01k4J19l6rk7P7Q0l4m8j6J27L6k19J37
3809G4j52J08r5J11j24mJ71r9J54L1r0o8j7n0J82j59m3O1lk49J64J30M5L0j97
3834h9J06R4j34J17j33Oo0Q7J01J9k0j21M8J16j14O5k9k43R0P8j7Qk5k9J30j16
3860f5r9K4J84j72O2M7k5J00l7l4L1K4N8o6r0R8P3j80R0j44J71k63J38M7J1m8
3886f5O5O2j46L6J24m4j93J75L2k16R5J65k12qJ14M7Q3j17P9p0oJ26p2q8j82Q3
3912a33N1Q4j92J64l7O6p6p8J20l1q7J58rN8r4j9j33J71J29j04L0n0n4J79j29
3937a6J50k0j08N9j76K31p3o8k3P5q8P9k33J20N4n9J73l7k29J22P3j2p8lJ03l3
3963a7J39N7j51o4l7R6K4p7J19om3P7k37J78j5n5l0j14K38M2j04Pj22J73k4pj9
$$ plain form
3781 3 57 132 -15 44 109 18 31 -8 18 118 -72 8 12 -89 -113 6 -30 -39 -66 11 91 57 9 -7 120 156 -63 74
3809 74 -78 30 -65 46 -78 -82 89 -10 144 175 85 17 0 -50 132 -27 -70 -9 -12 -261 -97 33 78 108 -89
3834 -89 17 111 -23 94 -39 -33 -93 -6 95 114 94 -27 21 137 23 88 59 -184 -94 -16 -33 -25 -50 -79 51 -65
3860 -65 -164 -140 44 -128 -66 -19 -44 56 19 -15 16 40 98 32 -58 40 113 -67 23 -121 50 -213 -75 -28 -17 -65
3886 -65 0 62 -84 -48 76 32 -161 14 46 -170 -75 90 -122 -130 -16 31 114 -3 76 6 0 126 54 -34 -216 -133
3912 -133 -82 2 -190 -26 -63 3 -73 -151 -31 -62 -149 9 0 58 -36 -55 -188 -17 112 8 38 -12 -66 113 -16
3937 -16 134 114 6 65 -111 120 47 -21 -44 31 -57 22 -211 -91 -37 -96 77 40 -189 -67 6 -6 -84 -87 16 -17
3963 -17 122 179 28 -36 -73 23 47 -30 89 83 40 117 -120 58 43 -12 -42 -156 82 124 20 27 -95 78 54 47 28
3990B8n9MPo3J05j47K08j18m3P3J7o6J36l2j05M4O2J4o8m0O0j75J43n5P9p1R1
4017B9p8k6P2P5j01L1mk7J06p0Q0l7j7R5j61o1M1j06J43n7l7oJ19q1k3K0P2p3
4045h2J52N8j82K2j4O9j0L9j29p0Q5J7J69o2j22J60p9n8J42j75L1J09j43jJ51
4070G7j28R9K5r1q1J50j20l1Q9j11J79%j80J87p2j31J78n2k3j22L33r0j4p0K9
4095C0j78J53j92L24j28j73K12k1j30k9K77k64J19J07m6K2k01L14l50J37n3K01
4117A31j87J34m7J22j3k22J61q3j9j17J46j6Lj43J2K09jj81Q7L1j7j02P0J21j44
4142f5K02k54j6J18K6k2m5J90k11J59rl4j0J09q9l0J8J32j38r0j15J45J66j27
4166A0J46j95r2J0J60p9q6J95j22K3o4Lj03J00P7M1j04J94j23J8j8J63j19r7J72
$$ plain form
3990 28 -31 -27 -20 -83 22 -125 83 -35 -78 -5 12 -54 82 50 -55 -11 51 65 -3 -43 17 -158 -15 -70 9 -62 29
4017 29 -49 -75 -3 72 -29 2 -2 -29 77 7 87 50 33 128 -33 -94 -53 -159 -16 -73 -110 -116 3 -78 -101 -81 -9 -82
4045 -82 70 128 -54 -32 -46 23 13 52 -77 -147 -62 -45 124 62 -60 100 21 -37 105 -70 -39 70 -73 -74 77
4070 77 -51 48 73 -18 -99 51 -69 -100 -11 -122 57 57 -123 64 -8 -139 39 -13 -36 -158 175 85 71 1 30
4095 30 -148 5 -187 137 9 -164 48 27 -103 -132 145 -119 0 107 61 83 -118 196 -154 -17 -70 131
4117 131 -56 78 31 153 140 -82 79 -4 -23 -140 6 -10 -7 -150 -138 71 70 -111 -24 7 -10 -112 -42 79 -65
4142 -65 137 -117 -133 -15 11 -11 -56 134 -77 82 73 39 29 138 49 19 37 169 31 -59 -174 -29 137 10
4166 10 156 -39 -131 -121 39 -40 -126 69 -53 -30 -94 -91 -194 -94 -17 24 -80 114 -9 9 -9 154 35 -62 110
4191A10lj98jJ47j00O2Q0j85l4J63j8j52O1N2q9k6Q0M5P8j64R9J77j19q7j2J05
4217G1j57K71j94q9Q1nJ32J4j84R2j60J34rk4k4Pr4J56r6R3k8o4k9j6J33l5L6
4244A2n1l7L7K15j48k3n7N2%M5l3p0K1J69j76j74L68j32O6j04j8q2J5M3J39j12
4270c5M1L8qj64JOL18j07j34Kk3q2J86Nj49J80j87J08N8j2o5j3J00k18J52k2o0
4297h4M0J7n8M0M0Nk0J58j99R2L6m2J95k21j4J05l1j7j71J56q3O5j21J31n6j09
4323a46J60J11o9j53j3N8M0l9J19no2m6K41l11J58j20J29p2NP8q7N3o1R8o1R8
4349A03j31oj49J05J48j01P6j20j16J20J73n1j26Q5J2%R6j09J07q4k6M5rN9n6
4374D5k9n2P1p9M5K27j75p1J25rn9j22N2J6M4j55K68j58r3J53k17K37Mr3mJ4k2
$$ plain form
4191 110 107 -91 -92 55 -45 17 97 -88 -122 41 23 -129 -68 -16 -105 -131 -51 -6 72 -92 7 184 65 -22 -34 71
4217 71 -86 185 -9 -98 -17 -22 110 124 -60 32 -128 6 -3 -27 -51 -44 -138 18 -78 15 -13 -77 -106 -122 11 -24 12
4244 12 -39 -76 -39 176 28 5 -52 0 0 45 12 -58 -37 132 -44 -218 150 18 84 -20 -38 -120 -105 -62 77 -35
4270 -35 6 44 36 -128 -127 -121 197 90 -44 -42 -65 -147 39 44 -105 75 -112 -4 54 42 -23 -36 64 -154 -2 -24 -84
4297 -84 -44 -27 -85 -45 -5 0 -20 138 -61 31 67 25 220 -1 -15 90 59 42 -129 27 -56 9 -112 19 -37 -146
4323 -146 14 125 56 -97 -110 -52 -12 -51 68 63 1 -45 196 -115 43 -77 52 -20 -15 63 -24 29 -32 66 5 103
4349 103 -28 -34 -183 -78 70 -31 45 -75 -191 -71 102 51 -75 10 22 22 118 9 116 32 6 51 42 101 45
4374 45 16 -36 35 -44 1 228 53 -18 107 98 39 -83 -31 -15 29 -126 142 -16 -109 44 -173 64 68 -25 -29 -15 -37
4401c7K22o3k31R8M6r4J08P0p6J11j81k2J35pj44L6O3n9o9l1K57j62j45P4K3P2
4427fKm9K2M2M5n5r4Q5J98j07M0j71M2j36J96j40l4J43m2K8k3L3m0p3J2L9Rn8
4455i2P4j74J96k9j57J68o3J50Q1j39%J39j80J9K19l02oK34j21PP0p1L1j00J0
4480c6l3K3o1n4J55j19K3K6k0o2J59J83j29k40J30K29l01J99M2n3L5q1K2o3nJ1
4506b0o4R6L8n0k1j00L1J77p9K2l1K0j30M2P7q5J47r9Q7l4L2j55P5k5P5j10J65
4533H1J6j35O5P2j07P2qk0j48L3l0R8Qk2K0p8J6j3J30p1J27r4j19J29R0p1j57
4560a16J64j24k6J50lo5pl8K41j69l4J09j26N9q1R8p7l9R8j47J14J6j38K2K74
4585A55k39J20q7l0j5J20j00P7K01j15j2q4K60k38N4N4j43J07j41M0Q4j01P5j63
$$ plain form
4401 -37 185 122 -109 -11 35 -59 49 119 43 154 -27 -49 86 79 -65 -29 34 -25 -94 -125 132 -30 -175 -101 -78 -6
4427 -6 -4 -53 -31 11 56 1 -93 -8 190 83 123 -48 -6 -142 54 -86 -120 23 -19 9 -14 19 -21 -94 -82 -43 -34 -92
4455 -92 -18 -192 4 -25 -182 -14 -77 73 154 15 15 154 -26 -7 212 -90 -96 138 17 24 94 23 54 -46 -36
4480 -36 -69 -46 -107 -161 -6 -125 -102 -76 -96 -158 1 184 55 -185 -55 174 -127 72 114 61 96 15 37 -26 -31 -20
4506 -20 -84 12 50 0 -21 -121 -90 87 8 30 -1 19 -111 -69 8 -77 70 -29 58 24 56 -99 -24 -49 26 -84 81
4533 81 97 -38 27 99 -8 64 56 36 -112 -79 -109 -11 -3 -25 -5 -83 -67 -80 50 -21 106 12 -107 22 112 41 -116
4560 -116 48 -76 -102 48 45 -20 -27 -65 176 7 -27 82 -44 15 -66 32 -45 -84 14 -133 -19 -3 -141 -119 155
4585 155 -84 36 -51 -81 -96 24 -76 1 202 87 75 -9 251 13 67 121 -22 85 -56 -16 68 -33 42 -121
4609a21L0K4M8J6J9rm5M6n7J5nJ37j2p5L8j6J8K2j35Q3j48Q8m5k6K11o7m2k01
4637b09K47%p5M7lo1p5P0J35j15K04k20no2K29o8P3j76J60r8k2Q8j4L9J7j90K22
4664A38j17L4n0k6L8n2O6k9K8m9o1Nj16J90L1m0P2j18J34j04k1M4p5J11j66L18
4690A85j76j5J23n5j10Q5j54J12J49o8on1Qj5q3P2oj84J82J2oj13J13J0J6O7m4
4717D8r3J79k39J82O7j22mj7K0J4q5O3OL1r5J34r8N5P2j14O7j00Q4j84J45J0k0
4744FN0k5k2n0K14j79O2j78K86q7j35J43j27J40j88o0P2R1rq2ON4Q2j03o4K59
4770A56n9j02J05K7r1K1o8j35J73n7N0K9N4l9j54O1O5K7R8j44m8o5J08o8J7R5
4796E6n6L5n2j7r1J02j14Q4j3O6k5M9N4j22P1o5M9N7L3o9J4N2j38M6n3P5o9J52
$$ plain form
4609 -121 -91 -67 -19 -3 16 7 -38 8 -49 -34 -39 98 86 11 49 33 51 73 -62 21 -127 -39 -84 -110 101 34 -8 -209
4637 -209 38 38 -37 10 7 -54 -129 -59 76 -39 165 -55 -60 -122 107 39 112 -64 96 -2 -24 64 50 89 106 -84 138
4664 138 21 55 5 -21 17 -35 31 2 30 -19 -80 -75 -191 -1 30 -10 62 -56 78 -26 -47 -3 -78 33 -133 185
4690 185 9 -6 117 62 -48 37 -117 -5 144 76 70 19 27 12 -71 1 -5 -189 -7 5 -1 -114 -1 9 25 92 48
4717 48 -45 134 -105 77 144 22 18 1 21 35 -50 13 19 50 -45 89 -9 46 118 4 71 -29 55 -129 16 26 6
4744 6 56 31 9 -41 173 -6 56 -122 164 77 -58 85 -42 98 -90 -150 -78 13 4 -78 -72 -18 64 -39 -103 156
4770 156 97 -5 100 127 36 57 -11 -146 27 -30 20 49 103 64 -90 -29 36 63 161 17 -31 -96 12 -56 -39 56
4796 56 0 35 -17 -34 -125 -23 -137 -53 -66 0 -25 24 78 -44 27 -38 11 68 101 32 46 98 -40 6 -47 28 -41 111
4824A11j69m9Q8K9Jm3l4m4KL1R9J22j09j26J08n5J78k21J95k23K6K20l45K43L
4849C8L0rmo8j8J2K0o3O8rj36J47R9o8r3P9k0J6j08J67n7R7j34M5j14Q7l0m3J89
4878A20Oj45J1J23j72J48P4q2j06j8L4p0kP7K5r0K6J03j69P4J03k56J71j40J68
4903A3j47J93j22j01J22R8o7j91K23L6l4J31j40J24k05%J8P6o0k9J19j83J58l9
4927gNrQ3m9j25L3R0J08o1k68K64j22L1L5l0Q8k32K28m0q0m1R3K4K43k47r1J09
4954C2k3M4k66J77p9K76k22j0J77j08k39K65j09K05p8j78p6K93m4rO7k0r4R5j78
4979a02J25k07J35%K7rJ0lM8j32Q2O7p3J5q2J28l1J2M4p7o9M4P1J30k16Q6r1O8
5007@K0o9R9k13K58j50r6K00r9P8K5p1j13K45n2p3O0j13N5n8J46l7j37K75j81
$$ plain form
4824 111 -58 -107 -19 10 11 -32 -66 -110 -108 -77 22 144 35 -91 17 -38 140 -81 114 -109 -83 137 -208 35 38
4849 38 68 59 55 -13 -31 -19 1 -62 6 -3 -139 8 107 39 -54 25 5 21 -87 80 23 120 -14 31 -83 4 -26 -69 120
4878 120 126 -19 -8 115 -57 91 165 83 -23 -41 -7 -77 -79 -2 23 -67 -41 62 -107 -33 70 -186 -15 -155 13
4903 13 -134 59 -63 -164 -42 56 -11 -202 21 57 23 154 14 138 -67 -67 -49 27 -33 -62 57 -126 32 -7
4927 -7 -2 -11 72 23 -102 -69 21 129 68 -200 64 -58 -27 8 -22 66 -166 62 22 -58 -99 -6 18 261 14 -77 32
4954 32 9 53 -213 -36 -115 161 -61 -71 106 -2 -241 24 -85 120 42 -136 -212 81 37 28 95 75 -19 76 -102
4979 -102 23 -184 -49 -49 -22 -31 -21 -24 24 -108 -26 41 -32 -17 -99 29 -2 10 54 -23 -92 -48 23 153 -63 23 -68 0
5007 0 20 -49 50 -163 95 -55 -151 49 -50 28 53 -18 -131 114 62 -11 49 -64 -9 -67 79 42 -95 180 -1
5032aJ44p1q5j43k1K27K0j30j2o8J77K2j29J25j61R2O6M5J9q8p5P5j16J74k06
5057a20K36j56j8m2J68J19q0p2P0j31O0P5j44J29j7k8q7J05J27k90J48L3R8j16
5081F7oPj43P0m8R8p5P4J2N2l48M84k00J18o2k29J25k9J1n3M5J33j53q%J47j30
5108d1l2oJ44J02k59l4J87l5O9r1QJ3k08J16J75n9K0p9k2k8O8O1q9j75K18L6p6
5135a7p2J73J5k03J64p5pJ95k38k8O2J0J5L4R9k07J38j01J46n8M0Qp8r8K6Q3j40
5162a14P2J08m2p5J18j16j60K35J1k02K32j13m5J47k2l3K7L2Rj48P2J7jL4q2J2
5188b7J20k18J99k2jm0P4q4N3r3p5KL2N4K0J33j30mj14J61MJ1j88J89j52J00n6
5215e2k1Q5MJ47j68j3j47L3J79O2M3k35J98j59n6K12o5r8Q2OK7j9j57l2J8K08
$$ plain form
5032 -1 143 72 -13 -156 -177 50 70 -60 -72 -140 37 59 -70 55 -106 -14 52 97 116 28 -47 28 -88 86 -120
5057 -120 116 -40 -58 -100 68 187 107 35 105 -26 34 109 -35 94 77 49 -38 67 194 -96 52 85 183 67
5081 67 61 68 -75 -5 -53 45 -30 44 56 108 -240 244 44 162 100 -129 -4 -33 -22 -75 -30 103 -50 -58 -58 89 -41
5108 -41 -73 -79 65 167 -92 -126 61 26 95 4 12 25 -183 -67 108 49 69 -10 -32 -60 8 69 -20 -195 23 59 -17
5135 -17 -89 84 99 -104 60 -15 -22 173 -65 -93 -31 -21 -6 28 127 -80 58 -43 103 45 85 93 15 -83 -57 26 -114
5162 -114 -42 66 24 -51 67 -49 -209 26 37 -165 67 -46 -91 56 34 1 28 60 69 -79 -7 10 9 43 -39 -27
5188 -27 93 -125 74 52 51 11 85 1 54 -39 -114 -112 -80 -26 -6 127 -3 -7 -121 40 44 55 -133 56 -96 4 -52
5215 -52 -73 12 16 163 -5 -18 -165 -132 47 109 152 -83 115 -44 -100 112 47 -51 31 37 64 45 -112 -144 -126 82
5241H2Lk6j54J79n8k6P5O0j11%j5j2O6ll0N3l2n6l0R3q3J7p3R6Q8j61J04j26Q1
5270AnN9r5P3r4j8L0L3nOJ38j71L9j2J8J42n8j39L9j15K88k35J37m2j7Q2r7O2
5298D4p4L7k9Q5j99K28kj42R5k9pK0O1l4j04J50k2j1k74K22o3R0k2j0Q4q5J48
5325A57k09J55j18J04l2K0L8m5r7N7o6l4O9p1J36j64J26j88K73j39Q3k23K28p4
5349a4k4O8M4j76M0j6N4j6j2O1J3J68j80k4j2MJ55j70J04j25m0L5p6J73n0K6k5
5376a5M0k4J96k49l8J01k1j4N0n2o3O8n0Pn5J01J3j6J53j00n8r8J91n1j39J22
5402aK3N4j85J76j50J62k09J06q5Q0K24k13Q8OK6m5m4qN1r7J47J0q7j21J28k5
5428A1j00K90j51o8j9Q8L4j02kK39k01q3O9Q3jj01J42l13M16k07p6m3N5J04K6
$$ plain form
5241 82 85 59 -95 84 26 0 75 135 24 24 9 -3 63 60 30 83 51 -5 -35 58 -25 -8 -81 15 103 -58 46 -80 1
5270 1 -4 55 -40 33 -61 -79 -49 -16 -21 -15 123 -48 -9 -21 -3 139 81 -58 -19 -134 154 -81 56 14 -3 79 -18 44
5298 44 -30 7 -22 63 -136 92 90 -52 43 14 7 27 88 54 -50 100 78 67 -207 15 -48 42 20 10 94 9 157
5325 157 -52 103 -15 89 57 77 115 70 -27 30 -36 -70 -1 -72 64 -100 26 -162 111 -28 55 -168 60 -14
5349 -14 -38 30 74 -102 -62 -78 -24 -40 -52 9 22 190 10 -14 -26 -22 133 -37 67 -58 -98 -63 -139 34 -16 10 -15
5376 -15 25 1 197 -52 -90 11 -10 -24 26 -26 -89 -21 -71 -64 -119 -18 -5 -21 132 32 -26 -124 67 16 -123 -1
5402 -1 22 76 -109 67 -83 79 -130 -24 -109 -29 195 -18 70 76 102 57 13 5 56 -41 106 116 29 -92 36 11
5428 11 -89 201 50 -18 -37 51 85 -17 -19 220 19 -64 5 88 87 -14 128 -185 231 24 -52 -95 -40 64 90
5453I0k05J65o8O6r7J25j89J18j2J1J54j68q4J15J13j00J9k8M3r5J16j78R7n7
5477d9K08j77kJ20N2p8j06o2J71j08J7L5j28l9J75L1k42J35P7r1j3J90K7j41j06
5502a04M2m1J64l0M7J08j45n2Q3j85o3P3O4J22j35M3N4r3Q4j59K25K9j29k5J10
5527H7k97O3J1J75M6j91L4P7Q0k27K01q3N6k32M6K60R6k62K20k42J73n3r1K10
5551A57l77P5J34j9M3l4K9J5J2K2Qj83l0J28o1J38j19J97j70O3pR4m6nMr8k3L7
5579a6J7l0n3K3P0m6L4N6n5j5J42p1M9n8k06J90q8J54j75J99J7o6k59K75j14p9
5605a05R6r3Q8N6j14J87p2N6k34K02j34K19j34k3R7q0J08o2N8j36J34k00K09q0
5629D3J7q3K27j74R9o2l8m1n9j1J12J2Q1k5j13j8m9N9P8q4M0q9J3J20k4k7k2R6
$$ plain form
5453 90 -115 50 -18 48 -49 76 -113 5 -7 4 158 -10 -94 21 134 34 53 25 68 -27 89 -89 8 -49
5477 -49 159 -18 -20 100 152 74 -32 -94 77 -31 -14 21 -107 -146 29 60 -182 -47 30 -61 -74 116 143 2 -104
5502 -104 -62 -103 61 31 78 186 41 -11 72 -113 -176 -103 -39 83 -52 -9 45 -48 36 -123 102 131 2 -23 87
5527 87 -210 -147 -136 39 85 -106 -72 5 85 -142 59 -24 32 -200 -154 106 202 -60 160 -82 91 38 -53 157
5551 157 -220 -145 -11 -30 13 -21 8 23 35 57 65 -118 -148 -20 -81 57 -62 135 -35 28 21 115 69 64 68 -30 -53 -16
5579 -16 1 -29 -82 -59 11 -35 -1 55 0 -15 127 56 105 47 -159 31 -57 97 -78 121 138 72 -187 88 -26 -105
5605 -105 -9 -102 -14 42 -72 115 43 99 -135 67 -67 152 18 -5 92 12 120 58 116 -20 114 -86 123 43
5629 43 60 -23 204 30 129 67 29 -12 -71 -82 30 42 123 98 -15 -33 -82 -23 55 -29 11 -78 -65 55 31 4 -18 78
5657G8J2J41j85k8p9P8l5J5o2J94r6m7M6q9J20j42JO3Q9j43m6J48J10j87j44Q2
5683a06Q0J47p5n7n9J85o9j13J09j6J9jl9P3j66jJ14j34J22J1nj8n1J1m8J0j44
5710b21K81q9oJ16q7Q2l9k1N9j6n0J86j15k5R8q0k46J63j21R5M3jm1j26qJ14K2
5737c3N8M0L0o6k56K80J4k22J32Q4J4m0J30j96J38%o5L8j54J32M5j47J5n5O9o9
5763h4K19j59O8K7p2n3p2J97j71K4q9J25q7J53rj8O3M3l0j53R5o1m2Q2K00j97
5789aO7j47K00j36J25p9O9j81O0j22J04k2N0O8k78L13k16J85j77J57q4q0K23O7
5813A65j68K7N8J3q2r2K21j38J2n9J8J24n8N0m4n1m7K7n3O7L6J42k61p1J21Q5
5839D2j29R5J67j97j2k3J58j0p2P0j11q0J44j66J11j87J48j10J84o6j9L1J07M3
$$ plain form
5657 78 90 231 46 18 -61 17 -18 -3 -65 129 33 -14 32 -57 63 -79 -78 -15 74 -69 -115 33 143 -44 -188 -106
5683 -106 -26 121 46 -11 -70 115 46 -67 42 26 45 44 5 78 -88 -89 25 -109 13 24 19 1 -50 -39 -87 -77 -221
5710 -221 60 -29 -35 81 -6 76 37 16 75 59 9 195 80 55 153 73 -173 -10 -131 -36 7 6 -35 -161 -169 -55 -33
5737 -33 25 65 95 29 -227 53 67 -155 -23 61 75 35 165 -31 107 107 42 80 -74 58 103 -44 -29 -84 -15 -84
5763 -84 135 -24 44 71 -1 -54 -126 71 -100 -76 -165 -40 -127 26 17 -1 62 105 75 -78 17 -44 -86 -4 196 -1
5789 -1 66 -81 119 -17 108 29 98 -83 -23 -145 -41 -63 -13 55 -223 90 -126 59 -118 39 -45 -125 98 165
5813 165 -3 24 82 95 13 -79 142 4 16 -43 -25 99 41 91 47 -4 -51 -24 -77 -10 26 168 -93 -164 -43 42
5839 42 -87 8 175 -22 -34 -57 101 91 19 89 -22 -102 42 -124 -13 -200 -52 -162 22 -44 -63 -32 75 118
5863A18o1j02O3m8K0J23j25p2J86K5m8k12Q2Q5Kp0O1o7q3J39Q7Lj57o9K0O5q7
5890a22MP0Q5j49J46L2p6P6l7o5l0J17l9k0J04j55K14j72o9j0O0j32K80q9J1l0
5916DJ32m6o8j39K27q7j7l6j6o1J14JO3p1N0j4n6K9N5K9j16J4o2J42j5O1j17j00
5944a00J99j56O9R5k67J37J00p8P4K3j63LJ9J23k3P8k95K12j40K7P3m6K03j87
5968b0K38j43M4j92N1J48n4j66jJ79m1P9K4j9j21M4q8j2M8J7R7r5MJ1p9J37k7
5995F3j7l7mJ14l1j73R0J17j7k6l6o3M3j35K51K4k5j25r1J36L7K1j93O8q2J47
6021E6r8J09o7J26j06j44J20o2J58j80L04k11j08M2N7M6p8k6J73J9m2r5j56K48
6045H5M9j53K6K01l17L3j7Q3j8j50J54K7j39L4J01j19Q8J8J3R8j49K11j22j1M0
$$ plain form
5863 118 57 -45 18 -30 -10 113 -12 -84 102 127 79 -133 -51 34 36 -34 27 -40 -123 16 103 106 -51 -120 -100 -35 -122
5890 -122 -118 -48 37 -112 34 66 -10 66 29 -36 -66 51 12 -8 96 -59 155 -17 -86 -96 -36 -168 112 23 34 4
5916 4 136 90 22 -117 110 23 6 -30 -46 -107 7 8 71 0 50 36 -20 9 64 93 -23 -9 -71 71 56 117 0 -100
5944 -100 99 -57 12 107 -160 -23 77 -1 73 96 -67 -64 -45 78 55 133 -162 50 -90 -63 10 -36 167 -20
5968 -20 218 75 119 -73 -22 126 72 -94 -95 84 43 122 146 127 6 50 -38 -50 -2 15 112 17 21 32 -47 90 63
5995 63 46 9 5 119 88 -85 5 122 105 79 43 -20 23 -112 139 163 138 13 -78 58 95 116 -77 -9 -91 56
6021 56 -42 67 0 126 20 -124 -4 -66 92 -88 216 5 -103 -61 -4 42 -36 -62 111 130 88 -7 -163 85
6045 85 134 -19 7 208 -109 -76 -93 -10 -28 -178 -24 3 -136 -102 -1 -120 -32 -14 -1 97 -52 159 37 26 66
6070F6n7P2j00oM3K28k56j11O7r9Q4j18L89k92J66q6l9l0J10k5o5L9M3o3k5J97
6096A32j09j67O8P0J02q5j10J78q8k1mO9RK3M0n8j30M3o7Q6N6Q0j66l8K1K6j6
6123e6o3J14j60J13j1J15Q6m3p2j18K88j43j73J24Q6j12L9Q5q2O4J8n6r4Mn5j4
6149a16O1qK9m2O2M0j17R5L5N8q6M4l5m4R4P4l72J85J7O9J5j7Q5j22R5J12j75
6176C6R4l18j2J19jJ5M1J22j47J75j61j8k3K06k00rQ2K0j02pK47j40P5l0j30R6
6202C0j87J07N4O2L5k03L9J10q2R7k44P2M0J13j08J44l2P0k44K5J02J39n4k59
6226a74J00J43M9p1JQO4j40J17L1J06j99k3k9qO2p1L1j3J0nk4l9L0K10j34k02
6253a70J53m0P2j12J71j85J09J9P1m1j00O2k8J7N2p0j65K01Jj64K07j09m3j9M7
$$ plain form
6070 66 9 81 -19 -25 18 246 -10 -121 -54 -153 -69 -187 202 -90 76 -10 -49 -79 31 6 -59 -20 23 -40 -65 132
6096 132 23 -144 -76 -6 96 11 -99 79 -9 -30 -34 35 44 67 107 49 -81 -38 -105 -19 37 117 -49 -87 -66 -40 -56
6123 -56 -119 -5 -165 -52 -63 52 138 95 23 -95 193 50 -123 1 87 -25 14 99 17 81 99 43 -51 -47 -102 -116
6149 -116 -55 -63 -34 -76 -14 26 -91 4 39 97 11 55 20 -24 70 144 -228 -43 -26 43 58 41 126 4 99 211 36
6176 36 130 -188 -200 -81 -82 -67 -26 96 -51 124 -37 -55 -78 128 -72 -81 1 21 -81 -88 159 19 94 64 -66 30
6202 30 -157 -50 4 66 101 -102 -63 47 -35 62 -182 -110 -70 43 -65 79 47 117 -127 -102 0 139 85 -174
6226 -174 -74 69 118 47 48 56 120 -20 97 128 234 35 12 -17 -25 37 -34 -3 -16 -6 -11 -35 -74 -44 166 32 -170
6253 -170 -17 -57 15 -97 74 -111 -2 17 88 47 -53 9 -19 -2 50 -20 -185 16 17 -147 60 -49 -92 -111 -64
6278f4l3q5K47Q6j64J55l10J89k40K20J20m4j80J42j09j23K83j55J72q0m4L0K1
6301C4j46K19r7K6j4j27J29O4M2m8K4j84R3Oj86J29j31K04q7j9jJ21j18P9j63
6326a51K5N7J56p7k7j9j2K2k0L6r3Q1J12o0K5k96K67j47J03L1j07J12L2o7JR8
6352H2j50J58p3O0j31o7J79k88K60p1J00j87J42M1j61J13N2K3k33J07l8mO5JJ23
6377A03j5p8r9Qm5J71j78K11r4J10j36J54k63L57j7k02k1J04k09N5L7o8M4j64
6401b35K30J34k25K00O6j10J5k25K91m3j66J00m8O6J07j45J8L7j20R6l7kj17J56
6425D3q3K7jQ0r5P7k34l3J93j27J77k9j48J33l2K41j91J26k60J78R6j88K14j89
6449b5O6L7j04o4J18K7n9n9Q4m9oqJ1j17O0r9J86J54j79J7k9O4q9M5N0N9q9N0
$$ plain form
6278 -64 -97 -182 65 151 -13 142 -168 21 -219 1 121 77 -103 39 -70 -193 90 -65 107 27 -17 13 34
6301 34 -112 107 10 36 22 -105 24 88 130 82 106 -78 15 21 -165 -36 -167 37 -50 -69 -70 51 -67 12 -151
6326 -151 -126 -69 87 10 -17 -36 -48 -26 -46 -10 -103 -22 90 30 55 -241 26 -121 -18 13 -94 18 50 -17 -16 82
6352 82 -68 90 17 77 -54 -121 58 -230 30 -41 59 -128 14 55 -106 7 59 82 -151 -44 -82 -86 -21 -20 103
6377 103 88 10 -89 -81 -126 45 -133 78 -16 94 -42 112 -151 206 189 -13 -34 70 -139 -84 -47 -115 -71 -235
6401 -235 -5 129 -96 104 170 60 75 -150 141 98 -68 32 -16 50 157 12 30 67 -53 43 6 4 -113 43
6425 43 -40 -13 -14 66 -29 48 -186 -219 -26 -153 24 -5 -153 -20 -52 189 -2 124 -136 42 138 -50 164 -25
6449 -25 41 78 -26 -90 28 55 -4 -63 21 -28 -34 -42 -31 -148 -88 -187 -1 153 -26 -9 -38 26 -63 -18 32 91 2 52
6477E2j1L1q7Q1k2j2m9n8J29M7n2l7m2J57j44n2J0J02n9J26j04m5J05r6K8j04
6503a06J55j43J23k9L1P2k02J68n9Q7L0J2k79K23p2J58l04L0J38j73J75M2l9p9
6527d1K4j49J34q3K03j35R3n5P6K6j40L2K47o0k19q0R8J5J00J28j27k13K11k35
6551a50n8J30R3j71J02r6J56p5J37m7k6J8k03J56J27j11j74K45L9k6j03K6r1J46
6575D4J07j29m9j47J85j46K7O2J3J39J5j50p9J92j58p1P3N4j01J51K3j22PP1k0
6600iN2j0m9j16O9R7j54L0K01j20L1J9l2j8rM7j23KM9m0J68l5M1j02J03k10J33
6627A5l0L0m1l1K01j16L2Ko5J40nr6N3lq3N7p6P2j27J13n4j06K24j18m7l8k5P4
6655d8k6Q6L6r4j7K5J06jJ3n5K2j7N4M2nq1q4L8N7p9lK8k5pJ5L1P7n2K9j23J38
$$ plain form
6477 52 41 72 -15 66 44 32 -17 -75 54 101 49 12 -30 127 -17 -69 -59 43 -16 110 6 -39 66 -30 -2 -106
6503 -106 49 -94 29 0 31 103 -99 69 10 97 127 139 -140 83 11 169 -135 -105 33 -140 35 77 38 -41
6527 -41 -17 -166 -32 -115 88 -47 46 -9 67 93 -47 -15 232 172 -47 -127 -29 -14 86 214 87 -126 85 -150
6551 -150 -208 -78 15 -156 -54 -150 6 -69 68 21 -5 13 -190 -34 93 -18 -192 53 92 66 -37 -11 -102 44
6575 44 151 22 -27 -174 11 -135 -108 -46 -33 106 121 -29 -108 84 -74 -145 -72 -18 -119 32 55 -67 -60 11 -9
6600 -9 43 33 -16 -132 -63 34 -120 -90 111 -9 22 41 9 -9 -18 29 -94 -92 -43 -83 85 50 91 -11 92 -118 15
6627 15 -15 15 -26 -57 144 28 60 62 -3 137 132 36 89 86 3 60 -16 56 -71 42 -12 -118 106 -12 -59 -97 -122 -48
6655 -48 -74 12 48 -46 -63 -38 68 67 80 25 47 30 84 126 121 40 -44 -6 51 -28 -31 -3 -28 -35 -20 11 88 36 65 -58 80
6686H0k00L5K68j52j98K40O8k63J42r0J13J3K8j04O3j72J77pJ55l54L01j96N5
6709Bn2L3rl7N7jL1m0J53r8k8j09L1J07J6k1Q1k76N3k8R0OJ8R2j29n5L7J92k6
6738I0q1j7j6J78j86J4l0rJ16K7j76L2J18oJ67j77l3l0J9K8P4j02JJ21q8M6j59
6765g9J63r1j2l9o1l6K75j97oO3j11N3j1J27M3k23K77j65q3J5J17p6PjJ12JN9
6792A21m8j17j55K60L2j89K21j35j07J49j54J42n8Q5k23J58L2n5q8M3P4M2NLq2
6817d4K9k8K8j35M6J29m2l9K5J67k37J40k9l9n9Q7Q0l4o6M3J4J3k12K39l4n9O1
6844D4qk4n6o7R3r0J05j7J5L9n1N0j5K5o7o8L1J0L3l4O6o8j31J0K61j63j15Q9
6872a03K1J35Nj31R0K7j03R1Q2j41qM8m7O9k6R2m2j68J33O2m0l1L5j16p0K55j02
$$ plain form
6686 80 -120 -85 183 31 -167 73 141 -122 20 -70 43 56 84 -20 43 -129 48 41 196 -158 143 -53 2
6709 2 -50 -17 -26 -63 -6 -7 24 -16 137 39 11 -98 -67 40 56 35 116 -160 -107 -135 -45 -39 -21 71 -58 -113 -76 116 90
6738 90 9 -8 -24 154 -32 -18 -48 -57 59 86 -90 -58 60 54 221 44 11 -19 0 28 102 0 1 122 34 80 -79
6765 -79 84 -7 -19 -58 -119 -155 120 -77 -83 -20 -131 -78 -89 38 81 -142 135 -30 -113 -98 19 -57 -50 -51 61 62 121
6792 121 73 -44 -199 61 93 -96 125 -10 -117 32 -122 20 -38 47 -176 -18 14 -41 -129 -86 -12 30 35 38 -44
6817 -44 -15 -43 -15 -150 -104 25 -17 -56 -31 136 -101 39 10 -29 -88 -1 79 45 -21 22 36 49 -163 76 42 -17 44
6844 44 36 12 -44 -111 -18 -108 -3 -20 -5 34 -17 33 18 43 -24 -92 -61 -51 -18 -52 14 -54 -185 -175 86 -77 -192 -103
6872 -103 -82 53 58 -73 17 44 -59 32 114 -27 -35 13 -34 35 9 101 59 -109 24 86 46 15 50 -66 -136 119 17
6899A7r0n5O8M6k3J09j62M0Q5j31O1J36K4K2MO2l15J9J65q9N8jn2K02p6k16J40
6926D8Q7j05p1P5j44L29j47q1J30j35J61k95K98j71K3j28J96l5j0k5k45K32O4
6949E1j47R7k1J7l3MJ39j20Q4k0k09P7J56m5n8p0K12j0j21o9J63o0j18K31j46
6974a6nJ32j86K3q6J28J70j48J06M4j86j44K94q8j02m3k2J70n7p2M2J47j12L6
6998B5J2j8M4K3r7k3j25J25R0j22J87j89J25o1k7q4QM1J66N9j37r0J25j43R8n7
7024d5P4n3j1N2p1n3O9M7N2L1o4r7J34k98J03J00l1n5O4K1k1R0j32J59r0L7j30
7051a18J46k28L16j91L8O4M6k5k41K74Nk21j9K01M2j75mJ43J9k7M4j03P7k74K89
7076G8No2J08k05J37J0o0q0n2J21p1N7j28L5K64j66Q5j34L2K9n1n2j7O6%r3K10
$$ plain form
6899 17 -73 -128 -60 -14 -37 72 -90 -50 35 -96 -35 101 125 147 151 213 -102 -83 82 -7 51 50 -2 200 124 -92 48
6926 48 135 30 -41 34 -110 219 72 -9 121 -14 147 -148 150 -21 2 -126 70 35 25 0 -245 -13 51
6949 51 -96 1 -20 -3 -36 -32 107 -13 71 51 -158 -81 75 30 -28 -98 114 104 -17 -86 77 17 -101 130 -16
6974 -16 -21 111 -75 -52 -138 -10 160 12 118 162 -24 -168 126 38 -64 -107 -129 41 -16 -88 -46 101 -11 25
6998 25 37 19 63 86 -11 -34 -159 -34 56 -66 121 -68 57 -4 -31 -115 -107 -66 100 159 22 -68 57 -86 12 -45
7024 -45 29 -24 -35 17 -54 -107 -38 9 61 92 28 -69 65 -233 -130 -30 -61 -116 -52 -31 -52 38 -94 65 -25 12 -118
7051 -118 28 -200 116 -75 -37 27 73 48 -193 81 86 -135 -154 47 89 -86 -90 53 72 45 89 -14 63 -211 78
7076 78 83 21 129 -76 61 71 11 -69 -121 0 -71 -14 -142 -107 157 -9 76 -58 -26 3 -48 -100 -117 -51 -51 -144 66
7103F6p4J12j72P5pm0Q8k23K32j41J63j87J62o0J28j38p1J44j04LJ13k21K50j66
7127f8Q1q3K15k09J20n0J17n5k4J14p8j48J39j12J9L9k5NJ4M3k24K70k01J6P4
7152a1m9J5j4n0K16j53J00q0M1j02J23Q1j51q2J85J56k43L4l0K4j05J34l4m9J70
7177A26k9n8k14L50l08J6J23l4K2N7j68J26R7j36J00o2M0j02j7Q0O7k4O9j28J34
7202A27q3j02P8R6j16P9j06j2j37Q4M7J07q7qJ49k54N2J01P3j00k5P9N3n3r8J9
7228c7L5j62J44N6k0pJ18j29OJ09J0o6j48J17O9q1N0j8K3n4m6p0J97n4j73K24
7254I3j70J27j5l0P6p4J00j18P5o4j4j10J51p5J07p2om3R4j03L9P3k3O5k01J43
7280B5j16N3l6QN7O6K9O2k62J60L2j93J00l1N2L5P8J9k46K22j03j65L64j20j04
$$ plain form
7103 66 -8 104 -68 7 0 -40 48 -175 57 -84 79 -108 54 -6 122 -16 -87 57 -47 -44 69 -152 98 -68
7127 -68 13 -70 145 -64 56 6 123 68 44 158 80 -68 71 -41 -22 17 -8 -3 11 54 -170 100 -101 -85 -11
7152 -11 -60 -45 -59 -109 107 -46 54 -26 15 -87 36 117 -34 -116 69 225 -18 16 -14 10 -95 39 5 -44 126
7177 126 97 39 -175 175 -133 -117 6 -28 -6 51 -117 9 106 -30 70 8 48 -54 -71 9 76 52 121 -7 127
7202 127 44 -58 20 116 0 79 -27 -39 -176 -92 -45 62 -25 -33 116 -138 -86 15 88 -12 -37 42 95 42 -56 -37
7228 -37 -2 -164 -20 36 16 9 127 -2 4 113 123 57 -91 26 95 14 64 46 69 15 -31 -101 96 42 -131 93
7254 93 -77 50 35 5 81 7 107 -11 64 0 -14 -124 27 -48 59 -13 -19 -62 32 -71 -32 41 18 83 -118 25
7280 25 -91 -38 -74 -66 -9 57 86 148 -114 46 78 -115 -15 -46 6 41 119 138 -108 114 11 -154 210 90 -14
7305a4o4J66M0k43J22n8j25K74k49J15J2J39j56n9J27j70J24O0M9j22J16j62k4
7328a02J20J47j03q1lK3J16j12k8j06K86o1nj0r9q3K94j3j01o0K6qkP3j09R6k3
7355G2q2k9J40o4q8J7q9J64J0ko7j06L5M8q9K15j00j08N8k3L0P4N3m0m4j05J32
7382A2N8n7P0q1J00q1j16K09l9j25K9K4jO9j0o8J41m5j62J68q8j79N5L3Qj36J74
7409c8j04R8j01K83j35p8L6N0n2J38j24o5O3N7O6kj69J80l1m5j47J98p8Lj3q5
7435i5J63n6P8j44N8j08J32k0o3Q6NJ40l11J23K5Q7r5m7J47o6L5M9j21p4O4j17
7461a25k6J30O1k45J20K08j57J62j83mJO3n6m5k5K40q0n4p2J31r0L4K7p2N1j00
7487a06k6K23j13P7j5j88J84j02M5m3M7pR1K3j65j0k5Q7O4n0j30J29P1m4mM9l4
$$ plain form
7305 -14 -78 88 128 -115 7 -51 -176 98 -151 -36 -24 115 -41 -100 27 -143 -19 41 90 -32 84 -78 -102
7328 -102 18 165 62 -19 -22 1 117 5 -23 -129 157 96 91 81 -18 -101 193 180 79 19 45 37 35 108 -1 95 72
7355 72 -10 -39 101 37 -51 -34 -123 41 51 49 -18 -124 -89 -41 -130 85 -15 -123 -65 -88 -58 16 69 29 -15 -120 12
7382 12 70 13 83 2 102 21 -95 114 75 -50 -21 3 2 71 61 -7 134 89 -73 95 7 -172 -117 -84 -76 -212 -38
7409 -38 -142 -44 -145 138 3 -75 -39 11 -41 97 -27 -92 -29 28 94 92 -77 103 72 27 -120 78 0 3 -10 -95
7435 -95 68 12 90 -54 4 -104 28 8 -55 31 36 176 -135 -12 13 100 5 -42 105 39 74 123 2 -72 -8 -125
7461 -125 -151 -21 40 -205 -85 123 -34 128 -55 -59 -58 5 -51 -96 -121 119 39 -15 -87 44 -46 -12 15 -57 -6 -106
7487 -106 -132 91 -22 55 40 -148 36 -66 -21 -64 -17 -24 67 90 -75 -85 -110 -23 41 -9 -139 -10 61 17 13 62 28
7514B8R0o4j8j26J11J8j45J63k0L2j48P4M6Q1l5M2j56n0L7j05J42Q7j31%J54j5
7540I2k46J07J99k51%m0J80m9L1J23j91l2J4j8m1P4J10q9J55j29J9j57J86m9j0
7565a2l8O8N3p8j50Q4j46L31pp7m3p7J81n2N6j91Q3p1J69j2N2j64N8n8K9K05k40
7592d7J37j40J17j26J36J22k44J18j59N6K30k35J47k41K35K4lj38M1n2o5qO7N9
7616C1JL9r3k6J19j7k0j75J95k22O4J18R8j63rJ11J9j10J6l1J1J9r6J5n0J11K05
7643A60j38qN5q5J01k9k2j28n1J30n7l8K5N5M1K0J9j60J10J09k46K47j23o7m9
7668a29R5P6m6J9M0N1l6Lj83K42r8J2j55K97l37K73q3j45O3l8R3J4L6p0J17k61
7694a50K13m9k4n5J04j74J39J86j11P7j44o3n4J41L7l1N9j13j88J76K39r2M6r8
$$ plain form
7514 28 118 54 36 -90 21 39 -106 57 37 69 -79 -5 41 122 87 129 -27 -77 -40 -145 -3 84 -47 -47 107 92
7540 92 -154 -47 152 -99 -99 -139 41 -8 23 146 -45 -77 -63 -81 -122 -48 62 -27 128 -1 18 -139 47 -2 -12
7565 -12 -50 18 71 -7 -157 -73 -219 112 105 28 -15 -92 89 37 93 -98 -15 -86 83 71 123 -41 17 -41 -12 193 -47
7592 -47 90 -50 67 -59 77 199 -45 73 -86 -30 200 -35 112 -129 106 130 127 -11 30 -22 -87 -95 -28 31
7616 31 32 71 -22 -48 71 54 34 -141 54 -168 -104 14 112 -51 -60 51 70 -40 -24 -55 -44 -25 -121 -106 -156 -45 160
7643 160 22 14 69 -16 85 56 34 -94 -145 -15 -72 -110 -85 -30 11 31 50 -110 0 109 -137 110 -13 -80 -129
7668 -129 -34 42 -4 15 55 106 70 73 -110 132 34 46 -109 188 -149 124 41 -104 -41 -79 14 28 64 -6 111 -150
7694 -150 63 14 -10 -65 39 -135 4 190 79 156 12 -51 -105 36 73 42 101 -12 -200 -24 215 123 169 71
7718G1j55M5J10Pk13O8Q0j56J74p5N8o4r6K31l2L0j1k77J18K15j74k6J27l6O3
7743H2j68J7O2j97L11j45q9J50r6L5KJ33P7j15k3n9J57jj87K35o9p8j16R8L8J49
7769B03m2k2j59j16J41P1L1j19J37p4R7k82J7J5N7l8k6J47k88J06P4P3M8j05J9
7794c5L9J64j48j73m5K67Om1N7lJ8k45K41K5j89N1l0l7l9J89o4J11n0L1r0o6N1
7821eJj12J55p0M9m2P8r9Q5J85k65Q8rj70NK48k65L23j17J80l01m3K06k91J66
7846b0j17J76n9mj0n9J77j81j7K23j20J47j12J5L0Q6j85o7K4P1J11o3p9K8j8L2
7872IM1N8j0m8k38J94p2J56m7j36nM3K3j26R3L3J4pj56Q1K53k72P9J34L3q8p1
7899c2J66j6k42J57J70l91O9Q1m1J7n5K70k19M1N1j32o8K19M0jk3P6m0j55J5L8
$$ plain form
7718 71 -84 -39 71 78 -135 -67 13 -143 31 -44 14 -50 -146 85 53 83 72 -205 -87 128 -46 -72 55 19 82
7743 82 -86 -69 -7 -204 107 -38 -127 23 -73 -38 -36 97 174 59 36 -23 134 133 -54 181 112 34 -82 16 54 203
7769 203 161 139 -20 -136 5 76 107 -12 125 51 148 -134 -117 -102 -45 -83 -109 38 -250 -144 -70 3 51 -54 -35
7794 -35 4 168 20 -153 -198 69 75 34 91 88 106 -139 102 127 -62 -11 -41 -78 -117 72 8 119 69 100 10 -56 -5
7821 -5 -4 -116 39 -31 18 -24 54 -45 40 225 -40 48 39 -131 -126 122 -143 180 63 243 -58 -101 105 -186 -20
7846 -20 -137 39 -20 -24 -34 -93 84 -97 -114 109 -11 136 24 39 69 155 -30 -97 -73 -2 109 46 -33 -5 -23 9
7872 9 50 108 98 50 -188 6 -66 90 43 -93 -98 -55 -32 -158 -65 -32 -18 -25 -181 -100 153 -119 -40 94 127 39 -32
7899 -32 134 118 -124 33 203 -188 -119 -38 -79 -62 -117 153 -66 -25 26 -106 -174 45 85 84 61 137 97 -58 -43 -5
7925eR1k4p6j06J9M4Q8J04k01K7J41N0k40K06n2J02o3J0j12p6N3J74K6j78J38
7950A40j77J92k08O3J38o9N2k8j98m0J26m3L9J51j87O7p0j6J91j77m4p7J52O9
7974D6M0jj99Q3R8K0l8k64K31OoK06j72pk5Rl8p7J92k11k2J39R3j92M8Q1o8o0
8002h8J56p8j4J54L4j21J4O6k10J93j89K36p1Pn8j1J04j42l7J08m7k6J52j24p8
8027g0Q4J06m3n2npk8j08K69l07J50P3o0n0KK11j57K3L0q8n6N4j4J32j04K91m19
8054a43j7J81Q2L5j57J79k47j7K19R5j09k0q7k27K52k07J53R9K3j00J6j79R4J80
8078I8p6O6k5r0Q4J94k72M0j05J44Q8k00L5m5K86k24L9k3j77K60j01j97J29k2
8102i4K2Q1O5p2M3M0k8M5k3o1j19Q5j94J91o2J67j77Q7Nj18J95P8pm0j02j49L
$$ plain form
7925 -5 86 62 -14 -120 -101 -57 31 135 -66 -39 102 152 -88 118 66 168 105 115 3 -73 -20 154 180 2 140
7950 140 -37 155 -53 10 148 79 131 103 -95 -135 -9 -52 -13 138 -49 18 -52 -68 123 -54 -98 -175 -23 46
7974 46 86 85 -114 -31 67 87 49 -215 16 22 16 222 50 43 18 27 -11 -88 104 -107 -129 10 103 -89 -41 40 -28 -88
8002 -88 68 -10 -24 130 164 43 57 123 -87 106 -83 153 82 89 31 20 124 -18 -55 53 6 -20 132 8 -70
8027 -70 14 120 77 25 20 13 -15 -123 146 -161 -11 62 2 -48 -46 165 8 31 61 -27 -83 -29 -43 89 -15 276 -143
8054 -143 -160 21 103 138 -19 160 -87 -104 115 210 101 81 -6 -233 19 -188 -35 64 87 -13 3 -176 -82 98
8078 98 22 88 63 -27 57 251 -21 19 -86 58 146 -54 -19 -64 222 -2 37 14 -163 97 -4 -201 -72 -94
8102 -94 -72 9 74 2 45 85 57 102 79 18 -101 -16 -210 -19 -81 86 -91 -4 1 -117 78 156 149 109 7 -142 -139
8129a39m6K40J30k75R7o3O4O4J9j7l9p1n4J88q1N8o0l8j0M6Q6n7L9r9l2J61j13
8156bk1oK9O9o3o1m8o1L13j90m8m4K46q8k5j12K15j40m5J02j0o9P8k1J4K4J44
8183A80j69K1N6m5q6k0L0M9
$$ plain form
8129 -139 -185 55 185 -90 7 -56 8 72 91 74 35 -36 -90 98 17 75 15 -23 -33 13 99 42 81 -18 -50 111 -2
8156 -2 -23 -29 0 69 6 -55 -103 -164 149 -41 -89 -133 113 25 0 -112 103 -37 -82 20 10 -59 19 -2 12 36 180
8183 180 11 32 88 43 -43 -63 -33 16
8191A6
$$ Imaginary data points
##PAGE= N=2
##DATA TABLE= (X++(I..I)), XYDATA
0@%%%%%%%%%%%%%%%%%%%%JrJ6j6J6j6J6j6K4l2L2l4M2m8N1n9O6p4Q3r1J03j15
42f0J27j41J56j73J90k10K31k54K80l07L39l75M16m62N12n71O41p22Q20r40J094
63E91j295J574j987K651l904P045k8002n0011Q1258N1080n1460m8032K8421L0598
77A8527l267p587p575j9717R463L9148N43n2189j4127N0325K4846m1141k9612
90c2363K4395K4992r265j2998m002k721R494J8429r648k7351O954K9604l053k2714
104a0247M039J2891p723q5J6375q910k6020J3590L3857j2948l8488Q289L6130
117B0750m343l0126J946J8985n223q114J1673k752k1781R039L1846j1314l8469
130b7883J0510M0663n660l7154K728L0099Q46j8685j034P830p11K638M067j0116
$$ plain form
0 0 0 0 0 0 0 0 0 0 0 0 0 0 0 0 0 0 0 0 0 0 1 -8 8 -8 8 -8 8 -8 16 -16 16 -18 24 -24 27 -32 34 -40 43 -48 55 -60
42 -60 67 -74 82 -91 99 -111 120 -134 146 -161 178 -197 219 -243 269 -302 339 -383 437 -503 591
63 591 -704 870 -1117 1534 -2370 4675 -23327 -73338 7920 59000 7540 -40492 -12071 18527
77 18527 15260 7673 98 -19619 -10156 28992 29535 -22654 -36781 13544 38390 -2751 -32363
90 -32363 -7968 17024 7759 -5239 -9241 -11962 -2468 15961 6313 -21038 -14084 15520 12467 -10247
104 -10247 -6208 6683 -1040 -1125 15250 6340 -19680 -6090 27767 14819 -23669 -15380 20750
117 20750 16407 -13719 -11773 7212 1989 -6125 5548 2796 -18985 -9946 21900 10586 -27883
130 -27883 -17373 23290 17630 -19524 -16796 13303 14149 -4536 -5570 2260 1549 4187 8254 -1862
144a862q348J4522J1607j6205j4792J4534J4779j2904j3870R004R298n685m354
157d276K522k528J24J0060j512j5724K491K1256j995k2930J851K3035n72j9399
171g597N19J5230j327r604L515M074p187o50J0510k260j4629K704J5733l507j5901
186a0377L241J3216l778j0044N430O298p205k446R356P80j0012J107J0089p46
200D909p826J813M452j772r40M035k793o487M469Q802n542j1381M026J1646l087
215D324j1027J154P514o90l140J045k089k232O577M865r215o856J0687Q974r121
230G70q954P352Q751m326o125K224K794o90L70J37m153q86O052J539q084k961
246f190P960L277q234l008O542J835n082k45L482j067j570L081P45m000R18M933
$$ plain form
144 -1862 -10210 4312 15919 -286 -15078 -544 14235 1331 -12539 -3535 5763 78 -4276
157 -4276 -1754 -4282 -4158 5902 4390 -11334 -8843 12413 10418 -12512 -10661 12374 11802 -7597
171 -7597 -7078 8152 6825 -2779 736 4810 -2377 -3027 7483 5223 -9406 -6702 9031 5524 -10377
186 -10377 -7136 6080 2302 -7742 -2312 3986 -3219 -5665 3691 4471 -5541 -4434 5655 4909
200 4909 -2917 -1104 3348 1576 636 4671 1878 -4609 -140 8662 3120 -8261 -4235 7411 4324
215 4324 -6703 -5549 1965 1275 -1865 -820 -2909 -5141 1436 6301 -2914 -9770 917 9891 770
230 770 -8184 -832 7919 3593 -2532 -308 2486 1796 2166 2303 -1850 -2736 3316 4855 -3229 -6190
246 -6190 1770 5047 -3187 -6195 347 2182 -2900 -3145 337 -730 -2300 781 1526 -2474 -1556 3377
262C377q48m702J717M846j769m045J711L300k145k905K363J793l591j309L386
277A179j25l855L92L361j663k675K459J593k978l93L995l66l759J415M349r52
293A977l954J309L612p03k536P17J288n25l44P47j060j918J904K060k878l260
309c564K375L344k571l485K157K262j244j144J232j50k47J474M91j914l67L105
325A754P47k652q72K813J066k175j070J626N19j397m49P82p62q18J258j00j857
342a587l79J989n0k085L69J852o13j111R31J046q93m7J289J88j017M70J165Rq51
361F75l27Q46J43o74o1O9q13k16J056m18j636j08J608k42j505q0R88J20m88N62
381e01m08L9J039N50r19l62J217P74j40q36J5Q50r6m57K04j18n38l04P11l44j201
$$ plain form
262 3377 2529 -2173 -456 4390 2621 -1424 287 3587 1442 -1463 900 2693 -898 -2207 1179
277 1179 1054 -2801 -2409 952 -711 -3386 -927 666 -2312 -2705 1290 924 -2835 -1420 2929 1977
293 1977 -1977 -668 2944 2241 -295 422 1710 1185 841 1588 528 -1390 514 2574 -304 -3564
309 -3564 -1189 2155 -416 -3901 -1744 518 -726 -1870 -638 -788 -1035 439 930 -984 -1351 1754
325 1754 2501 -151 -1023 1790 2856 681 -389 1237 1756 359 -90 692 -70 -888 370 270 -1587
342 -1587 -1966 23 -27 -2112 -1743 109 -504 -1615 -684 362 -531 -578 711 899 -118 352 1517 1526 675
361 675 348 1194 1337 663 602 671 -142 -358 698 280 -1356 -1464 144 -98 -1603 -1683 -695 -575 -1063 -501
381 -501 -909 -870 169 719 -200 -562 655 1429 1289 453 468 1318 1222 765 969 851 313 9 720 376 -825
402h25N1N80k26p78J93M8k60K18R86l41j065L21J380O66r19r18P91J918Jj706
422A15n18J293J116l84j395o35O67J137j93j586j062L99J519M50j978j972J425
439a602K687q5l333q53K958K094j600j856K37J728J322l82j268j016R11K760N47
456C249l147k639K490L919j201m745r40L888J974k762k687L15J909J380q31j966
472a794j436J839L115L33l787k225L607M726j886n469j59N605K377l837l591J460
488a122L682Q03k565k392K11J743K155q81m010j916M019M319l341o194J126O945
504B582J018n541k617L549L683j152k623j63J065J372J468o04l326q81M107K958
520D895l813m578K148N151q33m877j484L577J946k008k144J81R65R50K1m62j494
$$ plain form
402 -825 -774 -194 -420 -1198 -1005 -957 -1217 -999 -13 -354 -1419 -1098 282 948 29 -889 -98 1820 1821 115
422 115 -403 890 2006 1622 227 -408 259 1396 1203 -383 -1445 -1046 473 923 -1055 -3027 -1602
439 -1602 1085 1000 -2333 -3186 -228 1866 266 -1590 -1353 375 1697 1315 47 -969 -58 2702 3249
456 3249 102 -2537 -47 3872 2671 -2074 -3014 874 2848 86 -2601 -2286 -377 1003 172 -1794
472 -1794 -3230 -1391 1724 2057 -1730 -3955 -348 4378 2492 -2977 -3136 2469 4846 1009 -2582 -1122
488 -1122 2560 3363 798 -1594 -1383 360 2515 1634 -2376 -4292 -273 4046 705 -5489 -4363 2582
504 2582 3600 -1941 -4558 -1009 2674 1522 -1101 -1264 -199 1173 2641 2037 -1289 -2170 1937 4895
520 4895 1082 -3496 -1348 3803 2970 -1907 -3391 186 2132 124 -2020 -1839 -874 76 97 -365 -1859
537a859l24K524K056k079l558K016M461j31m259j270M202K022l151j976J545J833
553B052j252q13P21p10j533J415K003k570k774K314L308j965l599J386L568n19
569A032l258L59L114jk191Q0J973K58j441J87J177l35p17N45J46o38n61P74L90
588H93j140r41P49J451q29k256K36K584K14k585r85K648J351j962j104J598J098
605A020p31p5N34j32j111J162J691j382k560J403K833r94l066J09K388J68j980
622g23m86O79J02k04N06n01j166N41J770L04j938q13J733J945p86j988J21J852
640I48J103r60j612J16J709P81j634j364N98J189Nn48j482j78J244J307j655j933
658b366P68K207J74k117o88J688J410r06r42K81R32L62j93pm93L22P74J88j216
$$ plain form
537 -1859 -2183 341 2397 318 -3240 -1224 3237 3106 -1153 -2423 1779 3801 650 -1326 219 2052
553 2052 800 -13 708 -2 -1535 -120 1883 -687 -3461 -1147 2161 196 -3403 -2017 1551 1032
569 1032 -2226 -1867 1247 1246 -945 -865 1108 1366 -75 112 1289 954 237 782 928 290 -271 503 893
588 893 -247 -1188 -439 1012 183 -2073 -1837 747 961 -1624 -2609 39 1390 -572 -1676 -78 1020
605 1020 289 214 748 616 -495 667 2358 976 -1584 -181 2652 1658 -1408 -1299 1089 1257 -723
622 -723 -1209 -530 -428 -632 -126 -627 -1793 -1252 518 822 -1116 -1929 -196 1749 963 -1025 -904 948
640 948 2051 1091 -521 -405 1304 2085 451 -913 -315 874 879 331 -1151 -1329 -85 1222 -433 -2366
658 -2366 -1598 609 783 -1334 -2022 -334 1076 170 -772 -491 441 803 610 603 110 432 1206 1394 178
677A78n91J047O48j076p35L96J48m2l04k23j47j45L96%l03j95L49L87J25j04j51
698c42K98K68K29j15j35P2O93n4p36k0P14j2o29l25J78j74J1j32j26m74N70J9
720b22n41k36M77K29j36m38L34P57q1l77J57M29L38j88j49N8J72L19j87m43j45
741A27M88J00o78k04J72J84m42l37J08j44J63j05j16p3K47L58j74r5J51N07K6
762B63j3k50O36J47j80o9J2J8p0J24l37j79Q4n4k68j23J9L7j3l31k5J3j07KJ15
787e49K72k3M7M1L28j75K08K12j09K2K19m9r6J91K22l59j81K33J97m51l65P4R2
810Aj92k18O3k42K77j14J19k16l9K48K31j50j39L47L93j47q7J74K04o2J14l6l
833E26j90J83j77j21k90J53j40k34m2J08j89j15M9RO0r5j5K28O1O5k2K16K8J31
$$ plain form
677 178 -413 634 1282 206 -529 -133 15 -27 -331 -554 -701 -846 -450 -450 -753 -948 -599 -212 -87 -191 -342
698 -342 -44 224 453 338 203 275 968 914 178 158 872 860 231 -94 84 -90 -79 -211 -337 -811 -241 -222
720 -222 -763 -999 -522 -293 -429 -867 -533 224 143 -234 -77 352 690 502 353 411 583 902 715 272 127
741 127 615 715 37 -167 5 189 -253 -590 -482 -626 -463 -568 -684 -757 -510 -152 -326 -421 -270 237 263
762 263 250 0 636 783 603 534 546 564 494 618 281 102 186 132 -136 -259 -240 -203 -216 -547 -572 -559 -666 -664 -549
787 -549 -277 -300 -253 -212 116 -59 149 361 252 274 493 444 348 539 761 402 221 454 651 200 -165 -91 1
810 1 -191 -409 -346 -588 -311 -425 -306 -522 -561 -313 -82 -232 -371 -24 369 222 135 309 513 451 565 529 526
833 526 336 519 342 221 -69 84 -56 -290 -332 -224 -413 -528 -479 -470 -410 -505 -520 -292 -231 -166 -188 28 56 187
857A87J49l7l08O38J34k61l43L58O3j36l89J93k77n0J6R8n00k17N63o6n40r0N23
880b92J79l03r5K60N1J91J15K43m33m9P04L41n25l22L68M60l44m21%M7LQ0l97
903a39l97J12K66L75p41n25L83O40o5n58q6L56M37K41l37k13L13P97l04o05N4
924DN99r1o9l5k05k13M24K88o14q54M59J070o98j074J72Q42k64m96K0O45k98o8
946d56N22K50q50J42J066K18j196l9J081L66r34l28O94J99k39l96o8N9o2P1j42
967d2l21j83K54K48m19j15J8K02N67k85p61J83R92K04p87Q6Q41l3q89J75R48k32
989F51r13N26P99p95r10P51O34r67o14Q99N60j327n37J205L88j111n03J229N09
1008D74r41l93J090L04n32j24O63p8l60M88P9l02j77R3L45k22l57o4L5N26l66
$$ plain form
857 187 336 299 -9 629 763 502 159 517 580 444 55 248 -29 -79 -63 35 -465 -682 -119 -185 -725 -815 -292
880 -292 -113 -416 -511 -251 -200 -9 106 349 -84 -133 571 912 387 65 433 893 549 128 128 175 178 258 -139
903 -139 -536 -424 -158 217 -524 -1049 -666 -26 -91 -649 -735 -379 58 299 -38 -251 62 859 555 -50 4
924 4 603 512 443 408 203 -10 414 702 88 -766 -307 763 65 -1009 -837 5 -259 -755 -735 -90 -388 -456
946 -456 66 316 -534 -392 674 892 -304 -343 738 1104 170 -158 536 735 496 100 32 91 29 100 -42
967 -42 -363 -546 -292 -44 -463 -578 -560 -358 209 -76 -837 -654 338 542 -245 -159 682 649 -240 -65 883 651
989 651 -262 264 1063 268 -642 109 743 -224 -838 61 621 -706 -1243 -38 350 -761 -1264 -35 474
1008 474 -467 -860 230 534 2 -122 541 463 103 591 670 368 191 284 629 407 50 -14 21 547 181
1029A81p76k1O66N9q04k93P54K68o89J53M85j92l67N74O25p10n63R20J150j161
1049B59j197J275R62o78j017N58M86o03j71N02k17q21L12R28m90j145L83J139
1067D65l29j098J37R53j1j68k87J5K49L76P8l43m8M16K35m12k25K78K1n1J86l00
1089A37o27M18N69m35r11JJ084j71p91J55O00p7o30N10M34n00j30P17L64j112
1109c95M1J221P2r89p5Q43J7p66K08L68o34k73N80J58p65l04N92N9o02N1N54K8
1131a1n68L68K34l23N3L93J4l31L18N93l76n37N43L96n70l16N98J18o19j78N06
1152C05k76m01K26N16n60n27N14M55p36m42Q09q9j68pM75j30k98L59M70m00k97
1173b02O55J04n58j71O28J09n01j04M86l00l31K16J75m07k21N82j74n69KO11l21
$$ plain form
1029 181 -595 -616 50 109 -695 -988 -234 34 -655 -502 -17 -209 -576 -2 623 -87 -650 270 1420 259
1049 259 -938 337 1299 621 -396 162 648 45 -126 376 159 -662 -350 578 88 -1057 -674 465
1067 465 136 -962 -825 128 117 -51 -338 -323 -74 302 380 37 -11 405 640 228 3 281 302 251 437 137
1089 137 -490 -72 497 62 -849 -848 236 65 -726 -571 29 -48 -678 -168 266 -234 -364 353 717 -395
1109 -395 -354 867 939 -50 -125 718 735 -31 177 545 -89 -362 218 376 -389 -693 -101 -42 -644 -593 -39 -11
1131 -11 -579 -211 23 -300 -247 146 160 -171 147 740 364 -173 370 766 196 -120 478 596 -23 -201 305
1152 305 29 -372 -146 370 -190 -717 -203 252 -484 -926 -117 -206 -374 -381 94 -36 -334 25 495 95 -202
1173 -202 453 557 -1 -172 456 565 64 -40 446 146 -185 31 206 -201 -422 160 -14 -583 -581 30 -291
1194b91k00J72L74j58l14L46J68j81m1O01Rm89J67N85j30n20N9L25m02l13L95
1215A62M0l92k8L08k19m18K87K24k50k17L86L23m87L5L74J58l12j58N49k38k31
1236a04L26L06l70j73L69J60m90j34L62L9o73K7N74m46j67J20K43m21j91L81K39
1257b3k80o3L85J42m56K07L87j39p5J61K10k51p5M01L8n52K88m5J20n25K52R7
1279B04j94l18J23K23m54K2L98j3o33L67L72k16j0l1M15l91m7L92J94m29J93L47
1301E14k61l15K08K05j6m33J90K51k19k90R4J24k61o5J72l6n10M70L06m80j70
1322e22M55%q2J0J84Q8k64K96R2j59J04Q3K06l58l5J07j26j63J10l5J6j99M1J47
1346dk84j8O4R6j41p7L54j39j34J47J25J58j52R6J79r0l2J50J4j36J7J65k47n9
$$ plain form
1194 -291 -491 -319 55 -103 -417 -71 97 -84 -125 476 485 -4 163 748 618 98 157 482 80 -233 162
1215 162 202 -190 -218 90 -129 -547 -260 -36 -286 -503 -117 206 -281 -246 128 286 -26 -184 365 127 -104
1236 -104 222 528 158 -15 354 514 24 -110 252 291 -382 -355 219 -227 -394 -274 -31 -452 -643 -262 -23
1257 -23 -303 -366 19 161 -295 -88 299 160 85 246 456 205 130 531 569 17 305 260 380 -145 107 204
1279 204 10 -308 -185 38 -416 -394 4 -9 -642 -275 97 -119 -129 -160 255 -136 -183 209 403 -26 167 514
1301 514 253 -62 146 351 335 -98 92 343 124 -166 -72 52 -209 -274 -102 -138 -648 -178 128 -352 -522
1322 -522 -67 -67 -149 -139 45 133 -131 165 257 98 202 285 491 133 98 205 79 -84 26 -9 7 -192 -151 -4
1346 -4 -288 -306 -242 -146 -287 -364 -10 -149 -283 -136 -11 147 -5 91 270 180 148 298 312 176 193 358 111 52
1370E2n7K29k66l9n6J27k28k2qR9R9k31J57L4j29R5J63N4j52J53k8o3K19kM1j85
1396E6J77J33r7r2j23J06o8r7n3M7j9k07j7R8o0j06R8m1O9lj14J02K64j58J48
1421D3M0J64j14J7j25L43j52j5Pl4o9k35LK59Q7m00o8K73k42%J30j48J01j75Q4
1446b26J50j74K2J07K29j92J46j2J88q2j37K97ok25r4K67jj1k11M4O4j81j48O5
1470a21J21k30k05K49N1j98kJ18J09j09j9K9L94j38k31P9K28J63j47P9PJ57l31
1493E3J08J35k43j82M1R1j55qK3J75k91o5M8K04L6k97K9J91J06n2Q7J80j69k47
1517b02L14K60j46k08K16J79k56n3pL03l68j20R7j7j7l41L14l9n9k25L54l0l20
1540c71J53J15N3j82J9J47J86L2k3l4K30k6k36O8N1L6r1p8R9J8j78k0J70k44j37
$$ plain form
1370 52 -5 224 -42 -81 -137 -10 -238 -260 -268 -169 -70 -301 -144 -110 -239 -144 19 73 -79 74 46 -17 202 200 241 56
1396 56 233 366 269 177 54 160 92 -5 -58 -11 -30 -237 -254 -156 -216 -322 -224 -265 -196 -199 -313 -211 53 -105 43
1421 43 83 247 133 150 25 368 216 201 208 174 105 -130 -127 132 219 -181 -249 24 -218 -218 -88 -236 -135 -310 -226
1446 -226 -76 -250 -228 -121 108 -84 62 50 238 156 19 316 310 85 -9 258 257 246 35 79 143 -38 -186 -121
1470 -121 0 -230 -435 -186 -135 -333 -335 -217 -108 -217 -236 -207 187 49 -182 -103 125 288 141 220 227 384 53
1493 53 161 296 53 -129 -88 3 -152 -160 -137 38 -253 -318 -270 -66 -30 -327 -298 -107 -1 -53 34 214 45 -202
1517 -202 112 372 226 18 234 413 157 104 97 400 32 -88 9 -8 -25 -366 -52 -91 -150 -375 -21 -51 -371
1540 -371 -218 -103 -50 -232 -213 -66 120 152 129 95 325 299 63 131 182 218 127 49 148 166 -12 -32 138 -106 -243
1565b43J34J5o0j76J05K70j29j91J37L80l18j23K96J7j0j28J95L6o6M3j7J00o9
1588A98j84J92j49j8o1l8n1M5j91K21j18m0l2j8l4K65j76K8J96j10rR4K26q7j12
1613C7J13K9N7np9O9j80J97k45J28Ol02K37k06l7j12J63J89l48m4N6L27k99J66
1637h3M9N2j43M2J01P6m2J67j08p2J22O6K37l31o6K1O4n9k57J96M7m6k58M1p7
1662b61K03j03kq5L9Q8l4Q3L0K28j99L3J53K5k11P8J80j41NN8l6n5j31J06nl3
1688A3j72K00n5j61J73j83Nj52J08L02l12J45n4J90j42L2J46R7ON5j64P7j30R2
1712A16J70j64k00R0J86j74j67J63j10j35P6P9k29J55J19p8p9Q3R7M3L0j63J06
1735A4J05m8J24j85j77L20N2l7lq9Q9p0J1p5q6m0J7p8J61l23J86M7m8k20J74O2
$$ plain form
1565 -243 -109 -94 -154 -330 -225 45 -84 -275 -138 242 -76 -199 97 114 104 -24 171 207 141 184 167 267 198
1588 198 14 206 57 39 -22 -60 -111 -66 -257 -36 -154 -194 -226 -244 -278 -13 -189 -161 35 -75 -84 10 236 149 37
1613 37 150 179 236 231 152 221 41 238 -7 121 127 -175 62 -144 -181 -293 -130 59 -289 -333 -277 50 -249 -83
1637 -83 -34 18 -125 -83 18 94 52 219 111 39 161 227 464 133 67 88 152 93 -164 32 79 33 -225 -184 -261
1662 -261 -58 -161 -163 -248 -209 -121 -155 -72 -42 186 -13 20 173 198 -13 65 245 104 109 167 131 76 -55 51 46 13
1688 13 -159 41 -14 -175 -2 -185 -180 -332 -224 78 -234 -89 -143 47 -95 -63 83 180 186 241 77 154 24 116
1712 116 286 122 -78 12 198 24 -143 20 -90 -225 -149 -70 -299 -144 -25 -103 -182 -99 -2 41 71 -92 14
1735 14 119 71 195 10 -167 153 205 168 165 76 165 95 106 31 -55 -95 -78 -156 5 -318 -132 -85 -133 -353 -179 -117
1761a17p6l2K05J7j20J57j86J26J03m0P3K9k02K16Q7j34m2JK4N4l11J98k33J24
1785g9k8mNJ30m54K32M3o1J72j83K85j01p1O5O2Q4j25J46m0J75r8k09J41J07n4
1810A40j44P9o4j11r0J49J04j40r1L8K7r2J09rRj57J93Q1k9m6L0J4L2O9o1L23
1836C63j61r5m3l3L2Q8q4r2J3N2Kj19n3j5N8J48k63m4J57j09J20p9K03o7R2N9
1862A30r1O4J6J16j15O9qp0r8KK00r0j69M2O2j69p9J29m0nm1J25l3j79J01L4p7
1889a74J78j52J77N8nN3K3k11L40o4o7r0P6n6n3k0kJ00j33J22j17k6l0j14J00
1914h7j33P4n6J01o5k0J81K3j43R5q2J15PpJ19P8j71R1p3Q3o9Jr9m2Q3j13N9O3
1942A3k6j82L0K05j21o0J28n5J45j37P9J66j03L8j50K5O8n6J20j45J58n8l5J5
$$ plain form
1761 -117 -193 -225 -20 -3 -123 34 -152 -26 77 37 110 139 -63 153 240 106 64 65 89 143 -168 30 -203 -79
1785 -79 -107 -111 -106 24 -430 -198 -155 -216 -44 -227 58 -43 -114 -49 13 97 -28 118 78 253 155 -54 87 194 140
1810 140 -4 75 11 -100 -190 -41 63 -77 -168 -130 -103 -195 -86 -95 -86 -243 -50 31 2 -44 -14 0 32 101 40 363
1836 363 202 107 64 31 63 151 67 -25 -12 40 42 -77 -130 -145 -87 61 -202 -246 -89 -198 -78 -157 46 -21 71 130
1862 130 39 103 119 235 120 189 181 111 13 15 215 125 -44 -2 60 -109 -188 -59 -99 -104 -145 -20 -53 -232 -131 -97 -174
1889 -174 4 -148 29 87 82 135 158 -53 287 223 156 66 142 86 33 13 11 111 -22 100 -17 -43 -73 -187 -87
1914 -87 -220 -146 -202 -101 -166 -186 -5 18 -125 -30 -112 3 10 3 122 200 29 120 47 130 61 62 -37 -79 4 -109 -50 13
1942 13 -13 -195 -165 40 -81 -141 -13 -68 77 -60 19 185 82 120 -30 -5 63 7 127 -18 140 82 47 62
1966F2j41K84k69J02j91J11j4J86k16k0J0J19j56J00k46K38J1K4j22J81N0Moo2
1990C9J57j16Q0o9K4L9o8p4J50k31n4J73r7j32Q8J60j04j19O4p6l1j00J24r1K45
2015a9j15QJ36jn9M1J29o3N9m1MJ24j7q9M5L2k24M2J35l3j31k12K98k58Q6Np5
2042a93J02L3pJ46m25K28J98j6n7k2P9O0m2j50J88q2J19l8r5k09J62J48p0oJ6
2067F7r4j20J31O4k40J00J7r6NJ91o3o8J51Jnk3K8K6o3J47j67j8K65j07J0j62
2093b3J96k21o1R5P8o4j36J60m8kr0K86l13O0k3R4J8j74K15J9M8j13M6J55j10
2118I2P6j05Q4q4L6J7m3P0p3R3j99j26J26l2p6J70j36j69J04J08K6K1K3Q7J8j12
2144dk1J93k7q4o0R2N2k27K14Q4j76M9J22j53l4l2q8K88j71N8j83N4J8j9o8j22
$$ plain form
1966 62 -79 205 -64 38 -153 -42 -56 130 -86 -106 -96 23 -133 -33 -279 -41 -30 -6 -128 53 103 107 101 39
1990 39 196 80 160 91 115 154 86 12 162 -69 -123 50 -47 -179 -91 69 -35 -154 -90 -166 -197 -297 -173 -264 -19
2015 -19 -134 -126 10 9 -50 -9 120 57 116 75 79 203 186 97 142 174 -50 -8 127 94 -37 -249 49 -209 -123 -118 -193
2042 -193 -91 -58 -65 81 -344 -116 82 66 9 -13 66 126 84 -66 122 40 159 121 26 -183 -21 127 57 51 67
2067 67 -27 -147 -16 48 -192 -92 -75 -171 -166 25 -38 -106 45 46 41 18 46 72 9 156 -11 -29 236 129 139 -23
2093 -23 173 -48 -109 -14 64 0 -136 24 -24 -26 -116 170 -143 -83 -106 -12 6 -168 47 66 114 1 47 202 92
2118 92 168 63 147 63 99 116 73 143 70 163 -36 -162 -36 -68 -144 26 -110 -279 -175 -67 -41 -20 3 90 108 -4
2144 -4 -25 168 141 57 -3 89 141 -86 128 212 36 85 207 54 20 -12 -100 188 17 75 -108 -54 -36 -55 -123 -245
2170b45J66J08j07k7K6J58n6n2J50p3J44j77J26N1j56J17j03N3l5QM4o2r9j6j03
2195a60q4J10J60j41j8Q2J02n1o5O7O2p4J05j09r8J69j39J73Nj9n9P9j37k9J72
2220A03n6l7K9o9J88j01mK7j06q6q4J24j00J75K00j44q7J09n7L9j50O4J67l17
2244a73K94n2J33q4j51J58p1l5Q7k23j8J26L9Q2j77p1j4J43k15L1L18k59j5k3
2268a70J76j2n5P8J53o5j27m2n3K66k9q3p7J70j15O5m3j99J33oJ38j36pJ14k08
2293a34q9K39k6l10K14R6j50K19j06J99j03k4J8ol1J68r8P7j13J85j13p3L7n3
2317B3P9j2l02K14m8Q1j98R8j3l5K23k43J40j6O7r7K8N7q7K5o0J8K54j01j86K01
2343A10p0j11K00O9j72j8o6r8q6J53oL0q3rL1J39J0m5l4K4K0J4l3P9o2J37L6m1
$$ plain form
2170 -245 -79 29 -78 -105 -79 79 23 -29 121 48 192 15 141 192 36 153 50 103 68 76 120 58 -41 -57 -160
2195 -160 -244 -134 26 -115 -133 -51 51 0 -65 2 64 -10 95 -14 -112 57 -82 91 96 77 18 97 -40 -69 103
2220 103 47 10 39 -30 158 57 53 80 -26 -112 -196 -72 -172 3 203 59 -28 81 24 63 -87 -23 144 -173
2244 -173 121 69 202 118 -33 125 54 19 106 -117 -135 -9 30 112 -65 -136 -150 -7 -222 -191 127 -132 -147 -170
2268 -170 6 -6 -61 17 170 105 -22 -64 -117 149 120 37 -40 130 15 80 37 -162 -29 -35 103 -33 -40 74 -134
2293 -134 -223 16 -10 -320 -106 -10 -160 59 -47 152 49 25 43 37 6 174 76 153 40 225 112 39 76 23
2317 23 102 90 -212 2 -46 35 -163 -65 -78 -113 110 -133 7 -9 58 -39 -11 46 -41 -16 -76 -58 196 95 -91 110
2343 110 40 -71 129 198 26 8 -58 -156 -242 -89 -95 -65 -148 -157 -126 13 23 -22 -56 -32 -12 2 -31 48 -14 123 159 118
2371A18M1n9Lq5o1M7J4k3L8K3O7k79L04k09j02P5O4p2p1J00J57k01r6J67Q1j26
2397h5J41K3p1J6J6N6L8n8L5j22RJ54j24l7j37K28Mj52Pjpk5K6l6MJ6m3P7Q6r7
2427e9L5J6J52p3l7J03m9o8mo6J75j1j89J64j45P2j78L1p1J20J10o7r0m4R6P1
2453fNJ7P0Oj20J8q2Q7J66r8p7l2J97q4j76N8J94n1k16J36l4j7j05M5J22j45k5
2480a47K2O1j7N5L7l1q8P7J34p3K2K0J21j19j02O9N6j49R4M6o5O0N2p5j10M0R0
2507H0r3k8j50M6O1k4lJ49L0r7kj34J16J80ok51O4J31m5J44l5j02NJ0o9p6O3L2
2535dN8j02P0k0N2j08p1l9M4J29j63M7k5rM0J17KlJ19l21K62n5J63k46J98m6K0
2562A09l5j51J33j01l9L4pJ5j1J98j54R5m1j45P1K4MP3j81J77lj47P3p4R4N3Q6
$$ plain form
2371 118 159 100 103 18 -43 4 18 -5 33 56 123 -156 148 -61 -163 -88 -24 -96 -167 -67 90 -111 -207 -40 41 -85
2397 -85 56 79 8 24 40 96 134 76 111 -11 -2 152 28 -9 -146 82 86 -66 -59 -60 -67 -92 -66 -102 -98 -82 -125 -48 38 -59
2427 -59 -24 -8 144 71 34 137 88 20 16 -50 125 114 -75 89 -56 16 -162 -131 -202 -82 28 -39 -129 -173 -77 -6
2453 -6 -1 16 86 92 -28 -10 -92 -5 161 63 -14 -46 151 67 -109 -51 143 92 -124 12 -22 -39 -144 -99 23 -122 -147
2480 -147 -125 -64 -81 -26 11 -20 -108 -31 103 30 52 72 193 74 -28 41 97 -52 42 88 23 83 135 60 -50 -10 80
2507 80 -13 -41 -191 -145 -84 -108 -111 38 68 -29 -31 -165 -49 131 125 -126 -62 69 24 168 133 31 36 46 -23 -99 -36 -4
2535 -4 54 -48 22 2 54 -54 -125 -164 -120 9 -154 -107 -132 -141 -101 16 18 15 134 -187 75 20 183 -63 135 89 109
2562 109 74 -77 56 -45 -84 -50 -57 -42 -53 145 -9 86 45 -100 -29 -5 -1 72 -109 68 65 -82 -9 -83 11 64 150
2589A50j96O7K1J50j84k0P2r4J45j03KN0Q3k10J97k14P0j54p8J81R5j61P8Nj48
2614a96K55j3p0jO5M9j27J25J34j03j26N7j14O2oj02N4L6q0QN4P7j28p3l5J50
2640d8j44J32N1j17R4j54J40O1p8J19L7M4q2K77j91k25J83pJ80j39j52p4J76L2
2664A15k33J22Pj07J82p5j32J12J9Mq5R7r7Q2M5M5j69P9qj0J02k23J92M3j72M5
2690b0J35n7o4r2J60qk60J23j5j24J56m2J62j90L0J07k2J8K8k7%p2J97k4j2j25
2716c8O0K5o6J31p4J49l45J94j44J79q5NN3q4Q1k17o2J45rJ83j62p6J76Rj53K14
2742H9o0jN5K3m0j03L3O2J1q4JOJ96j87L5L2j21N8J0n1j50QJ27n9q2J72P2n8n5
2771f1P5k1n7O9N5q2L2m5J36kn5P6k8P0k16R7L5mMK4j46N5r4j0O1j21Q4N8nj22
$$ plain form
2589 150 -46 21 42 192 8 -12 60 -34 111 8 10 60 143 -67 130 -84 -14 -168 -246 -65 30 -131 -53 -48 -196
2614 -196 59 46 -24 -25 40 89 -38 87 221 118 -8 49 -65 -3 -9 -111 -57 -21 -101 -93 -39 38 -90 -163 -198 -48
2640 -48 -192 -60 -9 -126 -32 -186 -46 15 -63 56 93 137 55 332 141 -84 99 92 272 133 -19 -93 83 115
2664 115 -118 4 11 -96 86 11 -121 -9 10 14 -71 26 -71 11 56 101 -68 11 3 -7 95 -128 64 107 -65 -20
2690 -20 115 58 -6 -98 62 54 -206 -83 -98 -222 -66 -108 54 -136 -106 1 -21 -3 25 -2 -2 -74 123 99 87 -38
2716 -38 22 47 -19 112 38 187 -158 36 -108 71 -14 -9 44 -40 41 -176 -238 -93 -102 81 -81 -157 19 28 -125 89
2742 89 29 28 83 106 66 -37 -4 58 69 -15 -14 -8 188 1 36 68 -53 5 15 -36 -186 -178 -51 -110 -192 -20 52 -6 -61
2771 -61 14 -7 -64 5 60 -22 10 -35 101 99 44 120 92 162 -54 43 78 74 78 102 -44 11 -83 -93 -32 -153 -69 -11 -16 -138
2801a38j2J60m4N4k19K89j9r5K45j60J01k05O2L3o2J57j01q0J78j59j65k1O8J18
2825a5l3j7m3m4K15k65J06O6j27K57n6j60j9M7O3J11k46L04j42K7J16j92L0L1
2849A4J89j60k8j07J20K6j2j6j62QJ19P1n5j58J39k5O7m4j03K66k41J98L4k2M7
2874A65j24N1j08N4N4K0l9J5Q1l28L1J62k04P2N8j32N9J01l8nj8J91o2k40PJ58
2900a9LK9K07n6j65L6q1J51M8k97M05l73J34P8j14J21j98J23l7j23L2p0k1J99
2924A2m6M4J8j70J51K7qn7R5q0J18l8q9J95j58O7q6J23j02J01j71q1Q2OJ24p0
2950Gj89O6J17j11Q3o2k5Q9n3J29k2j22J61J9j7m3j04J47R9k75J20J33N7l64K11
2975E1K0j46J09j00J00j20M6j25K3J68j73K31j87J63P6j98Q1L5k00J77j13N8k
$$ plain form
2801 -138 -150 10 -34 20 -199 90 71 -24 221 61 162 -43 19 52 -10 147 46 -34 144 -15 -180 -201 -133 -15
2825 -15 -48 -65 -108 -152 63 -202 -96 -30 -157 100 44 -116 -135 -88 -25 86 -160 144 2 29 145 -47 -17 14
2849 14 203 43 15 -92 28 54 42 26 -136 -128 -9 62 7 -151 -12 -37 30 -14 -117 149 -92 106 140 118 165
2874 165 41 92 -16 38 92 112 73 88 169 -159 -128 34 -170 -98 -40 -172 -113 -12 -50 -55 -73 118 56 -184 -177 -19
2900 -19 -16 13 220 164 -1 35 -46 105 153 -144 261 -112 22 100 -14 107 -91 32 -5 -128 -96 -166 -187 12
2924 12 -34 10 28 -142 9 36 28 -29 66 -14 104 66 -23 172 14 81 -5 118 16 117 -54 -135 -53 -47 77 7
2950 7 -182 -116 1 -110 -27 -89 -114 -25 -78 51 29 -93 68 87 70 27 -77 70 169 -106 14 147 204 -160 51
2975 51 71 -75 34 -66 34 -86 -40 -165 -142 26 -147 84 -103 60 136 -62 19 54 -146 31 -82 -24 -26
2998b6oM6K9R3J6j47K4L8Oq6J27j57J08n7K6k0p9R4j01j6J54qo4%q6P9Q1j47N1
3027b8J30j8pj08J17j16M9L0%M0nlj0j77MJ13Rl7k7n3J28l7q6n8J27J2j26P0M1
3056b6n0Q0R2m0j2O9j88J59N1L1o3r3j28J55m8MK3j23J20m4j0K0j37j9J51r1j18
3083b35K41j15K7k8O5j7K18j96rmK14j35J71l0k29L4j13J71qp1K8j28Q3Q4j88
3108a70K08J1j3j04o0L9N8j4P5J2j60J38o4J04n8n8J95k5j27J40k4K9j08k6O3
3133F1k5P3j71j53PJ34j32K02j2k5j8M4nO2j81R5l2J14N8j02K05p2r5L2K5p4L2
3160D7K4N6j74J31j96L0j10j1J40n6J27j29K30j99J15m5n6O1jj19J03L5p9R2J28
3185A44j18J1L4j90O0k6K79j13r5p0k6J69n5l4J0O7j75O9L6Q0j18J01j92O0J10
$$ plain form
2998 -26 -32 14 43 136 152 5 29 67 73 -13 114 -43 65 8 34 14 -65 29 -72 -88 66 58 -6 -6 -92 -13 68 -79 -28
3027 -28 102 84 77 -31 86 -30 19 49 49 89 84 81 71 -106 -102 11 20 -17 -44 -97 31 -6 -92 -150 -23 -11 -137 -67 -26
3056 -26 -76 4 96 56 44 113 -75 84 135 166 103 10 -118 37 -11 -7 16 -107 13 -31 -41 -21 -158 -177 -26 -117 -235
3083 -235 6 -109 -82 -110 -45 -62 156 -40 -49 -53 161 26 197 167 -62 -28 -141 30 22 -49 -21 -149 -66 18 -170
3108 -170 38 49 36 -68 -128 -89 -31 -45 30 42 -118 20 -44 60 2 -56 139 114 -13 127 103 132 24 -2 61
3133 61 36 109 -62 -215 -208 -74 -206 -4 -16 -41 -59 -15 -20 42 -139 -44 -76 38 96 -6 199 127 32 64 89 15 47
3160 47 71 127 -47 84 -112 -82 -192 -203 -63 -119 8 -121 109 -90 25 -20 -76 -15 -16 -135 -32 3 -76 16 144
3185 144 26 37 71 -119 -59 -85 194 81 -14 -84 -110 59 4 -30 -20 47 -128 -59 -23 57 -61 40 -152 -92 18
3210A8k5K6LO3j49m9J41n1o1m5K81m9N9j84N0J2K5Q7k95O6J82o0P8j46L7L7j22
3237g1l6K7R0j86K03q0L0j0J63r5p1L2J8K9k04J95K2J07k5r1k9J58k63J57N2j85
3263f3o4oO3J63j42Q1j17j3j01K35J2j8j22O1k3l1Q6O6k5n9O9m0O7j33K05j66
3289a5r6K08j84J94q6r6J07r1J6L0k1N5M5r7o0j01Q1R9J8j10J32l8J00jo4n6J82
3316A51k46J43j6J5kP4k00J12J30j35j09M7P0J9k23J76l9j6K1J67l8j10R1j08
3340b6J32j94MK27l7m2j31K8J76k62J13k5J19r8rMJ82r7n2l3o4J17M4j29qJ01
3366D0r5M1L3j15J73p0q7K36m4j62J96Kj57j3j5J1J35j67j38J40m8l1jK49k50
3391a37R1n7K44k53LN7J17m5M4J1o5J4j19K05p7J14j00pm5j3PJ56k41J91J57k56
$$ plain form
3210 18 -7 19 22 85 -64 -113 28 -23 -84 -129 152 103 162 -22 28 40 65 152 -143 -77 105 45 123 -23 14 51 -71
3237 -71 -107 -80 10 -176 27 -53 -23 -33 130 35 -36 -4 14 43 -161 34 56 163 138 47 18 176 -87 70 122 -63
3263 -63 -127 -133 -70 93 -49 32 -85 -98 -199 36 48 30 -92 -31 -54 -85 1 67 42 -17 52 12 79 -54 151 -15
3289 -15 -111 97 -87 107 21 -75 32 -59 -43 -13 -34 21 66 -31 -91 -192 -111 -12 6 -104 28 -10 90 89 25 -31 151
3316 151 -95 48 32 47 45 119 -81 31 161 26 -83 -36 34 53 -170 6 -33 -49 -28 139 101 -9 82 -26
3340 -26 106 -88 -84 143 106 64 -67 -39 137 -125 -12 -37 82 -16 -25 -21 161 64 12 -21 -85 32 76 -53 -61 40
3366 40 -55 -14 19 -96 77 7 -80 156 112 -50 146 148 -9 -22 -37 -26 109 -58 -196 -56 -104 -135 -136 113 -137
3391 -137 -46 -103 141 -112 -109 -52 65 20 64 75 10 24 -95 110 33 147 47 40 -5 -18 -11 145 -96 95 252 -4
3417dP1q7m2Q9j89J04m0J3J10j64LQ3Nj0L6J9pK4J5L3L8K6j75J38M6q5k9O9j25
3446c5O6L6l2L4l9k10J31k1Q4l6o7J6N6j8o4J85j94R4M4N8p6j01J09n8J46k36
3472a28K13R4k62K16j11Rj97Q5J28n0J8N6k78K06N3p7L8o5k5N4O5o1r2M4J68m6
3498E5lmJ75m7j71j1P5p5PQ6l2k14J66j9Q1j89J19k2J73k56l3J18l7Q0j41J13
3524fq7R8q4J74j15R5n9j5m1j0N4M0k6r8P2N1qL6j90J05n7lJ40r8K7J4o8L4L2
3553Gr8M1r8J75j22r7J90o2q0K66j29MR8j71J49m6q7M4k5O3qp4j5K78l29J63M9
3580H6j22L4j63J99j8p6O7J76k88Q7O0M9m3p1q3J23k9O3l6Q6j70j8P5KJ66l00
3606a44OQ5J33q2j10J66r3L9j54K30k36J52l4n4K21r3Lj50J32j08o1K68o3j38
$$ plain form
3417 -4 67 -20 -62 27 -162 -58 -98 -85 25 -139 -136 -53 -48 -58 -22 -3 -10 14 29 62 100 126 -49 89 135 50 21 90 -35
3446 -35 31 67 35 69 30 -180 -49 -70 14 -22 -89 -73 -17 -35 -99 86 -108 -14 30 88 12 -89 20 -38 108 -128
3472 -128 85 179 -83 133 22 31 -166 -81 47 -3 15 71 -207 -1 52 -25 13 -52 -77 -23 42 -19 -111 -67 101 55
3498 55 52 48 223 176 5 -6 69 -6 1 87 55 -159 7 -12 69 -120 -1 -23 150 -106 -139 -21 -58 22 -119 -6
3524 -6 -93 5 -79 95 -20 75 16 1 -40 -50 4 44 18 -80 -8 43 35 71 -119 -14 -71 -74 66 -32 -5 9 -59 -25 7
3553 7 -91 -50 -148 27 -95 -192 -2 -64 -144 122 -7 -3 95 -76 73 27 -60 -16 -41 22 14 -60 -75 203 -126 37 86
3580 86 -36 -2 -165 34 16 -60 7 183 -105 -18 42 91 48 -23 -106 17 -12 51 15 101 -69 -87 -12 -10 156 -144
3606 -144 -138 -53 80 -2 -112 54 -39 0 -154 76 -160 -8 -42 -96 125 32 35 -115 17 -91 -152 116 53 -85
3630h5J83j29P6Ql1J42k08K2P2k8q0Q3N9j31M2J05l45K50K7O4M4j62M5J28k24
3655g3O9j01Q7J17n7p1J48j49L2R9j9K7p7r7J88j49m9O3q8J41j25j53K24Mo4m1
3681a14K06j21Q3j77J05m8J29o9o1J7P9P9o6n5M0J53k35N9R1k6j8J05l20J56o
3706a4p8Q5o7j2n0n1K18j17L2J03p9R5p9r8P1M6k6Q9k5M8J2j14J17o2j44J09n7
3733d8p4p8JK06J00j46j13J43J1j11J82j04J09J4q3J4J53j04j32J71p5k57J65
3756e6M7m0Q5k49K80j46J92k02l6J3K0K24j24p9J50j45P2P2r5L0j18KJ89m4q4
3781d2J30J2J27k56J67j76N5Q7o3j69J96J2k16K88j49N9Q8k27J17k06J69J4pJ64
3805A74k24K5j3j1l7j8K91j75J9K1P9j86J3J64k52K28q8Q7j08nQ9j16j09J47m3
$$ plain form
3630 -85 98 -31 45 53 22 164 -44 -22 50 22 -58 25 84 -47 -5 100 -245 5 32 96 140 -22 23 151 -73
3655 -73 -4 -105 -18 99 42 -29 119 -30 2 101 82 109 32 -65 123 -26 -75 -12 -100 41 -84 -237 -13 -9 -73 -114
3681 -114 92 -29 54 -123 -18 -66 63 -6 -67 -50 29 108 42 -13 27 180 -55 4 95 69 51 156 -164 -8 -14
3706 -14 -92 -7 -74 -86 -136 -187 31 -86 -54 49 -30 65 -14 -112 -41 5 -21 68 43 91 103 -11 106 44 -100 9 -48
3733 -48 -122 -200 -199 7 107 -39 -152 -9 2 -109 73 -31 78 92 9 23 176 72 -60 111 36 -221 -56
3756 -56 -9 -49 36 -213 67 -79 113 -89 -125 -112 -92 132 8 -71 79 -66 6 78 -17 13 -105 -103 86 42 -42
3781 -42 88 100 227 -29 138 -38 17 104 41 -128 68 80 -136 152 3 62 150 -77 40 -166 3 17 10 174
3805 174 -50 -25 -38 -49 -86 -104 187 12 31 52 131 -55 -42 122 -130 98 10 97 -11 -16 73 -43 -152 -5 -48
3830d8m6J01R0j39N5j5p0J59m3N7P2j94L4o1K3j39K56l6l9q9P4J2J16j24R0j6
3856H0l1j96L45k36om6jJK30l1j84J85k08nP5J08k4j60O2K9jJ25k13K26j33J11
3882A02j56J02k0J6n3N0M0j09N7j5J4j36M7rm6J37j42k4M6N9J10j51j7qJ49N0
3908I3p0q9J55r8L9R5Lj53J68j9p3L2j22N0J03j14L0o8M1O1p2K0l5K3o8k0J33
3935D5J03j86n1J54N9q4j50M8J12J2j34J19M3j42K8l1O2R9j69M4L2M2qj99K31
3960G9j45j19J52K9N5p4KP5r5n4K08q1r6J14KN8j02m6P7J49k2k34J45j37j8k7
3986a05J18k1O4n7K8n9j2K17j14k62J97Q2j90M5J39J54j21l5j34J45q9R7pP5j84
4011b9j9n6K32j15j4JP8k58J45k4P7j72Q6J35k46J00QM2K8j28M8K03q9n1J28j76
$$ plain form
3830 -48 -94 7 97 -42 13 -2 -72 87 44 101 173 -21 13 -48 -25 -164 92 56 17 -72 2 14 130 6 96 80
3856 80 49 -147 198 -38 -44 -90 -91 -90 140 109 -75 110 -98 -103 -28 80 56 -104 -42 -13 -14 111 -102 124 -9 102
3882 102 -54 48 28 44 -9 41 81 -28 29 14 28 -108 -61 -70 -116 21 -121 -145 -99 -40 70 -81 -98 -106 43 93
3908 93 23 -66 89 -9 30 125 128 -25 143 124 51 83 -39 11 114 0 30 -38 3 64 -8 12 -23 0 -68 -88 45
3935 45 148 -38 -89 65 124 40 -110 -62 50 62 -72 47 90 -52 -24 -55 7 106 -63 -19 13 55 47 -152 79
3960 79 -66 -185 -33 -4 51 -23 -21 54 -41 -95 113 32 -64 50 52 110 8 -38 39 188 166 -68 77 -60 -78 -105
3986 -105 13 -8 56 -1 27 -32 -44 173 59 -203 -6 76 -114 -69 70 224 103 68 -66 79 -10 87 80 155 -29
4011 -29 -48 -104 128 13 -1 0 78 -180 -35 -59 18 -154 -68 67 -179 -79 -71 -29 -1 -129 -81 122 33 -18 110 -66
4037f6K78r9r7j3J55j20N6j46J49K0j12J6j04L7N2J26j12N3m4M3O8o7n1R4k45
4062a29J20J55lL2j74N4P7o6p2l2J78k07J80o1L5j98J03J4q2J20n3L9j19j12P7
4087a24P8R6j92J28NK2K12k87k1O9LO3j08J04M5j03o1Q7j5J52k95J85P5j36j2
4112c0N1r3R5j29j13J72r2mK24r6P7j82K18j53J15nj2NJ51j57P5j4o2j6Q3n2q7
4139c1%l2K94n18J27R6q7N3R0J07j26j8mM5n4L9n8J7j1J27N7j19Q4ql7J02ql0
4167I7o5l3JQ0j52J29m8k0J03nj68O6N3M6J6k53J42q5J09N6k3K8j69l8R0LQ2Q1
4195A23jp0j09J56Nr1L9Rj63J38m7pM4J7j17k2Q6L2q4J6oO8L7j41J89k4j8L5j81
4224h7R3Q9jq0j2J2P2k04J17o0m3o3K9J36K8m0j5m2j44J36J11J0p7L3n5J8L5m
$$ plain form
4037 -66 212 113 16 3 158 38 94 -52 97 117 5 21 -83 -46 6 132 20 73 29 72 140 73 22 116 -129
4062 -129 -9 146 143 175 1 55 132 66 -6 -38 140 -67 113 52 87 -111 -8 6 -76 44 -9 30 -89 -201 -124
4087 -124 -46 50 -142 -14 -9 13 225 -62 -83 -14 -11 52 -56 48 93 -10 -71 16 1 153 -142 43 118 -18 -30
4112 -30 21 -72 23 -106 -219 -47 -139 -143 81 -15 62 -120 98 -55 60 55 43 48 199 42 117 103 41 25 108 56 -31
4139 -31 -31 -63 231 -287 -160 -64 -151 -98 -8 99 -27 -45 -49 -4 -58 -19 -77 -60 -71 56 113 -6 78 70 33 135 127 97
4167 97 32 -1 0 80 -72 57 9 -11 92 87 -81 -15 38 84 100 -153 -11 -96 13 69 46 74 -95 -133 -43 -40 42 123
4195 123 122 52 -57 99 104 13 52 61 -102 36 -11 -18 26 43 -74 -96 -10 22 -62 -46 -52 16 53 -88 101 77 59 94 -87
4224 -87 6 95 94 14 2 14 86 -118 -1 -61 -104 -167 -138 -2 26 -14 -29 -71 -215 -79 32 42 -35 -2 -57 -39 -4 -8
4252hJ2j4J26m7J26k77R4j26J68k11K61j09PN6K8ro0J1j13J03M8j77k9L2K87j50
4278B9j01J14j21J69p4m7p2K36mq7n1J04j06j5Pk4N1o7l9N9K05K5l30J53J5N1
4304H0k4M9k52Q8N2j47K16o1J04k5%qm8O2j06J74j03r2M5N2j89K95k17M7l8R4
4330D8n7j08J7M2Q0N4l2r7J2L2Mk8l8R9L8j4J52k15p7n0M7J43M0k5k39L3J39n1
4358e1j02J88J15j12j70J20J0N1o5m9L7J35k54J91j17K8M7n1j67K22k6n2K34k46
4382h4J46j9P5J0q8q0R4j89K20Qm3r8L9q6j2P3k31J82k6qO3%M2M4k3j85J70K0
4410A4j48J39J8r3QJ90k83J21k9P2rj47J70l2n7J14r2L4r1Jj22J87l3J14M5j09
4436a8O5Q2r5k20K84q4j42K10j%j72J15j42J01J95M0k88J22n3J31j84O9k20J37
$$ plain form
4252 -8 4 -10 116 69 195 -82 12 -114 54 -157 104 -5 2 58 86 77 17 28 -85 18 66 -111 -140 -108 179 29
4278 29 -72 42 -79 90 16 -31 -103 133 129 42 -9 95 -11 -26 -19 -43 8 -59 -98 -39 166 191 -139 14 29 80
4304 80 56 105 -147 -59 -7 -154 62 1 105 80 80 72 24 86 -20 154 51 -41 4 56 -133 162 -55 -8 -46 48
4330 48 -9 -117 -100 -58 22 76 44 -53 -41 -9 -5 -33 -71 28 66 52 204 -11 -88 -138 -91 52 92 67 -172 -139 0 -51
4358 -51 -153 35 150 38 -132 -12 -2 49 -16 -65 -28 107 -147 44 -73 -45 2 -49 -216 6 -20 -72 162 -84
4382 -84 62 43 118 128 40 -40 54 -135 85 93 50 -48 -9 -95 -107 -34 -265 -83 -109 -117 -54 -54 -12 32 9 -176 -6 14
4410 14 -134 5 23 -70 -62 128 -155 -34 -63 9 0 -147 23 -9 -66 48 -44 -10 -101 -100 -222 -35 -68 46 91 -18
4436 -18 47 129 34 -186 98 14 -128 82 81 81 -91 24 -118 -17 178 218 -70 52 -1 130 -54 15 -205 -68
4460f8p9J00L5l9p9J08O3m8J0l6pJ12J22j76J25j13LjK8j42J58j74J56j10jJ07
4486E4r7k1K3J7J2r3J6N4j0J47j86J07M3j76J20J1K2Jk3N1oJ62j85j26j0k2K7
4513h8k6K87o2j93J66j08j45Q5L0J1J51j71m0J79l2q2r6J55j15K5P5qo0K8P1M0
4539G7p7j84R8J4k4J68k6j6j8j0n1J64p5Nj62K37r5n4P6j03j04P3R2j12K19q5
4565B7N1r9N9M3o3J47j68j34K56k08J17p0j2K03q1j29m5J69j08o9P1K5j20nJ4
4590a29J84k0k28J86lJ9m0p9J02K33l03p4J74k7n5J66J1jj6ro7p0J41j40Mm3P4
4617a0o9P6Q1J6J51l34R6R9O5k49J15L6J1o7J93j53J20k6j06j26J67o0K5R9j34
4642A6q3P1J46m2k41qL0O9n1l5J95n8j20J03qo5J3N7J41k57J87J7%j47K53j28
$$ plain form
4460 -68 -147 -47 -12 -51 -130 -22 41 -7 3 -33 -40 72 194 18 143 30 33 32 60 -82 76 -98 58 -52 -53 54
4486 54 -43 -64 -41 -24 -12 -105 -89 -35 -45 102 -84 23 66 -110 10 21 43 44 21 72 66 228 43 -83 -93 -115 -88
4513 -88 -114 173 111 -82 84 -24 -169 -84 -54 -43 108 -63 -103 76 44 -38 -134 21 -94 -69 6 -2 -62 -34 37 77
4539 77 0 -184 -86 -72 -96 72 46 30 12 2 -49 115 40 45 -117 120 25 -29 47 -56 -160 -87 5 -107 112 27
4565 27 78 -21 38 81 18 165 -3 -137 119 -89 28 -42 -54 149 68 -61 -106 63 -45 -114 -43 -18 -138 -143 -129
4590 -129 55 35 -193 -7 -10 9 -31 -110 -8 225 -78 -152 22 -5 -60 106 117 116 100 91 24 -46 95 -45 -41 -84 -10
4617 -10 -79 -3 78 94 245 -89 7 106 171 -78 37 73 84 17 210 57 177 151 45 -81 86 26 51 150 16
4642 16 -67 4 150 108 -133 -141 -111 -42 -93 -128 67 9 -111 -8 -16 -81 -68 -11 130 -127 60 77 77 -70 183 55
4668E5N6j17O2m4p5P7K04k14o6R5j62O9m8p5Q9P0m0J3N4j13O9k45M16l3o2J1P3
4695A19M8m8j5k50R9j7N2J01q1j27K44k85J96O9j42J4Q7Qj37J25p3Q8j06J2qO3
4721C6N8k9p6J48j13J17L5j07j5o4J2M6j04K0j9J41j28P3K1k15J88J14j64mj12
4746a41J99n8Q4j84m5L7O0K11q4j62J94N3j00K5J04j53l0m5Q1n3R3j32j66K34
4770B2k14K09j77R8p4q4J34J24j48J32j29J92r3m7L2L6j7R2r8K47k13j18M4K9
4794b1J06l6n1p6K1n1J95n8k5J6j3k41M19k33N7M4m8L9j26J96j33J34k95L57j46
4819C1M5R8j56k2K3J01m5o4L6j07n5J83J11p0p1r1J53j09j21K12j8Jm2m1J92j30
4845D4O1q8q1J72j6J2j23k9k1J58K6K7j48J55j56p7J7j41K46j33N6J06j39LR7
$$ plain form
4668 55 111 -6 56 12 -63 14 218 4 -62 33 -129 -60 -108 -183 -94 -24 -64 -51 3 -110 -41 -286 130 97 35 46 119
4695 119 167 119 104 -146 -47 -64 -12 89 8 -119 125 -160 36 105 -37 -23 64 72 -65 60 -13 75 -31 -19 -27 36
4721 36 94 65 -11 137 24 141 176 69 54 -10 2 48 -56 -36 -55 86 -42 31 52 -163 25 139 -25 -29 -141
4746 -141 58 0 84 -100 -145 -108 -48 163 79 -83 111 164 64 89 193 40 10 -35 46 -7 86 -46 -212 22
4770 22 -192 17 -160 -62 -136 -220 -86 38 -110 22 -107 85 -8 -55 -23 13 -4 88 -10 237 24 -94 -50 -21
4794 -21 85 49 -2 -78 -57 -108 87 29 4 20 7 -234 185 -48 9 53 5 44 -82 114 -19 115 -180 177 31
4819 31 76 174 18 -4 19 120 75 11 47 -60 -115 68 179 109 38 -53 100 -9 -130 82 64 65 23 -18 174 44
4845 44 105 17 -64 108 92 104 -19 -48 -69 89 115 142 -6 149 -7 -84 -67 -208 38 -95 -39 67 -72 -69 28
4870B8q2O4J29j48Q6j95K79q9j34N4J1m4J93k28J48q9O6lnk3J60j79J11J0j54
4895c4K88j86p3l6R0j64J60j52QJ15K3J1L5J0k95J89j5J3R8k50K17k0j6j3m2j03
4921a42K69l9J33k83nM9O7q3j8Q5l9NpJ32j53L8J9qk14L12R7k03n2M4O1o8N5J7
4949F9j57J53j02M6r9N7m2L1J22j87Q4R4K3j23J26R2j50j71J01O4q4J67q5j5p4
4974f0P6o8p8J86J09n0j13J11k4j22R0j80J83k14N6J7N5p1jJ48j92J09Op3J22
4999B2l1o7J12j7J2M8l1j12K14j69J24L7j85J20j25M6M5J23j58Rjj4L8k15L8K13
5025G6J11n4j86M4l9OR9m5j0Q2q1o6J49j65J86k9m3q2M3J02j42J2J4M1j52N4L32
5052B57l84J41Q1j14L6j56p8K82q7q7J77j08o6J07j31k4K9J40K3O4j85J0R7j14
$$ plain form
4870 28 -54 10 139 -9 77 -118 161 72 -62 -8 3 -41 152 -76 72 -17 49 46 41 18 178 -1 110 120 -34
4895 -34 254 68 -5 -41 49 -115 45 -107 -99 16 39 50 85 95 -200 -11 -26 -13 85 -165 52 32 16 3 -39 -142
4921 -142 127 88 221 -62 -67 -18 49 -34 -52 33 -6 -1 -8 124 -29 9 28 20 -194 118 215 12 -40 4 65 -3 52 69
4949 69 -88 65 -37 9 -90 -33 -75 -44 78 -109 -25 69 92 -31 95 187 37 -134 -33 31 -53 114 29 14 -60
4974 -60 16 -52 -130 56 165 115 2 113 89 -33 57 -123 60 -154 -98 -81 -26 -97 -98 50 -142 -33 -27 -100 22
4999 22 -9 -76 36 19 31 79 48 -64 150 -19 105 142 -43 77 -48 -2 43 166 8 17 16 2 40 -175 -137 76
5025 76 187 133 -53 -9 -48 -42 57 12 2 84 3 -63 86 -79 107 78 35 -47 -4 98 -44 -32 -18 23 -129 -75 257
5052 257 -127 14 95 -19 17 -139 -217 65 -22 -109 68 -40 -106 1 -130 -154 -125 15 38 102 -83 -73 24 -90
5076i0J55l8j46K57j29k3J3n6J06j52j22K91j21p5rJ0L23k56J11j08J31r7j8R9
5100E6j12M1%K3j20J43J03o9m3k3K0l5J49j79j22J81jjR3j54j35J11k6R6J25j65
5126d4K3l8k3O5J05o7p9J43j6j8N1k61L09r5K4k08K58q4q6J2Q4l8j24l5o1J84
5152a9k3rj20J47m8J04k0m1K5R5k06J57q2j3J12m7jMk6j85J96J84k74K33j81J0
5178b8k4j7r3J18R3pq7J52j89nJ6%J32l9J7p6k5J21P1l2l7k9n5J41P8j33n7J38
5206A44p4K4n5K3q2p0K3j53K08k2Q8q7KJ45j47L7j2J15r2N9rR9j89M6L0k2l8l5
5234d4K15j98J61j33Q0O7j26o4J47k28M8l5K62j9k7j06ol4rJ21j15J3k6k4J06
5259B6Po2q4K19k7Oj75O8k8J95k57K12r4j49P1J88k93K46j74r7J61J02j35q5K64
$$ plain form
5076 -90 65 27 -119 138 9 -14 -1 -57 49 -103 -225 66 -55 -130 -139 -129 194 -62 49 -59 72 -25 -43 56
5100 56 -56 -15 -15 8 -112 31 134 65 22 -1 19 -16 133 -46 -168 13 12 11 104 -50 -185 -74 -100 -4 121 -44
5126 -44 -21 -59 -82 -17 88 21 -58 85 69 51 102 -159 150 55 79 -129 129 45 -41 -29 55 17 -107 -142 -203 -19
5152 -19 -42 -51 -171 -24 -72 32 12 -29 -4 91 -115 42 -40 -53 59 12 11 15 -11 -196 0 184 -90 143 -38 -28
5178 -28 -52 -69 -162 -44 49 42 -45 107 -82 -87 -71 -71 61 22 39 -37 -62 59 130 98 61 32 -23 118 196 63 6 144
5206 144 70 94 39 62 -20 -90 -67 -220 -12 -34 54 -33 -31 114 -33 4 -8 107 15 74 65 164 -25 21 51 29 -9 -44
5234 -44 171 -27 134 1 81 148 22 -42 105 -123 -75 -110 152 133 106 0 -6 -40 -49 72 -43 -30 -56 -80 26
5259 26 33 -29 -113 106 79 85 -90 -22 -50 145 -112 100 6 -143 -72 116 -177 69 -105 -202 -41 61 -74 -159 105
5284A05j88J81j67J86j64J81l67J99M1o9M3J9n9J0%j1m1P9j19P7k8J12r5p0J42
5309cm4J92j21l2r6K08k75J79R5RP1j63K8n3O1j89L9mK45or2p1N2k38J50m1K9
5336g0p3K6J14J50q3l9K6L7q1J9J10j96J27l8o0K49r6k9j8N7o7qK8l8QP5j10k4
5364dJ06j99r5J06J56j16L1n7O0n3J03k12J37J63j28K9l0q0Q1JQ8pl7N0nj2qj4
5392E4j64K21j82m0J99p0P7p5j07K33k77J21o5J17j02j05R7P1nk10J26O3p8K52
5416A51K1l8j17j18J11J0J4Q3j59J86q5L1j11j4OJ43j28K3o5J73r0J13o7q6M6
5441C3Pj21K18j83j57K26J11j09L5Rj45J6J97O4j49j4j6j3k5m9P1N1n4m2L8K5
5467B4p9l7l0K2J72L9j99K08o7J3j48J18R2j55N1o9K78l30K87j30j2k5n2q3L58
$$ plain form
5284 105 -83 98 -69 117 -47 134 -233 -34 7 -62 -19 0 -59 -49 -49 -60 -101 -22 -141 -64 -92 20 -75 -145 -3
5309 -3 -47 145 24 -8 -104 104 -171 8 103 112 183 20 48 -5 56 -133 -94 -98 147 141 49 -22 30 -208 -58 -99 -70
5336 -70 -143 -117 -3 147 64 25 51 88 7 26 136 -60 67 29 -31 218 122 93 75 132 65 57 85 47 55 130 20 -4
5364 -4 102 -97 -192 -86 70 -46 -15 -72 -12 -65 38 -174 -37 126 -2 27 -3 -83 -2 -1 87 80 43 93 88 76 68 54
5392 54 -110 111 -71 -111 88 18 95 20 -87 146 -131 -10 -75 42 -60 -165 -68 3 -2 -212 -86 -23 -101 151
5416 151 172 134 17 -101 10 20 34 117 -42 144 59 90 -21 -35 -29 114 -14 9 -56 117 27 140 73 -13 33
5441 33 40 -81 137 -46 -203 23 134 25 60 69 -76 -60 137 201 52 38 22 9 -16 -65 6 57 3 -39 -1 24
5467 24 -55 -92 -122 -100 72 111 -88 120 53 66 -82 36 128 -27 24 -45 233 -97 190 60 48 23 -29 -112 246
5492B46k80J03q9K8r0K46j72q7J36o6mj24K30m9k2K7m6j0N7J38j91O4P7r3K4j83
5518a30J85K12j10k63J22kP7No1j8l50M06j31J04k4L3r7J42k9p2J64p8Q2k72R3
5543a2L1m7O3J5J0J36k61L0%j67K31o4N3M5l9p1k9O7J3O0J0j66K15k03k4N1J61
5570A08q9j29R5R7rj9o9P7j57J61%m5J49j92J38k62R9J93j89PQ1N7j12J62l27
5595a75J48J4Jj00M0J60j48j28J46J09K4M0kM0j96L3L8m7l3N5p4J1o1J45k03K96
5621A33j90j1J72j68J25n5M1K5o8q5L3j16J23o6J17r8N6N7K6j32J92j96Q1q6R4
5646DL2R4j49J21k97J26L7j49K03r9QL0J2ON7k8j8J50j63K10o6k99J94J40k75
5671a19P7J87j57qjk5Pl3j08K60k25J87j19N3lk2l3Q3P6n7Kn1J6J76j91P5L7j47
$$ plain form
5492 246 -34 69 -20 8 -82 164 -8 -95 41 -25 -29 -153 77 28 6 33 -13 -23 34 172 -19 45 122 29 53 -130
5518 -130 55 267 157 -106 16 14 91 96 35 17 -333 73 -58 46 22 55 -42 100 71 -1 163 85 167 -105 -12
5543 -12 19 -28 35 50 60 196 -65 -35 -35 -202 29 -35 18 63 24 -47 -76 -9 4 64 74 -92 123 -80 -104 -53 108
5570 108 19 -110 -15 82 73 54 -15 62 -95 66 66 21 170 -22 116 -146 -47 146 -43 -36 45 102 -10 152 -175
5595 -175 -27 -13 -12 -112 -72 88 -60 -188 -42 67 91 131 129 169 -27 6 44 -3 -36 19 -55 -44 -105 40 -163 133
5621 133 -57 -68 104 -64 61 6 47 72 4 -81 -48 -164 -41 -107 10 -88 -32 25 51 -81 111 -85 -4 -90 4
5646 4 36 130 -19 102 -195 -69 -32 -181 22 -77 -69 -39 -27 -21 36 8 -10 140 -23 187 121 -178 16 156 -119
5671 -119 -42 145 -12 -20 -21 -46 -39 -72 -180 80 -145 42 -77 -24 -27 -49 -82 1 77 20 22 -29 -13 163 -28 47 84 -63
5699f3rk1K09J5r1j50mJ67k9j12J91k71J52Q8j06k1J52r5j47J62j48O2j3R2N8
5724F8j26J17k3l2K9m0k4j4L26j79m2o7oN5o3k8j12K14m1l0oJ5l0M8p7P7m9rk4
5753g3o9J75M3J9jo6qm0J40j05k2k01M4K37J2L6k06J22k3J1j9K06j62j32R7j4
5779AN5n9J14j98J01j17k9J03N7N2J8j27J89k60J26J64k25L1O6J43k39J4OO9N1
5804A06j36r7L8J47k49K78j30R1j39J3p3O7N2K70r6j11n3k0k9K28k54J41ql0J83
5829A89j13j08J4n2j7J51p1k4KQq9J14Qj79N7J42j42P1J3J21q1k0R8k28J77J16
5855A57j99J75j36P7N5k02K42k09J36j28J18j8k1j55J08q2Q7j89MR6M1pj20K00
5879C0l7mr4J49r5O9j41J83n8O1q4J28k1L3l1k1Km1q3m8K12r4K0k6L6j32J79j7
$$ plain form
5699 -63 -72 -93 116 131 40 -110 -114 53 24 -88 103 -168 -16 72 -34 -55 97 2 -145 17 -131 -69 -82 10 68
5724 68 -58 59 36 4 33 -7 -31 -45 281 102 60 -7 -13 42 -21 -49 -161 53 12 -18 -24 -9 -39 9 -68 9 -40 -49 -73
5753 -73 -142 33 76 95 94 28 20 -20 120 15 -7 -208 -164 73 85 121 -85 37 14 25 6 212 50 -82 15 1
5779 1 56 -3 111 -87 14 -103 -132 -29 28 80 98 -29 160 -100 26 190 -35 -4 62 205 -34 -20 -14 55 106
5804 106 -30 -127 -89 58 -191 87 -43 48 -91 -78 -151 -84 -32 238 142 31 -22 -42 -71 157 -97 44 36 6 189
5829 189 76 -32 -18 -70 -87 64 -7 -31 -29 -21 -110 4 12 -167 -110 32 -110 -39 -26 95 14 -6 92 -136 41 157
5855 157 -42 133 -3 74 129 -73 169 -40 96 -32 86 68 47 -108 0 -82 5 -184 -180 -84 -43 -50 -170 30
5879 30 -7 -11 -105 44 -51 18 -123 60 2 63 -21 107 86 119 88 67 69 28 -55 -103 109 15 35 9 45 -87 92 75
5907G5q6j5M1qLj02J03P8k29R1R0n2j8m0J4Qj2Pj13P6l6J02jK2n9k5J88l15J70
5936d3R7K7p4L2l3K8j04QL7J08k5j55J06M6k4L8R8j52l6R4o2J31j02m3lk01L75
5963A68k81Q0J91k17Q7o7o9Q5J47q6r9k2J02J38j34O1j76K24Jk43L42k02J03p5
5987E8j5J03k22P7N8q2olj8o3J88j99J00J61r6N2p1j33J0J10j5n9M5J0K3L2K6
6014G1r4k2NJ05l7j0m1L8M0nq8o2J89Nk32P1J12r4L7P8j12J58n5mj27Q5j04R1
6042bJ42q3J00n2n9n0K6j01l4J77j34P3K9r3J22k01K02j50K7K6K8J66k21J48q8
6067bM2l4o3J47j83J64l1m3Op2J98j26J94j96q3J91j39j03K22j87P1J5j1J2j22
6092a33J74n0M6j21J06j13K28j72R2q6j08K90j19K7m4k1J0N1n6p5k0J78N9j83
$$ plain form
5907 75 -11 -26 15 7 10 -92 11 89 -140 -49 41 -11 -29 -69 -55 -47 -59 -52 -165 -89 -125 -23 -24 -2 -61 -86 102 -213 -43
5936 -43 54 81 7 39 6 34 -70 -62 -25 83 58 -97 9 55 31 69 167 15 -21 73 11 142 40 -3 -6 -207 168
5963 168 -113 -33 158 -59 28 -39 -108 -23 124 38 -61 -83 19 157 23 84 -92 132 133 -110 232 30 133 58
5987 58 43 146 -76 1 59 -23 -29 -32 -50 -113 75 -124 -24 137 41 93 22 -111 -101 9 -6 -65 -20 -10 13 45 71
6014 71 -23 -45 -40 65 28 18 -23 15 55 50 -38 -100 89 94 -138 -67 45 -49 -12 66 -46 112 57 53 -74 11 -93 -2
6042 -2 140 57 157 105 46 -4 22 -79 -113 64 -70 3 32 -61 61 -140 62 -88 -61 -35 -7 159 -62 86 -2
6067 -2 40 6 -57 90 -93 71 40 -3 3 -69 129 3 197 1 -82 109 -30 -133 89 -98 -27 -12 -23 -11 -133
6092 -133 41 -9 37 -84 22 -91 137 -35 57 -29 -137 153 34 61 17 -4 6 57 1 -74 -94 84 143 -40
6116d0k4P4J9j41J38j2P3j81J00R8l4p3L3j2q8Nn0J97m9l9j7J49j54j17J44j9
6142b0J72k78J23J51o0P9j11m3n9O6j28J61p2j02Q7kK1n0J41ko4j46K05j97P9
6167d9J26j51K35Qk47J21o5J32j84J2Mm1M1q4K61k81Q2J26p3P0j08o7J70M9r5
6192hj5jM7kr1J85o2j39O9Q0N1l2j02R1r4m5J5R4j28Q3R9k32J20p5L8J36K5j66
6220e9R8j06J02LJ23j14Jl3j2Ml4m9K42k94J29K3q8J05j16N0j25J30K4J06K9k30
6246i1pJ22J0O5j1l4p2p1K4J28j09J66q5j13L0kO0Q0j41P3o8L51k70p4K72k24
6272IKj28J60j5l5R4M0k52J16O5pQ9j18J59l43J76l1P7L2j87j08J86N4r7Om4O0
6299d0Q4j13nO8qj59J54N2j43j6J36o7J13J0p6LK3j06O4M4j46P5P4LR0j7j79J25
$$ plain form
6116 -40 -64 10 29 -112 26 14 87 -94 6 104 70 -3 30 18 -70 -65 -115 82 33 -6 -23 126 -28 -145 -1 -20
6142 -20 152 -126 -3 148 88 167 56 13 -46 20 -108 53 -19 -121 -34 -36 -15 -65 76 74 10 -136 69 -128 -49
6167 -49 77 -74 161 169 -78 43 -22 110 -74 -62 -58 -99 -58 -142 119 -162 -80 46 -27 43 -65 -132 38 87 -8
6192 -8 -23 -24 23 21 -70 115 53 -86 -17 63 114 82 -20 71 -23 -68 -53 41 -87 -4 95 -137 -17 -92 -54 82 107 -59
6220 -59 39 -67 35 38 161 47 48 15 3 7 -27 -76 166 -128 1 24 -64 41 -75 -25 -150 -20 4 110 139 -91
6246 -91 -98 24 34 99 88 54 -18 -89 -65 63 -46 120 35 -78 -48 -50 10 90 -51 22 -46 305 35 -39 233 9
6272 9 11 -117 43 28 -7 87 127 -125 -9 56 49 138 20 179 -164 12 -19 58 90 -97 -205 -19 35 -62 -56 -100 -40
6299 -40 44 -69 -74 -6 -14 -173 -19 33 -110 -126 10 -57 56 66 -10 -7 16 -90 -26 18 -128 -53 21 24 114 97 -82 43
6327D3k4J00j00j0j82J43RJ58k84j3J83J08j81l8J61k16J04J64k68K1J93q5j49
6350a63N1L07j28k0M0R8k39R2lK4o9m5N8P2j12k0R2q2O7o2N3P1j36J60n3j78J78
6377E3p8K3j06J42R8o7q6j1K0l2P0lR2j23J41j00N1n3LlL2l2P7j55j09M07Rk98
6405c8J29qk14J28J99j82J1J54j46N5j70O6q2J75j4j04l5R3J1n7O3j54K46j39
6429a3J08j63J85j35j12N8J32o2Q9j35m0Q6j70K81j22k6K52j14p3n2o4L8M7o4
6453f9J58o0j02J18r2K1L3m6Or5J68rK1k12K2O2J05l7j7N1j05K17j04k12K03o5
6479d0l6J33j16n8P2k6R9pj11J26R3j05j8N6l0r4o8K50l3p9P0r7o2J90n3j30J21
6506D7J35j56nK7j54J57N1k11J95k21J37j17K65l7j41Q8o6J17j48N2j2J3l7J23
$$ plain form
6327 43 19 119 19 9 -173 -30 -21 137 -147 -160 23 131 -50 -88 73 -143 -39 125 -143 -122 71 -14 -163
6350 -163 -112 195 67 47 87 185 -54 38 35 59 -10 -55 3 75 -37 -57 35 -47 20 -42 11 82 -54 106 53 -125 53
6377 53 -25 -2 -108 34 132 65 -21 -32 -12 -44 26 23 115 -8 133 33 84 31 34 31 63 31 108 -47 -156 251 260 -38
6405 -38 91 83 -131 -3 196 14 25 179 33 88 -82 -16 -98 77 63 -41 -76 17 28 -29 34 -120 126 -13
6429 -13 95 -68 117 -18 -130 -72 60 -2 87 -48 -88 -2 -172 109 -13 -39 213 99 26 -26 -90 -52 -5 -69
6453 -69 89 29 -73 45 -47 -26 7 -39 -33 -128 40 31 52 -160 -138 -76 29 -8 -25 26 -79 138 34 -178 25 -40
6479 -40 -76 57 -59 -117 -45 -71 28 21 -90 36 129 24 6 62 32 -62 -130 120 87 8 78 -19 -81 109 56 -74 47
6506 47 182 26 21 48 -106 51 102 -109 86 -135 2 -115 150 113 -28 60 -6 111 -37 15 3 16 -21 102
6530A02o7j5P0j45jRo6K3J66j33N3O4J18j24k2J4N2P6q0K2j62J49q3J25p3K3M9
6557A44j91P3J05r5j58J40K8k6P8J0j43J35k1R3k36J20r4J52j77J29l7n1j43K71
6581A06j18kq6O0KJ03p1N8O9j7p9j06N5o8j19K00n2J47j66L8K4o0K11l25J52J8
6607b6p6J27j48O4q1K23m4r1J3J50j47N0rM2J9Rj60N2J29j11OmJ13o2N7k61J42
6634b4mJQ3P1J8j40O6m7r2Q2O2M0j36o8L3J24jj12J21N2L6j34kJ45r2j66N4p9
6662a09J15j00P5n8Q6k1J6Q3pj33j23J33m0J54K8jj14j14J46M1Q2k57R2R3nm9
6688A3k9J18Qj35j10J86M5k2j29J26j50Q2J39o5j10J27p9mP6K3L6j15r4P9j2J2
6714A6P0j22P2K0p1j27J00J11n6Mk1P6o1J1n7Q4k18J02J2R7p6o4J86k88K56J34
$$ plain form
6530 102 35 20 90 -55 -56 -47 -113 -90 76 -57 -4 60 178 54 32 46 98 174 94 116 -46 103 20 145 72 95 144
6557 144 -47 26 131 36 -122 18 46 20 98 108 -35 100 79 172 -64 56 -38 114 -63 66 29 -22 -165 106
6581 106 -12 -14 -100 -40 -38 65 -6 52 121 104 25 -81 -26 -94 -213 -13 -65 82 -84 -46 -22 -82 129 -196 -44 -26
6607 -26 -102 25 -123 -59 -140 83 39 -52 -39 111 -36 14 5 47 66 75 -85 -33 96 -15 -9 -13 100 38 95 -166 -24
6634 -24 -28 -27 56 127 145 5 71 24 -68 14 76 116 -20 -88 -55 69 68 -44 77 129 165 31 29 174 82 -84 -30 -109
6662 -109 6 -94 -19 -77 9 -12 4 87 80 -53 -176 -43 -83 71 99 98 -16 -130 16 57 139 -118 -26 67 62 13
6688 13 -16 102 110 -25 -135 51 96 74 -55 71 -79 3 142 77 -33 94 15 11 87 110 146 31 -63 16 4 16
6714 16 86 -36 36 56 -15 -142 -42 69 13 17 -4 72 11 22 -35 49 -169 -67 -55 42 -34 -98 88 -200 56 190
6740A90p2O3k31J23o8j71J23M9J1j07J33r5Q8m1k6K02j95o9K24l13J59J80j87
$$ plain form
6740 190 118 181 -50 73 5 -166 -43 6 17 -90 43 -52 36 -5 -31 171 -24 -93 131 -182 -23 157 -30
$$ [...]
8191a44
##END NTUPLES=NMR FID
##END=
