##TITLE=1H_5053-eth
 CDCl3, 8 sc, 
 5.08.2021
##JCAMPDX= 6.0         $$ Bruker NMR JCAMP-DX V2.0
##DATA TYPE= NMR FID
##DATA CLASS= NTUPLES
##ORIGIN= UXNMR, Bruker Analytische Messtechnik GmbH
##OWNER= root
$$ XWIN-NMR		Version 3.5
$$ Thu Aug  5 11:14:54 2021 Russian Standard Time (UT+4h)  she@DPX200
##.OBSERVE FREQUENCY= 200.131506
##.OBSERVE NUCLEUS= ^1H
##.DELAY= (6, 6)
##.ACQUISITION MODE= SIMULTANEOUS
##.ACQUISITION SCHEME= undefined
##.AVERAGES= 8
##.DIGITISER RES= 18
##SPECTROMETER/DATA SYSTEM= spect
##.PULSE SEQUENCE= zg30
##.SOLVENT NAME= CDCl3
##.SHIFT REFERENCE= (INTERNAL, CDCl3, 0, 15.7039)
##AUDIT TRAIL= $$ (NUMBER, WHEN, WHO, WHERE, WHAT)
$$ ##TITLE= Audit trail, XWIN-NMR		Version 3.5
$$ ##JCAMPDX= 5.01
$$ ##ORIGIN= Bruker BioSpin GmbH
$$ ##OWNER= she
$$ F:/spectra/data/she/nmr/H-F/1/audita.txt
$$ ##AUDIT TRAIL=  $$ (NUMBER, WHEN, WHO, WHERE, WHAT)
(   1,<2021-08-05 11:13:10.32 +0400>,<she>,<DPX200>,
      <created by zg, POWCHK disabled, PULCHK disabled
       configuration hash MD5:
       00 E9 B6 7A A2 85 ED C7 34 08 36 98 17 FE 4E 26
       data hash MD5: 16K
       F2 13 3D 42 A5 4D 12 55 3B F6 E4 C2 5A DA FE 1D>)
$$ ##END=
$$ 
$$ hash MD5
$$ 2D E3 4E 97 A9 AE 83 27 FD 1F 74 1F 37 DC 2C 0D
##$RELAX= 
##$RELAX= 
##$RELAX= 
##$RELAX= 
##$RELAX= 
##$RELAX= 
$$ Bruker specific parameters
$$ --------------------------
##$DU= <F:/spectra>
##$EXPNO= 1
##$NAME= <H-F>
##$PROCNO= 1
##$TYPE= <nmr>
##$USER= <she>
##$AMP= (0..31)
100 100 100 100 100 100 100 100 100 100 100 100 100 100 100 100 100 100 
100 100 100 100 100 100 100 100 100 100 100 100 100 100 
##$AQSEQ= 0
##$AQ_mod= 1
##$AUNM= <au_zg>
##$AUTOPOS= <>
##$BF1= 200.13
##$BF2= 200.13
##$BF3= 200.13
##$BF4= 200.13
##$BF5= 200.13
##$BF6= 200.13
##$BF7= 200.13
##$BF8= 200.13
##$BYTORDA= 1
##$CFDGTYP= 0
##$CFRGTYP= 5
##$CHEMSTR= <none>
##$CNST= (0..31)
1 1 145 1 1 1 1 1 1 1 1 1 1 1 1 1 1 1 1 1 1 1 1 1 1 1 1 1 1 1 1 1 
##$CPDPRG= <>
##$CPDPRG1= <>
##$CPDPRG2= <>
##$CPDPRG3= <>
##$CPDPRG4= <mlev>
##$CPDPRG5= <mlev>
##$CPDPRG6= <mlev>
##$CPDPRG7= <mlev>
##$CPDPRG8= <mlev>
##$CPDPRGB= <>
##$CPDPRGT= <>
##$D= (0..31)
0 1.2 0 0 0 0 0 0 0 0.06 0 0.03 0 0 0 0 0.0002 0 0 0 0 0 0 0 0 0 0 0 0 
0 0 0 
##$DATE= 1628147589
##$DBL= (0..7)
120 120 120 120 120 120 120 120 
##$DBP= (0..7)
150 150 150 150 150 150 150 150 
##$DBP07= 0
##$DBPNAM0= <>
##$DBPNAM1= <>
##$DBPNAM2= <>
##$DBPNAM3= <>
##$DBPNAM4= <>
##$DBPNAM5= <>
##$DBPNAM6= <>
##$DBPNAM7= <>
##$DBPOAL= (0..7)
0.5 0.5 0.5 0.5 0.5 0.5 0.5 0.5 
##$DBPOFFS= (0..7)
0 0 0 0 0 0 0 0 
##$DE= 6
##$DECBNUC= <off>
##$DECIM= 32
##$DECNUC= <off>
##$DECSTAT= 4
##$DIGMOD= 1
##$DIGTYP= 9
##$DL= (0..7)
0 120 120 120 120 120 120 120 
##$DP= (0..7)
150 150 150 150 150 150 150 150 
##$DP07= 0
##$DPNAME0= <>
##$DPNAME1= <>
##$DPNAME2= <>
##$DPNAME3= <>
##$DPNAME4= <>
##$DPNAME5= <>
##$DPNAME6= <>
##$DPNAME7= <>
##$DPOAL= (0..7)
0.5 0.5 0.5 0.5 0.5 0.5 0.5 0.5 
##$DPOFFS= (0..7)
0 0 0 0 0 0 0 0 
##$DQDMODE= 0
##$DR= 18
##$DS= 0
##$DSLIST= <SSSSSSSSSSSSSSS>
$$ [...]
##$SUBNAM2= <"">
##$SUBNAM3= <"">
##$SUBNAM4= <"">
##$SUBNAM5= <"">
##$SUBNAM6= <"">
##$SUBNAM7= <"">
##$SUBNAM8= <"">
##$SUBNAM9= <"">
##$SW= 20.0188882624521
##$SWIBOX= (0..15)
0 0 2 0 0 0 0 0 0 0 0 0 0 0 0 0 
##$SW_h= 4006.41025641026
##$TD= 16384
##$TD0= 1
##$TE= 0
##$TE2= 300
##$TE3= 300
##$TEG= 300
##$TL= (0..7)
0 120 120 120 120 120 120 120 
##$TP= (0..7)
150 150 150 150 150 150 150 150 
##$TP07= 0
##$TPNAME0= <>
##$TPNAME1= <>
##$TPNAME2= <>
##$TPNAME3= <>
##$TPNAME4= <>
##$TPNAME5= <>
##$TPNAME6= <>
##$TPNAME7= <>
##$TPOAL= (0..7)
0.5 0.5 0.5 0.5 0.5 0.5 0.5 0.5 
##$TPOFFS= (0..7)
0 0 0 0 0 0 0 0 
##$TUNHIN= 0
##$TUNHOUT= 0
##$TUNXOUT= 0
##$USERA1= <user>
##$USERA2= <user>
##$USERA3= <user>
##$USERA4= <user>
##$USERA5= <user>
##$V9= 5
##$VALIST= <valist>
##$VCLIST= <CCCCCCCCCCCCCCC>
##$VD= 0
##$VDLIST= <DDDDDDDDDDDDDDD>
##$VPLIST= <PPPPPPPPPPPPPPP>
##$VTLIST= <TTTTTTTTTTTTTTT>
##$WBST= 1024
##$WBSW= 4
##$XGAIN= (0..3)
0 0 0 0 
##$XL= 0
##$YL= 0
##$YMAX_a= 866592
##$YMIN_a= -1040682
##$ZGOPTNS= <>
##$ZL1= 120
##$ZL2= 120
##$ZL3= 120
##$ZL4= 120
##$ABSF1= 10
##$ABSF2= 0
##$ABSG= 5
##$ABSL= 3
##$ALPHA= 0
##$AQORDER= 0
##$ASSFAC= 0
##$ASSFACI= 0
##$ASSFACX= 0
##$ASSWID= 0
##$AUNMP= <proc_1d>
##$AZFE= 0.1
##$AZFW= 0.1
##$BCFW= 1
##$BC_mod= 2
##$BYTORDP= 1
##$COROFFS= 0
##$CY= 11.3945322036743
##$DATMOD= 1
##$DC= 2
##$DFILT= <>
##$DTYPP= 0
##$F1P= 2.36226072786647
##$F2P= -0.459571619588291
##$FCOR= 0.5
##$FTSIZE= 0
##$FT_mod= 4
##$GAMMA= 1
##$GB= 0.15
##$INTBC= 1
##$INTSCL= 1
##$ISEN= 128
##$LB= 0.24
##$LEV0= 0
##$LPBIN= 0
##$MAXI= 10000
##$MC2= 0
##$MEAN= 0
##$ME_mod= 0
##$MI= 1.114404
##$NCOEF= 0
##$NC_proc= 0
##$NLEV= 6
##$NOISF1= 3.799351
##$NOISF2= 2.8
##$NSP= 1
##$NTH_PI= 0
##$NZP= 0
##$OFFSET= 15.70392
##$PC= 1
##$PHC0= -13350.28
##$PHC1= 5.800991
##$PH_mod= 1
##$PKNL= yes
##$PPARMOD= 0
##$PSCAL= 0
##$PSIGN= 0
##$REVERSE= no
##$SF= 200.130013532006
##$SI= 16384
##$SIGF1= 3
##$SIGF2= 2
##$SINO= 400
##$SIOLD= 16384
##$SREGLST= <1H.CDCl3>
##$SSB= 0
##$STSI= 0
##$STSR= 0
##$SW_p= 3612.71676300578
##$SYMM= 0
##$S_DEV= 0
##$TDeff= 0
##$TDoff= 0
##$TI= <>
##$TILT= no
##$TM1= 0
##$TM2= 0
##$TOPLEV= 0
##$USERP1= <user>
##$USERP2= <user>
##$USERP3= <user>
##$USERP4= <user>
##$USERP5= <user>
##$WDW= 1
##$XDIM= 8192
##$YMAX_p= 0
##$YMIN_p= 0
$$ End of Bruker specific parameters
$$ ---------------------------------
##NTUPLES= NMR FID
##VAR_NAME=  TIME,          FID/REAL,        FID/IMAG
##SYMBOL=    X,             R,               I
##VAR_TYPE=  INDEPENDENT,   DEPENDENT,       DEPENDENT
##VAR_FORM=  AFFN,          ASDF,            ASDF
##VAR_DIM=   8192,          8192,            8192
##UNITS=     SECONDS,       ARBITRARY UNITS, ARBITRARY UNITS
##FACTOR=    0.0002496,     1,               1
##FIRST=     0,             0,               0
##LAST=      2.0444736,     0,               0
##MIN=       0,             -1040682,        0
##MAX=       2.0444736,     866592,          0
$$ Real data points
##PAGE= N=1
##DATA TABLE= (X++(R..R)), XYDATA
0@%%%%%%%Qj6J6j6K4m0M8n6Q0j04J22j47J77k16K64l17L73m33N13o02O92p99R24
30D95j061J208j372J559j764J988k238K512k812L140l500L896m323M790n305N866
46C079o476P143p875Q678r560J0532j1603J2793j4126J5620j7308J9236k1463
59a1330K4063k7146L0880l5505M1407m9241O0197p6712J04717j64197N00785p30518
71c32600p03406J545106K20593j060667k11183P72402P6276l00713j73064k0425
81a87681J94806M01340l11301o33421L29169Q36396l85195q88768L86841Q82439
91F24625m12867p51172L52591N92004k48453l91089O5892K12443J26047m5147
101A24874l31393m3481M84595N3944n64595J2601N34942r3028m19338J56243K26725
$$ y = [0, 0, 0, 0, 0, 0, 0, 0, 8, -8, 8, -8, 16, -24, 24, -32, 48, -56, 66, -81, 96, -120, 144, -173, 200, -233, 280, -322, 370, -429, 495, -566, 642, -730, 829, -935, 1053, -1185, 1327, -1485, 1655, -1845, 2051, -2272, 2518, -2787, 3079, -3397, 3746, -4129, 4549, -5011, 5521, -6082, 6711, -7415, 8205, -9103, 10133, -11330, 12733, -14413, 16467, -19038, 22369, -26872, 33325, -43387, 61330, -102867, 397918, -332600, -1036006, 509100, 729693, -330974, -542157, 230245, 306521, 5808, -167256, -187681, 7125, 408465, 97164, -536257, -207088, 629308, 244113, -644655, -257814, 624625, 211758, -539414, -186823, 405181, 156728, -234361, -168469, 43974, 170021, 124874, -206519, -250000, 234595, 288539, -276056, -263455, 271487, 178459, -240879, -84636, 142089]
112A42089j68220J4987J22808k60182j9969M37250j01465n12715K02508N05849
122C62940k65624m52337L05773L61151l21499k16894K95710K2115k13071J92141
132G0405P9948l81068R3624N05853k81877n37965M44757M80462n36187l68174
142d30222N39412K38907m60360j15796L20729J6150j43396M3836l9633n5229J91223
153A05621L2895k95644J699L58484l9584l81646P8518L57935j11114k86137J19621
164e9352J83812j00241p6361N7006k1661J1002R4304j01536j23247J90507R4719
175A48952k46314k2822K49440o6584k04278J47660J23948k04594k6890K24485
185A23003o6180k09829J34957J70971j71083j21120J77627O2571j57926M280J04700
$$ y = [142089, -26131, -11144, 111664, -148518, -168487, 268763, 167298, -345417, -142909, 362940, 97316, -355021, -49248, 311903, -9596, -226490, 69220, 91335, -121736, 70405, 150353, -230715, -137091, 368762, 86885, -451080, -6323, 474139, -62048, -430222, 109190, 348097, -112263, -228059, 92670, 108820, -34576, 9260, -30373, -85602, 105621, 138516, -157128, -155429, 203055, 163471, -218175, -139657, 218278, 107164, -178973, -59352, 124460, 24219, -52142, 4864, -16797, -5795, 88509, -13027, -136274, 54233, 148952, -97362, -120184, 129256, 62672, -141606, 6054, 130002, -74592, -101482, 123003, 56823, -153006, -18049, 152922, -18161, -139281, 38346, 100917, -57009, -52729, 51971]
196E1971o9083k0321J16323p9612j39759J78644J39865k66588j13337L28189O2657
207A88949l44286n287L06790l0790k28612L3746J35020p205m3444l8469l5422
218f9010R6330R2448j50655j24236J89489J39362k07104j45053K11049J39354
228A71974k02027j16103J73051Q2834j18197n1747M6917L1964L1171k8167j05766
239h4096M2603J66310p5679j93907J13136J82606j33962j44519J30729R6061j08601
250i319m7022P1179L957k2285K3775k8029l3302O4862L2404q7241k9471J00770
262D0278K1881j10502k307J05782k3314q4952M5848N0267o1699q213O6916l9504
274D81n4830Q1580K1240j00597J8809R0233m7520o2357N7507L0046n4363K885
$$ y = [51971, -17112, -37433, 78890, -722, -140481, 38163, 178028, -88560, -201897, 126292, 188949, -155337, -160624, 146166, 115376, -113236, -79490, 55530, 48325, 4881, -33588, -69010, 27320, 119768, -30887, -155123, 34366, 173728, -33376, -178429, 32620, 171974, -30053, -146156, 26895, 109729, -8468, -60215, -13298, 18666, 49837, 21670, -84096, -41493, 124817, 49138, -144769, -31633, 150973, 17011, -127508, 3221, 99282, -9319, -56341, 14838, 18795, -3490, 20285, -7744, -41046, 23816, 56220, -31021, -60492, 40278, 62159, -48343, -50650, 55132, 31818, -53134, -7286, 42981, -18718, -26931, 39985, 481, -54349, 27231, 48471, -52126, -33317, 56916, 9396, -52961, 4546, 34592, -19771, -16886]
286a6886L7981l0724j1138M5811j6468m7850L4802M6372m6116m7024N9869M1520
298E0149p1534k6766P4786P444o4926R913M6324k3233j9036L0456j6314k0942
310b3679N0002n703o6660L7625O4223o0057n0948P0989L3882p0789j4994N9636
322B3527O63l8673L261J7555J990m025m942p344M703K2723p232l8851J6476M9106
336C8937k8480n2314L9963M9544n1256l7294N6827J4926m8207P252K4506j7460
348c056K414J3582k2940m027L5884q712m1159K1488L6786k9762k6588K7886J8112
361A9908k1570j6299J9285J4061k0376p162J7916k463j0858Q895J345j2987J0229
374g6J3212k3861n695L3940r981l3429K4453K1932k9864p677K6228k572j7990
$$ y = [-16886, 21095, -9629, -20767, 25044, 8576, -39274, -4472, 41900, -4216, -51240, 8629, 50149, -21385, -48151, 26635, 34079, -30847, -20934, 25390, 2157, -16879, 13577, -2737, -23679, 26323, 20620, -46040, -8415, 55808, -4249, -55197, 15792, 49674, -21115, -36109, 23527, 24190, -14483, -11222, 6333, 8323, 4298, -644, -7988, -3285, 19438, 12206, -26645, -10169, 38937, 10457, -41857, -1894, 47650, -3606, -40900, 15927, 30853, -17354, -10102, 14404, -3056, -642, 12940, -10000, -14027, 21857, 13145, -28014, -6526, 30260, 498, -26090, 1796, 19908, -1662, -17961, 1324, 15385, -4991, -12153, 5763, 3300, -7558, 1337, 2682, -10305, -76, 13136, -10725, -16420, 17520, 7539, -25890, -1437, 20495, -9369, -17046, 9182, 6610, -11380]
387a1380R647O478j1448O052O327j3306J917J2980m532r578J143J0599L085j4913
401f929k408J7329o57j5503M582J0662p817j006R720j3225l852K5738q295k8769
415b0430J9166K2994k0891j5608J5512J0582n791q433m883R032J4636j1802k0170
428a6086J3871J9745r848j8420m4J9458J0845k3979j7449K5355K1576k2938k4757
441b2671J7662K5536q456k6511n465K9656J9355l7701k5858M2381K4720l8961
453f313k1909K8366J9690j4548j8608j818J8638J8385k1323k9981K2371L4615
465B7565j7012l7148N443M2034P062m9838j3902N3538J7500n2553j6769M5140
477A1060J3210l0827r918J0364J1751J0684j7729k4137K1524L0208j7353l4252
$$ y = [-11380, -1733, 4745, -6703, -651, 5676, -7630, -5713, 7267, 2735, -6843, -5700, 4899, 7984, -6929, -9337, 7992, 7335, -8168, -3586, 7076, -741, -1747, 7973, -5252, -9104, 16634, 8339, -20430, -1264, 21730, 839, -14769, 743, 11325, 5534, -2899, -7782, 1250, 15886, 4084, -16086, -2215, 17530, 7682, -10738, -10782, 8676, 19521, -4458, -21907, 3448, 25024, 2086, -22671, -5009, 20527, 12071, -14440, -19905, 9751, 29106, -8595, -34453, 7928, 32648, -6313, -28222, 144, 19834, 5286, -13322, -15140, 3498, 21883, 560, -29421, -7050, 27565, 10553, -26595, -21152, 20882, 27944, -21894, -35796, 17742, 35242, -17311, -34080, 11060, 24270, -6557, -16475, -6111, 5640, 16324, -1405, -25542, -4018, 26190, 8837, -25415]
489b5415P668L9924K990m3886j4649M8492K4446n2281k7519N2652K3204m3998
501h372j6400K7493J4150j0302j2770m498R641J6842l044k7778l725L3304J4863
514B9404l7273k9094M3547M1769n2672m5753N7827M1565n5100l3849M6787K3049
526C0207l3845r883J4830j808O391P597k2083j3178L0527K3196l8067l6325M7202
539D761M6702n5590n1657N9877N0423o0072m4237N6391L0978m4772j7497K5154
551D61R140n612m370q215l008J6526J4283k3062k6231K9031L6348l2834m7812
564d5355L7921N6030m3585n5974M5779M8406m0762l9162L3549K9201k6572j6074
576a6598J9422J082j0882J2775M327k5697m98M1690l555n8268J0655P0954j9916
$$ y = [-25415, -17747, 22177, 25167, -18719, -33368, 15124, 39570, -12711, -40230, 12422, 35626, -8372, -24772, 2721, 16871, 6569, -6201, -10699, -1058, 15784, 12740, -15038, -18763, 14541, 29404, -7869, -36963, 6584, 48353, -4319, -50072, 7755, 49320, -5780, -39629, 7158, 30207, -3638, -13521, 1309, -499, 5892, 13489, -8594, -21772, 8755, 31951, -6116, -42441, 4761, 51463, -4127, -55784, 4093, 54516, -5556, -49793, 6598, 37576, -7196, -24693, 461, 9601, 3989, -381, -8596, -11604, 4922, 19205, -3857, -30088, -1057, 35291, 2457, -45355, -7434, 48596, 5011, -50963, -5184, 43222, 2460, -36702, -3153, 26048, -524, -16598, 2824, 3906, -6976, 5799, 10126, -15571, -16069, 25621, 22066, -36202, -25547, 45407, 25491]
589B5491p3500K7658O8752l3282n7815L6852M1067l4538k0061K4626O90j2869
601f929J5442N928l0889j701M6525m357o0112J2580O9302j9519p3571K3307P1867
614D7873k4531o3122K1791M9890j4935l7639N401K8508R29j8229m717M871O511
627B601J0524q980k5240J0224L7865j0635m9890J2353N7432j4620n9451J4866
639b2951N8114j2453n6479R641N2807q905m4796Q775L4195r822k3276J2965R449
652G264j4877P619J3093k7176n216M1884m420m7689J2150M7744j9045m2124K3121
665g672L4771k2997k7491J9041K1943j6060j5964J6908P558j7937L460J6372j3673
678a741j0899K0774M830k4706J590K5088o167k1723P764J6077m669j1996L9J0772
$$ y = [25491, -48009, -20351, 48401, 15119, -42696, -5844, 35223, 685, -19376, 5250, 5940, -6929, 8513, 14441, -16448, -18149, 28376, 24019, -36093, -23513, 45789, 26270, -47301, -23994, 47873, 23342, -39780, -17989, 31901, 16966, -20673, -15272, 13236, 14165, -4064, -8781, -3910, 2601, 13125, 4145, -21095, -10871, 26994, 16359, -33531, -21178, 36254, 21634, -37817, -22951, 35163, 22710, -33769, -24128, 28679, 19774, -25022, -16247, 17948, 8126, -15150, -2185, 7264, -7613, 6, 13099, -14077, -19293, 22591, 18171, -29518, -17368, 30376, 11331, -30793, -7672, 27099, 4102, -23389, -4348, 17595, 1535, -14429, 2479, 10037, -7900, -4440, 11932, -1741, -12640, 8134, 12964, -11742, -10152, 14936, 8769, -12954, -5190, 10887, 6218, -5778, -5739, 5033]
692E033K639j1032j258R782q98p718L423M094o778K466R540j1116q849J6831N168
707A1327j7239l229J6044L302j6466m242J7495N261j8731n161J9181K274j9608
720i792M128J5974r790q518J1296j590p270Q097J452j0531K895J0837o764r556
734i132R306O362r192l982O369N420m879q414O646R169q879p471R712N392r735
749c308l047Q597P23m854J02p82K756M379p682l071J0527p0r113J023P474n26
765C128m940p80J710M267O48q674R68J1522m151j0542N064Q019k048p756j17P958
781D276J705q050l153Q412L992q772l910Q458J882m515k519M38N684J140q410
796c342j041Q939R47q934j491R087K42o724k22K784K775n51o916J660Q086l653
$$ y = [5033, 7672, -3360, -4618, 5164, 4266, -3452, -29, 4065, -2713, -247, 9293, -1823, -10672, 6159, 11327, -5912, -9141, 6903, 10205, -6261, -10503, 6992, 12253, -6478, -11639, 7542, 9816, -9792, -5664, 10310, 520, -7998, 3298, 1708, -5562, 2535, 3987, -6544, -3649, 7188, 424, -9132, 174, 6536, -2656, -6638, -269, 5151, 272, -8142, -1496, 7673, -1206, -8677, 1035, 6427, -3308, -6355, 2242, 2965, -1889, -1787, -2569, 187, 4566, -3116, -6187, 4340, 4270, -4843, -3820, 3654, 3128, -1812, -2592, -882, 3385, 4033, -4641, -3673, 7849, 3698, -6844, -1780, 6239, 4191, -3565, -3682, 4276, 5981, -2069, -5222, 3190, 7182, -1590, -5500, 2958, 4840, 325, -2194, -1756, 3928, 5068, -3342, -4383, 4556, 5503, -3431, -4922, 4165, 4407, -2317, -2539, 245, 3020, 2469, -4447, -2787, 5299, 1646]
812A646o158K721M577j893k902K64J344K236q52n193K303N608m842k822M328K69
828F34j690J95j028R37J684j582j601J804J724k932M68K766l046K46L297l141
844a265q18L044m94j678N60N25l64J240qk795J660L412l764j367L864p02r77M73
862E46j323J506J899l252j379M065R91m821Q84L701j682j384J279j306J140J644
878B508l831P68L811j896k727J830J319j098o30N47n79J305j49l377K958K538
894C297m776n07M654j700l341K071J581j478k98N1j91J292R3l037P54M033k914
911d16k391K429R14k57j682j201K796J927l789k044M255J536m328j34K967j056
927d74O31n63k710L101L731n605k505O237J041n317J93L580p47j531Q94o74M74
$$ y = [1646, -4512, -1791, 2786, 893, -2009, -1745, -401, 1835, 983, -4210, -1907, 3701, -1141, -3963, 365, 634, -1056, -861, -1889, -952, 732, -850, -2451, -647, 1077, -1855, -1387, 1379, -1667, -1421, 1876, -1265, -2083, 961, 467, -1211, -651, -126, -490, 750, 742, -2053, -393, 3019, -745, -2112, 1752, 1050, 73, 546, -777, 729, 2628, -624, -2003, 2062, 3053, -1768, -884, 2817, 1135, -249, 1030, -276, 864, 2508, -1323, -555, 3256, 1360, -1367, 463, 1782, 684, 54, 601, 22, 1327, 1178, -2199, 759, 3297, -1479, -1986, 2668, 968, -2373, -302, 1279, -199, -497, -446, -637, 655, 748, -2289, -1535, 2498, -416, -2807, -378, 536, 279, -1403, -2604, 192, 2119, -1670, -3714, 541, 2077, -2251, -2385, 582, -474, 157, -406, -3116, -15, 3716, -1889, -4394, 1843, 2884, -2433, -2240, 1340, 593, -938, -44, -718, -244]
944b44K364k334j708K257R49k68j871j53K852Q1l440M76L274p26k451J195J353
961A606k310J904J242m605J764N116m341l659N159J351m558P67K970l010K98L686
977C380l818k715N362J515n499j684N385K702o737k489P849Q40p425N15O132k813
993E00m040N238J44o495M930N272r104k358J0582p28r523J550Q790k679p029L162
1009a788L879j804j789k80J691M66r45K99j004k74K525N4k810n58K871K030l765
1026a202k582L933L328k639n632K021R115m164j0021P371Q737r340n080R263J359
1041D467q945L904O822r203k468J2426j983j3325N085J4402p905j5180J1509J4177
1055A3783j4686j0740J6044O218j6084j100J4520m289j1276J0335M559j3428J920
$$ y = [-244, 2120, -214, -1922, 335, 1284, 1016, -855, -1008, 1844, 1925, -1515, -1039, 2235, 1509, -942, 253, 1606, -704, 1200, 2442, -2163, -399, 4717, 376, -3283, 1876, 3227, -1331, -564, 2406, -604, -306, 3380, -438, -3153, 2209, 3724, -1775, -3459, 1926, 4628, -2109, -4598, 3251, 4091, -3334, -2819, 3313, 500, -3540, 1698, 1842, -4653, 277, 5549, -3555, -5913, 4669, 3941, -5582, -4032, 4758, 2079, -4950, -1788, 2091, 287, -1502, -1782, -91, 375, -570, -271, -1275, -1549, 976, 1030, -1780, -2338, 533, 2563, -1202, -3784, 149, 3477, 838, -4794, -2773, 6342, 2178, -7843, -472, 8265, -1075, -6155, 3108, 4467, -4478, -574, 6248, -2955, -5423, 7003, 5020, -8305, -3220, 11182, 3277, -11903, -394, 13783, -903, -11643, 4401, 10619, -5465, -6565, 7955, 3666, -7610, 2725, 7284, -6144, -4224]
1068d224J3442o564j2308R256J1053j1107r184J1348O817r990n426P992M822o695
1082g68m565O503K381n266j22L204j857j719K729J608m333j735O137J674p680
1097c809k907J0833L735j4901k803J8502j365j9048O306J6958j0394j2765J3988
1110B330O111j5368J349J5072q922j2137J4521Q740j8401n497K1609K044k4102
1123a2651L043K3729q108k0186J1887J5854j5510q482J6218N58j4374P692R178
1136H848j2332m203J4184oj3797L238J2503m330j1043M246R181k533q237N55Q346
1151D620m29p495N36O016o12m396OL623o12k520K052R42l398m7N466j351r060
1168f659M235J2341r449j2512J4335R740j8253m497J9471j299j8080P161J3332
$$ y = [-4224, 9218, 2654, -9654, -398, 10655, -452, -9636, 1712, 8529, -1461, -6887, 1105, 5927, -768, -5333, 1170, 3551, -1715, -1837, 1367, -490, -2209, 520, 2128, -2205, -3940, 2197, 3871, -3809, -6716, 4117, 7852, -7049, -9852, 8650, 7285, -11763, -5457, 11501, 1107, -11658, 2330, 8441, -6927, -5578, 9494, 572, -11565, 2956, 11696, -6705, -12202, 9407, 11451, -12651, -9608, 14121, 6013, -14173, -2286, 13568, -1942, -10424, 5794, 6352, -8022, -330, 8848, -3484, -7687, 6497, 6491, -7306, -4068, 8435, 4105, -6938, -2692, 6489, 3956, -4281, -3726, 4620, 4191, -3304, -2768, 3248, 2636, -1760, -1754, 1869, 1257, -1263, 789, 1731, -1667, -1714, 3752, 2401, -6659, -2424, 9917, 468, -12044, 2291, 12031, -6222, -10719, 8752, 7453, -10627, -3466, 9866]
1181I866j1967o777J4499r3j4802O048J2894j0323j0398J3886P603j6680l357
1194i601J6630p05j4848M455J1489p551p180R692J592r513M668O506q175k618
1208e159R040l17q442K631O995m264m109M088J137j994J170q79j646K909J519
1223B679m462j466O553L39p253K089O386m799l486N503J389o723J968O768o454
1238i69m525J0694K07j1782M029J0171p378p452J0207L749j1626R00J0111n442
1252H94o352P646K860q757j58Q982l160q157O823N899r811j981R705j747q097
1267e411M591O086p795k381R228k309p940O203M676p900j350Q233k196p029M641
1282f53N262o773j813O514j506n229M239L411n313j727O230p19o446L979M948
$$ y = [9866, -2101, -8878, 5621, 5528, -9274, -3226, 9668, -655, -11053, 2833, 10436, -6244, -9601, 7029, 6324, -8524, -4069, 7420, -131, -7311, 2381, 3973, -5540, -872, 5634, -2541, -5159, 3881, 3564, -4878, -2247, 4748, 484, -3625, 463, 1600, -394, 776, -103, -1749, 1160, 2679, -1783, -3249, 3304, 3643, -3610, -1521, 4865, 66, -3420, 2083, 3472, -3251, -1283, 5485, -969, -5494, 5200, 5407, -6375, -2346, 7825, 447, -7005, 3202, 6951, -4675, -3775, 6336, 894, -5458, 2188, 5048, -3709, -3867, 5115, 1955, -6202, 621, 6520, -3291, -5272, 4433, 2686, -5411, -820, 5266, -2529, -4910, 4318, 2009, -5931, 272, 4948, -2952, -4302, 3931, 1735, -5294, -653, 4609, -2164, -3977, 2537, 1031, -4198, 41, 3452, -1861, -3588, 2642, 1923, -4523, -544, 4404]
1297D404o076k400O885n99o451L765N332p210j784Q771l044o928O724L090p345
1312b866P6P242l505n263N933K771p326O93O538k912m951M286L375n111k080O449
1328C349j020o143L946M616o134j959O886n03p566L572O984o810m295Q682k42
1343C363p992L892N341n872k498O660j097n857M229L937o416j069O151j140n193
1358c561K182M584l413l570M455J373m810J468L509l497j705M649J16n550K405
1373a365N380n535l015O893K7o424L054M401m487k051N369j057m526L455L017
1388C136n009n82N101j240m236K105L692l232k465M353O32m390J333L873l047
1403B4k525M390L25n015J637N319m243l364N586P16n297K013L970l502k270M357
$$ y = [4404, -1672, -4072, 2813, 2214, -4237, -472, 4860, -2350, -4134, 4637, 1593, -5335, 1389, 4479, -2866, -2790, 4452, 947, -4316, 1617, 4388, -2938, -2245, 4293, 1381, -3570, 716, 4091, -1020, -3100, 3349, 2329, -3814, 132, 4748, -1386, -3345, 3541, 3038, -4528, -956, 6028, -782, -5077, 3605, 3363, -4629, -737, 4604, -1268, -3766, 2894, 1797, -4060, 169, 4106, -2310, -3379, 2772, 1632, -3561, -1379, 3205, -208, -3778, 677, 2050, -2760, -1292, 2217, -1280, -2985, 1664, 1780, -3770, -1365, 4015, -1520, -4535, 2358, 2385, -4039, -985, 3416, -1071, -3122, 2247, 1190, -3336, 119, 3136, -1873, -2455, 2646, 1406, -2830, -725, 2967, -265, -2730, 1623, 2255, -2135, -802, 3071, 24, -2501, 1889, 2214, -2801, -1164, 4155, -88, -3452, 2134, 2850, -2447, -434, 3536, 34, -2236, 2121]
1419B121j00m393K366L276l630j700L781K31l260J77L179j229k937K553J406k903
1435a062K0K775j268k269K063J395l555N02L729k261k658L395P53l269Q24K345
1451A459j991j124K643l34k914K070J656k879J09K019o82j370P32J443j202j711
1467b076K690M55k605L98K709j457k125K090J850l278j06L385j866j683K193N33
1483A107k215M91K161j131j675J828Q41k522O23J675q81n05L03N80k84r05Q41
1500C32M58q53K20K98j90j59N23k55q41O70J356j760k67J848j298p42J984j014
1518C10j066J351N38j421o20J771q3j500Q46N07n82j46o3M57J64j211P42L12p59
1537d53k85R53L40j547K77J692j202j206J488M27j113l13J050L94q66j284J676
$$ y = [2121, 2021, -2372, -6, 3270, -360, -2060, 1721, 1952, -1308, -1131, 2048, 819, -2118, 435, 1841, -1062, -1042, 1733, 465, -1804, 259, 1654, -1901, -1399, 2330, 69, -2589, 806, 1559, -1710, -886, 1459, -532, -1656, 987, 653, -2261, -191, 1465, -1414, -1305, 714, 32, -1338, -606, 837, -365, -2076, 614, 1069, -1536, -1138, 1571, 114, -2011, 79, 1929, -1349, -1455, 1930, 64, -1619, 574, 1107, -1108, -617, 1544, 413, -1262, 566, 1407, -1115, -492, 1183, 302, -203, 100, 680, 396, -509, 332, 790, -63, 157, 455, 265, 106, 629, 374, -467, 203, 1559, -201, -468, 1380, 82, -660, 1324, 310, -756, 595, 1133, -288, -908, 863, 780, -720, 126, 633, 51, -95, -158, 299, 463, -748, -6, 306, -453, -738, 215, 555, -992, -715, 977, -225, -1431, 57, 484, -629, -942, 108, 502, -364, -1648, 28]
1554B8P62j655l34J567K98k308J024K274k350j055K945m84k033R12J582j220j495
1571a542J195J557j084j355J240J255r84j670J767J359k554l42L058j017k522
1586a639J897J569k105j112K706M57k717M7K390l08k260P8L114r21l471J925L355
1603C005l095k232L659J330m259Q1M205j685l753L197K538l943j310L586J109
1618B433m344j6L892o07m058J778M027l059l327L650K233m446p02M720q98m259
1634b983K362K614k381j951K791J173l028r00L461R9k954j57L491m98l906J802
1650i65L777l015k574L159J609l175n30L271k2l571Q33L277j350l249K184L065
1666B724k707k858L597K490n256k23N112r80n115K725M124l777l248N095J518
$$ y = [28, 790, -865, -1199, 368, 666, -1642, -618, 1656, -694, -1749, 1196, 712, -1321, -409, 1173, -47, -1542, -347, 1210, 126, -1229, 11, 1266, 282, -1388, 379, 1738, -816, -1158, 1900, 883, -1639, 258, 1827, -278, -1390, 1316, 1773, -944, -897, 1493, 1185, -1075, -997, 2117, 1196, -2275, -350, 3005, -90, -2322, 1337, 2667, -1592, -1511, 2694, 1009, -2744, 453, 2991, -952, -2262, 1324, 2433, -1911, -1927, 1965, 1358, -2700, -922, 3105, 46, -3281, 369, 2602, -1844, -2546, 2174, 1276, -2983, -621, 1993, -388, -2339, 452, 1625, -1403, -2303, 1158, 1257, -1697, -1854, 1637, 1139, -2767, -965, 2812, -203, -2777, 382, 1991, -1184, -1714, 1557, 1535, -2036, -1203, 2074, 724, -2525, -341, 2724, 17, -2841, 756, 3246, -2010, -2233, 2879, 1899, -3216, -491, 3633, -144, -3392, 1703, 3221]
1681C221n286K78M610j490l903K003L892l194l056M521J016m214M02L926j298
1696A428l997J875L481l030j572L130M38k622k04K048nk021N79J866j256j514
1712a376J356J170j093j433J593Q18j933l38K202m03j299OJ571j32k043K69K369
1729A304r65k453J907K091k710j737M237m8m043J559L395l267k072L838J106l954
1745a812J78L708j716l181L266J893l242p70K929N3k767P52K863j866k176K645
1761G57O44k569K00K780q71k744J846K197l127J95K418j287j489J651M20j574
1777e53J19J558j359j67J271q80k70R46l5q80O04K91p14n14J008M86j363J94J711
1796A453j233j528J555J340k353n47K730q84k833K464K023l373k26L038j235k733
$$ y = [3221, -2065, -1787, 2823, 1333, -2570, -567, 3325, 131, -2925, 1596, 2612, -1602, -1200, 2726, 1428, -2569, -694, 2787, -243, -1815, 1315, 1753, -869, -1073, 975, 970, -1051, -472, 1394, 138, -1376, -20, 1150, 57, -1376, 217, 1035, -898, -1236, 966, 563, -736, -730, 841, 709, -1334, -1065, 1304, 339, -2114, -207, 1884, -826, -2563, 1674, 1626, -2417, -858, 2537, -730, -2802, 1036, 2142, -1812, -1634, 2074, 358, -2823, 443, 2336, -906, -1676, 1253, 1306, -1461, -709, 2154, 288, -1888, 757, 1401, -1168, -968, 1812, 941, -1803, 43, 2240, -887, -692, 1726, 439, -1050, 601, 1021, -553, -434, 1124, -235, -402, 869, -11, -281, 665, 630, -250, 354, 645, -69, -583, 425, 911, -452, -258, 1453, 220, -1308, 247, 1587, -766, -1313, 1417, 533, -2300, 164, 2187, -1186, -1412, 1626, 391, -2342]
1812b342K163K297l373n94L597j315k677K051J858k285p09K165m9k721J224K116
1828A406j963r50J708P64k317L44K458j374k069K245J231k582J97K286j485j342
1844a443K114O1j805O99J731j575o35J682Qj709J128O89j271m23J793m13j505
1861h74J167J063j539l12J466l67j384P99J396j604o38J973k39k571J726J482
1877A544j958o91K243j66k383R52K163j600j665K624j46k139J028J534j459r72
1893a091J363P76k014K09K059j156j799J840Q23k214J97K206j200j817K131O14
1909I27k248N82J921j524p19J569j04j664N57J739j686n21J605K9j548P73R53
1926F41l95j361J178Q21j572L9J819j226j069J477M86j392j33J802p19j540J781
$$ y = [-2342, -179, 2118, -1255, -1849, 1748, 433, -2244, -193, 1665, -620, -1329, 836, 787, -1934, -710, 1406, -557, -1507, 201, 965, -1352, -1008, 1450, 76, -1993, 252, 1483, -1099, -902, 1384, -101, -1443, 671, 732, -1073, -374, 1357, -218, -853, 829, 837, -872, 256, 945, -326, -749, 1044, 631, -874, 293, 1356, -183, -495, 971, 604, -780, 19, 1415, -189, -827, 1146, 907, -1664, 62, 1544, -414, -1105, 1138, 972, -1411, -459, 1704, 104, -1561, 1063, 917, -1222, -194, 1340, -119, -1091, 272, 1048, -966, -757, 1302, 146, -1653, 187, 1010, -1204, -1007, 1199, -1, -1818, 313, 927, -1321, -739, 1182, -342, -1061, 508, 404, -1260, -703, 1036, -650, -1171, 434, 463, -1085, -312, 641, 246, -1115, 63, 884, -688, -649, 1170, -56, -1125, 352, 838, -554, -687, 1115, 396, -1144, 637]
1943F37P83k413N12J840j028r22J300K18j802P00J547j369r61J813j73j281N57
1960d2J056r20q63J167P56j650l35K026q02j611J601J130k190n03K536p02k211
1977a557J983J151k495L36J634q51j628J566R44j855j34J729o44j402J338N70
1993F85j066m63R38J38r82K77J003j117j25J362m55j294P87R29j262n07J846l25
2011C69j779J767J91j507M69J000k54j271J664j22j525L31J902j385j015J713
2027E48M00j735j23K216r46j423J121J240j714n99J959R4j745L78J854j622j073
2044a170K180q1k067J227J091j354o50J708j45j485J039R26j394l00J205n88m00
2061b58P18L34r50j50R05j92j211O85P12j065k03J384m80j149R55J078j586n43
$$ y = [637, 1420, -993, -481, 1359, 331, -591, 709, 927, -875, -175, 1372, 3, -958, 855, 682, -599, -42, 1014, 94, -769, 398, 1154, -496, -831, 1195, 393, -1218, 383, 1513, -677, -1180, 1356, 654, -1557, 426, 1577, -918, -582, 1052, 201, -1427, 139, 1083, -772, -906, 823, 179, -1223, 115, 685, -381, -844, 94, 232, -750, -473, 530, -587, -712, 650, 195, -1099, -312, 617, -645, -1152, 694, 369, -1410, 357, 548, -959, -490, 510, 256, -1015, 649, 527, -998, -667, 1235, -150, -1165, 548, 948, -787, -910, 1306, 360, -1063, 58, 1298, -416, -1015, 944, 1038, -707, -329, 1525, -97, -1170, 1010, 929, -1138, 89, 1180, -174, -824, 884, 739, -746, 293, 1219, -175, -475, 730, 142, -258, 460, 794, -156, -306, 599, 407, -804, -119, 593, -472, -675, 709, 229, -920, 35, 1113, -473, -1016]
2079a016J761j19k015J125J359j682n82J872k60j921J124J301j363o27J631p8
2095E10j350K69J200n03r18O53P68j169k38J171k83p98N58N50j79q39P58k1l60
2114b21K54k89K75K01r6l76L54K24o11K89O04k77j103Q70Q74j207o0R52J33j168
2134c78L2J195l46j225O30J252j653k02J625J6j796Q34J503j259j528K001M41
2151A142j663j97J592m93j177M68J372r71r24J169M87j164m19Q74Q40j751qJ676
2169H53o63j208R00J163j436n61J344M04j552o5J374k62j083L41Q62m25j116J103
2187b7P71j390q5J114L94j567k23K073o74j639J328P40j346O2J129j71j114K41
2205c84R60j26j029N86N85n61o81P85Q70r02q29J566j08j208J75J343q65p39O08
$$ y = [-1016, 745, 626, -1389, -264, 1095, -587, -1169, 703, 443, -1478, -354, 947, -416, -1043, 588, 510, -840, -571, 629, 126, -792, -139, 629, -540, -778, 393, 110, -688, -130, 420, 241, -598, 160, 139, -221, 33, -256, 19, 220, 124, -252, 102, 326, -285, 4, 608, 331, -772, 98, 972, -235, -295, 657, 790, -378, -346, 849, 503, -722, -92, 1160, -493, -695, 930, 946, -850, -16, 1487, 228, -1300, 701, 1142, -521, -718, 874, 381, -796, -328, 1044, 73, -851, 318, 805, -359, -778, 96, 936, -815, -823, 853, 190, -1018, -118, 1045, -391, -952, 392, 796, -756, -821, 553, 291, -792, -451, 411, -14, -1130, -27, 744, -646, -731, 383, 777, -790, -1013, 1060, 386, -1253, 75, 815, -531, -469, 660, 489, -625, -384, 576, 450, -579, 7, 592, 31, -650, 135, 1005, 103, -726, 840, 732, -476, -301, 1042, 177, -562, 46]
2224D6Q30n90j075J426L70j302l71J203M58j948M66K189j257j590K020M53k028
2241g00l07K028j06k491J533J481j842o80J806j16j273r0J807n91j575J098R20
2258I02j123o85R78O46j237k83J263k20j067O95Q23q63ML07l39j72Q8R21q78J10
2278a30J05RL7L5l88P43L04j136J56O75m9j133N91J108j208r26J576J30j007J56
2298c52Q09l09j032J188P42j291o14J716j54j597O26J566j230j104J664L26j682
2315g28N35J061p44r42J223O63j303n02J448j94j090N68R24p87q43J027L22q88
2333b50K08P80r15k93J023o58L7L11K41r24L36K52Q7k78L02j82p02Q89K38r96
2353d94K99M12k69p26Q00P10j098o23J592R8j683O95J240j176q85J414L51j541
$$ y = [46, 876, 286, -789, 637, 1007, -295, -666, 537, 995, -953, -487, 1702, 445, -1145, 875, 1328, -700, -1007, 1021, 915, -1576, -43, 1438, -404, -1084, 722, 606, -667, -757, 1050, 459, -1116, -18, 902, -221, -906, 72, 718, -519, -802, 461, 241, -826, -131, 692, -171, -167, 140, -199, -371, -283, 638, -240, -130, -25, -16, 21, 56, -332, 411, 715, -421, -265, 410, 361, -772, -181, 927, -281, -1207, 369, 499, -508, -352, 457, 148, -884, 304, 1046, -245, -859, 857, 703, -894, -268, 1298, 68, -1036, 628, 954, -728, -193, 868, 124, -818, 405, 1068, -235, -737, 711, 517, -573, -5, 919, 132, -711, 316, 638, -250, -42, 738, -177, -470, 553, -105, -68, 243, 484, -440, -104, 148, 235, -43, 259, 77, -625, 264, 502, -494, -195, 217, -52, -778, 22, 732, -366, -989, 603, 701, -982, -287, 953, -223, -1108, 306, 657, -884]
2371h84K77J706j142j052J685N8j149j70J512m92j249J027J002j597k40R63j59
2388I6p45Q61L06l09q68N93P02q66J33O40n98m05R27o3q77O40M73j150L04J296
2408A090q76n43J090j30j036M33Q55j021j93Q95J11j392Q89N14q13l73R54P2r74
2427d48R5R13m21j023J024P99j323l2Q99k27j138O69R99p54q28J115j16r01O53
2446d5O82j095k91J026p7j009O90O95q97p2P36k36n98K70L42l91k15P33m74l13
2466e39M82L37o45J92O18n08o29P94L88j055O2J199o08q65J028N66j119m8J072
2485G22n68r98J068P15j338R4Q80k49r59M69Q47o67n90J154m27m20L47N37n05
2504A12l79O08K84r40k7J030o09l47N53Jp28K74Q87r11l01J118o77r41J261K86
$$ y = [-884, -607, 1099, -43, -1095, 590, 648, -501, -671, 841, 349, -900, 127, 1129, -468, -708, 255, 96, -649, 212, 518, 209, -659, -66, 636, -230, -97, 543, -55, -460, 467, 404, -473, 167, 640, -510, -206, 1090, 214, -329, 761, 631, -405, 28, 883, -138, -331, 564, 675, -717, 172, 686, -127, -500, 454, 526, -448, -353, 560, 139, -884, 140, 939, -384, -416, 483, 256, -882, -213, 786, 32, -796, 319, 203, -698, -45, 637, -458, -749, 277, 200, -809, -119, 576, -321, -393, 343, 107, -491, -221, 121, -270, -485, 248, -226, -539, -57, 280, -365, -173, 445, -63, -692, 102, 490, -565, -503, 696, 88, -777, 251, 817, -302, -350, 722, 154, -844, 224, 939, -399, -305, 575, 326, -633, -164, 683, 16, -574, 580, 153, -267, 80, 617, 112, -267, 341, 625, -315, -342, 688, 79, -268, 285, 286, -442, -168, 719, -192, -493, 625, -52, -993, 268, 554]
2524E54j149L34M26l2q27O00M27p47j17J016l58n50L6J039j002k95J000l88o13
2543f46L92O73p15l35P82M4m57N1K80m92O9N27J9o33L48M03o15LJ82J30k54J55
2565h9K49j60l80P08p5n12K04L70l92k78R88o9j302N48P70n05k79O32j5q06N60
2586A67M03o97k64P89J68q81J99O41l07m81K57L73l18j14L83p3p15N38J72J8l90
2607a32K54Q4k43M97m99J26j13K58l77K49K83k95j94K48Q5p2j40M60p92l68R52
2628B71l6q16L90O33m16m35M30N27r63J48M33Rq81L99R55m89p44N97L81n85l57
2649e49J064j32r32M46O18p70j0K25Qk29o7O07q2l86k00M73J68o71K4Q47j90n41
2671b79N20j6n08Q0O99m0n20J39J30k51L1j3L80l53j39L63L42o39k30Q17Q9r84
$$ y = [554, -595, -261, 165, 133, -694, -94, 333, -414, -531, 485, 127, -423, -387, 652, -350, -645, 355, -33, -646, -254, 419, -296, -631, 151, 195, -262, -211, 69, -423, -354, 173, 192, -441, -93, 310, -305, -302, -120, 10, -244, -89, 160, 0, -380, 328, 253, -259, -55, 315, -77, -355, 633, 564, -738, -190, 580, 75, -204, 428, 413, -393, 167, 570, -127, -391, 398, 566, -315, -116, 525, 218, -263, -6, 367, 49, -65, 318, 245, -470, 68, 240, 258, -132, 122, 206, -37, 460, -39, 87, -26, 232, -145, 104, 387, 92, -102, 146, 231, 159, 19, 479, -313, -681, 271, 235, -581, -191, 442, 26, -409, 21, 548, -415, -267, 166, 175, -706, -307, 648, 159, -585, 12, 393, -192, -549, 515, 383, -549, -103, 515, -255, -265, -40, -32, -261, -328, 279, 197, -189, -389, 84, 252, -419, -395, 452, 262, -279, 241, 225, -283, -203, 496, 456, -64, 75, 205, -46, -15, -28, 352, -1, -140, 223, 565, -74, -304, 513, 602, -382]
2693c82m3R06l28q67P69N72m97m61L91K76o53m7M46Pn98P60K34m88m86Q77lp04
2715c19k01Q44j35p00M08J47R6o94L52M68m70k34L58N7j18j53L10m5l97K11O13
2736C98p05k33M80N72o68k65Q25k06m00P4M55o6n86N60N29r70M9L90n9n14L15
2757b5M28m97m03O37K59m77l88Q73L88p59k21N42K12q23L02M04l21m04L95K20
2777C42k55Q3MJ45o40J56N98k24n27J38M08J01q89N98J99k61k82P41j34p57K14
2798b42Q66p20m87P47K97j114L13O76j23o25K88P08o90l12J46N07k55l21M25P4
2818A58n71M3Q82n29n39P08Jk85k50N94j5l38j04J29j31K36J45l03J63J38m46
2839c14O02J91p10j9N68j49n01N84K14q19J70N72m6p58L73N95o37l66Q82K19p81
$$ y = [-382, -425, 481, 153, -714, 55, 627, 130, -331, 60, 336, -317, -364, 82, 89, -509, 251, 485, -3, -489, 388, 385, -319, -520, 324, 189, -511, -103, 44, 140, -554, -202, 266, -204, -438, -80, -23, -141, -294, 16, -29, -426, -215, 398, -307, -540, -60, 512, -156, -421, 404, 198, -202, -128, 327, 261, -325, 235, 764, -206, -157, 233, 174, -340, -25, 403, -94, -497, 140, 399, -78, -466, 407, 795, 36, -185, 357, 569, -254, 48, 452, 131, -273, 122, 342, 87, 170, 174, 319, -321, -165, 433, 209, -318, -180, 228, 329, -560, 38, 237, -24, -306, 435, 301, -456, -242, 624, -96, -583, 164, 461, -653, -340, 336, 213, -412, -124, 584, -106, -418, -272, 235, -20, -341, 84, 158, -413, -370, 512, -17, -556, 152, 153, -132, -382, 212, 197, -141, -245, -116, -247, -11, 134, -169, -6, 132, -314, 288, 479, -231, -250, 318, 169, -332, 252, 466, -353, -183, 389, 343, -415, -42, 553, -84, -450, 432, 651, -130]
2860a30L3N47j33p81M21P25o30n04P14K04o76PP72m52m45O74j8m48K08J54N6o61
2882c63K88J81j57r9K23j38j74J39K40r3j81J00n2J49k51K2j24M88k08k41k60
2903e11R62l90p26O42O59q46l12R29l00o90N17M91j044L96R08n91q19R48K49p81
2923c09o9M80L6m83K20Q88q23l03L20L74o02J21Q95n21o11M14N66o58k86O27k11
2944F5l46L01M62m75O0J24j60k69N47P9m43J6L08j06l47L68O2l14K10L29o16J54
2966IO14n58l03L93L51p50j8P04k48o59L75N49n46n96J097k15q68M41P27p67k80
2987e48R74k39m89J79P71m81q13Q43K47o98k00R60o05l39N73K57p62M7O23l33
3007c3m32N55R3q05J59N57j64k49M43M1m88M08K92o33o3M25j30j93K89M63o45
$$ y = [-130, -97, 450, 317, -464, -43, 682, 52, -452, 262, 466, -210, -203, 569, 117, -328, 346, 328, -120, 88, 242, 298, -363, -75, 106, -51, -150, 73, -65, -239, -100, 140, 47, -134, -34, -86, 63, -188, -166, -290, 198, -10, -251, -511, 451, 61, -665, -23, 636, -210, -522, 407, 107, -583, -66, 425, -619, -223, 685, 94, -725, 223, 472, -309, -378, 102, 138, -345, -125, 763, -60, -363, -43, 331, -271, -150, 745, 224, -387, 27, 593, -65, -351, 276, 65, -281, 20, 482, 7, 67, 191, 31, -238, 309, 388, -55, -39, 269, 163, -184, 184, 246, -68, 142, 471, -145, 9, 623, 65, -238, 155, 506, -244, -262, 442, 194, -465, -90, 459, -87, -683, 414, 199, -669, -228, 499, -268, -548, 426, 187, -302, -123, 648, 167, -646, 197, 444, -254, -454, 506, -99, -438, 135, 392, -370, -323, 300, -33, -465, 90, 183, -622, -463, 94, -70, -319, 124, 165, -323, 85, 377, -256, -319, 106, -24, -217, 72, 535, -110]
3028a10l28O48J41p83L00O98o61O1K60J81r27L07R94p92k77Q64J57j019O2Q79
3048F55o25m18O55j9o39Q1P92k62o05O26Q7n72k3O12j94m31K04M25m05m8L29j90
3070C5o47O75M93r97K69N16m60k62M93J8m16L7J066q12q29Q96Q3n55k71R94j93
3091A33q68O90M47n62j79N16k11m05N46J31m46k47P98l18n05L66O02p14l1L62
3111A05J18o00N04K31n28K33L00n7p38N91J87o10K64K62l75l30O20L37o78k49
3131d13P21j42k87N72j97n69J98N73l81m12J69Q00p29l19J175m07r59N94K99m05
3151a19o2L14J88n21K53K46n92j9N54J90p71J59L20M0n45L00J51m67L87Kl02J46
3173a48j45N58r27L04Q23o62l55P25m55k79M89J12n43J05N58n25j26O25K66p84
$$ y = [-110, -438, 210, 351, -432, -132, 566, -95, -34, 226, 407, -520, -213, 781, -11, -288, 576, 733, -286, -224, 655, 30, -388, 267, 248, -391, -310, 482, 220, -385, 241, 328, -244, -267, 345, 151, -280, -76, 349, -56, -104, 225, 35, -612, 63, 556, -441, -172, 344, -116, -378, 115, 133, -283, -246, 820, 8, -821, 75, 158, -397, -668, 326, 133, -735, -45, 402, -160, -339, 177, -34, -439, 107, 238, -208, -455, 343, 25, -480, -114, 488, -226, -257, 105, 223, -377, 127, 358, -170, 63, 363, 306, -432, 159, 346, -264, 0, 262, -113, -443, 177, 514, -164, -413, 308, 166, -121, 451, 254, -315, -117, 456, 75, -337, -168, 632, -97, -416, 759, 352, -607, -13, 286, -119, -181, 133, 321, -200, 53, 299, -293, -312, 242, 432, -339, -180, 140, 180, -365, -65, 86, -381, 6, 8, -294, -148, -293, 265, -662, -358, 465, -197, -552, 173, -282, -561, -72, 40, -503, -398, 160, -365, -491, 134, 400, -384]
3193c84K87N52p81rL58L72m72j93N08j24n05K69O79n54l06N61J61r71M47O03l11
3214A87o65Q11R4m13m31O81J46n88L26J36m22j1K56p8LR1K02m05O4l00O83n62
3236a95J01k09K44O41p60J85J90N0l2l80K54L78o72p0N99l50m20N78J25n75J25
3257a93O15n33p36Q15L67q20Q8M24L76p93N2M06j04m26K50M28l18j81K74J38p05
3278e76L54M10l54k38N30j98j73j69N14Q1j64n4j8J72j69j94L08p6J02j56J11
3299D3K90r93R29J19m20k4K50l0j27n8L65j02l57J20L02R5k25k01M22k92l87L58
3321G7J59m85J60L41oo32O98k38q9j2L61l16j33R6J44J68l09R1M9k03m18O05k
3344A06j22m27O90k58l67K78p6P8L8n5N13o83J48L61n3l78J12R1j59r9k36P40
$$ y = [-384, -97, 455, -326, -335, 23, 395, -77, -270, 238, 114, -391, -122, 557, 3, -303, 258, 419, -552, -105, 498, 187, -478, 333, 427, 14, -417, 264, 410, -178, 148, 284, -138, -149, 107, 29, 32, 123, 325, -80, -16, -316, 367, -195, -94, -303, -59, 582, -178, 7, 197, 247, 215, -165, 89, 467, -205, -275, 324, -26, -446, 132, 257, -318, -193, 422, -111, -847, -32, 335, -485, -397, 27, 403, -390, -338, 68, -36, -462, -212, 216, -102, -283, -9, 129, -576, -222, 188, -166, -404, 126, -72, -245, -414, 100, 181, 17, -37, -55, 117, -52, -246, 62, -14, 88, -68, 43, 333, -660, 269, 388, -32, -56, 194, 164, 37, -21, 344, 242, -115, 5, 307, 402, 177, -24, 398, 106, -281, 77, 236, -249, -89, 252, 246, -386, 312, 74, -15, -27, 334, 18, -115, -19, 125, 293, -16, 75, 124, -79, -497, 108, 106, -16, -443, 247, -11, -378, -100, -176, -98, -60, -115, 398, -285, -137, 224, 171, -207, -95, -4, -163, -262, -498, 242]
3366B42J11n81r6O40j34n01k7K32J23j09L92j17o04M08L06l36l04L15L51m25L8
3387g6J84P8k50j68N47j40o07N57K40l54k26L48J02k33k41M10Q6m83L52N6k03
3408b1p6K32K10k09l24N71j13l76l5L56J26m53l7O38l28l95M33q7k9L0J4Om00
3431b67J34O10o21j10K90J10j71l98M32K1j14L2K45m0l88j94N12p6l93M33J68
3452B15l54m8K56r6j10j22K96k0k06j94L25k9k91K79M44l59l65M67K06n48M3M61
3474B50k32l51M37K3m28J41N24j65n32K93K06j3m05M01K31k94l11N57j58j06J10
3495A78o1q6k91O56qm96J47L78l65l21J54L58r8p3Q9J60l29j06J1J75K30m45k9
3518a72L56j45k04L28p8nj76L78l63j99L35Q7j69n4J84j39l26L79K50n4p02J17
$$ y = [242, 353, -228, -324, 316, 182, -319, -346, -114, 9, -100, 292, 175, -429, -21, 285, -51, -355, -40, 311, -114, -76, 108, 186, -64, -232, 315, 175, -432, 125, 365, 11, -215, 133, 235, 2, -239, 171, 257, -226, 126, 182, -21, -97, 135, 345, 136, -188, 383, 270, -106, -141, 215, 341, -112, -149, 489, 161, -234, 199, 112, 83, 113, 127, 133, -267, -133, 477, -144, -254, 36, 146, -25, -423, 9, 30, -84, -52, 193, 153, -235, -429, 83, 7, -386, 47, 215, -139, -187, 69, -27, -137, -259, 37, 17, -189, -383, -58, -87, -378, -99, 345, -14, -379, 88, 294, -254, -211, 250, 18, -333, 104, 127, -301, -160, 364, 199, -333, -40, 166, 153, -252, 149, 380, 86, -225, 332, 174, 68, 178, 117, 31, -260, 396, 388, -108, 39, 417, 52, -269, -115, 243, 145, 72, 161, 321, -8, -114, -103, 72, 302, -143, -172, 184, 39, -165, 163, 85, 80, -96, 282, -81, -280, 55, 142, -27, -81, 103, -36, -362, 17, 267, 213, -489, -372]
3540c72O12k25j74J77K51p19J81J94J35n10P21J6o68L19K47j70n11M07J91q2k65
3561b45K27J26p3l22M02p6M5K7J00l87J48L27k44J15K1j1j93o2Q1P4Jj4k31m7
3585b11M01k41k48N13q6l13J95J72K59n28L44M0m60J57L96o2n93R1K50r6o1R2
3607A1j01j77J11J99k24j30L70Q7k44J85K71n57l22L78J63q9P4r9J07k07j9K27
3629A4pm08M73k86o2L20j19k48L1K84J55l80J25K4n4J34J0p2j23M03j14l31J19
3652a12Q9l1j51K50k04J18M2K53l04K0K5p5J10q8J04J2j67J92j24J88l97N47r6
3675B01n28O84k74MJ60k94R5l23K31J65j52O0K47O8m77K77kl83J74L16k60j81
3697a92K88J9k59K25oj97qJ78M4J05n41L51k13J05j16L10l27L11j8j01n3m3K58
$$ y = [-372, 240, 15, -159, 18, 269, -450, -269, -75, 60, -450, 271, 287, -381, -62, 185, 15, -496, -89, 102, 20, -245, -18, 108, 35, -287, 115, 39, 84, 111, 211, -176, -28, 299, 55, 170, 191, 180, -13, -75, 6, 80, 81, 67, -164, -211, 190, -51, -299, 214, 128, -185, 10, 182, 441, -87, 257, 297, -163, -6, 390, 328, -265, -174, 76, -20, -81, 11, -90, -267, -156, 43, -181, -311, 59, 146, -98, 87, 358, -199, -521, -143, 20, -69, 5, -94, 13, -194, -213, 14, 7, -401, 72, -214, -276, 44, -75, -323, -292, -8, 147, -233, -108, -84, -138, -4, 6, -66, -189, 214, 100, -231, -112, -23, -54, -205, 45, -159, -41, 1, 254, -50, -30, -5, -80, 30, -58, 46, 58, -109, 83, -41, 147, -250, 297, 201, -327, 357, 83, 87, 247, -47, 48, -275, -44, 121, -31, 29, 276, 344, -133, 144, 142, -241, -67, 249, -11, -192, 96, 115, -144, 81, 75, -122, -130, 48, 92, 197, -344, 7, -206, -101, -217, 93, -234, 77, 59, -42, -95, -138, 120]
3720A20l63P3M36m08P4J22q2q4lj24M62j28j59o1o8M54l54J86j15J91j78N2p2
3743b9n0L28m14J72O3l85K07J26k71J86J10K41l79N3K18j14k9K0L53k18j39o0
3765a1K60l25J98J82l58K2L2Rm8Q6K25j74l82O43l04LJ11l8q1N7o1j67M6r8J21
3790e2O4o4J18l4j54J26l4J51k22K23k87L41k58J04O1R2m71L18j97R2L74m12o9
3813a90j05L30k77J05J27J85j50L9K1k6k20L59k18k06Q0M5n5j2j2L50l08K07R2
3836A61k2l8k80J96p1n4J2L14o8k85J47L57l40m4k8J80r6j19K40N9k56J86K50
3859D01j53l30L23k21r0%lJ86K73p29M64o7m9p5M29n28J51K18k61m58K96L75j53
3882ak36L39m4l24J88Q0J8j77q3K36r3J87k69L75N6o21K45L96m18p7L16j65j01
$$ y = [120, -243, -170, 266, -142, -68, 54, -28, -112, -115, -239, 223, 95, -64, -125, -193, 261, -93, 93, -22, 169, -9, 43, -29, -79, 249, -165, 7, 70, -315, -108, 18, -253, -67, 43, 284, -95, -42, 176, 62, 33, 53, 406, 188, 49, -11, 249, -76, 122, 304, -54, -32, 0, 9, -39, 47, 272, 98, -284, 359, 55, 58, 169, 131, 50, 107, 46, -121, -75, -173, -52, 12, -52, 66, 32, -122, 4, -30, 121, -101, 122, -165, 176, -82, 22, 83, 175, -296, 22, -175, -83, 291, -121, -190, -295, 35, -242, -137, -10, 175, 25, 64, 85, 59, -161, 198, -20, -226, -146, -101, -156, -168, -180, 170, -138, 69, 161, 139, 101, -179, 17, -54, -108, -96, 218, 150, -135, 12, 369, 29, -15, -43, 137, 41, -78, 162, 221, -35, 151, 401, 248, -82, 241, 20, -70, -70, -73, 113, 386, -343, 121, 54, 5, -70, 359, -169, -18, 200, -61, -519, -223, 152, -1, -237, 102, 58, -266, -78, 2, 20, -157, -240, -4, -97, 90, -179, 196, 252, -369, -124, 272, -146, -223, 93, -72, -173]
3905a73q9O85o46J42J96m0n4mk1q1j04K48k18J11K11l93O54l34j16j96M41l42
3927a23l67O11k86J89K36j04k33j94K09K12k43Q5J31n8k96M34j56J24p9n8L2J68
3949B34L0k56J24R2j41Kj94K33l52M36l57KN14k88o5P9l06M19n2k29MK09k80K6
3973a16N08l40k0k54J35K6N8J90j14k04J36p7K47k45K59p2l30J84N8R2k81R9k6
3996h7Q8l62K35R6R6k89J17K4J44q7J5l51K60J87k6R6j90N4j16NL7J35J0k83J1
4021a81O7K76l61J35M29k32l71M04k1j10K04k68K25k30L11j53l12M81m10L16M6
4042B45J1j24j13N6j08J86K0n9j59J77j59j36L49l3k44J33nj39j31J15l31L03
4064a46m3J27J69l81K73J2M6m4J45k01J71l57Q5K02J23l13j9L61n17K99Q0j91
$$ y = [-173, -262, 423, -223, -81, 115, 75, 21, 17, -4, -85, -189, 59, -159, -48, 163, -230, 424, 90, -26, -222, 219, -123, -490, 121, -165, 24, 260, 156, -77, -271, -62, 150, -93, -8, 123, 65, -231, 203, 47, 171, 92, 34, 66, 234, 264, 8, 132, 224, 83, 85, -109, 124, -228, 208, -149, -147, 367, 79, 14, 93, -213, 206, 154, -75, -71, 138, -142, -116, 392, 52, 32, -222, -87, -61, -3, 187, 73, -131, 5, -72, 175, -70, 189, 117, -213, -29, 29, 121, -160, -61, -87, 1, -361, -126, -30, 66, -223, -106, -82, 62, -25, -10, -361, -101, 86, 60, 156, -34, 20, -96, -91, -54, 81, 91, -192, -181, -114, 162, -199, -64, 365, 133, -238, 166, 145, 35, 239, -29, 196, -34, 277, 124, -188, 293, -117, 199, 245, 256, 132, 19, 75, -33, 153, 173, 114, -45, 132, -27, -163, 186, 153, -91, 42, 37, -102, -233, -118, -449, -146, -189, -62, 107, -274, -1, 11, 57, 13, 158, -43, 128, -229, -144, 58, 181, -132, -151, 210, -307, -8, 72, -119]
4086a19p0N0R5j82J03O3L42o4n80N02j46q4N8R1r8j65K98k07j96J55K87J1m13
4109b69J63L27m27K26J2j18J30J05j29M6P1r8j41j7J9L20j64Qpj20K37k09No5
4133i5k0N5L01j71lR1k62k44N55j37j98J53J81m58K08M9j43N8K32j63j82K08J49
4156A64l23K20J83m6j82nJ00k12j63J76J56j48J55j27n5l38L33J70q2j37L88l71
4178a44k00N75j81n88M08J14r1J05k2K30l63K83K3k27Q5n4j14Q3K9M00n27P7K51
4201A52R7k16N9N1r9j62J14r5m5J71J9J64n02P31j53m42q5L97p2r8P4N6n7J7L2
4226A08j73L26K05k96j11K9J44l42J61j07L37k70j27K19j01k32L38J34m71P8K01
4247E0J74o06K72R6j59m2M37k53k68K73r5RJ03K4m50L44J60j24j23k45M12j47
$$ y = [-119, -189, -139, -44, -226, -123, -60, 282, 218, -362, 140, -6, -90, -32, 59, -39, -204, 94, -113, -309, -154, 133, 144, -269, -106, 221, -206, 20, 32, -86, 44, 149, 20, 66, 137, 39, -102, -119, -100, 220, 56, 64, 57, -63, 174, -35, -30, -95, -115, -60, 241, 70, 67, 158, -104, -348, 207, 70, -128, 25, 206, -252, -44, 5, -138, -80, 152, -11, -193, 15, 164, -159, 61, 244, 198, 16, 11, 111, -101, -264, -88, 68, -80, 75, -52, -107, -445, -112, 58, -24, -161, 227, -144, -344, 231, 50, -538, -130, -16, -107, -2, -24, 206, -157, 126, 149, -78, 7, -47, -161, -78, -49, 351, -176, -99, 152, 249, 33, 92, 143, 44, -118, -4, -99, -144, 27, 46, 210, -292, 439, 286, -156, -241, 156, 84, -14, 60, 116, 59, 76, 108, -65, 261, 466, 170, 59, 88, 232, -110, 51, -56, 281, 11, -116, 103, 2, -230, 108, 242, -229, -151, 50, 224, -382, -110, -14, -173, -215, 222, -31, -299, -26, -121, -112, -9, 15, -435, -91, 69, -55, -178, -423, -11, -158]
4269a58K01k07J90r4j17K61k69j51K00PP8Q8p1Q6m3J99J22k44l24J81k7q7JL71
4293A93j20p4L08l49O7K61J04k87k31J73j4O8R5j26j12k0P9M11k64n5K92m21q7
4316a09N83n34o2P2M63n29ML31j56k25o6L72j94j28M49m30j4J25N8k49L97J02
4338B60J48l19n2O2j63o7K15j17r7R2p8J9o4J48p4p8J75k7j93M0J35J18l80K11
4362h6nr2j31K63qk17M50k80J5P4J90O6l68K66j36m8j76L57Q6j48r0j5%M1J37
4387A45p3m0q1L85l04J66oJ2k70J67l6p0K32r0j86P4K9J53l83L51k22q8N4j4j3
4412a08L35j54q8r0J68J51p3Q2k40L46m23p1J88J3l5k22K05L5l12K36K05m37L84
4435I5j90J72k02k2J84L2k21K18k33L41l56K70k29M0J8K90j20r0J0j12K85l51
$$ y = [-158, 43, -164, 26, -68, -185, 76, -193, -344, -144, -137, -59, 29, -42, 44, 1, 200, 322, 78, -246, -65, -92, -179, -178, 193, 73, -1, 307, -42, 25, 286, 390, 103, -128, 45, 31, 99, 194, 68, -44, -64, 15, 426, 162, 107, 399, -22, -109, 474, -60, -122, -50, 413, -116, -112, 219, 63, -162, -228, 144, -50, -178, 271, -159, -173, -48, 10, -239, 158, 260, 408, 89, 37, 99, -64, -131, 84, -33, -130, -38, -116, -97, -161, -13, -87, -165, 10, -17, -210, -170, -35, 83, -297, -86, -91, -183, -314, -51, -59, -276, 174, -106, -91, -17, 173, 239, -129, 137, 1, -47, -223, 134, 220, 72, -18, -33, -33, 8, 145, 72, 32, -49, 336, 32, 198, 192, 204, -66, 101, 65, -5, 227, 137, -49, 25, 54, 207, -176, 175, -47, -135, -81, -95, -108, 227, 73, -15, -105, 63, 214, 141, 223, -17, 329, -94, -165, 23, 36, 1, -221, -16, 19, -293, -57, 148, -289, 95, -95, 77, -125, -147, 37, 69, -152, 66, -167, 174, -182, 88, -141, -101, -83, 207, 87, -3, 7, -105, 180, -171]
4457a71l0L12o0k79L03j40J40j43L04l14j60R5M71k02j12Q7j22L88l56J32rj00
4479C4k22J27J51rJ17O4k62k12M53O8j50j14L17j44m03R9J77K22n34R3n6NJ52
4502b7q8J21J5J10k20K14j40J24j45n7O8K95k57p8K05L9p5k40j00M11k37l8r6
4525a96M52k72N9j07M54n63o8J20K36l24l4K31J12j38K80j01j84j31J96o2J13
4546G3j76J87l7J1J72k97P3k32L53m5l03J84J75Q6l60L08K09m96J87q9J33k7j16
4569b7j0J53L5j49K97q1j80rj5k3j8JJ30j37K53j38n6p5K45Pl31J67r7j48pN17
4595C04n23K58N4J45j47mJ84p1k01q6J91o9j14j07L88k31K80l30R9J2l5k2Q5P7
4619A37o2o7l06K49J28N5j07j50m3M30m16j42K40R4k14R3K02k68M71l54N6k71
$$ y = [-171, -201, 111, 51, -228, 75, -65, 75, -68, 236, -78, -238, -143, 328, 126, 14, 101, -21, 367, 11, 143, 134, 34, -188, -61, 90, 81, 198, 262, 0, -212, 241, 309, 159, 45, 362, 218, -185, -86, 91, 313, -221, -128, -184, -179, -27, -115, 6, 21, 131, -89, 125, -15, 109, -36, -93, -25, 270, 13, -65, 140, 179, 104, -136, -236, 175, -62, -100, -196, 256, -16, 43, -64, 390, -173, -241, -121, 115, -209, -243, -12, 100, -38, 242, 141, -43, -174, 22, -40, 73, -103, 84, 47, 58, 230, -67, 6, -226, 127, 82, -221, -37, 138, 224, -136, 172, 381, -115, 72, -17, 116, 89, -27, -37, 116, 151, 2, 299, 218, 38, 29, 14, -9, -27, -26, 104, -33, 220, 82, 26, -49, 196, 203, -128, 39, -58, -206, -213, 304, -219, 39, 93, 238, 91, 87, 271, 200, -1, -87, 104, 35, -79, -186, 202, -29, 251, -79, 20, 32, -3, -25, 60, 137, 75, 8, -298, -49, 79, 134, 27, -123, -166, 264, -152, -294, -54, 40, -174, -81, 121, -147, 324, -30, 26, -245]
4641b45J12l0L16p3M6j32K59m10K29m8r8lp3N11j77k57q0J58M8l13M53M7j73o4
4665CJ37R4k10L7J84j18k38K32l5j76j37M25O6l98KK70l09j86N22k82j41K08K
4688d8J30k60K37j80k5K22J50m26M9MJ00N0j13m8K35k30M5L4n7N6l4M40m63O4
4712f8J21k49K48k44J13Rj56J80l6R6K81J29n73K74m65J33L19Jr4P1n0j5J99k53
4736b9j59R6j0L5O7r3K59n2p6J09j34K66k05k19K30m0J92l39J37K05kj14lj47
4760b6L06l87J11l59N34j58M7r4Q4k25K8kO3k65L18j94O1M62j55o4k25L1J3n1
4784a47k9J50q9J82q3j03k8L6J06j11J68j68j17J90L3O7r0j2N1j41L5J09O4j57
4808h4n0L23l82K17rl86K98M2j8l4l2N9K93l78m5K21N7k25O1M7K61k22k4j19J27
$$ y = [-245, -133, -163, 153, 80, 126, -6, 253, -157, 72, 24, -74, -77, -150, 361, 184, -73, -153, 5, 53, -260, 193, 240, 67, 3, 140, 234, 24, 61, 245, 127, -111, 121, 86, -90, -227, 198, 264, -134, -132, 138, -171, -357, 165, -117, -258, -50, -48, 82, -178, 59, -121, -146, 76, 226, -200, -151, -147, -47, 3, -110, -158, 77, -153, -108, -74, -131, -75, -109, 331, -132, -68, 53, -196, 52, -192, -79, -70, -226, -46, -82, 14, 295, 424, -149, 125, -340, -207, 112, 113, 19, 90, 40, 25, 224, -29, -188, -92, -102, -67, 0, -93, 166, 114, 38, 147, 13, 279, 74, -145, 85, 45, 237, -102, 35, 240, 238, 124, 121, -26, 280, -107, 4, -355, 179, 21, 68, -26, 58, -167, -139, -141, -78, -343, -25, -219, -158, 304, 149, 85, -140, -109, -96, -147, -176, -26, -115, 67, -16, -119, -147, -111, -5, -116, 52, -116, -233, -43, -10, 57, -33, -45, 6, -135, -100, 9, 73, -84, -134, 189, -193, 24, 15, -371, -73, -31, -49, -83, -115, -56, 237, -141, -186, 35, 92, -133, -72, -25, 236, 14, -10, -129, -2]
4833bJ89k39L2j14mK83P2j41j6J52j44jj7J41m7k46K26j62m1j65L83oj52n6J19
4858D4R7k96J88j08j13J73J55J09m06q4K85l4j30J01lj49J47L27j94k60J18k76
4880c09K05Q7j17J50j62l2J45j46K1K7R1K44k39K51k40J8J29l11p0L53j72RK49
4903A81k83O0K27j79nJ88j71j29j94J43P3J00j40J51l8j6j3K42K3l27J00R9N0
4926A42j90K5j86L50m00J46J70l7j73L25k0j93M25l05o7q4P8K50l54K90O1j35
4948A18p4Q7K4k70K60r8K03m59J60J33m2k76L69o9Pm2k37K32j71j35K41L0j45
4971a54j95K40J2l4P8R0J7j83K01m2j33J0N5j82J43Q0Q1n1j03l9K25j13q3l7J55
4996C8m4N5J86m50N09m25J7N4q8J04R3j83J25J02O8j93K37O0m25J54N5J45k43
$$ y = [-2, 187, -52, -20, -134, -138, 145, 217, 76, 60, 212, 68, 67, 50, 191, 144, -102, 124, -38, -79, -244, 139, 133, -19, -75, 44, 141, -155, 33, -75, -188, -15, 140, 249, -157, -241, 44, 10, -120, -19, -22, -171, -24, 303, 109, -151, -33, -309, -104, -17, -134, 16, -146, -178, -33, -179, -158, -131, -40, 204, -35, 216, -24, -6, 123, -188, -258, 95, -77, -68, 181, -102, -42, 185, 6, 1, 189, 18, -111, -305, -162, -89, 11, -129, 22, -16, -32, -45, 197, 220, -107, -7, 92, 142, -48, -23, -209, 141, -259, -113, 57, 20, -153, 172, 152, -41, 384, 79, 12, -72, 6, 256, -98, 192, 253, 118, 44, 131, 155, -115, 145, 47, 250, -209, -49, 84, 42, -234, 135, 66, 73, 31, -206, 26, -145, -280, -39, -9, -154, -349, -109, -97, -131, -53, 37, 54, -129, 72, 30, -103, -93, -38, -220, -77, 3, 84, 33, -70, -109, 116, 3, -80, -117, 38, -6, 49, 235, -215, 294, -131, -114, -60, -148, -44, 49, -134, -9, 93, 161, -32, 205, 265, -160, -6, 49, 194, -49]
5019d9k9L9J32kJ55m01J91J07L8j58L88k70k09L28p5j90J8K01j89O8j19K2n2Q9
5043C3K25k56J1q4L63o38K49J96l63J40L39K2l00R1K00j8j34j33n0j8l6K95l03
5066a69k4K80q6R5j23r3Q1J12k99K63Q3p5k3j23K36j86j53K39l8K90m69J09k8
5089a01N3J00L7p6L2J37k69K83k11RM8j45j0K54Oj7q9J11l64M09k12J33l13J9
5113a76L04j20n2oK89j41k25K95l17J65n5j2l9K5q2L07k63j30K36J52M4j15R6
5136A80k12P6k08K23J32k77K66q1j80J37m9k54K54j06J68k05JJ58l33L34r8M0
5158c4m6k8J08O7K78n50l8L87j89m68Q37j62m02MJ80l00L07Q9K31l64K5O8O2k57
5182a95P0K12K44n04J55J97r5Q5j93J46l06j05L49K26n29O1M52m01J01k6J24K1
$$ y = [-49, -78, -39, 93, 91, 246, -155, 36, 143, 181, 23, 411, 141, -68, 260, 185, -5, 13, 214, 25, 93, -26, -4, -56, 33, 258, 2, 13, -71, 292, -346, -97, 99, -264, -124, 215, 237, -63, 28, 228, 210, 76, -57, -107, -125, -161, 134, -169, -193, 87, 1, 96, -27, -120, -39, 73, -226, 37, 120, 45, 22, -101, 135, -51, -204, 35, -3, 287, -182, -73, -101, -48, 52, 89, 13, 45, 182, -87, 196, -15, -6, 42, -103, -113, 141, 147, 130, 41, 152, -212, 197, -15, 118, -195, -176, 128, 8, -44, -50, 239, 98, -127, 168, -149, 16, -39, -51, -90, -65, -147, 160, -103, -233, 3, 155, 199, 84, 180, -32, 44, -164, 59, 191, -86, 180, 99, -81, 56, 7, -247, 7, -99, 69, -136, -135, 23, -310, 24, -74, -34, -80, -108, 0, 67, 345, -205, -243, 144, -45, -513, 324, 162, -240, -236, -56, -356, -49, 40, 271, -93, -68, 0, 62, -195, -125, 87, 331, -173, -18, 179, 84, 169, -24, 122, -184, -289, 60, 286, -243, -182, 270, -131, -30, -56, 68, 89]
5204H9M6j54K93j70m7J19J9j38j41K54l4m3k9J18j53j23NK98k83N4J52k05J19
5227D6j24K30j66J52j73j8J35j93J22K51k66MK03p8k08q6n0KR8J18J4j61J87q7
5251d8N5j9J04R9l90K30k01J38J72k32J36q1J2J12nr3J7k14K99k0R9l5J4j81K7
5276eJ88j17p6L9R8l06J56K08j69r6J02N6l25N2J79O6J1j5k6K42k19oM8O2m8l0
5302F9N1j56J72j54L96j34j79j12L8oM19m20K59k77J15j34P3j87J72j84K53j43
5324f9J58j92N1K55m01L10k52j21M33k95l2l9J28K35k63o3J23J25l05J85P5k12
5346a66j7L2l9N6k7M13l45J43Jn8J32J09l25J9J47j86k5J56L89l35j90J0M0j1
5370g7N2N41m67r2j27M24l76o4N59l36n2L6j47J45L7Jlr8P1J06J10j47nl70J85
$$ y = [89, 135, -19, 274, 104, 57, 176, 195, 57, -84, 170, 136, 93, 64, 182, 29, -94, -89, 209, -74, -20, 132, -73, 46, -78, 152, -14, 138, -35, -53, 82, -111, 11, 262, -4, 0, 203, 125, -83, -169, -219, -217, -119, -1, 13, -148, 39, -48, 7, -12, 92, 191, -199, 31, -170, -32, 140, -92, 44, -37, -25, 87, 82, -11, 6, -208, 91, 71, 170, 135, 149, -32, -5, 183, 66, -10, 29, 127, -179, -23, 185, 16, -80, 22, 78, -247, -195, -16, 50, 61, 46, 20, 262, 43, 37, 85, 147, 99, 69, 120, -36, 136, -18, 378, 244, 65, -47, -9, -15, 404, -16, 243, -34, 81, -53, 20, -167, 5, -179, 74, -69, 89, -103, -52, 203, -198, 112, -140, -261, 172, -123, -155, -194, -66, 169, -94, -157, -34, 91, -214, -29, 46, -166, -183, -151, -190, -134, -161, 252, -93, 50, 51, -7, 125, 234, -91, -72, 75, -111, -136, 20, 409, 74, -116, -106, -66, -77, -25, 516, 49, -43, -170, 254, -122, -186, 373, 37, -15, 21, -126, 19, 56, 57, 54, -44, 27, 133, 243, 96, 91, -279, -94]
5395i4N3Q1l74L3K05J34j34L5J36j81J23%k30N1L15K1j38P7j9q4l44K19M08m01
5419a08K10J17k17k10J01J80J4k06J96J44l57K93k80J27j65L90l52J55m32N88
5439A88l15M1P4J58j85j59K30J48k94K1J67j85J95j30K19k58J82j30J48J89m13
5460a09J09j73L39o6m79L70JJ48k08J1K1Q1J32q7J96m7o8k18r3L90k84J14n1r5
5484f6Po9L46k69J70j29m7N4o4k29M52J4p6p0M5l88k1K34L51l02r2K22J6m3J02
5509A48M7k15M3K10j01nn9O3k66k2k4k3K06k7k52K35j89q9K71K1n3O0J12j2r5
5534a6l3K23j72l19K06M64l60J41k86K60j8L4j14J18Nk66J84j8k78J56J58J41
5556B10l22nQ1J74K24l03j36O7J55j07K7Q1j81J90k98J80L47n50L00m5j29q4j19
$$ y = [-94, -41, 40, -334, -301, -96, 38, -96, -61, 75, -106, 17, 17, -213, -162, 153, 174, 36, 113, 94, 10, -334, -115, 293, -108, 102, 219, 2, -208, -107, 73, 87, -119, 77, 221, -136, 157, -123, 4, -161, 229, -123, 32, -400, 188, -127, -86, -12, 146, -39, -198, 32, 180, -114, -93, 74, -111, 84, -46, 173, -85, 97, -33, 115, 304, -109, 0, -173, 166, 100, -379, -9, -8, 140, -68, -57, -36, 45, 177, 90, 286, 239, 171, -47, -140, 250, -34, 80, 29, -66, -59, -128, 218, -51, 119, -10, -57, -3, -67, -296, 156, 170, 94, 24, 69, -319, -340, -106, 245, -57, -149, 73, 89, 46, 148, 195, -20, 23, 233, 132, 127, 68, 131, -135, -157, -181, -204, 2, -25, -277, -42, -231, -320, -49, -28, -81, -21, 91, 79, -16, -49, 174, 2, -317, -111, 353, -7, 134, -152, 108, 90, 124, 10, 128, 133, -133, 51, 33, -245, -89, 69, 210, -112, -117, -36, 138, 362, 59, -77, -10, 145, 38, 65, 146, -35, 155, -143, 37, 384, -166, 134, 89, -40, -124, -243]
5579b43K98L6k02J4J01j96J75j3nJ30j45J09j33j55J58k01M75j21j18L9L24m80
5601a53j17J03j8J14J65r6k04L61k97K91k23k29L84p1l7l1k3K84k13N7L3k37Q5
5624g2K65j26j45P7j28J17k7N4o4k04L60j08J5K3M2j12L5o7p9K21k64K66Mm4n3
5649a4p6J55j81Q7K00p3r2k13K34J28j30p5J35l3j69kJ98pm04O12j19k64L26k03
5673B0k14J38MJ53M8j68O9J53j28Pk06N4J37J39q0j00q4L1J71l68K83%n3n4K03
5698A55k04J33j82J3M8R3J27j98m4j68K13Q5K0M7m23J39J86J84k1j25l61O8J62
5721e3L7M7R2K17M9o5l11O3l54M34r2J18j46j14K51k08o4K58k83L33n20L95J41
5744B25m5j7k36r0P8p4K11k56K21k12M04l46o9L34k67J09K51j37Or9k4j20K13
$$ y = [-243, 55, 91, -111, -97, 4, -192, -17, -30, -35, 95, -50, 59, -74, -229, -71, -272, 203, 82, -36, 3, 327, -153, -270, -167, -185, -71, 94, -2, -206, 155, -142, 149, -74, -303, 81, 10, -27, -58, -81, 203, -10, 47, 80, -157, -72, 193, 67, -78, -1, -129, -12, -39, 15, -49, -253, 107, -1, 14, 37, 79, -33, 2, -65, -144, 77, -187, 79, 83, 39, -14, -90, 65, -116, -29, 171, 98, 6, -207, 27, 155, 25, -50, 85, 52, -117, -119, 79, 72, -332, 280, 161, -103, 223, 20, -194, -56, -52, 101, 149, -19, 50, 203, 75, 82, -124, -70, 67, 206, 126, 26, -58, -27, 144, -224, 59, 59, 6, -48, 155, -49, 84, -98, -85, -37, 56, 183, -15, -59, -227, -14, 71, 91, 138, -285, -146, 40, 224, 203, 78, -283, -215, -53, -16, 31, 123, 340, 389, 324, 13, 76, -278, 156, 64, 182, 36, -78, 173, -35, -99, 159, -124, 209, -311, 84, 225, 180, 163, -73, -163, -85, -159, 52, -204, 17, -195, 209, -137, -206, 128, -139, -30, 221, 84, 90, -9, -33, -153, 60]
5767F0k7j0J08j50K1k01K14o3L6J79m01K09N9P7nr3r8K88n35K36j2J64o8l3J95
5792A50l05R9L82n21N3K46r8k25L39Pj90P8j55j0kJ79O3J5k1k97J63R0K80l86
5816f6K67j22k51L12J52o5l80M93k94j32J30M6R0m9O1j16J20k48J04k9o6Jk20
5839b62L48J63j40M7k5l21L35n2N4l07J17kJ28j86J82m2m8m2k8jj74K3K21k0R6
5864F4K0k08K02L12m66O1j06J26lj05j1J52K96j02k61J87m8p9p7j19Q0k5L23l13
5888a00l61L46K45k68K42k2o4M6l00K1J98n1K13P9k08q7o8l6K71k28J78o1J21
5911A06q5j41K4J10k62K85J5K29k45J39l32N7K03l06K84R4r3o2M2Q8k66Q5K9J20
5935A18j43l7K1p5J58pJ59k68K01l16J85l6N4k89M8K65%R2j64o3k37L04pJ99k82
$$ y = [60, 33, 23, 131, -19, 2, -199, 15, -48, -12, 167, -234, -25, 34, 111, 106, 13, -85, 203, -332, -96, -108, 56, -12, -45, 150, -155, -56, 326, -195, -142, 104, 6, -219, 120, 127, -63, 15, -140, -150, -152, 27, 90, 105, 84, -213, -50, 40, 320, -66, 201, 79, -172, 140, 292, 227, -153, 340, 46, -86, 44, 90, 180, 131, 192, 76, 196, -52, 52, 23, -43, -42, -262, 86, 249, 109, 156, 131, -190, 145, 93, 147, -160, -43, -45, 83, -103, 79, 37, -11, -53, -81, -82, -256, -233, -12, -32, 64, 84, -124, 78, 390, -76, -15, -121, 5, 2, -103, -114, 38, 334, 232, -29, 158, 110, 31, -46, -165, -85, -110, 213, -100, -461, -115, 130, -138, 104, 82, 18, 64, -236, -215, -17, -68, 145, 224, 16, -71, -139, -175, 96, -132, 46, -15, 106, 21, -120, -96, 14, -248, 37, 52, 281, 36, 175, -157, -100, 103, -203, 81, 175, 82, 20, 62, 150, -116, -31, -2, 118, -25, -62, -41, -116, 42, 35, 194, -74, 127, -189, -4, -40, 14, -275, -227, 38, 38, 130, -34, -97, -334, -30, -37, 162, -120]
5960a20M3j27K03Q0L2j10M6pP9j54O3Q4J11j16k22j9L50m6k04Q4j36k3j4J13P7
5985F7k22J52N4m3k2J85k11q9K79j72j31O9j85J89qR3j45J66l7K00j01k69J24
6008e7J21p6J39k93K56k23M24l48j8L59j92p1M9j33j72K72J3j9p7J44J34j51l34
6031b53K07j05K24R7j33k7J66Lk16Q5j67LJ83QN4J29k32k7M2p4J04j59j1J04K9
6056C4p0J85l33R5J50j34j13k5K68l4k94L73j13l5O6j29K09J08j99O8j55n7K51
6079A16l1q6j39L61k33J34%o1Q1q6P1k72J56l8j82K16k43J00J57L82o92Q3K30
6102B4j05p9J46L2p5j52L67k04R2k65K13K45j16L7m28N39k17l20L38l85L81j64
6124i6L7K46k11R5L3O1l05K2K07j56J91l11L03J24k55j13R2lJ58j16o7K03k30
$$ y = [-120, -77, -204, -1, 79, 111, 1, 47, 40, 119, -35, 28, 112, 223, 107, -115, -134, 216, 170, -34, 50, -86, -109, -123, -10, 67, -155, -3, 51, 8, -14, 171, -40, -129, 150, -22, -153, -84, -269, -80, -88, 5, -140, 26, -11, 189, 88, -181, -57, 64, -12, 127, -166, 90, -133, 291, -57, -75, 284, 92, 21, 70, -63, -235, 37, 50, 31, -46, 98, 232, 81, -253, -46, -151, 73, 170, 37, 10, 176, 179, -37, 48, -119, -116, 67, 75, 129, 258, 26, -1, 41, -33, 71, -88, -99, 5, 34, -36, 149, -184, -89, 61, -73, -186, -211, 57, 23, -271, 102, -11, -46, 20, -109, 100, 208, 9, 77, -78, -135, 116, 85, -1, -140, 221, -12, 122, 122, 61, 142, 56, 127, -145, 11, -27, -209, 7, -236, -136, 21, 403, -289, -206, 24, -81, -160, -14, 18, -57, -209, 158, -46, 46, -219, -6, 239, 123, 160, -268, 271, 54, -266, 72, -313, 68, -96, -59, 187, -24, 71, 104, 165, -140, -118, 89, -67, 124, -187, 116, 240, -15, -128, -36, -39, 119, 3, -64, 139, -91]
6147i1j15J78p9j04K37j56K92k49R7j33J04r7L88k13K4j89J44J64j19J6o7j25
6169i3J78j61j42J35K59j88k34K62j31J2K49l2M5l97J42J21j06O8O3J0j24J98
6191A34k70K34j18K5M3J0K72j82j49o7oQ4l7J26j10J3J10J00j86j86L08l07N35
6214C76k36k00J68m4k67J67L0K36p6l90P53k34m67J60J3q7K22l01J86J03k32O2
6236e8j63l6L88K34m41K14j2m46K87Q3J29q6P3k18M9j12m2N30m82m1J20M2j78
6259a66K45p2q4k63K10J20N0J13J1k50J92k12L9J49k10J57j78M8o1J66J11J56
6281B71k93K7j16J30j66j30K44J62k63K03j49J24J55q2k37P1K20l05K36j06M4
6302D0j93J24j5J55k11q4K50j93Q0j1K48j65j34K62j53l7m3O5m8K17o6q2Q0r4
$$ y = [-91, -206, -28, -107, -211, 26, -130, 162, -87, 10, -123, -19, -116, 272, 59, 83, -106, 38, 202, 83, 99, 32, -93, 85, -76, -218, -83, 176, -12, -246, 16, -115, -103, 146, 114, 159, -238, -96, 25, -81, -13, 50, 60, -64, 134, -136, 98, -20, 5, 48, 58, 330, 148, -1, -68, -74, 10, -27, 99, -11, 2, 112, 212, 26, -160, 148, -159, 376, 140, -60, 108, 64, -203, -36, -6, 230, 154, -236, 517, 283, -184, -24, -11, -98, 124, -177, 9, 112, -120, -58, -221, -257, 131, 365, -76, 138, 126, -320, -33, 50, 179, 93, 166, -52, -3, -115, -157, 373, -109, -150, -30, 12, -166, 79, 7, -77, -340, -130, -10, 40, 153, 164, -86, 106, -106, -67, 82, -128, 29, -149, -101, -162, 4, 115, 271, -22, 5, -111, 19, -147, -277, -33, 129, -134, 69, -80, 44, 199, 117, -120, -49, 171, -134, 102, -4, 40, -153, -29, -44, 111, -100, -184, 66, -127, -47, -58, 190, 25, -109, 153, 0, -37, -80, -15, -63, 154, 88, 6, 86, -8]
6326hk0L28k16Qj9N9l69J96j23J90k1R6p2N1l61K99J87kk00K3K6K57k58K24r1
6351A84k33j99N35l21n9J66k97L21l08K32k95K00j16J39r2K44j81R1M3R7l11J57
6373cl8lrJ33Q7p5L4Oj53o8K70m20K50K24n6j84N5k04J11q3J05K32k00l69L84
6398B6j74M28m41j3J22l3N2L8r6J38j54k8P5J32N1j77L5L15k20J98k03l24R4q7
6422b46K07O7K12k58L8k02K55j38J5P3l67L37P8J45K8o4k02J18j36K52j72J4O9
6445A23j88J0J45j37jL1J52j72l3O6J0j52K50k22J02J29j65K59j61l0P4k71L38
6468A57K6k02J61k37L37k69K41j35j28j7R8l04L39J7n1j20k7p5J30K54k81p7K7
6491a36O5J94n5l41M24l10J29p3K48k07q8L09r4l48J5L16n4Q6k46j24J81j38K53
$$ y = [-8, -28, 300, 84, 92, 73, 132, -237, -41, -164, 26, 5, 101, 29, 80, -281, 18, 205, 203, 3, 26, 52, 309, 51, 275, 184, -49, -248, 287, -34, -93, 73, -224, 97, -211, 21, -274, -74, -190, -51, -143, 101, -80, 11, 54, 151, -160, -3, -41, -44, -53, 80, 167, 92, 126, 132, -21, -89, 181, -239, 11, 235, 179, -5, 50, -154, -43, -126, -21, 211, 11, -358, 26, -148, 280, -161, -174, -52, -85, -33, 5, -91, 47, -107, -135, -60, 72, 123, -54, -19, 296, 76, 274, 71, -253, -159, -246, -39, 28, 240, -18, 20, -182, 73, -65, -50, 23, -344, -7, 71, 216, 244, 180, -22, 96, -40, 212, 40, 54, 123, -65, -55, 90, -47, -48, -17, 135, -37, -70, -4, 6, -146, 104, -118, -16, 113, -52, 207, 46, 16, 90, -181, 157, 183, -19, 142, -95, 242, -27, 214, 79, -49, -66, 32, -272, 67, 84, 33, -87, -114, -189, -59, 195, -86, -163, -136, -71, 123, 68, -273, 151, -159, -30, -103, 145, -62, -150, 159, 65, -283, -268, 48, -6, 80, -166, -290, -109, -247, 6]
6514FR1j31K19j15l4jK50k02j99L66k11pj3J20l10r4K0M53m33K59K37J62k97L2
6538A68k46K6L3j23J25J1k9k6J28k3j78L00j39m70K74L35lk68J54j25J4J9k7K61
6562A91m20J47Kk8l5j02O01l04r4n4K99l14K9R2J46Oj65l5K25j65j45J95m2l48
6586c18L42l03L5M01O7l57K8J36O4j84K51k79L78k38N6L13n32J6L68k61j68K9
6608a56J41Lk40o2M91p6j3n7p2l5L7M9j28K93j69l02K30O9P2k88J31R1n1K69o6
6633A61K9j77r6l1M7L83l50J94r3j08J73r2K71j08j59P2j13M0R3l2j40L56k46
6656G4j34J23j50L34k89r1p6L16j11R0J3k31j8N4L6l0j29Q1J40L3J72k93K68j08
6680G4r9k29j01M15j46J6K10m9j47J42j98L6K59k93K61k44M60l81j66L31k88L07
$$ y = [6, 97, -34, 185, 70, 36, 35, 285, 83, -116, 250, 39, 32, 19, 139, -171, -265, -245, 208, -225, 34, 271, 433, 136, 168, -78, -52, -19, -142, -17, -6, -35, -61, 67, 44, -134, 166, 27, -443, -169, 166, 163, -105, 49, -76, -62, -43, -70, 191, -229, -82, -80, -108, -143, -245, 356, 52, -42, -96, 203, -111, -82, 10, 156, 162, -3, -38, 187, 22, -123, 72, 30, -318, 24, -279, -244, 157, 224, -133, -105, 31, 95, -89, 162, -117, 261, 23, 79, 392, -140, -124, 244, -17, -185, -156, -15, -12, -252, -314, 177, 101, 88, 31, -41, -76, -39, 10, -118, 175, 6, -296, -66, 3, 75, -213, -82, 9, -42, 227, 161, 190, 13, -83, -114, -67, 316, -34, 160, 67, -41, 132, 40, 311, 203, 44, 116, 3, 43, 136, 104, -36, 320, 74, -60, 63, -87, 247, -42, -133, -209, 107, -4, 86, 99, -132, -150, -96, -60, -90, -219, -138, 2, 35, 207, -86, 182, 74, -25, -254, -355, 60, -86, -70, 140, 91, -56, 86, -112, -76, 183, -110, 151, -93, 367, -14, -180, 151, -137, 170]
6702A70k26P4J78K7k08J94l12Q6J18k37J46q6J21J39j74j01K75l91L16q6J96k09
6724A0o0L5r9K02m27K34N9K13n0J39m5j74j0J47j18J66k00q1M2K29k59P6K7n0
6748FM5l4q9O7J49Q7qk73O5l5q0J2n3K4k17L96J40j33r9r9q6K72k0pk36K14P9
6775H7j14j92K11q5J12l9j72J78N1oq7p0J12j7J1N0m4J09j65j7O7O9QR5l2p7L9
6802H2n3j75J62k17L56k36Q8O7k69J88QM53k99L8j35r5J06J35j85K19k40M8p1
6825b5j74M0K44K4j32r3K12k41K92Q9l69J98j98J41L04m00K24J00j87QN6R9j24
6848H8j33J41q8R1k40K67j87N8P3j94M14k79j27L6J35r2N1j41O5O2J58l3m6k10
6872a31J41m5ML17k81lK86l12n0Q6R0p2R6l8j37j35Q7J1M13m55K60k28m5PP9j03
$$ y = [170, -56, 18, 196, 223, 15, 209, -103, -17, 101, -136, 10, -76, 45, 184, 10, -91, 184, -207, 109, 23, 219, 10, -50, -15, -114, 88, -339, -105, -46, 167, 117, 256, 211, 37, 27, 174, 56, 222, 22, -59, -17, 212, -47, 29, 56, 6, 51, 17, -72, -5, 144, 231, 223, -50, 15, -20, -100, -88, -141, -117, -334, 62, 202, 69, -30, -129, -215, 57, 37, 30, -206, 8, 87, -27, -219, -8, -93, 19, -20, -192, -14, 37, 31, -56, -126, -14, -31, -20, 30, -14, 95, -70, -87, -20, 49, 57, 152, 120, 43, 82, 29, -146, 16, -201, 155, -81, 7, 74, -195, -7, 1, 454, 155, 193, 58, -37, 69, 204, 19, 238, -2, 46, -25, -199, -159, 85, 109, -23, -116, 96, -145, 147, 236, -133, 65, -133, 8, 312, -88, 136, 236, 49, 57, 113, 212, 88, -45, 96, 8, 99, -141, 126, -61, -3, 70, -124, 290, 11, -116, -80, 55, -37, 14, -127, -62, 0, 158, 125, 79, -131, 10, -35, -31, 286, 5, 2, 288, -24, -74, 12, 102, 30, 126, 88, -49, -184, -97, -86, 327, -128, 132, -96, -141, -134, -55, -158]
6898a58L80k38r2k26L57P0j24K5p4o0J31J02j72L29m68J79r5L23p3k90O5L25j09
6921A07l33J72m3Q9l92N16Kn4L0j85M51l32J25m30L37n6k64M39j48j03J48K10
6943B86j38k71K71L15l63l90oL87Q4n50K96q6K00K52k62N7k01l9J24j30K66k12
6965a10L99l26K08O8n3J41m24J14k45M50j86k83M32j84L2K4L1k66J61J21p9p2
6987d7k6R6J12j03J81j97r4J57Q7p8l87L05m6j44J01L6J22j70K77j90N6j4m9N2
7011C7N4k61j25L40j44K39j69k9L1M6M2P5J16l8k46K39j87l97L88j09K48k28O9
7034iQ6J06l21J38K8J29K4k68L04j53O7j78k4K93j16q2j21L4o2K33k7j9j84lK28
7059A03j89L49m29J99j60K35j19J12k78J38J2QJ07k15K78r0j19J42J89J58l93
$$ y = [-158, 222, -16, -108, -334, 23, 93, -31, -6, -80, -140, -9, 93, -79, 250, -218, -39, -134, 189, 116, -174, -109, 216, 107, -226, -54, -97, -8, -400, 116, 118, 64, 94, -91, 360, 28, 153, -277, 60, 4, -260, 179, 31, -72, 76, 286, 148, -123, 148, 463, 100, -290, -296, 91, 175, -375, -79, -165, 35, 287, 25, 82, -119, -158, -34, -164, 102, -110, 289, -37, 171, 239, 186, 327, -97, 17, -228, 222, 36, -247, 185, 1, 33, 57, 88, -178, -17, 104, 25, -47, -73, 23, 135, 32, 213, 16, -78, 79, 166, 88, -299, 6, -40, -184, -83, -47, 75, -95, 182, -8, 48, 34, -15, 37, 91, -170, -295, 45, -99, 140, -29, -58, -27, 19, 61, 136, 252, 214, -32, 207, 20, -377, 11, -98, 150, -78, -9, 77, 183, -138, 0, 28, 157, 181, -87, 217, 64, 131, -47, -71, 222, 106, 24, -97, -63, -125, 108, 81, 62, -122, -125, 103, -86, 263, -166, 33, -127, 108, -11, 101, -177, -39, -27, -19, 88, -127, 151, 61, -58, 84, 273, 431, 38]
7080C8R2J20j33L6k70P7J67q3j30J93J27l43K64k08k19L50K05k44q1J18M9o3J48
7103B10j59L1m0n9k8o8J8n2PL03q6l45R8L7L54l39J3J96k18Q7J21j66J97Jj31
7128a8O2j8N9j36p0K64k26Q8r8J02j46O9Q1N7l4J81r0j42J95l22P4n1J80k55L18
7153A24q6l09L73L6m06L69r0m2L1Q1k27K31j91J40j4J38o1k57L32p8J40j06k63
7176a35J53k38K35n5O5K28n4K31m75%R7j43J43l9p9K01l3N1j90p4j1o5J73J10
7200I6j84R9j96K36l69L26j54M9p4K05Q0j85J11k35J86p6K94nj47ll3k25K01N8
7224E5j69J04k75L29l32K95j98J36K05L0l52P7J6M16l45j31K9l2P0j64L31k65
7246a70J19K16j10J36l06L12J52k05k1Kn3L0l25L10j45O0n3j39q3K49K61k59k01
$$ y = [38, 130, 250, 117, 153, -117, -40, 127, 44, -86, 107, 234, -109, 155, -53, -272, 78, 283, 39, -42, 76, 125, 62, 210, 51, 82, 42, -17, -45, -113, -95, -147, -140, 163, 77, -268, -170, -133, 221, -118, -105, 91, -127, -40, 81, -85, 112, 113, -18, 44, 26, 85, -51, -121, 143, -83, 5, -93, 9, -137, -68, 13, 70, 36, 217, 127, -15, 180, -142, -68, -119, 61, -194, 124, 38, -271, 102, 138, -268, 101, 11, -31, 0, 81, -146, 85, -106, 34, 20, 158, 97, -160, 172, 94, 234, 128, -135, 18, -220, 15, -40, 25, 253, 199, 430, -45, -45, 52, -91, 52, 13, -66, 135, 102, 153, -37, -111, -122, -187, -14, 96, -88, 11, -185, 51, -318, 8, -146, -97, -171, 34, 114, -71, 40, -195, -9, -85, 209, 204, 57, 54, 21, -204, -3, 55, -114, -10, -285, 44, -288, 7, -191, -55, 150, 180, -172, -95, -79, 337, -8, -139, -110, -142, -72, -236, 95, -170, -51, 165, 55, 191, -115, 197, 349, 144, 123, 125, 72, 102, -223, 87, -58, 2, -51, -190, -273, -24, 237, -22, -223]
7269b23L06k87J72q4j84K74K17L1k95K50n1j11Q8j89K67j54oJ14j92p2L44k16
7291aL1J83j3%l02o7o5q1M21j78L27m01K04k75K71o7oj14K01j00j07K41J50l55
7315a03K29j13J14o7j67j80K28J86l88J98K52k40J60k69p7L84k79K59K9J78n13
7336a79R3J03k07K6J84J6K39n85L40j85J51M4k4M7r1J4n6J67L3l5k11K71j75K31
7360B11l92M6J73p6j39J44L8M5J92j72k03J74j44K2J88j36m6J6o3K78j96p7J14
7383cJ10r8o6o9P6J01j89J56j0j30K64l12K07j80P1j37J48J07j53q5M75l50j82
7406b49K00o0J75m11K55J99J01m08K27J72m3j40N6j74K74j44j5k6Ok6j68K76j40
7429f3Q5o1J60l40J81L12l51j2K28l5j71N1J2m4k9N21k73l56M17k07kJ49j86k5
$$ y = [-223, 83, -204, -32, -116, -300, -26, 191, 222, -73, 177, 126, 15, 103, -86, 181, 27, 21, 135, -57, -129, 215, -1, 30, 213, 200, 200, -102, -169, -234, -315, 106, -72, 255, -146, 58, -217, 54, -13, -19, -133, 68, -32, -139, 102, 252, -103, 126, 13, 127, 60, -107, -287, -59, 127, -261, -63, 189, -51, 109, -160, -237, 147, -132, 127, 156, 334, -179, -86, 17, -190, -164, 20, 36, 275, -310, 30, -155, -4, 40, 16, 63, -28, -14, -70, 97, 130, 95, -116, 155, -20, 211, -181, -135, 38, -38, -177, -33, 5, 50, 242, 70, -133, 41, -103, -81, 107, -29, -75, -59, -122, 156, -40, -117, -3, 107, 9, -57, -126, -50, 51, -138, 18, 8, -122, 142, -170, 37, -143, -72, -209, -61, 46, -107, -192, 283, -67, -249, -49, -109, 66, -345, -90, 109, 210, -198, 29, 201, 158, 18, 74, -100, 174, 30, 15, -11, -5, -31, -199, 77, -63, 22, -39, 121, -219, -38, 274, -77, -89, 139, 104, -67, -16, -4, -48, -77, 444, 171, -185, 232, 25, 23, 172, -14, -39]
7453c9K00k14k18J98J36l40L36p5K99o8k66J59j24J43m3o4k7L1J32J44l57L1J06
7476H0j80M3R3j68J66J3j66K79q8j0q7k34J06n6J3M3J34K8j76J53n8p6K91k32
7500h9MK96j63j37K18M0k57r3L99l41K6K12k7j86kn2J24M1n6K92q9o6j58L3K05
7525A74Jj36k43J45j8N6l36M83j15J44q4m69O23k98K52k23R5J19k84J61m81N00
7547F6q2QK74l38J40j18j5K38j12K62m64K10r2M48m55k2K84o5k12M8N8j80j74
7570b93K51r6k3K31q9j2l9K08l21J91o1J47l13J16N3j34K59l13J50O5J61j82l9
7593h3J53o3j70mL03n0l22L11j0r1Q7n5j22M8Q4j58M9q4J18M2L42r3k6k35J28
7618I9L1j13q5M1J66k33k08K81J40J4k85J08M7O6j41K91l76K50k29L06P1j73L42
$$ y = [-39, 161, -53, -271, -73, 63, -277, 59, -16, 283, 215, -51, 108, -16, 127, 84, 20, -7, 24, 156, 300, -57, -26, 80, -100, -57, 36, -132, 34, 47, -119, 160, 72, 62, -25, -259, -153, -209, -196, -153, -19, 9, -167, -14, -72, -148, 143, -89, -85, 211, 48, -89, 129, 169, -88, -181, 218, -123, -97, 115, 88, -98, -100, -152, -28, 13, -43, 249, 160, 94, -64, -31, 174, 175, 39, -204, -59, -77, -21, -357, 126, 11, 155, 71, -398, 225, -73, 179, -44, 51, 170, -114, 47, -434, 66, -16, -8, 266, -72, 68, -50, -65, 173, 61, 323, -141, 69, -23, 425, -30, -52, 232, 167, -45, 3, 61, -119, -293, -42, -138, -161, 70, -19, -31, -70, 138, -183, 8, -53, 94, -219, -103, -50, -184, 75, -238, -88, -23, 138, -44, -83, 70, 7, -163, -167, 136, 86, -236, 75, 65, -26, 61, 6, -116, -68, 16, -142, -93, -177, -59, -17, 325, 232, 206, -29, 99, 130, 17, -68, -27, 139, -94, -302, -21, 119, 133, -152, -44, 3, 69, -72, 219, -157, 93, -136, 170, 241, 68, 410]
7641D10o18K04j19Q8J47j34j76L32j56K57k75J5M9j23N7M6j1j8o4Q5LJ68l28K16
7665E5k20J12M3M5r5j01J84L05k13l43K47j37q8K18j58J06j32l7k2K65o3J9N5
7688D5J00k98J70qq5L1j04M34j00l5k89K8L10j58j06J25km70M17j7M3L1p2j13
7712a23j3R0k0J31j35qj8j31M87l66L93k96o7J34Q3j73K4J78l17j07K67q9k39
7735c15L90j28q4J32q6J56q6L05k30o3J51q7O8k54nk6J56l0nK62n03K80m0j86
7759b28J55m4O9K50p8j89J15k43OJ42j45L42k27K36n7j63j78K88j73j30K07m0
7781h5J51K8l3l44K57Q3j7J30n0p2K0j7J33r1r2k7p0L70k35j54J90q3L20j40m71
7806b99K64j05K71J06k54o9J89j80K62j54R6J14j75M3l30J31k39M22l10K02K25
$$ y = [410, -208, -4, -123, -35, 112, -22, -198, 134, -22, 235, -40, -25, 24, -99, -42, 4, -7, -25, -89, -4, -1, 167, -161, 55, -165, -53, -10, 35, -60, -161, 23, 328, 115, -228, 19, -118, -206, 12, -146, -40, -172, -209, -231, 34, -29, -10, 45, 145, -153, 17, 9, -76, -45, -149, 285, 185, 150, -139, -111, 199, 41, -65, 60, 58, -412, 5, -12, 31, 62, -10, -123, -136, -46, -66, 65, -70, -78, -96, -227, 260, -106, 287, -9, -76, 58, 141, -32, -8, 170, -147, -254, 13, -76, -315, 75, -53, -137, -5, -91, 65, -21, 284, 54, -9, 142, 55, 123, -131, -136, -162, -6, -36, -41, 221, -282, -2, -42, -228, -73, -117, -48, 202, 124, -65, 50, -193, -187, -45, -190, 152, -75, 161, 104, -59, -237, 51, -122, -252, -45, -85, 66, 94, 61, -283, -26, 57, 40, 170, 120, 48, 68, 51, 184, 93, 1, -26, -96, 274, 39, -115, 75, -8, 312, 172, -299, -35, -140, 131, 237, -17, -86, 103, -77, 185, 31, 127, 241, 66, 109, -221, -90, -329, 93, -217, -15, 210]
7827B10r9k05j87M84m0k82P0O1k57L10j14l1M40m71j14Q0R6k92J82J57o3r2L2
7850a25N7R0k1l0q4K29k48N5j59K55j28J68j24j67L43j41K03k19K51k27J3r0M8
7873e1l4R7KJ22j18p4L6L9J93r7k52J7J09J17l5O6r1j40J20L66n11j70O5K46J13
7898A35m2Qj08K43k99L49k79J9J08j18j47n1L5N2J4O1P4m3R2j76J14M7M5k27k46
7923c40L81J40k82J26o4N7n4P0j76K94j59j29J09q3N3N8M1rj33J11j86K52r5J75
7947A57j85l78M35Q5N6k24J5k5J72k20J41R0j22O6j59P4rK30k99N8M17m84M4r3
7971a58J45Q1j04J42j13Q7k18K24M7l17J88l8J96J60l47J64r6J22L0l6k55N1J44
7994I9k38L60l45L38j33j34K07j17l0N9j44j00K37N6r5J10n0l71L31J7J1pk80
$$ y = [210, 111, -94, -281, 203, 163, -119, -49, 12, -245, 65, -49, -80, 360, -111, -225, -145, -49, -341, -159, -2, -65, -157, -125, -68, 22, 1, -29, -113, 116, -132, -77, -236, 19, -109, 59, -65, -232, 111, -30, 173, -46, 205, -22, -9, -99, -51, -85, 12, 14, 136, 18, -56, -20, 19, 212, 115, -137, -120, -11, 106, 71, 137, 46, -94, 26, 392, -119, -289, -224, 22, 135, 93, 101, -7, 236, -63, 286, 7, 26, 134, 16, -131, -182, -147, -95, -81, -20, 54, 11, 103, -73, 41, 88, 133, -94, -340, 41, 181, -101, 25, -39, 18, -36, 34, -142, 152, -7, -136, -27, -110, -57, 1, 42, 33, -100, 11, -175, 77, -18, 157, -28, -406, 29, 114, 170, -54, -39, -64, 108, -112, 29, 119, -3, 63, -96, -22, -31, 199, -100, -42, 375, -109, -65, -158, -13, 68, -36, 106, -7, 80, -138, 86, 133, -184, 4, -34, 162, 322, -25, 139, 43, 165, 195, 159, -96, -45, 99, -139, 221, -124, 214, 81, -53, 154, 37, 7, 66, -78, -178, 59, 115, 20, 130, 80, -291, 40, 57, 68, 61, -219]
8017b19K27M53l28l62N0J05K5K1q1M65m59K79m91L03k45K93l8J02j40p3K25j62
8039e0R4j35l8k0M86n34J54J07l34K71o2m7R3N0K9p5J49j69J41l67M14k81j47
8062b71J83L53j97K21r8k34R2J01rj94J19R9k31P7O3k13J67j76K37J58o0k0l05
8085a38J24o3j31L25j52m7j42K66j07Ql4K19k7j88J16kk30K0K65r7R8P0k9l11
8109a87K77j28L1k31K34q6J06j92m0K25j63k3K2j9p9K41j62j30K94J14k53J36
8131a3L66n09j11M06o5p7M9L9K48l82l3L21k99o3K99k92m9P3k6K00P7k7p9k98
8155b45K48j24P1K7M7q4J18K37k58J9J18q8k50J77J97j63l8r1J3K32l5J07j81
8178E4k43K66k08J05K29m26K06J44j36l6N7p9j16
$$ y = [-219, 8, 461, 133, -229, -179, -74, -49, -28, -109, 356, -103, 176, -315, -12, -257, 36, -2, 100, -40, -113, 112, -50, 44, -91, -129, -149, 337, -197, -43, 64, -270, 1, -61, -108, -15, 35, 64, -11, 138, -31, 110, -257, 157, -124, -271, -88, 265, 68, 289, 191, -43, 49, 150, 141, -53, 66, 165, -66, 11, 74, -139, 28, -148, 89, 247, 187, 167, -138, -14, -77, -208, 117, -35, -82, -224, 42, -65, -57, -91, 128, 101, -87, 29, 27, -203, -183, 82, -15, 83, 153, 124, -187, 90, -38, -7, -238, -4, -90, 16, -176, -216, 9, -154, -177, -155, -174, -253, -12, -174, -304, -10, 104, -149, -13, 353, -156, -267, 139, 74, -3, 46, 85, 333, -49, -82, 239, -60, -123, 176, -116, -165, -92, -118, 82, 159, 132, 53, -245, 3, -121, -50, -23, 24, -60, 58, 295, 37, 56, 174, 86, -164, 13, 210, 47, 9, -82, -69, 163, 128, 235, 54, -189, 77, -131, -26, 203, -223, -17, 127, -9, -45, 12, -67, -183]
8191a83
$$ Imaginary data points
##PAGE= N=2
##DATA TABLE= (X++(I..I)), XYDATA
0@%%%%%%Qq%qJ6j6J6k4L2m0M8n6P2q8J04j24J44j64J96k32K64l04L52m04M60n21
32b77N92o70P54q48R51j061J183j322J469j626J801j993K203k430K678k952L254
49A706l584L944m345M794n295N857o492P220q064R052j0226J1651j3425J5697
63H490j8713K2914k9176L9445n9019J08558m51237o61944J520712L86562j283007
74d16415k34209R43688J13286n19498j30653J47944J71377K26508k63016n20516
84d81504L17174P53466l63887q70453L82642R01950m07757q22381L88167O78921
94D76338l11633m89897J61302L01919K7140j21435k32495q015M15031O1211n37818
105b58352k5591N62168n2674m87917J30124L30850j68286j10090J53578j42085
$$ y = [0, 0, 0, 0, 0, 0, 0, 8, 0, 0, -8, 8, -8, 8, -16, 16, -24, 24, -32, 40, -48, 56, -68, 76, -88, 108, -124, 140, -164, 188, -216, 244, -277, 315, -355, 399, -449, 502, -559, 624, -698, 771, -855, 946, -1047, 1156, -1274, 1404, -1548, 1706, -1878, 2066, -2279, 2515, -2780, 3077, -3415, 3805, -4259, 4793, -5433, 6218, -7207, 8490, -10223, 12691, -16485, 22960, -36059, 72499, -378738, -1040682, 480030, 866592, -416415, -650624, 293064, 406350, -113148, -243801, -95857, 75520, 302028, 39012, -481504, -164330, 589136, 225249, -645204, -262562, 639388, 231631, -590750, -202583, 476338, 164705, -325192, -163890, 138029, 165169, 43734, -188761, -196776, 218255, 279466, -258352, -283943, 278225, 225551, -262366, -132242, 198608, 30322, -79768, 73810, -68275]
115f8275p6082L60752m0939m87700J57051N16636k37499m83630K88327M12216
125C40857l17480k96108L15346J24171k61287Q5336J52241k92470L068M53651
135C07325j88085n34017L69307N18649n01324m28700N48739L03827n08833j76151
145b89263L96974O1996k35436J9780M9620n5202J20967M6849k49621j6617L31385
156A81432k0054l75846N9114L75829r6581l27376J18326K37332j12990j30225
166i1039Q1529K4966k6374O2670n4591j15611J48057J16155k24629o2400K54552
177A13285k1479k32379J09186J67543j79881p6905K20099k1430k21037J04751
187c8247J92140j56921j46773J77772R3047j71261k9585J35906l7858o5542R5860
$$ y = [-68275, -144357, 216395, 175456, -312244, -155193, 361443, 123944, -359686, -71359, 340857, 23377, -272731, 42615, 166786, -94501, -9165, 143076, -149394, -146326, 307325, 119240, -414777, -45470, 473179, -28145, -456845, 91894, 395721, -113112, -289263, 107711, 169707, -65729, -45949, 3671, -51531, 69436, 116285, -133336, -149953, 181432, 161378, -214468, -155354, 220475, 123894, -203482, -85156, 152176, 39186, -91039, -9510, 15456, -10918, 51752, -2839, -118450, 29607, 145762, -78867, -141267, 113285, 91806, -140573, -31387, 136156, -43725, -120630, 99469, 78039, -142998, -38247, 153893, -3028, -149801, 27971, 121018, -50243, -79828, 56078, 18220, -47322, 48538]
198D8538k8893j31208J30363J42990k24475j29880L02103R0163l42978l2528L32094
209A56289j6521k71005L6534J82454k3643q7769j3555J675O6949O6521j24306
220b6377j10983J72511J33210k00818j43129K10077J44629k08636j29855J90743
230C1372R9527j48295o6024Q3427M0228q378k7928o9605L2689J39184n7854j85035
242a36692R5413J92502j26893j65959J35177J20674j21691p1709R1903K4110m8082
253a1247J2069l760l0836M8751L3467p8110l1041R4605K6617j06671j3570J10320
265E0594j0240r7414L5184O9108n4755l0418O6087j4877o3905O2654M0017r4550
277d2515p95R8225l5339p7296N4962M6652n7772j2994M8197j8246k5123M0178
$$ y = [48538, 19645, -111563, 18800, 161790, -62685, -192565, 109538, 199701, -143277, -175805, 156289, 139768, -131237, -94703, 87751, 64108, -23661, -37216, -35541, 31408, 97929, -26377, -137360, 35151, 168361, -32457, -175586, 34491, 179120, -29516, -159371, 31372, 130899, -17396, -83420, 7, 40235, 31857, 3929, -65676, -32987, 106197, 48343, -136692, -41279, 151223, 24330, -141629, -6452, 114222, -7469, -79178, 12725, 36835, -11247, 822, -2938, -33774, 14977, 48444, -29666, -60707, 33898, 60515, -46156, -59726, 50594, 40354, -57060, -21876, 47232, -7523, -37941, 28146, 13269, -50636, 12018, 52035, -42515, -43310, 54915, 19576, -57720, -2758, 43894, -13878, -26872, 21325, 3079, -22044, 18134]
289A8134l594m7388K7045M6824m0316m7080N3091M5571o6331l5164P4574J7374
301D2740p0920J719N6285j6509l4159K8361K235k8066L4147R243o0676K1929O7367
314E3696n0014n8422O6618M2819p2097k4624O6415O728m9960L087K6913j062r929
327A68l864j799M921J4335n192l1280J0779M4991k2638n1772L4310N2088m5965
340i18m4980N5324K6713n4705k972L7426j3991j0855J6530j3886q841L0140k496
353A2489l9238J5047M0249k6777l1585K9784K1348k4656j6712J9770J5967j9797
365d111j1451K0172K228j4807O197O119j1250M342J3874j6722j0553K9938j349
378A2627l5413J8163K8754k8846j4116K8784J538k1658O800J2209j1035R4R719
$$ y = [18134, 14540, -32848, -5803, 41021, 705, -46375, 6716, 52287, -14044, -49208, 25366, 42740, -28180, -26461, 29824, 13315, -20844, 7517, 9752, -18314, 15833, 25076, -35600, -13671, 53696, 3682, -54740, 11878, 54697, -17400, -42024, 24391, 31119, -18841, -15754, 11159, 10097, 168, -3696, -5495, -574, 13761, 8569, -22711, -11932, 33059, 10421, -41351, -7041, 45047, -918, -45898, 9426, 36139, -18566, -21538, 15888, 1897, -8958, 7572, -6314, -15155, 14985, 12489, -26749, -11702, 28547, 1770, -29815, -31, 21317, -3339, -20051, -281, 15686, -4111, -15562, 4610, 6838, -7969, -1772, 4347, -6903, -2561, 11313, -5409, -15962, 13976, 12627, -22786, -4623, 24131, -4715, -18831, 9953, 11491, -10167, -3367, 8842, -2193, -2099, 7620]
391G620j0646k393J4565m207j1295L713R462J417j2709l476J6738J108j6973K884
405d192J3441o302o379R154n934p837K0439k011k8538J4424K6353k1223j9018
418a7623J8902J2412j1096r711R78Q420R455r911j8479J3277K0624j3111j8857
431a4720N507J7975N624k1608j4584K4910J9535k4349k3535K0671K5462j3993
443F895k5447J538K7565J2785l3496k3571M0919K6048m2284k3057L4816K0636
455B3347k1897j9475O788J8724J0475j9687k5526K2873L2917k0748l5445J1934
467a5720L8850J236m5748j1014N2461J5901n3457j7049M9358J5178l8642j1341
479a9987K1073J0502O69j4632j8637K0364K8227k0470l2184J2961L6861k575m1579
$$ y = [7620, -3026, -5419, 9146, 4939, -6356, -2643, 6819, 8236, -4473, -7949, 8789, 9897, -7076, -4192, 9249, 2947, -3432, 5722, -212, -8049, 12390, 10379, -18159, -3735, 22618, 1395, -17623, 1279, 13691, 2595, -7116, -6138, 2282, 11737, 1826, -16653, -3376, 17248, 4137, -14720, -9213, 8762, 14386, -7222, -21806, 3104, 22639, -1710, -25245, -4574, 20888, 6895, -18552, -17014, 10551, 23336, -10160, -33731, 7188, 33236, -9048, -32105, 2711, 23347, 1450, -18025, -11237, 7487, 17962, -1725, -27251, -4378, 28539, 7791, -27654, -15720, 23130, 24366, -21382, -32396, 20065, 35966, -17491, -34540, 14818, 29996, -8646, -19987, 1086, 11588, 12257, -2375, -21012, -648, 27579, 7109, -25075, -12114, 24747, 22172, -19407]
492a9407q751M5746K0438n0653k7241N3428K6191m9759j9442L6025J5033j8639
504B969j3802K592J1368J1078o727k2801k44L0836Q714l5059k1917M0106L6279
517D3392m8659m4912N5788M4500n7383l8310N1690K8945m1192j6713K4724L831
529E701l973M929j5382j0297K7182J7458l4394k9310M2290M2110n2106m9406N8227
542C029N2057o0694m8171N9366L7946n1975k3372L5316J2670j4664o797k293J485
555f097J3046Q274k0003k0301K6639L1278l0655m2664L5285N2899m0981n6678
567d9958M5250N2618m3797m3470L7359L4058k9709k3040K3215Q940j5427O102
579B141P002j8960j895L2988r44n0384O655O5503j5230p3086K3935P1938l0828
$$ y = [-19407, -28158, 17588, 38026, -12627, -39868, 13560, 39751, -10008, -29450, 6575, 21608, 2969, -10833, -8241, 3127, 14205, 7478, -15323, -15567, 15269, 23983, -11076, -32993, 7113, 43392, -5267, -50179, 5609, 50109, -7274, -45584, 6106, 35051, -6141, -22854, 1870, 5701, 1728, 6657, -8725, -19022, 8160, 25618, -8776, -38086, 4204, 46314, -5792, -55198, 3029, 55086, -5608, -53779, 5587, 43533, -8442, -31814, 3502, 16172, 1508, -5289, -7582, -6097, 6949, 15223, -4780, -25081, 1558, 32836, 2181, -40483, -5198, 47701, 6720, -49958, -4708, 47910, 4113, -39357, -1998, 32060, 2351, -20689, 2526, 11466, -3961, 2141, 9143, -9817, -11712, 21276, 20332, -30052, -23397, 42106, 26876, -46210, -22275, 49663, 18835]
592A8835o4314L6086N0108l6986l1046L0232J0195j8604P438Q892k3151l773L8553
605B2465r69n4318Q826O5062j6229p2196K1676P3450k4395o8518K3994N6823j9185
618A6486m3130J0120L2534k067k3455l456J2223N577K999q084j7939R660L1778
631B3246j0470m3973J1354N4113j3635n8983J5557N8743j3727n7489J1060N5085
643C0881q900m9296Q673L9930r104k8968J1509J6801j4257j369J4620j7404r343
656a6227L5247K92m5600Q609M8762j6150m5124K1583L8648k3715l0984K1403K4426
669B1170j7180j9317J5939J2775j7912k079J7809r119j3655J7331P794k3081j729
682a1254K5493m061k4151P973J8552p061j3212K511J0335K066j1093k196J0433
$$ y = [18835, -45479, -9393, 40715, 3729, -27317, 2915, 13110, -5494, 1944, 10836, -12315, -16088, 22465, 21496, -32822, -23996, 41066, 24837, -47359, -25683, 47767, 23372, -45146, -21152, 35671, 16486, -26644, -16524, 16010, 13943, -9512, -12968, -745, 4832, 7831, -253, -18192, -8532, 23246, 12776, -31197, -19843, 34270, 20635, -38348, -22791, 35952, 22225, -35264, -24204, 30881, 21981, -27315, -18642, 21288, 12184, -16784, -5275, 11526, -2731, -4100, 10520, -6884, -16227, 19020, 19312, -26288, -17679, 31083, 14933, -30191, -8608, 30040, 6325, -24659, -3256, 21170, 3990, -15327, 612, 13387, -4525, -6604, 11205, 2086, -11569, 5762, 13556, -9525, -11254, 14239, 10178, -13973, -6000, 12552, 5491, -7721, -5210, 5125, 7191, -3902, -6098, 4335]
695D335O7q855K178N784m961p81P995p066r478J4661O929j7520m060J6874K306
710H408j5550l683J6946M787j8494n012J8759L909j9359M78J8435p413j2701J1456
724I66L299r844N597M349r985J185J1149n179j0462Q656Q119r825m961Q214M003
739E281n189o366N420Q935p824q510R721O506r967m054R355J989o983j97K312
754D29R50K976n397m255R961J061j0038J010Q464j062o155K9L384K197k98o760
770c504o0J0694l068j1380N312R271l978p707M57Q146J123q363k389Q169L550
785F273q587m166Q659L380p171k356K752L451J145p415j360Q728J431r488j028
800e752R129R01q320m8M649J480j602m891Q54P868l201o682L713M955k219l862
$$ y = [4335, 4402, -4453, -2275, 3509, -1452, -2233, 5762, -1304, -10782, 3879, 10808, -6712, -10772, 6102, 8408, -7142, -10825, 6121, 10908, -7586, -12598, 6161, 10070, -9289, -8811, 9624, 2211, -10490, 966, 4265, -5579, 18, 4367, -5618, -4433, 6716, 1537, -8925, -269, 7850, -1975, -6936, 1278, 5281, 92, -6274, -854, 8081, 257, -8253, 1468, 7974, -1993, -6047, 3308, 5297, -1686, -1883, 429, 1379, 4355, -1042, -5297, 4664, 5725, -4313, -3303, 5161, 4099, -2056, -2027, 1357, 3554, 3256, -3504, -3564, 7130, 4062, -7318, -2006, 7265, 3287, -4420, -3963, 4183, 5306, -3057, -5446, 2723, 6273, -2314, -6480, 2179, 5559, -1612, -3968, -1216, 2235, 3380, -4035, -5395, 3333, 4764, -4724, -5752, 3377, 4278, -4042, -4090, 559, 2039, 437, -4454, -3600, 4268, 1067, -5615, -1902, 3053, 834, -3028]
816c028J094K096J483j057m160J524N909l878m825N584J383l279O16J94K44J440
832A340j350j678J626J819j998j037L026j383j675L648j737k128L305l63j849
847d34N53J019l34r7N06j742M65L206k795k157L758L92k934J174n08P57J568k898
865e01j419L951J004m644j51M504j478k687J815l59K59J347l291m24M620k026
881E20l091K127J606j717o93R20p1O22j91k448J561L180m058j431N013j196l688
898c035J777K324j938q04J106k40N34O21k374J2M033j719l477K783J536j072j021
915i54n96J823J918k803k366L799J758l757j284L727j97j237O60k218K074L645
931C992m569l030N837J777n321r21M553k38k806Q85N80l19J773j477j957K281
$$ y = [-3028, -1934, 162, 1645, 588, -3572, -2048, 3861, -17, -4842, 742, 2125, -1154, -538, -344, -100, 1340, -10, -1688, -62, 1757, -241, -1278, 1748, 365, -1310, 2338, 601, -1527, 1778, 1415, -434, 119, 1138, 804, 707, 1213, -529, -64, 3142, 347, -1810, 1948, 2340, -594, 580, 72, 829, 2397, -501, -1920, 2031, 3035, -1609, -1760, 2744, 1266, -1421, 394, 35, 294, 1641, -1650, -2074, 2546, 520, -2571, -444, 1162, -555, -1248, -328, -399, 223, 32, -2416, -855, 2325, -1733, -3164, 1849, 653, -3035, -1258, 1066, -872, -1676, -570, -810, -276, 345, -2029, -2017, 2016, 297, -3180, -397, 1139, 67, -954, -1550, 273, 2191, -612, -2978, 821, 2579, -1178, -2462, 1265, 1068, -169, 491, -1727, 347, 3992, -577, -3607, 2230, 4007, -1314, -2235, 2318, 2080, -726, 159, 739, 420, 2193, 716, -1241, 1040]
947A040R31j312j085j91K385L85l415O2L031j75l015Q14K180j859K21J893l606
964a716J15N755l927m349M742K597m834m59L479j436j778L897k355l554N265J677
980C119n690j665N413K367o014k842P530J346p227j83O584j270n420L784K383
995B215o209K570O353p438l680J0096Q99j0320J201R303j932q268L021N699k826
1010F84k481Q95J927N8j616K10M83m59J509M76k772j42K699J221l155k343L990
1027A184K965l077m541J894P410k634r745N675R408q184p078R089L260q903J067
1042b210Q189o573m775J0756N10j3331L782J3622o684j4418R451J4628j3021j2547
1056a2621J5168Q757j6190l764J5226j578j3443P865Q228j2419j195J3805m806
$$ y = [1040, 1971, 659, -426, -617, 1768, 2153, -1262, -1200, 1831, 1656, -1359, -545, 1635, -224, -3, 1890, -1716, -1601, 4154, 227, -4122, 620, 3217, -1617, -2076, 1403, -33, -1811, 2086, -269, -3823, 1442, 3119, -2571, -4236, 1177, 3544, -2470, -5312, 2218, 3564, -3663, -3846, 2738, 1468, -3952, -168, 2215, -3994, -1424, 4929, -2509, -6189, 3907, 4806, -5514, -4313, 4990, 3058, -5210, -2189, 3510, 684, -1797, -902, 1025, 1083, -533, -323, 160, -299, 1210, 1686, -1086, -1228, 1471, 2692, -463, -2806, 1184, 4149, 1072, -3469, -1575, 5835, 3201, -6544, -869, 8539, 355, -6723, 2366, 5626, -3277, -2210, 5979, -594, -5369, 5387, 5897, -7434, -3652, 9970, 3286, -11132, -1681, 12947, -74, -12621, 2547, 11304, -4886, -8650, 6576, 4998, -8445, -580, 7648, -4771, -5966, 7839, 3033]
1069C033j3109Q246J1396r890j0449J1582P856j0694n892Q640N046o740n640P321
1083G06L445o009j135M153q32k349K295J803l591j943N304K210p449k330R525
1098C803L290j2448l799J7380O80j9292M076J8467q857j4709J2260R883j4949
1111d215k663J5730n651j3484J1969J0419j6276p488K0013M320k3219K37K4310
1124A4002n543k2402J0130J8323j4143j2286J5984M862j5421L308J2231j0437
1136a392o728J3815J465j4244J722J3419l919j1960M680R645l188q366J081Q215
1150D245k28q322O68O927p71n428M79L765l71k661J264J764l175J1L950l48p200
1167e431K570J0810p027j2307J1891J1346j6445p441J9066J745j9020M322J6194
$$ y = [3033, -10076, -1830, 9566, -324, -10773, 809, 8665, -2029, -7921, 719, 5765, -975, -6615, 706, 4151, -1858, -2993, 1160, 328, -2021, 274, 2077, -1514, -3457, 1847, 4057, -3392, -5722, 3803, 7093, -5355, -9154, 8226, 8906, -10386, -6310, 12157, 3300, -11409, 851, 10734, -4215, -6878, 8852, 3201, -10283, 1686, 12105, -4171, -11659, 8354, 12674, -10545, -10308, 14002, 8459, -13943, -3813, 14510, 367, -11919, 4065, 8927, -6494, -3186, 9045, -1392, -8120, 5695, 7160, -7084, -5362, 8057, 4138, -7822, -3142, 6503, 3315, -5051, -3970, 4245, 4017, -4305, -3637, 3290, 2519, -2909, -2430, 1335, 964, -1697, -433, 1331, -1844, -1833, 2117, 1769, -5431, -2861, 7949, 922, -11385, 506, 11852, -4593, -12034, 7032, 8777, -10243, -5921, 10273]
1180A0273j0058j0016J4005K663j4814L576J3918q383j1750J2251R100j5676n508
1193a0419J7284J430j6021K647J3359o056r771Q904M812r881J432Q418o620m444
1207d926Q479J643r102J319Q335m034n838M705K498l485N54N81j755J835J948
1222B757l577j780N245J132p164J172O817l493n042N026K451o017J81O449l782
1237C75o041Q799K432j1593J909J1500n826r161Q660N882j1244j438J0960l018
1251B196q509O656M500q372j386R279j739r042N178P432q618l997J0150J4r046
1266e304L326P145o433m351Q769P0q863N005N941p390k630Q082l44p556L206O405
1282E078o030l404P183o75o094L567M483m787k853O143O15o588K427N675n218
$$ y = [10273, 215, -9801, 4204, 6867, -7947, -4371, 9547, 1164, -10586, 1665, 10765, -4911, -10419, 6865, 8295, -7726, -5079, 8280, 2224, -7547, 1357, 6169, -3712, -2280, 6138, -482, -4926, 3553, 5196, -3906, -2587, 5748, 1714, -4124, 581, 3079, -406, 148, 729, -1026, 809, 2757, -820, -2600, 2645, 3777, -3387, -2215, 4602, 1109, -3933, 1093, 3544, -2473, -2292, 4157, 375, -5666, 3133, 5565, -6028, -4119, 7381, 1555, -7606, 1054, 6936, -4308, -5746, 5214, 2196, -6313, 343, 4843, -3529, -4915, 4364, 2625, -6417, -1239, 6193, -2425, -6422, 3728, 3742, -5304, -1978, 5167, -1266, -5617, 3152, 3222, -5641, -636, 5305, -2085, -4715, 3367, 3023, -4533, -1327, 5078, -952, -4356, 2827, 2152, -3942, -375, 4108, -679, -3532, 2611, 3226, -3362, -935, 4740, -478]
1297d78l555O663O80o587K168O141n563l972Q570p88p916N066M613p376j283P890
1313D273j809o963M878M389o749j508P204j743n837L690M092m652k931N947L69
1328B650o182K509M954m799l047O379O86p503K024P742n531o098Q276J988q627
1343d579K332O631n091l770O177Q76o948L069N143n369k614O371r0n525J793M833
1359C239k939l794L814K256m460N7M203k600k692M126J211n306J276N712m066
1374C7m146O475J345p013J962N499m036l192N239K85m936K407L917m751j665N254
1390B681o06m421J973L573k575l094L641J929m387j62M238j951l500L796J806
1405B941m885pN498k787m540M756K433n587M29M858k752l392M196J147m539J002
$$ y = [-478, -4033, 2630, 3310, -3277, -1109, 5032, -531, -4503, 4067, 3279, -4637, 429, 5042, -2334, -3617, 4273, 2464, -4499, 379, 4768, -1981, -3489, 3715, 1972, -3865, -175, 3917, -735, -3666, 2281, 2650, -3532, -1023, 3931, -868, -3915, 2464, 3150, -4353, -2329, 5413, -118, -6216, 2060, 4048, -4579, -2247, 4384, -707, -4477, 1700, 2576, -4372, -1303, 3840, -1529, -4143, 2228, 2138, -3387, -1594, 3239, 300, -3494, 320, 2576, -1884, -1827, 2376, -224, -2916, 1210, 2421, -2885, -1609, 4103, 37, -4109, 2366, 3711, -3302, -1340, 4159, 123, -3069, 2170, 2455, -2481, -74, 3843, -908, -2573, 2681, 2075, -2346, -373, 3200, 625, -2469, 1172, 3101, -1286, -1448, 2790, 839, -2661, 1135, 2941, -1944, -1951, 3547, 760, -3780, 976, 3409, -2178, -1749, 3109, 357, -3035, 1161, 2308, -2231, -1229]
1421a229M035l039k822M295N66l809K11L369j000k937K188K006k910n29K717m59
1437F53k671J668J747k622j027M030j169l308K582J822l543L68L155j830j675
1452a820K495N52k854J224K029k576m40K291l36j670O65J405q08j638J691J422
1468A632k714K99K508j055k036J651K018k905q31L592j091k926K870J040k671
1483f19j90K225n22j967J625J179k197o8J990r10j144O99M32k3o74kP85q68J94
1502e5O51l63n97P76j03r02M0J262p53r24J663o90r56J386j84j476J068P43j301
1521g15n21J411M13j788P79Q13q35O7k00M69M30j139N65N42r74k91J046k2r51
1540i01J15K033j339j425J635P75j347k33R24L80o05j219J257J108j481m29J305
$$ y = [-1229, 2806, -233, -3055, 1240, 1806, -2003, -1792, 1577, 577, -2360, -172, 1834, -1076, -1605, 1112, 653, -2018, -350, 1397, -1225, -2252, 1778, 609, -2699, -117, 1705, -1838, -1470, 1685, -145, -1820, 675, 1227, -1627, -403, 1626, -950, -1390, 901, 565, -1105, -440, 965, 157, -1481, 210, 1632, -1082, -783, 1725, 670, -1366, 285, 2303, -602, -1433, 2159, 1068, -1858, 1012, 2052, -619, -809, 1416, 894, -1073, 552, 1731, -466, -534, 1456, 546, -598, 101, 533, 510, -164, -166, 619, -249, -55, 596, 233, -364, 412, 309, -593, -553, 709, -44, -968, 695, 5, -951, 435, 251, -1225, -157, 586, -715, -1236, 175, 588, -1200, -421, 392, -443, -376, -576, -107, 323, -816, -251, 291, -683, -974, 72, 50, -901, -786, 1247, -92, -1517, 118, 893, -454, -687, 237, 617, 12, -1207, 50, 1158, -323, -752, 553]
1557E53O93k078L55K422j718k071K620M88k364N33K403q71k045J144J395j169
1573B90j189J131J156q48j666J525J571k605o78K914o54k354J633J608k040j277
1589a483K428N83k420k07K533k33k506O4K507Q4l603J156L959k929k606L515J494
1606B336l921q05M131n18m346K586L387l655j991L648J384m094p18M386j25m469
1622b784J412M076k606l537L231K946l959j833M904l48m031J438L516k432k426
1637b433K765J711k815j377L613K81l108k00L454n79l734J126L635j669l269K652
1653E3K304k751j425L563J30l388M86L404q03l547J602L280k605k854L390K527
1669C366m603j121M838j46m905J157M922k985l667M211K299n020j024N250r83
$$ y = [553, 1246, -832, -477, 1945, 227, -1844, 776, 1264, -1100, -567, 1836, 965, -1080, 64, 1459, 290, -899, 232, 1388, 540, -1126, 399, 1970, -635, -1313, 1601, 947, -1407, 226, 1834, -206, -1483, 945, 1528, -892, -1099, 1434, 1201, -1305, -1241, 1266, 1350, -2253, -1097, 2862, -67, -2673, 842, 2336, -1585, -2390, 1741, 1223, -3123, -537, 2850, -805, -2796, 852, 2236, -1858, -2576, 1810, 1685, -2784, -1372, 2704, 98, -3439, -208, 2738, -1221, -3054, 1850, 1502, -2529, -1091, 2425, -7, -2433, 332, 2043, -772, -2149, 1464, 1745, -1363, -1563, 1891, 1312, -2422, -1296, 2339, 670, -2599, 53, 2357, -394, -1819, 1744, 1874, -1514, -1028, 2376, 1573, -1974, -372, 2908, 303, -2551, 839, 3366, -1237, -2358, 2480, 2334, -2571, -1414, 3508, 523, -3144, 1067, 3366, -1654, -2678, 2572, 1589]
1684A589l994J646L856k793l665M172J635m333j4M044r43m019J749L805l077k129
1700b471K989J119l061j78K533k68k104L29K316r97j514J036J455j492j043J079
1716b72J182j618o99K074j04j538K72J278K92j913j2K287k68k661J120K279j703
1733dk401L636J244m544R29L900k404l127L793J665m138j95L978r37l805K781
1749C71K420l364j122K980O21l039J20K881j202k613K375J734k610m98K560n09
1765A105k839J294K644k653j024L036p20k168J729L11j140J2J200r18p25J329
1781D73k71r58J130J23j154J42P21m02o50Q19O60j287l62J785n44j615J443J061
1799A114j832m68K030Kl001J782K641l085r76L421p79k858J436K715k852j428
$$ y = [1589, -2405, -759, 3097, 304, -3361, 811, 2446, -1887, -1901, 2143, 1200, -2819, -1070, 2735, -342, -2471, 518, 1637, -1424, -1602, 931, 663, -1441, -1112, 1204, 207, -1307, -271, 1184, -308, -1351, -272, 910, -708, -1407, 667, 563, -975, -703, 575, 867, -1046, -1058, 1229, 961, -1700, -580, 1699, -4, -2405, 1231, 2475, -2069, -1140, 2760, 356, -2771, 1022, 2687, -1451, -1646, 2332, 1395, -2410, 371, 2791, -573, -1695, 1285, 1906, -1133, -1013, 1868, 666, -1947, 428, 2162, -448, -946, 1614, 1105, -1734, -440, 2204, -449, -1473, 1563, 843, -1325, 404, 715, -425, -413, 787, -131, -856, 473, 202, -756, 374, 497, -657, -515, 206, -196, -846, -27, 633, -654, -1016, 769, 225, -1390, 53, 1114, -718, -1186, 844, 846, -2155, -373, 2268, -817, -1793, 1628, 849, -2009, -573, 2142, -710, -2138]
1815b138L514q4l412J920K136k186j361K449J48k017N33K127j227k086K111O79
1831A106j619m59K211k58k427J391J984k738k87K473m69k085J602R80j941N3J880
1848A397j120j628K308%j926R16J601j301j488J972J8j827P60J892j689o51J608
1865H42Nj890P80J278j218j104J859K34k115O74K031j536j490K380O0k386P61
1882h35K155j809j596K628N87k384L53J676p16j713J399J168j733K9J761p79j687
1899a496J375Q95j469m19J949k58j931J237J330k130J10J806q76j275J359Q54
1915A061j813L46J750j129j352J699L28j615M06J406p06j005Q80J051j434m19
1931e46J373l99j229J084J030j801j02J879n00j717J179J294k139J61J788q77
$$ y = [-2138, 1376, 1292, -2120, -200, 1936, -250, -1611, 838, 986, -1031, -498, 1629, 402, -1684, 427, 1106, -513, -972, 1239, 981, -1446, -55, 1929, -809, -1096, 1377, 908, -1177, 425, 1405, -536, -483, 1397, 277, -1351, 957, 957, -969, -53, 1548, 247, -1241, 731, 749, -1078, -318, 1574, -115, -766, 842, 847, -1043, -263, 1015, -203, -1307, 552, 786, -1329, -655, 1376, -160, -1650, 730, 790, -1596, -835, 1320, -489, -2085, 543, 1130, -1254, -901, 775, 59, -1654, -255, 913, -820, -791, 970, 191, -1496, -121, 774, -695, -1114, 835, 577, -1354, -117, 1213, -917, -807, 999, 123, -1152, 207, 1061, -752, -406, 1344, 215, -1137, 562, 890, -725, -319, 1087, 381, -624, 256, 1307, -127, -546, 827, 428, -801, 283, 1313, -488, -590, 1289, 789, -928, 251, 1545, -594, -433, 1355, 478]
1947D78j448J425N76j753R3J613q57j472J881L76j665K06J222l32j349J125N52
1964F71j207m97J843l81j799J338J315j970q09K234k54k157J433J587k202m30
1980a285K048m21j901J128J694k039l34J930l11j761R83R39j093n78J373J63j258
1997g23K91J173q34o28J186m7j053N59O47p39j027J987r5j727J158J097j673j64
2015f12J569p05j151J224Q96j557l71K020n82j953J661O42j578j45J665o9j943
2032i89O63J844j643o98J975p0j724L3J870j003j417J798L61j901P14J430j111
2049A32r83J255L98j757N64J144q48q45J169j4j009M97Q00p62k42P24N5j179Q02
2068i9N78q88l56J255j54j294N33J487j465r53J744N10k125Q51J549j471r03J862
$$ y = [478, -970, 455, 1031, -722, -629, 984, 127, -1345, 536, 912, -753, -547, 675, 343, -1006, 119, 671, -536, -1033, 810, 429, -1370, -32, 1283, -687, -1496, 738, 484, -1673, -240, 1347, -855, -1285, 763, 342, -1559, -431, 1263, -776, -1110, 820, 509, -1252, -269, 670, -423, -1001, 372, 535, -723, -432, 741, -93, -721, 465, 418, -635, -76, 571, -168, -1195, 792, 697, -1030, 128, 1225, -448, -612, 957, 252, -899, 325, 1221, -336, -707, 1313, 731, -1222, 439, 1081, -497, -642, 1023, 954, -989, -326, 1518, -125, -823, 1152, 1082, -642, -609, 1261, 258, -1159, 639, 1000, -901, -187, 1243, 132, -851, 404, 802, -955, -391, 753, -95, -940, 229, 215, -794, -297, 503, -259, -501, 223, 278, -901, -99, 479, -409, -765, 490, 336, -958, -425, 1062, -403, -1356, 388, 898, -1227, -376, 1173, -298, -1201, 661]
2086F61L30k176O14J713j088j114J366O05j564P8J304l39p70K98J037r77n31J131
2104E78j5p01l08P73l6p84O61L95n17p1O04m84J03J60n20K67L75l81k45Q48j92
2125E10j227O20R34r78m13J051M3r44p0R94j11j153Q33R18j233p64J642Q5j536
2144g99P2J779o69j744J685P73j691l36J621j01j557L40J570r42j238J264O62
2161F89j114m98J126N96j667Q3J485k62j747P91J499j196p14J011P98j648J6J688
2179I36o08r28J34J111l75j030O95J361j446p59J159O22j577K21J433j25j803
2196i79J000J119j481k13J159J59r17k92J167J9j091K61R32n32p73Q75N32r61
2214a6j135J634K83j629M06J250m52j108N98R18n40j156J025N42j050K0Q72L23
$$ y = [661, 991, -1185, -571, 1142, 54, -1060, 306, 911, -653, -575, 729, 390, -380, -82, 955, -22, -553, 578, 563, -138, -446, 327, 291, -493, 168, 563, 46, -25, 579, 95, 198, 358, -162, 105, 480, 99, -146, 702, 510, -717, -97, 837, -141, -554, 497, 540, -404, -474, 520, 409, -744, 89, 1007, -226, -990, 652, 737, -799, -727, 1052, 383, -1361, 324, 1097, -594, -930, 691, 590, -967, -627, 943, 1, -1237, 27, 689, -425, -923, 203, 799, -868, -785, 700, 438, -1309, -518, 981, -215, -929, 82, 880, -768, -752, 936, 328, -600, -466, 645, 270, -760, -65, 1296, -150, -909, 250, 872, -705, -484, 949, 824, -979, 21, 1140, -341, -554, 605, 764, -153, -445, 722, 741, -350, -89, 843, 311, -462, 413, 945, -16, -1151, 483, 766, -863, -457, 793, 341, -767, -169, 749, 209, -947, 78, 620, -430, -410, 462, 785]
2232G85j451j99J585m49j812J612J385k256l12J697J13j924R93J614j609j208
2248a436J651N47j717M89J083m1j696Q79J061j087p38R77Q44j230l81J211j28
2265B88j362R54Q03p51k17M90K4q60N69Q01o05m64J55L07j73K98k22L26n4n78
2285b71l10J061r9r56J84J098o62j075J585L88j390J65Q98l82r13P86J136j210
2303C3r55J744l47j414Q79J245j125j099J465J138k331O1J747o62j104Q41P93
2320I09j452l41J338J7j290Q92O72j303k20P86O48j165J75P41m98o54R63j7o36
2339d35K85M19n14J07L33l63n00M75K40l52J59M47k01m21O66j09q18L58J045r82
2359a61p80J298Q1j200K90J415r57p13R36O93j802M76J669j085j364J436P34j628
$$ y = [785, -666, -865, 720, 271, -1541, 71, 1456, -800, -1112, 585, 698, -1226, -233, 1381, -228, -1436, 215, 762, -955, -466, 617, 576, -1120, -241, 820, -267, -1005, -28, 816, -414, -795, 416, 288, -1074, -120, 683, -68, -285, 205, 229, -631, -62, 739, 134, -330, -175, 132, -41, 257, 35, 361, 307, -271, -581, 480, 381, -575, -391, 707, 45, -1030, 555, 943, -447, -282, 616, 234, -679, 107, 1243, 33, -922, 822, 475, -939, -60, 1185, 60, -1039, 426, 1564, -767, -706, 1041, 379, -725, 116, 909, -543, -884, 454, 471, -819, 73, 745, -558, -778, 8, 656, -509, -334, 407, -91, -745, 218, 201, -435, -150, 269, -245, -138, 195, -168, -668, -193, 47, -305, -146, 301, 100, -321, 345, 236, -582, -224, 821, -161, -941, 357, 438, -762, -472, 943, -14, -727, 209, 902, -900, -424, 1245, 160, -1204, 232, 966, -662]
2377f62R4J427n9j724R86Q88j344j25J086Mo73k42Q86m24n70P63K26o43q9J014
2397H19o90o28O41M98j177K14Q01o29k95J059m35o77O06J99p58J71J107j007p83
2416i64J243N23j604M83J294j123p14J189K87j055N4P45j99j177N81J280j164
$$ y = [-662, -568, 859, 800, -924, 62, 950, -394, -519, 567, 571, -102, -344, 542, 118, -452, 311, 537, -106, -195, 819, 129, -499, 142, 640, -537, -323, 478, -151, -446, 613, 178, -499, 107, 306, -452, -281, 826, -181, -964, 279, 802, -802, -319, 975, -148, -862, 327, 614, -441, -387, 358, 159, -1018, -437, 843, -321]
$$ [...]
8191a4
##END NTUPLES=NMR FID
##END=
