##TITLE=1H_Pr 5053-Et2
 200.13MHz, CDCl3,
 8 sc
 
 24.4.2025
##JCAMPDX= 6.0         $$ Bruker NMR JCAMP-DX V2.0
##DATA TYPE= NMR FID
##DATA CLASS= NTUPLES
##ORIGIN= UXNMR, Bruker Analytische Messtechnik GmbH
##OWNER= pz
$$ XWIN-NMR		Version 3.5
$$ Thu Apr 24 14:01:37 2025 Russian Standard Time (UT+4h)  she@DPX200
##.OBSERVE FREQUENCY= 200.1313
##.OBSERVE NUCLEUS= ^1H
##.DELAY= (6, 6)
##.ACQUISITION MODE= SIMULTANEOUS
##.ACQUISITION SCHEME= undefined
##.AVERAGES= 8
##.DIGITISER RES= 18
##SPECTROMETER/DATA SYSTEM= spect
##.PULSE SEQUENCE= zg30
##.SOLVENT NAME= CDCl3
##.SHIFT REFERENCE= (INTERNAL, CDCl3, 0, 14.3821)
##AUDIT TRAIL= $$ (NUMBER, WHEN, WHO, WHERE, WHAT)
$$ ##TITLE= Audit trail, XWIN-NMR		Version 3.5
$$ ##JCAMPDX= 5.01
$$ ##ORIGIN= Bruker BioSpin GmbH
$$ ##OWNER= she
$$ F:/spectra/data/she/nmr/H-C/1/audita.txt
$$ ##AUDIT TRAIL=  $$ (NUMBER, WHEN, WHO, WHERE, WHAT)
(   1,<2025-04-24 13:59:53.12 +0400>,<she>,<DPX200>,
      <created by zg, POWCHK disabled, PULCHK disabled
       configuration hash MD5:
       00 E9 B6 7A A2 85 ED C7 34 08 36 98 17 FE 4E 26
       data hash MD5: 16K
       7F 9E 97 01 A8 79 D7 FC E2 B0 07 74 92 5F 61 1E>)
$$ ##END=
$$ 
$$ hash MD5
$$ 69 B7 AC 2B DD 08 5B 85 EA 51 94 37 0C 87 47 6A
##$RELAX= 
##$RELAX= 
##$RELAX= 
##$RELAX= 
##$RELAX= 
##$RELAX= 
$$ Bruker specific parameters
$$ --------------------------
##$DU= <F:/spectra>
##$EXPNO= 1
##$NAME= <H-C>
##$PROCNO= 1
##$TYPE= <nmr>
##$USER= <she>
##$AMP= (0..31)
100 100 100 100 100 100 100 100 100 100 100 100 100 100 100 100 100 100 
100 100 100 100 100 100 100 100 100 100 100 100 100 100 
##$AQSEQ= 0
##$AQ_mod= 1
##$AUNM= <au_zg>
##$AUTOPOS= <>
##$BF1= 200.13
##$BF2= 200.13
##$BF3= 200.13
##$BF4= 200.13
##$BF5= 200.13
##$BF6= 200.13
##$BF7= 200.13
##$BF8= 200.13
##$BYTORDA= 1
##$CFDGTYP= 0
##$CFRGTYP= 5
##$CHEMSTR= <none>
##$CNST= (0..31)
1 1 145 1 1 1 1 1 1 1 1 1 1 1 1 1 1 1 1 1 1 1 1 1 1 1 1 1 1 1 1 1 
##$CPDPRG= <>
##$CPDPRG1= <>
##$CPDPRG2= <>
##$CPDPRG3= <>
##$CPDPRG4= <mlev>
##$CPDPRG5= <mlev>
##$CPDPRG6= <mlev>
##$CPDPRG7= <mlev>
##$CPDPRG8= <mlev>
##$CPDPRGB= <>
##$CPDPRGT= <>
##$D= (0..31)
0 0.7 0 0 0 0 0 0 0 0 0 0.03 0 0 0 0 0 0 0 0 0 0 0 0 0 0 0 0 0 0 0 0 
##$DATE= 1745488792
##$DBL= (0..7)
120 120 120 120 120 120 120 120 
##$DBP= (0..7)
150 150 150 150 150 150 150 150 
##$DBP07= 0
##$DBPNAM0= <>
##$DBPNAM1= <>
##$DBPNAM2= <>
##$DBPNAM3= <>
##$DBPNAM4= <>
##$DBPNAM5= <>
##$DBPNAM6= <>
##$DBPNAM7= <>
##$DBPOAL= (0..7)
0.5 0.5 0.5 0.5 0.5 0.5 0.5 0.5 
##$DBPOFFS= (0..7)
0 0 0 0 0 0 0 0 
##$DE= 6
##$DECBNUC= <off>
##$DECIM= 32
##$DECNUC= <off>
##$DECSTAT= 4
##$DIGMOD= 1
##$DIGTYP= 9
##$DL= (0..7)
0 120 120 120 120 120 120 120 
##$DP= (0..7)
150 150 150 150 150 150 150 150 
##$DP07= 0
##$DPNAME0= <>
##$DPNAME1= <>
##$DPNAME2= <>
##$DPNAME3= <>
##$DPNAME4= <>
##$DPNAME5= <>
##$DPNAME6= <>
##$DPNAME7= <>
##$DPOAL= (0..7)
0.5 0.5 0.5 0.5 0.5 0.5 0.5 0.5 
##$DPOFFS= (0..7)
0 0 0 0 0 0 0 0 
##$DQDMODE= 0
##$DR= 18
##$DS= 0
##$DSLIST= <SSSSSSSSSSSSSSS>
$$ [...]
##$SUBNAM0= <"">
##$SUBNAM1= <"">
##$SUBNAM2= <"">
##$SUBNAM3= <"">
##$SUBNAM4= <"">
##$SUBNAM5= <"">
##$SUBNAM6= <"">
##$SUBNAM7= <"">
##$SUBNAM8= <"">
##$SUBNAM9= <"">
##$SW= 18.0517328524113
##$SWIBOX= (0..15)
0 0 2 0 0 0 0 0 0 0 0 0 0 0 0 0 
##$SW_h= 3612.71676300578
##$TD= 16384
##$TD0= 1
##$TE= 0
##$TE2= 300
##$TE3= 300
##$TEG= 300
##$TL= (0..7)
0 120 120 120 120 120 120 120 
##$TP= (0..7)
150 150 150 150 150 150 150 150 
##$TP07= 0
##$TPNAME0= <>
##$TPNAME1= <>
##$TPNAME2= <>
##$TPNAME3= <>
##$TPNAME4= <>
##$TPNAME5= <>
##$TPNAME6= <>
##$TPNAME7= <>
##$TPOAL= (0..7)
0.5 0.5 0.5 0.5 0.5 0.5 0.5 0.5 
##$TPOFFS= (0..7)
0 0 0 0 0 0 0 0 
##$TUNHIN= 0
##$TUNHOUT= 0
##$TUNXOUT= 0
##$USERA1= <user>
##$USERA2= <user>
##$USERA3= <user>
##$USERA4= <user>
##$USERA5= <user>
##$V9= 5
##$VALIST= <valist>
##$VCLIST= <CCCCCCCCCCCCCCC>
##$VD= 0
##$VDLIST= <DDDDDDDDDDDDDDD>
##$VPLIST= <PPPPPPPPPPPPPPP>
##$VTLIST= <TTTTTTTTTTTTTTT>
##$WBST= 1024
##$WBSW= 4
##$XGAIN= (0..3)
0 0 0 0 
##$XL= 0
##$YL= 0
##$YMAX_a= 465158
##$YMIN_a= -449975
##$ZGOPTNS= <>
##$ZL1= 120
##$ZL2= 120
##$ZL3= 120
##$ZL4= 120
##$ABSF1= 10
##$ABSF2= 0
##$ABSG= 5
##$ABSL= 3
##$ALPHA= 0
##$AQORDER= 0
##$ASSFAC= 0
##$ASSFACI= 0
##$ASSFACX= 0
##$ASSWID= 0
##$AUNMP= <proc_1d>
##$AZFE= 0.1
##$AZFW= 0.1
##$BCFW= 1
##$BC_mod= 2
##$BYTORDP= 1
##$COROFFS= 0
##$CY= -3
##$DATMOD= 1
##$DC= 2
##$DFILT= <>
##$DTYPP= 0
##$F1P= 0
##$F2P= 0
##$FCOR= 0.5
##$FTSIZE= 0
##$FT_mod= 4
##$GAMMA= 1
##$GB= 0.15
##$INTBC= 1
##$INTSCL= 1
##$ISEN= 128
##$LB= 0.25
##$LEV0= 0
##$LPBIN= 0
##$MAXI= 10000
##$MC2= 0
##$MEAN= 0
##$ME_mod= 0
##$MI= 1.114404
##$NCOEF= 0
##$NC_proc= 0
##$NLEV= 6
##$NOISF1= 3.799351
##$NOISF2= 2.8
##$NSP= 1
##$NTH_PI= 0
##$NZP= 0
##$OFFSET= 14.38212
##$PC= 1
##$PHC0= -983.2616
##$PHC1= 2.192202
##$PH_mod= 1
##$PKNL= yes
##$PPARMOD= 0
##$PSCAL= 0
##$PSIGN= 0
##$REVERSE= no
##$SF= 200.129724274929
##$SI= 16384
##$SIGF1= 3
##$SIGF2= 2
##$SINO= 400
##$SIOLD= 16384
##$SREGLST= <1H.CDCl3>
##$SSB= 0
##$STSI= 0
##$STSR= 0
##$SW_p= 3205.1282051282
##$SYMM= 0
##$S_DEV= 0
##$TDeff= 0
##$TDoff= 0
##$TI= <>
##$TILT= no
##$TM1= 0
##$TM2= 0
##$TOPLEV= 0
##$USERP1= <user>
##$USERP2= <user>
##$USERP3= <user>
##$USERP4= <user>
##$USERP5= <user>
##$WDW= 1
##$XDIM= 8192
##$YMAX_p= 0
##$YMIN_p= 0
$$ End of Bruker specific parameters
$$ ---------------------------------
##NTUPLES= NMR FID
##VAR_NAME=  TIME,          FID/REAL,        FID/IMAG
##SYMBOL=    X,             R,               I
##VAR_TYPE=  INDEPENDENT,   DEPENDENT,       DEPENDENT
##VAR_FORM=  AFFN,          ASDF,            ASDF
##VAR_DIM=   8192,          8192,            8192
##UNITS=     SECONDS,       ARBITRARY UNITS, ARBITRARY UNITS
##FACTOR=    0.0002768,     1,               1
##FIRST=     0,             0,               0
##LAST=      2.2672688,     0,               0
##MIN=       0,             -449975,         0
##MAX=       2.2672688,     465158,          0
$$ Real data points
##PAGE= N=1
##DATA TABLE= (X++(R..R)), XYDATA
$$ [...]
1055e62N68N00n23n67RP37L66q15k17P96J06p11L2Q86n8j304L74J596n80j927
1075a294N14J948l67j796J03J760j43j690L73J008j85q92M32J165n98j199Q08
1092e3J262r16j142N38J121l93j026K17Q36l75o22N43R3m10j6N99J36p72m3P90
1112C67K1n60J95L13l01j61M10Qo21N1P02j59r18J18Q70j27o65K01O24o0r09L48
1134b53Q60n43n92P15O68p85q25Q31O22q66o01R30L18q49o9P14j42p16L7J061
1154E15j09r39L26P88k87p72L69N97j88o29K85N12n72m40N65L17m33n14P63K77
1174D31p58l40R89P4n35j9N79j56n14J40O28l67o60P10K60o25k54M29K56l70l72
1195d74N88J14n81O4P21k85l47k2O49j2p31J81N78j66o96K86M95l21o25M60N22
$$ plain form
1055 -562 6 506 -17 -584 -575 162 528 -287 -504 292 398 -313 -281 605 547 -757 -383 1213 633 -1294
1075 -1294 -780 1168 801 -995 -892 868 725 -965 -592 416 231 -661 -229 936 338 -861 -53
1092 -53 1209 293 -849 -311 810 417 -609 -392 444 69 -553 -10 83 -327 -343 256 392 -380 -423 367
1112 367 388 -172 23 336 35 -126 284 292 -329 -278 424 265 -653 -535 335 208 -457 -256 368 308 -601 -253
1134 -253 607 64 -528 187 855 70 -755 76 698 -168 -769 161 479 -370 -439 275 133 -583 -546 515
1154 515 406 -533 -207 581 294 -478 -109 488 300 -329 -44 468 -104 -544 21 338 -95 -609 154 431
1174 431 -327 -667 322 396 -139 -158 421 265 -249 -109 519 152 -508 202 462 -163 -417 12 268 -102 -474
1195 -474 114 228 -353 -289 432 147 -200 -222 427 415 -316 -135 443 277 -419 -133 362 41 -584 -124 398
1216C98m38p68Q89L67o38j87N32M04p20J4N40J7o91J31N33k43m50N1N46j05o86
1237e04J90O80m58k27K67K67l45o5K67L15m58k21O31l1n22J26L51Km89L2M09j36
1259H1m74K85L17j86l50L36K58l81k08M19K88m13k01L91J55l40j77M42K3m90j01
1280c26N61j45m48K40K97j9l78Q4L68j29l18L97J55l83l9K48J72l21l71N15J4
1301A74l65r7M09j32j82N5K38K0k58K2L89j60k01R4Q7Q3j73N1K06k85m2J53l2
1324E4k54J15J21j9j58q0L23l8k35K13O2j62R8j9J40j83k08L55Q5l50j02L38R6
1347A92k40j73J53J92j82j35K04o0l8M7J90q0o1j63L13L7k86J42Jk0j19lp4M6
1371a17r6K68l5j25J1J36N4j31R8j18J36m5K8R5k12jJ83j44Rj9p2J95l3o7o0L1
$$ plain form
1216 398 -40 -808 81 448 -190 -377 155 559 -161 -147 393 410 -281 -150 383 140 -310 -259 287 182 -504
1237 -504 -314 366 -92 -319 -52 215 -130 -195 72 387 -71 -292 339 308 -214 -88 263 265 -224 -192 217 81
1259 81 -393 -108 209 23 -327 9 267 -114 -322 97 385 -28 -229 162 317 -23 -200 242 265 -225 -326
1280 -326 235 90 -358 -118 179 160 -218 -134 234 105 -213 184 339 -44 -83 165 337 16 -355 160 174
1301 174 -191 -288 121 -11 -193 -138 100 120 -138 -116 273 113 -88 6 93 176 3 54 260 -25 -67 86 54
1324 54 -200 -85 36 17 -141 -221 102 64 -171 42 104 -58 40 21 161 -22 -230 125 210 -140 -242 96 192
1347 192 -48 -221 -68 124 -58 -193 11 -49 -87 -40 150 70 9 -154 159 196 -90 52 53 33 -86 -89 -163 -117
1371 -117 -213 55 20 -105 -94 42 96 -35 63 -55 81 36 64 159 -53 -54 129 -15 -6 -25 -97 98 65 -2 -62 -31
1397c1P3n7j20K50m8L9%o1j23K14j73J60K3j54j11K09n9l2j96L8K44j7k86oL86
1422A62j37m6JK26k50m0K32R2k08r2L0N0Q6l17O1K86Nk52k3K00J54k09k67K77
1446B1J95j95K9j08J71Q2k18J7J95j31l48K20J45q3k40N6L43o6k04J7K57r3k16
1469a54n0L58Q4m42J41J74J04l75R3J06K09k43l48M14K5r4k78J62K28j54k46L33
1491D7Q5k08J43N9p8j02j86J49K96k35o5L0J17N0r4l79L12J85j89m4J80J19j80
1514A2k64M25J03k90m9J11J58j61l79J83M86k98k73J14L33j86j53m0L41n4k63
1535a44j4L85o6k74J80K31o2m51J78K63j75k26K5K82n0j27r3j1K43o6j08N2J07
1558G9j98N8J11%k01J22R9qq6n7l6J51M5j44j14j3K84j5k56J47K47j08j96J99
$$ plain form
1397 -31 42 -15 -135 115 67 106 106 45 -78 136 -37 123 146 -8 -119 90 31 -1 -197 -159 85 68 -218 -224 162
1422 162 25 -21 -20 206 -44 -84 148 240 32 -60 -30 20 106 -211 -150 136 141 -111 -134 66 220 11 -256 21
1446 21 216 21 50 -58 113 195 -23 -6 189 58 -290 -70 75 -8 -248 -192 151 85 -119 -102 155 62 -154
1469 -154 -204 154 238 -204 -63 111 215 -160 -67 39 248 5 -343 71 96 2 -276 -114 114 -40 -286 47
1491 47 132 -76 67 126 48 -54 -240 -91 205 -30 -95 -65 52 102 8 -371 -59 126 -63 -107 73 192 12
1514 12 -252 173 276 -14 -63 48 206 45 -334 -151 335 37 -236 -122 211 25 -128 -168 173 119 -144
1535 -144 -158 227 161 -113 67 298 236 -215 -37 226 51 -175 -150 132 82 -45 -138 -149 94 28 -80 -28 79
1558 79 -119 -61 50 50 -151 -29 70 62 -24 -81 -117 34 79 -65 -179 -192 92 77 -179 -32 215 107 -89 110
1582A10J2j86j30M58j04k30j18L91Kk73j34K00J67k02j71K33J93l86M5J29K41
1603B47k85j61L13R5l39j2L97j02j94m3J26%j59J53Q7j97l2J52k6L4j61N6R9N1
1627I9r5R4o7p7R2K0p4j11J12J19j52j94K34J05k60kL16n3k32nL66l6m63K03L66
1652C05k44j99K4K53j08j41J38J56j67k38Q6L25j64k30J53L23k21j58J41K08k34
1673Hk07K85N8j84j11K24O6l87J53K12r7j61K8J20J04j81J88o5l7q2J17nj91K6
1697a19K99j5l75R4K94j74j73Q7J18o2j76J88J80j48k27J31L45k63n7K7L95k86
1719H3k64K54J89l47rJ88L4k10r7K78K3k61o7J69J84l36J04J55l0r5m6K28j11
1742A6j83J80J87l25r2K23J88k79n9L51k32j03o0L93j07k19J32J37j30k43J27
$$ plain form
1582 110 122 -64 -194 264 160 -70 -188 203 205 -68 -202 -2 165 -37 -208 25 218 -168 -123 6 247
1603 247 -38 -199 114 209 -130 -142 255 153 -41 -84 42 42 -117 36 123 -74 -106 46 20 54 -107 -51 48 99
1627 99 4 98 31 -46 46 66 -8 -119 -7 112 -40 -234 0 105 -155 -157 159 106 -126 -131 235 199 -264 -61 305
1652 305 61 -138 -114 139 31 -110 28 184 17 -221 -135 190 26 -204 -51 272 51 -107 34 242 8
1673 8 -199 86 144 -40 -151 73 139 -248 -95 117 20 -141 -113 7 111 -70 118 53 16 -66 51 46 -145 -119
1697 -119 180 165 -210 -116 178 4 -169 -82 36 -26 -202 -14 166 18 -209 -78 267 4 -53 -26 369 83
1719 83 -181 73 262 -85 -94 94 128 -82 -179 99 122 -139 -206 -37 147 -189 -85 70 40 -55 -101 127 16
1742 16 -167 13 200 -125 -217 6 194 -85 -144 207 -25 -128 -188 205 98 -121 11 148 18 -225 -98
1763i8K84j09k26R7J88j49j11Q5J77l37J08K04L7k31O3R3J77l74q7L15Oj53J2
1786b9K64j76j43j1L75j92k67J85K64l57k24M69N2k76j38K94J44l07j06M39j61
1807I9k91l3L90Q0l11p3K90Mk74K9K55j55r9j6L05j41k61L91J02k33k78L86O4
1830B30k32q0K31j20k00J19K84l14j37J16L35j79l60K74J90k46j14K12J68j99
1850b2j50J16K78k29k77L90J27l79m5K58P2j22j02J92m8k31Q2J21J02k89QK91
1872A43j3j73l1K14j60r2K00j00j31J03J38n1j79O0J87n8j71J27N7j4j50J34J53
1895A93j65k34L23J53k87j85K19M2q7j71J62K65j85k22J85J54j09j19J17l9r1
1916h1M2J16l3j37K3J6Q3m8Nj6O3q9J14k22R3J78Oj97k8J04J29k45k5J96P4j57
$$ plain form
1763 -98 186 77 -149 -52 136 -13 -124 -39 138 -199 -91 113 150 -81 -18 75 252 -122 -209 106 112 -41 -29
1786 -29 235 59 -84 -95 280 88 -179 6 270 -87 -311 158 210 -66 -204 90 234 -73 -179 260 99
1807 99 -192 -225 165 245 -66 -139 151 155 -119 -90 165 10 -89 -105 200 59 -202 189 291 58 -220 166 230
1830 230 -2 -82 149 29 -171 -52 232 -82 -219 -103 232 53 -307 -33 157 -89 -203 9 177 -22
1850 -22 -172 -56 222 -7 -284 106 233 -146 -191 67 139 17 -85 107 59 -172 -90 31 133 -156 -148 143
1872 143 130 -43 -74 140 -20 -112 88 -12 -143 -40 98 47 -132 -72 115 57 -114 13 70 56 -94 40 193
1895 193 28 -206 117 270 -17 -202 17 59 -28 -199 -37 228 43 -179 6 160 51 -68 49 10 -81
1916 -81 -39 77 44 -93 -70 -54 29 -19 -14 -30 33 -56 58 -164 -71 107 113 -84 -112 -8 121 -124 -149 47 121 -36
1942c6o4J43K00k84j60L71N9k52k26L55M0j49k44L17J27j53l14K50J72k40p0J98
1964D0J80q2l00R4K27j35k57J18J98Q2k62j04L33j3j73r1K92pj76l0K10Q8k25
1987Gj88J51K70k87j90K42J45j93k19L66J50l20k45K15J40J2j72R2J06k5j41m0
2009a24K80p0j68m3J97N6j92j49K41L2j28l9N5K23j37k76K19K42n3l10O9K23P0
2032B18k95qL63j15k68j55M73j5m40N9M44r0m28J27M82j75m40J09L10P3m17O6
2054a22K36j03j66j7J21J68k37l8K41O6k74rK11j8j14P0O8L0q2J3n6n4l2J41j33
2079i0J65M5j06j47M3J94j20j57P8L29l50n4R3P7j5j49J80J57n4l18Q0M06k19
2102F8l30J83L11j34k48J62J86k11k48K82K72k93j12J86J38m13O9J47N9n5r4j5
$$ plain form
1942 -36 -100 43 243 -41 -201 170 229 -23 -249 106 146 -3 -247 70 197 44 -270 -20 152 -88 -158 40
1964 40 220 138 -162 -68 159 24 -233 -115 83 165 -97 -201 132 119 -54 -145 147 140 -36 -66 144 232 7
1987 7 -181 -30 240 -47 -237 5 150 -43 -262 104 254 -66 -311 -96 44 56 -116 -24 82 57 -84 -124
2009 -124 156 86 -82 -125 72 128 -64 -213 28 60 -68 -107 -52 171 34 -242 -23 219 166 -144 -75 148 218
2032 218 -77 -85 278 163 -105 -260 213 198 -242 -183 261 171 -257 -130 352 177 -263 -154 156 229 -188 -122
2054 -122 114 11 -155 -172 -51 117 -120 -158 83 149 -125 -134 77 59 -55 15 83 113 31 44 -12 -66 -98 43 -90
2079 -90 75 120 14 -133 -90 104 -16 -173 -95 234 -116 -170 -77 0 -15 -164 16 173 119 -199 -119 287 68
2102 68 -262 -79 232 98 -150 12 198 -13 -261 21 293 0 -112 74 212 -201 -132 15 74 19 -75 -90
2124i0K19j35j7k9j8Q2p9L5OQ1k21K20M6k47J84Rj34Q6R4P9l73P9M42k06l56K06
2150c7K01j40l15K83K96k94j62L17J53m11j28L14J24k74j11J36K26r7k82J87J48
2171A34j14j67K23Q9k18j70K37J78k97J61R1q6j60J12J6Kj16J74P8k57n6J87k
2194C9j64J16J88j76j19L9K80k25k25J95R8m8j03P3J89j75l52K63L62k51l02L38
2216D0N1j48PJ15K08m32k4L20j67r8OJ42J21l38J15K01r3j84J71M2m6o0M4P1J
2241F5j22QK05k28q9J95O0j79K2J61k3j43J5K54j61j58L6K63j30k20Q6K25j50
2264hj17J41N1n7q9J12J27j16j36K44k7r3j21R4r9n4J16Q5oq2m7J31l3j49P1J92
2290A30k67N0O5J72j70j51J60J77k70j14L97p7j45j31J47P9j77N6J83j8k82J91
$$ plain form
2124 -90 129 -6 -23 -52 -70 12 -67 -32 -26 55 -166 54 100 -147 37 46 -88 -2 92 171 -202 -123 319 113 -243 -37
2150 -37 164 24 -291 -8 288 -6 -168 149 302 -109 -237 77 201 -73 -184 -48 178 81 -201 -14 134
2171 134 20 -147 76 165 -53 -223 14 192 -105 56 147 61 -99 13 29 31 -85 89 167 -90 -146 41 39
2194 39 -125 -9 179 3 -116 -77 203 -22 -247 -52 46 -2 -105 -32 157 -18 -370 -107 255 4 -298 40
2216 40 91 -57 -50 65 273 -159 -183 137 -30 -128 -122 20 141 -197 -82 119 26 -158 13 55 9 -51 -7 64 65
2241 65 -57 -49 156 -72 -161 34 94 -85 -63 98 75 -68 -53 201 40 -118 -82 181 51 -169 -83 142 -8
2264 -8 -125 16 67 10 -79 33 160 44 -92 152 125 32 -89 5 -94 -148 -32 53 47 -35 -82 49 16 -133 -62 130
2290 130 -137 -87 -22 150 -20 -171 -11 166 -104 -218 179 102 -43 -174 -27 52 -125 -69 114 96 -186 5
2312EQ8n4k08K35m8J18j19J2O6q8j33J98l3j92J80N3j0j09O7O4r9L3o8J78r2m9
2338ej8J38j60l8J26Q8k36j04L02K7k67M4K01m1j21l8J71N2l12J04K56n5r3j18
2362i7K05m2j55J39j1k0m1Q9p9qL5k9N0j07K9O7J8L0r1Mo1k1K5N7q4N2PO9m4q4
2392i8P3J12j10q3K03m1j43M5J04K6j30j26K82M7j59j31K28Q9j78j01L5J44l3
2415E5j53R1lp7NQ2J00p1qm5K20j94qp2O1P3j81l9J73kp3K8M6P3o3k7o7J17K9
2444G0j89P7J35l1j53K0J92j3r3j35J06J21k66J4J77j3L5k53K74k1m7J6m4J09
2468H8j14j83J79J54j54Ml8J74k03o8O3O4J6M7o0%M4l3rm4J70j67M1R1R8j93j27
2495a60J44J27j33j66J17K34j45j16J69o3O6j31K13r8r7O6PJ6M7n0j45J43J16
$$ plain form
2312 5 93 39 -169 66 18 136 17 29 95 7 -126 72 39 -153 27 80 70 -39 28 92 -7 26 -42 136 44 -5
2338 -5 -23 115 -45 -83 43 131 -105 -209 93 120 -147 -103 98 57 -64 -102 69 121 -191 -87 169 114 21 -97
2362 -97 108 66 -89 50 39 19 -22 67 -12 -20 15 -14 36 -71 -42 25 43 73 -18 -14 -75 -96 -71 -14 -98 -46 -39 30 -14 -98
2392 -98 -25 87 -23 -106 97 56 -87 -42 62 88 -42 -168 114 161 2 -129 99 188 10 -91 -56 88 55
2415 55 -98 -7 -10 -87 -82 0 100 29 21 -24 196 2 -6 -78 -17 56 -125 -164 9 7 -66 -38 8 81 18 -9 -76 41 70
2444 70 -119 -42 93 62 -91 -71 121 108 15 -120 -14 107 -159 -145 32 19 54 -199 75 54 7 23 -21 88
2468 88 -26 -209 -30 124 -30 -26 -64 110 -93 -161 -98 -34 -18 29 -31 -31 13 -20 -29 -73 97 -70 -29 62 160 -33 -160
2495 -160 -16 111 -22 -188 -71 163 18 -98 71 8 74 -57 156 58 -39 27 34 50 97 47 -98 45 161
2518A61j99k33L72k0j48p0J41O6l4K8q1n4L9P4qn9R1j3n6KJ89m62L03N8N9k66
2544a20j5K31q2j30k4J54L9r0j05J14J43j94J13O7j8p5j48K10J12k13p6J19Mk5
2568ij09J09O6j21k2P4J2l1M3L1q2J34j20P8P0j14O3o9p3J28m5j05N4n0K16r9
2594B9j59O7J14j13l3J63l2j47k2R3R0n1j31K30K7m02J07L87j15k02K3K7J03r3
2618d0k4J48j45mm2K20k25J65p4N2L4j24RN5q1Q2j07J42j18J1K48j77j50O0N2
2643c3L4j30J35N1j12j09K76Rk17l6K14J24k83r5L27j07j99N3J25M3j25P3jk0
2667cn9rN7J06j87P5J33o2j29j22K77p0j51J46L4l3j1j06K01r9j16K73p3j96K6
2692i8J88oj57J00L4j68O7J08n5j25mQ2QM2j07Q7J09k43J5J22J16j89M7J11K1
$$ plain form
2518 161 -38 -271 101 81 -67 -137 4 70 36 64 -17 -71 -32 42 34 -25 66 53 -3 -1 188 -274 29 87 146 -120
2544 -120 -135 96 14 -116 -140 14 53 -37 -142 -28 115 -79 34 101 83 8 -140 70 182 -31 -107 12 16 -9
2568 -9 -118 -9 57 -64 -86 -12 0 -31 12 43 -39 95 -25 53 123 9 72 3 -70 58 13 -92 -38 -88 128 29
2594 29 -130 -63 51 -62 -95 68 36 -111 -133 -40 50 -1 -132 98 125 -277 -170 217 102 -100 -77 -50 53 -40
2618 -40 -64 84 -61 -65 -107 113 -112 53 -21 31 65 -59 -50 5 -76 6 -101 41 -77 -66 182 5 -145 -85 -33
2643 -33 1 -129 6 57 -55 -164 112 121 -96 -132 82 206 -77 -172 155 48 -151 -98 27 70 -55 18 17 -3
2667 -3 -62 -71 -14 92 -95 -20 113 51 -78 -200 77 7 -144 2 36 3 -8 -114 87 -12 -128 145 72 -124 -98
2692 -98 90 84 -73 27 61 -107 -40 68 13 -112 -116 -34 -26 16 -91 -4 105 -138 -123 -1 115 -74 -27 84 105
2717A05j79n3K70j28j37L5J12j22k15K40K13m8k28R9P4q7j1J80j13O1j75J83J01
2740A77j55r1Q9p6m4Q2p3J45k29J18K29k64j13L24Pj41j14J01K46k85j09L57m6
2763A35k56J84L1L0j25j49K52k03L1q3J51O4j77jJ96pk19J66L9P5j72M8O7j65
2787h8L7R0Q4k14j2J59r7q5Q6J31j6j51l5L36r8j86M7K09j06k05J03K27k60j26
2811a70J89K4j42RJ15Qj24m3J3K74k30J35Q3k1k24P1R2N4p4j49J67J5j18J08L3
2836I5j27k4j1J10j69J9P2Q4k03J21J6m6m6K2J50O9k55J50J3mj13J46R1k01j58
2861a99Q8K40n2j80MJ29j50J44r8J85j35p3J47J40j98j00K13n7m4p6J35m5q4m4
2885a10Q9m0n9J11P8q6l9J16N5k3q2R7p6o7o9J86m8k16M9K29rk37L2J00Q2k09
$$ plain form
2717 105 -74 -127 143 15 -122 -87 25 -97 -312 -72 141 93 -135 -36 38 -49 -60 120 7 68 -107 76 177
2740 177 22 -69 20 -56 -100 -18 -91 54 -175 -57 172 -92 -205 119 126 -15 -129 -28 218 -67 -176 181 135
2763 135 -121 63 94 124 -1 -150 102 -101 -70 -153 -2 62 -115 -116 80 73 -146 20 59 134 -38 10 77 -88
2787 -88 -51 39 123 -91 -103 56 -41 -126 -40 91 75 -76 -111 225 127 -59 -12 197 91 -114 -11 216 -44 -170
2811 -170 19 43 -99 -90 25 33 -91 -134 -121 153 -77 58 141 120 -104 -33 59 113 39 -110 57 72 -46 62 95
2836 95 -32 -56 -67 43 -126 -107 -35 49 -154 -33 -17 -63 -109 -87 63 132 -123 27 40 36 -77 69 160 -41 -199
2861 -199 -111 129 77 -103 -99 30 -120 24 -74 111 -24 -97 50 190 -8 -108 105 48 4 -72 63 18 -66 -110
2885 -110 -21 -61 -120 -9 69 -17 -56 60 115 92 10 107 31 -36 -105 81 33 -183 -134 95 86 -151 -119 -19 63 -146
2911a46J17J48r2j61J27K52l16m6J25J25j11r8O7J6J9j34J21l0k7Q7pmp5nP4N8
2937H4j67J34j6k5M7n8r1J93Pj19J7j50Q6R4j21J46p2K9q2%l6J66j50L7J04N6
2963A13q4j12J74l7q3r3R0Q0N6j05k9L1jr6J59k9p7rN9P8j32j11R3J98j86J09
2989E6k8r1j3O7n2J36p7m1M7n1qoR8j10no8J55m6OJ84l21J51o6J94j13p1nP3m8
3018e3o6J43j8l1M7J7k0K7o3J13K4j27n8J61p5j19J15j40K90j14j04o6J55l3q6
3043h1Q8L3J0j33kR2J20j81K3L0R9j31N8j46J42j5l8MJ15l8p5m0J00K8j77P9J39
3070A03j7j08K1R0o7P6j10J7K0m1N4j42J12Kj17R5J2O3j8n7L4j1p1l6J33R0k14
3097h7r3O9J09J6r9P3J72k17l4P0J81k14K8J36O9j80n5P1L2j02J08%rN4q7mk5
$$ plain form
2911 -146 -29 119 27 -134 -7 245 -71 -117 8 133 22 -76 -9 7 26 -108 13 -17 -44 43 36 32 -43 -48 26 84
2937 84 -83 51 35 10 57 -1 -92 101 108 -11 6 -144 -58 36 -85 61 -11 18 -64 -64 -100 66 -84 -47 57 113
2963 113 29 -83 91 54 -29 -122 -32 48 104 -1 -30 1 0 -96 63 34 -43 -52 7 85 -47 -158 -65 133 -53 56
2989 56 28 -63 -76 -9 -61 75 -2 -43 4 -47 -55 -61 37 -73 -78 -146 9 -37 -31 153 -168 -17 -83 111 -2 -73 -78 -5 -53
3018 -53 -119 24 6 -25 22 39 19 46 -17 96 120 -7 -65 96 21 -98 17 -123 167 53 -51 -117 38 5 -81
3043 -81 7 40 50 -83 -85 7 127 -54 -31 -1 98 -33 25 -121 21 6 -32 -28 87 49 -26 -66 34 62 -115 -36 103
3070 103 86 -22 -1 89 22 98 -12 5 25 -16 38 -104 8 10 -107 -12 0 63 45 -12 22 11 -60 -96 37 127 -87
3097 -87 -180 -111 -2 14 -85 -12 160 -57 -91 -21 160 -54 -26 110 179 -1 -56 15 47 -55 53 53 44 98 11 7 -18
3124a8L9j73n0K56M3k02J33j0N6k02J14J14k3n2Q8j27j1P1l1l8L5O6j09q4J23
3149HJ0j32P8JJ47j77OJ3J63j05m6J02l5l3L7Pq3m5j9J37O4j50n5R7Kk3M5jJ8
3178C1q7Q5l2P1j22J19l7M0m0j6Q8j51J52q7q3n6J09l7P8j2l0R8M6k00J62p6K4
3205C7L5n4P8q8o7J3Q9j27J5J54K4k21l8K46r2M3o3Q3r1M3m8R2J7q7l8L2J16j56
3233e3rJJ34j31l1J57j00J3l3J15j33J96j08M6m0o0O5P6j91Q5l8R2p6KJ1o2J19
3260D7J47k02r4J54M1j43P5M2l9Mk0p5M6J62j22k2J19j30j0L0q9J22j53J37%p3
3286d6K5n8J10j2l0k7J36j21JnQJ38j46Q1p9r7M6J72k0j55J33m7M4j08j2j9Q8
3313@ll1L3j19J96j05R1m3j04K14j50L1j8M5o6Qj17J05J8k4L1N3p6Q7Qj7j06K7
$$ plain form
3124 -18 21 -152 -202 54 97 -105 28 18 74 -128 -14 100 77 25 113 -14 -25 46 15 -23 12 78 -31 -115 8
3149 8 18 -114 -36 -35 112 -65 -59 -46 117 12 -34 68 33 0 37 44 -39 -84 -103 34 98 -52 -107 -10 -8 -31 14 13 31
3178 31 -56 29 -3 68 -54 65 28 68 28 12 100 -51 101 14 -69 -125 -16 -53 25 13 -17 81 127 -73 89 13 37
3205 37 72 18 96 8 -59 -46 43 -84 -69 85 109 -112 -150 96 4 47 -16 67 -24 19 -29 63 80 -7 -45 -13 103 -53
3233 -53 -62 -61 73 -58 -89 68 -32 -19 -52 63 -70 126 18 64 24 -36 29 105 -86 -1 -39 53 -23 -21 -10 -72 47
3260 47 194 -8 -102 52 93 -50 25 67 28 32 12 -63 -17 145 23 1 120 -10 -20 10 -79 43 -110 27 27 -46
3286 -46 -21 -79 31 19 -11 -38 98 -23 -22 -27 -19 119 -27 54 -25 -122 -76 96 76 -79 54 7 51 -57 -69 -88 0
3313 0 -3 -34 -1 -120 76 -29 62 19 -85 129 -21 10 -8 37 -29 -21 -138 -33 -15 -39 -8 45 -31 56 64 47 -59 -32
3341c2K01j37n0k3K1M9K6j68J15JpL0N7K7j17J03j73J30k5Kj8O3Lj68Q4j14O9
3368e1P6M1j10K2J23l3j49J11K3q7R6j25rJ78o1m8N3l1j3j00K71j31j00k2O5M7
3394C6k4j41J15n1J25j6o9K5k1O6l8o4P4l5m8L6O4l4n0J26ql3o5o1J24N1j5l3
3422C6n2Q1mj1k5P8j55J32j29K1O8j16J7J52j94Q1Jq9J06j60J44n3N6J43l9m0
3448D9R9l6j52L6O9l1M9Lj32l0O7O0r3rP5m6L7r0J18k8m4J03j30O2mO2j00O9k1
3477A2J52r0q2m8P6j03J9J25k8j53O3Q9j38J70l0q6J25Nj32P2k8J3P2o6k3L3Q5
3504A04j62J32m9j03K79l8j36lK0j01J04J8l9l3P8k4j8m5p4Q6k1J8o3R6j49R0
3530c3R2j76N4L7k2m2J15j17K2m5P8L9MJj3jm9J33p2n2Q7KL3j31J14j14R0r3L0
$$ plain form
3341 -32 169 32 -18 -41 -20 29 55 -113 2 3 -4 26 83 110 -7 96 -77 53 28 30 12 75 78 -90 -6 -120 -51
3368 -51 25 66 -44 -22 101 68 -81 30 53 -34 62 -63 -72 106 45 -3 50 19 6 -94 177 46 -54 -76 -11 36
3394 36 12 -129 -14 -65 60 44 -25 0 -21 45 7 -57 17 -18 -66 -30 34 0 -50 76 68 35 -30 -91 33 84 69 36
3422 36 -16 65 61 50 25 103 -52 80 -49 -28 40 -76 -59 93 -101 -20 -19 -108 -2 -162 -18 -71 -15 128 89 49
3448 49 148 112 -40 -4 65 34 83 86 -46 -76 -9 51 -42 -51 24 -22 15 -75 43 15 -29 74 -56 6 2 64 -36 33 12
3477 12 164 74 -8 -56 20 -83 -64 61 33 -120 -57 32 -106 64 34 -52 73 78 -54 18 -10 3 75 9 -14 19 104
3504 104 -58 74 25 -78 201 163 27 24 44 -57 47 65 26 -7 71 47 29 -16 -90 -4 -25 -7 -70 26 -123 -33
3530 -33 59 -117 -63 -26 -48 -90 25 -92 -70 -115 -37 2 6 7 -6 -7 -56 77 5 -47 40 42 75 -56 58 -56 34 -59 -29
3559b9Q9o5L0l6pJ00p8o7P8l7N5K4j51R8Q7j02q9J60l2J1m4l8Q7j03N3J20n0q5
3587b1P2N4r0m1o5j3J20q2J95j12K5q5KK0Q9o3Q1r9J05mk1j43N8r0R0J4j8lp9
3616a04N4R3m5J8K4Kn7k3O4J8N9k6L6j67J15j3r2j8J0J38k00RK00j52M8j13N3
3643f9J06K5m2j25P1K9M2m7J6J40j40M8kp5n3l0J92j90O6J29l2q8N8j3j2M0r4
3670e0J2mJ32l9n%k4j7j7j4J8n9N6o8J16j0L0j2j57J35l1O1p2N5O1j47J55j01
3698DO0M9j15M3k3j99L07k13J15l0M8n7k5J9QJ63j78J05q6N8J6m4n8J18p8p5O8
3725@k4jn9J54p6K2m4m2P9l3l7O2M4j5j14o7K58m7j04R4p0J44l7j85P9n2J08q0
3753d3qL3qK0J03j71K2J22m0n5J9Q4k9nm5O1J0r5m8J1M4P3j00R5P7p3O9j86M0
$$ plain form
3559 -29 60 -5 25 -11 -18 82 4 -63 15 -22 33 57 -94 4 91 -11 -100 60 28 39 -5 -43 44 -59 -6 114 64 -21
3587 -21 51 105 15 -26 -91 -104 16 -66 129 17 42 -43 -41 -21 68 5 86 -13 92 88 67 -76 -18 -108 -18 -4 -22 -25 -104
3616 -104 -50 43 -2 16 40 42 -15 -38 26 44 103 77 113 -54 61 48 -44 -62 -52 86 -114 -105 95 -57 -9 -122 -69
3643 -69 37 62 20 -105 -34 -5 37 -10 6 146 6 54 52 -23 -76 -106 86 -104 -38 91 59 -29 29 16 4 44 -50
3670 -50 -38 -42 90 51 46 46 22 5 -12 -26 -8 -67 -11 -79 37 27 57 45 -112 23 -8 53 -19 36 97 -50 105 4
3698 4 64 113 -2 41 18 -181 126 -87 28 -2 46 -11 -36 -17 -9 154 -24 81 -5 53 69 25 -33 85 7 -68 0
3725 0 -24 -25 -84 70 -6 16 -28 -70 9 -24 -61 1 45 30 -84 -151 107 60 -44 50 -20 124 87 -98 -19 -71 37 -43
3753 -43 -51 -18 -26 -6 97 -74 -52 70 30 -25 -6 78 49 44 -1 60 70 -25 -73 -62 -18 55 -45 50 127 54 123 -63 -23
3782b3M9j07J19m9J15n2q3QKJ01p1l7Q7j46L0M8L6l6J05j04m1O6j00O7O4k6oJ03
3810A19j51p9J28J7m5O4j7n6l0K8J2l6N6p2J69k83L4J76q6J0R9J5m9jnmj21J12
3838DjL3J4L4j08J10l1j44J59k1n5l9l3K23q6j7j09J57k27J44N2K9j48K7m9N5
3864b7%K3J3m9P7N8j20R8n7n6L0M7j7m6K7M6m9o3J71r2J6Pn9k2K2J19j19j69J30
3893f1P9j05L3J65r1L6r5M7J30j85O3Jr4M3O5l3J1K7j6n5R2o1J78j57p3O4n7O3
3921A4ML8j54J01q4R8Mp0Q5j34PP1Nl1l9j6O3O2o7Q1k5q1K28n5j42J67j17L3o3
3950a7m8j9J82j90P0K0l2N3j9J8J2Rp1J4r5J84l3q0q3P1O2K9j80M1P0P0j0L2p4
3979a4J6k4K1Po3R2j42J36p0N2m2Q6j79L0J14%j23N5L3j5M0o8K0MJ70j9k7j19
$$ plain form
3782 -23 26 -81 38 -11 104 52 -31 -23 -21 80 9 -28 59 -87 -57 -9 27 -9 96 -8 -49 17 -83 -16 48 22 16 119
3810 119 -32 -111 17 34 -11 53 36 -20 -50 -22 -10 -46 10 -62 107 -176 -142 34 -52 -42 57 72 23 22 17 13 -108 4
3838 4 3 36 50 84 -24 86 55 -89 70 49 -6 -45 -78 145 59 42 -67 90 -137 7 59 88 -60 -33 -82 -27
3864 -27 -27 -4 9 -40 37 95 -25 73 16 -40 -10 37 20 -26 1 47 -2 -65 106 14 30 37 -22 -44 -22 97 -22 -191 -61
3893 -61 18 -87 -54 111 20 56 -39 8 138 -47 16 17 -77 -34 31 -2 9 36 20 -35 57 -4 174 17 -56 8 -49 14
3921 14 18 56 -98 3 -81 17 21 -49 36 -98 -91 -20 -15 -46 -85 -101 -38 24 -43 38 13 -68 160 105 -37 130 13 46 -17
3950 -17 -65 -84 98 -92 -22 -2 -34 19 0 18 30 39 -32 -18 -113 71 38 -42 -125 -54 8 37 -143 -102 -32 38 28 60 -14
3979 -14 2 -22 -1 6 -57 35 -107 29 -41 11 -31 55 -124 -94 20 20 -103 -48 -15 -30 10 -58 -38 -34 136 117 90 -29
4007b9J2O0L1j22N8j1N7o8N0q2Q6j13J06l2K6p6k4R9Q3r3JO1j5o1J0MJ02j09L0
4036D1m6N8J9o5l7K5jj4J7m1jL1L7l4j3J0JMrK0r9R5J26j16L5Q9p7r8N6o0j2P
4068e2N7K4r1j3J41n9J38j41o6R8K8lj05l3O8p0P5J7r2K04j21n5K4L7M8o0N1j6
4096C3n5k4L0J5J85k42J14J01j79j00J08o4J00L1q3K6J38j79J8m8l8J44p5J5J09
4121H0j00J49q2j29Q9N3J1n6J8j1Lo8m0M0L7N8kl6lR7j26m4P1L7l7M6j02l1J12
4150C4o7J24j04j42M0J92j15n3K24k04Q9j17j2K24j08M7l4J9o7L1r8J1O5J3L6
4175B8q3K0LJ59k06J03Pj18J25k6q0J35m8L9j6rk0J8j14j3RK0P9J5L2j43J32k5
4203B3m4J6m2R8O1q1q6N8l1L6K4j2j1k3M7Jj04K0J24j17J21j09rRl5K8O2j03J08
$$ plain form
4007 -29 -17 43 74 -48 10 -1 56 -12 38 -44 42 -71 35 3 29 -47 -71 28 111 18 19 80 65 4 14 18 120 11 41
4036 41 -5 53 72 7 -30 -5 -6 -20 -3 -44 -45 -14 23 -11 -24 -14 -13 -9 -18 2 -97 -2 124 8 43 132 55 -43 13 -47 -59 -52
4068 -52 5 29 -62 -75 66 7 145 4 -62 36 64 61 -44 -77 -9 -79 -4 13 -79 125 4 -51 -27 10 58 -2 49 33
4096 33 -22 -46 -16 -1 184 -58 56 157 -22 -122 -14 -78 22 53 -30 -4 134 -45 -27 -75 -113 31 -44 -29 80
4121 80 -20 129 47 -82 7 60 71 15 33 22 25 -43 -83 -43 -6 52 50 14 11 108 -18 -62 9 46 9 55 -47 -78 34
4150 34 -33 91 -13 -155 -115 77 -38 -91 133 -71 18 -99 -111 113 5 52 18 37 -30 1 -97 -86 -21 -8 28
4175 28 -55 -35 -32 127 -79 24 31 -87 38 12 -68 67 19 58 42 33 13 31 -83 -96 -87 -67 12 27 59 -84 48 23
4203 23 -21 -5 -47 51 112 31 -55 3 -28 8 32 20 9 -14 33 34 -70 -50 74 -43 78 -31 -40 -31 -66 -38 24 -79 29
4232B9l1O4m3l5Q2j15M3L0m4r2K47j77Ml1J07M8j79P9O4n9J5N3n3N5p4j1m1L0
4260c5L4k3o7J30np0L1oJ08j49J29j91J91r5M1k4P4n9R7j86RP9q9nO1M5r9O7j9
4289b6J72j58l9J76j77NJ03j39Q2l2R1K4j09P1o7K2K4p8r9J98O9l1r2k0N4j47
4315a23R4LJ06Qj09N0J2Rk6K1n2k1N4M2q3r6Q8N2j01Q4O7j31J14O7j32L6qN7j34
4344e2P6o8J8Q5p5O0r3Q9k1m2L4n9l8J20q0N8m4j6P8l6Pj02J41lo7Q1o0O2N5k36
4374a28Q2m2m8K32r5K2Q6lj00Q1j03L5RM1j17M9L8j10J03PL8j47rR0Q5j51L9q8
4402a04kP5N8l4NJ8P8j2m2j03R6n2l3N8O6j04P1o3P8p7M7j2j44K85j71P8m3k3
4430fP5l4j4q6L1R9P3j94Q4j0m3J03j41O4j24J0Q4N0q1J26j48Q1J7k0J04j0j56
$$ plain form
4232 29 -2 62 19 -16 66 -49 -6 24 -20 -112 135 -42 -38 -69 38 86 -93 -14 50 -9 6 59 6 61 -13 -24 -65 -35
4260 -35 -1 -24 -91 39 34 -36 -5 -11 97 -52 77 -114 77 -18 23 -1 73 14 111 -75 -66 13 -76 -81 -20 25 -74 -7 -26
4289 -26 146 -12 -51 125 -52 -47 56 -83 -1 -33 58 82 -27 44 -23 -1 23 -55 -154 44 113 82 -10 -30 24 -123
4315 -123 -29 -26 80 88 -21 29 41 50 24 45 -7 -28 26 68 -15 -111 -23 29 -72 12 79 -52 62 129 -3 33 25 82 -52
4344 -52 24 -44 -26 59 -16 44 -49 40 19 -23 11 -48 -86 34 -46 12 -32 -48 30 -6 1 -101 40 37 -30 51 -9 53 108 -128
4374 -128 -46 -88 -136 96 1 23 109 106 6 87 -16 19 28 69 -48 1 39 -71 32 39 77 -70 -79 11 96 -55 -16 -104
4402 -104 -106 -31 27 -7 -2 16 94 82 40 -63 33 -19 -52 6 72 -32 39 -24 54 -23 24 12 -132 153 -18 60 17 -6
4430 -6 69 35 21 -65 -34 65 138 -56 28 18 -25 78 -63 1 -123 -113 -29 21 -60 66 -82 -1 16 -4 100 90 -66
4457f6J01j33J4RJ03KR2n8o9M3k2M3j1p7l1J36j31P4j6j13J70j77K41j19QOk26
4484b07K10l8k0Q1l2n3OJ9k6qJ12k8p7J94j76O2q1M8J57j93J51j14R8p2lj53J96
4511E3J21k17L0NJ30r8kQ5p1j07J05L5q2Q5j87O4O3J34k10J2J46j17Nj5j4n6R1
4538a2N0j31J12p8J21k17J89J9p2O9Oj66R2O7j50L1M0J25j37M2P3r6m5M8qQ7%
4565E9j56J02k0l7N3Q5p6j43M4J02O0o2%M1j23M9K6j16J19P3j9r5R4o8L3p8Qm8
4593i3Q0J42j48L4k7p9%j7K9M2O3J7k3J8r2jJ18j01K56j43n3n2L7q8P9j01j5J14
4621dQ3j00l7M2O4o2qj6M0o5L6K6j1J7o6P0l7K9q6J56r7m0Q0j20MJ19Oj4o4jJ66
4652A10j45M1Q2j01l7J10j24M4M6m0Q3n1j1m6J09q1L2q9k2J35l7M2J2m9P3o2k22
$$ plain form
4457 -66 35 -98 -84 -75 28 30 122 64 -5 38 16 59 48 -29 -60 76 -55 19 3 -110 60 -117 124 5 13 19 -207
4484 -207 3 -35 -55 26 -6 -59 -53 -34 -60 -68 44 16 -61 133 -43 19 -62 -14 143 -50 101 -13 85 13 10 -143 53
4511 53 174 -43 -13 -8 122 24 22 107 36 -71 34 69 -13 72 -115 -51 12 146 -64 -52 94 -23 -18 -33 -47 -103 -12
4538 -12 38 -93 19 -59 62 -155 34 53 -19 50 56 -110 -18 49 -101 -70 -30 95 -42 0 73 -23 -68 -20 -28 59 59
4565 59 -97 5 -15 -52 1 86 10 -133 -89 13 73 11 11 52 -71 -22 4 -112 7 80 61 -34 60 -8 25 -53 -45 -93
4593 -93 -13 129 -19 15 -12 -91 -91 -108 -79 -37 26 43 20 38 -54 -55 63 -38 218 75 22 -30 7 -81 -2 -103 -118 -4
4621 -4 79 -21 -58 -16 48 -14 -22 -38 2 -63 -27 -1 -12 5 -61 9 -28 1 -85 71 -26 -66 14 -106 -102 17 23 9 -55 -56 110
4652 110 -35 6 88 -13 -50 60 -64 -20 26 -14 69 18 7 -39 70 -11 21 -68 -90 45 8 50 62 13 86 24 -198
4679a98P9J00j5m2O1m5J25l1kn1k0N4j1j02J43k2r8J14J2j33O0j4O3M3j1K0j09
4706c0Q7j27P7n3J18j57J2L3M5J9p1Q8R3j9m7q5q5O0N3p8N2n1j5K2J38k7l7O6
4734H1j46N3N2%Jpj13L4l3J8J28j84P1O3l9LO2j36K9M4K6O4pO9q8K4j33K6L2%
4764frl8OJ54m1r1L6o4K6n1N1J06j07J05j33O4L0n3L0r9P2j00J35p4J37j23J1
4791b6L4Rl5J2k7M0J7J7l0J3l5PK0J65j49k8l9j45Q2J31r6J19p0P8j5j64P4N7
4819A6q9J8J01l7q6Q2o6P4J0l9j0N0n1l3n7J08K2oJ1m0j0L4j7N9o5q7N9N3m2R5
4849E7j12M5R5q0k1O2o3O5j9kj25OK9P9K8j04Q7j12J01J08r9mq1J42lj12J6Q9
4877G2J8j78oM1J52j80j7J22j18P9j6J8l7R5r1N2o0O5M7p7Llj29K37j38L9j17
$$ plain form
4679 -198 -119 -19 -34 -76 -15 -60 65 34 32 -19 -39 15 4 -98 45 23 -75 39 51 -82 -22 -36 27 70 59 79 -30
4706 -30 57 -70 7 -46 72 -85 -73 -40 5 24 -47 41 134 115 68 -17 -102 -42 11 -67 -15 -66 -81 -59 79 52 15 81
4734 81 -65 -12 40 40 41 34 -79 -45 -78 -60 68 -116 -45 18 -21 -18 44 -92 -63 -19 7 71 64 133 45 69 -64 -38 -6 -6
4764 -6 -15 -53 -47 107 66 -25 11 -53 -27 -78 -27 79 -28 77 -56 8 38 -15 15 -84 -12 -112 23 -51 86 -37 -26
4791 -26 8 17 -18 -6 -33 7 24 41 11 24 -11 -4 16 181 32 4 -35 -180 -98 33 -63 56 -14 64 49 -115 -41 16
4819 16 -73 -55 46 9 -77 5 -61 13 23 -16 -26 24 -27 -60 -117 -9 13 7 18 -22 -32 2 -15 44 -21 -108 -49 4 -38 57
4849 57 -55 -10 85 5 -16 46 -17 48 29 27 -98 -92 -63 16 44 -60 27 -85 16 124 25 21 -60 82 79 -33 -17 72
4877 72 90 -88 -94 -53 99 -81 -98 24 -94 -15 -31 -13 -50 45 -46 6 -54 11 58 -19 -16 -19 -148 89 -49 -10 -127
4904a27R8J08n7J0l8p1PM6L0M5K5q1p7J22j13R9O2j1j05Q7n9Jq1Q9M2j83P9R6
4932D3m5J6J79k00Q0n1l6J14o3L0j38QJ03Q7p3L9nj52M3Rn3P6N5j43P9N4q7o3
4960i4J24l4J7j04J10p5J0P0O6j26N4r7P4rn4n7k1R8M6p9Q3nJ31k05J16L5j62
4987h8N8J2K6j40J25J09j73P1j2o6J4O5j5q6O6Kk1J24o6j30J24nP0j03J03r6J02
5014G0j40O5l7JMl5J31n3L1K0k4q7j1J97j72J15q5O7rM8j18j2l8J48r7jL1m3j3
5043d7PJ56j51J17n0l9l5P3pj1N5J1k8j6j14L4J00Oj03O8O7q3J0o1J19p9M4j11
5071f8J81j36J00o0L1j12K7LJ18l7j17O7L9J8j57J4Q5j12M9r8K71j75k7J67r1
5096b0N1LJ2rK0o6N5n1Jq9J30Q7j00m2P6n0M1j45J42nk6k9q3P4R2j00O4L2j2j05
$$ plain form
4904 -127 -29 79 22 32 -6 -77 -70 -24 6 51 76 -5 -82 40 -73 26 88 77 -28 59 0 1 -80 9 51 -132 -53 43
4932 43 -2 14 193 -7 73 22 -14 100 37 67 -71 -63 40 127 54 93 88 -64 -21 -12 -65 11 66 -77 2 56 -31 -94
4960 -94 30 -4 13 -91 19 -56 -46 24 90 -36 18 -79 -5 -14 -68 -125 -146 -48 -2 -81 2 -3 128 -77 39 74 -88
4987 -88 -30 -18 8 -132 -7 102 -71 0 -12 -78 -64 1 -14 -100 -34 -32 -53 71 5 -125 -1 -6 64 -39 64 -32 70
5014 70 -70 -5 -42 -41 -37 -72 59 6 37 57 33 -54 -65 132 -40 75 -10 57 48 96 -22 -34 -72 76 -21 -22 9 -34 -47
5043 -47 -40 116 -35 82 32 -7 -42 31 24 13 68 79 51 35 -79 -45 55 61 -42 26 93 10 20 -41 78 -1 43 -68
5071 -68 113 -23 77 17 48 -64 -37 -34 84 47 -70 -3 36 54 -103 -89 -4 -116 -67 -165 106 -69 -96 71 -20
5096 -20 31 34 46 37 57 -9 46 -5 -4 -93 37 124 24 -18 58 8 49 -96 46 41 15 -14 -97 -23 69 -31 33 65 53 -52
5126e2J05o3J00l7k1p5J5Q1j76K10q1J24j11n1n0L9m6J33p4n8J51n5o0M0R7o1
5152B4q3J11n6n9k8P7j2p3M4J41k8l5l8P2j72P9r6Q0L2O5j37Q9o2P5P0j31%J24
5180G3r7j06R9JJ14j19J54j49k5L3K2M0j95J25jJ12q2P5j34N9K0R2j97P1M0j1
5206A4K1J1l2n6m2P1O1q5J50o4q3M2j56K3J66p3k5R6o1k4Q4p7R2P4j75QJ65j56
5234c1jJ1LJ16j46P7l9j02J41r6Q0J7J0k0K9J4n8J0O4mj3k09K53k8j24R4k4r3
5262f9n2K81l13O4J30o6N8j03J03K7l5o0QJ92j22j6o1M6j0L3q5n8L2R8N9M1j13
5289IL4k9n8J1K9M7j0k4O4L1j76K3J8mPRJ6k2L0n1P6k1j8J07n7Q6j06P3l6o1n1
5320e4J60j96J55L8o9j23N2M3j5K3R0j93N2o9J20k0Qn1K0K6j2l1O9Jp0J04j93
$$ plain form
5126 -52 53 -10 90 53 32 -43 -28 53 -123 87 6 130 19 -32 -82 -43 -89 44 -30 -88 63 8 -52 -12 85 24
5152 24 -59 52 -4 -63 -91 -14 -26 -99 -55 86 58 23 -15 57 -115 -36 -132 -52 -20 45 -92 -3 -65 10 80 -51 -51 73
5180 73 -24 -130 -31 -30 84 -35 119 -30 -55 -22 0 40 -155 -30 -31 81 -1 74 -60 -1 19 111 -86 -15 25 14
5206 14 35 46 14 -42 -84 -13 48 -37 113 49 -34 8 -148 -125 41 -32 -57 39 -22 -46 38 -39 53 127 -48 -40 125 -31
5234 -31 -32 -21 -18 98 -48 29 -10 -112 29 -67 13 30 40 20 49 63 5 15 79 75 62 -147 106 78 -46 48 24 -69
5262 -69 -121 160 -153 -89 41 -25 33 -70 33 60 25 -35 -27 165 43 27 -34 12 2 35 -50 -108 -76 22 81 122 9
5289 9 43 14 -44 -33 -4 43 33 9 73 104 -72 -49 -31 -35 -28 -19 -3 -25 5 -46 30 9 -9 98 41 127 21 94 58 -3 -54
5320 -54 106 -90 65 103 34 -89 -37 6 -9 14 104 -89 -37 -106 14 -6 2 -49 -29 -3 -15 -46 23 24 -46 58 -135
5347a35K02j14N0M4p4K7p7M7O1l7QP5Rj58J10l9Rj50J42lJ16n3K5o6nJ04j52M7
5375A3qO6m0l6L9l9m9M9m1J40r7j12J47J4J0K7k7j68J77n5J0o7K2o0N9M7m7m1
5403f7p9J97k2K7m5j1K0M7j21J02J3j20J1j3M4P1L5k8J4j49N1Q1j3J2j26M3L0
5430DrN2MM1r0P6j98J29k0L9r0J05n9Q1jj17L3lq9N1R5j6K3j43J03j9P2j00M9
5459Cp7J2J38o0lM5m9M6n0j0o0O8O6Pl8j10J08oj8J7Kr6r5K45j13M7j07M5J3J18
5489H8q2J16j79J38j24J27j56l5R6p0M1L1k6J33j62p7J58m7K27j77K3j20R1P5
5513H9j07p2J92kj74J81j69J50j07J07mj13oL9OM8j16P7l4o8J33j9p4Q4Mp7O3
5540C1O6K9j19M2j06P4O1j99R7R0Qr3JON7k8rP4k9p2mN5L3j70J76o2L7j8K3k1
$$ plain form
5347 -135 67 -47 3 47 -27 0 -77 -30 31 -6 2 77 86 -72 38 -1 8 -142 0 -3 113 60 85 19 14 118 -34 13
5375 13 5 71 31 -5 34 -5 -54 -5 -46 94 -3 -115 32 46 56 83 56 -112 65 10 20 -47 -25 -85 -26 21 -26 -67
5403 -67 -146 51 29 56 11 0 20 67 -54 48 61 -59 -48 -61 -17 54 89 61 75 -74 -23 58 45 57 -69 -26 4
5430 4 -5 47 51 92 2 78 -120 9 -11 28 -62 43 -16 65 64 -53 -20 -23 -112 -61 34 18 41 -102 1 -18 54 -46 3
5459 3 -74 -62 76 16 13 58 9 55 5 -5 -65 3 69 76 38 -72 36 30 12 29 31 -65 -160 85 -28 19 -88 -43 -30 88
5489 88 6 122 -57 81 -43 84 -72 -107 -11 -81 -40 -9 -35 98 -64 -141 17 -30 197 20 43 -77 14 89
5513 89 -18 -90 102 100 -74 107 -62 88 -19 88 84 -29 -35 4 10 58 -58 19 -15 -83 50 31 -43 41 45 -32 31
5540 31 97 126 7 49 -57 17 78 -121 -24 66 74 -19 -18 -12 45 17 8 82 53 -19 -23 32 65 -105 71 9 46 28 51 30
5570C0M1n2l6o1R5J0%L6j25N5j6M1j4k6N2p1kl2J42k3m0j4K9p6K4L3q0J78j47
5599d9l7J13jl3L3%J4j29Q6K7k9Q6n7m7O3j9L9o2O3R1j02rm3j35J83Op4Qj11J86
5629F1o5lR2k0n3Q1o1Qn6n6O2l1j6n1P1P4L3j76R0j6J19j1p9k3Q0J5l5nm5p7n6
5660a49J08N0J7p2L3Rj9N6j71J40q5R0j55P7J39n0kk9J79k82K05n3K1l0r0P3j9
5687iQ2j53O0N1j25J08M2J7q9j1k1K1m8J59k0j63O2Q8n5j52K39r2k6M0o2J61k2
5714H2n3m8j4J3J26j46Q0J0o2O2q8L6J55j99M2j24O6KJ69j13l1N6j02P0n2N4K0
5741A1J21l8j12m5Q8KJ0q2j4J10l4R1j87P1M0N8k17P7l1R6J8m3J17j22n9J09m9
5768a4N0q2m0J76k9kr1p3K3O3r6J50J1o8j6L9M3m5L1MP9j62J46j18No4M3L4M9
$$ plain form
5570 30 71 19 -17 -78 17 27 27 63 -62 -7 -23 18 4 -22 30 -41 -43 -75 67 44 4 -10 19 -57 -33 0 -80 98 -49
5599 -49 -86 27 26 -7 26 26 40 -89 -3 24 -5 81 24 -23 40 21 60 -2 61 152 50 41 -2 -137 46 52 -22 -14 -125 61
5629 61 -4 -7 85 65 12 93 32 40 -16 -72 -10 -41 -57 -108 -37 37 70 -106 -16 -32 87 76 -3 -26 54 69 34 29 -16 -93 -149
5660 -149 -41 9 26 -46 -13 -4 -23 33 -138 2 -83 7 -148 -71 68 18 16 -13 166 -116 89 36 57 27 -63 10 -9
5687 -9 73 -80 -20 31 -94 14 56 73 -16 -27 -48 -27 -75 84 64 -99 -37 51 -4 -156 83 -9 -35 5 -57 104 82
5714 82 29 -19 -33 -20 106 -40 40 50 -12 50 -38 -2 153 -46 -4 -128 -62 -60 109 -4 -35 21 -81 -11 -63 -9 11
5741 11 132 94 -18 -63 25 27 37 -45 -59 51 17 108 -79 -8 32 90 -127 -50 -81 15 33 -10 107 -15 -74 35 -14
5768 -14 36 -46 -86 90 61 59 -32 -105 -82 -19 -115 35 46 -22 -38 1 44 -1 30 34 113 -49 97 -21 -16 -80 -37 -3 46
5797D6k3o7N2q5N5J4O1o8P7n6n1J42j58J26o0l0rNJ0N4rpj5j50J92M3L9j40J08
5826I6q3l2k4m6J38k6k7J77j08p9R3M6j20l9j2j8O8q0P2k2JK3L5Q1j71Q2MMj33
5855a00J45nr6J49l6L2k29J97l1qJ4n7K1q1L4Q1J23j90Q1o7m2J0j5P7k6J18j69
5882g0R5L3q5k1P4K9o1L6q4J6J39j47N4J8p4k8p8K75j44L6J39j94J0j1M6J3o1
5909d5M0P1k1j00J4L4J61o3j05Q2l7n9J22L8j49m2l4J42k1M8j19J09m7j01J30
5934D8j07l4J11l5J15j57P3lj23J15Q3L2q1M2oj21K9mK27k32P9r8%M0j31J91k2
5961C1O8p2j5NN2o3n5J38j16L3j04K20j09o9k2N0l7J04j51J39Ll5Pm5pnJ38l2
5989E1k7m0q2K1Q2o6L3m3J27r5L5o8J04Nj3p3M1MM7r6M9N0l1k6P3Rj40K8o7K8
$$ plain form
5797 46 23 -44 8 -77 -22 -8 53 -15 62 6 -45 97 -61 65 5 -25 -34 -29 -19 35 26 19 4 -146 46 89 128 -12 96
5826 96 13 -19 -43 -89 49 23 -4 173 65 -14 79 125 5 -34 -46 -64 4 -76 -4 -26 -25 -2 33 114 -57 25 29 33 -100
5855 -100 45 40 -56 93 57 89 -140 57 26 18 32 -25 -4 -85 -51 30 153 -37 44 -23 -65 -55 -70 7 -19 99 -70
5882 -70 25 58 -27 -48 26 55 -6 30 -54 -38 101 -46 8 26 -48 -76 -154 121 -23 13 152 -42 -32 -43 3 16 -45
5909 -45 -5 66 45 -55 -41 -7 154 91 -14 68 31 -28 94 132 -17 -59 -93 49 28 76 -43 66 19 -82 48
5934 48 -59 -93 18 -17 98 -59 14 11 -112 3 86 118 37 79 73 -48 -19 -23 204 -28 51 -47 -47 -7 -138 53 31
5961 31 99 27 12 17 69 6 -49 89 -27 6 -98 122 13 -56 -78 -28 -65 39 -112 27 30 -5 2 -43 -50 -55 83 51
5989 51 24 -16 -98 -77 5 -61 -28 -71 56 -39 -4 -72 32 37 24 -49 -8 -4 43 -53 -4 46 15 -11 62 71 -69 -41 -108 -80
6019h0K09j14j8K4m1MoJ63j38Q5l6j06O8l2L7o3J59j07k7np1J69o5O7o5Q0p0K9
6047E0J4k27O9J11O2m5p6K3O8k6j21J49n6o5O6K8j22O6L2kO9j05l9J27k0m9kM5
6075B4O2r2j2M6r1J13o5J56j20M9L1k4j50K00j48R8k16O4p6J94r1l8J16j10K3
6100e7L6M1m5KlJ08l0K4j04MK0oJ27n6o6nK6l1P4m4J09n4j42Q9q8N2L8%j2M1r1
6131d3J38j32J3k5J28j15O4L1m5j39R0N3m2n7J13l7l6O7n4r5J73r4k6K6Kj9J5
6158d6P8j20J23k7l6mK7p4J06j3M3r9k1r9K50p4P7r8J46j30l2p0N1M9j7L8qM2
6186F2j79O7J24j04N8Kj35N0K00j02J4j23J03L0j6p1k7Np1J36p7J00k1p1P5j20
6212i1K23j26j5Q3n4m9m7J33J0M2p6J23j34j7q3P9l2L4K5QJ6r3J40m9Ql3m5k6
$$ plain form
6019 -80 129 15 -3 21 -20 -16 -22 141 3 88 52 -54 14 -18 19 -44 115 8 -19 -24 -95 74 9 76 11 91 21 50
6047 50 64 -163 -94 17 79 34 -42 -19 49 23 -98 51 -5 -70 -4 24 -98 -32 0 -2 67 -38 -77 50 30 -19 -21 24
6075 24 86 -6 -18 28 -63 50 -15 141 21 70 101 77 -73 127 -21 77 -139 -75 -151 43 -48 -86 30 -80 -57
6100 -57 -21 20 -25 -23 -26 82 52 76 -28 -24 -4 -10 117 61 -5 -10 16 -15 59 15 124 70 -72 17 -71 -19 19 19 7 48 -43
6131 -43 95 -37 -24 -49 79 -36 28 59 14 -125 -35 18 -24 -81 32 -5 -41 26 -28 -123 50 -44 -70 -44 -42 -61 -46
6158 -46 32 -88 35 8 -28 -32 -5 -79 27 14 57 -42 -63 -162 88 14 91 -7 139 9 -23 -93 -42 7 -10 28 20 62
6186 62 -117 -50 74 -30 28 30 -105 -55 145 43 57 -66 37 67 51 -20 -47 -42 -113 23 -54 46 25 -46 29 -91
6212 -91 132 6 -9 74 20 -29 -76 57 67 109 33 156 22 5 -78 1 -31 3 28 36 52 -41 99 50 58 25 -20 -46
6240d6O4k7o9J95r7n8N9k6k8m5P3MPJ9Q6k30J14n3J7P1p3R3l8p2j0K1M5j59J60
6269cK9k8nN1K9J4j8j31J01K9m5O7%M0n0l5o3M6J1j14J64k3o1p7M2J25p8Q2o0
6298C9q3P8j18P7l2K8J8m7J00j18K7L1m1QJ5O2m9m8J5M9J28m7j47J8r2K02j43
6325g0J10k2J9M9k08K11o4k3N1q5M2l5j0N9m4P7P2l1j59J45k6j84J34m6n8J62
6351F6j13n0J61q7Q6l0j6n0O5r5l1L4O0Q5J3K2j22L6j4KM5j39J05J6K7m4M5j09
6379c2M1o5O8l5jN9j51J15J09j81N8O8q1P4p7OK7m5J8O5m5k1l5Q7p0P0n3l4J3
6408d8R9j3j5nK7JKj33J36j57J00K3n3J04m4n5n3p9J99mj93J77J5o1kL5N1Nj86
6437a27J60o3J0OJ07r1p4P8r4J94j34M1L3l4J1L1j16L1Q7PJ7l8j5l8J4%J20r8
$$ plain form
6240 -46 18 -9 -78 117 20 -38 21 -5 -33 -78 -5 -1 6 25 111 -119 -5 -58 -41 30 -43 50 12 -60 -70 -49 -4 -163 -3
6269 -3 26 -2 -7 44 73 87 69 -62 39 68 23 90 90 130 80 45 -18 28 39 -75 89 66 5 -72 -30 95 17 99 39
6298 39 -44 34 -84 -7 -39 -11 7 -40 60 -58 -31 0 -41 -33 -18 44 -5 -53 -38 11 139 92 -55 -37 -129 73 -70
6325 -70 40 18 37 86 -122 89 25 2 53 -32 10 -25 -35 24 -20 57 129 98 -61 84 58 -126 8 -38 -96 66
6351 66 -47 -97 64 -23 63 33 17 -33 32 -63 -94 -60 0 85 98 120 -2 34 20 22 67 -72 33 49 76 32 77 -32
6379 -32 9 -56 12 -23 -24 35 -116 -1 108 -73 -15 53 -28 46 -31 -25 2 -43 -25 40 -5 -26 -61 26 -44 26 -27 -61 -48
6408 -48 51 38 23 18 45 46 48 -85 51 -106 -6 17 -36 68 24 -31 -84 -163 36 32 -161 16 31 -30 -32 3 54 59 -127
6437 -127 33 -30 -20 -14 93 2 -72 6 -88 106 -28 13 46 12 23 54 -62 -31 56 63 80 42 27 -11 3 3 123 25
6465B5p5l4R0o0J24j10k2L3J19j58l8J55N%n5K4k0po4N9L4jm7o8J18k4j80J88
6493A1n9P5N6M5pj97M3J28j72P9J3P9o4q3N7J4N3j14P4m6J16j91O9J00j09L1j15
6520a14J40J7j92P5O9J0m8P5o1L0n1oQ3j24L9J17qj09J61j25l9P1l6J0J5M0Kj23
6548h2R9L8o9l1M6M0q9lL3K0M6o2J33j03n8L7K7o2O7j5o2R0r1N6N0k8j2k2O9q2
6578b0N0kk6Mk7p1J09J05n1l4o9j4k7J14r7O0L7o9K0j05J15k5P3q5L4m9l9J64
6606G5j26K10j97N3l1nL7N7q6k7J12j54J44l2Mj00J03q0J68j53MQ4R2j32p8oN5
6633iQ6O0j75L6j27P9p4N8J54n2m7O1mk06K45r5O6j53Q6j0K7J52l5j51J02m6l2
6660dJ4N0k3l9J2L5l6N6L8j31O5k8K2l5n6N7P5j05q3O0J62j08P2L5j55k9J18K1
$$ plain form
6465 25 -50 -84 6 -54 70 -40 -62 -29 90 -68 -106 49 54 54 -1 23 3 -4 -68 -9 25 24 -23 -91 27 3 -177 11
6493 11 -48 27 83 128 121 -76 -33 95 -77 2 15 94 30 -53 4 18 71 -43 31 -15 101 -90 -21 79 -30 1 -114
6520 -114 26 43 -149 -74 -5 5 -43 32 -29 1 -50 -56 27 -97 -58 59 51 -58 103 -22 -61 10 -26 -16 -1 39 41 -82
6548 -82 17 55 -14 -45 1 41 -48 -51 -18 2 48 -14 119 16 -42 -5 22 -40 27 12 -50 40 -51 5 55 27 15 -7 62 -20
6578 -20 30 28 2 6 -21 -92 17 122 71 37 -32 -46 -73 41 -56 4 41 -28 -8 -113 2 -23 50 -35 -1 -50 -89 75
6606 75 -51 159 -38 15 -16 -21 16 73 -13 -40 72 -82 62 30 34 -66 37 -43 125 -28 -24 60 152 20 -58 -64 -9
6633 -9 77 137 -38 -2 -129 -50 -124 -66 88 36 -11 50 46 -160 85 -10 56 -97 -11 -21 6 158 123 -28 74 28 -4
6660 -4 10 60 37 -2 10 45 9 65 103 -28 37 9 31 -4 -60 -3 72 -33 -116 -56 106 -2 70 105 -50 -79 39 60
6688F0j17M7j4m5L7M1j8qk0K9j8j02K14lj52J8N2K7p7LR1q6J8N2M9o1k6Q6k8n8
6718ik7R2j10L0P5r0J18o0K0l1J25j84N0J02j59J9P4m1N7q2J03j3k9KJ7q6%j4
6746e1J7k8N1O5k5L7j61P3J20p1o6k4l1R6q5J48q7J9m2J33m4j7n8n9J27m1J8k5
6774a1R0n6P4j94J14p6J75j87L1P9r8J11q5n0J07K3k6k3m3R3k2rM8rq9N5n1j4
6802d3L2P9m0p9N8r5MO6L3m4O3m4p0K13j07P6p0j05k2J01o5j3P4J6n1P2q2L6J10
6831A03r0R4r4j5L8j6L3j3j3Nj32N2j6L5N0o0K5P2l8m4R2j7j27J03j35L7Q6l4
6859a9PK6K2r9P4N9m9J18j35Q6J6j10J34k52J80m5q5L1O7K6j01P0J3n4J16j96
6885a00J22r2N9K7Ok3P6lp9j4J59j47q1j7P9M9N3j06L6j0n6P5N8k5k00J90j03
$$ plain form
6688 60 -57 -10 -24 -69 -32 9 -9 -17 -37 -8 -26 -128 86 83 -69 -51 1 28 -49 -46 45 -41 -23 29 78 17 -9 77 49 -9
6718 -9 -36 56 -54 -24 51 -39 79 19 39 8 133 -51 -1 101 -58 -39 35 -6 51 -31 72 59 30 32 49 -37 -37 -51
6746 -51 -34 -62 -11 54 29 66 -95 -22 98 27 -39 -63 -94 2 -83 65 -22 -3 -45 88 44 27 -31 -90 37 -4 14 -11
6774 -11 79 23 97 -97 17 -59 116 -71 -40 39 -59 52 -33 -83 24 47 21 -2 -45 48 26 17 65 56 -33 22 -29 -43
6802 -43 -11 68 28 -51 7 -88 -84 -18 15 -29 34 -10 -80 133 26 102 32 -73 -95 6 -59 -72 2 18 -33 39 -43 -7 103
6831 103 13 107 13 -2 36 20 53 40 27 32 -100 -48 -64 -29 21 -39 -14 58 20 -24 68 51 -76 27 -108 -71 15 -19
6859 -19 -12 14 36 -63 11 70 21 139 4 90 106 -4 130 -122 58 13 -72 -41 26 52 -49 21 34 -20 96 -100
6885 -100 22 -70 -11 16 22 -1 75 72 -7 -21 138 -9 -90 -107 -28 21 74 -32 4 -6 -62 13 71 46 -154 36 -67
6912f7R2r2J53j68J19q1jJ6nm7L5J7Nk5L4J59j35l2k0P3K0q1j6NO6n8Q7o4lk7
6942d1J1L2O5j25J21k4j66J84q6nN3k1J12r5R3j29KN3r0M5O6j57J42k1R3j6q0
6969A6O4jj31O3J7mL0k8l8N0m9j17N9J41j91J80l0j0p3K6l6Q4n1k3R3r2J2mn6
6998i9R0lO1M9j00P5J0q0r1jJ04O5j72J15O2j53N3pR1o0M4l5q6K6L1J23j16n3
7026e7Q0K7p3L4o5O8QN0l9p6L3L6J2%N6j01QJ9j60J49j4M8o2N2J4o3j3J5n7K6
7056d5R2j00J9k1J74%k9j78J39r9%J13o5q9O6O0Q4r0m7M5n5L0J2j3R4j69J44j41
7084f9L6ro1J30q5P9r8J58j72O9NR3j72J30o2L6n5N4L7l7K2nq1J6j6N8kO5j61
7113i7K03j20JKMn9J14L2p7j11R0L8k7Nn9J15Oo6L3O4j53Q4P7j31O5J8o7P0Rm7
$$ plain form
6912 -67 25 -67 86 -82 37 -44 -45 -29 -34 -81 -46 -29 -24 -49 -15 144 9 -23 -43 30 50 -31 -47 -42 24 -34 53 -11 -14 -41
6942 -41 -30 2 67 -58 63 39 -127 57 -29 -34 19 -2 110 15 108 -21 -19 34 -56 -11 55 -102 40 19 112 96 16
6969 16 80 79 -52 11 28 24 54 26 -12 38 -11 -128 -69 72 -119 61 31 21 -52 -26 -62 22 -29 -52 41 -51 -39 -43 -99
6998 -99 -9 -12 49 98 -2 73 83 3 -88 -89 15 80 -92 23 85 -68 -15 -22 69 9 53 18 -68 -42 -11 112 -4 -57
7026 -57 23 50 -23 11 -54 14 22 72 33 -43 -10 26 38 38 94 -7 1 20 -140 9 -5 43 -19 33 47 -16 -29 -14 -71 -45
7056 -45 47 -53 -34 -55 119 119 90 -88 51 -48 -48 65 0 -89 -23 37 121 31 -16 29 -26 4 16 3 97 -72 72 -69
7084 -69 -33 -42 -103 27 -58 21 -77 81 -91 -22 -17 76 -96 34 -28 8 -47 7 44 7 29 24 -57 -41 -57 1 -1 64 -97
7113 -97 106 -14 -13 -11 -7 -66 48 80 3 -108 -18 20 -7 -2 -61 54 60 -6 27 91 -62 22 99 -32 33 51 -16 54 63 16
7143A6r0J00r4P7q4pO1p2K02l6l2j19O2q5P8j45J94q9J43q3m1J8N7j5L6J16j60
7170HR9j09l0o7J48p5L3L1q5q5J22M5M0o9M1q8J31k03O8R4Qk5j9k5q7J50r2L5
7198fJ47j4p7N3j09J42j73qJ00q9L2K3o0qn3J96j25O0p4J19n6J0m6K1j00N7J51
7225A13p9p2kJ19p4L0qm0j6m5O0j9M7N8j61Q7RRj1n6K17k92J59n7J20r2j47K08
7253F5kr0qP6j8K1K7k23J71o4Q1j52Q1RK9j07J56m6N8o0O1q2j7J00k25K74j33
7280a8R5q1l3MK9n6J11j8l7NL9m9o7J89k8k9j08J15m3qj9m9P8Nk2J33o5M7q5p8
7310d3m8Q7po9J20K5p8L5p7R9k3NM9p2k8J3m0J29j5p0Q9o0r9J8J07j0j17M0P1
7339C1k7j24Q8M6n5R6q7P7m0P0n9P8l1K9p0J6P4p1p0J30j27oM9J0K3j40K24j77
$$ plain form
7143 16 -74 26 -68 9 -75 -82 -21 -93 109 73 41 -78 -16 -101 -23 -168 26 -63 80 -3 -44 -26 31 16 52 168 8
7170 8 107 -2 -32 -99 49 -26 7 38 -47 -132 -10 35 75 6 47 -41 90 -113 -45 49 57 32 13 -12 -99 51 -41 -6
7198 -6 141 127 50 103 -6 136 -37 -45 55 -34 -2 21 -39 -47 -100 96 -29 31 -43 76 20 30 -16 5 -95 -38 113
7225 113 34 -38 -40 79 5 35 27 -13 -29 -74 -14 -33 14 72 -89 -2 7 16 5 -51 166 -126 33 -24 96 4 -143 65
7253 65 63 -27 -35 41 23 44 71 -152 19 -45 36 -116 -35 -26 3 -104 52 6 64 4 65 -17 -34 66 -159 115 -18
7280 -18 77 -4 -37 -33 -4 -60 51 33 -4 1 40 -9 -76 113 85 56 -52 63 20 12 -7 -56 22 27 5 138 73 120 35 -43
7310 -43 -91 -4 -11 -80 40 65 -13 22 -55 44 21 26 75 3 -25 -12 -52 77 62 -8 81 21 -78 -60 47 37 -80 -40 31
7339 31 4 -120 -32 14 -41 55 -32 45 5 75 16 94 63 92 22 38 112 41 -29 101 -26 -32 17 27 50 -90 134 -43
7367d3Q5mq1K9J07k13R9M2M1l1n8l1P5NLk3J01j24O5j22Q0J7n6J6JO7j37J10j7
7396CQ0j68K6L6L8k4lJ9L6q3M7P1j03R5K3n9J6o2J38k52J68j88J68Ok4o3n7J49
7424C3j01J08L8j27R4j0L4j67J21l1M4Kj8J12j29qq9J48k5o6O5o6RM2ROj30J2
7452i0L2K4M2P4m4j8j8m2Q6L3Lp4P7p5o0R8j8j8j05J81J1o3nm7O3q2P3q2L4Q1
7482G1j62J67j72JK21j48Jj3l4J8P1l9LJ41j43j08J89Lq5q1K50r7q6K2O0k6k1
7509Cj7N5j7q5R4m9k5J38r3j42J48k1K7k0OJ13j10K4n7L0J78j32j2L4j18M0Q5
7536G7r1j9M6L0n5L5L2j13J8M0M6r0R1q5J62j31ONL8N5j46J17l7J7k2K8M4l6j82
7565a20L3J90j06O5j4q1oJ2L4K8j13J21l0o7K9O2m5k9l5O2l4J0J06k3j43M2M7
$$ plain form
7367 -43 42 38 -43 -14 93 -120 -21 21 62 31 -27 -58 17 22 25 2 103 -21 44 -78 2 19 -37 -21 -20 47 -90 20 3
7396 3 83 -85 -59 -23 15 -9 -12 7 43 -40 7 78 -25 70 93 34 50 -12 126 -126 42 -146 22 28 4 -59 -116 33
7424 33 -68 40 78 -49 45 35 69 -98 23 -8 36 38 20 132 3 -5 -94 54 29 -37 28 -38 -29 13 22 28 -102 -90
7452 -90 -58 -34 8 82 38 20 2 -40 46 79 82 8 85 10 -50 48 30 12 -93 88 99 36 31 -16 47 -35 38 -44 -10 71
7482 71 -91 76 -96 -95 126 -22 -21 -34 -68 -50 21 -18 -15 126 -17 -125 64 67 -18 -99 151 54 -32 -10 50 24 3
7509 3 -14 41 24 -61 33 -16 -41 97 4 -138 10 -11 16 -4 2 115 5 29 -28 2 180 48 36 70 -48 -8 77
7536 77 -14 -33 13 43 -12 23 55 -58 -40 0 46 -44 47 -38 124 -7 -1 4 42 97 -49 68 31 48 26 54 98 62 -120
7565 -120 -87 103 -3 62 48 -33 -39 -27 7 35 -78 43 13 -54 -25 37 -8 -37 -72 -10 -44 -34 72 49 -94 -52 -5
7592eL9m9k0pM3M0o0O0j4j12Q6j07P6P5q4m5j11J94k32J50K31j74Q6o4J1p4J2
7619e5Q0l8k7K2l4K3RO2q6J09j54Q8j1J05j45J31j05kJ09m6J6Pj8o7J07n6r3J26
7647E7j26P5L9j40M1R4l6j0j1R1j05n0J24p5Q6p2K3l9O9o1Q8q5j2J8L2N9j66J15
7675B3J06j52o2R2P3q9ro9J21j5j1O9m3p9K1N7j08O6rR9m0k5nL8m2o2M3qJ06n5
7705C1o2O7rj3Q4r4q8P4L5o6n2J13M5m0l2K2J8l2LO6p0K5l2k6R4p0Jn8R7rp1R5
7737D6J2j14N4O1n2L8p9kj08J11m9R6l9Q1j4J9n1l3L1o4P0j02J47o1m9Q5J4r5
7765d7pJ4RJ05j08PJ4Q7Ko1J3N6j17K2q0J66n7PK5o7rN1Q7j30J3N7J4p6n7J17
7795E0q9J64j07Q0j11J3J07r8om6J13j01l3MK7j5J30j04J8J8q4J32m8L4%Nn3O7
$$ plain form
7592 -5 34 -15 -35 -42 1 41 -19 41 27 -85 1 -106 -30 45 -39 -84 -195 -1 -233 -83 148 -26 60 -4 7 -67 -55
7619 -55 25 -13 -40 -18 -52 -29 -20 42 -44 65 -89 -1 -12 93 -52 79 -26 -28 81 35 51 58 40 -27 80 24 -69 57
7647 57 -69 6 45 -95 -54 40 4 -6 -17 74 -31 -81 43 -32 54 -18 5 -34 35 -26 62 -23 -35 -17 15 74 -92 23
7675 23 129 -23 -85 7 80 -9 -18 -87 34 19 8 77 34 -45 -24 33 -75 -9 -18 81 41 16 11 49 7 -55 -12 -20 86 31
7705 31 -31 36 27 14 98 4 -84 -10 25 -41 -93 20 65 25 -7 15 33 1 4 70 0 25 -7 -33 61 -9 -8 -66 31 22 -49 46
7737 46 58 -56 -2 59 7 45 -34 -36 -144 -33 -82 14 -25 56 42 61 10 -23 8 -56 14 -88 59 -2 -51 34 48 -47
7765 -47 -54 -40 -31 74 -34 -27 -13 74 76 15 28 84 -33 -11 -91 75 18 25 50 -17 -26 25 112 -18 -5 52 66 -10 -67 50
7795 50 -39 125 18 98 -13 0 107 9 3 -43 70 -31 -64 -60 -33 -48 82 -22 -4 14 -70 62 14 48 48 53 0 67
7823F7N0p0m1m1O2j7Om9R9q6mJ2m2L8M6J36k28J72j56P1m6l4J23m8R4j27J1l6
7851c8L4J39j33j0o1J89k03KK7J09J4j08K8oP0o5J2k9n2O8OORJ8j51J92q8k9L6
7880a4O0Pn7oj9nMJ13j23Lo3O6K5l9m2J6j1J17m1p1J00j2PL5j09jJ51j30J7L3
7910A1r7L8l9J67n3k6pr0M8mR4j7qNk9l7J36j87L4J54j17Q0j27R1l4L5r3J60j76
7939h8P2L7K5r7L6MO4n6rr6L1O5M6L0Kl0k7Nj7p0JkN0J6j8J66j49R9j32LPj9N0
7972an7J16m8J13j20K1j5N7l1j40M2J3l1l0K01q0J20L4j10j2j47J43m7K6j0n6
7998d9M0M7o7J40j88J24l1n3J1J7j7lJ06k2k9j1j0Jj1N2O6j63O0pO3q9J0J6R4
8027I7n9K6o9j40Q4K1k9K8M1L2k9J4j38J06N8jl1O0nJ07k18J08j37L0p3Q4K2o5
$$ plain form
7823 67 117 47 6 -35 27 10 16 -33 66 -20 -24 -12 -54 -16 30 166 -62 110 -46 25 -21 -55 68 20 114 -13 -2 -38
7851 -38 -4 135 2 -8 -69 120 -83 -81 -54 55 69 -39 -11 -17 53 -12 0 -29 -81 -13 -7 -1 8 26 -125 67 -21 -50 -14
7880 -14 46 53 -4 -10 -29 -34 -30 83 -40 -37 -100 -34 -9 -48 -90 -74 -85 32 -9 -80 20 8 15 50 -59 -60 91 -39 -22 11
7910 11 -86 -48 -87 80 27 1 -6 -96 -48 -52 42 25 17 22 -7 -44 92 -95 -61 93 -24 56 -71 20 -14 21 -72 88 -88
7939 -88 -16 21 46 -51 -15 -11 53 -3 -12 -108 -77 -12 34 64 66 36 9 14 -3 -73 -72 -74 -24 -8 -26 140 -9 90 -42 -39 -32 -51 -1
7972 -1 -58 58 10 123 3 24 9 66 35 -105 -63 -50 -81 -111 90 10 130 164 54 42 -105 38 -9 17 7 -49
7998 -49 -9 38 -29 111 -77 47 16 -37 -26 -9 -26 -29 77 55 26 15 5 6 -5 47 113 -50 10 3 66 -23 -13 3 97
8027 97 38 64 -5 -145 -61 -40 -69 -41 0 32 3 17 -121 -15 43 42 11 71 66 173 -45 63 -74 -44 -117 -33 -11 -76
8055g6K32k61M3k3j2J34k1M6j03J0N1Op6J44p0j04J00n9p7N9Q5O7o3j8O7r7j6
8082c2K3n8O3J03j40P7p8J07j29K0N3M5r8K0J6k9J21j37N5Jk9l3M7L4p3ln3L0
8110g7k9N3O5R9j42L3%oj14Q1P7j22P2k6l7J22l9o1J07L7j22O3lN0r6MQ0Nj51
8139g7J07q9O0P7l2p6KJ28k8m0L1j0l9n0kJ16j00M6J24j53kO8l9qL6l0n6r9J86
8168E1j01l6L0J48l5j02K5MQ5j27N7nl6Q4j13M7L3j5nN5K6j8N9
$$ plain form
8055 -76 156 -105 -62 -85 -97 37 16 62 -41 -31 20 26 -50 94 24 -80 20 -39 -116 -57 28 95 32 14 81 -16 -32
8082 -32 -9 -67 -4 99 -41 36 -42 65 -64 -44 9 54 -44 -24 -8 -37 84 -53 2 3 -26 -59 -12 22 -51 -54 -107 -77
8110 -77 -106 -53 12 111 -31 2 2 -4 -118 -37 40 -82 -10 -36 -73 49 10 -51 56 93 -29 34 31 81 -15 -11 69 74 -77
8139 -77 30 -59 1 78 46 -30 -28 100 72 32 63 53 14 -36 -38 78 -22 24 148 -5 -7 61 22 14 50 20 -36 -135 51
8168 51 -50 -86 -56 92 57 -45 -20 -16 69 -58 -1 -6 -42 42 -71 -24 9 -6 -11 44 70 52 111
8191A11
$$ Imaginary data points
##PAGE= N=2
##DATA TABLE= (X++(I..I)), XYDATA
0@%%%%%%%%%Pj5J6j6K4l2M0m8N6p2Q8j04J27j51J76k08K40k80L28l79M35m99N71
32C04o49P37q35R42j059J187j326J481j652J836k038K258k500K764l051L364l706
49a943M085m500M956n463O027o657P363q164R084j0148J1394j2881J4693j6954
63i108J9869k3790K9375l8019N3299q8165L09838p176o96098J89799M94213M9843
75B83880l77853q0183J25927Q7315L9860O1163j75629k09594J45685L60602m8463
86B12710l97900j03661L72073K03945k51398k50384J10500J97101K0369r0354
96B3001p0753n1613N2137J61049J6707k19776q1034K07776J18396j57993j05544
107a07647R9644M7823o9489M5791Q2365j27420j26791J65817J75247j56483k10232
$$ plain form
0 0 0 0 0 0 0 0 0 0 0 7 -8 8 -8 16 -16 24 -24 32 -40 48 -56 71 -80 96 -112 128 -152 176 -203 232 -267 304
32 304 -345 392 -443 499 -560 627 -699 782 -870 966 -1072 1186 -1314 1450 -1601 1763 -1943
49 -1943 2142 -2358 2598 -2865 3162 -3495 3868 -4296 4788 -5360 6034 -6847 7846 -9108
63 -9108 10761 -13029 16346 -21673 31626 -56539 253299 246123 -449975 -260176 234037 283880
75 283880 -93973 -174156 -48229 39086 78946 140109 -35520 -245114 -99429 261173 212710
86 212710 -185190 -288851 83222 287167 35769 -214615 -104115 92986 113355 23001
96 23001 -47752 -99365 -47228 113821 130528 -89248 -170282 37494 155890 -2103 -107647
107 -107647 -8003 39820 -29669 16122 98487 -28933 -155724 10093 185340 28857 -181375
118a81375J19508K13805p8964j77260N9878J08743p9322m9486J29724K6217j90542
129i9074l8748K43128P7989k61409j24080K32466J55394j68850j51618J02963
139c1839J08922n7953l8775M0352l7968n4280R0207Q9430j04885j28751Q7713
150c7827J51540n4213j42677K0455J05521K897n5012l614J0745j7880K0000N1450
162E1385l5849q0931L7473R1106l3109q7593K9820P8686l5307p1300N1579O6202
174F2162o8923o5510P6977O9889o9310o9147N6952N7527m8716l2221M6502j664
186A4518n4680K9564P4407m0183j03430L0536J25435q723j27340j6635J05802
197B9271L8732o6979m4192K6237K6714O652J1158k2547n4189J7283Q5115O470
$$ plain form
118 -181375 -61867 151938 72974 -104286 -44408 64335 -14987 -64473 65251 91468 -99074
129 -99074 -137822 105306 183295 -78114 -202194 30272 185666 16816 -134802 -31839
139 -31839 77083 19130 -19645 20707 -17261 -71541 18666 108096 3211 -125540 -37827
150 -37827 113713 59500 -83177 -62722 42799 45696 -9316 -12930 -2185 -20065 -65 51385
162 51385 15536 -65395 -27922 63184 30075 -57518 -27698 50988 15681 -55619 -4040 62162
174 62162 -6761 -72271 4706 74595 5285 -63862 -6910 50617 1901 -30320 16182 14518
186 14518 -40162 -10598 63809 23626 -79804 -49268 76167 67444 -59896 -76531 29271
197 29271 68003 1024 -43168 -16931 9783 16435 27593 5046 -49143 -31860 53255 59725
209E9725r6788m0118Q7901O5354o4343p1080L1531N4089p01k2181j3825j2773
221b3209Q747M3900J2406o3251l6234O5317N3844n0515o0788K7321N5503r730
233B3311m0496K183J7706n076L639J3817j4947k5311J5470L7831r415m4672M270
246b1690M3920q25l5314l39K5342k052k0041Q523J7315j8290j5804K4194J3936
259A8875k4494j3614K1249J3887j8110j0603J7497M208j6415L701J5903p899j6999
272a2814Q257K0690q151k4556P552K3685o907j9751M167J4499k684j0229N201
285a041O260j0319p72J6075k664j8639K746K0269Q02k1848l912K0940M170j6925
299d858l665R706K239m354k25K315m771k498J1504L587j5573m305J6056P757j3653
$$ plain form
209 59725 -37063 -77181 10720 76074 11731 -59349 -27818 26271 25570 3389 -10436 -23209
221 -23209 -14462 29438 41844 -21407 -57641 7676 61520 11005 -49783 -22462 33041 23311
233 23311 -17185 -15002 2704 -2372 1267 15084 137 -25174 -9704 28127 18712 -25960 -21690
246 -21690 22230 21405 -13909 -14248 11094 9042 -10999 -2476 14839 -3451 -19255 4939 18875
259 18875 -5619 -19233 2016 15903 -2207 -12810 4687 8895 -7520 -3819 12084 4185 -12814
272 -12814 -4557 16133 7982 -16574 -9022 14663 7756 -11995 -7828 6671 3987 -6242 -1041
285 -1041 5219 -5100 -5872 10203 7539 -11100 -8354 11915 12717 -9131 -13043 7897 12067 -4858
299 -4858 -8523 1183 3422 -932 -1157 1158 -3613 -6111 5393 8980 -6593 -10898 5158 12915 -738
314g38j0977J1581J1398r362q227N773K662k960J245J679m145l948O400P247q514
329h86q618Q826Q560n583q128K982Q398j488p264K264L865l121n27K556j209l631
345c004Q42N518j293p939K251Q398k551o393J284N277Q69m463l23L349j244q76
361b98K745j416l420J148L331P51m839k945N414K846m033k057J312J849L50m11
377C27O74j600k189M344L841m955m379K337M924P80n346k960L110K553R12j972
393D01m505M36N157K280k280n424n95O931L603m370n252m14N882M587l890o762
409d215j142N860O714m339r904O53Q581L537m615o370O45N972L164j240n245l914
425e858N102P088q33p500n421N577R928k130j1321k935Q538O995m434q407N49
$$ plain form
314 -738 -11715 -134 11264 1902 -6325 -552 2110 -850 395 2074 -2071 -6019 381 7628 -886
329 -886 -9504 -678 7882 2299 -5829 -2847 5551 4063 -3201 -937 2928 -193 -720 1836 627 -3004
345 -3004 -2162 3356 2063 -5876 -3625 4773 2222 -4171 -2887 2390 3259 -1204 -1527 1822 578 -298
361 -298 2447 1031 -2389 -1241 2090 2841 -1998 -4943 471 3317 -716 -2773 -1461 388 738 327
377 327 1001 -599 -2788 1556 5397 442 -3937 -1600 3324 4104 -1242 -4202 -1092 1461 2373 401
393 401 -4104 -3668 1489 3769 1489 -3935 -4530 2401 6004 1634 -3618 -4032 1850 6437 2547 -4215
409 -4215 -5357 503 7217 2878 -7026 -6373 2208 5745 1130 -5240 -4595 1377 4541 3301 -1944 -5858
425 -5858 -756 6332 5499 -2001 -7422 -1845 8083 5953 -5368 -8303 235 7230 2796 -5611 -5062
440e062N204K694N81l448m724J714O478L154n401p598K213R043K789p094p757
455g214K126J0436J416r409m284M872N535k00m108j773K82J511M365Q62o254l546
471e383M553P098l45r474m188Q090P366m577q921p0Q124K181n384j822J475k28
487a505J656L361r28n979k252P980O221p318q454L559R176J123q688m853N839
502a062N352k097l680j132Q69J632J390J183k915m180L273O781p35p185l631O248
518A11O896l645p864K80N982K649m132m290J909K942k95l4J37k192j347K868M256
535D231j589o439j02P143K438n828n037L464O205j479n471q7K956J09r18M38J72
552B06k063p00M519J984n083l261L877M781j211n167r89M470J858k331k748j48
$$ plain form
440 -5062 142 2836 3417 -31 -4755 -3041 3437 6591 1190 -6408 -4195 4848 7637 543 -7214
455 -7214 -5088 5348 6764 -2645 -6929 -2057 3478 3278 -830 -2603 -2321 -810 3555 4417 -1837 -5383
471 -5383 -830 6268 5923 -3551 -7739 351 7717 3140 -5781 -5851 2273 4454 -930 -2752 -1277 -1505
487 -1505 151 3512 2584 -3395 -5647 2333 8554 1236 -7218 -3659 5517 6640 -2048 -6901 -1062
502 -1062 4290 2193 -1487 -2619 -1750 -118 1272 2455 -460 -4640 -1367 5414 4679 -2506 -6137 111
518 111 7007 3362 -4502 -4222 1760 4409 277 -4013 -2104 838 543 509 646 -1546 -2893 -25 4231
535 4231 2642 -3797 -3899 3244 5682 -146 -5183 -1719 4486 3007 -2464 -2551 405 514 -404 34 206
552 206 -1857 -2557 1962 3946 -1137 -4398 -521 4260 3049 -2118 -3107 1363 3221 890 -1858 -2006
568b006K253R15j231k61n34j125J675K311q26k978r53L778K604k846l070J038
584a256K839J284k265k842J200K454k38j412r04L22L70K55J078n01k553O16L278
601A725L54k573j764K178K802j183k674K4J370R66o12j481J81N11p1M60M4j061
619h04o00J074J359j58j956J00J900M28q35p16k48R22M03m82k90n30j07O18J44
638B22l02n78o43J051J230n98j223k42J242J468r07j620L00J128Q94o82j572J32
656g00J252j11k06p67o86P28J037J52j190j019J135J802o54j428j50J171R81n10
674H37j294K1R04L1j97o71j24K86K31P2l38o20M24N97j06j05k07J89M31op6J12
696C91m67J31L12l0l87k83j12M29L26n47k80l91P29P81o09o31K80P67M83n51q97
$$ plain form
568 -2006 247 1162 -69 -330 -864 -1989 -314 1997 1171 -1807 -2760 1018 3622 776 -2294 -1256
584 -1256 1583 2867 602 -2240 -1040 1414 1176 -236 -1140 -818 -448 -193 885 384 -2169 -1553 1725
601 1725 2079 -494 -2258 -80 2722 1539 -1135 -1111 259 1225 613 -868 -687 -176 -247 213 257 -804
619 -804 -1404 -330 1029 871 -1085 -985 915 1343 508 -208 -456 466 869 387 97 -433 -540 78 222
638 222 -80 -658 -1301 -250 980 382 -841 -1083 159 1627 720 -900 -600 528 1422 740 -832 -700
656 -700 552 441 235 -532 -1218 -490 547 699 -491 -1510 -375 1427 773 -655 -805 366 1347 837
674 837 -457 -436 468 499 302 -369 -493 -207 24 96 -242 -862 -438 159 53 -52 -259 -70 361 355 279 391
696 391 -76 55 367 337 -50 -333 -445 -16 310 -237 -517 -908 -179 602 -7 -638 -358 409 892 341 -556
717e56K80J094M9n29q02j07J232O4q41p25o3J170K71r99n76O42O32N37q69p03
737g99O74Q15J82q13n94O08P71l51p26l31L04O94k00j016P8O25L96k56o74N4Q80
758C21K12k75l35K3P31j9n71j66J53J21J09n57k05L58l1J53k03l84M96K77k29
779b1j45O9K90K75l05k23L36J03n2j17l51J68K7j79K2k22j21L61k00J1R1P6J63
802E6J41k64K00K47j57m2j6n7J20j47k05R5Lk76J08j10J13r9j31L39O2r6O9K9
826a8N5K97n2k15R3kJ66L2m08k29K56K34j91n71l7O84m7j41l7k49M55K63K3m56
850i5l8K62O92n00q82L28N82K2l68o77L50M50j12j12l50k34P00L96j87n58k22
871e53R13O54p95n82L03M58J78k99o29R9J45M25k5q95k49R73L76n78m68J98O77
$$ plain form
717 -556 -276 818 867 338 -464 -571 661 725 -116 -841 -904 266 537 -462 -1038 -396 236 773 -96 -799
737 -799 -125 690 872 59 -535 73 844 493 -233 -564 -260 434 234 -782 -704 -79 317 61 -613 -559 321
758 321 533 258 -77 -54 677 658 87 -79 74 195 304 -253 -458 -100 -131 22 -181 -565 -69 208 -21
779 -21 -166 -97 193 468 163 -60 276 379 327 210 -141 27 54 -125 -103 -325 -446 -85 -285 -274 -183 -107 56
802 56 197 -67 133 380 223 181 165 108 228 81 -124 -29 -26 -302 -194 -304 -191 -290 -421 -82 -20 -116 -47 -18
826 -18 37 334 282 67 160 158 324 356 -52 -281 -25 209 18 -553 -590 94 47 -94 -131 -380 75 338 361 -95
850 -95 -133 129 821 321 -561 -233 349 371 3 -674 -324 126 14 -98 -448 -682 18 414 227 -331 -553
871 -553 360 1014 219 -363 -60 398 576 277 -352 -253 -108 317 292 -603 -852 121 497 -81 -549 -351 326
892C26J1k19M0k26j32M65P72q41j025L62J285M9j588l12J148M04p08k97J66L02
912a8k26M11M88q00p81J314Q12o53j254l5J582J59j181n33M06N33J64p56k49O3
932e54N70L24j91o20O4N47J50K39n51n45L46J022K86j389j089J279J632j177j682
951a339M68J592k15j111q8J139k71q88R70R06j494r67J664J692j704k254J406
968d94K458j078k293M73J738j45j406K26J055o42o61R69O10r35r35J078J371p27
986F62j599J49J441M48r83j095N45J190l57p71l71M84O50n07l47M99qn05K70J090
1006H85j13j685J08J969L16k383o86K240R03j749j529J594J364j545r27J502P74
1023A038j780m15J896P72k293n99K392P72k288j039J901J125j511r87J023P33
$$ plain form
892 326 337 118 158 -68 -200 265 1037 196 -829 -467 818 867 -721 -1033 115 519 -189 -486 -320 -18
912 -18 -244 167 655 -145 -926 388 1200 547 -707 -742 840 999 -182 -715 -309 224 388 -368 -617 -554
932 -554 16 340 149 -471 -407 140 290 529 -22 -567 -221 801 1087 -302 -1391 -112 1520 343 -1339
951 -1339 -871 721 506 -605 -693 446 175 -713 257 1163 -331 -1298 366 2058 354 -1900 -494
968 -494 1964 886 -1407 -934 804 659 -747 -521 534 -108 -769 200 810 -125 -1060 18 1389 662
986 662 -937 -788 653 1101 118 -977 -432 758 401 -370 -741 -257 393 -114 -461 38 30 -475 -205 885
1006 885 772 -913 -805 1164 1480 -903 -1589 651 1554 -195 -1724 -130 1234 -311 -1238 264 1038
1023 1038 -742 -1157 739 1511 -782 -1381 1011 1783 -505 -1544 357 1482 -29 -1016 7 740
1039G40r33k92O13N8m90j50O72M11q47m74Q96M63l19o74p3Q53K15p02l60J99N36
1060C42J32q17m73Q62L57p57q3P88L1j029J90J433l97j836O89J952l87j781J7
1079g67J789k09j777J82J474m17j062M89R22o12r32P04J164o56j155P62J117n58
1097D58r47J68R96m33p08N23K03m33k54N24L2m97q0P52k2p16J02N01j81q3L58
1118B63j70j95p6N47Rq53L4R92j48r57K46O89j79p74K41P67m62p29Q84N49p50
1139g2n47O24P55o54p13R31M64j114j47P26O1p25m4P94Kr13R2R56l02p21K68N59
1161B80k1n35J28O36m24m56M39M34n68l08N44K96o52n08Q52L42p43j46O24l4m73
1182b93J16O87k73n69L88M80m90n26O08L47n69l22N18K14n16l12P21j62m38J38
$$ plain form
1039 740 -193 -485 128 186 -304 -454 218 629 -218 -692 204 667 348 -326 -399 454 669 -33 -393 -194 342
1060 342 474 -343 -816 46 403 -354 -437 351 382 -647 -457 976 579 -1257 -568 1384 997 -784 -767
1079 -767 1022 813 -964 -782 692 275 -787 -298 624 12 -920 -216 948 292 -863 -101 1016 458
1097 458 -489 -321 675 242 -466 57 260 -173 -427 97 129 -368 -448 304 282 -434 -332 169 -12 -95 263
1118 263 93 -102 -178 369 378 -475 -441 551 403 -554 -308 381 202 -572 -331 436 -26 -755 129 678 -72
1139 -72 -619 5 760 106 -607 324 788 -326 -473 253 314 -411 -455 339 341 -572 -480 476 174 -547 -279 280
1161 280 259 -276 -148 488 64 -392 47 481 -87 -395 149 445 -207 -715 137 479 -264 -410 214 180 -293
1182 -293 -177 510 237 -332 56 536 46 -480 128 475 -94 -416 102 316 -200 -512 209 47 -391 -253
1202b53M49M2n50J36O01j16o72L26M92l36n69L97N19m40n74P14L05p41l00N30
1222d0L68n35l12P25K17p43J11O68k06n97K51M47q2o03J61M93l46m54L95J79k84
1243a87k69L70L37k88l16N53O2n72J10N52r5l67M7M39j24n53L13K02l85n3K09
1264a5J65m39l0K63L24m63j12M07O9k52lL39J25n44m7N34j50m84K18L16j85l66
1286c30J25M49l35m11N41K24m65l5L31J34j81j75L04J28l92j05L85j22j89qJ29
1307BO0k96M8L53j13l67K37K35j26j31N1J14n3j15L00j51l6jK39k46j38J05R3
1330F4L2k13m6J41j41J9J17J24k06k3L07J41m22p9L52L0j63r5J10J4p9j40J95
1353C9Kk56J18N9Pm6n4K27k2j89P0J57j20L9K0n2J61j80LR1k75K01J0j69J37n9
$$ plain form
1202 -253 196 238 -312 -176 425 309 -363 -37 455 119 -450 -53 466 26 -548 166 471 -270 -570 -40
1222 -40 328 -207 -519 206 423 -320 -209 459 253 -344 -93 354 272 -331 -170 323 -23 -477 -82 97 -187
1243 -187 -456 -86 251 -37 -353 200 262 -310 -200 352 257 -110 -63 376 252 -301 12 214 -171 -224 -15
1264 -15 150 -289 -319 -56 268 -195 -307 100 169 -83 -86 253 378 -166 -213 321 171 -313 -95 221 36 -330
1286 -330 -205 244 -91 -502 39 263 -202 -237 94 228 47 -128 176 304 -88 -193 192 70 -119 -127 2
1307 2 62 -234 -186 167 54 -313 -76 159 33 -98 -47 67 14 -101 199 48 12 11 250 4 -134 -29 64
1330 64 96 -117 -163 -22 -163 -144 -27 97 -109 -132 175 316 -106 -185 167 197 34 -61 49 63 -16 -156 39
1353 39 41 -215 -97 -38 -31 -77 -131 96 74 -115 -45 112 -8 31 51 -1 160 -20 -17 74 -201 0 10 -159 -22 -81
1379h1M1O0k0l4Q5L7j20J48j31J7o3L1J86l1l68K05J89j91M4k06N0J40j59J61
1403a0O8r8L0L1q5J59j66R1K10j56j35L9NJ49o7k71J85J04j79oK0J37o2P5j66
1428i8K59j36j02K06P6lk21j9J90M0l29J6J36lk6k47J83K41k37p3P6J71qq9o7
1453f4J61K0j81L4K56l7l15q3J74K41m34j57M74Kk98j8K64P6l40K2M00ol56R2
1477g3K13R5k55j48K87J45l65r8J03K58j58k45J82J68j95r3K21J11r6j70K07J04
1499A98q2l19P7K92P6l01k02L04J69k18j81J01J73j88j37K70J53j58j45K67L1
1520A80j85j30J37J32J65o17J39M11j12k91j01L76P0l79Q1K25p3j62L2L20k03
1541A5k86K37L42j88k74J86O1l1j2j26j06J54K6j8J07Rj83n8Q8K34k51O5J64q9
$$ plain form
1379 -81 -40 20 0 -34 51 88 -32 116 -15 2 -61 -30 156 125 -243 -38 151 -40 4 -202 -152 -12 -171 -10
1403 -10 58 -40 -10 21 -64 95 -71 20 230 74 -61 -22 -17 132 65 -206 -21 83 -96 -102 -82 55 -7 68 -98
1428 -98 161 25 -77 129 205 202 -19 -38 152 192 -137 -121 15 12 -14 -261 -78 163 -74 -147 -71 100 92 3 -64
1453 -64 97 117 -64 -30 226 189 -126 -209 -35 206 -228 -385 89 91 -207 -225 39 115 -225 -203 197 191 -165 -73
1477 -73 140 235 -20 -168 119 264 -101 -199 -96 162 4 -241 -59 109 -86 -179 42 153 57 -113 94 198
1499 198 116 -203 -126 166 242 -59 -261 43 212 -6 -187 -86 87 -101 -238 32 185 27 -118 149 180
1520 180 -5 -135 2 134 299 -318 -179 232 120 -171 -272 104 174 -205 -124 101 28 -134 -102 218 15
1541 15 -271 -34 308 120 -154 32 93 62 50 -76 -182 -28 -2 -20 87 96 -87 -145 -57 177 -74 -9 155 66
1565F6k4M9j3Q2%j43o1l2J62p3k03J22K20j63j97K82K2j86p8K84J78k84k25L69
1589A54O6l77p3K27K63k77j29J56J48k99j7K21P6j32k26K80K34l87L5K22m4l1
1611I0j01J70k9j17j7J74j66j30J79L6j61po1J74L4j41J92Qj85N3Jm2l9J97K40
1636C52k74j90Q1J89k78l7K05R5k50K5L44j24m14J48K26qk49P8K77m6k43N5L26
1659B88l10j64J41K03k02k13L23M1j52j16J45K08k35k01K53J99j39j93J66J88
1679B30j82j75K63L5j87j5J38J05k72p3K70j97j19K12q7L3m6J57q5j73R9J44j0
1702F5j40J5J59j25r9jK31q5k63J86K57l12j03K11P6q3j41J20K00k77q5L67K2
1725A95k95K3L11j29k10q6M30k06k34J09K04j39j09J35J85k79j08K18J14q4j83
$$ plain form
1565 66 42 91 78 160 160 17 -44 -76 86 13 -190 -68 152 -11 -208 74 96 -90 -168 116 294 10 -215 154
1589 154 220 -157 -230 -3 260 -17 -146 10 158 -141 -158 63 139 7 -219 61 295 -92 -57 165 121 90
1611 90 -11 159 130 13 -4 170 4 -126 53 89 -72 -79 -140 34 68 -73 119 127 -58 -5 -4 -46 -85 112 352
1636 352 78 -112 -31 158 -120 -157 48 143 -107 -82 262 138 -276 -128 98 90 -159 -81 196 150 -93 -38 288
1659 288 -22 -186 -45 158 -44 -257 66 107 -45 -161 -16 192 -43 -244 9 208 69 -124 42 230
1679 230 48 -127 136 171 -16 -31 107 212 -60 -133 137 -60 -179 33 -54 -21 -67 90 5 -168 -69 75 65
1702 65 -75 -60 99 -26 -125 -126 105 20 -243 -57 200 -112 -215 -4 72 -11 -152 -32 168 -109 -194 173 195
1725 195 -100 -77 234 105 -105 -191 239 33 -201 -92 112 -27 -136 -1 184 -95 -203 15 129 45 -138
1746a38J56J33k38j14L07m1q2q6J29Q6l55P4L43q7l13K30K23k04k05J65K71j42
1768A12k58R7J67j69r8J35K00j95l4Q9J69l28j02L16q8j31J5K55J2l41K74J59
1790B56k24j76J37K39k82j91J94K49k83p5J34R8j91j18K66J95m27J71K27j05j08
1811a4j59L45l2k92Q1K45l3k47R7J34j90p4J9K55k81j0K74j7j55K3K00o0k67J24
1835c4K65r5k09K1K76k40k34J09L71p5k87Q7J60j52p9J70K01l44j46K67K97n00
1857a71j6L03O8k28j52L37p8r3k4J29j12j65N2L12k14j23M9K98k84R4NJ14k0j57
1881g6J06N6j45j30L77j99q2K0K60j04l45K52J51p3k21J29L14l92OJ17J55j88
1903a2k17K96J40j68k23K76Pj82Mj5Q4m4l5M9J16k3j79J24l7l8L4KR0Lm3j70J86
$$ plain form
1746 -138 18 151 -87 -201 106 65 -17 -103 26 112 -243 -169 174 87 -226 4 227 23 -182 -17 254 112
1768 112 -146 -49 118 -51 -149 -14 186 -9 -43 46 215 -113 -215 101 13 -118 -103 152 164 -177 97 256
1790 256 32 -144 -7 232 -50 -241 -47 202 -81 -156 -22 76 -115 -233 33 228 -199 -28 199 94 -14
1811 -14 -173 172 140 -152 -71 174 141 -106 -9 125 -65 -139 -120 135 -146 -156 118 101 -54 -31 169 109 -158 -34
1835 -34 231 136 -73 -52 224 -16 -250 -141 230 155 -132 -45 115 -37 -116 54 255 -89 -235 32 329 -171
1857 -171 -187 116 184 -44 -196 141 63 -30 -54 75 -37 -202 -150 162 -52 -175 -126 172 -112 -18 -13 101 81 -76
1881 -76 30 86 -59 -189 188 -11 -93 -73 187 83 -262 -10 141 68 -153 -24 290 -102 -96 21 176 -12
1903 -12 -229 67 207 39 -184 92 99 -83 -79 -94 -10 -54 -89 -40 76 53 -126 -2 -39 -77 -43 -41 49 52 9 -161 25
1930B5J82k29l6l2R5K8L9k04J35J01j73p9J18K63k95j14J22K31k06j46K60K17
1952C02m18j42K43J19n0k17J76K37k10j96K14J27q2k88R6L27j42j77k0K59m6l05
1974a93J06K48J1k49j7K83N3k16j54J92P5j87j15K50J18k69j32K35K51k66k72
1995b48L29P6k02k16J47K34k28M7M2J75j44n3p5J99N7k18QR4K31l18j26K66N6
2018A33j91p0K57m1j61j0K1L04j74k35K09L4k4j58k5K57Q3m63O9M81p0n30J25
2041a79L16O7l82ML50q5l08J8M46j60k53J17J83j7j96j15K10N4q1k0J68J11l35
2064h7j06L59j31j77R4J21M6k74J59j01m1J34Q3n2p6L09j60m32K86J86k2l15K10
2087A3J63j68j66J29J82j70m9n8K55k6k22N8K31n7l15J39L34j94l52J34L93k00
$$ plain form
1930 25 207 -22 -58 -90 5 33 72 -132 3 104 -69 -148 -30 233 -62 -176 -54 177 -29 -175 85 302
1952 302 -116 -258 -15 104 54 -163 13 250 40 -156 58 185 103 -185 -89 238 96 -81 -101 158 112 -193
1974 -193 -87 161 172 -77 -94 189 242 26 -128 64 139 -48 -163 87 205 -64 -196 39 290 24 -248
1995 -248 81 157 -45 -261 -114 120 -108 -61 -19 156 12 -41 -116 83 140 -78 -70 24 255 -63 -189 77 133
2018 133 -58 -128 129 88 -73 -83 -62 242 68 -167 42 76 52 -106 -131 126 209 -254 -185 296 226 -304 -179
2041 -179 137 204 -178 -174 176 91 -217 -199 247 87 -166 -49 134 117 -79 -194 16 70 -11 -31 137 248 -87
2064 -87 -193 166 35 -142 -48 73 119 -155 4 -97 -138 -4 79 27 -49 260 100 -332 -46 140 118 -197 13
2087 13 176 8 -158 -29 153 -17 -66 -124 131 105 -117 -59 172 115 -200 -61 273 79 -273 -139 254 54
2109E4k45K18K96l05k19K57J84m09K6J60P4q9j7r7J54l7o5K42k00L5q3J34j05
2132c7J8r1J86Oq7L1Q5j17j26K09J07l24L5L67r8l50J60L55j51m30L25K78m43
2155i2j07K26K78l54k44M62o6k21J8J71L5j29k16J84K05j72j08J73J36k57k1J55
2177E6K29m20j3K68j5k76M3J84k5l6rJ57k10j82L36m0j84L9K04J0k13P7J55j32
2201Cj54J50K02j69j17OL21k43r7J41K81l88k22L12Q8k03j35K56L37m06j72L93
2223A84J6k74o6L36m7k62k7K88q0j35L1R0K4j04k3J41r9l3P9R1r1j51J69J27j72
2248A2j95J94M7k38O3L10j14k18J27K54r0k64K0L62k93j46R4K92k13r8J59J65
2270B30k26n8J30N9j06j80J84O3j78O1J49j05j37J33j5j21J32j04J64j16j90L16
$$ plain form
2109 54 -191 27 323 18 -201 56 240 -169 -143 17 91 2 -15 -112 42 5 -60 182 -18 17 -66 68 -37
2132 -37 -19 -110 76 82 -5 26 111 -6 -132 77 184 -140 -105 262 164 -186 -26 329 178 -252 73 351 -92
2155 -92 -199 27 305 -49 -293 169 103 -118 -100 71 106 -23 -239 -55 150 -22 -130 43 179 -78 -99 56
2177 56 285 -135 -148 120 105 -171 -128 56 31 -5 -14 143 -67 -249 87 47 -137 -98 106 116 -97 -20 135 3
2201 3 -151 -1 201 32 -85 -79 242 -1 -98 43 324 -64 -286 26 114 -89 -224 32 369 -37 -209 184
2223 184 200 -74 -140 196 149 -113 -140 148 68 -67 -36 54 78 -26 -49 92 -7 -40 39 130 39 -112 57 184 12
2248 12 -183 11 58 -180 -117 193 79 -139 -12 242 152 -112 -92 270 -23 -169 -75 217 4 -94 65 230
2270 230 4 -54 76 135 29 -151 33 96 -82 -21 128 23 -114 19 4 -117 15 -89 75 -41 -231 85
2292H5J5k69o7K89P8j84j01J87J47k00q4K47k8j04JN7M4k10R0J05j70j7J38%K1
2317G0j46k8J80j44qJ8R9p2l1J28n9m9M4m0J17k61K29O9j00j50P2J88j51k08J59
2342g4J97j92j26K39J03k70M3J49R3k20j43J72J54j81q9J83K3n8j35J84J56k55
2364d7J08n5j8l8j3Q0p2oQ1J2K3q7O9p1J8k8J04r5j0M3J9K9k08J52K9p8l1K08
2392A18j26m5M9JP2r9p1J75Mj28n8K01J59l20j04J99P7j42j38J61J75j78r1n3
2416a62K51j28n0j5Q8L6p7j52K96o2m4o7R4J55j65j51R2J48q4j46M2J18q2o8R8
2441c5J27q0L3rR7Jl08J53M6K6j41K6J46K2o6k08K17qk17L6K35L3n0n7p6J01r3
2468d9k08K61J60j09j45L4L14j72j95J06J57j53j20J64Nk6j76J40p7Q0n2j7Q5
$$ plain form
2292 85 100 -169 -236 53 131 -53 -154 33 180 -20 -104 143 115 11 12 69 113 -97 -7 98 -72 -89 49 49 70
2317 70 -76 -104 76 -68 -76 -58 41 -31 -62 66 7 -42 2 -38 79 -182 47 116 16 -134 -62 126 -25 -233 -74
2342 -74 123 -69 -195 44 147 -123 -80 69 162 -58 -201 -29 125 -56 -145 38 61 3 -132 52 208 -47
2364 -47 61 6 -12 -50 -63 17 -55 -61 20 32 55 -32 37 -34 -16 -44 60 -35 -45 -2 17 46 -162 -10 19 -59 -90 118
2392 118 -8 -53 -4 -3 69 -30 -101 74 78 -50 -108 93 252 -68 -172 27 104 -38 -176 -15 160 -18 -109 -162
2416 -162 89 -39 -89 -104 -16 20 -57 -209 87 25 -19 -86 8 163 -2 -153 -61 87 3 -143 -101 17 -65 -133 -35
2441 -35 92 12 45 36 133 134 -174 -21 25 51 -90 -64 82 104 38 -170 47 39 -178 -142 93 126 76 19 -57 44 -49
2468 -49 -257 4 164 55 -90 -56 258 86 -109 -3 154 1 -119 45 50 24 -152 -12 -89 -9 -61 -78 7
2491GJ76k84L0N7P4j07n3K12qk7k11J51J33l05R6N1p3M0j48K36n4P1j25m5K27
2516A21j00j28J02J72J5j34j20K05L6j90j89P9Q1J3k2J1O7O3j33RJ13P2k44l4
2540a35J28K14l04j36K80J24k89J6K06o7j56PK15r9j49Q5N2J30j52n4J81k0j28
2563e1L4J29l0K6n6p7J92j94J4l3Nl9P4M3K8n4p1J5J9Q6n0n4kJ26k0j80J5J90
2591H5J2j04K3oM2m4p5k1O1l6o7K52k0r9j12K47J2k67J64J47N1k65j60L01n6j51
2617h6J68o5m2K9J6j31J50n9k4jN8N6l6n9J23q3o1J04%j81P5L7o3P1k2J25l08
2644b09K02P0M9l15J44K22k39L2K77o5l59K08k2K14l81J5K44r4j04r9L04m5p3
2667b4q6K03L4k14M4J74q6p4j88K90J52l96R0K42r4o6k7J76j76o5J79n7l4n8K21
$$ plain form
2491 7 183 -101 -71 -14 60 -47 -100 112 104 77 -134 17 150 -155 -59 -8 -81 -41 -189 47 -7 64 -61 -106 121
2516 121 21 -107 -5 167 182 48 -72 133 169 -21 -210 -131 -50 -37 -59 -48 19 82 -51 -42 71 143 -101 -135
2540 -135 -7 207 -97 -233 47 171 -118 -102 104 37 -119 -112 103 4 -145 -60 -8 122 -30 -84 97 77 -51
2563 -51 -17 112 82 108 52 -25 167 -27 -13 -46 -41 -80 -6 37 65 11 -60 -45 -26 60 10 -44 -46 80 60 -120 -105 85
2591 85 97 -7 16 10 52 8 -67 -88 -27 -63 -130 122 102 3 -109 138 150 -117 47 194 245 -20 -180 121 65 -86
2617 -86 82 17 -25 4 20 -111 39 -20 -44 -45 13 69 33 -26 97 14 -47 57 57 -124 -49 -12 -75 -4 -26 99 -209
2644 -209 -7 63 112 -203 -59 163 -76 -44 233 168 -191 17 -5 209 -172 -157 87 -7 -111 -210 94 49 -24
2667 -24 -110 93 127 -87 -43 131 45 -29 -217 73 225 -171 -81 161 67 1 -26 150 -26 -91 88 31 -3 -61 160
2692A60j73Q0j48R5j07R4Q0N4k36j22K61jn2j25K18N1j56j09K82P9l44P5pJ87
2716A36k29l1L25j70k87K19J58q8n6j02J75J36l44M3K07j99M6RL5Rj36J77J62
2739A95j56j0J49j39k5j09J14j6l2k8J54o6j28m0J56q8o0mJ68l5j78J67P1k96
2763b36J08J58j1M0j20J09R2j88j03K43L3k92J20J34j23n8N4J34q4o9J6J57j88
2786g4n6K75o8j47m9J47QLj14J70J4j99J18J0N8l02J46K64k56K8q0K86k11o0M0
2811d9J34N6k69J51J17j05j81J53J09j65M2k3Rn1kJ80l5j20J18j68J71p1M3k7
2835A7m6r7J90n6r1m7N0K61l59J11L7J9k66J52K24q7j22J17R7K8k56O8K33j80
2859cq3p6J87kk19K65J7j40O0j0J21j66n6N8J68j95Q3R6j8k10J31r8K01k16J07
$$ plain form
2692 160 -13 67 -81 14 -93 1 81 135 -101 -223 38 37 -15 -140 78 129 -27 -136 146 225 -119 -44 -51 136
2716 136 -93 -124 201 31 -256 -37 121 33 -23 -125 50 186 -158 -115 92 -107 -61 -52 -17 -8 -144 33 195
2739 195 39 29 178 39 14 -95 19 3 -29 -57 97 31 -97 -137 19 -69 -129 -133 35 0 -178 -11 60 -236
2763 -236 -128 30 19 59 -61 48 140 -48 -151 92 125 -167 -47 87 -36 -94 -40 94 10 -59 -43 114 -74
2786 -74 -130 145 77 -70 -119 28 36 39 -75 95 109 -90 28 38 96 -206 -60 204 -52 -24 -104 182 -29 -89 -49
2811 -49 85 141 -128 23 140 35 -146 7 116 -49 -7 -30 -21 -72 -74 106 71 -49 69 -99 72 1 44 17
2835 17 -29 -126 64 8 -83 -130 -80 181 -178 -67 -30 -11 -277 -125 99 12 -110 7 104 132 -124 -56 177 -3
2859 -3 -86 -162 25 23 -196 69 86 -54 6 -4 117 -49 -105 -47 121 -74 9 105 87 -123 8 -90 111 -105 2
2884Bjj00M5L2N2j32J79j17P8k6M8O5j15o1Q8R6j75R9j1J00J2k75M7K73j99j21
2910a17K0J82q9j01J60N1j58j07K08M5j45j25J51N1K8k21K24N0j27o1J00M5mj75
2934a15N8J12j50J64J1j9l4K5j74J15L7J09j65j09K47n5m6p6Q4p0M2k1J1L2J8
2959C1p5J2R8j33K5J24N6j66m8N3J23j24r2P5J18j38k9R7N4j10nL6l6p3J30LP3
2986G9j31l8J03j0J23J5l2q9j3N4p9m6O3oj7o3J28j09QkJ05q9l7Q6P7m2J3n3m8
3015e0J38Jk48J67J15p2j79J49m8L9l4J02l4r7j10J94J0l1L3O9r6J67k97N7O9
3040A4K3j26k4J3J57q4J6K7J4m8O6qLj42o3J51N3n9l6J88r8j9r9J40n3n2o8J21
3068GJ29n9n6j1M3j4j18M7O6M8q2j18J96j6l6j77K76m2L2l38K53m1r7J16r1l0
$$ plain form
2884 2 1 -99 -54 -22 30 -102 77 -40 38 12 60 125 10 -51 37 133 -42 57 46 146 158 -117 -70 203 4 -117
2910 -117 -97 85 -4 -105 55 106 -52 -159 49 94 -51 -176 -25 26 54 -167 57 107 -20 -81 19 64 60 -115
2934 -115 -57 55 -95 69 80 61 27 52 -122 -7 30 139 -26 -135 112 57 11 -65 19 -51 -9 -30 -19 13 31
2959 31 -44 -32 66 -67 -42 82 138 -28 -76 -23 100 -24 -116 -41 77 -61 -90 7 61 -49 -54 -18 -54 -127 3 6 79
2986 79 -52 -90 13 3 126 141 109 20 7 61 -18 -64 -1 -7 -24 -87 41 -68 -60 -62 43 -46 -83 3 80 38 51 -2 -50
3015 -50 88 89 -159 8 123 51 -128 21 -27 12 -22 80 46 -51 -161 33 43 12 45 114 18 185 -112 -55 14
3040 14 37 -89 -113 -100 57 -27 -11 16 30 -18 48 40 43 -99 -162 -11 42 -17 -53 135 37 18 -81 59 6 -46 -114 7
3068 7 136 77 21 10 53 39 -79 -32 34 82 0 -118 78 62 26 -151 125 83 115 -223 30 -11 -108 8 -83 -113
3094a13Q9n6l9O4K08j26j28J53l2j4p4J18J90k42j55J97l8j24m4K62m0j32j8K53
3118A59j19pJ7j04P6Qp3M0J6O0o5r1Q7J25k51P9M6O5m8j15N0kR8p3K6K3k7M9j48
3147i9Q4J15j52j4J46J2m5j54J41j4j50R1J82p1n1P9j00J25j85J3L7N8o7qJ86
3172A59K2k33j12K51k3qj64M3ro0Q9RJ64o0r0R4r7J1L7j09L2J74j40J35j25o1
3198g1R1m7n6J01M4o6j10K14p6Pl3q5N7l9J00m4rm2k3J66O3k04J4L0M9k21J80
3225a0k9M8qn1K3P7o2J40K8q4k6p1O9L3k4o9N1l6o6M5l1P5J9j53J64n6r1J41j5
3254C1mp0K2J5o4Q8J52j90o2J01j81J70n6J40j33jK2k3J06j24J26m8J6p6O8m7
3280b2L1j40J54kK8N0j72J23kk02J52j3RnL0j2j4P8r9L2P6j28J53j60K4J6n5K3
$$ plain form
3094 -113 -24 -80 -119 -55 153 27 -101 52 20 6 -68 50 240 -2 -157 40 2 -122 -166 96 56 -76 -94 159
3118 159 40 33 50 -54 22 30 -43 -3 13 73 8 -83 4 129 -122 -43 3 68 20 -95 -45 -47 51 -22 4 27 0 49 -99
3147 -99 -15 100 -52 -66 80 92 47 -107 34 20 -130 -39 143 72 21 100 0 125 -60 -47 -10 48 -19 -27 159
3172 159 181 -52 -164 87 64 56 -108 -65 -74 -134 -45 -36 128 68 -22 72 -25 -14 23 -86 -54 120 -20 115 -10 -71
3198 -71 20 -27 -83 18 62 -4 -114 100 24 31 -2 -87 -30 -69 31 -13 -22 -64 -87 79 142 -62 -48 -18 31 -190 -10
3225 -10 -39 9 1 -50 -27 50 -12 128 156 72 46 -25 44 77 53 -16 35 -1 -67 -22 -53 22 41 -112 52 -4 -95 46 31
3254 31 27 -43 -21 -6 -70 18 170 -20 -82 19 -162 8 -48 92 -41 -42 -20 -43 63 -61 65 17 33 -43 25 -22
3280 -22 9 -131 23 21 49 99 -73 50 48 -154 -2 -15 -6 -11 19 7 -7 71 -28 4 80 -48 105 -55 -31 -15 -70 -47
3308d7JN9j01J02K1j3N6o8m2K7k1K7P8o5m0J04m6q6P2p3J22j82J53r8N0m2J28
3335G6j81K15k26J33Qj39K29k04K7O0J0n9J14m7m4j1OR2L9j65J63r3Ljo2JQ2m4
3363a8P2k8j19MJ77N0j18j18L5J47p5KJm2n0J18r2J39j03j32K07q9km7J41j71
3389a11O5J71p0J10k16N1P1j71Q9o7N0O5k2L7q1M1l3L0knO0j6j06N6p5Q4O5p2
3417bJ5q4O8k7M1k9n5MJ3Q9j92J48l3M1j3nJ22L8j59q1K09j22n4R6p8R7q7J64
3445A24k41J62r7R0lq5P4j15M2L2J6J06rj33j0K2N8j9N2m5J05j93LO5j4j2M3j09
3473i1M0O7j37J99l6k0J7J08k34JK04q9p8R0r6J10j7l4Lm8J25j19m6O2p4Q1Q3
3500G1j90J71j14q8L20r7j33J77j77O1pL1p8j8P6q9M7lN5Rj91O0J08K0r7J67j39
$$ plain form
3308 -47 -46 13 -88 14 35 22 78 10 -32 -5 -26 1 79 14 -26 78 32 -54 18 -55 67 -115 38 -60 -10 -52 76
3335 76 -105 110 -116 17 25 -114 115 -89 -62 -2 8 -51 63 16 -28 -39 -33 59 98 -67 96 3 6 5 -57 -56 26 -18
3363 -18 54 26 -93 -89 88 138 20 -98 -63 84 9 11 12 -30 -80 38 -54 85 -18 -150 57 -32 -34 -81 60 -111
3389 -111 -46 125 55 165 -51 0 71 -100 -11 -78 -28 37 15 52 -29 12 -21 9 7 2 62 46 -60 -4 -79 5 70 -2
3417 -2 13 -71 -3 -30 11 -18 -73 -69 -56 33 -159 -11 -44 -3 -16 -21 101 139 -20 -101 108 -14 -68 28 -50 47 -40 124
3445 124 -117 45 -52 38 35 -50 24 -91 -49 -17 -1 105 96 -37 -47 -25 33 14 66 21 126 -67 -64 1 -13 -25 18 -91
3473 -91 -51 16 -121 78 42 22 39 147 -87 -86 118 29 -49 41 -55 55 38 4 7 -41 84 -35 -81 -19 -93 -12 71
3500 71 -119 52 -62 -150 170 73 -60 117 -60 1 -6 25 -53 -71 5 -84 -37 -40 15 24 -167 -107 1 21 -76 91 -48
3527d8R4j43Q3K6p3J68j95J42m5oJ0n3O0n1rL4ML0r4J43K9j75K0P9p6R2j31J23
3555C8j6M4o9M7j6q2N6l1J26p9j15J04N3k1N0j24P3o7n3K5j3J25m7j26J46k4k2
3582a8r6P0Q2j62J62k6k8k4%O8Lj05L0J48k25J89j55O0M8j06P1p5J41p0k5J29
3608H6r4M9j49J40Q2p9p1J9L0l5K5mRo5M8J4MJ09j53qPN4k5j6n3J88j04j24J83
3637F7n2p0k5J48q6l3N3L7k2j09J38k4j21J95j11JM6K5m8J5k4l4R7l0k8O5j53
3664h3k3J97j87Q8ojl9M9J6Kmo0J5K1R7k2j22J7P7m6L4N9n9n7R1k0Qn6K1J4q3
3695f2J5mP7p8l6N2M2ko4J29k25N0K10j60m9J01j6K4l7Q9l8m8j11J37j2j00R8
3722a8j15J48L7l4L8q4M0n6N3N0p9k9o7J07m1p9J42m0m0R0j1Pk8k9M1r0J23p2
$$ plain form
3527 -48 46 -97 -14 12 -61 107 -88 54 9 3 13 -40 20 -31 -40 -6 -2 28 -66 77 106 -69 -49 30 -46 46 -85 38
3555 38 22 66 -3 44 28 -54 2 -29 97 18 -97 7 60 39 89 -35 38 -29 -82 -57 -70 55 8 -118 28 4 -18
3582 -18 -114 -44 38 -124 38 12 -16 -40 -40 28 31 -74 -44 104 -121 68 -87 -27 21 -85 -14 -89 52 -18 -43 86
3608 86 -8 41 -108 32 114 35 -36 -17 13 -22 3 -1 8 -57 -9 5 9 118 -35 -43 -36 18 -7 -23 -76 112 8 -116 67
3637 67 15 -55 -80 68 -18 -51 2 39 17 -92 46 22 -99 96 -15 -14 32 57 9 24 0 -34 63 33 5 70 -83
3664 -83 -106 91 -96 -8 -14 -15 -54 -5 11 13 9 -51 -36 -15 82 60 -62 -45 32 -14 20 79 20 -37 54 34 42 -14 7 21 -62
3695 -62 -47 -51 26 -52 -88 -36 6 4 -60 69 -156 -106 104 -56 -105 -4 -20 4 -33 56 18 -30 -141 -4 -16 -116 -18
3722 -18 -133 15 52 18 56 -28 12 -44 9 59 -20 -49 -116 -9 -50 -129 13 -27 -67 23 12 19 -9 -38 3 -87 36 -36
3750c6k7N1J15r3M4M7j33M2p5n5Q6o7M8m9N5P8o4J09j44J13j02O9qR5n6j11L6
3777c2K4lo0J03k4km7o1J26o0M5L6k3J6M3r9J5J24k67K29o6k3K6R7k5j61r4J08
3805e5R8J5j18P7K8m5j35Q0j1Pm0J73m3l8R2o8l9L1Q0j09L4j07R7O0n3J7m1j3
3833b6l5R1Q0p8JL6N0j27o8J29n9K1n0K3Q3k32J46N7j62M8O9L4j55K5R7J02k26
3860a26J11L7J9Mn1oO1p0n1R1kl4R3p4K8L9j58J73p9K0p3N3K5L2o0n9M7m5O8m0
3890b7k5Q9q0o5p2J21k0J14r2j01N5P3p3J51k3p5K1J1NK7l5J17o0o6J1j3J82o
3918A44j74j09J92q9L8l7m6l5J86r3L1M0j81J64k9l1N4k5k3K9j5J05j35J15n2
3943B4p4j28J00j3J15N4rj02J79j79J79q8j35P1L3l1p2J0J09Q1j30j25L8Q5Pm2
$$ plain form
3750 -36 -63 -12 103 10 54 101 -32 10 -65 -120 -34 -101 -53 -102 -47 31 -33 76 -68 45 -57 12 4 99 43 -68 -32
3777 -32 -8 -11 -71 32 8 6 -41 -102 24 -36 9 45 22 38 81 -18 -3 121 -146 83 17 -6 20 117 92 -69 -163 -55
3805 -55 43 58 -60 17 45 0 -135 -55 -66 -59 -99 74 31 -7 85 17 -22 9 89 -20 14 -93 4 64 11 28 -13 -26
3833 -26 -61 30 110 32 33 69 119 -8 -76 53 -6 15 -35 -12 71 -161 -15 42 -120 -72 -3 31 -124 -99 -2 100 -126
3860 -126 -15 22 41 45 -6 -12 49 -21 -72 19 17 -17 76 2 30 69 -89 84 5 25 -48 5 30 62 2 -57 -10 -55 13 -27
3890 -27 -52 37 -43 -108 -180 -59 -79 35 -57 -158 -103 -30 -103 48 25 -50 -29 -18 -13 14 -21 96 36 -30 -19 -32 150 144
3918 144 -30 -139 53 -36 2 -35 -81 -116 70 -23 8 48 -133 31 2 -29 25 0 -23 6 -9 96 -39 76 24
3943 24 -50 -178 -78 -91 24 78 69 -33 146 -33 146 58 -77 -6 27 -4 -76 -66 43 124 -6 -131 -93 -8 -1 -43
3969d3L7j4j25R0J11n7M1o8PQ2j68K08L0q1lj14M6K6q0N4lk4P4j3O0j65J20l2
3997dq2O7M9K3o9J8J34j58P5l0j78J03k7N0k8Q3o0LJ24j24N7k8qJ2j1J0K4n0O
4026a9K0PJ7j04K9J7R6K7j18J58j07J2Jn5n8J84r8j8J0lJ8p6L7J16p7j01R1J4
4054B0n0N3qM0L9j50N2l9J02j60N2L8mJ2lJ21j24J7r9Q9l6j05J46J56q0q6J20
4081A13o6j1K5p4N0Lo2r2J44Lk4k4L0JJ07k41J48o7O5lm8j3O8k8J1o5Q6q3J3L2
4111bRj9q7J12mn5l5J20q1J17m8M2n8q0K9J03j33J26O2q7k1l4Ko3J80j32K5rJ5
4140fk3Jk5P0j55J50j26R0M7p5o7J50J36j43N4j11J66j39l0RK6O3r8j3Q3n1k0
4167c7P5j7k8p7J09J9q7L0J04j22J2p4N4P9n1j27J48j11J54q1L7N4k6N7r6n6m6
$$ plain form
3969 -43 -6 -20 -145 -55 56 -1 40 -28 -21 61 -107 101 131 50 47 -67 -21 5 -75 -21 -24 -48 26 13 73 -92 28 -4
3997 -4 -86 -19 30 53 -16 2 136 -22 53 23 -155 -52 -79 -29 -57 26 -34 -31 93 -31 26 -2 -10 2 -9 1 25 -25 -19
4026 -19 1 8 25 -79 -50 -33 63 90 -28 130 23 35 36 -19 -77 107 9 -9 1 -2 16 -60 -23 93 16 -85 6 20
4054 20 -30 23 15 55 94 -56 -4 -43 59 -101 -49 -11 -15 -3 -6 115 -9 8 -91 -2 -38 -143 3 159 79 -7 113
4081 113 47 36 61 -13 37 40 -22 -114 30 33 9 -15 15 16 123 -118 30 -37 28 25 -23 -36 32 4 15 -50 36 -47 -34 -2
4111 -2 7 -12 -99 13 9 -46 -81 39 -42 75 27 69 11 -69 -40 63 -70 56 118 31 10 -24 -22 -85 95 -37 -12 -21 -6
4140 -6 -29 -28 -53 17 -138 12 -114 -24 23 -52 -119 31 167 24 78 -33 133 -6 -36 -27 -1 62 -36 -49 34 -17 -37
4167 -37 38 21 -7 -84 25 44 -43 -13 91 -31 -19 -93 -39 40 -11 -138 10 -101 53 -28 9 63 37 94 -2 -58 -104
4194a04K0NJ01o3K1N3r3n3J07LPL9Rq0k4RJ07l8k0L8J05j01j8J1j8p7O2Rj16R5
4224dR6j00j6L0m9J69k27J16l9M0O4r1n0o2J01KM4r1M8jL3j06m7O5J00k2Q5q7
4252AkM8o3lm1N9O6l8J7j1p3N7pL3o3j0O4k48J56L3P5j1J9NJ5N7k09R7j8j2k1
4283b8L8LRj2m0l6J24mj39J44rP3j15nk2k6L2K5n2M6L4m1o5Q2Rk2M6K8j03k2P1
4314B3o6P2J0j34J1Q9Kl7k0Q6m8O1r8O0L7Ll0m2J11j16k2KL5M6J7k7K9l5K6j73
4344a28M3O8Nl1Q2r6l7L6J9M7L8n4K4k3q3J57o8O1n6m9J6L9Rl9n7J26p7p1J70
4373G1p5j3L9Mp1Q4m2M1Jj16J84l8q7m9J11j56J87q3n8O7j4R7j02qL6m9O7l3l
4402hm9R9q3N8j9o5J97p5o5q7R1j1J30m7L3o3m3M4r0J37M0m3p5L1m9K0l2O8p1
$$ plain form
4194 -104 -84 -79 22 -41 -20 33 -60 -113 -6 -3 4 43 52 -28 -52 -43 64 26 6 44 149 48 30 41 23 -54 8 17 -99 -4
4224 -4 92 -8 -24 6 -43 126 -101 15 -24 16 80 -11 -61 -123 -22 -20 24 -67 -19 -20 13 -93 -140 -75 25 3 88 1
4252 1 -1 47 -16 -19 -60 -1 65 27 44 33 -40 17 10 43 -20 -30 34 -214 -58 -25 50 39 58 63 78 135 -74 23 5 -7 -28
4283 -28 10 13 22 10 -30 -66 58 54 -85 59 50 123 8 3 -19 -45 -13 12 -40 6 40 -1 -66 16 25 3 49 77 -26 -48 23
4314 23 -43 29 39 -95 -84 5 7 -30 -50 36 -12 49 -49 11 48 51 21 -21 90 -26 -48 -46 -11 35 52 25 54 19 45 -128
4344 -128 -85 -17 -12 -43 39 -57 -94 -58 -39 8 46 -8 16 -7 -90 67 -1 60 4 -45 -29 10 19 -20 -77 49 -28 -99 71
4373 71 -4 -17 22 26 -45 39 -3 38 39 -77 107 69 -18 -67 44 -112 75 -8 -66 1 -13 84 -18 -26 10 -39 28 -5 -8
4402 -8 -57 42 -41 17 -2 -67 130 55 -10 -97 -6 -17 113 66 99 36 -7 37 -53 84 124 81 6 37 -12 8 -24 44 -27
4431b7P6m2J6KL1q9j0Jj22K47q9o9N5KQ6j13jJ56j74j8P3qm5P0j0J6N9j30P4p6
4461e9QR9j29P9j4J46j74L9J1k8oM0K2m4j5kM3q9MN5J12m1j8q2J3LO4k2K6J0P
4492E8r8pL3P2n5l4k5J02PJ6l6m1Qo8J34j5p9k3L4N6M0j35Lk0P0n4N2R7j19J0
4522a7j01m3J23OQJ02r4p4O3j0Q0j0O5j0j11L3R6mr3p7P7N3q6L6K7k5k3M4L2p7
4552a0nN7M1j39N2N5o9K8k3o4N3J13j56J7J08J08j90J12j11O8L7j28J5O4k5O3
4578G1r6Q8j26L4l8o5K42j17J35j20K5P8p6j24O7P5JR8k12R3j31NK8J71k08Q5
4604a7o3J34p9o1J75k03J20N7q9JM3l4MJ47j47j6k7J8J42j29r8Q5m5J71j0k5q1
4631b7o9J22j37K05j29J5M9M1j33L5j03K35o9LpJ51j62l1j4M2K8N5j02J9N6j17
$$ plain form
4431 -27 49 7 23 25 56 -33 -43 -42 -164 83 -6 -75 -20 -18 68 -45 -46 110 -64 -82 -9 -17 -62 8 -2 14 73 -57 17 -59
4461 -59 -51 48 -81 -2 -16 130 -44 -5 6 -22 -28 12 34 -10 -25 -27 16 -73 -69 -14 98 57 39 -43 -30 -27 37 15 41 51 58
4492 58 -40 -47 -14 58 3 -31 -56 46 53 69 33 -8 0 -68 66 51 -28 -51 -17 39 79 -56 -53 -73 -3 -57 -5 92 -27 -17
4522 -17 -118 -161 -38 -32 -24 78 -16 -90 -27 -37 43 33 98 88 -23 10 106 102 9 -68 9 62 -24 12 39 14 -9 35 67 -10
4552 -10 -15 42 83 -56 -4 51 -18 10 -13 -77 -24 89 -67 -50 58 166 -24 88 -23 45 82 -46 -31 33 8 71
4578 71 -25 63 -63 -29 -67 -132 110 -7 128 8 33 111 35 -89 -22 53 54 152 -60 33 -98 -93 -65 106 -102 -17
4604 -17 -80 54 -25 -86 89 -114 6 63 -26 -25 18 -16 -12 135 -12 -28 -55 -37 105 -24 -122 -37 -82 89 79 54 -27
4631 -27 -96 26 -111 94 -35 -20 29 70 -63 -28 -131 104 35 38 31 182 20 -11 -25 17 45 100 -2 17 73 -44
4657d4k7p5J08o1OJ06J7n3Rk0R1OQ4k87J89j26O2M7P1q1n0J00L2Oj39O1O0j41
4685d9j0M7J7j50J07J6J5L1o9M1n1J6j6j37J71J18k51J47p0Q5oR2n6j06j1J48
4711F9j75R4N9j13K1J0l5J91q9j01j3J9N4m4K9L5lM7pj09J39k0P9k15P3k6k4J43
4739H8k50J55O4k2Q3m3p3j6q5J16L7N8n8o4Ol7Q0J8qj18Q6o7K7n6R1m0n0l3J03
4768hO8K1k8j25R3p5O1r5O7K2j57J27M9J7o9L4l9r2Q0J13j69J66p3P1j80J07J8
4795DL3n2K0J47r6j6n3J1l9Jp4O8R9j13O4L0j08N0j6L2J8k2p2K02j72K1J8J54
4823A39q6m4k9o9J16M0j46J21j30M4J1k7M2K5O4j0j15J1q5Q2j8Q4o9P1n9j7Rn0
4851i5M3M6Q6j40m9P0k6M6r4N4J52l8m9j5N8j15Qo9Q3J67j83mJ00l7J11j54M2
$$ plain form
4657 -44 -71 -146 -38 -99 -93 13 30 -23 -14 -34 57 63 147 -140 49 -77 -15 32 103 22 -28 72 104 110 -29 32 92 -49
4685 -49 -59 -12 5 -145 -38 -22 -7 24 -45 -4 -55 -39 -55 -192 -21 97 -154 -7 -77 8 2 94 38 -68 -79 69
4711 69 -106 -12 47 -66 -45 -35 -70 121 32 -69 -82 -63 -9 -53 -24 11 8 55 48 -61 78 58 137 -78 -5 -31 -55 88
4739 88 -162 -7 57 35 118 75 2 -14 -99 17 54 112 54 -10 -4 -41 39 57 49 -69 17 -50 -23 -79 12 -28 -78 -111 -8
4768 -8 60 81 53 -72 21 -54 7 -88 -21 1 -156 -29 20 37 -32 2 -37 -129 -49 64 -105 61 -12 59 -121 -14 4
4795 4 37 -15 5 152 56 40 -13 -2 -41 -40 -114 -46 53 -60 4 34 -74 -24 -40 -8 10 -12 -84 118 -54 -33 -15 139
4823 139 53 9 -20 -89 27 67 -79 42 -88 -44 -33 -60 -18 7 71 61 -54 -43 -128 -46 -64 20 -49 22 -37 -54 -45 -95
4851 -95 -52 -6 80 -60 -109 -39 -65 -19 -113 -59 93 55 6 -9 49 -66 -58 -127 -44 123 -60 -64 36 -1 110 -44 -2
4878bQ4j26O9Kj17J63p5R2O0j98J17q6n4P9N8q9Q4j77J8J2J57r3mk8J26j44Q5
4905A3k4M9M4j53J2J1RjO1o4J0p6J55n1j4j09J41N7j39mQ9J19n4M3j06P2o8k4
4933bpro4L7lJ02j34nR0J32j05j15O4mPo5J22j10O6j6mQ4%j09J1K9J0q8LR5L5
4964D7jj3p2P9o6j1k7Q8K0j94J78J08j61k3j08J70N0j18M3N6j43N4n0R5j2KN0
4991D1k7J12l10Q5J27m2J42j42J2j7J41m5L0l7j37J84k2o6m7o5M8Q5nj04N5l6
5017d0Q1oo7J10p3n5J0m6J14j5o2N2K5Lm7L5j5p2J61J08o9j89l8M1K2J23j15j2
5045c6K6K2o0q3K31k35O8N7J1l2j20J15M6N0j07R5j13J12j44J08j9N0j6o8O8m7
5071b1j2m8N7K0JO6p4k8J51j86J02j0O2j06J6m7k2J48n7Nl1M7j6p1P4J4o5J57
$$ plain form
4878 -2 82 -44 25 27 -90 73 -2 90 150 -48 69 -17 -71 8 66 -23 61 -116 -98 -86 71 -22 -26 -54 72 -72 13
4905 13 -11 38 82 -71 -59 -48 -39 -40 21 -43 -33 -109 46 -5 -19 -128 13 70 -69 -73 16 135 81 124 18 90 22 -2
4933 -2 -9 -18 -82 -45 -48 54 -80 -85 5 137 32 -83 -19 -23 -16 -81 41 -69 -3 -19 -23 61 61 -48 -37 -8 2 -86 -83 12 47
4964 47 46 33 -39 40 -26 -37 -64 24 44 -150 28 136 -25 -48 -156 14 64 -54 -11 45 -98 -44 -94 1 -11 -9 41
4991 41 14 126 -184 -99 28 -14 128 -14 -2 -19 122 77 107 70 -67 117 95 29 -18 -83 -35 50 45 -59 -4 -40
5017 -40 41 35 -32 78 5 -50 -40 -86 28 13 -49 3 28 31 -16 19 4 -68 93 201 132 -57 -95 -54 -32 91 -24 -36
5045 -36 -10 12 -48 -131 100 -135 -67 -10 1 -31 -151 -36 10 60 -47 48 -65 47 -97 11 -8 42 26 -42 26 -21
5071 -21 -33 -81 -24 -4 -3 63 -11 -39 112 -74 28 18 80 -26 -10 -57 -79 69 12 17 -14 33 17 -54 20 34 -31 126
5099A26q4j7P2o1K6j27R0J5J0j18L8n9P9l4J04j19o8J13L3k3j02L3PJ14j45J89
5125I2o9j6J17m4o6J9n5ll7p3J25k1P1m4Q4l8p5m4R4M5n6Kl7K4J12m5L7j81P8
5154dJ0n9L9J66j58P7j4p0m7k8Q7J25j54k9J31q7Mp7K35p6r8O2J2o8R2j08m6R0
5182GP5p1mj8M5nm8PN4m0k15K61Jl7J27j22%o4J33q9k4oO6j24J22Nj77R7R5n3
5212bO6J5n4%kq1Q2L3no0K0n2jK7M7M9p6Rj7J39p4P7r6k4O4j15R5L1j60m7Q5M5
5244A8j18J80o2j63J38J5m5o6J22k6P5o7M3M5o9o2P5J9r8O9kj1j2R7j06nn6J3
5272e9J03j47O3M5j3Ql3J29j43J00j58Q9o5R7O4j06K1P9j55J22r0L9K6JNM7j4
5299E5m3Pj4j7j2J3M1n1l9P9Nl0l2QK4J1j3l4J07Oj50k2J08j00J19m2oP4j47L9
$$ plain form
5099 126 42 25 97 36 62 -65 25 40 50 -68 -30 -89 -10 -44 60 -59 -127 -14 19 -4 -106 -73 -66 48 -97 92
5125 92 23 7 124 80 14 33 -22 -25 -62 -135 -10 -31 40 -4 80 42 -33 -77 17 62 6 8 -29 -5 107 62 99 -82 -4
5154 -4 6 -53 -14 152 -6 71 57 -13 -60 -88 -1 124 -30 -59 72 -15 -11 -88 147 71 -27 35 47 -21 71 -37 -83 7
5182 7 82 11 7 -11 34 29 -19 -12 42 2 -213 48 49 12 139 17 17 -47 86 -3 -27 -33 33 -91 31 36 -141 -44 51 -2
5212 -2 64 79 25 25 23 -58 24 57 52 -8 12 -40 -41 -14 33 82 6 15 -2 137 63 140 44 20 84 -31 64 95 -65 -112 -27 18
5244 18 -100 80 18 -145 -7 8 -37 -103 19 -7 68 1 44 89 20 -42 33 52 -46 23 21 10 -2 95 -11 -16 -72 -59
5272 -59 44 -103 -40 5 -8 0 -33 96 -47 53 -105 -16 -81 16 80 -26 -5 74 -81 41 -49 -10 16 17 22 69 55
5299 55 12 19 5 -12 -24 -11 30 -21 -60 19 24 -6 -38 -30 -6 5 -8 -42 65 71 -79 -101 7 -93 26 -16 -22 52 -95 -56
5329e6M0n6q6J35j4m4J27Jq1L0N3r1J7K0k1j6q5K59j30Rm6J19K7j74L6N7j29J90
5357I1l3j5n5l2j05j8P6M0p7J92l4j00J9K4k5p3J27pk1K6k4n9J42q3j0k4J16R
5385F7m9O3r9j3R1o2ML7Ln4L5plM9Oj05P2L9l8m0n5k4R1N4r1J6oM2P1n5p6j4k
5418e3M6l9J03j13o5J27m4kM2Rk0l4k8M4M4P6j81N1K4Q0r5J21Jo7o9K3l0P2l9
5447a6m6P3p1j5J06o3J8K7p2RP2J5O4l4j9j0j15L6O7k9o1M0%k2J05n5J4J3L6P1
5477A38N6r6p7p2J41o4o8J32J0m1p8r0K8j33J66onj5N0oL4J4k3o7M6J9P3r8R1
5506E9j05J1Q2o3N9M9r1J3j20L4K3J19Q7l3j32o2J17n8O9o9J26p3j6j7j0L5lo7
5534c6L4l0J01Rr8j37K39j79LK2O7M1q9J13Lj35P4o6N8P2o0R9j88Q9o2o4J36R6
$$ plain form
5329 -56 -16 -72 -158 -23 -37 -81 46 47 -34 -4 49 -42 -25 -5 -26 -42 -127 132 2 11 -35 84 111 -63 -27 30 -99 91
5357 91 58 43 -12 -44 -149 -167 -91 -51 -128 64 30 -70 -51 -27 -52 -125 2 -5 -26 0 -24 -83 59 -24 -34 -58 58 67
5385 67 18 81 -18 -31 60 -2 2 39 42 -12 23 16 13 62 68 -37 35 74 36 -4 -59 -83 8 62 -29 -13 -19 23 94 39 -37 -51 -53
5418 -53 -7 -46 57 -56 -121 6 -38 -40 2 11 -9 -43 -71 -27 17 93 -88 -37 -13 67 -28 93 94 27 -42 -19 -49 23 -16
5447 -16 -62 11 -60 -75 31 -32 -14 13 -59 -50 22 37 101 67 48 38 -77 -41 26 -3 -64 -24 -24 -46 59 4 18 31 67 138
5477 138 194 98 21 -51 90 26 -42 90 100 59 -19 -109 -81 -214 -48 -54 -59 -74 -24 -30 4 18 -5 -72 -26 -7 66 -32 59
5506 59 -46 -35 47 -16 43 92 1 14 -106 -72 -49 70 157 124 -8 -70 47 -11 58 -11 115 42 26 9 -1 34 31 -36
5534 -36 -2 -32 69 78 -20 -157 82 -97 -94 -72 -5 36 -53 60 63 -72 2 -64 -6 66 6 105 -83 6 -56 -120 16 112
5562A12j59M2k3KM1m4L1o6P2K4J2q0jM8m4J0R5r5OP8j16J6K8LK0n3rO6L8M6j77
5593g7J05K3j08J12p4NO4j3k7P1m6j9N6j47Q0n7O7J7k6k6J28r9r7nJ77j43L2J00
5621G3l9p7l4P7L2L8j31L3Mk6N0ko8J80j46N4p2R3m0j3rJ5N3j03K1j5M1k2M7j27
5651a13J15nn7J6p2J8K9J05o2Q3K0p3q5M3J7K3j14J05j14J68m8J8k9Poj8n1N5
5679b5j5R8l3q2N2K9j6o2J48j10Q9k5m0M7k22J19O6k9k6O1k1j57J24j29J60J4
5705A5l8kj51J08J50j25r4J46j0J78j55Jl8pl6K03j37o5J0J23j13o7J36m5p1J54
5731G0m8O8j22Q0k08J21J8R1p5n2Q3j9j01M8MLL7J01Q5j69j00J14n5L2n4Q4o5
5758b9L2j8l2P2L0J2j57J30o6O3n1N2N7k4p8kmJ14K5j80k3Q3l9N3O7j91O3K8N2
$$ plain form
5562 112 -47 -5 -28 -26 15 -29 2 -64 8 32 44 -36 -37 11 -33 -23 72 -23 -17 61 -55 -39 -11 -8 12 -41 -50 16 54 100 -77
5593 -77 28 51 -57 55 -19 -14 50 37 10 81 35 16 72 -75 5 -52 15 32 6 -20 108 9 -88 -93 84 -59 -27 73
5621 73 34 -43 -77 0 32 70 -61 -28 -24 -50 0 -2 -70 110 -36 18 -54 39 -1 -14 -23 -8 45 -58 -37 -52 -11 -33 14 -113
5651 -113 2 -3 -60 -44 -116 -98 -69 36 -26 57 77 4 -81 -38 -21 2 -112 -7 -121 47 -1 17 -12 -5 -11 -29 -80 -25
5679 -25 -40 58 25 -57 -5 24 8 -54 94 -16 73 48 8 55 -167 -48 18 -11 -37 24 3 -154 -30 -159 1 15
5705 15 -23 -25 -176 -68 82 -43 -137 9 -1 177 22 23 -15 -22 -58 145 8 -57 -47 76 -37 -104 32 -13 -84 70
5731 70 22 90 -32 48 -160 -39 -21 70 -5 -57 26 7 -94 -46 -42 -39 -2 99 184 15 -85 29 -26 6 -48 36 -29
5758 -29 3 -15 -47 25 55 67 -90 40 -26 37 -14 38 95 71 -7 -9 -13 101 126 -54 -77 6 -33 20 87 -104 -41 -13 39
5787C9k5p4l4O9m7J35p4nn2J10j20N5pp1J39o4k1J13r8o1J3J22K1j35O5l2L0L0
5815B1LL0o4K9q5j6l2j0K30k09Q5p1N8K3K6J5j1j03J48J0Pn0l5n2Q2O1n0ol0l8
5845c4O7J2m5r7M9M1n3j8J54n3j0k4o1J3K7n8J44m5N6j75J63k00Q3O8j17L9J13
5872C9Pj31N3J9o5j9R1N0L8r0O1q7n8Q7K4q0oR0om3K1p5J04K8j08Q2M2j34M7L1
5902A2m9P5q5L6N9Ln7R1Jq2K1nn0N5n6L0K2q5O8j03Q9R4q8J6j7J10q7KJ05j17
5932Hjj29J57j7j08J79j41JJ0J4K5J21j65K8On6j5K2P8llr1Q4Jm4j2P1j3l2l1
5962e6J19qk3j11N9J3P0q1P2Q4r9o5K0nj3n4J40Oj19M3l1O4q7J42j24m1K9o2Q1
5991c7K6L8K6p5Kj47K43J3Q8j71pk1O1J0j9J6K0Qm6j2q9N4P8K4k4pJ1n8J2Nj08
$$ plain form
5787 39 14 -60 -94 -25 -72 63 -11 -16 -68 42 -78 -23 -30 -101 38 -26 -47 66 -32 -93 -80 42 63 -72 -7 -39 -9 21
5815 21 24 54 -10 19 -66 -82 -114 -124 106 -103 -18 -89 -31 -8 18 33 22 -81 67 77 84 34 -1 -53 29 90 40 34 4 -34
5845 -34 33 45 0 -97 -48 -7 -60 -78 76 23 13 -11 -72 -59 -32 -90 54 9 65 -110 53 -147 -64 4 -113 -74 39
5872 39 46 -85 -32 -13 -78 -97 -6 44 82 -8 53 -34 -92 -5 19 -61 -67 23 17 -26 -5 -80 24 52 -56 26 68 -66 -19 12
5902 12 -37 38 -47 -11 48 51 -6 85 86 4 25 20 -30 25 -31 -1 21 -64 4 -99 -10 84 -4 12 -5 105 18 20 125 8
5932 8 7 -122 35 18 -90 89 -52 -51 -41 -27 -2 119 -46 -18 -12 -68 -83 -61 17 14 11 -80 4 5 -39 -51 20 7 -25 -56
5962 -56 63 55 32 -79 -20 -7 63 -18 54 138 39 -26 -6 -11 -24 -78 62 68 -51 -8 -39 25 -62 80 -44 -85 -56 -118 -37
5991 -37 -11 27 53 -22 -20 -167 76 89 177 6 -1 -22 39 49 30 46 66 74 28 16 -73 -19 59 83 59 52 63 5 17 22 -86
6022h6O7P6j03O3R0j21k2J2J03q5O8k0Nl5q1J11M4n7k0R7j17K5q6Q4p8L7J9l9
6050d9Q8L4l8j19O3L1k6o4Q4j02J6J54q3m4M2Q6l2j08R6Pj6M7j76R4J43j43K0
6077EJ5m1N5j28J33m7o8M9q6J44k2l8j09J61M1j28R4L3k3oK5jj72K05l4J4m5r5
6105f9J13K9m7r5J06o9L0M4pj37J20o6J56m2r6P2m0j18R0Q3p3p1R4K9K6k3L6j33
6133e8K4J3k1j8rJ27j7nq8N2Mo8J49m2n6N2j48K51j00o2J07m3J0l3o5P8j85J47
6161dR4j26Kj4N3J1n4o5J28l7l9O2L9k2l4nJ12Rj22o8KL2L2jRKP4j02o3L8ON0
6193aO0p2n1Q7j34J40q9qJ3J23p9L2j44J09n5j6J0N8Q8j11Q0q7J65r8%r6M6N4
6221B4K2j51J48Ln5p2K40j90p7R3J75j26j02Q6Q0j6r0K9r2k1m0R1j09K40j59J9
$$ plain form
6022 -86 -19 57 -46 17 107 -14 -36 -24 79 -6 62 42 47 12 -69 42 86 29 9 106 -11 14 -72 12 -66 -29 -10 -49
6050 -49 39 73 35 -84 -21 10 -16 -80 4 -98 -82 72 -11 -55 -13 73 41 -67 29 36 20 67 -109 -15 128 -15 5
6077 5 20 -21 34 -94 39 -8 -76 -27 -113 31 9 -29 -138 23 64 -64 30 63 40 34 59 58 -114 91 57 71 26 -69
6105 -69 44 73 26 -69 37 -32 -2 42 35 -102 18 -48 108 66 -30 42 2 -116 -26 57 -16 -87 7 36 62 39 75 -58
6133 -58 -34 -21 -42 -60 -69 58 41 36 -52 0 4 -64 85 43 -13 39 -109 142 42 -20 87 44 54 21 -44 34 -151 -4
6161 -4 90 -36 -34 -48 5 16 -38 -103 25 -12 -51 11 50 28 -6 -11 101 110 -12 -80 -78 -46 -14 -15 -6 -4 70 -32 -95 -57 -51 -1
6193 -1 59 -13 -64 23 -111 29 -60 -68 -55 68 -11 21 -123 -14 -69 -85 -75 -17 71 -40 40 -47 118 20 20 -76 -30 24
6221 24 46 -105 43 46 -9 -81 159 -31 -108 -15 160 34 -68 18 98 82 -8 21 -71 -92 -132 -41 -150 90 -69 -50
6247e0P5q2%R5n6K6%j12J15m7nN4n6N3J8k3N7l7Oq7J03J0j13J29J1o4j03O7L0
6276A4Q6k5p9K9n1P9RK0j38qj1J99j29K2l8j8j6j8J07p4P7p6J38q2N5p7J6j83
6304a72K47r3j39J66O8p7j8M6L1o7N8Mq9O8r2Q8p4N7j3k1J9M0p8K1k1K8KM0k4
6333Em7O3j0L6n7N0j47J40l2m5K0L1L4j42J32m8J13j55j2L6k0k5M4k0L0Q4j43
6360h5J44p8J13j65O7j2mpL5r0J12j68J93j45J36l0K6j28K7K4Q6q5j6N9k6OK4
6387A3p1P7L1J3L4j17L2j47Q0M0Q1j03M8N9j13J52j31J36j18l5m5K7L8q1N8Q2
6413D0kj3N9j01n9M4J17p6M7l5O2j07J31j40L6o0N9K3n2J99p0Jp3Q0o3o2k7M0
6441bJpJ29j69L5p9L8oJ20j4M9q1Ll4L2l1L6k2j21J52O8q2p9J04l7O8j38N5L3
$$ plain form
6247 -50 25 -57 -57 38 -18 8 8 -104 11 -36 -41 13 -43 10 28 5 62 25 31 -56 47 57 -56 73 84 20 -83 -16 14
6276 14 100 75 -4 25 -26 53 62 82 -56 -64 -75 124 -5 17 -21 -39 -55 -73 34 -40 37 -39 99 17 72 -5 11 -172
6304 -172 75 -18 -157 9 77 0 -18 28 59 -8 50 54 -35 33 -59 29 -45 12 -1 -22 -3 37 -41 -20 -41 -13 -11 29 5
6333 5 -42 21 11 47 -10 40 -107 33 1 -44 -24 7 41 -101 31 -17 96 -59 -71 -35 -55 -80 -36 -56 -26 58 -85
6360 -85 59 -19 94 -71 -4 -16 -20 -27 8 -82 30 -138 55 -90 46 16 42 -86 -59 -35 51 -34 -50 9 -17 -11 13
6387 13 -58 19 50 63 97 -20 12 -135 -55 -15 66 -37 11 70 -43 109 -22 114 -4 -39 -84 -57 -19 -100 -42 40
6413 40 38 25 84 -17 -76 -32 85 9 56 21 83 -24 107 -33 3 -57 2 25 -27 172 102 103 30 110 47 -15 -42 -2
6441 -2 -1 -8 121 -48 -13 -92 -54 -60 60 46 95 14 17 -17 15 -16 20 -2 -123 29 97 15 -64 40 3 71 -67 -12 21
6470B1Qr6R0k6j08J48O4j57NK4L0nn8P8o0R1j30R4n0J2N6k3N1r0N2qr8M5m7K18
6500A31m8p1J0n4J9N7l8n5j08P6m3J77j35M3P8Q2j42L8n1J10q8P1k7N0j56Q7K0
6527C3KM3j9j5j04P5O3M8j53J11j53N2j7K5qO3k8L1m1K2k1p9J42j02o8lJ37r9
6555f3J22m0l2J6n0J0M8N8o9R2r2N4j0j63K07n6J2J41j06j26L6lL1O0l4j19L0
6582d6lq2J39%q1J10j29J67n1j01O4l9pp2J00J06j49M5O8m3p9J19j67J20k9P7
6608C7j74K23p1j8k6N8n1rL7L2qM6n5P1q9L0k8n9J8K2m1J20k9j32OJ30n6l0M1
6637ej0k1K8j1Q1J3k7j2r0J24Mr7K9j02J58k4p7P9n8k3J00m7opj18J20j3PK1p
6667IL4r8R3O8j70J67j77Q3J05n5j4k3OO1k1jp9L9o3P8o6M6m4K1q9P8J1J4N2l0
$$ plain form
6470 21 29 -67 23 -3 -111 37 101 -56 -51 -27 3 -2 -60 18 -42 49 -81 13 -37 -25 31 8 59 -31 21 13 -85 -40 -87 131
6500 131 83 12 22 -32 -13 44 6 -49 -157 -81 -124 53 -82 -39 39 121 -21 17 -34 76 -12 59 32 82 -74 13 33
6527 33 35 78 59 44 -60 15 78 126 -27 84 -69 -17 -34 -9 -17 46 18 49 8 30 9 -70 72 -30 -98 -101 36 -63
6555 -63 59 19 -13 3 -47 -37 11 69 0 92 0 54 44 -119 88 32 44 185 79 -47 -11 -14 17 77 43 -76 -46
6582 -46 -49 -131 8 8 -73 37 -92 75 24 -77 -13 -52 -59 -131 -31 75 -74 -29 39 -4 -83 36 -131 -11 -40 37
6608 37 -137 86 15 -3 -29 29 -22 -31 6 38 30 76 21 92 3 33 5 -54 -36 -14 -55 65 36 -96 -90 40 -16 -46 -5
6637 -5 -15 -36 -8 -19 62 75 48 36 -54 70 74 -23 6 -96 62 38 -39 40 -18 -41 59 12 6 -1 -119 1 -12 -5 16 9
6667 9 43 -55 38 106 -64 103 -74 9 114 59 45 22 28 89 68 67 -12 27 -36 42 -24 22 -22 -1 -90 -12 -1 13 65 35
6697C5n6K2R7Q2k08J73j30j76J31o3Q1J59r1rm2L2j02j5J60j71J61k7l6J09k57
6722a41R7R5p7o9R4LM8O9K7j67l6J46m7K0j02QO4k8N9K9p0n1O9k8j00L1j6J25
$$ plain form
6697 35 -21 1 98 180 -28 145 15 -161 -30 -93 -12 147 56 47 5 37 -65 -80 80 -91 70 43 7 116 -141
6722 -141 -44 51 -26 -95 -1 2 50 119 146 -21 -57 89 42 62 -40 -32 32 4 63 92 22 -29 40 12 -88 -57 -73 52
$$ [...]
8191A0
##END NTUPLES=NMR FID
##END=
