##TITLE=1H_Pr 5053-3MeO
 CDCl3, 8 sc, 
 5.08.2021
##JCAMPDX= 6.0         $$ Bruker NMR JCAMP-DX V2.0
##DATA TYPE= NMR FID
##DATA CLASS= NTUPLES
##ORIGIN= UXNMR, Bruker Analytische Messtechnik GmbH
##OWNER= root
$$ XWIN-NMR		Version 3.5
$$ Thu Aug  5 12:56:39 2021 Russian Standard Time (UT+4h)  she@DPX200
##.OBSERVE FREQUENCY= 200.131506
##.OBSERVE NUCLEUS= ^1H
##.DELAY= (6, 6)
##.ACQUISITION MODE= SIMULTANEOUS
##.ACQUISITION SCHEME= undefined
##.AVERAGES= 8
##.DIGITISER RES= 18
##SPECTROMETER/DATA SYSTEM= spect
##.PULSE SEQUENCE= zg30
##.SOLVENT NAME= CDCl3
##.SHIFT REFERENCE= (INTERNAL, CDCl3, 0, 15.7039)
##AUDIT TRAIL= $$ (NUMBER, WHEN, WHO, WHERE, WHAT)
$$ ##TITLE= Audit trail, XWIN-NMR		Version 3.5
$$ ##JCAMPDX= 5.01
$$ ##ORIGIN= Bruker BioSpin GmbH
$$ ##OWNER= she
$$ F:/spectra/data/she/nmr/H-F/1/audita.txt
$$ ##AUDIT TRAIL=  $$ (NUMBER, WHEN, WHO, WHERE, WHAT)
(   1,<2021-08-05 12:55:20.03 +0400>,<she>,<DPX200>,
      <created by zg, POWCHK disabled, PULCHK disabled
       configuration hash MD5:
       00 E9 B6 7A A2 85 ED C7 34 08 36 98 17 FE 4E 26
       data hash MD5: 16K
       1A B9 8D 49 20 27 86 05 7A 16 E9 CC 8E 43 97 BB>)
$$ ##END=
$$ 
$$ hash MD5
$$ 17 1C 0E 92 0C 60 1D ED 60 6F 70 DF 04 2F 52 55
##$RELAX= 
##$RELAX= 
##$RELAX= 
##$RELAX= 
##$RELAX= 
##$RELAX= 
$$ Bruker specific parameters
$$ --------------------------
##$DU= <F:/spectra>
##$EXPNO= 1
##$NAME= <H-F>
##$PROCNO= 1
##$TYPE= <nmr>
##$USER= <she>
##$AMP= (0..31)
100 100 100 100 100 100 100 100 100 100 100 100 100 100 100 100 100 100 
100 100 100 100 100 100 100 100 100 100 100 100 100 100 
##$AQSEQ= 0
##$AQ_mod= 1
##$AUNM= <au_zg>
##$AUTOPOS= <>
##$BF1= 200.13
##$BF2= 200.13
##$BF3= 200.13
##$BF4= 200.13
##$BF5= 200.13
##$BF6= 200.13
##$BF7= 200.13
##$BF8= 200.13
##$BYTORDA= 1
##$CFDGTYP= 0
##$CFRGTYP= 5
##$CHEMSTR= <none>
##$CNST= (0..31)
1 1 145 1 1 1 1 1 1 1 1 1 1 1 1 1 1 1 1 1 1 1 1 1 1 1 1 1 1 1 1 1 
##$CPDPRG= <>
##$CPDPRG1= <>
##$CPDPRG2= <>
##$CPDPRG3= <>
##$CPDPRG4= <mlev>
##$CPDPRG5= <mlev>
##$CPDPRG6= <mlev>
##$CPDPRG7= <mlev>
##$CPDPRG8= <mlev>
##$CPDPRGB= <>
##$CPDPRGT= <>
##$D= (0..31)
0 1.2 0 0 0 0 0 0 0 0.06 0 0.03 0 0 0 0 0.0002 0 0 0 0 0 0 0 0 0 0 0 0 
0 0 0 
##$DATE= 1628153719
##$DBL= (0..7)
120 120 120 120 120 120 120 120 
##$DBP= (0..7)
150 150 150 150 150 150 150 150 
##$DBP07= 0
##$DBPNAM0= <>
##$DBPNAM1= <>
##$DBPNAM2= <>
##$DBPNAM3= <>
##$DBPNAM4= <>
##$DBPNAM5= <>
##$DBPNAM6= <>
##$DBPNAM7= <>
##$DBPOAL= (0..7)
0.5 0.5 0.5 0.5 0.5 0.5 0.5 0.5 
##$DBPOFFS= (0..7)
0 0 0 0 0 0 0 0 
##$DE= 6
##$DECBNUC= <off>
##$DECIM= 32
##$DECNUC= <off>
##$DECSTAT= 4
##$DIGMOD= 1
##$DIGTYP= 9
##$DL= (0..7)
0 120 120 120 120 120 120 120 
##$DP= (0..7)
150 150 150 150 150 150 150 150 
##$DP07= 0
##$DPNAME0= <>
##$DPNAME1= <>
##$DPNAME2= <>
##$DPNAME3= <>
##$DPNAME4= <>
##$DPNAME5= <>
##$DPNAME6= <>
##$DPNAME7= <>
##$DPOAL= (0..7)
0.5 0.5 0.5 0.5 0.5 0.5 0.5 0.5 
##$DPOFFS= (0..7)
0 0 0 0 0 0 0 0 
##$DQDMODE= 0
##$DR= 18
##$DS= 0
##$DSLIST= <SSSSSSSSSSSSSSS>
$$ [...]
##$SUBNAM2= <"">
##$SUBNAM3= <"">
##$SUBNAM4= <"">
##$SUBNAM5= <"">
##$SUBNAM6= <"">
##$SUBNAM7= <"">
##$SUBNAM8= <"">
##$SUBNAM9= <"">
##$SW= 20.0188882624521
##$SWIBOX= (0..15)
0 0 2 0 0 0 0 0 0 0 0 0 0 0 0 0 
##$SW_h= 4006.41025641026
##$TD= 16384
##$TD0= 1
##$TE= 0
##$TE2= 300
##$TE3= 300
##$TEG= 300
##$TL= (0..7)
0 120 120 120 120 120 120 120 
##$TP= (0..7)
150 150 150 150 150 150 150 150 
##$TP07= 0
##$TPNAME0= <>
##$TPNAME1= <>
##$TPNAME2= <>
##$TPNAME3= <>
##$TPNAME4= <>
##$TPNAME5= <>
##$TPNAME6= <>
##$TPNAME7= <>
##$TPOAL= (0..7)
0.5 0.5 0.5 0.5 0.5 0.5 0.5 0.5 
##$TPOFFS= (0..7)
0 0 0 0 0 0 0 0 
##$TUNHIN= 0
##$TUNHOUT= 0
##$TUNXOUT= 0
##$USERA1= <user>
##$USERA2= <user>
##$USERA3= <user>
##$USERA4= <user>
##$USERA5= <user>
##$V9= 5
##$VALIST= <valist>
##$VCLIST= <CCCCCCCCCCCCCCC>
##$VD= 0
##$VDLIST= <DDDDDDDDDDDDDDD>
##$VPLIST= <PPPPPPPPPPPPPPP>
##$VTLIST= <TTTTTTTTTTTTTTT>
##$WBST= 1024
##$WBSW= 4
##$XGAIN= (0..3)
0 0 0 0 
##$XL= 0
##$YL= 0
##$YMAX_a= 643979
##$YMIN_a= -963544
##$ZGOPTNS= <>
##$ZL1= 120
##$ZL2= 120
##$ZL3= 120
##$ZL4= 120
##$ABSF1= 10
##$ABSF2= 0
##$ABSG= 5
##$ABSL= 3
##$ALPHA= 0
##$AQORDER= 0
##$ASSFAC= 0
##$ASSFACI= 0
##$ASSFACX= 0
##$ASSWID= 0
##$AUNMP= <proc_1d>
##$AZFE= 0.1
##$AZFW= 0.1
##$BCFW= 1
##$BC_mod= 2
##$BYTORDP= 1
##$COROFFS= 0
##$CY= 11.3945322036743
##$DATMOD= 1
##$DC= 2
##$DFILT= <>
##$DTYPP= 0
##$F1P= 2.36226072786647
##$F2P= -0.459571619588291
##$FCOR= 0.5
##$FTSIZE= 0
##$FT_mod= 4
##$GAMMA= 1
##$GB= 0.15
##$INTBC= 1
##$INTSCL= 1
##$ISEN= 128
##$LB= 0.24
##$LEV0= 0
##$LPBIN= 0
##$MAXI= 10000
##$MC2= 0
##$MEAN= 0
##$ME_mod= 0
##$MI= 1.114404
##$NCOEF= 0
##$NC_proc= 0
##$NLEV= 6
##$NOISF1= 3.799351
##$NOISF2= 2.8
##$NSP= 1
##$NTH_PI= 0
##$NZP= 0
##$OFFSET= 15.70392
##$PC= 1
##$PHC0= -13359.45
##$PHC1= 16.60099
##$PH_mod= 1
##$PKNL= yes
##$PPARMOD= 0
##$PSCAL= 0
##$PSIGN= 0
##$REVERSE= no
##$SF= 200.130013532006
##$SI= 16384
##$SIGF1= 3
##$SIGF2= 2
##$SINO= 400
##$SIOLD= 16384
##$SREGLST= <1H.CDCl3>
##$SSB= 0
##$STSI= 0
##$STSR= 0
##$SW_p= 3612.71676300578
##$SYMM= 0
##$S_DEV= 0
##$TDeff= 0
##$TDoff= 0
##$TI= <>
##$TILT= no
##$TM1= 0
##$TM2= 0
##$TOPLEV= 0
##$USERP1= <user>
##$USERP2= <user>
##$USERP3= <user>
##$USERP4= <user>
##$USERP5= <user>
##$WDW= 1
##$XDIM= 8192
##$YMAX_p= 0
##$YMIN_p= 0
$$ End of Bruker specific parameters
$$ ---------------------------------
##NTUPLES= NMR FID
##VAR_NAME=  TIME,          FID/REAL,        FID/IMAG
##SYMBOL=    X,             R,               I
##VAR_TYPE=  INDEPENDENT,   DEPENDENT,       DEPENDENT
##VAR_FORM=  AFFN,          ASDF,            ASDF
##VAR_DIM=   8192,          8192,            8192
##UNITS=     SECONDS,       ARBITRARY UNITS, ARBITRARY UNITS
##FACTOR=    0.0002496,     1,               1
##FIRST=     0,             0,               0
##LAST=      2.0444736,     0,               0
##MIN=       0,             -963544,         0
##MAX=       2.0444736,     643979,          0
$$ Real data points
##PAGE= N=1
##DATA TABLE= (X++(R..R)), XYDATA
0@%%%%%%%Qj6J6j6K4l2M0n6P2q8J04j28J60j92K32k80L28l83M49n27O11p01Q07
30D32r26J059j205J365j545J744j962K202k465K753l070L415l790M202m652N145
46B702n683O266o907P611q384R238j0180J1223j2390J3704j5186J6877j8831K1115
60A1175k3825K7103l1171L6366m3269N2950o7603R2639j46657M62918m75676o95059
72h00109J031791K77520n26823k12024K71631o4480j8626O1773l8562l5223J63150
83A10018j23062j59732L12671K86352n14831m15491N68417N79637m86731o02174
93d44926K21546M40107k8656k08519j21327N774J50185Q6814j58771l5080J67928
104G5075p4755j48360K63843J77247l58319k20323L10040K16651j20834j26071
$$ y = [0, 0, 0, 0, 0, 0, 0, 0, 8, -8, 8, -8, 16, -16, 24, -32, 40, -48, 56, -72, 88, -104, 128, -152, 176, -207, 242, -285, 326, -375, 432, -494, 565, -640, 725, -820, 924, -1038, 1164, -1301, 1452, -1618, 1797, -1993, 2209, -2443, 2702, -2981, 3285, -3622, 3989, -4395, 4843, -5337, 5886, -6504, 7200, -7986, 8891, -9940, 11175, -12650, 14453, -16718, 19648, -23621, 29329, -38274, 54365, -92292, 370626, -105050, -800109, 231682, 509202, -17621, -229645, 41986, -22494, -41120, 20653, -17909, -53132, 110018, -13044, -172776, 139895, 426247, -88584, -504075, 64342, 643979, 157248, -444926, -223380, 216727, 188071, -20448, -141775, -136001, 14184, 100998, -57773, -92853, 75075, 320, -148040, 115803, 293050, -65269, -285592, 24448, 241099, 120265, -5806]
114e806j41480q7677K94931K40743l47211l01681K87053K47445j83257j16178
124a13118J19069k0280p6117J79423J08529k48535j27699K06456O6337r4321Q9399
135H9143k7621l15807N2922M46846m3696m54067J4432L48169J6331j71309j2925
146e7582R150R446J37932L9255j70053n4049J03850Q14j6851J00813k4256k21421
158a42952l8164K53158J05458k14071j44925J21733J46182l677r5693p9787M0313
169e2425J43830L9820j24235n7164N2988j0473J1136J10831m1979j94805J676
180a20800J70541K3080r1111k5626r055J0414J02617L2967j33214o3301J24766
191B1278J03921n0619q9567l2184R200O3646P7198n5855j41149L439J21856Q904
$$ y = [-5806, -147286, -234963, 59968, 300711, -46500, -348181, -61128, 186317, 3060, -113118, 5951, -14329, -90446, 88977, 197506, -51029, -178728, 27728, 94065, -256, 89143, 61522, -254285, -201363, 245483, 201787, -252280, -237848, 110321, 126652, -44657, -57582, -48432, -38986, 98946, 138201, -31852, -85901, 17949, 18763, 1912, 102725, 78469, -142952, -181116, 72042, 177500, -36571, -181496, -59763, 86419, 82742, -12951, -92738, -52425, 91405, 131225, 6990, -50174, 2814, -7659, 3477, 114308, 72329, -122476, -120800, 49741, 72821, -18290, -43916, -52971, -42557, 60060, 93027, -40187, -103488, 21278, 125199, 74580, -14987, -47171, -37971, 25675, 102873, 47018, -94131, -90692, 31164, 40068]
203D0068p6811J8433K9051o6039K0042J27331k8932j45116J8061J37794L9353
214A13235p4645r2452k7116R1329R6129o9170j26665K3335Q5140j6333m0070L2126
226e157J9138n2859q443R4007L3975j01432n8194Q5975R3919k5808j02442n8055
238h5376N6515J01409j5007j14310j4464P6735n235l7107M2359J7583o2634m193
250d3725Q5391K4991o8074m2654L0356O2216K8589n8812p9852J3118P4489J8857
262D4890n2882l5091J7650R213k953K8167J0937m6554j3549O6978L1315n5481
274B640l0793K5051K0246K3595J343o4237l5896N1905L8442k5361k3441o178j4833
287c7517J6781M7692o922m8100J669M4612J9898k0801k4537K1J3434J9598J2137
$$ y = [40068, -36743, -18310, 10741, -55298, -35256, 92075, 63143, -81973, -63912, 73882, 113235, 38590, -53862, -80978, 10351, 106480, 37310, -89355, -66020, 19120, 2787, -37283, -5157, 13981, -38878, -47321, 46686, 80661, -20771, -78965, 7010, 100929, 75121, -27321, -85376, -28861, 72548, 57541, -56769, -71233, 5502, 267, -36840, 5519, 23102, -39532, -43725, 41666, 66657, -1417, -44071, -13715, 48501, 77090, 18278, -61574, -48456, 26033, 44890, -7992, -43083, -25433, -16220, -19173, 8994, 19931, -26623, -40172, 26806, 58121, 2640, -28153, -3102, 17144, 40739, 42082, -22155, -58051, -6146, 32296, 6935, -16506, -22684, -37517, -20736, 26956, 20034, -28066, -26397, 18215, 38113, 17312, -7225, -7204, 6230, 25828, 37965]
300C7965l1974m4496J0375M1299M109k2498j0770j3373m13M4220J6184m7762j0933
313b8067M2523J0609j2572K981j2565j9230K7296L2166l0429m0873N885J8704
325c572R217J888j8395k0040Q182K8861J2655j8969j3652J4051J4345M943M421
338B3935j3052k6584R329M1604o893m8198n322J9745Q0N975K083k5167n566K9956
352A925J1209j4457J83L510n511J7587K0642k3981k9998J1857K6513J066k4181
365c636j7534K641P302Q274M965j1984j3742J0277K0947K267o871j266m556Q706
379E790K5665r998l7819L721K7101k213j4116m104j1382o320J8796J2598j3318
392e599r140K043O004J8691Q270j8759j2103J5475J9636k939k2581j1202J2153
$$ y = [37965, 5991, -38505, -28130, 13169, 17278, -5220, -15990, -29363, -29776, 14444, 30628, -17134, -28067, 14456, 25065, 12493, 15474, 2909, -16321, 10975, 43141, 12712, -28161, -22276, -3572, 5645, 7533, -10862, -30902, -22720, 6141, 18796, -173, -13825, 226, 14571, 19514, 23935, 10883, -15701, -6372, 35232, 28339, -19859, -25181, -5436, -5356, 619, 2702, -22465, -28031, 1925, 13134, -1323, -1140, 2370, -3141, 14446, 35088, 11107, -18891, -7034, 19479, 20545, -3636, -21170, -18529, -11227, -2953, 2012, -9972, -23714, -13437, 7510, 9777, 2906, 1640, -2916, 5790, 31455, 21457, -16362, -12641, 14460, 12247, -1869, -5973, -17355, -23675, -4879, 7719, -5599, -14739, -12696, -6692, 11999, 20269, 1510, -10593, 4882, 24518, 21579, -1002, -12204, -51]
405e1J0233o842q450m768q938L584K0268J167j5659j799L709R334K1311l297k9518
420i716p07K8979P527j9182j3233j559N923J0501n651j6448j33N401J084Q422
434A208L926j0730p081J0618J8513O054j4929j8932O306K7010L686k5516j6581
447a6448N718J6103N588j8878j3501J2587O858o438P243Q748j3575r172K1087
460E920J7535j0282j5744q662J0343K5353l288l5107j3468K2442J9852j1943k3688
473b0737L53J8514L573r905P089J0834j5528p177K7632J4042k1115j8974K999
486h400J9631J4437j7639l1250o49K9816J2004k3498k1237R874K4092K355j6766
499g230L714J4117j2815n976K8469R884l2431k0337K2449K4019q122k4694j5616
$$ y = [-51, 10182, 3340, -5110, -9878, -18816, -15232, 5036, 6203, -9456, -11255, -7546, 1788, 23099, 19802, -9716, -10423, 18556, 26083, 6901, -6332, -7891, -1968, 8533, 2882, -13566, -13699, -8298, -7214, 1208, 5134, -5596, -12677, -2059, 16454, 22508, 7579, -11353, -5047, 21963, 25649, 133, -16448, -10730, 5373, 10961, -7917, -21418, -8831, -1973, -8411, -1168, 7580, -5995, -15167, 5920, 23455, 13173, -2571, -11233, -890, 24463, 21175, -13932, -27400, -4958, 14894, 2951, -20737, -20384, -1870, 1703, -8202, -1113, 9721, -5807, -12984, 14648, 28690, 7575, -11399, -8400, 11231, 25668, 8029, -23221, -23870, 5946, 17950, -5548, -26785, -16911, 7181, 9536, -7230, -3516, 10601, -2214, -8190, 20279, 30163, -2268, -22605, -156, 23863, 15741, -8953, -24569]
512b4569R176K6113L872k5659j7954J7950L0902k809k8189J584K3426m252j0629
525a038K0234N918l7618j3149L8777J5944k8517k2232m22J5507K1280l253l0126
538a8695j2660L1196L2067j8295l6232R695L5193l236k2972J0663Q031l1243m989
551b1477L9679P156l7789k2133J5718K8498R409k1243k8294Q247M1568J5404l3600
564A143l0664K1835L9993q031l5073L800J7029j7688p919L1081N941m5203j9801
577d3557M2219L2956k1827l5395k648L0847K8858q583l5359j6079L1346L7941
589D0719j9819m4791P879L0196j3191j4626K6279l8m7104J154N6739R873m5375
602a2105k1967K4680L4203P095k5550k9836M635L9819K0152l5116l8037J6869
$$ y = [-24569, -15393, 10720, 14592, -11067, -29021, -11071, 19831, 17022, -11167, -9583, 13843, 9591, -1038, 19196, 25114, -12504, -25653, 13124, 29068, 551, -21681, -22103, -6596, 14684, 11431, -18695, -31355, -159, 31908, 13613, -22619, -12924, 22269, 19033, -3939, 6724, 14755, -16488, -21477, 18202, 25358, -12431, -34564, -18846, 9652, 19061, -2182, -30476, -22229, 19339, 34743, 1143, -29521, -7686, 32307, 24276, -10797, -6997, 10032, -7656, -15575, 15506, 21447, -23756, -43557, -1338, 31618, 9791, -25604, -28252, 2595, 31453, 22870, -12489, -28568, 2778, 40719, 20900, -23891, -16012, 14184, 993, -13633, 12646, 12608, -34496, -33342, 23397, 33270, -12105, -34072, -9392, 24811, 31906, 6356, -23480, -18845, 20974, 41126, 6010, -32027, -15158]
614a5158L2281q975j7441R538m569k2196J6601L7070r473m0002o622L6847L0540
627C8441j5794l9801j0701L1721L0085j0108l5705k0704J9905L3762n996l1824
639a6719k054J5469k018L090J8307p483l2301M865M4727J2635l8882l0789J8120
652a3033L7096N768k7414k7218k627K8529K6032k0903l5915R030K7372j099n236
665C82Q370j1718j7780K3540L2541j6115l8236n697L0403K5408j3314l4469j3984
678c0669K0039K8603J030k8403j9357J5711K7483J859j5535q456p06R055J8672
691A9326J976k2894j7722R350K6008R333k4742k9089O389L0666J1473j7021k1522
704a8469n475K2310K7312r961l0992j384K3252J2720m200j1997j3332k591J6089
$$ y = [-15158, 17123, 8148, -9293, 245, -4324, -26520, -9919, 27151, 17678, -22324, -28946, 7901, 38441, 22647, -17154, -27855, 3866, 33951, 23843, -11862, -32566, -12661, 21101, 15105, -16719, -18773, -3304, -5322, -2232, 16075, 8592, -23709, -18844, 25883, 38518, -364, -31153, -13033, 24063, 29831, 2417, -24801, -27428, 1101, 27133, 6230, -29685, -20655, 6717, 5618, 382, 8752, -2966, -20746, 2794, 35335, 19220, -19016, -24713, 5690, 31098, 17784, -16685, -30669, -10630, 17973, 19003, -9400, -28757, -13046, 14437, 16296, 761, -7695, -8401, 654, 19326, 21302, -1592, -19314, -9964, 16044, 25377, 635, -28454, -22065, 8601, 20074, 3053, -18469, -23944, -1634, 25678, 15717, -15275, -16659, 6593, 19313, 15113, 3116, -10216, -12807, 3282]
717C282J6285p725k6313j3645J9303K7369m333k6452j2443J4066K8471O929k8131
730c337k0320J8973K6483j671j8439j1396k402R440J6765p90k0768j5724N341
743a7845K3623J4181j8756k5777O315K9613J2959j7442k1562R56K3054J6480j4122
756A1677k1695l902R281J3867N769j5196j9997J442J9487J4726p248k1188q250
769b1227K0768K3460p338k3041o795J2614J9322L239k1192j8056O413J8884Q763
782A5814j1270j9672o281J6617J9619l205j8848r346R600K0795P662j7768j7887
795a4170N191J9618J0338j1351k1630p044J7078J7828o477k0064q412Q977J7558
808G440P025j4818j4977M938J7531J1408p791j8958n983J5921J6650m657j9489
$$ y = [3282, 19567, 11842, -14471, -28116, -8813, 18556, 14223, -12229, -24672, -10606, 17865, 24794, -3337, -23657, -4684, 21799, 20128, 1689, -9707, -12109, -2669, 14096, 13306, -7462, -23186, -17845, 5778, 19959, 1203, -24574, -18259, 11354, 24313, 6871, -14691, -13735, 9319, 25799, 11677, -10018, -13920, -4639, 9228, 14997, -199, -20196, -18754, 733, 15459, 8211, -12977, -21227, -459, 23001, 15663, -7378, -14173, -1559, 17763, 21002, -190, -18246, -11833, 7051, 15814, 4544, -15128, -21409, -4792, 14827, 11622, -7226, -16572, -6972, 13823, 21485, 3717, -14170, -8979, 10639, 20977, 9626, -12004, -19048, -1970, 15858, 9381, -10683, -19095, -10118, 7440, 14465, -353, -15330, -10392, 7139, 18547, 10756, -8202, -14185, 1736, 18386, 13729, -5760]
821e760j2275P252J9169N486j7297j4740M239J4780J1064n069j6394m804J5688
834A339J6157l587j6634r853P465J7845M970j7179j6376K590J4432J0283o549
847D903j6787n926J2977J5211M5j3646r410P403J7991M873j5349j2603L852J2934
861F468R163p731j8305n116J2204J1844o97j1912j1130L968J7470P697j2065j1636
875i778L435J2975R432n985j5918l684J1780R784k603j3009r911L532J3837N971
889I858j0210j2646O05J3220J2089m939j4936j728J1960R586j301j1250r472M323
903d841J2777K700j1272j0751n60Q842J0946k625j5362l953J1981J1781P6j0717
917i78p932O218J3098K883j0475j0364N22Q160P334m381j2303n005O592J0236
$$ y = [-5760, -18035, -10783, 8386, 13872, -3425, -18165, -13926, 854, 11918, 6849, -9545, -14349, 1339, 17496, 13909, -2725, -12578, -5113, 12732, 17702, 523, -15853, -13263, 1169, 11452, 4903, -11884, -17810, -4833, 10378, 10423, -3223, -12633, -5230, 12761, 17634, 2285, -10318, -6466, 6468, 15631, 7900, -10405, -15521, -3317, 8527, 7830, -4082, -15212, -11244, 6226, 13923, 1858, -9778, -6343, 6632, 16064, 10079, -5839, -9523, 2257, 12041, 9438, -3571, -13482, -9950, 3887, 9858, -352, -12998, -12393, 827, 12916, 7977, -6959, -8687, 3273, 12859, 11558, 308, -9164, -4841, 7936, 10636, -636, -11387, -11947, -3105, 7841, 5216, -10146, -14099, -2118, 9663, 9739, -978, -8910, -2692, 10406, 13289, 2814, -7550, -7028, 1132, 8466, 4085, -8218, -13223, -6631, 3605]
931C605L224r941r632O506J3111L993p176q921k48J0584R237o702j4116k042Q068
946d50O263J73q698r837L085J1466N397o377q444r3Q570R790j579j1557m854P909
962G64J0182q6j2216q817N625Q789K039o095r277j310R219P784k815p244j850
977e308K523P832P469p801j2446M114J1707J978p396q566j967O399Q051k700j1328
992g439l496P691O920K84m667l571Q68M408P504J91j1155n370R055Q194l928r049
1008c560m059J891P289M536q238q809M275Q636K278l008l741j114L971N513J163
1023G023m593n027q93O271O235o014j1248k0Q090M478l441o687j460M389N576
1038B679K218m600m907L871P100m86m530J56j027m010N796P008j0295j1340P694
$$ y = [3605, 6829, -3112, -12744, -6238, 6873, 10866, 3690, -5231, -5479, 5105, 14342, 7640, -6476, -8518, -450, 5813, 5986, -2712, -12549, -9464, 2002, 7399, 1022, -7422, -7515, 1055, 10845, 9266, -2291, -7145, 764, 10946, 10860, -1356, -10173, -4548, 4241, 6280, 185, -9092, -10402, -1183, 6601, 3786, -3458, -5308, -2785, 5047, 12516, 4715, -7731, -3617, 8090, 10068, 2672, -5894, -7861, -1462, 6589, 3889, -7439, -10935, -3244, 3676, 3960, -707, -4278, -3410, 998, 8502, 8693, -2462, -7832, 1223, 9417, 5489, -3560, -7619, -5728, 1561, 6097, -2141, -10950, -6675, 1961, 4239, 1231, -2510, -3624, 347, 5860, 7023, 2430, -2597, -3490, 2781, 9016, 3002, -8246, -8266, -176, 4302, 861, -5826, -7286, -2897, 2679, 4897, 297, -4610, -739, 6361, 5875, 1345, 1501, 474, -3536, 2260, 9268, -1027, -12367, -4673]
1053d673J0373l576o377L46L47K023P038M56q136j298P902K949n100k387K768
1068B655l076k831P054J776j1669m758R977O276n689m635J270J475L919M418m195
1083A967m818K685L817M72j417l091j479P96N72P11J78m234m392N627Q504m407
1099A491q665K872P521J598k957j027k58j374K463M491l705p443J353N805k469
1114c04l103M363k896q328Q869J1182r601j0329R190Q921n095k810K446k896j446
1129a837O828J381q599l628N126K453k795k5P33n109o34J0450L541j0626m576
1144g317Q785O028l400l009j757p53M356K576m930m101K95J311K910J533m597
1159b070m304K883N273J741p71m180m325O419R565m187j0480J40P106K042m114
$$ y = [-4673, 5700, 2124, -4253, -3907, -3560, -1537, 5501, 5957, -2179, -3477, 4425, 7374, 2274, -113, 2655, -421, -3252, 3802, 5578, -6091, -10849, -872, 5404, -285, -4920, -3650, -2175, 1744, 6162, 1967, -2851, -166, 3651, 4123, 2706, -385, -1864, -1068, -496, 215, 393, -3841, -8233, -2606, 5898, 1491, -7174, -4302, 3219, 4817, 1860, 833, 575, -799, 1664, 6155, 2450, -4993, -3640, 2165, -304, -3407, 956, -1940, -10268, -1399, 9783, 182, -10147, -957, 7964, 2869, 59, 2505, -391, -1837, 4991, 6372, -2227, -5855, -729, 1724, -1071, -1096, -363, -5472, -6106, 4344, 7885, -2741, -7317, 1468, 7496, 4096, 1087, -670, -1423, 2933, 5509, 579, -3522, -3227, -1916, 994, 2527, -2070, -6374, -3491, 1782, 3523, 2752, -1428, -5753, 666, 10231, 6044, -4436, -4296, 2810, 4852, 738]
1174G38j868j165l056K983P140l308r205J684Q725M21k993K390m378m095J0757
1189D770O999j1725q474P433O156l103k561j581m510K132Q149l96p665k549N827
1204a098M281r5q69k690l701N100Q320l426j0010j545O407L507j459m104o233
1219g615J414R529J229o926k129J994K291M914J636o968m768O361O171k338m523
1234B72l757j251N950N450n472r264K10R353L894m903l603q0J373N473M346n576
1250B415q225L845Q394j129m353k192l985J771R054k47j1333l298Q117N466j705
1265B595k945l507j029P276O287n440q042R43O462K219k014l726m917M51Q420
1280C033L249q565o605M597O675J187j538m505l928O337R187l665r249m81M722
$$ y = [738, -1130, -2295, -5351, -2368, 4772, 1464, -7741, -6057, 2668, 3089, 96, 2486, -1892, -5987, 4770, 11769, 44, -8430, -997, 5159, 2056, -505, -2086, -6596, -4464, 3685, 3289, -4376, -6925, -1098, 3183, 3088, 2219, -471, -4172, 928, 9248, 5822, -4188, -5733, 674, 4181, 2722, -1382, -7615, -6201, 3328, 4557, -2369, -4498, -2504, -213, 4701, 6337, -631, -5399, 962, 7133, 4795, 272, -3485, -4736, 1214, 6664, 1192, -8072, -7862, 1491, 5385, 482, -3121, -3201, -1828, 3645, 7991, 2415, -5810, -1965, 6429, 5300, 947, -1245, -5230, -3459, 5595, 5348, -5985, -9283, -1166, 4300, 2595, -350, -3857, -4886, 2390, 8677, 3237, -4805, -3862, 2600, 4819, 2805, -921, -5838, -5387, 3033, 6282, -2283, -8888, -4291, 2384, 3571, 2033, -2472, -6400, -63, 9124, 5459, -3790, -4271, 451]
1295D51L225J270l433p399q66Q576L836n388n747j20M435N484O94o063n192M142
1311b095R105J94p675l392K203L842L425j975q313l364P783O228m476n198j166
1326d874J054N798N318n302q481K713R194J730n218m008j583K834O617k10q502
1341b920n142N312O987n64n194l366k57N434O724k527q876j480P942M600k804
1356C869m331l521J30P344L493p801p160L179O113K177k299m723l295M986Q220
1371F381q91p716k931M337M999J634l667o488j567O769N924m968p631k65M732
1386a348M510L76m589n359K237R196K255p394l903J959L985L957p25p749m583
1401g175O217P133k559o752k715J727N552M106m049p072L16P757M656m057n426
$$ y = [451, 3676, 4946, 1513, -5886, -6752, 1824, 5660, 272, -5475, -5595, -1160, 4324, 5018, -1045, -6237, -2095, 7010, 7204, -471, -3863, -1660, 2182, 5607, 3632, -4681, -8045, -262, 5966, 1490, -3708, -4874, -3820, 1978, 7296, 1994, -6487, -3774, 5420, 7150, 1932, -2076, -3659, -825, 5792, 5582, -2920, -8062, -2750, 4237, 3673, -1521, -4887, -5144, 290, 7014, 4487, -4389, -5869, 2073, 6673, 3869, -462, -3983, -3853, 3491, 6984, -817, -7977, -4798, 1315, 3492, 1193, -3530, -6825, -1839, 6381, 5490, -2226, -5157, -820, 4179, 5813, 2146, -4342, -5909, 860, 6784, 1816, -5815, -6080, -1348, 3162, 3538, -1051, -6410, -4173, 5023, 7278, -116, -4019, -2060, 1925, 5882, 5157, -2592, -7175, -958, 6175, 3616, -3136, -5851, -4124, 1428, 5534, 1485, -5587, -5271, 2486, 7142, 3085, -2341]
1416b341r36K772N216J642o422o735K874Q044J020n982m002l54M047O612j036
1431D419q313k398O566N571j209m125l766J75O136L945n560o671M09N452M359
1446D990k523o167k658L507O934J099o718m426L098O570J851l773m959j509N225
1461E41N731k906p398j416L734M549Q85m567n785J473Q101L103n606n102J226
1476c437M390M643j170o084l478M164O264m08o155l944K011M579K866k932n801
1491d492j231N665N894k513o420j246L850N033J232n164n642K014O624J806m879
1506E31m701o45M468M784j677o135k052L435N785J149m828m641J717O074L071
1521F335l939o211l33N408M042k628n652k176K661N410J461n502m650K413N491
$$ y = [-2341, -3277, -505, 4711, 6353, -69, -6804, -3930, 4114, 5134, -848, -4850, -5204, -1157, 5455, 4419, -3894, -6292, 274, 5845, 4636, 511, -3255, -3080, 3056, 7001, 1441, -5230, -4821, 631, 4990, 2467, -3700, -6358, -2851, 4083, 5182, -1536, -5962, -2864, 3706, 5557, 1784, -3175, -4684, 541, 6272, 3366, -4032, -5448, -1714, 2835, 3720, -847, -6632, -5159, 2942, 6045, 439, -4663, -3437, 953, 5596, 4426, -1658, -5136, -972, 5292, 4884, -1271, -5215, -3204, 1375, 4241, 1309, -4492, -5723, -58, 5836, 3323, -3097, -4343, -493, 4540, 5772, 608, -5034, -3020, 3604, 5410, 531, -4170, -4815, -347, 4437, 2760, -3375, -5427, -1992, 3793, 4942, 114, -4527, -2810, 3264, 6335, 2396, -3815, -4148, 1260, 5302, 2674, -2978, -5154, -2493, 2917, 4378, -1124, -5774, -3361, 2130]
1536B130K593k829m839j299M699N237j667n991k718L289N190M01n528m266J825
1551c773N312K242k781n144o29M657M995j577n211k199K781N063J538m809m848
1566d383R59N059L175l329o000p41N296M137k128m416j826K479M820K063m670
1581D95m416J605M948K325k755m686j518L577M235o30m930l499K476N822J213
1596D262n022l299K033L733K000j051m168k039L729M580j087n296k366K686L465
1611B160Q88k790l918l17L881M253j852n874j81M780K693j482k577j623M69L699
1627B209K243l739m496J046L889J315j529l352j215K022L387J151l466l410K180
1642a765M597N27l232k173J064J433J958m89l512j864K451K938j69l020k110J508
$$ y = [2130, 4723, 1894, -2945, -4244, 455, 5692, 4025, -1966, -4684, -1395, 3795, 4196, -1332, -5598, -3773, 1539, 3781, 1000, -4144, -4773, -116, 4879, 3302, -1909, -4108, -1327, 3736, 5274, 465, -4383, -3424, 1635, 4810, 1481, -4519, -5260, 36, 4173, 2045, -2371, -4197, -1718, 3102, 5165, 495, -3921, -2316, 2632, 4957, 2202, -2484, -4002, -425, 3810, 3180, -1750, -5249, -2773, 3049, 4262, -760, -4059, -2026, 1707, 3707, 2656, -1512, -3551, 178, 4758, 3671, -1625, -3991, -1305, 2160, 3048, 258, -3660, -3977, -96, 4157, 2305, -3569, -3750, 1030, 3723, 2241, -336, -1959, -1490, 2209, 4452, 713, -3783, -2737, 1152, 2467, 938, -2414, -3629, -1607, 1780, 2931, -535, -3945, -1765, 2832, 3359, 127, -2046, -982, 451, 2409, 1920, -1592, -3456, -1005, 1933, 1764, -1256, -3366, -1858]
1658a858K965Q23j351k136q35K397L838j022m578m49L270J347j130j456j374l77
1674a926K266J913j843l061K74L004J311j058j582j40L75J736K111k430l608J769
1690h89L242l82k605o15K25l1J941M73k617j242K005J921m2j680p02O81J444Q25
1708A952m15j882j155J815J765r83k709K52J135N07J81q81j127M42J148P39j02
1725F82j240n76J652J128r07r94ok10N45J078j076k454J125J767l00j110k19M29
1743f86K10Q49O35p00j006O95J141J87j269l84O56o46N5J227j557j440J644J283
1761H94j326n21J035l29o9J429j56j124K87N47Q0L7j35o47l66N2N51j3q82p57
1781a413P66Q76l10K1J50m52N27J222o94m90L80m23K15P38o21j549J76J137k47
$$ y = [-1858, 1107, 1930, 579, -1557, -2392, 5, 3843, 2821, -1757, -2206, 1064, 2411, 1281, -175, -1549, -1926, 340, 2253, 410, -2651, -2377, 627, 1938, 880, -702, -842, -467, 1269, 3380, 950, -2658, -889, 2353, 1971, -634, -1249, -1024, -1055, 886, 1359, -1258, -2500, -495, 1426, 1384, -296, -998, -317, 1127, 1952, 1537, -345, -1500, 315, 2080, 1097, -1612, -1360, -225, 282, 463, -418, -1545, -1103, 45, 784, 682, -558, -1134, 518, 1646, 739, -255, -261, -471, 74, 1152, 76, -2378, -1253, 514, 214, -896, -1115, -686, -476, 373, 1008, 308, -698, -3, 1138, 1325, 56, -328, 328, -318, -263, 964, -593, -2033, -389, 894, -432, -953, 82, -247, -316, 1113, 957, -167, 120, 667, 747, 784, 649, 2, -364, -312, 239, 226, -656, -1413, -647, 229, -81, -60, 90, -362, 165, 1387, 693, 203, 583, 160, 375, 1113, 492, -1057, -881, 256, 9]
1800Ij61k22j035K91J977K12j431j52N54M69M21L44j340o54P25J068k61j409q76
1819a471N77Q56J16k49p66r53J551K091j168j581N06Q49K73O42l70j782l26K352
1837A147L8j383j042J61M55J165J02j652p95R45K122R8j396o31L64J207O30l78
1855A157j729p39J580J219r19j130p07k7J582R39j294j518O10J842L82m10p66
1872G2j257J203K109n43k018q33J045R40N3p79j312n36J555J889r39j842l67J617
1890E7J325n9o85j412j55K352Q77k330j408M91J211M75q9j612j324J394J988j38
1908I58j803o43P22J588Q90r25j684k22J595J461r63k051o98J189J639n04j231
1925f82j570O77K481N14j467j180LJ500J712l85k079j093J804J602m06j636j283
$$ y = [9, -152, -374, -1409, -1118, 859, 1071, -360, -512, 42, 511, 932, 1276, -64, -718, 7, 1075, 814, -595, -1471, -894, -38, 78, -171, -937, -1890, -339, 1752, 584, -997, -491, 358, 631, 1273, 903, -879, -1205, 1147, 1185, -198, -1240, -1079, -624, 541, 643, -1009, -1804, -859, 1263, 1361, -35, -666, -302, 905, 1535, 1157, -572, -1311, 269, 1488, 569, -561, -1268, -1295, 287, 1226, -68, -1586, -976, 866, 1248, 838, 72, -1185, 18, 2127, 1584, -434, -1267, -222, 718, 771, -8, -1320, -1856, -301, 1588, 649, -1193, -1560, 57, 1382, 1323, 638, -774, -929, 1423, 2300, -30, -1438, -947, 264, 739, 650, -962, -2286, -892, 1096, 958, -845, -1488, -766, 822, 1712, 787, -897, -1119, 476, 1937, 974, -1077, -1775, -586, 1053, 549, -682, -2252, -1575, 906, 1420, -47, -1227, -1224, 276, 1988, 1603, -476, -1569, 235, 1837, 1431, -205, -1488]
1942a488J23K132R25j680j861J94K015J288q44j495p46J266K066M00k150j643
1958a498R11K292R9j375j745p33J949K043j237k515l72J978J520N9j270j496K71
1975a119K460J156j830k226L36J603J694j058k078j291J317K383J19k328j397
1990b259R78K144R45j545j409n20J824K222o75k675p79J537J703P9k061j733L45
2007a879K614R55j753j868j18J776K192n62k484p32J609K033K24k008j506J67
2023a340K176J343j783k213m89K161J705o40k159p49J145K496P73k275k138J112
2039h75K724L73j429j866n21J541K184o27k820j198J789K165K34j921j509M00
2055a356K276J619j508k273m72K451J879r66k631r35J126K082K75j864k105O04
$$ y = [-1488, -1365, 767, 1692, 12, -1849, -1655, 360, 1648, 804, -691, -1437, -171, 1895, 2295, 145, -1498, -587, 1705, 1804, 429, -1316, -2049, -100, 1943, 706, -1809, -2181, -203, 1317, 1376, 106, -1390, -1119, 1341, 2497, 667, -1559, -1223, 380, 2074, 1016, -1062, -2353, -1036, 1347, 1466, -862, -2259, -1281, 863, 1808, 263, -1146, -1666, 158, 2380, 1705, -970, -1749, -212, 1491, 1570, -491, -2224, -1879, 735, 1690, -63, -1931, -2049, -273, 1919, 1357, -1127, -1859, -250, 1783, 2007, -1, -1507, -1340, 836, 2179, 396, -1817, -2306, -145, 1560, 920, -1239, -1988, -843, 1653, 2426, 151, -1987, -875, 1849, 2222, 793, -1073, -1594, -53, 2131, 1504, -1316, -2514, -725, 1440, 1674, -247, -1756, -1356, 920, 2539, 1031, -1242, -1714, 737, 2616, 1650, -981, -1916, -790, 1292, 1567, -297, -2402, -1798]
2071a798K378J269j180k117o63K144K537j006k453q85J148K413M62k254k052K73
2087a784K885R35j887k132m30K070K109k32k524j350J357K845Q14k848j703O66
2103a209K175J277j184k593j101K608K172j077k529j151J473K700N98k184j935
2118a960L99K569J621j249k764n93K183K361n32l047j249J066K603Q04k402k126
2134b316L52K609J906j485k759l00K096K091j64k137j950O63K989J380k905k490
2150b420P10K080J342o38k402j346K143K707j50k554j640J268K603O66j724k234
2166a589j25J999K169q86l027j183J994K503m03k137j443N35K572J319j598k617
2182a917Q8K304K062j144k616p12J393J873L45k031k107O31K689J299k058k177
$$ y = [-1798, 580, 1849, 669, -1448, -2111, 33, 2570, 1564, -889, -1774, -626, 1787, 2249, -5, -2057, -1784, 1101, 2036, 149, -1983, -2413, -343, 1766, 1534, -990, -2340, -983, 1862, 2676, -172, -1875, -1209, 966, 2243, 1059, -1534, -2635, -27, 2145, 1068, -1461, -2612, -1139, 1561, 2159, -25, -1960, -1561, 1008, 2629, 1380, -1384, -1977, 206, 2567, 2035, -1012, -2261, -1195, 1408, 2212, -190, -2316, -1964, 645, 2551, 1066, -1693, -1993, 103, 2194, 2030, -107, -2057, -1394, 1595, 2975, 70, -2420, -1710, 370, 1712, 1074, -1328, -2674, -531, 2176, 2026, -528, -2168, -900, 1703, 2369, 645, -1589, -1714, 285, 2454, 1568, -1459, -2642, -648, 1855, 1452, -685, -2128, -1593, 979, 2298, 700, -1917, -1829, 475, 2537, 1393, -1223, -1935, -542, 1331, 1676, -355, -2462, -1831, 858, 2157, 99, -2078]
2198b078L71J591J831mk454j244J625K301L7k071j596N80K111Q50j565j630n78
2215a923J605K176m27k713o38J416J915K06j502j415M97J884J043j181k118m67
2231a642J820J731r24k251m29J177J209N61j299j591K13K562R49j728j581M01
2247h22J135J098k79j385j292P52K226q5k115j141J180J225N15n74j257r29J700
2264d8J797p15j955j62J110J040J20j120j582L61J564Q87j311j357M1J337J067
2281A074l56j518m06J097J317P7j219j246O18J383N95j106j541J46J184J008p76
2298C31q61n22L28J506O61j690j069R90J381J8o94p25o58J103J250k98j899m17
2316a265J228Q43l72n33q29m0J054J395q21j784M58J260N30n10o10o32k4J407
$$ y = [-2078, -1707, -116, 1715, 1711, -743, -1987, -362, 1939, 1976, -95, -1691, -1111, 1000, 1850, 285, -1345, -1923, -318, 1858, 1431, -1282, -1920, -504, 1411, 1617, 115, -1300, -803, 1081, 2124, 943, -1175, -1642, 178, 1909, 985, -1266, -1695, -518, 691, 1252, -47, -1638, -1425, 1137, 2086, 358, -1223, -822, 313, 1411, 1132, -253, -1545, -793, 1433, 1348, -767, -1908, -728, 497, 1012, 438, -819, -1748, -48, 1749, 1034, -921, -1083, 27, 1067, 1187, 67, -1515, -1154, 410, 1297, -14, -1371, -1330, 7, 1074, 718, -800, -1206, -109, 1208, 1285, 66, -1180, -562, 821, 1416, 310, -1231, -1085, 99, 1107, 331, -530, -1052, -724, 782, 1443, -247, -1316, -326, 1055, 1073, 379, -346, -1004, 99, 1349, 1051, -848, -1265, -37, 806, 434, -99, -928, -968, 86, 1481, 660, -1124, -666, 594, 1124, 614, 4, -628, -652, 755]
2334G55M54j479j032R88N68L00l45r36l85J025J070l55j106k79N87Q50M41j057
2352F4r61K74R84M36p42o35N4K75N07K96r11p59O33J133l2r08k7Q8L01Q68k81
2373F57j377n7J148L27o14k77j22l32M81Q94o90j025M91Q46O2m44j36j69N07K18
2393C88L81o28q40N88P79m26l93j51q9J8P81m6j006M28N59O1k11r3m57J01Q14
2414E58J20n64l48M6L76j17J18l31m99N61L23J7o80K05O21j81m4j8l34k54O41
2435B16M53o52m96N66Rm15L70l5n78j0R50l34m82K88L71m75J79M74m89j58K74
2456B6L62j58m68k5N6k2L32k93m01O8O03J74o92O7N69k57J45L76k61m34L34J41
2478B42j16j03J89n07j48O33K1o51J26L39j12O6J74M0n87M21L17n7k85J33N8j63
$$ y = [755, 1209, -270, -1302, -314, 254, 554, 209, -727, -1112, -87, 983, 628, -478, -757, -170, 680, 1121, 64, -897, -623, 361, 797, 55, -580, -526, -251, 256, 552, -359, -1118, -485, 648, 616, -292, -319, -231, 70, 938, 657, -720, -777, 371, 698, 84, -193, -315, -647, -166, 728, 38, -987, -496, 350, 412, -32, -168, -337, 170, 388, 769, 141, -699, -111, 668, 242, -151, -302, -391, -373, 408, 362, -644, -216, 343, 404, 193, 100, -357, -256, 558, 678, 114, -234, -188, 188, 71, 189, -142, -641, -80, 243, 260, -420, -215, 406, 225, 181, 163, -171, -425, 216, 669, 17, -479, 87, 96, -319, 51, 16, -562, -572, 378, 44, -438, -150, 221, -254, -75, 399, -90, -248, 26, 388, 230, -238, -263, -207, -229, 103, -190, -591, -523, 80, 254, -438, -371, 198, -59, 86, 462, 201, -233, 101, 242, 126, 23, 212, -295, -443, 190, 211, -440, -314, 25, -87, -21, 153, 193, -394, 27, 344, 287, 2, 135, 193, 30]
2500C0J04K62k84l94K92K32l45j6K08k40r0N33J35n96K8M73J5k70L03n06j09L91
2522A56L04n80j87P5J97J03J64j98n11J77N40K36n88k17L93j61K35K18m05n72
2542f21K73Q14k43n03j09L7J80L08N2o32j08N32N57m58k5l33j8N11M09l86p75
2563e38r0Q45K11l68l43j93l6R58K31q36l15L26N65P0n8n06o62P59R23l79q91
2584c27l4M63J89K95l14p22l36J252M46p75o18J45M32L77K90q47m49K26R42K53
2604H88r85n73L76L69M69j35q14n66P26J077m02p60k10J49O86L89k91q61k80J008
2624B60M05k98r33j77N54Q22J00j184m82M93Q30R2l79n49l14R74P05k93j163k77
2644h14Q65M82K7n85n96r0R86O20o44j339K36J165L34k54o20m48L53J332k3j012
$$ y = [30, 134, 396, 112, -282, 10, 242, -103, -119, 89, -151, -241, 292, 427, -169, -141, 332, 347, 77, 380, -126, -235, 156, 460, -120, -307, -232, -35, 68, 232, 34, -477, -300, 240, 476, -112, -329, 64, -97, 138, 356, -49, -621, -348, 466, 223, -280, -389, -352, -172, 136, 188, -444, -552, -20, 537, 79, 54, -279, -297, 214, 623, 237, -538, -628, 217, 428, 60, -283, -476, -512, 446, 677, -159, -474, -148, 417, 487, 429, -77, -739, 20, 943, 564, -327, -361, 102, 291, 586, 272, -450, -786, 466, 912, 137, -481, -336, 96, 473, 763, -84, -533, -307, 635, 888, -97, -670, -294, 75, 544, 409, -405, -971, -245, 832, 430, -330, -540, -391, 295, 684, 393, -468, -748, 260, 665, 367, -566, -743, -189, 633, 733, -451, -933, -440, 390, 482, 103, -446, -760, 214, 919, 626, -537, -814, 51, 533, 560, -25, -621, -711, 275, 895, 251, -1088, -852, 313, 647, 393, -227, -675, -322, 1010, 987, -25]
2664b5q51P35O74M06p72q18k68P20R55j25j224n27R99Q36K20q70r11K27J372N68
2684A321r72r29j21N99R14j9j208n01O23R24J11p32q77P2J033R10o34j519R1J369
2704D55N37k70r59o45M56R42M18q56j133K64R89P97o14j080k65O07J162L00j454
2723c49q48O80J274K58j093o95j5R66P12o73r84m52P28J240Q0j134n41K60J151
2742E65N16p86r31k80J166R17p53j173k42Q45J023L7j010q73M24J042N47q70j002
2761h38n6J274P68n96r21n80O47J091K43j034j012L78J252L49j023o47k08J055
2779A42O19m6q38p24N06J262l3j140l45L13O62N46n89r24k12P75R02l83r40n67
2799a014P36J058m5q42m58q3Q70P84o45j031%Q51Q05p41n76l30K46R89J66r90
$$ y = [-25, -876, -141, 533, 939, 167, -651, -919, -199, 756, 631, -593, -1120, -121, 715, 935, 65, -846, -619, 753, 1321, 349, -580, -701, -102, 812, 793, -415, -916, -293, 631, 742, 10, -867, -795, 238, 1148, 514, -1005, -914, 455, 992, 722, -237, -882, -426, 516, 934, 78, -1055, -791, 198, 995, 381, -699, -964, -357, 805, 1105, -349, -1197, -517, 757, 1015, -78, -773, -788, 178, 890, 217, -767, -1219, -491, 749, 829, -305, -846, -586, 565, 1081, 295, -636, -916, 250, 1167, 414, -759, -1001, -156, 867, 904, -106, -979, -555, 487, 1034, 164, -838, -894, 380, 1148, 552, -369, -949, -302, 789, 1032, -2, -1014, -636, 616, 965, -58, -705, -913, 142, 761, 715, -123, -847, -341, 921, 888, -252, -597, -284, 378, 924, 335, -589, -801, -26, 876, 493, -447, -1014, -278, 780, 735, -107, -565, -648, 222, 1006, 361, -670, -670, 181, 986, 245, -331, -661, -415, 574, 740, -250]
2819b50p95M27R94M55p86o04o6Q15M57k04o64l86L40Q08k3q96k57O6P93M80n72
2840A32o86L1P95L71k61o71m84P29Q38o5q95l94K65N82M47n41p42l03J012N17
2860F77l04o02n32O06Q55No83n87J99P92O43r87o77L04M11L45J05p68o41N92R40
2881F93j08r19k27P3N40P23m24r32M0O59N27j96p79l71L79P21J49o67p04L08Q18
2902C03L90n71o05nL26P53l3j138r2O68O06k46m63l71k92J013M73p52o40K80M75
2923G9L06k96j52n26K96Q29q7n50n14L99O20L8k81k59l84K59Q48j62q60o1N58
2944A00K00o3j85l58m2O48K55n03m03J43M14K53j61p49P5L01N39j47l79m17K94
2965a85K21K95j56o47J36N54M92l65m41j07J82K80J82o69l60L38P11j84m61j92
$$ y = [-250, -1045, -618, 376, 831, 45, -559, -625, 190, 647, 443, -221, -607, -267, 541, 518, -378, -635, -569, 224, 704, 132, -554, -523, 272, 643, 382, -289, -773, -44, 794, 729, -166, -560, -295, 287, 734, 193, -549, -852, 160, 677, 373, -229, -761, -155, 700, 705, 22, -565, -366, 426, 1069, 82, -595, -291, 120, 465, 570, -198, -839, -247, 693, 585, -334, -561, -488, 52, 775, 351, -581, -541, 118, 645, 449, -330, -701, -322, 399, 548, -119, -823, -515, 303, 693, 122, -483, -488, -162, 591, 558, -580, -672, -4, 602, 356, -107, -478, -770, 243, 716, -36, -676, -396, 79, 385, 89, -63, -589, -293, 536, 449, -101, -615, -216, 404, 442, 161, -98, -482, -223, 625, 463, -397, -458, 100, 300, 237, 52, -306, -348, 300, 555, 52, -351, -208, 206, 459, 298, -451, -376, -75, 464, 317, -62, -479, -185, 36, 331, 175, -472, -336, 218, 710, 345, -96, -203, -21, 259, 441, -228, -588, -250, 461, 277, -184, -376]
2985c76J46l2O58r2o80j67N06L80k8m23k0q1L40K72k70p04J26O03K13m88k70J11
3007b76P5L28M04p23l50M61L62j01l62j36J4M81J92q4p18k1N41L02j31n31k2L8
3029b57M98J03m51j71J05M59J59j90j96k57K63M03n3n77l15M71K04O8j71m50j83
3050e38O73O07o25l80O3M32Q8m8j00n84J64N05L20p33j2m3K66J80N4p56M3L71
3072e3N37k1o83J4K28J91K49j39o23k81O29J24j42k81j03J17M35J00m33l54M68
3093b1K87k0j44k74j23K13N70k70l03l02M50J20j48J5k77J9Q5M82j43n68J15M86
3115B49n1j27M8k82L16Q6J31l84j36J68Q2j28J12k72q5L53K44q8l33J57N9O6J04
3138B89j91j84n4K17K60j96l29K37r7K2L11k87k17N2L47r0j87J32J5l23K53L54
$$ y = [-376, -230, -262, 396, 304, -376, -543, -37, 343, 315, -108, -128, -209, 131, 403, 133, -571, -445, 158, 371, -117, -387, -276, -201, 127, 531, -192, -542, -81, 281, 180, -182, -318, -304, 177, 369, 285, -433, -454, 87, 389, 258, -273, -295, -257, 241, 344, -107, -278, -173, 286, 445, 255, 59, -198, 65, 468, 415, -162, -477, -6, 198, 266, 95, -355, -538, 135, 742, 117, -263, -200, 232, 320, 272, 172, -412, -248, 257, 577, -156, -168, -211, 55, 235, 289, -467, -424, -53, 484, 463, -220, -206, 22, 213, 462, 323, -300, -581, 48, 172, 30, -251, -354, -237, 198, 298, -135, -489, -21, 266, 246, 102, -172, -295, -82, 488, 218, -85, -387, 63, 183, 35, 50, -227, -208, -123, 359, 216, -352, -237, 249, 198, 71, 119, -163, 153, 239, 370, -14, -150, 18, 100, -28, 84, -188, -273, 80, 324, 236, -97, 60, 119, 185, 289, 98, -86, -140, 77, 337, 141, -188, 49, -48, -26, 285, -2, -219, -167, 180, 90, -97, 35, 50, -273, -20, 334]
3160C34k41j29J54r7j64k8J30j27j03O7J46k1j5K99j33mj70R7K8j24J38j11Q8
3183A4mK7j96J99k4n4l7N5lO5r5m7k6J80K17k55j50Q4J08l5N4Jk31k6K42J06n6
3210A13l77K41p5J32l5J35l17pM24o2k44J18R2k33J48L31k06k45M0J76n5p1j44
3233a21L8Q9K11j57j27k59L60K56Q8l62q5O4J05M9q0k40n0J85L27j37l93r0J32
3256a97K97J96j7o11J69L54q7K67m30k45M54Q2j29l82O4R4J48J98k99k85J88J36
3278c5M33k94m72k7M23K96p1l75j44K50L09ok73l69J05N19L8k64r8m83M76N10
3300D48k11k76k16Q2O30k0k99n61K33K40L43j99m34mJ89K85n5j61n11K83O53j66
3322B73q0l87q4M98N22l32p52j35N13K21L1l55m62L06M37J90l95k91p0N14K21
$$ y = [334, 93, -36, 118, 21, -143, -171, -41, -168, -271, -204, -58, -79, -94, 205, 72, 68, -102, -5, 23, -101, 37, -74, 14, 10, 37, -159, 40, 16, -38, -75, -20, -23, 42, -53, -100, -126, 54, 271, 16, -134, -50, 58, 23, 77, 78, -153, -179, 63, 169, 113, -264, -23, -98, 34, -1, 134, -183, -190, 234, 172, -72, 46, 138, -95, 53, 384, 178, -67, -27, 149, 94, 23, -121, -83, 6, 217, 60, -67, -326, 34, 290, 378, 16, -69, -5, 100, 149, 69, -171, -221, -36, 291, 154, -239, -329, -197, 100, 296, 279, -332, -163, 191, 104, 371, -59, -304, 150, 232, 103, -279, -215, -121, 27, 225, -74, -359, -171, -35, 398, 104, -368, -395, 28, 324, 253, -122, -266, -16, 293, 287, 14, -355, -250, 269, 307, 43, -55, -538, -62, 448, 237, -39, -255, -173, 457, 437, 138, -423, -190, 50, 393, 194, -240, -244, -55, 230, 175, 14, -497, -214, 439, 273, 193, -194, -278, 220, 742, 410, -342, -477, 36, 257, 288, -67, -529, -223, 214, 404, 9, -282, -352, 162, 383]
3343C83j36l94k65J88O62m7l88l11J55L47K92l75n64J11N14K47k19o18m6K43N02
3364B81J18m83l12J38O29O6l73m12Q4M08K20k24p45J60N07J76L4k10l99K20M27
3385C10L24l10o05m8N69J56k46n13L7J40N68k3m58n05M75K94K43l64l85j28M76
3406GL81j29o28J36L14M11r0m60m94K72P75j41l57k64j54L91M52q0o93o0M36L94
3428D19Mm80l96L65M91Q5m19n73K85L18L26l76m91QK94M25J2m86m75O21N15P6
3450E48o01m93L18M59L59m90m20K4M9N93Pp09k47K22P38K6n14j27j89M68M42k28
3472B35o16j88N48O20l27n29k05K50M47J59m23m85J55O35K19l68m06q0K96K95
3492B32K60n31l13K98N17Q8n40l84J15N26K41k49m35LK09N26l8o82j99J22O44
$$ y = [383, 247, -147, -412, -224, 438, 391, 3, -308, -153, 194, 486, 111, -453, -342, 172, 419, 200, -418, -464, -221, 281, 399, -84, -396, -258, 371, 437, 64, -348, -264, 144, 364, 140, -605, -445, 62, 238, 272, 62, -337, -117, 310, 634, 324, -281, -329, 240, 396, 150, -363, -326, -186, 382, 359, -99, -604, -129, 165, 408, 44, -341, -469, 7, 388, 259, -369, -233, 81, 492, 402, -58, -552, -280, 495, 354, -3, -267, -421, -30, 422, 342, -351, -411, 25, 419, 423, -57, -453, -88, 403, 488, 69, -504, -219, 99, 425, 49, -442, -434, -140, 285, 297, -189, -664, -43, 472, 548, -53, -546, -228, 231, 590, 100, -320, -296, -247, 346, 353, -356, -603, -381, 357, 383, -131, -258, -447, 21, 463, 235, -381, -569, -21, 599, 272, -257, -462, -212, 235, 394, -29, -514, -359, 276, 495, 127, -279, -359, -63, 232, 492, -39, -352, -54, 463, 551, 11, -373, -258, 268, 509, 260, -175, -172, 37, 563, 525, -157, -356, -234, 410]
3513D10j1l57n08N3O36R7k12l75q1K11M16j32n81k9L58L93J96m65l37r5N08K42
3535C37K4p05qM05L60o1l99m92K47N50K00n98l01J90K42L53l66j69j78K48O89
3556E68j43n71j23J64M42M2l45m80J11M18M01j67p30L4L41L92K40p01l33K73N56
3577C89J9m61k26k9M64K78j45m10l57N21L54k13n50P7J26M55L67o46l05K2M51
3598A81K68l29k85k63K15P99k83m27m47L00M71K64m16k80n0J31N87j46l54l76
3618d40K47M87Q1o44K6o8M20N29o33m64J52M10J52o4o09M2K34L97K54p22N0J5
3640a48J52L58k09n01k27O15K30j65m84J55J79K98Q6l78j63p3M99K71n74j41k20
3661d40N24L05j59l48k28L12K57m5l49k09K53K68K76j63m81M4J92K11j17r8k93
$$ y = [410, 399, 42, -466, -413, 223, 320, 108, -267, -348, -137, 279, 147, -434, -463, -105, 288, 484, 19, -318, -413, 95, 337, 361, -344, -352, 53, 413, 352, -47, -539, -292, 258, 458, -140, -441, -251, -9, 344, -22, -191, -369, -121, 568, 425, -146, -269, -105, 337, 379, 34, -446, -335, 83, 484, 317, -413, -379, -38, 354, 594, -107, -440, -167, 389, 408, -53, -279, -308, 156, 434, 289, -121, -478, 43, 397, 184, -366, -289, -163, 292, 659, 13, -292, -270, 181, 449, 120, -165, -428, -213, 586, 303, -124, -571, -271, 200, 464, 48, -232, -282, -151, 436, 290, -64, -440, -193, 294, 375, -269, -243, -311, 109, 638, 5, -459, -307, 103, 255, 191, -418, -376, -142, 255, 509, -213, -163, -148, 4, 362, 153, -348, -575, 40, 270, 105, -379, -224, -45, 253, 339, -39, -202, -275, 224, 495, -79, -220, -440, 84, 389, 230, -118, -346, -34, 223, 178, -171, -380, -127, 141, 417, 254, -227, -183, 9, 220, 103, 5, -288]
3682b88K37M80Nm59l81R7L80K28j74k96n8L99Q9kl65j8K09P9j34Mk68M7J94L62
3706C67k55m63K02K19J20j57q5k24J81K42K1l01o0J7K84N3n8k70j06R6N41k58
3728A06k67PN7K6K2K6j29j95M06J83r3k46o7J81j04K38k67n4N4K02N3j74p4OK35
3753A32J16j13k83l8P5L33m2k41l8P4m6K89j99r4JK65r8J6q2M3q7O4J06n4j80
3778h1KK01p8O6n6q4P4P5n0k74P0L38j73J8r4j40Q9N3J43q4j69K23l5o0J49o3
3804F0j43k6J56Q1k01n9J69K5P4j21k42Q2J48j22R8k4r3K19r3pR4l6j83L39k41
3829d6J13j59O8N9P0j87j51K45j04R5o5kJ10ook5n8J50m9R1k96J49Kj64K92k7
3855I9j65p6K79R9j98j54K15j50N1p3J90k5j46K27J5j58k00J05K73j86j17J78
$$ y = [-288, -51, 429, 434, -25, -406, -309, 71, 299, 125, -171, -229, 170, 259, 257, -108, -126, 83, 162, 28, 32, -236, -189, 5, 367, 112, -351, -149, 70, 190, 33, -52, -276, -95, 147, 168, -133, -193, -176, 108, 161, 103, -167, -273, -177, 364, 106, -161, -154, -97, -71, -49, -23, -152, -347, 59, 242, 149, -97, -164, 17, -87, 151, -116, -170, -116, 86, 139, -35, -109, -103, 132, 248, 135, -148, -186, -111, 222, 180, -61, -99, -25, -71, 218, 19, -75, -74, 191, 93, 109, 27, 70, -17, 47, 153, 99, -81, -79, 122, 44, 110, 54, -30, 44, 119, 69, -205, -135, 203, 30, 48, -46, -186, -97, -44, 99, 15, -154, 69, 34, -26, 123, 60, -83, -109, 47, 128, -73, -132, 37, 62, 136, 15, -227, -145, 3, -119, -21, -45, -138, 81, -12, -19, 75, 39, -144, 195, -46, 67, -92, -24, 35, 105, -82, -233, 12, -92, 3, -62, -64, 46, 40, 34, 9, -49, 101, 52, 143, -153, -4, -2, -166, 126, 99, -66, -142, 137, 236, 38, -116, 99, -51, 0, -73, 117, 92, -54, 173, 188, 30, -170, -65, 208, 22, -95, 83]
3877H3r1J01M7O7m04J5L66j77j0K42k65M3L0Pm3j92J61J97J4k11j25p2K66n6K04
3902A97k90p2K48n6j62m9J91J09j23J25j36j04r9J24M06j96j91p3J13K01j53n5
3924d5j32J19K02J00k82r5L1J58R1j58m1j73L40j15J81l93J0P2K96K4k87rK54
3947A48J07Q7l71l2q8J08L30k32o1k31K41K76l10j25k4K4K16R9p1k35l2J8M72
3970C14k86k31j3P5K03Rk30Pk7K02R4k16j4K8k9K55j02j14k25M26J08j25r9k15
3994b05k4M68o9j95l13P6J69K04K8k88p6J71K80r7k19r6J81K03j06j26j06q2L17
4017I5J20k02k38J4K80K28j84k60K3l0K86J23j29m30K32J25J00J0k06rR1RJ77
4040B25l10j78J24M01r7j63r3L8K29mj32j30l5M10k47n7R9j51p5L91R9m77k10
$$ y = [83, -8, 93, 140, 207, -197, -182, 184, 7, -3, 239, -26, 17, 47, 54, 11, -181, -20, 177, 191, -20, -145, -217, 49, -7, 197, -93, -165, 83, 27, -135, -184, 7, 116, -7, 118, -18, -122, -221, -97, 309, 113, -78, -151, -38, 163, 10, -45, -177, -58, 144, 244, -38, -133, -102, 56, 147, -11, -52, -225, 115, 0, 181, -212, -202, -130, 166, 190, -97, -106, 148, 255, 342, -29, -61, -149, -41, 289, 57, -4, -235, 6, 282, -28, -153, -177, -153, 63, 162, 91, -144, -176, -158, 314, 28, -203, -216, -141, 62, 71, -159, -152, -179, 23, 117, -99, -113, -85, -114, 141, 39, -75, -300, 126, 234, 109, 10, -205, -229, 239, 170, -25, -338, -262, -93, 111, 139, -149, -225, -54, 226, 129, -90, -186, -5, 198, 92, -34, -140, -222, 95, 215, 13, -225, -211, 69, 297, 113, -147, -124, -154, 132, 255, 126, -304, -72, 53, 153, 163, -43, -52, 39, 48, 225, -85, -263, -139, 262, 165, 2, -91, -53, 176, 172, 40, -90, -125, 285, 38, -19, 80, -71, -146, 245, 344, -133, -343]
4063c43J48K50L34l45j92Q8j10L96j87j95k9Q8R5L21l11k36j2K28J66k15j47n5
4085b63K04K33J16k51j64P9R5K50k93L4l00L39J94k15k20j43M26J37j28j98k31
4106b99J82L04l3J68o08R3M45Mk33k92J54P6J62K31n75r1K26Q9K03k60p1j90L94
4129G9J55j24l11K2O5L93m0l50k14K43K30J72k68k38J16K37M5j14j80l2J47K23
4151B56j09l29J83k09L47J62k40l54L1K76J79k94k60J60J47K93j4m17k67M09L34
4172B84r4k10j69L8K13J95k59r5k60M56K07j71l22j33K11K62q5j92j3j79N04Q1
4194B69j78k72j2K96J90q5k98j75P3M48N9k69k61o3M35O4p0l12K9N5L57n2j80
4217D8j04L2J94K11l01k91J55K93J20j60l01j52M18J41r1k95k34M60K61j15j15
$$ y = [-343, -195, 55, 389, 44, -148, -60, -170, 226, 39, -156, -185, -97, -2, 319, 8, -228, -240, -12, 154, -61, -208, -263, -59, 174, 290, 39, -125, -46, 49, 299, 6, 40, -260, 79, 273, 58, -162, -305, 121, 258, 130, -68, -299, -117, 187, 154, 322, -286, -193, 252, 256, 23, -269, -115, -39, 123, 354, -221, -312, -86, 3, 206, -54, -125, -315, 79, 234, 110, -201, -179, -114, 279, 239, -111, -325, -82, 148, 320, 52, -186, -70, 167, 212, 98, -82, -114, 33, 256, 147, -182, 1, -208, 139, 301, 61, -293, -262, 14, 193, -101, -361, -201, -54, 239, 225, -192, -459, -50, 284, 190, -20, -189, -151, 62, 257, -2, -97, -357, 99, 306, 135, -187, -320, -109, 153, 68, -124, -137, -316, 188, 269, 91, -181, -193, 103, 293, 208, -90, -265, -192, 256, 315, 46, -215, -278, 157, 221, 151, -161, -132, -77, 280, 228, 48, -56, -24, 170, 381, 80, -211, -56, 237, 357, 197, -104, -256, 162, 303, 212, -83, -317, 143, 404, 289, 174]
4238A74m70J72R1L64l63k15L16j13L75j16m88j8j1L77P2r9m51M7M68R9r9m08N4
4261b42K09L71Nl88k64J04L79O5j83m44J28J55L53r6k47j04K81J61j6l33K2m2
4283a26K70Rj96l21L57J28L02k88k84j49K98J92k13Qj79J22K57r7j75j25kL81
4305A69J21j92l18O1L7K68j28j83q9J73M14r4k86j18L8J52K22j47k69r3K33J81
4327A52q9k32Q4j00L32K5k65j18J01J96lm0j95J14R4L9J75l55j0P5J99l6j09l02
4351b68J03K29L0oj41MJ3J37l3k64q0K92K50p7k94k9j06L11KL5k46J69l4J99j27
4376F9k26N6m7M20p4k27K3k99M15o8j33k6K19k36L62n9k68qM7J50J26j85o3MQ2
4401E4J03O3l23l7J99K71j64j06j28l8M08j75o8k70J78mK74j84j45qj7J56J07
$$ y = [174, -296, -124, -33, 331, -32, -247, 69, -44, 331, 215, -273, -291, -302, 75, 147, 48, -403, -356, 112, 211, 112, -296, -242, -33, 338, 343, -45, -309, -205, 174, 239, 56, -388, -260, -105, 248, 152, -95, -199, 82, 243, 227, -106, -84, -126, 144, 153, -43, -364, -7, 121, 423, 135, -149, -298, 0, 192, -21, -13, -192, -70, 187, 90, -85, -210, -212, 169, 290, 98, -220, -159, -122, 146, 18, -165, -254, -81, 333, 239, -47, -165, -127, 25, 247, 100, -169, -262, -29, 152, 63, -169, -85, -185, 147, 172, -93, -211, -110, 86, 83, 43, -152, -38, 56, 95, 270, -85, -95, -20, 179, 143, 34, -268, -165, 64, 94, 88, -53, -49, -36, 101, 68, -196, -276, 16, 266, 189, -105, -134, -240, 71, 73, 108, -138, 31, -3, 196, 69, -157, -101, -148, 272, 198, -29, -6, -305, 110, 42, -91, -117, 102, -134, 228, 169, -99, -107, -60, 90, 216, 31, -32, -28, 54, 157, 220, -103, -140, 59, 330, 166, 60, -68, -106, 302, 127, 59, -211, -33, -37, 237, 53, -92, -100, -117, 39, 146]
4424A46j93M8P1j9rm9j45L6J77J67l18j09J02J68j17J42q3k47oK66R6k09j59J03
4448a41J19Q9k9k51J80k1N1Q7j87J5K8J12q2J0M1pm8J14o0j57J96o7J71j08j77
4473a22J2J49P4n6m7p0J88J87l82K07j73j4O8p4J38j33J18q1L8N3k11Q0L8KN3
4498D2k06K51K0j57J18j29m9P4P6J38j84p8J11R9j60M9p8r2l5K04R8l1k10N0M6
4523c3M8J31o0j04j2J0j21J9J13j16K25j25K4j23J22Q9J2n1O7k22J19J16j12l
4547A3j16J25J05No7l6N3j50j45K57j18N7P8M7kj27J3O8mjJ5k6r4M3Q7j14k5J35
4575G6j96L11qj22l33K27O3j37p4L8K67j77n4J77P1o8L0n1k8Pj47O8oK1QJ14l1
4602D6ml0n7o8J54j06RJ14K2R8k01j09qK38M0j08qo4LJ18r2n2N2k17rL15j74J00
$$ y = [146, -47, 1, 72, 53, 44, -5, -150, -114, 63, 230, -88, -197, -95, 73, -44, 98, 15, -232, -238, 28, 124, -85, -244, -141, -22, 67, 38, -213, -33, -54, -3, 84, -103, -88, -60, 52, -30, -20, 21, 14, -34, 80, 20, -137, 59, -8, 163, 55, -122, -110, 39, 113, 57, 10, -60, 128, 315, -67, 140, -33, -47, 21, -53, 85, -48, 70, -11, 27, 80, -131, -51, -13, -11, 42, -164, 87, 107, -50, 68, -61, -110, -36, 40, 178, -6, -84, 27, 126, -34, 15, -63, -155, -190, 14, 112, 81, -129, -79, -33, 15, 146, 86, -18, -30, -20, -141, -122, -9, -125, 100, -25, -1, -124, -2, 87, 99, 48, 115, -107, 12, 128, 16, 13, -103, 22, 127, 132, 65, 29, 82, -68, -213, 44, -74, -17, 61, 108, 106, -21, -8, 60, 56, 55, 70, 44, -50, -7, 80, -34, -59, 76, -120, 191, 183, 61, -272, -45, 18, -119, -193, -155, 112, -65, -119, 58, 129, 61, 91, 40, 12, 19, -128, -60, -66, -45, -37, 77, 46, 42, 12, -45, -113, 41, -65, -56, 58, 80, 178, -23, -132, -140, 98, 138, 30, 22, -42, -39, 79, -13, -65, -13, -230, -239, 76, -98, 2]
4630Bj04J14N6k89K63m09L55l9J15j86J95j54j41J35Q0J8j81O4k6K26R9k76O5
4653a8q4L24J4l23l6J98K2jj67k2k6J60M5r9j33LJ46m7K55l02k21K18J76K45k77
4678E0j45q6L20pj10K5k16K06K2l7j15k5q9L61q5J24l88M7J27K42k64l7lJ4J47
4703G8J34k21k22R4J88k0M7m10K5K17K93k09j42%N2J76M6qk94p6M80l1k26rn5
4728i3R3n9J07J5j94o2M34k03p7j83N0K14M1ln0r8j50M29k26k44M3K46J21j39
4752A2o7o6p5L54M4K9j47k82K74P9j44r3j37J80J90o4j63o8KR1J45J54l88j87
4776c27L29J27j40J38k29J62J57k04j22n9R0O4NJ3l27R7J52O1K59k30k16O9J07
4799b4J8ql19J46L46n3r1k18o5K74M2p6k9j32J95J35l2k42m3J34J79J38k58j84
$$ y = [2, -102, 12, 68, -221, 42, -367, -12, -51, 64, -122, 73, -81, -222, -87, -7, 11, -170, -106, -132, 94, 193, -83, -18, -102, 222, 236, -87, -123, 75, 97, 96, -71, -93, -119, 41, 86, -13, -146, -143, 3, -44, 211, -91, -312, -94, 82, 327, 50, -95, -181, 139, 132, 22, 47, -169, 37, 59, 22, -93, -118, -207, 154, 69, 193, -195, -148, -21, 221, -43, -80, -83, -69, 78, 212, -9, -231, -137, 51, 31, 78, -332, -307, -90, 203, -6, -148, -148, -96, 80, 126, 118, -176, -252, 228, 197, -29, -38, -93, 0, -59, 48, 63, -131, -193, 241, 38, -39, -222, -172, 42, 83, 80, 30, -68, -218, 211, -15, -259, -216, 30, 151, 12, -55, -121, -196, 158, 202, 231, 84, -198, 76, 155, 11, -82, -219, -39, 151, 87, -76, -144, -142, -51, 94, 248, -140, -327, 2, 129, -11, 127, -102, 60, 217, 13, -109, -168, -78, -14, -9, 4, -323, -226, -74, -13, 246, 16, -200, -131, -24, -6, -14, -333, -187, 159, 106, 15, -203, -268, 6, 48, -28, -57, -189, 6, 141, 109, -133, -176, -42, 137, 275, 17, -167]
4823a67k8K94OM7k09k47L34J11j6j80j84J86J06J10l5l24Q2K38n5M1Oj26k08M50
4847B32r7l79J12R7J28j9Pj36m3J22J87j20j43l2Q3L15m08N2j23O3K96N3l05q2
4871a40rML07j90j8k43L46J58p6l8k30L70k36J37j58j6n9J89N8k12mj73J29K83
4895A79j89l5l02K76K18r9L6j38j44K08J56j43l14L0K42k6J88k49j0K08J35r5
4917A32m2k69pK26J43M4n16K80N1J74Nk42j17M5J18O9j61qK3K31J04j38j98J2
4941d1O1J43j23j84MK29J56q6j23j78R2K16m4J7j29q6KK37o1j35j71J66K39p5
4965A26L6l22J75R3j80lj25J8K37m5J82l23lJ5Q8J33k31j54J68J51K19k90j61
4988a96P4J87l3R3j94k7j11J93J59j50k5n9K26l4R0k38j25RL99O9l54p1J65oJ30
$$ y = [-167, -195, 99, 105, 152, -57, -304, 30, 141, 125, -55, -239, -53, 53, 163, 128, -196, -114, 124, 69, 110, 116, -10, -218, 232, 135, -244, -132, -35, 93, 74, 81, -55, -98, 24, 211, 91, -52, -84, -1, 314, -94, -42, -165, -102, 194, 247, -58, -140, -149, -145, 162, -28, -46, -289, 57, 215, 139, 101, -129, 241, 5, 142, -16, -32, -91, 98, 156, -56, -60, -233, -104, 179, -10, -45, -347, -71, 147, 48, 84, -54, -198, 10, 166, 23, -291, -261, -19, -45, 143, -106, -116, 92, 227, 132, 90, -179, -186, 40, 183, 227, -289, -9, 42, 216, 221, -21, -138, -93, 25, 94, -67, -75, -52, 179, 283, 145, -53, -41, 20, 163, 40, -144, -140, 89, 245, 159, 36, -142, -50, 166, 122, 139, 10, -76, -74, 163, 102, -33, -204, -38, 201, 126, 162, -160, 15, 108, -72, -75, -200, -182, 55, 10, 192, -131, -134, -119, -31, 102, -129, -283, -115, 36, 255, -35, -196, -122, 65, 32, 125, -69, -96, -207, -14, 145, -5, -30, -89, 137, 103, 193, -45, -170, -161, 238, 307, -47, -118, 47, 41, 171]
5013A71r8L8j90J89k1k04J79m8l3J00J89l53j45L95q0j7r8P1q4K29l3p1j85J24
5037B5o0kK21j9j00r7j2J35k8j88R0OK77j17j2j95N8N8j5k10R6M0K02j11q0j8
5063e6p6P3J53j48Oj50K16M3r0j82L6J28Q7l1K7j88J65m7M5q0m1J26k6J53j97
5088e4k6q0J16J7J09j33j04P8j1J07J7k35J84J95J2j94j16K8K7L21j47j02j1N8
5112E6r4K19n1l62L14k6J05n5n4j56J24m9j0k8k5N1J13m1j19RN3J10j90J44j20
5137h2n1K75R3k06j57O4K9K17N7j96k14m8J93J01j37n0J13r4J77m2j39L7l0K77
5161A87j30j1p0k4L1pN5p6kQ0O8k07N8k3j86K13O7j2l4R8q6j89K69kj20L5O3q8
5189d3L5k6J84l0m5j07l3n8N2J46J05j26mJ8Jj12R1l06J32J40j02O9l5K9K08L7
$$ y = [171, 73, 111, -79, 110, 89, -115, 64, 16, -17, 83, 272, -81, -226, 169, 89, 72, -26, 45, -39, 190, 157, 86, -99, 25, -35, -37, 184, 165, 65, -32, -44, 91, 63, -125, -35, -29, 248, 131, 119, -76, -18, 40, 25, -185, -89, -49, 153, 42, -38, -56, -132, -59, 94, -54, -48, -198, 18, 61, -29, -211, -175, -47, 40, 9, 36, -152, 13, -34, 11, -69, -110, 16, -10, 143, -54, -80, -160, -44, -27, 82, -51, -155, -77, -88, 19, 36, -199, -15, 180, 192, -2, -118, -90, -63, 258, 111, 9, -2, 56, -38, 181, 130, -232, 82, 56, 161, 106, 52, -104, 20, -29, -39, -67, -92, -41, 72, 31, -88, -79, -26, 84, -106, 38, -82, -133, 142, 235, 29, -128, -64, -35, 182, 239, 43, -171, -219, -26, 75, -62, -112, 1, -93, 84, 42, -97, -60, -90, 187, 57, 46, -24, -48, -17, -24, 31, -45, -47, 33, 101, -106, -48, -71, -257, -44, 23, 11, -23, 75, -11, -200, 69, 67, -53, -18, 45, -43, -8, -34, 150, 120, 75, -32, -65, -123, -71, 75, 180, 54, 50, 68, 69, -43, 48, -258, -126, 14, -88, -19, -54, -25, 183, 220]
5215B20l08p8L76j9k81J80r8M3L1J30k60J22j94L0P5k1J41l09L56L8k08r0J2K47
5239A35j10K1q8j6m6J36j2j90J36q7k8K79l6j16J37k70%J37J83k33J67j02o7J44
5263G4q5J8K7R9o0J8j87J22K7K6j34M2k8m7Q6M2q0pJ58j52k2m4j55K74n9O5Mj15
5291i3K40j34l0J76j82n1J25n3j04J92p6K4J60q7q8j31M7J09j9j30J31J00k6q8
5315A2%j2M4r7K23j61k39K91k08J83R3r6j10J09M2j60J80j37p2k9Q1Q8l9r3K42
5340A35j36n8J45j73K8N9rk5L8m4J13n9L4L4j78K35j95J53k24j0J34K2J28r0j70
5365a13j65K64Q0q1O9k58J93J39j3r3k5M5m4K21k76M1j88L79j10r4k1L4%O4K21
5390B69k91L6o3J80j38J23L8j25J10n2Rj53K3M6J54k35J11m5n5J02K7j66K6q5
$$ y = [220, -88, -166, 210, 191, -90, 90, -8, 35, 66, 196, -64, 58, -136, -106, -31, -52, 89, -220, 136, 174, -34, -124, -112, 135, 25, 46, -42, -58, -104, 32, 20, -170, -34, -121, -149, 130, 94, -22, 115, -155, -155, -18, 165, -68, 99, -3, -70, 74, -11, 7, 34, 133, 73, 91, -96, 26, 53, 79, -55, -13, -41, -88, -2, 40, -40, -47, 111, -41, -63, -107, -262, 12, -47, 18, 22, -93, 147, 13, -17, 159, -23, -74, 51, -2, -106, 86, 10, 34, 194, 107, 19, -112, -65, 44, 25, -105, 26, 126, 100, 12, 12, 0, 44, -53, 170, 9, -230, 61, -147, 36, 129, 33, -77, 32, 74, -86, 94, -43, -115, -144, -63, 25, -14, -107, 135, -1, -59, 86, -87, -59, 0, -9, -34, 4, -40, 73, 14, 48, 82, -96, 139, -56, 97, -127, -137, -3, 19, 147, 57, -113, -278, -14, 66, -15, 54, -204, -11, 128, 115, 22, -3, 42, -2, 219, -57, -16, -204, 175, 65, -29, -50, -16, -16, 48, 269, -22, 14, -49, 131, -7, 116, 154, 29, 139, 87, 96, -57, -34, 12, 166, -69, 42, -3, -58, 44, 71, -95, -69, -154]
5414a54J19K0O5k8j40J10J56l2j79J4j64L11j31J15j03n5n7J56K6j29J60Q9m1
5437A28j3l2j85N4O7p4lj12J20J52o1j57o0k3J41R9J69k72L9j40K25K8qN8j77
5462c7J80k42Q7kK8M6QL7j89l5J22p4K23p7m6L6j14J62j04k35K19k01J83L8J7
5487C0r2N3K23k34j5K4N6K4j46J02k42K81J11j39k6j16J92k29K61k58J50j28J05
5510a3O1J35l10k0P6K5J30j30m1l6J10K05k17J9M1j28K15q2p9o9K8K32m4k73K59
5535I4k50J13NJ76l61K39Q4J09k00r0m0N3J74o4J2k85N3J31J49j68J50n6j04P5
5559aO4N6k41o2K79Q9r9qj52J7J74k1k84J6L06m8p1j5J4R4K8j09o7j30J73jJ46
5586A47l05K26k68K59J05N6l58Q9J41n2M7k09P9n7Q0J60k16J8j46O6J82L0j09
$$ y = [-154, -35, -15, 50, 22, -118, -8, 148, 116, -63, -49, -213, 98, -33, 82, -21, -76, -133, 23, 49, -80, 80, 169, 128, 115, 83, -102, -48, 19, -55, -58, -170, -50, 102, 41, -116, -176, -199, -58, 41, 210, -62, -23, -163, 62, 90, 82, 140, -37, 143, -99, -12, -14, 14, 60, 68, 105, -84, -119, 3, -71, 152, 75, 29, 65, -49, 113, 9, -226, -7, -208, -25, 13, 30, -62, -9, 214, -20, -35, -11, 45, 69, -77, 25, -217, 64, 175, 36, 10, -106, 86, -143, 118, -140, 10, -118, -13, 48, 183, -127, -147, -71, -46, 84, -46, -87, -123, -13, 192, -25, -6, 35, -93, 122, 40, -39, -108, -80, 152, 108, -165, 94, -156, -43, -38, 138, -223, 16, 100, 209, 9, -81, -121, -68, 106, 42, 54, -231, -178, -47, 102, -66, 84, 28, -76, -1, 63, 119, -122, -184, 95, 184, 85, 77, -75, -58, 116, 95, -189, -173, 133, 85, 14, -1, 13, 107, 135, 26, -41, -171, 2, 1, 147, -158, 68, -200, 59, 164, 220, -138, -49, 92, 40, 87, -122, -43, -100, -20, 140, -76, -58, -204, -138, 44, 74, -35]
5609c5j34LR0K13j22q4N4J31k00J45r1M9o8J65j2j52j7O1R8Qj51q8LL22j84M9
5635E3j76m9K36j19K18j78j93J59n9K82j75lO2n4Mk8O5j24J55P3j35p5j79K68
5659B8L8K5m8J3k88L59j58R4m7j19J45L3J80k25m8Q1J11o7q8k31k7K20l6L8n3
5684g0q4K24p2J2Pm7o1J33mJ01k56J52j1J85k49J17r2j07J10N6j24r7K2J93J58
5709A96k20l2J17Jp7kP8k29K35L2Kj12n9P6J55k26Q4j05j89L42pJ17j97p9J92
5734I3O0n3q6m2j0J09K3Pk76K49j23QJ99l68J34K7n8J63j02o4K31o0k5p7r0N3
5760g8J79l9j68N1J29q9J34j14j09J94q3l0K54l11P6Q0K22n9j51j53J50j04P9
5783F0k0j42K8j30J90J38j06p1K3r1J09j56J71j48p2J81J7k6j55K51K4k53K55
$$ y = [-35, -169, -166, -76, 137, 15, -69, -15, 116, -84, 61, -30, 19, -49, 116, 104, -48, -65, -4, 94, 102, -49, -137, -134, 188, 4, 53, -123, -172, 64, -55, 163, -15, -208, -49, -108, 174, -1, -4, 58, 4, 8, -20, 45, -79, 76, 149, 14, -61, -240, 28, 66, 91, 43, 56, -232, 127, -31, 63, 16, -103, 42, 75, 255, 30, -18, 63, 174, 107, 19, -212, -239, -19, -55, -17, -70, -154, 70, -2, 10, 17, -30, -91, 42, 38, 139, -117, 35, 24, 209, -40, 77, -15, -122, -12, 44, -80, -177, -155, 38, 196, -24, -56, 61, 62, -15, -17, 61, -168, 67, 99, 101, -11, -70, 6, 161, -65, 19, -86, -275, 67, 60, 177, -20, -99, 93, 153, 100, 14, -28, -38, 71, 94, 101, -175, 74, -49, -41, 158, -210, -76, -49, -107, 56, -46, -110, 121, 61, 36, -41, -131, -78, 101, 62, -106, -55, 74, -15, 119, 5, -104, 90, 7, -23, 231, -80, -4, 76, 298, 239, 88, -65, 85, -19, 60, 40, -102, -74, -204, -14, 124, 18, -53, -30, -121, -12, -168, 3, -145, -217, -36, -19, -45, -200, 51, 75, -178, 77]
5806G7j07k1M0J22j42k9j3oJ16Q1j71l7J3N7o5m7O4L3j46J73J48l06K41j32LQ7
5832C3L1o7j53K36j69J37l9p1p0J42j74Q7J13n2Q4O1q3l1j24O8J94o9j13k8J44
5857H7p0RM4j94K4K17k6k40K34j12k5M4J8j60R3Q2j10L3P9k24K50n4K1O5j99K83
5883A69l3q3P5m4m9q0M0k3N1ML9j33N6J55l23J28K0K3P0K8n1o6P7j71J46P5p7
5910B3R3j28J75l2q5j77K23K3k00K8N8J32j07o2R4J17j03Q2k07K43j74L1J40k37
5934e0M8k2pR4KL1j34J7n4LJ04j56K33q9K6jO9j24K6J76l04P3o7J94r1N0n8k5
5962c6o4oJ09l9J08j03p2L1J66q7q4J05Nn0jJ7O1j49J96k99K65k01R7k8M6k0J8
5989a5P0j57MK30k19M1Q4J21l39J34j14R5K0k07J45K41k5j68J38j50J69j56K28
$$ y = [77, -30, -51, -11, 111, -31, -60, -73, -79, 37, 118, -53, -90, -77, -20, -85, -132, -68, -35, -181, -8, 140, -166, 75, -57, -54, 33, 64, -3, -156, 80, -89, 48, 9, -62, -132, 10, -164, -77, 36, -16, 68, 129, 46, 15, -109, -41, 153, 84, -29, -57, 87, 17, 26, 70, -124, -100, 117, 91, -149, 85, -27, -52, -8, 10, -150, -57, 25, -85, -52, 27, -197, 53, -1, 20, 85, -114, 169, 136, 53, 128, 84, 35, -45, -5, -28, 23, 27, 66, -67, -11, 144, -179, -51, -31, -8, 62, 90, 39, -27, 50, -121, 25, 100, 23, 116, -12, 163, 131, 46, -131, 92, 115, -85, -57, 1, 133, 26, -36, 58, 175, 72, 154, -53, 190, 16, 47, 187, -50, -2, -24, -31, 63, 65, 96, -38, -21, -75, -72, 32, -124, 109, 20, 46, 45, 114, -10, 16, 192, -112, -39, -106, 88, -3, 47, -11, -36, -100, -106, 3, -36, 72, -31, -103, -72, 94, 7, -77, 28, 33, -17, -18, -1, 60, -89, 107, -192, 73, -128, -31, -59, -13, -33, -15, 55, -102, -98, 132, -87, -46, 38, 159, -180, -46, -160, -65, -45, -252, -107, 134, 109, -59, 79, -71, 98, -58, 170]
6012A70j67r0m6K51j41M0rM1k2P0k16%rR5j76L11j73J46N9r4q2M1j1o2m3O7m4
6039i4O4k4J47K07k79nL3l9j4l5N8j44J11Q2n1k16J28j27J01R3J5j05J23J98j59
6064F8m1j47J02J29j78K7j01j15J64J8J76j06K1k20K04k4J65j58j9K11m4j46o0
6087g4l6L0R5L1rj34M8l7J28j29NK44j71J5J03j01L7l9J5R1j3k5j02J43m4Qj6
6114F3l9K2m3p6Q3r0J09j19P6J7M3j87J31K31k32O4j04J11j60N5J1jJ45K0m0j57
6140f7l4J42MJk07J29L2K1L5qj45M1j2L3O4j10J45j34P1P9k17k3J21o5J05j1Q6
6167G6k44J25%K2L60m96J07n3K38j03l8q5J40nR0k20P9M4J8Q6jj32oM1J9Ko1J4
6195A7J18k22J90j01j39L30j31J51j52k05J66J34L7k33L3m7J60P6o8j67k4J82
$$ y = [170, 3, -87, -133, 118, -23, 17, 8, 49, 27, 97, -119, -119, -128, -33, -209, 102, -71, 75, 134, 40, -42, -1, -12, -74, -117, -50, -94, -30, -54, 93, 300, 21, 16, 49, 10, -4, -39, 19, -125, -14, 68, 17, -199, -71, -198, -97, -4, 11, -94, 29, 227, 68, 27, -120, -18, 111, -67, -40, -141, -256, -92, -74, 102, -4, 17, -203, 1, -23, 142, -16, -35, 176, 132, -14, -74, -110, -80, 15, 46, 37, -97, -49, -86, 42, -87, -82, 162, -9, 6, 109, 8, 45, 6, 21, 112, 99, 74, -28, 115, 71, 79, 63, 24, 46, 3, -73, 10, -80, 29, -90, -14, 3, 46, -141, -10, 221, -11, 53, -51, 60, -100, -45, -34, -35, 110, 130, 90, -67, -101, 41, 45, 46, -161, -32, 0, 21, 56, 48, -97, -56, -68, -35, 29, -81, 64, -70, 1, 80, -137, -160, -39, -104, 1, -10, 76, -168, -43, -43, -21, 339, -157, -50, -103, 135, 32, -6, -91, 49, 44, 134, -86, -7, 37, 55, 141, 140, 8, 2, 43, 62, 64, 3, 17, 135, -87, 103, 2, -137, 193, 62, 213, 61, -144, 22, 156, 193, -40, -7, -54, 106, 182, 114, -53, -77, 105]
6217A05R7k24l02K56m1n9J29K5l3M5j60K82k92J24mJ54j53J00k2j83N7J53j13
6240e9MkJ68j33J27J22k42p7L9J29j48L9P4n6R4p7j5m7k0J07P7r6j08O8M0K26
6266B34q8m0r4M7pm1L1k01K78q9l4O4j23J35K0%o5j82j1M4K35k45Q4J4J7N0Q7
6293A20k19J2M6o8O6R0O0k49J87J03o2j8r6J2J50n6nj87R5J03m4m4j7j0KJ17O
6320I4j47r4QK81r8p7J06k2j1k4R5q8o9J79m6o0j27J22k11J11K17j41l2L0l4J42
6346A04j11k85J11L66j76kM5j08L6k6J67k14LQ3J2R2k03O1J22J05M7l83J40J03
6370H9m9K7J6j31MK1QKN8j5j05L00n5l30K69j20L9l0k76K95J11o5k05J00Pj0N7
6397A2o6M8m9o8R4N4M9L3l7j90K19Kr1k50J32n1O7pJ85j62M1O5q7m5r9K2K70j70
$$ y = [105, 202, -22, -324, -68, -109, -168, -39, -14, -47, -2, -162, 120, -172, -48, -52, 102, -51, 49, 27, -156, -99, 54, -59, -55, -57, 111, -22, 105, 227, -15, -92, -53, 76, -72, -33, 41, -15, 79, 2, -13, -60, -80, 27, 104, 8, -100, -32, 8, 234, 146, 106, 12, 59, 52, 11, 42, -159, 119, 30, -4, 60, -63, 72, 92, 92, 27, -155, -166, -122, 113, -132, -48, -34, -17, 33, 120, -99, -87, -41, -109, -43, 47, 107, -142, 45, 148, 86, 68, -28, -16, 134, 78, 73, -114, -19, 84, 40, -4, -21, -31, -29, 88, 94, -53, -147, -139, 142, 44, -33, 73, 51, 40, 16, 111, 23, -46, 133, 87, 27, -100, 22, -189, -78, 139, -2, -34, -4, -38, 104, -7, -292, -181, 185, 9, 7, 52, -56, -20, -46, 121, -93, -90, -7, 5, 97, -106, -45, 77, 182, 229, -154, -14, 89, 40, 67, 83, -48, -44, -23, -15, -13, 45, 30, -75, 225, 170, -160, 109, -11, 28, -2, -278, 17, 128, 63, -142, -42, -35, -45, 12, -54, -6, -55, -123, -29, 25, 74, 107, 70, -120, 99, 101, 10, -240, -108, -159, -92, -99, 86, -76, -35, 30, -57, -102, -201, -179, 91, -79]
6425g9L26m10j4K06j75J58j13J04n8Q1n9O4n0j08K68o1j61K29q4j79OJ40O9R8
6449A98l13K33L5j44J0k44K04j26LJ78m0jQ5N1J03k85J3O5k5K1j2j49J18L5N0
6474F3r4o4M4J74m4q1j25J29J64j83rl9j00k13L80Q1q9k96L38Lr4J21j94j05J31
6499a02M34l87M1j7l5J73j59K17j75m7Q0k3j0m4J5k0J2J81j89k9J48J42l03K14
6523A17k10L6l9j1J68n0q6K2J54k94J15m9M2J67K5k3j38m3J47M7k59K16l0M8m1
6548C1o0r7K19j48Q1J4Q6j76J32Ok0j1Qj05Q3p6P3J30j81j08R7O8nj29Q7m2J04
6575F1L6j45n5J10Q5o8p3r3n1J69L5p9j30J79P5q7j56K80j4m7j33J3l9J47O8o9
6601A9oj30m1kK42j53OJ74j62K31j32j51L1J92q4n4L9L9k19J13L7J9J27p5j3p4
$$ y = [-79, 247, -163, -177, 29, -146, 12, -101, 3, -55, 26, -33, 31, -19, -127, 141, 80, -81, 148, 64, -115, -109, 31, 100, 198, -115, 118, 153, 9, 19, -225, -21, -147, -144, 34, -6, -7, 78, 129, 232, -53, -40, 25, 0, 21, 9, -140, -22, 13, 63, -31, -95, -51, 123, 79, -2, -127, 2, 166, -17, -26, -65, -165, -378, 2, 83, -6, -302, 36, 39, -55, 66, -128, -233, -102, 332, -55, -14, -31, -66, 107, -52, 165, -10, -57, 23, 0, -10, -54, -39, -59, -47, 134, -55, -84, 64, 206, -97, 117, -93, -57, -96, -107, 61, 11, -75, -53, 101, -193, -78, -127, -85, 82, 107, 84, -54, -97, 50, 97, -162, 54, 24, 72, 31, -29, -126, 93, -55, 26, 40, 126, -50, 82, 88, 68, 57, 65, -40, 43, -33, 40, 170, -11, -119, -22, 46, 41, -88, -1, -43, 61, 97, -48, -103, 7, 92, 24, -49, -142, -193, -24, 11, -68, -198, -19, 56, -31, -187, 93, 79, 32, -101, -88, -127, 20, 88, 19, 13, -117, -158, -160, 82, -71, -65, 109, -53, 178, 46, -105, -74, 118, 34, -20, 19, 58, -161, -48, -11, 8, 135, 60, 47, -27]
6627b7J82k51J1o7J5K05o7LM3j2k8Q3k06K0J00j15J72k44K17mL5N4j74k8Q8l2
6653b7J29k49J05j41L00j15R1p9j46Q1j06L16q1j38K02j31q5K13q8q0L3nl7M6
6677Hj67K30j77J41J13q0N1j59k8L73j24k79K5J01K1J6j29p5K45k2j13J21q7%
6701Ej00M8n3M3J05K2n8j76J20j39K60j17J07j12j18J87Qk9J04j39J26k5n7o6
6725e4j95L81k22K24k10j40J00J47J29j62j33O2J48m8q0j03P3N1Q5j74J18J24
6747A21o3P0p2n9m4L1n3L0N3Ln9r8J33J17j13J8o8N3q6j32K69R1j43k52J56j5
6773a12J11k54L75j02n8R1Jq2r1l5K15o9j14J97q0Q4J12o7l03J93k6nm6N5J11
6798A01j23m4J64pj02J6j35O1J71J51l27J69K6j14J50k32J19L7j28O2kP1j88R0
$$ y = [-27, 155, -96, -85, -152, -137, 68, 1, 4, 47, 35, 7, 90, -116, -96, 4, -111, 61, -183, 34, 30, 65, 119, -55, -83, 5, -27, 102, -147, -42, -183, 117, 2, 93, 14, -132, -51, -157, 159, 78, -60, 142, 11, -74, 139, 51, -29, 4, -1, -38, 8, -159, 71, -106, 35, 148, 68, 119, -40, -68, 305, 181, -98, -73, 28, 49, 65, -64, -139, 106, 84, -29, 92, 5, 5, -95, -47, -100, -57, 48, 70, 12, -164, -44, -183, 77, -40, 67, -45, -163, 24, 32, 3, 107, -32, 94, 69, 12, -54, -249, 132, -90, 134, -76, -216, -116, 31, 160, -2, -135, -73, 75, 27, -53, -156, -83, -32, 53, -121, -3, 121, 58, 128, 56, -3, -47, -16, -69, -39, 14, 17, -42, -140, -7, 110, -3, 15, -53, 0, -86, -218, 51, 142, -1, -253, -97, -112, -1, -255, 120, 18, -40, 51, 52, -30, -121, -156, 59, -10, -124, 73, -7, 77, 189, 122, -181, 12, -14, -19, -65, -10, 101, -22, -66, 98, 91, -11, 5, -130, -69, 102, 253, -74, 95, 121, 7, 157, -75, 44, 81, -47, 15, 13, 84, -104, -14]
6822a4R0o9Mn6k5N9R1q3J12j10L5q1Q4J12j93J35p0J14j13N4M8m1j9l2M8m7l2
6849AN7K7k99K24J9j07J89j17j44P3m3K46n6k1K4O8j84K53k22J33k0j52J97k14
6873f8j13J84J11j07J41j88N1j9j01J43Pj99J60n4l2M2J23k02L3J70n8j98O3J22
6897A1K11l45k1K4N2J45p0j8Kn3R4pJ42k64L4Q8j34K16j22m9K5J37k04J18J09
6922A21k02j4m9J22KJ41j57J99o2j00L3p0R9q2Q1N1l6R6k77K01k31J98j33Q7j00
6947h2o2K31j02M7p1K6J00o5k6O6j26rK5P4R4M8j60O7jk16N4J11j72J15O0k31
6973b05J92o3J37l04L30j19m6Q1Q6Np2M0j15J94j03l8J28l75K03J05k3j29O2j57
6997a86J10m7K93l00K05R3K0j03lN1j88J27j39J41q9J01Kj11J3o4m2M10k84K28
$$ y = [-14, 76, 7, 11, -45, -70, -11, 80, -3, 109, -1, 34, -47, 37, 149, -44, 91, 21, 135, 22, 76, 124, 83, 64, 32, 80, 33, 1, 58, 85, -214, 10, 29, -78, 111, -6, -150, -77, -120, 126, 70, 49, 73, 141, -43, 210, -12, 121, 101, -51, 146, -68, -181, 3, 114, 7, 148, -40, 11, -8, -109, 34, 41, -158, 2, -52, -84, -42, 81, -121, -88, 82, 24, -174, -111, 11, 222, -123, -144, -120, -68, 77, 7, -11, -9, -62, 32, 25, 167, -97, -63, 25, -109, 107, -15, -64, -39, 98, -106, 12, 121, -81, -95, -144, -22, -20, 121, -36, 163, 101, 1, 34, -36, 63, -19, 62, 113, 77, 173, -104, 97, -134, 64, -69, 18, -82, -144, 87, -15, 32, -39, -13, 87, 22, -4, 62, -64, -73, -48, 26, 120, 168, 8, 75, 74, -142, -88, 23, -149, -34, 26, -205, -13, -76, 61, -243, 87, -32, -78, 3, 89, 94, 22, 62, -53, 141, 38, 0, 128, -247, -44, 61, 38, -91, -29, -186, -76, -123, 170, -130, 75, 168, 188, 85, 82, 133, -55, 72, -67, 74, -15, 86, 88, -23, -10, -74, -116, 294, 10, 238]
7021B38k62q5J66k16K55m4lj26P6L0p3J21p7nj3j9P6k99K74j3P7m0MM5n1q0J5
7048b9j10l1J74P4j38R3n5J02o7Pl2M1o5j0J06p6R1j09l4J57M4j74PM6n4L6J66
7075A60m7k63J70L7j35J44j37p4J81J29o3j26P0K5p7R6P2j90OR6q4o3O4N8j45
7100i6J85j00J03j04k1QM6J3R4j37K2p0Q7l7r8J63Nl4l0J33j23R7j69J68p9r1
7126f5J52j01k32J71J73rm3lk34O6J39J51j70l8K0l0Q4l9Q6j22q9J76k9k8l1J59
7152A14j77J70j36O6j17K56j31l4j84L17j55P2r0lL6N5j7oNJ10k14O4K9j44J33
7177A9n8n1Q4J15q2K4r0r6Q0P1O4q5J37k54J39j51J68N9k9k1j0o1j87L11k93L28
7203A31j26J05k0jj4k2m1O3k0n3p4Q6j73K56k09q3K48o6J14m4J17l56J85Q9o5
$$ y = [238, -24, -109, 57, -159, 96, 52, 49, -77, -1, 29, -44, 77, 0, -5, -18, -37, 39, -260, 14, 1, 78, 38, 42, 87, 36, -44, -29, -139, -170, 4, 78, -60, 33, -22, 80, 13, 20, -12, 29, -36, -46, 60, -16, 75, -34, -68, 89, 133, -41, -34, 12, -42, -6, 160, 113, -150, 20, 57, -78, 66, -71, -145, 36, 165, 102, -24, 46, 71, -6, 90, 162, -28, -22, 74, -10, -73, -9, 49, -96, 89, -11, 92, -12, -33, -25, 21, 34, 128, -9, 13, -57, 30, -7, -105, 58, 63, 29, -1, 132, 9, 106, -63, 105, 26, -65, 87, -14, -246, -75, 98, 89, 46, 43, -191, -125, 14, 165, -5, -43, -23, -53, 31, -8, 78, -44, -133, 43, 14, -14, -45, 114, -63, 107, -29, 37, -80, 176, 45, 11, -173, 144, -11, 61, -29, -32, 4, 59, 42, 36, 41, 151, -63, 1, 30, -114, 19, -39, -90, -6, 109, 27, 51, -39, -135, -55, 16, 80, -5, 132, -122, 17, -134, 34, 93, 64, 43, 33, -28, -215, 96, -197, 131, 5, 110, 90, 89, 75, 53, 12, 75, 55, 2, -72, 14, -159, 97, -112, -195, 53, -13, 101, 57, 174, -182, 3, 92, 27]
7228B7j25K42j59k2M6N3l1o2j7K30k25k7J50k33O1Pj0J86j18J28m0o3Q8j0r7J76
7254A55p1k02L85l03r4j4J43j24J76o0k9R3Q4j41q6k3L26k79L4J06j23K11p2k85
7278a93K35r8J09j84K5J09m7Q2jj27jL0r8J43j9P8rln7L01l06J09k01J92o1j19
7304a11J87j76J38j57J03K07k24jj91K28q7P3Q5r0J35j33n4J26K3r8j25J27J20
7327A05j04j02J07oj57J58l6nO2m6%N4L3j00K6j26J13qK0J9j63K58k23J14j13
7352a20J21m7M9j98L39k44J8M8K7J21j59p8K18o6j01N4m3n8R0L6r1N9l9J49j9
7377F6l07K12J00J41k09j18J56R4n7p5l7j38M5K22j27L9J16k13R4m8j52K25o4
7400c5J87j79k4J18j08K06rJ4j80l2J84k7j02j39N1Q3L0lp7l3J42l7r2J87r9k30
$$ y = [27, -98, 144, -15, -37, 9, 62, 31, -31, -48, 182, -43, -70, 80, -153, -92, -85, -95, 91, -27, 101, 61, -2, 86, 76, -21, 155, 84, -118, 267, -36, -130, -144, -1, -125, 51, -9, -38, 55, 139, -2, -88, -111, 215, -64, -30, 76, -47, 164, 92, -193, 42, -56, 53, -131, -106, 3, -44, 38, 37, -90, -91, -61, -159, -16, -35, 43, 34, 31, -26, 275, -31, 78, -123, 69, 8, -111, 76, -100, 38, -119, -16, 191, -33, -34, -225, 3, -84, -11, 74, -16, 119, -14, -68, 58, 81, -17, -142, -15, 105, 1, -101, 6, 0, -157, 1, -35, -40, 22, -24, -24, 30, 63, -37, -11, -137, -24, -32, -12, 7, -156, 102, -121, -7, -120, 1, -46, 3, -195, 144, -100, -82, -34, -7, 114, -45, -123, 95, 29, -72, -18, -61, -119, -29, 7, -84, -25, -64, 85, 66, -241, -29, 71, 212, 3, -115, 41, 135, 78, 3, -34, -172, -127, 95, -32, 7, 123, -90, 4, -44, -196, 29, -35, 152, -27, -51, 67, -41, 165, 156, 170, -10, -42, 142, 115, 13, -126, -75, 8, 38, 35, -42, -75, 67, 30, -62, 125, 26, -204]
7426b04O3L37j95J48l9m1kL6k4n2m3J7Q2j18M5O6o3p1J32j22m3J20mq9J05N4j82
7453h7Q3N6M0J7k42K8J23O5j55J69q6o6l1L2o7O8J77R6j62l5q2m5M2N4m8j27J46
7480c7j69K07J24k43J63r5PJ40r9l9J16l4J22l27K58l05M16k22J2R2j28n4J15
7503B0j38J1P3P1j38M8J57m7k22J39J41j17o5p1J71L6J85k15m4Q2j54R5J22j93
7527e3J77o4o3J04j58k1L29k70J7R2j36J56p1l1O7r7N1N0j13j36K05j3L5M4j80
7552g9pJ13l2N3j95O1n1K44j10n0j18J59k0K4Q8kj01Q9P6j84J8J6J02j64K31k36
7578g5J0R5J30k3j41O6K9k9M7q1k5j22J61j8m3Lk2N9o6J33k42Q0K78r5l4L8MJ
7606A18m9l7o8ML9q4J44j56R0p4R0P8j49L7J03p0L6n4r8O0J0NK04qj79L0J4J00
$$ y = [-204, -141, 196, 1, 149, 110, 69, 67, 103, 79, 27, -16, 1, 83, -35, 10, 76, 13, -58, 74, -48, -91, 29, 25, -64, 41, 95, -87, -4, 52, 92, 109, -133, -105, 18, 83, -72, 97, 11, -55, -86, -54, -121, -53, 124, 220, 58, 23, -59, -104, -62, -8, -56, -183, -37, -206, 1, 125, -118, 45, -50, -43, 97, -2, -41, 75, 41, 163, -164, 94, -211, 205, -17, -5, 87, -41, -95, 20, -118, -107, -34, 37, -101, -53, 104, 57, -165, -26, 115, -2, -67, -138, 33, 69, 254, 39, -5, 77, -77, 18, 140, -53, 124, 60, -3, 101, -57, -78, 251, -19, -2, 90, -46, 110, 39, 8, 75, -22, 29, 79, -34, -170, 35, 22, 57, 101, -79, -86, 27, -5, 48, -147, -86, -137, 107, -3, -53, -171, -12, -32, -8, 80, 78, -23, 66, 142, -42, -24, -8, 94, -70, 161, -75, -65, 30, 160, 137, -4, 62, 91, 62, 109, 28, 3, -119, 42, 24, -19, -16, -38, 21, -45, 88, -154, -74, 204, 109, 75, 113, 117, 118, 69, 32, -36, -32, 7, -77, 67, -89, 1, -73, 17, 95, -54, -17, 86, 16, 52, -2, -100, -40, -30, -25, 179, 171, -8, 22, 36, 136]
7634A36j20j15J39j08n5K75j38j62J46J6J0K05k15o1Q4j35J16k7m1J01j55O8J41
7657A05o1n1l0m7J32j75K55o4l2j15J04j37rJ33j26MJ14n0l0K02j14J0K7j17Q1
7682Ik4r6p4J34L9Lj7n0N4J97k58J45Q8k29J03j40J4K2L9j61J21K8K2P9j27M7
7708c2Pq1J55o8J71k3j26M5p6L2o9K62r8J6j75m4J53n8J7k4j08j10K06j52J68
7733a2L4j5J16k26J73j54J00m6%J36j46o9P4r0K62k30L2J36J18k63J65j38J12
7756F9J3j88K28j76K4n3J81j00k7K52k49K4j9L3P9k26M7K1L60k21p4M6j77P0K14
7781A51k41P4n9J85m6K5q6K01j53O1j94M5m3K66j85J6j0j0j85J84J01j33Q6p0
7805b0R0k2J56k71K8J37j25K5K2Q1j10N2k6j08J22j3k5n6j23L33j84j9J32J4m05
$$ y = [136, 16, -99, 40, -68, -123, 152, 14, -148, -2, 14, 24, 229, 14, -47, 37, -98, 18, -9, -50, 51, -104, -36, 105, 44, -7, -37, -84, 48, -127, 128, 64, 32, -83, 21, -116, -125, 8, -118, -114, 0, -50, -80, 122, 8, 18, 45, -72, 9, -15, -111, -185, -51, -12, -9, -26, -76, -22, 175, -83, 62, 150, -79, 24, -116, -102, -80, -41, -202, -81, -53, -31, 48, -79, -32, -25, -106, 49, -19, 152, 129, 3, 48, -28, 4, -65, 197, 99, 115, -60, -104, 49, -9, 8, -16, -124, -234, -28, -180, -12, 22, 7, 123, -103, 70, -84, 16, -30, -30, 106, -40, -109, -35, -125, 137, -93, -61, 75, 193, -70, 95, -43, 69, 82, -106, 122, -54, -30, -83, 98, -2, -29, 223, -26, -2, -21, 12, 91, -135, -88, -67, 293, 72, -2, 44, -133, -63, 151, -90, -16, -75, 110, 64, 89, 3, 204, 51, 112, -82, -37, -80, 186, 1, 17, 7, -3, -188, -4, 97, -36, 50, -20, 70, 48, 204, -67, -39, 98, -27, -2, 20, 101, -9, 43, 17, -91, 31, 18, -7, -63, -186, 147, -37, -56, 76, 90, -315]
7830c15K21q2J35J82j03k6j54K17n0j48M2j3k9J30m9J9n6L11j93q6L7n7J16j04
7854e5j23J46J08r3n6P4PQ6O2n7N4k49J87ro6m4O7K42l82m5J46j26J82O2k17L5
7880f4l4K27r2m6O1j06K12k3j31j57J03oJ80j09k81K71J18k3n2j40K73j10nM0
7904A06o4N3k20J25J70j85J04q8q0J78r5r2Q3Q4j00J22j02j10J22n8J62j68rN9
7928cQ8j41J34j9p6P3j05nJ60j45j16%R5R3q8K1k32L77J2j03j23J24m3J11r2J
7954bj37j1J45j19J68l2J54k97P6J81j83J75j04o0jJ7O4K0j0j71K54j12q7J28
7978E6%j17n0K50l39K39J6m3k1J21j7k33J68k8M9k8j59K89j48L0r8J0J46J6j47
8003c8LQ9j16n3K57O7j27l14K31p8O3P0j07j6K87l07Q7P8n0j82n8L25k27J00K4
$$ y = [-315, -94, -176, -41, 141, 38, 12, -142, 75, 25, -123, -81, -94, -123, 7, -42, -23, -79, 232, 39, -47, -10, -67, 49, -55, -178, -32, 76, -17, -73, 1, 8, 94, 156, 99, 153, -96, 91, 82, 16, -28, 39, 281, -101, -146, 0, -126, 56, 118, -99, -64, -98, 129, 37, -9, 52, -54, 158, 135, 4, -153, -50, -56, 124, 15, -266, 5, 123, 100, 48, -92, 181, 71, 66, 106, 42, 95, -125, 0, 170, -15, 89, 1, -79, 99, 4, -88, -5, 79, -21, 101, -1, -111, 11, -47, 115, -53, -62, -3, 85, -56, 78, 59, -17, 56, -49, -54, 106, -39, -155, -155, -60, 33, -55, -34, -266, 111, 123, 20, -103, 21, -22, 89, -3, -2, -139, -150, -5, -124, 44, 12, 166, -131, -55, 126, -57, 118, 14, -46, -47, -30, 34, 54, 44, -127, 127, 15, -72, 56, 56, -61, -111, 139, -200, 39, 55, 12, -9, 112, 95, -138, 30, 2, 51, 23, -136, 153, 5, 35, -63, -53, 93, 109, -38, -35, 54, -62, -115, 142, 209, 82, -232, -1, -79, -16, 54, -53, -69, 218, -89, -2, 76, 26, -156, -214, 111, -116, -16, 8]
8028HO7r9M3p2p4N1J39j33P0n1P4m8kO6N4j6j18M3O6j19m7K9R6n8NJ7j7L3J1p3
8058e5J3J53j83Q9j05J59M5j60M8N6k9j01N7J5j33J23n0m5J8O4k0j32K65k41J12
8083c7M1M6j31O1J30nk26J29Q9j00j05M6J26j01L0j01K26o8J7k42J89J1J53j77
8107An0N3L0%p2nj7lJ41m9j52j5K39k03R1m6J58j69J66p0j47J62j03P8q3%J05
8134D0k3pLr2J23L0j06k8J18k5J6j31N9j3r9L5K2l3J60j33J01j4N0n6J07j13Q0
8161G1J42m03K23K6j08o3O4qL1J9P6Ol41K15P8l1J28R6k15l9J25k3r4K6M8j57
8187a08J00N2j9J
$$ y = [8, 75, -24, 19, -53, -127, -76, 63, -70, 0, -51, 23, -25, -27, 39, 93, 77, -41, 2, 68, -51, -98, -69, 27, -31, -26, -9, -26, 7, 18, -55, -42, 111, -72, 17, -88, 71, 116, -44, 4, 60, 31, -70, -13, 2, -131, -8, -58, -103, -85, -21, -41, -173, 92, -149, -37, 4, 50, -81, -20, 110, 105, -121, 8, 97, -3, -108, -62, 64, -37, -7, -108, 118, 50, 67, -175, 14, 25, 178, 1, -49, 4, 34, 34, -38, -43, -60, -63, 78, 29, -123, -138, 101, -102, -11, -57, 101, -68, 98, 28, -119, 43, -60, 18, -65, -65, 40, 17, 10, 13, -79, 44, 74, -32, -60, 58, 33, 49, -82, -23, -36, -135, -100, -78, -111, 49, -84, 17, 3, 53, -3, 104, -9, 71, 213, -190, 33, 59, -49, -112, -48, -56, -25, -6, 70, 76, -265, -50, 28, -3, 125, 221, 6, -33, 92, 69, -25, 1, 49, -108, -8, 44, 25, 26]
8191B6
$$ Imaginary data points
##PAGE= N=2
##DATA TABLE= (X++(I..I)), XYDATA
0@%%%%%%Qq%qJ6j6J6k4L2m0M8n6P2q8J04j21J42j65J94k31K66l04L52m07M64n25
32b79N98o78P63q60R64j077J204j344J496j659J837k033K249k483K738l019L326
49A743l663M036m447M904n415N986o631P366q215R207j0381J1798j3546J5767
63H509j8694K2731k8672L8282n6302J01054m04105o26347J145812M30797p31336
74a18271k78606M09928M2505j10330P1358L739o2216J24318l6283j49024K07101
85A04219K17693m32798l46275N49644N02510n60081o14145L55957N42848j16430
95B03142l19616n5330J04210J48360O4704j51826o8990J66708p497j58154J69204
106I4915J53778l31214k05078L49341K21912k34940j91493j5080K3461K34895
$$ y = [0, 0, 0, 0, 0, 0, 0, 8, 0, 0, -8, 8, -8, 8, -16, 16, -24, 24, -32, 40, -48, 56, -65, 77, -88, 106, -125, 141, -163, 189, -218, 246, -279, 319, -359, 404, -456, 508, -569, 635, -709, 787, -872, 965, -1068, 1181, -1302, 1436, -1583, 1743, -1920, 2116, -2331, 2573, -2842, 3144, -3487, 3879, -4336, 4871, -5510, 6288, -7258, 8509, -10185, 12546, -16126, 22156, -34146, 66908, -337197, -963544, 182268, 613065, -118271, -396877, 13051, 55556, -54774, 16584, 20323, -41893, 82425, 46142, -102882, 104219, 321912, -110886, -457161, 92483, 594993, 34912, -579233, -223276, 319572, 203142, -116474, -171804, -67594, 80766, 145470, -6356, -75346, 91362, 83865, -74289, 94915, 248693, -82521, -287599, 61742, 283654, 48714, -142779, -157859, -134398, 100497]
116A00497J77653l32277k82455L31498K90833k31241j83522J48807N0692r1428
126b0943J01047Q3351k32515j28517K36311J06070j58856l612K4304k04937N0111
137a48186L98812m8996m63236L3387M16007N908k60928j5932Q8873J3503P0842
148I0054J0312j72666n7453J42319L2682o0730M2586j6739j66218K021K51061
159I7229P7215k38743j27073J75946J53868n9820j22647m0393P0535J17230p60
170A02587j46811o2744Q8801K9304j9657N7825l5068j61814K6895J96844J6859
181I3021j32370k3557M5255K4017O2970J2420j24110m8207J35109Q3955r5722
192C2781j08204L631N2716N2736L3782o6341j17070L0990J41764J1747r7018L468
$$ y = [100497, 278150, -54127, -336582, -5084, 285749, 54508, -129014, 19793, 70485, -20943, 80104, 163455, -69060, -197577, 38734, 144804, -14052, -17664, 6640, -198297, -148186, 250626, 201630, -261606, -228219, 187788, 193696, -67232, -83164, 5709, 19212, 90054, 100366, -72300, -129753, 12566, 45248, -15482, 27104, 10365, -155853, -153832, 97229, 174444, -64299, -191372, -15426, 138442, 78622, -44025, -84418, -13883, 103347, 102587, -44224, -106968, -18167, 11137, -8520, 49305, 14237, -147577, -120682, 76162, 93021, -39349, -62906, -17651, 6366, 69336, 81756, -42354, -90561, 44548, 128503, 32781, -75423, -71792, -19076, 33660, 67442, 1101, -115969, -84979, 56785, 68532, -28486, -25018]
204b5018N5710l7472p79R9552k8189j41395K7237J44886M520j16367p3372K2121
216f8566R5535O5455q3614j18713M6255J13164j2931n7774K5179K9205l8879r618
228a5302P4744J8358j02585m7038R5650P3727o3791j06724j9096Q1914Q4242l4317
240C9782j13086l284J01255J1446n2877K6740K7523n1963p740P5820J1357q2464
252a7491l5908M9752N1279m547o7813o0915L6963Q1890N355o4593k9601L6683
264a8946K8010m603J2531P536l7563j0696N8273K1966o5554l4310M0846K5072
276B2562l865j3536m9606k0224O2891M1705l8533l2391R836P416J6475L6070j0822
289B7978m9157O097M7432Q225l4967k6258Q678J9353Q546l859l0187l1128K3354
$$ y = [-25018, 30692, -6780, -7559, 91993, 63804, -77591, -50354, 94532, 99052, -17315, -90687, -68566, 26969, 92424, 8810, -109903, -63648, 49516, 36585, -21189, 3990, 33195, -5684, -15302, 59442, 77800, -24785, -71823, 23827, 97554, 33763, -72961, -92057, -10143, 74099, 39782, -73304, -76588, 24667, 36113, -16764, 9976, 37499, -14464, -22204, 53616, 64973, -17491, -53399, -3647, 47632, 43085, -24728, -85643, -48680, 33210, 38565, -26028, -55629, -18946, 9064, 4461, 16992, 24528, -13035, -23731, 34542, 56508, -9046, -43356, -2510, 22562, 18697, 5161, -44445, -64669, -1778, 39927, 1394, -30997, -21161, -13745, 2730, 38800, 27978, -21179, -15082, 32350, 40575, 5608, -20650, -11972, 7381, 15927, 12068, -18119, -49247, -25893]
302b5893M6720r91l2743p990P251Q989L2544J1303m7668j4549M7182J0384k9615
315D924o052k967j2146J9685K4496l2651m0056J9549L2774L898o563j4094j0367
328a9570J6957K7781M077k3745j4355J6810J4610o083q498j2820j7730J0375L3575
341B1384j0012m8608L48L6987M502m835K780j5481k025L1552J0850k2229o332
354a119R100l807O060J1237k5089k7970J7904K7585o535k7265j0710J4454J5754
367d01N943P18r156p902J3707J9769l124j5192k733R69L456J3502j1870l5776
381b8090N866L2921l902k1679j754K077J139J8658J1935j6009r962R773R283R641
395A9897J266k0933j1714J6907J4227j1557k3649o299J7259J1541r543j0303J449
$$ y = [-25893, 20827, 19836, -12907, -20897, -13646, -4657, 27887, 39190, -8478, -23027, 24155, 34539, 4924, -1128, -4095, -16241, 3444, 27940, -4711, -44767, -25218, 7556, 11454, 4891, -9203, -19570, -2613, 25168, 29245, 5500, -8855, 7955, 22565, 16482, 7984, -4836, -22566, -12191, 21384, 11372, -37236, -36888, 99, 4601, -234, 2546, -12935, -14960, 16592, 27442, 5213, -1119, 7981, 4174, 10234, 21471, -3618, -31588, -13684, 13901, 7366, -19899, -30609, -16155, -401, 5542, 6260, -2896, -10798, 2909, 22678, 19554, 4362, 1629, 2598, 6054, 19556, 7686, -28090, -22224, 10697, 6795, -14884, -16638, -14561, -13422, 5236, 17171, 1162, -8800, 973, 10256, 19897, 21163, 230, -11484, 5423, 19650, 8093, -15556, -21855, -4596, 6945, -2598, -12901, -11452]
408a1452J596O450J7812q4j8549j37J1762O157Q492p975k8086L73K8972K827k6885
423h727j2468P905R765O820n168j4101L986J3650K931L238K122r873m582J2181
437G679J2602l323j9021j4126R606K2603l168k9256j1620J5911J7303J311j7070
450a0569r711J7220J2822p782J718P969j0339q297J8530J2715j8562j8686L3J2537
464d02J6685q626l2882n402L0358J7732j6248k1681O904K3470M101j2228J403
477C184J0441j1063r029K2009R289k7565j7760J1627J8550M942k0649k4429R310
490b1143L2772Q048k6594j6642J8586K4640j517k0123p61J5675p842j0158K0036
503A4977N322l3404j6212K7601K2277j6385k5610m042J8507K3293j183k6423r598
$$ y = [-11452, -9856, -3406, 14406, 14322, -4227, -4364, 7398, 13555, 22047, 14072, -14014, -13641, 15331, 18158, -8727, -21195, -13290, -3525, 3295, -1873, -15974, -11988, 1662, 4593, 7831, 9953, 80, -4502, 7679, 20281, 16958, -2063, -16189, -6583, 16020, 12852, -16404, -28024, -12113, 5190, 6501, -10569, -20280, -3060, 9762, 1980, 3698, 11667, 1328, -6969, 11561, 24276, 5714, -12972, -12939, -402, 16283, 7657, -25225, -30627, -269, 17463, 1215, -20466, -13562, 9908, 14009, 1781, 3184, 13625, 2562, -6467, 15542, 24831, -2734, -20494, -8867, 9683, 14625, -6024, -30453, -21143, 11629, 19677, -6917, -23559, -4973, 19667, 18150, -1973, -2734, 12941, 5099, -5059, 14977, 20299, -13105, -29317, -1716, 20561, 4176, -21434, -25476, -6969, 16324, 15141, -11282, -20880]
516b0880K3701K6165r044l0698P57K6194l026j7978R850N719l0885r964L9829
529I740J4329l6209j9490J5444K1087J3554q914k6031l082L2743K3480k5347l5971
542b4667J3170L6375o349l1033M045J3858k1621o023L7083M777m0212j3650K9358
555d889K7813j674k5501j8914J6474L7196L687l9830k4415K7671L5580j5229m0791
568b2822L339K5704r852j1072K4384N562l8682j1178M7003K8425l2757l4682J0693
581a5935L4935J6715k1366l4908m547L3877K7569k7273m4623J2227L8511q719
593F463k2267J8960P058l5984L242N4860M251n2644j5462L6428K9279r019l2826
606g661k0570J5516L5405O990m0274l1583K5749L7484j1073k5326Q166P167j4063
$$ y = [-20880, 2821, 28986, 19942, -10756, -9999, 16195, 13169, -4809, 5041, 10760, -20125, -30089, 9740, 24069, -12140, -31630, -16186, 4901, 18455, 9541, -16490, -19572, 13171, 36651, 11304, -24667, -11497, 24878, 18529, -12504, -8459, 5399, -16222, -22245, 14838, 19615, -20597, -34247, -4889, 22924, 21250, -4251, -23165, -6691, 30505, 34192, -5638, -30053, -2382, 33198, 17969, -22822, -19483, 6221, -3631, -14703, 9681, 15243, -23439, -34617, 12386, 40811, 8054, -26628, -15935, 19000, 35715, 14349, -20559, -25106, 8771, 36340, 9067, -35556, -23329, 15182, 6463, -15804, 3156, 10214, -25770, -22528, 32332, 36583, -16061, -31523, 4905, 34184, 25165, -7661, -28231, -12715, 22690, 29680, -10594, -42177, -16428, 21056, 9983, -15343, -7177, -10, -14073]
619a4073J3213L1124j4426l9213K610L9832J8721k8566l8319J487L7069K1165
631C0624k2779l6164n948K9299K9892j1796l4418J702K5644K450m236R798o442
644G626k5563P465L9266K246m4621k3250K9381L5073o952l5252j8094J3451L0472
657A1248J6584k4821l2754J5913L4397l073j6565L913l929j2750J8796K5066k3039
670H986l7829N376L5231J5872k3332l2502m81K9732K3906r211k9818j0336K3844
683e62K5946n801k3223o333P433R226J0363n864k3513j0697J7058K2627o26k7340
697a1306k0253J6879L2617M342k4864j7211P320K3593J7880j6826l1691M033K8181
710A2694P474j4958j5384o056N132J5794R653j3733k2551k111K5189K2639j1751
$$ y = [-14073, -860, 30264, 15838, -23375, -20765, 19067, 37788, 9222, -29097, -27610, 9459, 30624, 7845, -28319, -34267, -4968, 24924, 13128, -21290, -19588, 6056, 8506, 4270, 14068, 7626, -17937, -10472, 28794, 31040, -13581, -36831, -7450, 27623, 20671, -14581, -32675, -19224, 11248, 27832, 3011, -29743, -13830, 20567, 17494, 929, 4842, 913, -11837, 6959, 32025, 8986, -28843, -23467, 11764, 27636, 4304, -28198, -28679, 1053, 24959, 15748, -14070, -24406, -562, 25384, 19583, -3640, -9973, -2540, 6686, 17049, 11185, -12328, -23025, -5967, 16660, 16034, -11306, -31559, -14680, 17937, 22279, -2585, -19796, -12476, 11117, 28997, 12171, -19520, -15487, 12694, 20168, 5210, -10174, -16230, -11098, 4696, 14349, 616, -21935, -24046, 1143, 23782, 12031]
723A2031k7989l692K2209K1973l801k9884j4721K4173K4150j0979k5264o769Q032
736a0531J1730J0785n831k0723p172J5053K2111N406k1926k0372J3900K9718L633
749B5781k5360j8794Q958K2935P778k0422k1912M896J6828R583j518j6220j3369
762b0836J0054K2366P937j3692j8713o1K2543J6808j5062k5582r5J8564J3151
775A7382n937k2692j1966J4665K0162J534j6000j5120L578K0341J4654j0084k0389
788i872k774J5400J6002j339k1337j4671J2009J9381J888j7323j7828K288K1070
801B894J3640j2211k0333m48J6287J4999k26j7422j1117J0604J7177K916j3828
814B932j7184P02J8266J1425j1554k0031m429J4422J7429j35j8972j0421J1982
$$ y = [12031, -15958, -19650, 2559, 24532, 20731, -9153, -23874, 299, 24449, 13470, -11794, -18563, -10531, 1199, 11984, 6153, -14570, -21742, -6689, 15422, 20828, -1098, -21470, -7570, 22148, 25781, 421, -18373, -9415, 13520, 21298, 876, -21036, -16140, 688, 10271, 8753, -7467, -20836, -10782, 11584, 19521, 5829, -12884, -12945, 9598, 26406, 11344, -14238, -14333, 4231, 17382, 11445, -11247, -23213, -8548, 11614, 13148, -2852, -17972, -14394, 5947, 20601, 10517, -9872, -12646, 2754, 18756, 17417, -3920, -18591, -6582, 12799, 14687, -2636, -20464, -18176, 2894, 16534, 4323, -16010, -16458, -171, 14828, 14602, -2820, -13937, -3333, 13844, 16760, 2932, -14252, -13550, 4716, 16141, 4587, -15444, -19873, -5451, 11978, 11843, -7129, -17550, -5568]
827e568J6505M618j0219j4909K70J7325J0839j0821j8469l968J2727J4204k075
840A0459j9201j2047J1070J6993M967j0624j4575R12J6879J2001o547j5047m980
853i740J1060J4297k018j8174j0373R729J3371K528j1560j5246J549J6724R634
866A1781o227j2095n228R039J6000K510j5607j0737Q163J2628K743j0550j4343
879a1923N69J4102P040q130j2606l900R508J3462J870j2291r777O550J4396O551
893A5421r496j4536J481J4086N221p746j1764n462Q313J1605j102j3120p106O297
907g908J1219O826n597j3606j36J5386Q758o559j2076m627Q250J0905k391j3251
921d807q034N447J0130L500o763j0516J14J1281Q846j142j0332o553R403J2103
$$ y = [-5568, 10937, 15555, 5336, -9573, -9303, 8022, 18861, 8040, -10429, -14397, -1670, 12534, 10459, -8742, -20789, -9719, 7274, 12241, 1617, -12958, -12046, 4833, 16834, 10287, -4760, -9740, 1320, 15617, 13599, -4575, -14948, -5219, 8152, 10680, -880, -16126, -14577, 2147, 11781, 5554, -6541, -11769, -2730, 13270, 15780, 173, -10564, -2401, 10227, 12970, 2420, -11923, -11354, 2748, 9788, 1658, -10948, -14848, -5340, 8122, 9992, -2299, -12076, -5526, 8870, 15421, 5925, -8611, -7130, 6956, 12177, 4431, -7333, -12795, -4482, 7123, 6021, -7099, -14205, -7908, 3311, 10137, 4540, -9066, -9202, 6184, 14942, 8383, -3693, -8320, -70, 10835, 8444, -4807, -12841, -7394, 2736, 6236, -527, -11043, -10929, 352, 9198, 8056, -2276, -8829, 574, 12677]
935A2677j126j0960p469L178R859M321r665j3475K233J1673M717l866q119m985
949a1007P165J2105J833r096p098L428R350N204n799j1832k162R801P176m620
963D448j2528n074R621R526j509p790o048L297J0678N435n938q088Q42N263M908
978G043K430q801j1243O010J2073j209j0772o113K800Q544N399m624r948j57J1055
993B487O002l368o295k209L173M276L348k864j0471l243J0514O674p287r440j42
1008h845O188O459J694p802o997P430J0060r68n499l587J027M118L446k205o284
1023a765l877K144N416L504o712r366L250J0441K747n291n644J423O595M063p74
1038F154n609l972M415N949k581o642n28J677k364L277N370q705r334J0129J1568
$$ y = [12677, 11551, 591, -6878, -3700, 6159, 10480, 815, -12660, -10427, 1246, 5963, 2097, -6022, -11007, -3842, 8263, 10096, 1000, -6098, -2670, 6680, 11884, 6085, -5747, -7909, 1892, 9068, 4448, -8080, -13154, -3533, 5993, 4484, -3306, -9354, -6057, 4621, 10056, 4118, -3970, -3128, 2135, 7043, 9473, 672, -10571, -4561, 7512, 6303, -4469, -10582, -7782, 762, 6161, 1537, -8411, -8568, 2487, 8489, 5121, -1174, -3383, -210, 4066, 7414, 4550, -5921, -9164, 1350, 8024, 737, -8703, -8845, -2657, 3802, 5496, -2306, -9303, -1873, 8187, 7219, 1720, -1867, -840, 3278, 6724, 4519, -1765, -5642, -3498, 1918, 5422, -1290, -10656, -7406, 3035, 5782, 491, -5153, -3730, 2865, 6928, 6154, 545, -3427, 988, 6937, 4356, -2286, -2814, -1137, -3501, -224, 5146, -3559, -12893, -2764, 8804]
1053H804n303q212K074L784J574L820r37q268j109Q120J935p281l573L425m02
1068a549k919M980K427r693k965J1733O188p817n497M188L469J861J505m778n262
1083d129L254M337j403l422k468k32K108J467k69m12j884j973N688P280m884q801
1099e743M049Q745o26n788k062Q25O2J044K588l647o621K486P093j445m647L479
1115b08Q85n830O393J0234r389j0928R792R820p376o277L147l54k436M951R50
1130C374q690k441P434L536l586j641J968j964j78Q397K287j0835m288J0041N382
1145H796o515n361L75R98K740K134n426m004L002K888J854M06m176k337M460N606
1161E440o25l397k987k067N189P306o114j0596J789Q566J157n884k378J353j36
$$ y = [8804, 3501, -4711, -2637, 1147, 2721, 6541, 5604, -2664, -3773, 4347, 6282, -999, -4572, -1147, -1549, -4468, 512, 2939, -6754, -9719, 2014, 8202, 385, -5112, -924, 2545, 4406, 5911, 1133, -4129, -875, 3462, 2059, -1363, -3831, -4063, -1955, -488, -757, -1169, -3053, -5026, 662, 7942, 3058, -5743, -1694, 7051, 6425, 637, -1425, -600, -538, 506, 3094, -553, -7174, -4688, 2405, 960, -3687, -208, 677, -5153, 1240, 11474, 2085, -8843, 949, 10769, 3393, -2884, 263, -91, -2527, 2424, 3374, -5316, -7757, -323, 3213, -373, -2014, -46, -2010, -2188, 6209, 8496, -2339, -6627, 3414, 8796, 2281, -3080, -2705, -1707, 1033, 3167, -2259, -6263, -3261, -373, 1481, 1887, -2289, -4626, -166, 5440, 4815, 1418, -1569, -3636, 1553, 8859, 2745, -7851, -6062, 2504, 3661, -2223, -4601, -3248, -3384]
1176c384K601N598l205q097K983R756r2o255O60r58l132P699N163j2319q252R744
1192a490P412n093m779O07p87K516P012j001p995p86P231M115k781l505j855j420
1208b599L972N733m819j0113Q63Q473K842m430l847k383L273Q753N07q435j803
1223d013N069K642J606p88o563l769O990N625n139n908j294J771N227L690o003
1238h57p240L161R784K930p513l924K642K756L053J422o494o767M485Q581k816
1253C203p118r58J71K438P233j395j0744j015J0600N097n064m204j151J172N989
1268D254L629p347p700L061P627P70n046l468j315K261P328J475q424m990P146
1283g39P292j355m445l244j109N898O822n645j0059J449P063K034k128l973m792
$$ y = [-3384, -783, 4815, 1610, -6487, -3504, 6252, 6160, -95, 565, -393, -3525, 4174, 9337, -2982, -11234, -1490, 5922, 829, -3950, -3343, -4130, -1614, 5398, 4397, -3598, -4384, 2847, 6962, 4181, 676, -1179, -2599, 1373, 7106, 2287, -7826, -6963, 1510, 4352, -78, -3925, -6308, -3035, 5718, 6225, -2210, -4013, 1056, 3698, 5304, 4516, -2047, -5816, 1174, 6799, 1660, -4248, -5542, -3771, 1456, 5146, -857, -8097, -4936, 4848, 7778, 265, -3659, -1017, 1739, 4792, 6214, -280, -7047, -2562, 6019, 3203, -3915, -4873, -4702, -2264, 4969, 3574, -7170, -8185, 2415, 7512, 2448, -1756, -2907, -1735, 4254, 7883, 536, -7164, -4103, 3524, 4294, -752, -4220, -5535, -3274, 4054, 5529, -2895, -7885, -739, 6553, 5198, 753, -2491, -3600, 2298, 9120, 3475, -6584, -5135, 1928, 3962, 1834, -2139, -6931]
1298f931J945Q950K520p597m822L005N778L443k203n986l086N329P540k377r254
1313c746k355N166L871N53l347o429p56Q903N378o303o223K266L379M188K252
1328F797n974p307L988R304o05p931l261J429L454M463j958q283k397P683O723
1343F125k911o417j483L120M894L700l960q387L01Q760L250n981n198p72K472
1358b487N546J717p852n538N765P417k40m374l622j46N385O283l039q910r89O090
1374A006M150j456n219m470J117P165L751o465o787K652O863K861j972m954k814
1389d572L874P826j48q866l458M618M315P38k757o804j846P006O524m272p600
1404e422j05N106M701J135n000n683K284Q001K223o326n560J518L962L327j019
$$ y = [-6931, -4986, 3964, 6484, -1113, -5935, -2930, 2848, 6291, 4088, -1898, -4984, 345, 7885, 5508, -3746, -6101, -935, 2936, 3489, 142, -6287, -7043, 1860, 7238, 935, -5288, -3022, 357, 4545, 6797, 823, -6484, -2496, 6808, 6203, -1728, -4989, -3560, -106, 4357, 2399, -5884, -8281, -598, 6125, 3214, -3203, -4686, -1566, 3328, 7028, 3068, -5319, -5018, 3742, 6992, 1011, -4187, -4959, -2487, 3059, 4776, -3076, -8614, -2849, 4568, 4328, -46, -3668, -3814, 1571, 7854, 4815, -4095, -5084, 1006, 5156, 3700, -1519, -5989, -4872, 2293, 6044, -421, -7208, -4556, 2307, 5168, 3196, -1758, -4572, -698, 7128, 6980, -1886, -5344, -726, 3589, 4327, 1570, -5234, -7080, -74, 6450, 2178, -5422, -5527, -421, 4280, 5415, 415, -5268, -2984, 5017, 7240, 914, -4646, -3128, 834, 4161, 3142]
1419C142o669m095M961P954j097p280k703L283M602M012k867p825o10P732M461
1434G001m036n733j666K543N077J740o401n781L155O489K238m137n429pN669N219
1450E941j369p182l103N094O102p13n650l729J025N221L754m340p213Q74O244
1465I56L433j698m883l193L446P475J095p280m320L519M991J887l147o030j431
1480e180N589M903k470o662j993M384M853M79m157m377J092O434L897m424o601
1495d233M84N453L432j670n525l663L681O151j44o105l664K464N106K963k997
1510A733n929j24N552M488j478n914k981L477N639M75n480n099J757O012K398
1525D526m188n493L31M657M423r10n695l117M468N466K79m460m376J111M857L259
$$ y = [3142, -3527, -7622, -2661, 5293, 4196, -3084, -5787, -2504, 2098, 6110, 3243, -4582, -5192, 2540, 7001, 2965, -2768, -4434, -1891, 3186, 4926, -1475, -7256, -4101, 2388, 4626, 489, -4940, -4947, 722, 5941, 4572, -2610, -5713, -619, 5483, 4770, -880, -4609, -3584, 1637, 5391, 1051, -6162, -5288, 956, 4389, 2691, -2192, -5385, -1939, 5536, 6631, -649, -4969, -1450, 3541, 5428, 2281, -3749, -5180, 409, 5312, 2842, -3820, -5813, -1429, 3424, 3903, -254, -4631, -3539, 2895, 6792, 2368, -4233, -3749, 1704, 5136, 3466, -2059, -5722, -2041, 4110, 3966, -2139, -5803, -3339, 1767, 4730, 1733, -4196, -4320, 1232, 5720, 4242, -1672, -4653, -1176, 4463, 4938, -542, -5641, -3884, 2128, 4526, 338, -5155, -4824, -167, 4256, 3346, -2349, -5466, -998, 4468, 4747, 287, -4089, -2978, 1879, 5138]
1541E138k988o651o66M951M204j478n660k637M238N072O29m383l895J391N496
1556B761L219l562n755m04M503L717j001n174l777L075N353J178m503m765J431
1571c704O117K874l559m889K09L631L887k71n159l758L210N101K79m186m124O52
1587c690M398L137k294m732j634M154N092m13n713k607M183L884j35k947l482
1602b799m56L937L539k609n212r58L966L375q60l523k382J507M456K636l247n327
1618c957J109N533J814l577l056j94J318K803J039m036l783K669M444J84k785
1633d75k484L65L039K702m88l842k177L166M317r66m398j700K331J920M04j147
1649E67l114o84L404K472j414l001q70K713K609j13k344j760O17K317K082j623
$$ y = [5138, 2150, -4501, -5167, -216, 3988, 2510, -3150, -5787, -1549, 3523, 4152, -231, -4126, -2735, 2761, 5980, 2418, -3337, -3741, 762, 4479, 3478, -1696, -5473, -2398, 2955, 4133, -370, -5135, -3704, 2413, 5287, 1728, -3161, -2952, 679, 4566, 4295, -864, -4622, -1412, 3689, 3968, -218, -4342, -3690, 708, 3845, 1551, -3181, -4815, -661, 4431, 4018, -1695, -4302, -119, 3765, 3630, 683, -2799, -3255, 682, 4221, 1612, -3600, -4558, -592, 2783, 1923, -1600, -3982, -2475, 1981, 4617, 1370, -3957, -2848, 2685, 4499, 922, -2134, -2328, -1010, 1793, 2832, -1204, -4987, -2318, 2126, 2310, -475, -2959, -2594, 445, 3147, 2659, -1183, -3360, -194, 4123, 3157, -1241, -2941, -610, 1310, 1714, 567, -2547, -3231, 173, 2645, 1231, -1770, -2640, 73, 2682, 2569, 225, -1535, -918, 1399, 3481, 1858]
1665A858m532J67M048P36k271j566l99P65J882J320k074k572J414L321N54k145
1681E06j856O61J144J007O76k267k949J846L603j143l127k24J584N10O60L78k174
1698a165p17K731J605j126j658n71J252J032k51q16j773m32J907J560j539k698
1714b659P69K195K35k72p94o66J175J193J58q62r56j78J318P12j300j255J68O07
1732d12J41Q55r92j799J253K295l79j477j31J140J62M33L91j133o43L87J151l11
1750I31j706k04Q74j22o3N93q11j065J798J442j719o20J228J05m40J001k26j336
1768c40k9Q01k06k83mq37k50P12L99L17r09k15O42J273n19m33L36l03J14P90o23
1789D33r86L82j11j24N40k84j535P09J230k8o08M7l24K05J908j11j842k4J099
$$ y = [1858, -2674, -2507, 1541, 2277, 6, -1560, -1959, -1194, 688, 2008, -66, -2638, -1224, 2097, 2651, 506, -1350, -689, 455, 1462, 2138, -129, -3078, -1232, 2371, 1228, -1899, -2123, -539, -29, 631, 1009, -1165, -1882, 849, 2454, 1328, -330, -901, 351, 1383, 1132, 316, -1457, -1889, 18, 1578, 39, -2659, -1890, 305, 540, 268, -526, -1192, -17, 1176, 1334, 472, -484, -662, 656, 1368, 68, -1187, -1019, -412, -271, 584, -408, -2207, -954, 1341, 962, -515, -646, 494, 656, 1089, 1480, 347, -296, 91, 1242, 931, -775, -979, -105, -227, -290, 303, -508, -1573, 225, 1667, -52, -672, 556, 661, 221, 1222, 996, -340, -369, 432, 226, -57, -61, -898, -1148, -436, -37, 280, -629, -844, -202, 1071, 552, 119, 455, 152, 266, 1056, 433, -553, -171, -282, -406, 134, -150, -1685, -976, 254, 226, -382, -335, -659, -454, 1454, 1343, -499, -523, 576]
1808E76K02k81j20j095n54P30J238p56j241m9P91J015k84l93l80j32J500J566
1826B333j660j734Q69J179j98l17m48j206o5K130J90j983m93N28R94P19j3j244
1844d19n15J404J683p97j766l43Q48J187N8j211j503n6J436J283j242j299N3P54
1862d45J259O26j571j272J369J638k5j197r37m97J129J491j041k221q3J391J123
1879G37k90j058q15L16J631J372j216j795K52J860P96q20j315p60M75J928M78
1896A776k800j333J404J669j09r52r49l10J468K145r85k025K8J239J180K87j591
1913A42j373R7J889Q93j727j830K08J699J279p92j340p29J148K347o5k104o16
1930h74O75J458Q51j321j908n81K141J428j271j866l12Q67J722O41j888j668J100
$$ y = [576, 778, 497, 377, -718, -1272, -542, 696, -60, -1301, -1350, -559, 456, 172, -221, -601, -733, 767, 2333, 673, -1061, -192, 987, 789, 472, 24, -1182, -1247, 883, 1073, -910, -1403, -875, 119, 838, 825, -419, -934, 470, 2153, 1356, -410, -753, 95, 1282, 1340, 129, -1374, -1430, 6, 1289, 47, -1252, -1199, -445, 814, 1440, -131, -1403, -34, 1604, 1579, 382, -555, -1052, 77, 1568, 527, -1694, -1777, -386, 737, 447, -611, -1426, -1110, 521, 1893, 677, -1118, -866, 994, 1790, 970, -345, -1105, -630, 1298, 1776, -1024, -2357, -953, 716, 607, -345, -1294, -1604, -136, 2009, 1024, -1001, -973, 266, 1446, 1733, 142, -1231, -1134, 755, 1648, -79, -1909, -1701, -2, 1277, 485, -855, -1584, -436, 1911, 1846, -258, -874, -199, 1259, 2110, 789, -1119, -1700, 441, 1869, 598, -1268, -1580, -713, 1009, 1650, -238, -1906, -806]
1947h06K277O24j590j611J73J454J469q07k310p61J435J826k74j971j222M20K076
1964D02J406j442k179J78K455J344j019j667p83Q62K218L68k544j757R59K064
1980H65N52j450j969o2J821K125n78k736q12K175K177n10j648j426L80J937J347
1997B188j458k684k05K531J178q40j931j241J401K555L94k278j472Q25K140J532
2013B635j628k438nK072J513q84k161j131J120K115N69k029k036P65K513J259
2029B249j606j923j00J862J698m1k739j570J899K384m13k255j465P11J508J453
2045A652r54k776j07K268K091q32k180r50J320K423M10k231k304P14K669J048
2061B261j847k493n4J906J735m50k392j105J641K439J57j819j830O47K334J499
$$ y = [-806, 1471, 2095, 505, -1106, -933, 521, 1990, 1183, -1127, -1888, -453, 1373, 1099, -872, -2094, -1674, 402, 1808, 366, -1813, -1635, 820, 2164, 1145, -522, -1305, -443, 1775, 2143, -401, -2158, -1199, 865, 1417, -33, -2002, -2064, -243, 1882, 1304, -1432, -2244, -69, 2108, 1598, -50, -1476, -1096, 841, 2188, 730, -1954, -2159, 372, 1550, 710, -1221, -2462, -1061, 1494, 1888, -390, -1862, -1037, 1103, 2635, 1007, -1431, -1436, 636, 2149, 1265, -896, -2027, -907, 1208, 1777, -252, -2288, -1523, 990, 2249, 643, -1280, -1380, 482, 2180, 2139, -600, -2170, -271, 2113, 1700, -555, -2020, -1309, 199, 1652, 698, -2078, -2185, 83, 2174, 1342, -838, -1788, -468, 1955, 2365, 134, -2170, -1456, 1213, 2261, 414, -2079, -2133, -227, 1508, 1058, -1334, -2439, -798, 1641, 1798, -21, -1851, -1204, 1130, 2629]
2077B629j550k767j90K024J523m44k551j420J705K764nk512j752J247K184J397
2093B282j293k430l62K029K367o42k814j364J577K083M48k055k068J86K861J635
2109B440j792k445n8K319J716k57k371j672J518K754M83k329k523N05K510J628
2125B426j487k943l48K034K131l1k480j762J523K678Q11k495k059O01K490J388
2141B477j535k399q01J647K370J98k923j934J635K697L83j627j990j87K339K303
2157B653j181l069o31K275K127k87k597j519Q29K326J103j714k703kK651J967
2173B228j172k427n21J428K310L77k125k330J076K485Q85j835k511K86K076J352
2189A582m37k075j312J149K787N32k625j725J439J934Q47j140k069n62K080J691
$$ y = [2629, 1079, -1688, -1878, 146, 1669, 1225, -1326, -2746, -1041, 1723, 1718, -794, -2546, -1299, 885, 2282, 989, -1441, -1803, 226, 2593, 1951, -863, -2227, -650, 1433, 1881, -174, -2242, -2056, 805, 2440, 648, -1797, -1855, 464, 2180, 1923, -448, -2120, -602, 2152, 2635, 306, -2217, -1712, 798, 2426, 939, -2004, -2352, -318, 1813, 1782, -698, -2460, -937, 1741, 2552, 57, -2002, -1401, 1089, 2477, 942, -1457, -2258, -611, 1759, 1957, -966, -2900, -1265, 1432, 1815, 188, -1802, -1989, 350, 2653, 1472, -1597, -2228, 47, 2174, 1887, -710, -2229, -1400, 926, 2029, 315, -2388, -2390, 261, 2228, 1056, -1371, -1892, -464, 1846, 2223, 98, -2232, -1156, 1329, 2214, 379, -2132, -1846, 230, 1582, 1145, -930, -2242, -1093, 1694, 2226, -399, -2124, -685, 1249, 2096, 956, -1113, -1675, 405, 2096]
2205B096m76k759j034J602J965J17j993j453O43J939J355j192k146j91K190J438
2221B101p73j976r60J197J542M56j728j833M20K174R71j354k241M34J837J054
2237A321j71j363j256Q17K271L22k208j370J102J203L64o89j607m03J441J527
2253A301l33k238n73J664J619m82q98j041L8J548J196j136k129K62J779M93n00
2270E70j166q39N29J741L33j605q99N31J605O25q74j576K64J363P52m02j401r10
2288a359Q94J563j9j314j167N58J526K53q62j069K00J013J026N4j841q88J640
2305B08J193o32j047l24k74R46J145o64j776k2J413O66m97r44o6J91J103N59p26
2324D52j741M97J807J27j297m09j03L00R79K65j667p12J213Q90k32k81j002J67
$$ y = [2096, 1620, -1139, -2173, -571, 1394, 1511, -482, -1935, -1292, 647, 2002, 810, -1336, -1527, 663, 2101, 1328, -648, -1608, -411, 1131, 1587, -141, -1974, -1554, 620, 1591, 237, -2004, -1570, 267, 1321, 1150, -213, -1469, -652, 1619, 1941, -267, -1637, -535, 668, 1032, 343, -1264, -1667, -226, 1301, 968, -1270, -1843, -179, 1440, 958, 60, -981, -943, 605, 1801, 665, -1464, -1202, 577, 1070, 570, -596, -1435, -906, 835, 1168, -437, -1336, -805, 800, 1425, 551, -1025, -761, 602, 1354, 952, -449, -1359, -465, 1098, 1079, -235, -1402, -844, 682, 935, 73, -996, -796, 217, 1243, 1297, -544, -1432, 208, 1401, 769, -278, -602, -876, 70, 1215, 551, -1225, -1247, 166, 832, 335, -609, -675, -484, 619, 1178, 452, -1289, -792, 1015, 1142, -155, -564, -667, -367, 612, 877, -790, -1502, -289, 601, 369, 88, -914, -747]
2342g47R69P69n48j251O0R57N98j58r45n41L33Q14M3o17p59K60O79L41N1o09n52
2363h53R28R44k90j092m0N12J9L87o5j308q5J430O2p83m57L37K06M60K80n29p40
2384f77O24Q84p5p15l56K79L83pJ16q71m52R07O18o15m69K57O7K36L97j34r57
2405e60M04P51j56l51m0n11K85M28K26p81k51N88J80l72r6j05n5L48M88k82o88
2426e50L82O55m55J1J16j22n64P50L58p17o44O67L25l90j8K33o46L37P49j97o60
2447c80J67O48l20j26K08j41m46O20J28j29n81P1L05j79o8L06k72j51O81K44o49
$$ y = [-747, 222, 991, 443, -808, -748, 209, 807, 649, -296, -837, -504, 310, 353, -264, -1023, -763, -84, 257, 308, -301, -853, 75, 1019, 729, -363, -403, 109, 128, 515, 450, -858, -943, 487, 549, -234, -691, -354, -148, 312, 592, 63, -677, -53, 831, 756, 41, -315, -36, 347, 340, 456, -415, -867, 40, 658, 43, -426, -169, -102, 134, 531, 397, -560, -156, 595, 439, 88, 48, -463, -178, 250, 476, -305, -556, 32, 212, -160, -256, -361, -416, -68, 420, 138, -550, -168, 487, 32, 43, 159, 37, -527, 223, 581, -136, -780, -113, 212, -178, -196, 37, -609, -272, 477, 280, -380, -213, 435, 115, -11, 197, 56, -390, 230, 358, 229, -352, -281, 24, -155, -223, 83, -189, -340, 341, 585, -64]
$$ [...]
8191e8
##END NTUPLES=NMR FID
##END=
