##TITLE=1H_Pr 5053-12
 CDCl3
 8 sc, 
 17.12.2021
##JCAMPDX= 6.0         $$ Bruker NMR JCAMP-DX V2.0
##DATA TYPE= NMR FID
##DATA CLASS= NTUPLES
##ORIGIN= UXNMR, Bruker Analytische Messtechnik GmbH
##OWNER= root
$$ XWIN-NMR		Version 3.5
$$ Fri Dec 17 12:07:57 2021 Russian Standard Time (UT+4h)  she@DPX200
##.OBSERVE FREQUENCY= 200.131346
##.OBSERVE NUCLEUS= ^1H
##.DELAY= (6, 6)
##.ACQUISITION MODE= SIMULTANEOUS
##.ACQUISITION SCHEME= undefined
##.AVERAGES= 8
##.DIGITISER RES= 18
##SPECTROMETER/DATA SYSTEM= spect
##.PULSE SEQUENCE= zg30
##.SOLVENT NAME= CDCl3
##.SHIFT REFERENCE= (INTERNAL, CDCl3, 0, 15.7039)
##AUDIT TRAIL= $$ (NUMBER, WHEN, WHO, WHERE, WHAT)
$$ ##TITLE= Audit trail, XWIN-NMR		Version 3.5
$$ ##JCAMPDX= 5.01
$$ ##ORIGIN= Bruker BioSpin GmbH
$$ ##OWNER= she
$$ F:/spectra/data/she/nmr/H-F/1/audita.txt
$$ ##AUDIT TRAIL=  $$ (NUMBER, WHEN, WHO, WHERE, WHAT)
(   1,<2021-12-17 12:06:40.28 +0400>,<she>,<DPX200>,
      <created by zg, POWCHK disabled, PULCHK disabled
       configuration hash MD5:
       00 E9 B6 7A A2 85 ED C7 34 08 36 98 17 FE 4E 26
       data hash MD5: 16K
       76 1C 34 CE 2F 71 16 B1 CF 98 1D AB 0F F3 6F FB>)
$$ ##END=
$$ 
$$ hash MD5
$$ B3 16 CB 42 DB 16 3D 77 2C C8 29 C7 0A 91 6F 43
##$RELAX= 
##$RELAX= 
##$RELAX= 
##$RELAX= 
##$RELAX= 
##$RELAX= 
$$ Bruker specific parameters
$$ --------------------------
##$DU= <F:/spectra>
##$EXPNO= 1
##$NAME= <H-F>
##$PROCNO= 1
##$TYPE= <nmr>
##$USER= <she>
##$AMP= (0..31)
100 100 100 100 100 100 100 100 100 100 100 100 100 100 100 100 100 100 
100 100 100 100 100 100 100 100 100 100 100 100 100 100 
##$AQSEQ= 0
##$AQ_mod= 1
##$AUNM= <au_zg>
##$AUTOPOS= <>
##$BF1= 200.13
##$BF2= 200.13
##$BF3= 200.13
##$BF4= 200.13
##$BF5= 200.13
##$BF6= 200.13
##$BF7= 200.13
##$BF8= 200.13
##$BYTORDA= 1
##$CFDGTYP= 0
##$CFRGTYP= 5
##$CHEMSTR= <none>
##$CNST= (0..31)
1 1 145 1 1 1 1 1 1 1 1 1 1 1 1 1 1 1 1 1 1 1 1 1 1 1 1 1 1 1 1 1 
##$CPDPRG= <>
##$CPDPRG1= <>
##$CPDPRG2= <>
##$CPDPRG3= <>
##$CPDPRG4= <mlev>
##$CPDPRG5= <mlev>
##$CPDPRG6= <mlev>
##$CPDPRG7= <mlev>
##$CPDPRG8= <mlev>
##$CPDPRGB= <>
##$CPDPRGT= <>
##$D= (0..31)
0 1.2 0 0 0 0 0 0 0 0.06 0 0.03 0 0 0 0 0.0002 0 0 0 0 0 0 0 0 0 0 0 0 
0 0 0 
##$DATE= 1639728399
##$DBL= (0..7)
120 120 120 120 120 120 120 120 
##$DBP= (0..7)
150 150 150 150 150 150 150 150 
##$DBP07= 0
##$DBPNAM0= <>
##$DBPNAM1= <>
##$DBPNAM2= <>
##$DBPNAM3= <>
##$DBPNAM4= <>
##$DBPNAM5= <>
##$DBPNAM6= <>
##$DBPNAM7= <>
##$DBPOAL= (0..7)
0.5 0.5 0.5 0.5 0.5 0.5 0.5 0.5 
##$DBPOFFS= (0..7)
0 0 0 0 0 0 0 0 
##$DE= 6
##$DECBNUC= <off>
##$DECIM= 32
##$DECNUC= <off>
##$DECSTAT= 4
##$DIGMOD= 1
##$DIGTYP= 9
##$DL= (0..7)
0 120 120 120 120 120 120 120 
##$DP= (0..7)
150 150 150 150 150 150 150 150 
##$DP07= 0
##$DPNAME0= <>
##$DPNAME1= <>
##$DPNAME2= <>
##$DPNAME3= <>
##$DPNAME4= <>
##$DPNAME5= <>
##$DPNAME6= <>
##$DPNAME7= <>
##$DPOAL= (0..7)
0.5 0.5 0.5 0.5 0.5 0.5 0.5 0.5 
##$DPOFFS= (0..7)
0 0 0 0 0 0 0 0 
##$DQDMODE= 0
##$DR= 18
##$DS= 0
##$DSLIST= <SSSSSSSSSSSSSSS>
$$ [...]
##$SUBNAM2= <"">
##$SUBNAM3= <"">
##$SUBNAM4= <"">
##$SUBNAM5= <"">
##$SUBNAM6= <"">
##$SUBNAM7= <"">
##$SUBNAM8= <"">
##$SUBNAM9= <"">
##$SW= 18.0517287032376
##$SWIBOX= (0..15)
0 0 2 0 0 0 0 0 0 0 0 0 0 0 0 0 
##$SW_h= 3612.71676300578
##$TD= 16384
##$TD0= 1
##$TE= 0
##$TE2= 300
##$TE3= 300
##$TEG= 300
##$TL= (0..7)
0 120 120 120 120 120 120 120 
##$TP= (0..7)
150 150 150 150 150 150 150 150 
##$TP07= 0
##$TPNAME0= <>
##$TPNAME1= <>
##$TPNAME2= <>
##$TPNAME3= <>
##$TPNAME4= <>
##$TPNAME5= <>
##$TPNAME6= <>
##$TPNAME7= <>
##$TPOAL= (0..7)
0.5 0.5 0.5 0.5 0.5 0.5 0.5 0.5 
##$TPOFFS= (0..7)
0 0 0 0 0 0 0 0 
##$TUNHIN= 0
##$TUNHOUT= 0
##$TUNXOUT= 0
##$USERA1= <user>
##$USERA2= <user>
##$USERA3= <user>
##$USERA4= <user>
##$USERA5= <user>
##$V9= 5
##$VALIST= <valist>
##$VCLIST= <CCCCCCCCCCCCCCC>
##$VD= 0
##$VDLIST= <DDDDDDDDDDDDDDD>
##$VPLIST= <PPPPPPPPPPPPPPP>
##$VTLIST= <TTTTTTTTTTTTTTT>
##$WBST= 1024
##$WBSW= 4
##$XGAIN= (0..3)
0 0 0 0 
##$XL= 0
##$YL= 0
##$YMAX_a= 154964
##$YMIN_a= -209390
##$ZGOPTNS= <>
##$ZL1= 120
##$ZL2= 120
##$ZL3= 120
##$ZL4= 120
##$ABSF1= 10
##$ABSF2= 0
##$ABSG= 5
##$ABSL= 3
##$ALPHA= 0
##$AQORDER= 0
##$ASSFAC= 0
##$ASSFACI= 0
##$ASSFACX= 0
##$ASSWID= 0
##$AUNMP= <proc_1d>
##$AZFE= 0.1
##$AZFW= 0.1
##$BCFW= 1
##$BC_mod= 2
##$BYTORDP= 1
##$COROFFS= 0
##$CY= 11.3945322036743
##$DATMOD= 1
##$DC= 2
##$DFILT= <>
##$DTYPP= 0
##$F1P= 2.36226072786647
##$F2P= -0.459571619588291
##$FCOR= 0.5
##$FTSIZE= 0
##$FT_mod= 4
##$GAMMA= 1
##$GB= 0.15
##$INTBC= 1
##$INTSCL= 1
##$ISEN= 128
##$LB= 0.24
##$LEV0= 0
##$LPBIN= 0
##$MAXI= 10000
##$MC2= 0
##$MEAN= 0
##$ME_mod= 0
##$MI= 1.114404
##$NCOEF= 0
##$NC_proc= 0
##$NLEV= 6
##$NOISF1= 3.799351
##$NOISF2= 2.8
##$NSP= 1
##$NTH_PI= 0
##$NZP= 0
##$OFFSET= 15.70392
##$PC= 1
##$PHC0= -15877.42
##$PHC1= 19.20079
##$PH_mod= 1
##$PKNL= yes
##$PPARMOD= 0
##$PSCAL= 0
##$PSIGN= 0
##$REVERSE= no
##$SF= 200.130013532006
##$SI= 16384
##$SIGF1= 3
##$SIGF2= 2
##$SINO= 400
##$SIOLD= 16384
##$SREGLST= <1H.CDCl3>
##$SSB= 0
##$STSI= 0
##$STSR= 0
##$SW_p= 3612.71676300578
##$SYMM= 0
##$S_DEV= 0
##$TDeff= 0
##$TDoff= 0
##$TI= <>
##$TILT= no
##$TM1= 0
##$TM2= 0
##$TOPLEV= 0
##$USERP1= <user>
##$USERP2= <user>
##$USERP3= <user>
##$USERP4= <user>
##$USERP5= <user>
##$WDW= 1
##$XDIM= 8192
##$YMAX_p= 0
##$YMIN_p= 0
$$ End of Bruker specific parameters
$$ ---------------------------------
##NTUPLES= NMR FID
##VAR_NAME=  TIME,          FID/REAL,        FID/IMAG
##SYMBOL=    X,             R,               I
##VAR_TYPE=  INDEPENDENT,   DEPENDENT,       DEPENDENT
##VAR_FORM=  AFFN,          ASDF,            ASDF
##VAR_DIM=   8192,          8192,            8192
##UNITS=     SECONDS,       ARBITRARY UNITS, ARBITRARY UNITS
##FACTOR=    0.0002768,     1,               1
##FIRST=     0,             0,               0
##LAST=      2.2672688,     0,               0
##MIN=       0,             -209390,         0
##MAX=       2.2672688,     154964,          0
$$ Real data points
##PAGE= N=1
##DATA TABLE= (X++(R..R)), XYDATA
$$ [...]
1830C15n60jL32m23R2k3J16L45k51k98O78k86M2K4N7L66n45J35N34r04N66j29
$$ 315 -245 -246 86 -337 -245 -268 -152 193 -58 -356 322 36 78 102 159 525 -20 115 649 -255 311 182
1852A82k57K35n06M66L21j025K24P36n64j45J31L2Q7l05L83J30m55M31J19l71
$$ 182 -75 160 -346 120 441 -584 -360 376 -188 -333 -202 -170 -83 -388 -5 125 -330 101 220 -151
1872a51J69j96K71k2k63M32R2m13J88j28J80j96l12L94K00m67K74j2k08P6p9J96
$$ -151 18 -178 93 71 -192 240 332 -81 107 -21 159 -37 -349 45 245 -222 52 40 -168 -92 -171 25
1894B5k00m08O91n8l71J97R0R8N4m47Q96m05l63O20l16k19N51n38M20p6k75M60
$$ 25 -175 -583 108 50 -321 -124 -34 64 118 -329 567 162 -201 419 103 -116 435 -103 317 241 -34 426
1916D26m63j98N39k56j52O2j94M37o25O0L17jN1l3P2J03o0q7N59p06L76l5j35
$$ 426 -37 -235 304 48 -104 -42 -236 201 -424 -364 -47 -48 3 -30 42 145 85 -2 557 -149 227 192 57
1939E7J80m00R7L01j64j88M55l87K97o1m68M35l88L4J95l88O69j78k47J16k25
$$ 57 237 -163 -66 235 71 -117 338 -49 248 187 -281 154 -234 -200 -5 -393 276 98 -149 -33 -258
1960b58J88J38m47N99r8k97N61n40J87J63m66M40k6l51M33j93j35J28m66N27Q1
$$ -258 -70 68 -379 220 122 -175 386 -154 33 196 -270 170 144 -207 226 33 -102 26 -440 87 168
1981A68k90R1J69k28O3j62j6N62m03J22mk95L96j86L6J45j98J38P4j54N79o28
$$ 168 -122 -31 138 -90 -27 -189 -205 357 -46 76 72 -223 173 -13 23 168 -30 108 182 28 607 -21
2003b1j38M61k18m1O4l17N48o07Q1O51p79Q9K58r5J83l30j83P15n13p0O11n27
$$ -21 -159 302 84 43 107 -210 338 -269 -188 463 -316 -227 31 -64 119 -211 -394 321 -192 -262 349 -178
2025a78L72k39o4N55o73K07K82l70K53o2k71N62m21L9K16m94L74j13l01K36j64
$$ -178 194 -45 -109 446 -227 -20 262 -108 145 83 -188 374 -47 -8 208 -286 88 -25 -326 -90 -254
2046b54K26J19l82M14j88m10O69k94K03q4j21L30j30l62L03J08J3m1m10M62j8
$$ -254 -28 91 -291 123 -65 -475 194 -100 103 19 -102 228 98 -264 39 147 160 119 -291 171 153
2067A53k97N09j72m00N55n43J40K31n24N12J39n95K91q4J3n7l8N21n84J62N89
$$ 153 -144 365 193 -207 348 -195 -55 176 -348 164 303 -292 -1 -85 -72 -129 -167 354 -230 -68 521
2088E21o05l9K51j83J9J23j50O10n86j7L37l11K00J9l76L31k78K8K37k26l52N27
$$ 521 -84 -123 128 -55 -36 87 -63 547 -39 -56 281 -30 170 189 -187 144 -134 -106 131 -95 -447 80
2110H0m07M05l98k0L68k51KL03k77j21N52k14L19n35K86J08j53K39l27P2L15k62
$$ 80 -327 78 -320 -340 28 -223 -221 82 -195 -316 236 22 341 -194 92 200 47 286 -41 31 346 84
2132H4L02j70n14J04K42n00L13J26l44J95o1N02j72n02O37l01k19K92k16M54j62
$$ 84 386 216 -298 -194 48 -452 -139 -13 -357 -162 -223 279 107 -395 242 -59 -278 14 -202 252 90
2153I0k69N24m16mJ92j73L64K3l23J74j68k06M19k80m5L8M7O8k05n3L79n20K27
$$ 90 -179 345 -71 -75 117 -56 308 331 8 182 14 -192 227 -53 -98 -60 -13 55 -150 -203 176 -344 -117
2176a17J16N2j53K32l15L90k56m2M77m31o4J38p0K68p7M9J17n75J14M96m37J50
$$ -117 -1 51 -102 130 -185 205 -51 -93 384 -47 -111 27 -43 225 148 197 314 -261 -147 349 -88 62
2198F2j11k19M78m17L1M24p91L35J78k47L94k03N1M9m26L31K94l68K33j05J78
$$ 62 -49 -268 210 -207 -176 248 -543 -208 -30 -277 117 -86 -35 14 -412 -81 213 -155 78 -27 151
2219A51n7k81L25L72m19k53J85R3R8l63J79K15p00L94K6k04L49M3k5k8m33L72
$$ 151 94 -187 138 510 91 -162 23 116 214 -149 30 245 -455 -61 -35 -239 110 153 128 100 -333 39
2241C9j87p7L70k48L33l49K54R8j04j03J39j15n3o9J89k2r4k19J68j01J49K09
$$ 39 -148 -225 145 -103 230 -119 135 233 129 26 165 50 -3 -72 117 95 1 -218 -50 -151 -2 207
2263B07m43J58j45m8K18n92J44N88k41o3L93p8lO8k21O57p76L66Q4l29K29j75
$$ 207 -236 -78 -223 -271 -53 -645 -501 87 -154 -217 176 98 95 163 -58 599 -177 189 273 -56 173 -2
2285bJ71J28l04K73J4n23L81l5k06J19k92K47K6j93L5J73q2J64j67J60L6l07M85
$$ -2 169 297 -7 266 280 -243 138 103 -103 16 -276 -29 -3 -196 -161 12 -70 94 -73 87 123 -184 301
2308C01k02l18M37l5j03K73l30K70j73m89O01j75k50L28L5q1j50m90Q73j58m21
$$ 301 99 -219 218 183 80 353 23 293 120 -369 232 57 -193 135 170 89 -61 -551 322 164 -257
2329b57L19k59J98k12K21J02k52P3M04m76J80J85l01K05j46N1M45l74l4Q9k08
$$ -257 62 -197 1 -211 10 112 -140 -67 337 -139 41 226 -75 130 -16 35 480 106 72 161 -47
2350d7pJ2J14j11j8K5J40m07K79q1J0N07o64P7M22n24K07M03j41j50j8l6J75m3
$$ -47 -54 -42 72 -39 -57 -32 108 -299 -20 -101 -91 416 -248 -171 251 -273 -66 337 196 46 28 -8 167 124
2374A24O3K80m47J61R7l11L01l16J54l2k12J32j17J16R8k19kK44m68L56j9l69
$$ 124 187 467 20 181 278 -33 268 -48 106 74 -138 -6 -123 -7 91 -128 -130 114 -354 2 -17 -386
2396c86P25j96k28J19k65M83Q4n53N40q9m13L10l88L27J94l05K99j34k03K37l06
$$ -386 339 143 -85 34 -231 252 336 -217 323 234 -179 131 -257 70 264 -41 258 124 -79 158 -148
2417a48k1q3J88J72p3l83N00j26m18N44k57k42j1L95l5k10j0N09n29K65J67l13
$$ -148 -169 -252 -64 108 35 -348 152 26 -392 152 -105 -347 -358 37 2 -208 -218 291 -238 27 194 -119
2439a19L93m85J75M39o07L75j43K1j17j17n0L34l36lK33j58L2l12K72K99l46m7
$$ -119 274 -211 -36 403 -204 171 28 49 -68 -185 -235 99 -237 -240 -7 -165 -133 -445 -173 126 -220 -267
2461b67L63j64P0R6k77K64j27L3M08l41N5K79n51K03o5j26J54k77L38r0m3q6j05
$$ -267 96 -68 2 98 -179 85 -42 -9 399 58 113 392 -159 44 -21 -147 7 -270 68 -22 -65 -151 -256
2484b56r1N06m99L68o0j19jQ4j03L28k2k58L89m05K69k86K85K79l63q8K30j97
$$ -256 -347 159 -340 28 -32 -151 -152 -68 -171 157 135 -123 266 -139 130 -156 129 408 45 -43 187 -10
2506a0K62m04r6J08J52p0J0l31K69n4J22L89n54K90Q6k72j11J47k18N41n3l18
$$ -10 252 -152 -248 -140 12 -58 -48 -379 -110 -164 -42 347 -207 83 169 -103 -214 -67 -285 256 203 -115
2528a15J19j00J79LQ0N4k03k3J64k96J45J09m62L72j95K67Q2j97N6n2n19L59Q4
$$ -115 4 -96 83 86 166 220 17 -6 158 -138 7 116 -346 26 -169 98 180 -17 39 -13 -532 -173 -89
2551h9J6Q8j25J4L11l99K53M1J7r2M0O4l3k34L10L6l02Q1r0M8J62o16N85L6l50
$$ -89 -73 15 -110 -96 215 -184 69 110 127 35 75 139 106 -128 182 218 -84 -3 -93 -45 117 -499 86 122 -228
2576b28K91k52N4J38j78L97j55n1k52N2k9N81k59K37j27m01L57r7j19J90J48j13
$$ -228 63 -189 -135 3 -175 222 67 16 -236 -184 -213 368 109 346 219 -182 175 78 -41 149 297 184
2598A84P5m16N38l82k46N42n62J07L72k54Q6k71J62L76n99k3M02k31J98J99j95
$$ 184 259 -157 381 -1 -247 295 -267 -160 212 -42 44 -227 -65 311 -288 -311 91 -140 58 257 62
2619F2qj32oM16k30nk34P4L81j08j78K10n04N57k02k29K77j0l32J94l87K52M25
$$ 62 54 -78 -84 332 102 97 -137 -63 318 210 32 242 -262 295 93 -136 141 131 -201 -7 -394 -142 283
2642B83n84M93J5l49L30l16M1K32m51M83J3n36L56K15l20L59l66O7J25j32K66
$$ 283 -301 192 207 -142 188 -128 -87 145 -306 177 190 -346 10 225 -95 264 -102 -35 90 -42 224
2663B24l19J40J56m89K85l47K86K4J20k26m5L5l4n7K36J23o3P7r2j40J53q1j75
$$ 224 -95 45 201 -288 -3 -350 -64 -40 80 -146 -191 -156 -190 -247 -11 112 49 126 34 -106 47 -34 -209
2686b09M83j99j72M64l32k33M71k26K21k93j52L54m11L04j16q0j98p2K96K9j52
$$ -209 274 75 -97 367 35 -198 273 47 268 -25 -177 177 -234 70 -46 -126 -324 -396 -100 -71 -223
2707b23l2L94m77L00J37k30Q2J09Nq8j50L22R3l12N75m13M7P6k23q1R3k64L48
$$ -223 -255 139 -338 -38 99 -131 -49 60 65 -23 -173 149 242 -70 505 92 139 215 -8 -89 4 -260 88
2730H8p9P7j43j42K59J16m51K73j43p8L27j82K26j76j6J2p1J60K74l35K0K70k54
$$ 88 9 86 -57 -199 60 176 -275 -2 -145 -223 104 -78 148 -28 -44 -32 -103 57 331 -4 16 286 32
2753C2j64Q1o9K54o2p3R2n8j84J86k96J87j94l8J95n5j87M01k52M36j68j97J05
$$ 32 -132 -51 -120 134 72 -1 91 33 -151 35 -261 -74 -268 -306 -111 -166 -353 48 -204 232 64 -133 -28
2776b8lJ39J49l97N35l06j09K54j23j40k6q5n9M94n16L61m37N27J70o66K94K60
$$ -28 -31 108 257 -140 395 89 -20 234 111 -29 -55 -140 -199 295 -221 140 -297 230 400 -266 28 288
2798B88l68j81L2K02J4KJ99N8l21J45K19l97K72j5r3l7l61N10j2l68M30l21J79
$$ 288 -80 -261 -229 -27 -13 -11 188 246 -75 70 289 -108 164 149 56 19 -342 168 156 -212 218 -103 76
2821G6K0l66N02l62o4K31k89j7J80k88J67L86k32K37j73J7L37l01j92M19j71J46
$$ 76 96 -270 232 -130 -194 37 -252 -269 -89 -377 -210 176 -56 181 8 25 362 61 -131 288 117 263
2843B63p4k18J12ln6J22j32K07k10k72N51k16J03k80o5K37l86J82L20n56J17K46
$$ 263 189 -29 83 80 24 146 14 221 11 -261 290 74 177 -103 -168 69 -317 -135 185 -371 -254 -8
2865hm39L75K47n57Q56m89l8L77m88J08K61p3L1l16M31k29j95O9J65l03J06RJ75
$$ -8 -447 -72 175 -382 474 -15 -53 324 -164 -56 205 132 163 -153 278 49 -146 -77 88 -215 -109 -100 75
2888G5kk67M85j96l96J07K43N9j72l36M05J83l22R2N3j37J65P3j06J6L0J46K76
$$ 75 73 -194 291 95 -301 -194 49 108 -64 -400 5 188 -134 -42 11 -126 39 112 6 22 52 198 474
2911D74m51O0k12j2L16l16K79p7k29K05j19j46J65J82j43Mk59L41k15j48O91n02
$$ 474 23 83 -129 -141 175 -141 138 61 -168 37 -82 -228 -63 119 -24 -20 -279 62 -153 -301 390 -112
2933a12J2K73j45J86m2k36J71J34j99k42J40J10J57l13L35l74Q0Mq4K81m1j04
$$ -112 -100 173 28 214 172 -64 107 241 42 -200 -60 50 207 -106 229 -145 -65 -61 -145 136 95 -9
2955iN7N2r9J10k47J08J87j49Q4j97K47k03R0J45P6k17j58J6L7N4j01J65j25j89
$$ -9 48 100 1 111 -136 -28 159 10 94 -103 144 -59 31 176 252 35 -123 -107 -70 -16 -117 48 -77 -266
2979b66M38j66j80J1J7J27L35n94K13J90p0J60k11j13J36k96L61P5j20K87l87
$$ -266 172 6 -174 -163 -146 -19 316 -278 -65 125 55 215 4 -109 27 -269 92 167 47 334 -53
3000e3K19K08m02Q1J46l49L37r7l81K37j75K01J3m10O07n21J70M18k48L6r8k27
$$ -53 166 374 -28 53 199 -150 187 90 -291 -54 -229 -28 -15 -425 182 -339 -169 249 1 37 -61 -288
3022b88L32j37R7P5n4j41L79l09J72j50mJ26j44M8K76l29K0j09k6R0K6k04K29
$$ -288 44 -93 4 79 25 -116 263 -46 126 -24 -28 98 -46 2 278 -51 -31 -140 -166 -76 -50 -254 -25
3045b5j54L21j73n4J80p8J22p3k18p9K48l8M45n72K31J53l11J91J18j60R3r4l95
$$ -25 -179 142 -31 -85 95 17 139 66 -152 -231 17 -21 424 -148 83 236 -75 116 234 74 167 73 -322
3068c22P00n41J46K2k42J16j23k2J23j64J24J34m7J75p0m33P21k60P4Mjj72R8
$$ -322 378 -163 -17 5 -237 -121 -244 -266 -143 -307 -183 -49 -96 79 9 -424 297 37 111 115 114 -58 40
3091D0j1L36m75M4L40l72K59J18k25L24n41k6L36k21j60K23J2J76o04K44M71l51
$$ 40 29 365 -110 -66 274 -98 161 279 54 378 -163 -189 147 -74 -234 -11 1 177 -427 -183 288 -63
3113f3J16N2k53J08J11J25J75m83q9L50p2J02p1rQ7l75M45q9l85M99Om45J00j14
$$ -63 53 105 -148 -40 71 196 371 -112 -201 149 77 179 108 99 186 -189 256 167 -218 281 287 -158 -58 -172
3137a72N0L36k91P9l6k30M96l22J05ll13N49J50n60M91l12r7L33k32N0J33k25
$$ -172 -122 214 -77 2 -34 -264 232 -90 15 12 -301 248 398 -162 329 17 -80 253 21 71 204 -21
3159b1K07j40j98L68l75J27K42k93oj9J05J32k22J23r7j00L71m66J31K76j93O9
$$ -21 186 46 -152 216 -159 -32 210 -83 -89 -108 -3 129 -93 30 -67 -167 204 -262 -131 145 -48 21
3181B1P5O1kL41l39J18m50M3K95k55L12r4k91K5K08l09L14k99M42k44j96l6J78
$$ 21 96 157 155 496 157 275 -175 -132 163 -92 220 126 -165 -140 68 -241 73 -226 216 -28 -224 -260 -82
3204h2N6J25m08M33p3l78N81k67J40K7j85K18J08l62M1J89o4M3k45Q0N4l57N56
$$ -82 -26 99 -309 124 51 -327 254 -13 127 154 -31 187 295 -67 -26 163 99 142 -103 -23 31 -326 230
3227B30o2l5L4k23j60K83l15K70j5l2O4r9j07Q7j24K89k95j3O57m82J02Q6j76
$$ 230 168 133 167 -56 -216 67 -248 22 7 -25 39 -60 -167 -80 -204 85 -210 -223 434 -48 54 140 -36
3250c6N3O6k44M28k24l28M06j54j01N6n6j36L22k12M17m97j32N15l73M16p4m77
$$ -36 17 83 -161 267 43 -285 121 -33 -134 -78 -134 -270 52 -160 257 -240 -372 143 -230 186 112 -365
3272c65O10l25N7R9j71K03j52K72k85O2o8L81l51J32q9n5J82j32q1M53o49J15
$$ -365 245 -80 -23 76 -95 108 -44 228 -57 5 -63 318 -33 99 10 -45 137 5 -76 377 -272 -157
3294a57K30n28J22J31K80R5j63j23J02m6J92K5J61n2j45j03K45n18N09Q9n36O14
$$ -157 73 -455 -333 -202 78 173 10 -113 -11 -57 135 160 321 269 124 21 266 -252 257 346 -190 424
3316D24l66K57r2k72K49l1l06L99j96k59L07k54J29P6l27N37l58qK29q0N2mJ61
$$ 424 58 315 223 -49 200 169 -137 262 66 -193 114 -140 -11 65 -262 275 -83 -91 138 58 110 106 267
3339B67j35k44K15K34l27J71k74J20J37j34nJ09k10l35M41m39K85R6j86O35l10
$$ 267 132 -112 103 337 10 181 -93 27 164 30 25 134 -76 -411 30 -409 -124 -28 -214 421 111
3360A11l04M57n75K45P2j59L88o76M54K51k72j08Q3j57J49k22K03K94l53K55L
$$ 111 -193 264 -311 -66 6 -153 235 -441 13 264 -8 -116 -33 -190 -41 -263 -60 234 -119 136 139
3381A39m74L03J94j80K05l94L75j96k70O02l90j00K2K35k40K87j57J15R0k15K22
$$ 139 -335 -32 162 -18 187 -207 168 -28 -298 304 -86 -186 -164 71 -169 118 -39 76 166 -49 173
3402A73k4R8j26n3L5M7k50K21k96J85L5r9o4J70o8j47K43l48J64j01K15q9J01
$$ 173 149 247 121 68 103 150 -100 121 -175 10 45 -54 -118 52 -16 -163 80 -268 -104 -205 10 -79 22
3425B2K65k56jK03k69J07J37k93M07j89j73K24j61k43N09k77P0q7n9M11n32o4
$$ 22 287 31 30 233 -36 71 208 -85 322 133 -40 184 23 -220 289 12 82 -5 -64 347 -185 -249
3447b49M31l80Q0Q2l10L37j78K07K24o38L48J37l34L72k9k38L34k21LJ90l9k7
$$ -249 182 -198 -118 -36 -346 -9 -187 20 244 -394 -46 91 -243 129 100 -138 196 -25 -22 168 129 102
3469A02J44k02R4l08M32J48l91J38j31k42K11L2k32M74n09L05J19l39K1l5L61
$$ 102 246 44 138 -170 262 410 19 157 26 -216 -5 27 -205 269 -240 65 184 -155 -134 -169 192
3490A92j18k84K61L1j17L49k94Q1n9k30M33k58o2L24p7j57k1r2J54Q2k81l0q3
$$ 192 74 -210 51 82 -35 314 20 101 42 -188 245 -13 -75 249 172 15 -6 -98 56 138 -143 -173 -256
3513b56J62J98k72Q4J58m13N58j60k49M03p3j78L62l13K79j99j17M5j56M09j83
$$ -256 -94 104 -168 -84 74 -339 219 59 -190 213 140 -38 324 11 290 91 -26 19 -137 272 89
3534H9k3k3J62m29K51j51M5O8j75o4K23j75K97l37K17K59k23R9J17l60P3J99j81
$$ 89 66 43 205 -224 27 -124 -79 -11 -186 -250 -27 -202 95 -242 -25 234 11 110 227 -133 -60 139 -42
3557d2L96k20l61M74m86L32k3J1J67k35L6J37k28J09j11J12ql55J38K89n65K50
$$ -42 354 134 -227 247 -239 93 70 81 248 13 49 186 -42 67 -44 68 60 -295 -157 132 -433 -183
3579a83L00k07J36j62P8l3j16J73J42l52M57l35J98lk35K01J01m93L36L7m05O01
$$ -183 117 -90 46 -116 -38 -71 -187 -14 128 -224 233 -102 96 93 -142 59 160 -333 3 40 -365 236
3601B36k28m4K48l49Q1J31j95L47k24O4K58k45J94q0j81M3O8j59M3j27j01L59
$$ 236 8 -36 212 -137 -56 75 -120 227 3 67 325 80 274 194 13 56 124 -35 8 -119 -220 139
3623A39k04K99k51l16L77j05J7j5j48K99k86J45K46q7j34J15j76L05m55Q2JRJ33
$$ 139 -65 234 -17 -333 44 -61 -44 -59 -207 92 -194 -49 197 110 -24 91 -85 220 -235 -153 -152 -143 -10
3646a0K03l69L29l2m8K55m19L1L89l87J01j06j02J03J03J36r3k07%J87k1j46j15
$$ -10 193 -176 153 121 73 328 -91 -60 329 -58 43 -63 -165 -62 41 177 84 -123 -123 64 43 -103 -218
3669b18rJ14J4J40k17N2Q4n1j5L19k73J17J26k62J08K71j64K40n45K78P4k50M57
$$ -218 -227 -113 -99 41 -176 -124 -40 -91 -106 213 -60 57 183 -79 29 300 136 376 -169 109 183 -67 390
3692C90l13k02J31k32L07J7k50L09j92l9RJ41l3n3j16K33j68j58M49j74j98M71
$$ 390 77 -125 6 -226 81 98 -152 157 -35 -74 -65 76 43 -10 -126 107 -61 -219 230 56 -142 329
3714C29l41R6j21K43k6l43J83J59k68M4K33l17O4N34p93K33j61K29k43O1L24j30
$$ 329 -12 84 -37 206 180 -163 20 179 -89 -45 188 -129 -65 469 -324 -91 -252 -23 -266 -205 119 -11
3736a1m1J77k63J9J03k36M82j58n4J86j85j14L50k75J03P7l05L23k60j09L40j67
$$ -11 -52 125 -138 -119 -16 -252 230 72 18 204 19 -95 255 -20 83 160 -145 178 -82 -191 149 -18
3758a8J03k49R6q3J61k35L54j96J03M6k58J72K2r0M05k61m1J3J38k2j57o6K49
$$ -18 85 -164 -68 -151 10 -225 129 -67 36 82 -176 -4 18 -72 333 72 31 44 182 160 3 -63 186
3781A86j82j09qm0J26M9l9K32k72R5L03m21R0j16j55K45n7jK72k33K86l63M9M02
$$ 186 4 -105 -113 -153 -27 22 -17 215 -57 38 341 -80 10 -106 -261 -16 -73 -74 198 -35 251 -112 -63 339
3805C39k26n28N29j94J25j92O9L0n6Q8L5J2J21N7j77K0K6q9l9n1O5J25l94J10
$$ 339 113 -415 114 -80 45 -147 -78 -48 -104 -16 19 31 152 209 32 52 78 -11 -50 -101 -36 89 -305 -195
3829a95J57M7J91l54J55p6O2K64l87n5K66r9K09q8r5J57J15l90P6J59l55L57j87
$$ -195 -38 9 200 -154 1 -75 -13 251 -136 -191 75 -24 185 97 2 159 274 -116 -40 119 -236 121 -66
3852f6J32n3k28L19l41k2L71j66q0J34j78K06LK30j47k13L10l45M1K37R4m18K23
$$ -66 66 13 -215 104 -237 -259 112 -54 -134 0 -178 28 31 261 114 -99 211 -134 -93 144 238 -180 43
3875D3P3j77L05m53K12j74M1j2K89l20K54l14M0K27k90L40l00M12o5k47J01J13
$$ 43 116 -61 244 -209 3 -171 -130 -142 147 -173 81 -233 -193 34 -256 84 -216 196 131 -116 -15 98
3897I8l70K64j35L56j85k55L98P6k11K74m57%N6J19P3J81n04R5K8K6J29j72L07
$$ 98 -272 -8 -143 213 28 -227 171 247 36 310 -147 -147 -91 28 101 282 -222 -127 -99 -73 56 -116 191
3920A91q0k69O2O5j85M66k86R6J18l60L00Nk22P8P4k14L55l11J65k2k25N4K29
$$ 191 111 -158 -96 -31 -216 250 -36 60 178 -182 118 123 -99 -21 53 -161 194 -117 48 26 -199 -145 84
3943H4k03l3K83j94J98j99J77k47n3R9JJ22k82L29J03j63J21j07P0k87L19k90
$$ 84 -119 -152 131 -63 135 -64 113 -134 -187 -88 -87 35 -247 82 185 22 143 36 106 -181 138 -152
3965a52L33J91o89M04J9K7LJ5k8j71k9J86j69p2J39J06k79p1O4K48r0r9J54MJ5
$$ -152 181 372 -317 87 106 133 136 151 123 -48 -77 109 -60 -132 7 113 -166 -237 -173 75 -15 -114 40 44 59
3990E9P6k65j09J27K35Qk24P5J00K3K39k59j47J41q4o1J44r7K35m15J88K1k48
$$ 59 135 -130 -239 -112 123 131 -93 -18 82 105 344 85 -62 79 -5 -66 78 -19 216 -199 -11 10 -238
4013b38K27K03m20l6M54l29K79r6N5j70K1J92J02l88M31k63J7K89n12L24j28j45
$$ -238 -11 192 -228 -264 190 -139 140 44 99 -71 -50 142 244 -144 287 24 41 330 -182 142 14 -131
4035a31K14J9n7l3j92K32J8k48k1J02q5J18k86K49K00j29K45Pk68L25k43l11J89
$$ -131 83 102 45 12 -180 52 70 -178 -199 -97 -182 -64 -350 -101 99 -30 215 222 -46 279 36 -275 -86
4058h6R5j3O5k33J94q8J23Nk77K13O4q3R4j86k7K48k26Q1L0l51N15L1j35P3l55
$$ -86 9 -4 61 -172 22 -66 57 62 -215 -2 62 -21 73 -113 -140 108 -118 -37 -7 -358 157 188 53 126 -229
4083b29K43n2N4K50m52J01K97j12O4o7l1K03k08j80P4j63K04K3j44J36l58R6J79
$$ -229 14 -38 16 266 -186 -85 212 100 164 97 66 269 61 -119 -45 -208 -4 19 -125 11 -347 -251 -72
4106g2M7K09l86L8R7O4j44J24k15K55j66J73O8mk41K54J1j71J33l1J53j21j04
$$ -72 -25 184 -202 -164 -67 -3 -147 -23 -238 17 -149 24 92 88 -153 101 112 -59 74 43 196 75 -29
4129b9R8p0j50J71m9j74K31k59M85n58M25n4k65J24J53j74j25L40l2Kk35L01j22
$$ -29 69 -1 -151 20 -29 -203 28 -231 254 -304 121 67 -198 -74 79 -95 -220 120 88 90 -145 156 34
4152C4j1J5L67j81q0j79mK34j46M2Ll66L32L6m3j0k16J88j18pJ21j34j34L85j31
$$ 34 23 38 405 224 144 -35 -39 195 49 91 94 -272 60 96 53 43 -173 15 -103 -110 11 -123 -257 128 -3
4177cL0N7j9J72Jj02j78R3j78R7L7J7q6l57M85j89L10o8l93M42j61k45K90m02
$$ -3 27 84 65 237 238 136 -42 51 -127 -30 7 24 -62 -419 66 -123 187 119 -274 168 7 -238 52 -350
4201c50K31K44m32K30r4K31J9J06nm8M3l35J92q1L34L9m19j22m4L43n7K2K2k3
$$ -350 -119 125 -307 -77 -171 60 79 185 180 132 175 -160 32 -49 285 324 -95 -217 -261 82 25 47 69 46
4225D6K6j15k70L75Q6j0k59L3k4J0j58P5K19K3J39l58Q5J40k39J75P0o8J62M0
$$ 46 72 -43 -313 62 148 138 -121 -88 -112 -102 -260 -185 34 57 196 -162 -77 63 -176 -1 69 1 163 203
4249B03k68N7J37n2k13p1J14R2m0J08j95J46q1p8qJ26J4k33J25J82J19j34q4L11
$$ 203 -65 -8 129 77 -136 -207 -93 -1 -41 67 -128 18 -63 -141 -149 -23 -9 -242 -117 65 184 50 -34 277
4273B77j90K4j56k11M00j25k23L08J55l24L50m25M42l41o6R2J11m02J18K23r0
$$ 277 87 111 -45 -256 144 19 -204 104 259 -65 285 -140 302 -39 -105 -13 98 -304 -186 37 -53
4294e3j64k15O97k40Oj73N2K85l00Q6J48j96J14j54J37K6j23K81m2j85N5R0k22
$$ -53 -217 -432 265 25 31 -142 -90 195 -105 -19 129 -67 47 -107 30 56 -67 214 172 -13 42 132 -90
4317i0K9N3l6J10J04l93K61j48L11k04l21K89K0q2J88n09O00j08j58L68l05j71
$$ -90 -61 -8 -44 66 170 -223 38 -110 201 -3 -324 -35 -15 -97 91 -418 182 74 -84 284 -21 -192
4339a92K47l01K71L23p32L90j08J84O2r7L3n8L0J48l56J01n2K56k94L15k79K4
$$ -192 55 -246 25 348 -384 6 -102 82 144 47 80 22 52 200 -156 -55 -107 149 -145 170 -109 -85
4361h5Ok73K71J11J41k06k3R8K19l03J74l20K29N1q5j38Q0j78K93M6k27K26q9
$$ -85 -79 -352 -81 30 171 -35 -58 40 259 -44 130 -190 39 90 5 -133 -53 -231 62 108 -119 107 18
4384A8L7q2Q3J24o15J49L45k75N81k47l41K30j14l2J58j44K94j4m20N27j27J26
$$ 18 55 -27 56 180 -435 -286 59 -216 365 118 -223 7 -107 -139 19 -125 169 155 -265 262 135 261
4406B61k41No1p1K59j28k0j15J78j71J30j97J69j6L6K33k02j40P8J53j57J60k00
$$ 261 20 25 -36 -107 152 24 4 -111 67 -104 26 -171 -2 -18 18 251 49 -91 -13 140 -17 143 -57
4429e7k1J60j41j3Mr3j7K85k41K37k08O9Nk94K45j52L9K49k1m45N60l52j27M06
$$ -57 -78 82 -59 -72 -68 -161 -178 107 -134 103 -105 -36 -31 -325 -80 -232 -193 56 35 -410 150 -202 -329 77
4453G7J00j59J1j06J99k94O9J22m3J50j74k8R2M0l0J16ol4K13k11J8j74L6J39
$$ 77 177 18 29 -77 122 -172 -103 19 -24 126 -48 -76 16 56 26 142 136 102 315 104 122 -52 -16 123
4477A23l41J48J53j92K59l18M6J53q3Q2m1N0n3q4k7O6L46k48L8j07J95j00M7k53
$$ 123 -218 -70 83 -109 150 -168 -122 31 -52 30 -11 39 -14 -98 -125 -59 287 39 77 -30 165 65 112 -141
4501a41M3K4K57k0M4j25k74L99j68j36L60m76J31J36nN9l65L26q3J19o8Nk89K39
$$ -141 -98 -74 183 163 207 82 -192 207 39 -97 263 -213 -82 54 49 108 -257 69 -14 105 37 42 -247 -8
4525hJ77k7k25J97M7j58k33M05l55K70N5j62q7L78k00k08J9J09P2r4j28m9K01
$$ -8 169 142 -83 114 161 3 -230 175 -180 90 145 -17 -104 274 74 -134 -115 -6 66 -28 -156 -205 -4
4548dj43L52l51L9J0J29K47l15m5K63k89M8J02k04J91J40k03R1k04J73J29j58
$$ -4 -147 205 -146 -107 -97 32 279 -36 -81 182 -107 -59 43 -161 30 170 -33 58 -146 27 156 -2
4570bpj43J40O4O5o9j5k56L15j99m5K37k11J48O6j11J61R8j72RJ81l03J81k00
$$ -2 -9 -152 -12 52 117 48 33 -223 92 -107 -152 85 -126 22 88 -23 138 236 64 73 254 -49 132 -68
4594f8j16L38j60Q4k52J90L4j08KJ0k20L11k09K48r6k17M56k18J8J93j95O1N6
$$ -68 -184 154 -6 78 -174 16 50 -58 -56 -46 -266 45 -164 84 -12 -229 227 9 27 220 25 86 142
4617A42m3lrr2J16j6j84j3l2K35k27J66Oj17k08L47k11L5J78l84L45N8k90L93
$$ 142 99 96 87 -5 111 95 -89 -102 -134 101 -126 40 46 -71 -279 68 -143 -108 70 -314 31 89 -201 192
4641A92j6k16Q4j78K58J01l62M30l66J14j43PJ92M1j90K90j70J24O8k78j74k02
$$ 192 176 -40 44 -134 124 225 -137 293 -73 41 -102 -95 97 138 -52 238 68 192 260 -18 -192 -394
4663c94K92N6j36Q6j55N1L05Mj39K0j98J59j4n8K40j49k5j02L05OM7l01J91O0
$$ -394 -102 -46 -182 -96 -251 -200 105 109 -30 -10 -208 -49 -63 -121 119 -30 -55 -157 148 154 201 -100 91 151
4687A51j81Q9p8J99J0k82k50M72j47n5J52L5r8k59J21%K38J14l57N3K00j70J31
$$ 151 -30 59 -19 180 190 -92 -342 130 -17 -72 80 115 17 -242 -121 -121 117 231 -126 -73 127 -43 88
4710H8O3n04O07l04J19r8N8k10L54j06k24J36k2J17N8k0K09m28J31P8O5j69j85
$$ 88 151 -353 254 -50 69 -29 29 -181 173 67 -157 -21 -43 74 132 112 321 -107 24 102 167 -2 -187
4733a87J00L01k59j93K17L2p8K0j4j1r4M9L69m13M05k14k35K74k07Q5J9o7N8N8
$$ -187 -87 214 -45 -238 -21 11 -67 -47 -61 -72 -166 -117 252 -161 244 30 -205 69 -138 -53 -34 -101 -43 15
4757A5j46J01j89L50l44J88J65o6j12kJ13J76l0k90J17K13p2o7k06M8M5j60L09
$$ 15 -131 -30 -219 131 -213 -25 140 74 -38 -40 73 249 219 -71 46 259 187 120 -86 -38 7 -153 156
4780A56n7k32J01qP2J15J7k20o5O4O9k35J75l2K67k09J55l48K19J3j65J67J41
$$ 156 99 -133 -32 -40 32 147 164 -56 -121 -57 12 -223 -48 -80 187 -22 133 -215 4 17 -148 19 160
4803A60j42rK59q0j15j48K21l17L47j37M6R2O9k78J78k31k9K25k01N1J85j73J40
$$ 160 18 9 268 188 73 -75 146 -171 176 39 85 177 246 -32 146 -85 -114 111 -90 -39 146 -27 113
4826A13j05l8K55j49J31n7m80K39J34p8J57k00J36J96k88N0Pj98L0N3J51j36L5
$$ 113 8 -30 225 76 207 150 -330 -91 43 -35 122 -78 58 254 -34 16 23 -175 -145 -92 59 -77 -42
4849d2K76m72K6K68q4p9L35l88K29k43K83p0j21R9JJ97j93J24p9l26L64m07K00
$$ -42 234 -238 -212 56 -28 -107 228 -160 69 -174 109 39 -82 17 18 215 22 146 67 -259 105 -302 -102
4872a02J55J43j60K1J49J29o54N37k25j13J32%J02L4j62n4J99j66N8k09J02K31
$$ -102 53 196 36 57 206 335 -319 218 -7 -120 12 12 114 148 -14 -68 131 -35 23 -186 -84 147
4894A47l27K86M8k04J30j65K21r2N2n0J37j08K04k50J55N3j02j69J4r7L63l95
$$ 147 -180 106 154 -50 80 -85 136 44 96 46 183 75 279 29 184 237 135 -34 -20 -117 246 -149
4916a49O4K92k56N2j73R9J55j27qJ1J82p0j02Q2k29M3R3J00J15j78r1P2K43j53
$$ -149 -85 207 -49 3 -170 -71 84 -43 -51 -40 142 72 -30 52 -177 -134 -41 59 174 -4 -95 -23 220 67
4940F7l11L52m37L96k30R1L41j28j58K05m14J96J93J4L3l37Q3R6j35P9J96o6J98
$$ 67 -244 108 -329 67 -163 -72 269 141 -17 188 -226 -30 163 177 210 -127 -44 52 -83 -4 192 126 324
4963C24j49l93L16p3oJ9O4j09j16K93l39L18k84P6j51K74q9J00J82k46j22K02
$$ 324 175 -218 98 25 19 38 102 -7 -123 170 -169 149 -135 -59 -210 64 -25 75 257 11 -111 91
4985I1Q9m96L80k37K31j63M7K99k40K1J5j60J65L5r4j10N9j00M08k57j7J90k75
$$ 91 180 -316 64 -173 58 -105 -58 241 1 22 37 -123 42 77 -17 -127 -68 -168 240 -17 -34 156 -119
5008a19J41j07J9j60P7J47K15j90J1Q5j67K95j79J00o0p3J12k35RL5L6k55L43
$$ -119 22 -85 -66 -226 -149 -2 213 23 34 119 -48 247 68 168 108 35 147 -88 -79 -44 -8 -263 80
5031H0j27J25j81J97k61J55J82k54L8p1R0j4Q7K79l46K00l15M4K18m1k21L79k64
$$ 80 -47 78 -103 94 -167 -12 170 -84 -46 -117 -27 -41 46 325 -21 179 -136 -92 126 85 -136 243 -21
5054b1K39k66j3n1J08R2l32K53K95k78j0L6k50J67r9qQ9j64K98J37k96o9P7kL2
$$ -21 218 -48 -61 -112 -4 88 -244 9 304 26 16 52 -198 -31 -130 -138 -49 -213 85 222 -74 -143 -66 -68 -36
5079c6MK24k58o8J10N9K10j57p4j31J97K00j92M3l0k17J47j00Pk53M07l3o0ol24
$$ -36 -32 192 -66 -134 -24 35 245 88 14 -117 80 280 88 131 101 -116 31 -69 -62 -315 92 59 -1 -7 -331
5104c31Q2K13M5N7l00K44K31m08M1L14m55L17j8J13k96L87m47M30k61J55m7l9
$$ -331 -249 -36 9 66 -234 10 241 -167 -126 188 -267 50 32 145 -151 236 -211 219 -42 113 66 27
5126B7qj04j46L19Q6j46L0J45k51L2m5p7N1J30j01o9K89q5J47j07j33L1J79k92
$$ 27 19 -85 -231 88 174 28 58 203 -48 -16 -61 -138 -87 43 -58 -127 162 77 224 117 -16 15 194 -98
5150i8N4K16k34M2O5j1j73Q9q9p2J43qr1M9J72k22O5M4n6n3J19R7K7k28p1l1L29
$$ -98 -44 172 -62 -20 45 34 -139 -50 -139 -211 -68 -76 -167 -118 54 -168 -103 -59 -115 -168 -49 48 75 -153 -224 -255 74
5177G4l2k24J42PM8K60o2k58m0J50J67k01M2l66K54M1J62r6l29L40k22Q9K43o
$$ 74 42 -182 -40 -33 15 275 213 -45 -85 65 232 31 73 -293 -39 2 164 68 -261 79 -143 -54 189 183
5201A83k42K08k93J58pj68L57j33J2n2Q2j54J25k59L91%Q2j55j40QJ16j05J04
$$ 183 -59 149 -144 14 7 -161 196 63 75 23 105 -49 76 -183 208 208 290 135 -5 3 119 14 118
5224A18j80K11j19mm7n0j13J33q4Q7J58j67m9J25r5L8pK9l5N0N3Ok26J92N2r8
$$ 118 -62 149 30 26 -21 -71 -184 -51 -135 -48 110 -57 -106 19 -76 -38 -45 -16 -51 -1 52 58 -168 24 76 -22
5250b2p4K1R4n6j49K11j05J71k67K50n5jp5q3Q2R2l7k0j46K69n4K50l23m4P7N4
$$ -22 -96 -75 19 -37 -186 25 -80 91 -176 74 19 18 -57 -140 -58 34 -3 -23 -169 100 46 296 -27 -71 6 60
5276F0J1j20j85J30l9J38M4j29J52j8pN9j0l38L91j90kQ2o3j4n6j2J90k73J8J7
$$ 60 71 -49 -234 -104 -143 -5 39 -90 62 44 37 96 86 -252 139 -51 -53 29 -34 -48 -104 -116 74 -199 -181 -164
5302a64M32l59J21j41K61j56p3K85j01j71K90k48k77K12K1Q6j95K27L8k61P0j5
$$ -164 268 -91 30 -111 150 -6 -79 206 105 -66 224 -24 -301 -89 -68 18 -177 50 88 -173 -103 -118
5324a18k3K25j64J24j25J50%m6N1K9J37k71K14k73L8K83l28K30j67N3J30j34k28
$$ -118 -141 84 -80 44 -81 69 69 23 74 103 240 -31 183 -90 -52 231 -97 133 -34 19 149 15 -213
5347b13M19k98J37n4j50J01J86ol39J62J01R7l36K72k73L57j4k34L21j87o5K08
$$ -213 206 -92 45 -9 -159 -58 128 122 -217 -55 46 143 -193 79 -194 163 149 -85 236 49 -16 192
5369A92m5J22j34k18q2J96m9Q0L1j43J61j10j0J25j74K30l57K16J43j89J6L2q8
$$ 192 147 269 135 -83 -165 31 -18 62 93 -50 111 1 -9 116 -58 172 -185 31 174 -15 1 33 -55
5392e5M2j73L88O2l11J96q7J18Oqk78K59k87N2K42k60L5K0j40L07j63k54Q8O3
$$ -55 -13 -186 202 264 -47 149 62 180 186 178 -100 159 -128 -76 166 -94 -59 -39 -179 128 -35 -289 -201 -138
5416a38L04k54o5m9L80q8k2Nl26J65P6J16k91J58L51k93p0J89k30k0K30m46M18
$$ -138 166 -88 -153 -202 178 90 68 73 -253 -88 -12 104 -187 -29 322 29 -41 148 -82 -102 128 -318 100
5439A00k14L3QM5K17j66K86k84k81O7J07J03q8J25l72M5R6J94k1j10L00Ll40J18
$$ 100 -114 -81 -73 -28 189 23 309 25 -256 -189 -82 21 -67 58 -314 -269 -173 21 0 -110 190 193 -147 -29
5463b9M4qM2k47K42q7j18J83jm3o1J9k2J37k25J19O3K8O3m20K19K33q4RO1j07
$$ -29 15 7 49 -198 44 -43 -161 22 21 -22 -83 -64 -86 51 -174 -55 8 36 99 -321 -102 131 47 56 117 10
5489A0R5k64J4J12l11J73J39j66K29o3J35J5r8L86m11n1J76j42L2j87L4p5J19
$$ 10 105 -159 -145 -33 -344 -171 -32 -198 31 -32 103 118 20 406 -5 -56 120 -22 10 -177 -143 -218 -99
5512i9N1K89k07L7k7L4j5K45k83M9J85j64l12P3L85k06j52J97N8o4l71K24K21
$$ -99 -48 241 34 71 44 78 63 308 25 74 259 95 -217 -144 241 35 -117 80 138 74 -297 -73 148
5535A48j2k30m6K17j59n6J39j89j4M1L15k19K33R5k45Lp5q7N7R5P4J37l40K03
$$ 148 136 -94 -140 77 -82 -138 1 -188 -202 -161 154 -65 168 263 18 21 -54 -141 -84 11 85 222 -118 85
5559H5l17K25J46j49k3r4J02k89L23j79R2J29j13J45q4r4K35p6J53j44o0J54K7
$$ 85 -232 -7 139 -10 -33 -127 -25 -314 9 -170 -78 51 -62 83 -1 -95 140 64 217 73 13 167 194
5582A94n24N01k85nK73k4k41L65l60J61K55j35O4k24J12O4m7k18o6J39n1pLp5
$$ 194 -330 171 -114 -119 154 130 -111 254 -106 55 310 175 239 15 127 191 144 -74 -140 -1 -52 -59 -56 -131
5606a31J78j00j29P1L46k71J26k09J72k57K76J7P2k03J43Pk6p3m1j60L18M2j38
$$ -131 47 -53 -182 -111 235 -36 90 -119 53 -204 72 89 161 -42 101 108 82 9 -32 -192 126 168 30
5629C0J02j00M9j69m3M22l56j19M5K20K2J37l22o0M49n07K93k00L88k80R0K7k21
$$ 30 132 32 81 -88 -131 291 -65 -184 -139 81 103 240 -82 -142 307 -200 93 -107 281 1 91 118 -103
5652a03Q5K34k82J13l8kJ5k3%J07k41J22K30j88k67K75j55K03lm6k7q5m6K47j2
$$ -103 -18 216 -66 47 9 7 22 -1 -1 106 -135 -13 217 29 -238 37 -118 85 82 36 9 -76 -122 125 113
5677A13j41R4k96K04O9j46K73m15J11K41j81J67j95K02k74j3K76k3j04J63m70
$$ 113 -28 66 -230 -26 43 -103 170 -245 -134 107 -74 93 -102 100 -174 -187 89 66 -38 125 -345
5698c45M06j22j92K02K85k03J90k33N1l19J87J10j25J53o1J43l06M56m87M12k24
$$ -345 61 -61 -253 -51 234 31 221 -12 39 -280 -93 17 -108 45 -16 127 -179 277 -210 202 -22
5719b2j18LJ19m9J94j64m0l1J12Q0o3K05k03J58j82J45m47K26q1K00l4j4l8J63
$$ -22 -140 -137 -18 -67 127 -37 -77 -108 4 84 21 226 23 181 -1 144 -303 -77 -158 42 8 -6 -44 119
5743A19l02L17M4j62k3O3m34L03q0K58r6p0J67k64L01M4n54K64J62j34o5K98j84
$$ 119 -183 134 178 16 -7 56 -378 -75 -155 103 7 -63 104 -160 141 185 -369 -105 57 -77 -142 156 -28
5766b8K97l36J96M3j23j5l60K13J25O0l12M40m23K06j05J03M3j44J6N5K7j7q2
$$ -28 269 -67 129 172 49 34 -326 -113 12 72 -240 200 -223 -17 -122 -19 24 -120 -104 -49 -22 -39 -121
5789a21J21J29k22O7n4K25o6K63l47J55k1m22M42m6L9K9k38o0J03o9J87j22K42
$$ -121 0 129 -93 -26 -80 145 79 342 -5 150 129 -293 149 103 142 171 -67 -127 -24 -93 94 -28 214
5812B14k47J75J0k22kJ89L60m46r1K05j18l30M41j25N5RK3j59q5Q2J85l73M46
$$ 214 -33 142 152 -70 -72 117 477 31 -60 145 27 -303 138 13 68 77 100 -59 -144 -62 123 -250 196
5835A96l18L14j08J7L7l13J98O2r2R4j31j26J94k5n7j86J18K24k42r1P5J89Oj6
$$ 196 -122 192 84 101 138 -175 23 85 -7 87 -44 -170 24 -1 -58 -244 -126 98 -144 -235 -160 29 35 19
5859A9J5J40q2j05K79j98rJ82l37J08j28qLj50L77O5j68J53j86M6j00N8j28J48
$$ 19 34 174 92 -13 266 68 59 241 -96 12 -116 -124 -121 -271 106 171 3 156 -30 16 -84 -26 -154 -6
5883fl0nJ54k3Q0j22j5O6r9O6k09J90l1O6m3j50k3k28M09k61J31K71m76K65M7
$$ -6 -36 -41 113 90 170 48 33 99 0 66 -143 47 16 82 39 -111 -134 -362 47 -214 -83 188 -288 -23 24
5908B4m2n4r8K29m26K38L18q8l9m58J78N08j18k28K57l17L2K80j42l1r0N4r4J5
$$ 24 -18 -72 -170 59 -367 -129 189 101 62 -396 -218 290 172 -56 201 -116 -84 196 54 23 -67 -13 -107 -92
5932i2N7J45j75J73Pk3o0q6K05k9K8j2l10J04oJ26j26J7J38j11j17J68J05k08
$$ -92 -35 110 -65 108 115 92 32 -54 151 122 150 138 -172 -68 -74 52 -74 -57 81 -30 -147 21 126 -82
5956h2L07j40J3j88M3P7l7m8n9J21j03J70j68j01L0M04k58J40O5l39J64j47M38
$$ -82 225 85 98 -90 -47 30 -7 -55 -114 7 -96 74 -94 -195 -165 239 -19 121 186 -153 11 -136 302
5979C02l90nM0k01K58P0j59J59rj66J46k28L86o0k80J01Jj62O6N6lJ61l70L70
$$ 302 -88 -93 -53 -254 4 74 -85 74 65 -101 45 -183 203 143 -137 -36 -35 -197 -131 -75 -78 83 -287 83
6003H3J33m64J91J95p2J58k16k6k08J54J98o8k00L17k09jj5q4K64O9k58K51k38
$$ 83 216 -248 -57 138 66 224 8 -18 -226 -72 126 58 -142 175 -34 -35 -50 -134 130 199 -59 192 -46
6026d6k21L57n9j55j06L49Ml39M6O2J63k9k09J63N8%K5M1k06J44j55J24N8k34
$$ -46 -267 90 31 -124 -230 119 123 -216 -170 -108 55 26 -183 -20 38 38 63 104 -102 42 -113 11 69 -165
6050a65j16M76k16j20K50n3m9k63K81P0M5k10j1K69l1k83N6J2J92j65p9J13l2
$$ -165 -281 195 -21 -141 109 56 7 -256 25 95 140 -70 -81 188 157 -126 -70 -58 134 -31 -110 3 -29
6073b9J42j76J50r1j2M1k33L45k39q8J94K4J14k35O3qk3K06k18l9j34N9P0J77
$$ -29 113 -63 87 -4 -16 25 -208 137 -102 -190 4 28 142 -93 -30 -38 -61 145 -73 -112 -246 -187 -117 60
6097F0l6k08J62K4j88K87j70o2L17j55Q2J2m00L03j44M5K37m6r6J93j01j67K23
$$ 60 24 -184 -22 2 -186 101 -69 -131 186 31 113 125 -275 28 -116 -71 166 120 24 217 116 -51 172
6120A72j54J09R1l4l09o5J83k9m9K22j15N3j7m7Q4j19K49k81J32j05K53k49J19
$$ 172 18 127 218 184 -125 -190 -7 -36 -85 137 22 75 58 11 95 -24 225 -56 76 -29 224 -25 94
6143I4k65Q8K64j11q6N9k0k12L41j60N7l1r9J58j45J36j25j18K40q6n1j00K9J29
$$ 94 -171 -83 181 70 -16 43 23 -189 152 -8 49 18 -81 77 -68 68 -57 -175 65 -21 -72 -172 -143 -14
6167a4k46K94L0j0j87K19m6L8j45r5N25m28k07K41j36K67j08P9J77j63j04o3J31
$$ -14 -260 34 64 54 -133 86 40 78 -67 -162 363 -65 -272 -31 -167 100 -8 71 248 85 -19 -82 49
6190D9J77k60J51mk87k82N58q7k0qk02L61j56j55K00j17R8R7k27J74L16n06K18
$$ 49 226 -34 117 113 -174 -456 102 15 -5 -13 -215 146 -10 -165 35 -82 16 113 -114 60 376 -130 88
6213H8k42m7J35m8k12L32k82L94l25K10q3K2J75Q0l38J68k70L1R2R0n5M08l58
$$ 88 -154 -201 -66 -114 -326 6 -276 118 -207 3 -80 -58 117 197 -141 27 -243 -212 -120 -30 -85 323 -35
6236c5Q2P7m9J57m38L64k10r0Q8j1j73K26j13J12O7k67J96j21J39m8j68K34Q5
$$ -35 47 124 75 232 -206 158 -52 -142 -54 -65 -238 -12 -125 -13 54 -213 -17 -138 1 -47 -215 19 104
6259A04j01j74J43j63J43O4K8j3O8LM5j90P8K00j75p2Q6j8J22j50J28j61l88K60
$$ 104 3 -171 -28 -191 -48 16 44 31 99 102 147 -43 35 235 60 -12 74 56 178 28 156 -5 -393 -133
6283a33k5J08K52k53K39N3m50L45k08K8K5K04j81q1m3j9K36k20J59k74J57J31
$$ -133 -158 -50 202 -51 188 241 -209 136 -72 -44 -19 185 4 -77 -120 -139 97 -123 36 -238 -81 50
6305E0j62P8k8k10L52j15l3O4j03rJ89j15J00j19J7m7M3k4J44j09j01o1J84P7
$$ 50 -112 -34 -62 -272 80 -35 -68 -4 -107 -116 73 -42 58 -61 -44 -91 -48 -72 72 -37 -138 -199 -15 62
6329F2p2k3r8J09J30nj08J52k92N20m64K6o8m1L28k00j03K36o3l55K33L3J64l26
$$ 62 -10 -33 -131 -22 108 103 -5 147 -145 375 -89 -63 -131 -172 156 -44 -147 89 26 -329 -96 -63 101 -225
6353b25R9J78j05J55j07q2K38k42o0J53J38l02K34k44Q7J56Rk19Q9M9j67K32J77
$$ -225 -126 52 -53 102 -5 -87 151 -91 -151 2 140 -162 72 -172 -85 71 80 -139 -50 -1 -168 64 241
6376B41j79J39k26j11k4R0J99k27K62j57J33o6P2k7J55k91K4J22j50L06k50j65
$$ 241 62 201 -25 -136 -160 -70 129 -98 164 7 140 74 146 119 274 -17 7 129 -21 285 35 -130
6398a30K73o3j49k7k2R6r5N8O4N5L4j03O0K18m76K48p6n0J26L3k64J37J82j77
$$ -130 143 80 -69 -96 -118 -22 -117 -59 5 60 94 -9 51 269 -207 41 -35 -85 41 74 -190 -53 129 -48
6422d8p9J29J81K2k68J16k18Q1L20l85j5N8j89M50k03P1p3p3R5J14Q8k82j04J
$$ -48 -127 2 183 205 -63 53 -165 -84 236 -149 -164 -106 -295 155 -48 23 -50 -123 -28 86 174 -108 -212 -211
6446b11K23O3K95k70q5n7J56j5k72L41R5p4l30J35K51k58J41m46M41j69k71N29
$$ -211 12 75 370 100 15 -42 114 99 -173 168 263 189 -141 -6 245 -13 128 -318 123 -46 -317 212
6468B12l41J04K6j23J93K23m31K09Lk99K15j27p0L71k42j55L84q8N3j35q3K36
$$ 212 -129 -25 1 -122 71 294 -137 72 75 -224 -9 -136 -206 165 -77 -232 152 64 117 -18 -101 135
6490A35p9j60R7j55O0L10l17O9k0J7J39j42j12R6M2K05l47P1k6l8K46j10M8j54
$$ 135 56 -104 -7 -162 -102 208 -109 -40 -60 -43 96 -46 -158 -62 -20 185 -162 -91 -117 -155 91 -19 29 -125
6514a25K11k67P2P9L6q8j74M34o1Nl9L6J61n01J92R3N9j92K47k36j31K43o1P8
$$ -125 86 -181 -109 -30 6 -82 -256 178 117 122 83 119 280 -221 -29 64 123 -69 178 -58 -189 54 -7 71
6538G1k96L08M1m3k6j13j11J58M6O0O6j34j82JJ99J73k15k16K36J40k28K54r6
$$ 71 -225 83 124 81 55 -58 -169 -11 35 95 161 27 -155 -154 45 218 3 -213 23 163 -65 189 93
6561I3ljj50j41J59K26j12l30L29L1j9p9J87l46O3N5n0K19l37K53O9r4j25J15
$$ 93 90 89 -61 -202 -43 183 71 -259 70 101 82 3 190 -156 -93 -38 -88 131 -206 47 116 22 -103 12
6585A2L7j02j7r1K03K35j77j62P8l8nM4k13J49n5J34q6K12j24M5p8j33K23j03
$$ 12 49 -53 -70 -161 42 277 100 -62 16 -22 -27 17 -196 -47 -102 32 -54 158 34 79 1 -132 91 -12
6609a2J59l9k55L16m9j08P2j74K81l06o1K15Q7m15M53l04J11J54j79K7M7j9mK0
$$ -12 147 108 -147 169 120 12 84 -90 191 -115 -176 39 126 -289 164 -140 -29 125 -54 -27 20 1 -3 17
6633A7J72j40j93J99J4J01l1k69K68J18k09N0j95J30R4k23KN7M4l4J23j35m0k8
$$ 17 189 49 -144 55 69 170 139 -130 138 256 47 97 -98 32 126 -97 -95 -38 6 -28 95 -40 -80 -108
6657a08M3j07o0K18j66J37M0J87l73P3j34J95J42q0R3k29J88j54J48o2J00J09
$$ -108 -65 -172 -232 -14 -180 -43 -3 184 -189 -116 -250 -55 87 7 100 -129 59 -95 53 -9 91 200
6679B00j92J7j07J17j15LL26o53M22J46k30k13L43j49j55L09k07L67k94M6J96
$$ 200 8 25 -82 35 -80 -77 249 -404 18 164 -66 -279 64 -85 -240 69 -138 229 -65 -19 177
6700A77j22J66L9m03J87n41P04q7p7k8j26J31j17L6M7J53k63J3N0N1M9m7k07L83
$$ 177 55 221 260 -143 44 -497 207 120 43 15 -111 20 -97 -61 -14 139 -124 -111 -61 -10 39 -8 -215 168
6724A68k5q3o5k03K31j47J96O8k36L39p4j76JM3N7J2m27M35n4rL9rM2j42J64k06
$$ 168 143 60 -5 -208 23 -124 72 140 -96 243 169 -7 -6 37 94 106 -321 114 60 51 90 81 123 -19 145 -61
6750f1M8j94O3K5l12N96l04J72l6j28K32k4J0N4q8j68J51l05K86r5P8n6j49K04
$$ -61 -13 -207 -144 -119 -431 165 -139 33 -3 -131 101 77 87 141 53 -115 36 -269 17 -78 0 -56 -205 -1
6774akj36L74j1k68L51j75j43M0j50J40m1k04K09J30p3M1r5j91L12J32j6l8l61
$$ -1 -3 -139 235 224 -44 307 132 -11 29 -121 19 -22 -226 -17 113 40 81 -14 -205 107 239 223 185 -176
6798a76K06Q7p7J06j27j25Q7J28k11m9L43j27k69K05J97k46om2j10K85j05J54
$$ -176 30 117 40 146 19 -106 -19 109 -102 -151 192 65 -204 1 198 -48 -54 -96 -206 79 -26 128
6820A28j70J35ONj83K04k71R8N9j30l9J66R5k61K39k16P1J42j15K44k32n4J25
$$ 128 -42 93 99 104 -79 125 -146 -48 11 -119 -158 8 103 -158 81 -135 -64 78 -37 207 -25 -79 46
6843D6j20R3J01k49J94J58l4m1l14P13p54L17J23k20KL4L8j53K20k37J39O5k91
$$ 46 -74 19 120 -129 65 223 189 148 -166 547 -207 110 233 13 15 49 87 -66 154 -83 56 121 -170
6866a70J59p6L81m07KJ73j82n2J80j4p6l0M2J35j63J60q6P7K5k54L96j71l31L12
$$ -170 -11 -87 294 -113 -111 62 -120 -172 8 -6 -82 -112 -70 65 -98 62 -24 53 78 -176 220 49 -282 30
6890C0n1n5J27o8J20k4j97K07j98j25K15pJ34j48j72J27J82j32j00o4K34J05j99
$$ 30 -21 -76 51 -17 103 79 -118 89 -109 -234 -19 -26 108 -40 -212 -85 97 -35 -135 -199 35 140 -59
6913e9K58o8o8P8r5j43O9K37k41KL9J70j45P6J05m6k45P1P5P5k77O9J33m1k06
$$ -59 199 131 63 141 46 -97 -28 209 -32 -30 9 179 34 110 215 169 -76 -5 70 145 -132 -63 70 29 -177
6938a77R0m9K03j77j03R8J44j61J22O9R6k62pm7K96k92j1J52p5L05r5k52J42l17
$$ -177 -87 -136 67 -110 -213 -115 29 -132 -10 59 155 -107 -114 -161 135 -157 -168 -16 -91 214 119 -133 9 -308
6962c08L34lk05K94l07L14k03K22j43N6k12R8p5O3J46k37K70J69k53r8J14k01
$$ -308 26 23 -182 112 -195 119 -84 138 -5 51 -161 -63 -138 -75 71 -166 104 273 20 -78 36 -165
6984a65K28j06J02j85J48j53k47N26j14J91q6k36j29K07m6p8J08L7j99J60J53
$$ -165 63 -43 59 -126 22 -131 -378 148 34 225 139 -97 -226 -19 -65 -143 -35 2 -197 -37 116
7005A16P6k28K20k14l6l11K16K35j6J45k56K18j72J28J87k33J33j62O6J00k63
$$ 116 192 -36 184 -30 -66 -377 -161 74 58 203 -53 165 -7 121 308 75 208 46 112 212 -51
7026e1r0J34l51M64q4k00Q1L6J91k71m6K09r8n4L7m7K89j94p2j95K44M4j14J46
$$ -51 -141 -7 -358 106 22 -178 -97 -61 130 -141 -187 22 -76 -130 -93 -140 149 -45 -117 -312 -68 -24 -138 8
7050Hj79L24r3nj85J95J15k45K14r1k61K83p3o5J07j64K48k57J82r7n6J00J03
$$ 8 -171 153 60 55 -130 65 180 -65 149 58 -203 80 7 -58 49 -115 133 -124 58 -39 -95 5 108
7073A08J59k49K42l53J78j77l9J51J4p3jJ47p6P6j57J3o8j10L80n6j30j07K35
$$ 108 267 18 260 -93 85 -92 -131 20 34 -39 -40 107 31 107 -50 -37 -105 -215 165 109 -21 -128 107
7096A07J2k13j13L01k32J04J61j27J62j2k50J23j05J61n8J7q7K0j20L9PJ77j8
$$ 107 119 -94 -207 94 -138 -34 127 0 162 150 -100 23 -82 79 21 38 -49 -29 -149 -110 -103 74 56
7119E6k05p6K04P1q7q8%J26j0K14k31j99M71l68j1L23o4P9j33m39J19L99k54K87
$$ 56 -149 -225 -21 50 -37 -125 -125 1 -9 205 -26 -225 246 -122 -133 190 126 205 72 -367 -248 151 -103 184
7143A84K4k55M7k9K88m19K20j1l9j00O2J08m9n9l68K07K94P1j70j69q8K65N4J11
$$ 184 208 -47 0 -29 259 -160 60 49 10 -90 -28 80 31 -28 -396 -189 105 176 6 -163 -251 14 68 179
7167A79j36M9K46n53L55R2m07K77n5O2o3k0rM6k95J48R3j39N2L6j88J70n6L4J33
$$ 179 43 92 338 -215 140 232 -175 102 47 109 46 26 17 63 -232 -84 9 -130 -78 -42 -230 -60 -116 -82 51
7192E1l7J81k9j95n2q3n0J71K59l10J3Q4r3K63m03L04k98J09n4R6p2J6L38j27
$$ 51 14 195 166 -29 -81 -164 -214 -43 216 -94 -81 3 -90 173 -230 74 -224 -115 -169 -73 -145 -129 209 82
7216H2K6K7l49J25j39K6J0J5J65r3L02r4j68M0L4O4j13L23j27l15J27k5J70n9
$$ 82 108 135 -214 -89 -228 -202 -192 -177 -12 -105 197 103 -65 -25 9 73 -40 283 156 -159 -32 -57 113 54
7240E4P5o6Rj28J3K7K23k31J25o2N8k71K71J3j05Oj10L53k73J10k15J34j1M3k7
$$ 54 129 63 72 -56 -43 -16 207 -24 101 39 97 -174 97 110 5 11 -99 254 -19 91 -124 10 -1 42 15
7265A5K19K6l14K51k59J54O6k04J82L9l69K01J18o6r2mL4J39j07N7p4J7k72N4
$$ 15 234 260 -54 197 -62 92 158 -46 136 175 -194 7 125 59 -33 -37 -3 136 29 86 12 29 -243 -189
7289a89J0P3j64K36j28P2R1M8J51j35l14L05J31l24L62m7r8K32l25j49J39l7J15
$$ -189 -179 -106 -270 -34 -162 -90 1 49 200 65 -249 56 187 -137 225 178 80 312 -13 -162 -23 -60 55
7312E5J08j20l9k5j11J80p4L0m1J45n6j33J83R6j97K40q2l98K20p6J73K5j33J54
$$ 55 163 43 4 -21 -132 48 -26 4 -37 108 52 -81 102 198 1 241 159 -239 -19 -95 78 103 -30 124
7336A24P1j1P8k66M5N7J9Lj00M6j4j98J33J24l41J13L38k07P4k25j00R5J58P1
$$ 124 195 184 262 -4 41 98 117 120 20 66 52 -146 -13 111 -230 -117 221 14 88 -137 -237 -142 16 87
7360H7k75K73J01j32j48m2m3J00L1J22l13J12m6K94m37K76l6L02j92K02o21O26
$$ 87 -188 85 186 54 -94 -136 -179 -79 -48 74 -239 -127 -173 121 -316 -40 -76 226 34 236 -385 241
7382B41l73M7K52j83J04m1K42m50R0j13J96j06J13K5K2j31J40q2o4j73J91J72
$$ 241 -132 -85 167 -16 88 47 289 -161 -71 -184 12 -94 19 44 66 -65 75 -7 -71 -244 -53 119
7404A19N2l07P8J25J4m12M35k76J6K56r8j42J42j11J65j71R1K02q1p7k9P8J11
$$ 119 171 -136 -58 67 81 -331 104 -172 -156 100 2 -140 2 -109 56 -115 -24 178 97 20 -9 69 180
7427A80j78O6j77R9J38o9q0Q3L1j18L1jq6M4m9K98j20k38K12jl1J28j0r7q0J66
$$ 180 2 68 -109 -10 128 59 -21 62 93 -25 6 5 -81 -37 -86 212 92 -146 66 65 34 162 152 55 -25 141
7453A41pp8o1R8k75l8J57Q7j91J80k4L28j96k82P2k87M27K43l89L37k84O9Jj12
$$ 141 134 56 -5 93 -182 -220 -63 24 -167 13 -11 317 121 -161 -89 -376 51 294 -95 242 -42 27 28 -84
7477h4j27J90J19k14J54j55L34q1l3l0q4K62l39o2K5R5K14J48k40j34M4k03J61
$$ -84 -211 -21 98 -116 38 -117 217 136 103 73 -11 251 -88 -150 -125 -30 184 332 92 -42 2 -201 -40
7500d0kj64J99j70K73k15O8j76L23M7K5k40J79P3m44L62p0K56l1l85J31J38j26
$$ -40 -42 -206 -7 -177 96 -119 -51 -227 96 143 168 -72 107 180 -264 98 28 284 253 -132 -1 137 11
7523A1o6L66l16j0M9k82J23J77J74l28k2J75n4Q5J34l10J53P3j77j81J89pN2j04
$$ 11 -55 311 -5 -15 34 -248 -125 52 226 -102 -124 51 -3 82 216 -94 59 132 -45 -226 -37 -44 8 -96
7547i6q9J74l41M87k74J20N5Q9j05j4m8NJ04j8o6k36J0L3J46J17q2M2K1k5J64
$$ -96 -185 -11 -352 135 -139 -19 36 125 20 6 -42 -37 67 49 -17 -253 -243 -210 -64 53 -29 13 34 9 173
7572A73k88k8O1K34m7k39K6J68K1k64k3K74N7j75J8J28k09k9jJ61Kk44j13J21
$$ 173 -115 -143 -82 152 105 -134 -108 60 81 -183 -206 68 125 -50 -32 96 -113 -142 -143 18 20 -224 -337 -216
7596b16L09j43J29kj45J71j33j36L52j09N6J88n65J15J62k77O45l75j89K67o1
$$ -216 93 -50 79 77 -68 103 -30 -166 186 77 133 321 -244 -129 33 -244 401 26 -163 104 43
7617D3lJ10k1j39k13L25j4k7J07Pk31j60o0K80J21j00J93m14O2N4J97k52J63j78
$$ 43 40 150 129 -10 -223 102 88 61 168 175 -56 -216 -276 4 125 25 218 -196 -134 -80 117 -135 28 -150
7641a50J93J01n1j53m2L8K42j91j26J87j3j39k3L3r2M15k52QJ84m05J62O2k7J61
$$ -150 43 144 93 -60 -102 -64 178 -13 -139 48 35 -104 -127 -94 -186 229 -23 -15 169 -236 -74 -12 -39 122
7665A22O0l12J19j76K75j48M3l0r4n2Q8J83j35J77j64J64k17O1j3j20ON2K61k27
$$ 122 182 -130 -11 -187 88 -60 -17 -47 -141 -193 -105 78 -57 120 -44 120 -97 -36 -49 -169 -163 -111 150 -77
7689g7p9K06j29O3J94l63N5K85o8J55n11K01J62j01k0l3QJ06o2q5J44o5J82j53
$$ -77 -156 50 -79 -16 178 -185 -130 155 87 242 -269 -68 94 -7 -27 -60 -52 54 -8 -93 51 -14 168 15
7713A5J34l43J9K15N5j46k9K13m7lk05O1J8l8O7J64l7r4j93J47K49j45j32L02
$$ 15 149 -194 -175 40 95 -51 -80 133 86 83 -122 -61 -43 -81 -14 150 113 19 -174 -27 222 77 -55 247
7737B47r9j61J36k50K21k15j10M60k03K9M7m2M1l54Q9P2J78k33J70RP1m19J97
$$ 247 148 -13 123 -127 94 -121 -231 229 26 55 102 60 101 -253 -164 -92 86 -147 23 32 103 -316 -119
7760a19J97p5K7J2j60J05K75n43O9L1O4q7L23K4k26j21L13m07N30j59j17q9J12
$$ -119 78 3 30 42 -118 -13 262 -281 -212 -181 -117 -204 119 143 -83 -204 109 -298 232 73 -44 -133 -21
7783b1R7N5k19J77l74J05J37N7j03J43k12J47pj85M79k13p6J00j75J37k24J28
$$ -21 76 131 -88 89 -285 -180 -43 14 -89 54 -158 -11 -18 -203 276 63 -13 87 -88 49 -175 -47
7805d7J82o5k04K80n18L34K37m12L14j55L17k41J18j30lj57J11m8Q7n5K3o8J36
$$ -47 135 70 -134 146 -372 -38 199 -213 101 -54 263 22 140 10 7 -150 -39 -87 0 -55 -32 -100 36
7828C6J97k9j68P5l0r5J5j31o4K84j71l1K69q4l2k15LJ85Q9k18J05p6j75K78J5
$$ 36 233 204 36 111 81 -14 1 -130 -194 90 -81 -112 157 73 41 -174 -171 14 103 -115 -10 -86 -261 17 32
7853C2J48m34K11j03J25j66K40j05R4J84l75J42P9j29q6R1J87P0j78j85p1K34
$$ 32 180 -254 -43 -146 -21 -187 53 -52 42 226 -149 -7 72 -57 -143 -52 135 205 27 -158 -229 5
7875EJ43j75q2K43oj26o7J35j36J34O0j49j50J91J96j58N3j57J81p8Q7k29K81
$$ 5 148 -27 -109 134 128 2 -65 70 -66 68 128 -21 -171 20 216 58 111 -46 135 57 144 -85 196
7898A96n8N6q2k3q5K5K6k56K59q9Q6R4k34R8q7K88j08j80LQ7k06K9J51Q1j32K57
$$ 196 138 194 112 89 4 29 55 -201 58 -31 55 149 -85 13 -74 214 106 -74 -71 16 -190 -161 -10 71 -61 196
7924A96p4j25J92j25o1J29j60n7L66l21J39j67M6L6q6J78j9m52L87K43l28l2K75
$$ 196 122 -3 189 64 3 132 -28 -85 281 -40 99 -68 -22 14 -72 106 87 -365 22 265 -63 -95 180
7947A80k22j9K30P7n75K53l8J21j4l6O6j14K57J3j29k47J99J04p6q6J20j00J2
$$ 180 -42 -61 169 246 -329 -76 -114 7 -7 -43 23 -91 166 179 50 -197 2 106 30 -56 64 -36 -24
7970b4J42pm68L4M86k69K4r7K04J43j1P6k74K73k12j2J15k24K68k01J83Lk64L07
$$ -24 118 111 -357 -323 163 -106 -82 -179 25 168 157 233 -41 232 20 8 123 -101 167 -34 149 152 -112 195
7994A95l30J10o4J01K34k93K12q5l3j00J52j97J19J87l06J21N2j73J51M1k65M8
$$ 195 -135 -25 -89 12 246 -47 165 80 47 -53 99 -98 21 208 -98 23 75 -98 53 94 -171 -123
8016a23j70N09k6j19Q2Nj97q9J36j99P1r5R8Q9L63n45K59L4k54J18J23j25j88
$$ -123 -293 216 190 71 153 158 -39 -128 8 -191 -120 -215 -117 -28 335 -210 49 83 -171 -53 70 -55 -243
8039b43J42J40j45p8k2MM03j07J79j83j2l8j42P8j01Q0j25M5J93J6P1j41L06k39
$$ -243 -101 39 -106 -184 -206 -202 201 94 273 90 78 40 -102 -24 -125 -45 -170 -125 68 84 155 14 320 81
8063H1K5Qk82K05Q7k34j3K32j99k5n1K02j5K3nk58L87j0j3K3l09L6K53j81K8Q5
$$ 81 106 114 -168 37 124 -110 -123 109 -90 -115 -166 36 21 44 39 -219 168 158 145 168 -141 -105 148 -33 -5 80
8089H0j5j17l05J82M31l48j71N29m52J76L1k48J89P0j07RJ68Oj62J81K1l3k42
$$ 80 65 -52 -357 -175 256 -92 -263 266 -186 -10 21 -227 -38 32 -75 -66 102 108 -54 127 148 115 -127
8112a27J10L38J1m44J33J46q6j99K59J6k01l29N55k64j88M31m45N4M04l12J0K30
$$ -127 -17 321 332 -112 21 167 81 -118 141 157 -44 -373 182 -82 -270 161 -284 -230 174 -138 -128 102
8134A02l79J65K74l31K74k43N0J84j99K4Q3J89r0l5k53J54j88K31J63k70j07M45
$$ 102 -277 -112 162 -169 105 -138 -88 96 -103 -79 4 193 103 68 -185 -31 -219 12 175 -95 -202 243
8156B43l74K50n9J4m4L6J16j58Q5k27L22j88O5J51l39J68j53J91M3j24r6j2K78
$$ 243 -131 119 60 74 30 66 182 24 109 -118 204 16 81 232 -107 61 -92 99 142 18 -78 -90 188
8179A88r7l19n3K70l33L01K9o5J60K86m04K54
$$ 188 91 -228 -281 -11 -344 -43 -14 -79 81 367 -37 217
8191B17
$$ Imaginary data points
##PAGE= N=2
##DATA TABLE= (X++(I..I)), XYDATA
0@%%%%%%%%%%%%%%%oJ4j6J6j6J6k2L0l2L5m3M9n7O7p5Q8j02J13j26J42j61J82
$$ 0 0 0 0 0 0 0 0 0 0 0 0 0 0 0 0 -6 8 -8 8 -8 8 -14 16 -16 19 -24 25 -32 35 -40 48 -54 59 -67 75 -86 96
37I6k03K27k53K81l12L45l84M24m66N16n68O24o89P61q39R24j021J129j250J389
$$ 96 -107 120 -133 148 -164 181 -203 221 -245 271 -297 327 -362 399 -440 484 -537 592 -658 731
57G31j549J736j956K223k553K971l523M285n408P233j0674J9309p9218j37837
$$ 731 -818 918 -1038 1185 -1368 1603 -1920 2365 -3043 4190 -6484 12825 -66393 -204230
71b04230K17168J42026j16053j30310M1364P3649p472J1598J8558r5237k3247
$$ -204230 12938 154964 38911 -91399 -50035 23614 16142 27740 46298 -48939 -72186
82g2186J06635N8417q3865q2886N6261O7723m1640j7267K6638l4299j9995M5010
$$ -72186 34449 92866 9001 -73885 -17624 50099 8459 -8808 17830 -16469 -36464 8546
94H546K9867m2908m7469N3660K2449n2526K2644M3288n3009m1995P0591O2210
$$ 8546 38413 -4495 -51964 1696 24145 -28381 -5737 37551 -15458 -57453 13138 75348
106G5348q1251p6107J01650O3888j00184m2321Q1249M4103p8039m5738P8325K5076
$$ 75348 -5903 -82010 19640 83528 -16656 -58977 22272 66375 -11664 -57402 20923 45999
118D5999o4991n98L2324k1512j4010L6864K0739o9664k8854R6128K4353q3927
$$ 45999 -18992 -19590 12734 -8778 -22788 14076 34815 -34849 -63703 32425 56778 -27149
130b7149k5483N7471L3634l6022k1925K6990o139q371L2807j5653l4059K3039
$$ -27149 -52632 4839 38473 2451 -19474 7516 1377 -6994 25813 10160 -23899 -860
142h60L4199k1812n3126L3087O5369m9497o5529M3535N7583k2741n4527J0495
$$ -860 33339 11527 -41599 -8512 56857 7360 -58169 -14634 42949 20208 -34319 -23824
154b3824L9916j9422j669K9682l1711l5716L7173N3750k4435p0062J7359O3992
$$ -23824 16092 -3330 -4999 24683 -7028 -42744 -5571 48179 23744 -46318 -28959 35033
166C5033j3483l1686Q135K144r243M264L1497m008n4000M986M6440J726j9217
$$ 35033 21550 -10136 -2001 143 -9100 -4836 26661 22653 -31347 -26361 20079 21805 2588
179B588j2553n073M852J7918K7194k8879n8998L2586O5505j4063n8432j3264N0307
$$ 2588 -9965 -15038 -10186 7732 34926 6047 -52951 -20365 45140 31077 -27355 -40619 9688
192I688J8954l1795m049K943j0695J7855J8914j4218l0056L165M5438l987m2941
$$ 9688 28642 -3153 -7202 -4259 -14954 2901 21815 7597 -22459 -19294 26144 22157 -20784
205b0784R738K6216n378j6312K262J7215j1546j5027K1660P85j8848O500Q086
$$ -20784 -11046 15170 9792 -6520 -4258 12957 1411 -13616 8044 8829 -10019 -3519 4567
218D567m370r857N465J6266j8514j2033K6401L861k0900m267J6958J3524k0986
$$ 4567 197 -9660 -4195 12071 -6443 -18476 7925 11786 -9114 -13381 3577 17101 -3885
231c885r948K3309q73j0569N391l6l135k268R536N238k3704m37K5506o671j8030
$$ -3885 -13833 9476 8603 -1966 3425 3389 254 -2014 7522 12760 -10944 -11381 14125 7454 -10576
246a0576J333J2491L379j7507L443J6050j3175n395J1143J902l055n679O151N508
$$ -10576 -9243 3248 6627 -10880 -7437 8613 -4562 -9957 1186 3088 33 -5646 505 6013
260F013j1536P617J0380j5652m108J1794Q839q359j8116J2291J4340j3207l948
$$ 6013 -5523 2094 12474 -3178 -7286 4508 13347 4988 -13128 -837 13503 296 -3652
273c652K572j910L162J74K474o723r474J7013O041j6828j486P606P170m853r691
$$ -3652 -1080 -2990 172 346 2820 -3903 -13377 3636 9677 -7151 -8637 -1031 6139 1286 -8405
288h405J1003K957j0396O463L506m460j161k14O827m060p170J0787k938q475P285
$$ -8405 2598 5555 -4841 1622 5128 668 -493 -707 6120 2060 -5110 5677 2739 -5736 1549
303A549K199k244o326n37J3002n657j0375P504J680r09j96k712M247l947m76R801
$$ 1549 3748 1504 -4822 -5359 7643 1986 -8389 -885 795 -114 -310 -3022 1225 -2722 -3198 6603
319F603p373n550P802J582k81n696O09R152p180k608Q059m116j607J401nL118
$$ 6603 -770 -6320 1482 3064 2783 -2913 -2304 6848 -332 -2940 5119 1003 -604 797 792 3910
335C910n980M41O390p326O06M047l679j37j693L237L652r510J945P571l995r46
$$ 3910 -2070 -1629 4761 -2565 -1959 2088 -1591 -1728 -3421 -184 3468 -6042 -4097 3474 -521 -1467
351a467j040J635M746n188J681K374n694N930K632n632o9p41N082Q38q812L414
$$ -1467 -2507 -872 3874 -1314 367 2741 -2953 2977 5609 -23 -92 -833 4249 5087 -3725 -311
367c11K415l679L010k467r47J361l868N346Q7o117L850K08p68K563k034K672j425
$$ -311 2104 -1575 1435 -1032 -1979 -618 -4486 860 947 -5170 -1320 -1112 -1880 683 -1351 1321 -104
384a04l817P928L01m276J024k472M047K555m526Q13l391q9P402l626l238o65k505
$$ -104 -3921 4007 4308 32 1056 -1416 2631 5186 660 1473 -1918 -2007 5395 1769 -1469 -2134 -4639
401d639O567K07m237M24m317L600P367m471l419k149K277R221m421m272J877j472
$$ -4639 1928 2135 -2102 -1678 -5995 -2395 4972 501 -2918 -5067 -2790 6431 2010 -2262 -385 -1857
417a857M752K024m495K56l442K923P034o072l296N20R61N203m753l743N444k185
$$ -1857 2895 4919 424 680 -2762 161 7195 1123 -2173 -1653 -692 4511 -242 -3985 1459 -726
433g26n89K20j047N172l062n564M420J704K079j405o290M168K316n17L744m774
$$ -726 -1315 -1095 -2142 3030 -32 -5596 -1176 528 2607 1202 -5088 -920 1396 879 4623 -151
449a51l940K161M158O914p042j1235O411Q231K566o186j0644N548Q130j905p38
$$ -151 -4091 -1930 2228 9142 2100 -9135 -2724 5507 8073 1887 -8757 -3209 4921 3016 2278
464B278n549k462M460K381M878n128j1503N567R621K623o576j0933O517J0737
$$ 2278 -3271 -5733 -1273 1108 5986 858 -10645 -5078 4543 7166 590 -10343 -3826 6911
478F911l288l923k652J893M476l479K157K441o460q7L128K472L48p420P18N788
$$ 6911 3623 -300 -2952 -1059 3417 -62 2095 4536 -1924 -2011 1117 3589 3937 -3483 -2765 3023
494C023l824r09J967R76j162p776M108J1605n128r068k012P860R935p204r082
$$ 3023 -801 -1710 257 1233 71 -7705 -3597 8008 2880 -6188 -8200 -340 9595 2391 -6691
509f691L789L368M602n05m966l41l196L608J0004m744j0080k157P000J0962o744
$$ -6691 -2902 466 5068 4563 -403 -744 -3940 -332 9672 4928 -5152 -7309 -309 10653 3909
524C909j2359L041O508L790l776o295L570O96j637N234o76m100k761K041R520
$$ 3909 -8450 -5409 1099 4889 1113 -5182 -1612 -916 -2553 2681 2005 -2095 -4856 -2815 6705
539F705j763j0545K574N749J940m146m460P389J833q428L51N000K984m024p847
$$ 6705 4942 -5603 -3029 2720 4660 514 -3946 3443 5276 -3152 -2801 2199 5183 1159 -6688
554f688M794O505l693j174k398o99L049j11M106j881r922K802R107L690o173j1667
$$ -6688 -1894 4611 918 -256 -2654 -3353 -304 -415 3691 1810 -8112 -5310 3797 7487 1314 -10353
570a0353N652J3358j825q232n276M398R081l992l063J036l210J185L954J713j922
$$ -10353 -4701 8657 6832 -1400 -6676 -2278 6803 2811 -252 784 -2426 -1241 2713 4426 2504
585B504r223J566J1308j582p016l224L946O241m606l402L982j362q67J077J036
$$ 2504 -6719 -5153 6155 4573 -2443 -5667 -1721 4520 -86 -3488 494 -868 -1735 -658 378
600C78K441m487j924O020k62j451p48o95L583k297k096M247l90k414k141m86P402
$$ 378 2819 -1668 -3592 2428 2166 715 -33 -728 2855 558 -1538 2709 2319 -95 -2236 -2722 4680
617D680j230p624P2L392M062j739o475K507K348r68K923j667l093K37J670O047
$$ 4680 3450 -4174 -4102 -710 3352 1613 -4862 -2355 -7 -975 1948 281 -2812 -2575 -905 5142
633E142k582p516L134M896M50k118m344L146K251k176J463j283j723J949j040
$$ 5142 2560 -4956 -1822 3074 3524 1406 -2938 208 2459 283 1746 463 -1260 689 -351
648c51Q97K54k893K188l78j156K038j966j85J752j327R77m14j30K597l023o45
$$ -351 546 800 -2093 95 -283 -1439 599 -1367 -1552 200 -1127 -150 -564 -694 1903 -1120 -1765
665a765M296j401n18q34j93K786k099R8J846l390M32J789M29m50l899N66M794
$$ -1765 2531 1130 612 -222 -415 2371 272 370 2216 -1174 -742 1047 1476 1026 -2873 -2307 2487
682B487k068j517l46q24L230n48r60M02k638K614K583l379K71P60K28J583k466
$$ 2487 419 -1098 -1444 -2268 962 414 -546 -144 -2782 -168 2415 -964 -693 67 295 1878 -588
699e88Q30J115k184K378K86k278N60l01J156P1k768K393J35k492J558N2j92J76
$$ -588 242 1357 -827 1551 1837 -441 119 -182 974 1045 -1723 670 805 -1687 -129 -77 -269 -93
717i3k078K430L14k338K167n03r67J433p74J297n84j630L200r43j655K108o70
$$ -93 -2171 259 573 -1765 402 -101 -1068 365 -409 888 304 -1326 1874 931 -724 1384 714
734G14Ml19q69J865j159j537K303j078l45L44q79J420p83j199K224j836j63K007
$$ 714 718 399 -470 1395 236 -1301 1002 -76 -421 -77 -956 464 -319 -1518 706 -1130 -1293 714
752G14j418K64Nj93J999j810l61K261j592P51K81r72J177j009L63J479k747O06
$$ 714 -704 -440 -435 -628 1371 -439 -800 1461 -131 620 901 -71 1106 97 460 1939 -808 -202
770b02J628j587J49q16J28J704k278O81J274k018P81J18l66J081j531R49J255
$$ -202 1426 -161 -12 -828 -700 1004 -1274 -593 681 -1337 -556 -438 -804 277 -1254 -305 950
787I50j935J633L00j309J089o33O84O07k291J821K77j546R45o10M1R64j869J216
$$ 950 -985 648 948 -361 728 95 779 1386 -905 916 1193 -353 592 -18 23 987 -882 334
805C34J06j925J994n46r25Q50r11J241k36j644K180o17j042K294j377L75mp50
$$ 334 440 -1485 509 -37 -962 -112 -1023 218 -18 -1662 518 -99 -1141 1153 -224 151 147 -603
823f03J871n91j104J971j417o1R32j317J288j080n83J874j198n98O08q75O58l29
$$ -603 1268 677 -427 1544 127 66 998 -319 969 -111 -694 1180 -18 -616 -8 -883 -225 -554
841e54p29J656j350k20J984j361O31L7p37J200m64J97R21j795O47J156q20N85
$$ -554 -1283 373 -977 -1197 787 -574 57 94 -643 557 93 290 1211 -584 63 1219 399 984
859I84j159k3J503j389M10L81j712R88K97n04P31j975O49J220j540J170k77q62
$$ 984 -175 -198 1305 -84 326 707 -1005 -17 280 -224 507 -1468 -819 401 -1139 31 -246 -1108
877a108J249m59M79K55j571J511M53j378J506l78n19M79j043J834j46k388J456
$$ -1108 141 -318 161 416 -1155 356 809 -569 937 559 40 519 -524 1310 1164 -1224 232
894B32Lq3O70j303N06n54o01J829m17j908R79j50R08P44k550J318P6j33J912k014
$$ 232 235 152 822 -481 25 -529 -1130 699 282 -1626 -647 -797 111 855 -1695 -377 -301 -434 1478 -536
914e36m58J459j55Q01m41r72J296j340L92K083k323o57L39R47R40k545j24K398
$$ -536 -994 465 310 1111 670 -302 994 -346 46 2129 -194 -851 -512 435 1375 -1170 -1294 1104
932A104j327o59N77L16M38j799K77K606j856o13O80K43J136j100K1J179j746L79
$$ 1104 -223 -882 -305 11 449 -1350 -1073 1533 -323 -936 -256 -13 1123 23 44 1223 -523 -144
950a44J096n34L14j114o00J834J39n31j061j370K770O15k488M82j04M13J84r91
$$ -144 952 418 732 -382 -982 852 991 460 -601 -1971 799 1414 -1074 -592 -696 -283 -99 -1090
968a090K107j177k520K768J790j429k039M0L326L40l583J339J078n68j76j96J350
$$ -1090 1017 -160 -2680 88 1878 449 -1590 -1550 1776 2116 -1467 -128 950 382 206 10 1360
985A360r56j932K222P46j897K02n97J057M44j804R29j36j88Q14j157N86J340j750
$$ 1360 404 -1528 694 1440 -457 -255 -852 205 649 -1155 -226 -362 -550 264 -893 -307 1033 -717
1003g17k87L65J213J140k830l50K982n67p45k27M57Q07k412Q75K868k503k155
$$ -717 -1004 -639 574 1714 -1116 -1466 1516 949 204 -23 434 1241 -1171 -296 2572 69 -2086
1020b086J925J536j13l131K03K958j439n59O17k54lp92Q74J744k541L2J973p06
$$ -2086 -161 1375 1262 -1869 -1666 1292 -147 -706 -89 -343 -346 -1138 -264 1480 -1061 -1029 944 238
1038B38N33p87o84J198j10L99k75j494J725M06k089Q97R09l39q28j339K926j50
$$ 238 771 -16 -700 498 388 787 512 -982 743 1149 -940 -43 866 527 -301 -1640 1286 1136
1056A136l051J460R34k53j091l23K409r83k403K556J151j610r73L96K108o52j795
$$ 1136 -1915 -455 479 226 -865 -1188 1221 238 -2165 391 1542 -68 -1041 -645 1463 811 -984
1073i84J555p4r21J426p41J36q15L7J668j120j151J438p76m70J294l84o00n67
$$ -984 571 497 -424 1002 261 397 -418 -381 1287 167 -984 454 -322 -792 502 118 -482 -1049
1091a049N49J725j943o04K192p21o12k8Q93R31k155K38K540j501j265J100M03
$$ -1049 -500 1225 -718 -1322 870 149 -463 -491 402 1333 -822 -584 1956 455 -810 290 693
1108F93N0j688R63J773k301j12J323n53l14l82K48Q00j712R09J272k016K79J070
$$ 693 743 -945 18 1791 -510 -622 701 148 -166 -548 -300 500 -1212 -303 969 -1047 -768 302
1126C02p4j43j052J308N29j823J054J011j539M06N08P10o71j464J930L91k038
$$ 302 228 85 -967 341 870 -953 101 1112 -427 -21 487 1197 526 -938 992 1383 -655
1143f55P65O42n50n08n60J731q65j829K076L31j469M05K29O20j160j54J718n18
$$ -655 110 752 202 -306 -866 865 0 -1829 247 578 -891 -486 -257 363 -797 -951 767 249
1161B49j232J249K80j27o18m0J683j303r11J942n28q81K67L95K44j273J35J390
$$ 249 -983 266 546 419 -199 -239 1444 141 -770 1172 644 -237 30 425 669 -604 -469 921
1179I21j151j254K000m66o46j64M52Q75j732M75J695j233m56Q11P3J61r35P26
$$ 921 -230 -1484 516 50 -596 -760 -308 567 -1165 -690 1005 -228 -684 127 200 361 -574 152
1197A52J239j875J38J697j144l28n5P12K59j650R41R23k006N15N39N3l28o27J121
$$ 152 1391 -484 -346 1351 207 -121 -176 536 795 -855 86 1009 -997 -482 57 110 -218 -845 276
1216B76K07j635Q26J042j164L77n6M51q3j023J590r6j384J005M03l68p9o25J253
$$ 276 483 -1152 -326 716 -448 -71 -127 324 241 -782 808 712 -672 333 736 368 289 -336 917
1235I17o75j163J594l60j060O48J07J81o45n31J600n84j480J459j20j53j64m1
$$ 917 242 -921 673 313 -747 -99 8 189 -456 -987 613 29 -1451 8 -112 -265 -429 -470
1253d70J314j163m48J699o21q25P33j0kl28J63J226j337l27J049o19j8k19O1Q24
$$ -470 844 -319 -767 932 311 -514 219 209 207 -121 42 1268 -69 -396 653 34 16 -203 -142 682
1273F82j265R7J322j492j09J103p85N19q65N34P72j142M54Q02q63Q4L09P8M02
$$ 682 -583 -486 836 -656 -765 338 -447 72 -793 -259 513 -629 -175 627 -236 -152 157 235 637
1292F37j135O89Q94j207K98K35l30K11p56R75P1j309N39K01l73J05P1J65N5r96
$$ 637 -498 191 1085 -122 176 411 81 292 -464 511 582 -727 -188 13 -360 -255 -184 -19 36 -960
1312i60R60J30r57J019j64n2L00m12O58k10o79J391m15q87N01k26M10l62l94Q99
$$ -960 0 130 -827 192 28 -24 276 -136 522 312 -367 1024 609 -278 223 -3 407 45 -349 550
1332E50n24q94R38j36l28L01l57O64n11l27J135p20j25M91m98M94m89mR61q90
$$ 550 26 -868 70 -66 -394 -93 -450 214 -297 -624 511 -209 -334 157 -341 153 -336 -340 621 -269
1352b69R5P96k67m0j62j94R41j056K68P26j114L67J19n91M41n50L64N28j280L32
$$ -269 -174 622 355 315 153 -41 900 -156 112 838 -276 91 210 -381 60 -490 -126 402 -878 -546
1372e46P74n89L91m46L96N95j065N89M60j012O01J1j9L1m2L58K99j190R84k49
$$ -546 228 -361 30 -416 -20 575 -490 99 559 -453 148 159 140 171 129 487 786 -404 580 331
1392C31p95Q65n12l1M73p83M86n2q04P66M9m51L82k95P53k71q52Q19J33m06M33
$$ 331 -464 401 -111 -142 331 -452 34 -18 -822 -56 -7 -458 -76 -371 382 111 -741 78 211 -195 238
1413B38m16O19m6q83R18P8j029R27k78K40r8o15M06L1k24M09r47O01L20o67L93
$$ 238 -178 441 395 -488 430 508 -521 406 128 368 270 -345 61 92 -132 277 -670 -69 251 -416 -23
1434b3r8k73M36n82L17P31q00ML16K14K51q26L42Q93j245L78K32j0j01o95N04
$$ -23 -121 -394 42 -540 -223 508 -292 -288 28 242 493 -333 9 902 -343 35 267 257 156 -539 -35
1455c5P57j113o2O71k43L64p55J76O31r99L30K96l87M20m18l08J051m14MJ28m07
$$ -35 722 -391 -453 218 -25 339 -416 -240 391 -608 -278 18 -369 51 -367 -675 376 -38 -34 94 -313
1476c13N30K45p67O97j5k14O3n70J052m51r74R93J7n98J06m9O84l38q98R40J0
$$ -313 217 462 -305 392 377 163 226 -344 708 257 -717 276 293 -305 -199 -248 436 98 -800 140 150
1497A50o02L88j54L77k53o89J389l67k12K24k49L51l9n85J023l33m96O03o07K64
$$ 150 -452 -64 -218 159 -94 -783 606 239 27 251 2 353 314 -271 752 419 -77 526 -81 183
1517A83K96o95K65K4j26K82p92J61P88p27l9L31L6J84r25N33R40j017nP49K2l91
$$ 183 479 -216 49 73 -53 229 -563 -402 386 -341 -380 -49 -13 171 -754 -221 719 -298 -303 446 468 77
1539G7p78J003M98q09N9L84m42M90n47J44L31o61K20J09l11j43J08L6n7JK06j
$$ 77 -701 302 800 -9 50 434 -8 482 -65 79 410 -251 -31 78 -233 -376 -268 -232 -289 -288 -82 -83
1561h3j87M56r9o96R23k33p6J43o47J054l40o32R53l6k16k23j92M31k79n57Q76
$$ -83 -270 186 87 -609 314 81 5 148 -499 555 215 -417 536 500 284 61 -131 300 21 -536 340
1582C40l48l98J95r1K92l16j21Q37n90m20M94q2K13j43O8M36o87jJ074q64K6K36
$$ 340 -8 -406 -211 -302 -10 -326 -447 390 -200 -620 -126 -208 5 -138 -70 366 -321 -322 752 -112 -86 150
1604A50j06M23m81o7N81o90pO28n83m6J48j42N47p73L45O10j164J33P91o16L08
$$ 150 44 467 -14 -81 500 -190 -197 431 -152 -198 -50 -192 355 -418 -73 537 -627 -494 297 -319 -11
1625a1o82N95N42q12N66L01n91P0M4L88J23p73N45L08q94M47k0m2j55k74L38J20
$$ -11 -693 -98 444 -368 198 499 -92 -22 22 410 533 -240 305 613 -281 166 146 104 -51 -325 13 133
1647A33q16P86j41n38O95m70K9L06n81O71L0o21P07K38n36K77k77O58k89n96O93
$$ 133 -683 103 -38 -576 119 -351 -322 -16 -597 74 104 -517 190 428 -108 169 -108 550 261 -335 358
1668C58j98n32M27J29j3j98k29R72r19j43O62l38k43q9j72P44n23k49P12n12k68
$$ 358 160 -372 55 184 171 -27 -256 716 -203 -346 316 -22 -265 -354 -526 218 -305 -554 158 -354 -622
1689f22N09J66K73m12j40P32p63J55Q11m72j92r3K95K84o85K56K10m62K12J12
$$ -622 -113 53 326 -86 -226 506 -257 -102 709 237 45 -48 247 531 -154 102 312 -150 62 174
1709A74l44K35l67J99K52n60J81M90k85q0J50ML48p61M51N55p65K65K01j62j04
$$ 174 -170 65 -302 -103 149 -411 -230 260 -25 -105 45 49 397 -364 87 642 -123 142 343 181 77
1730G7l26N64q3o42N22J41m01J99k13K14j16l84O72M2j055O95L1j31j38R6M08
$$ 77 -249 315 232 -410 112 253 -148 51 -162 52 -64 -448 224 266 -789 -94 -63 -194 -332 -236 172
1751A72l55j07Q94n66l91N65P5J0m67j73R34n25n14R82k16o10Q4K51L51o13j79
$$ 172 -183 -290 604 38 -353 212 287 297 -170 -343 591 66 -448 534 318 -292 -208 43 394 -219 -398
1772c98P93m83k33J98P2M0k17k12Q53q33Q3L89l01J24L74j89N92n53l34P72n41
$$ -398 395 -88 -321 -123 -51 -11 -228 -440 413 -420 -337 52 -249 -125 249 60 652 99 -235 537 -4
1793dL44n0j14K4n67L84J86p21M80L12m19P3j56K52N2l57L58M0p84O99J93l34
$$ -4 340 290 176 200 -367 17 203 -518 -38 274 -145 -72 -228 24 76 -281 77 117 -667 32 225 -109
1815a09N3j66N03j13m80M81J53n98L54M6k1K76n99O38r1n66N59q2m16L76m58M87
$$ -109 -56 -222 281 168 -312 169 322 -276 78 124 103 379 -220 418 327 -239 320 238 -178 198 -260 227
1837B27j36n78O43k38m06O02p9j32J0j19Q33q07k11O56n4J12k00q8J49l18K18
$$ 227 91 -487 156 -82 -488 114 35 -97 -87 -206 627 -180 -391 265 211 323 123 35 184 -134 84
1858H4L02l38p2J84l08L72m29j83N97l51L5J17j81j7J81j61M48o79O06J48n37
$$ 84 386 48 -24 160 -148 224 -205 -388 209 -142 -107 10 -171 -188 -7 -168 280 -399 207 355 -182
1879a82K37K63l14J28k24J75L12p45M94N19r32K82J34j46J76m44J75M18n99K90
$$ -182 55 318 4 132 -92 83 395 -350 144 663 -269 13 147 1 177 -267 -92 326 -273 17
1899A7o3q9J75n48O37Q0m06J69K8l01M97k19K30j97j49M51j11k92N14m26j47M31
$$ 17 -46 -135 40 -508 129 209 -197 -28 0 -301 196 -23 207 10 -139 312 201 -91 423 -3 -150 281
1921B81m24O90k07m07L58Jm99L78k20M00l44l05M46j34m25N61k6p4J34k75L31
$$ 281 -143 547 340 -67 291 292 -207 171 -49 351 7 -298 148 14 -411 150 124 50 184 -91 240
1942B40Ll97N14n14L79k0k30L62l29p8P2l55K01M90n88L97j84k73M41m52M14J19
$$ 240 243 -154 360 -154 225 205 -25 337 8 -70 2 -353 -152 338 -250 147 -37 -310 131 -321 93 212
1964B12n33R9L95m50J80J32j8J74l29K67Q8q3M1l66L33J59l23k40N47o09M21l5
$$ 212 -321 -222 173 -277 -97 35 17 191 -138 129 217 134 175 -191 142 301 -22 -262 285 -324 97 62
1986F2k65Q18o02l66L31j61P2J50l54L28j51k56L85j63K46j45m7N70m89J44K28
$$ 62 -203 615 13 -353 -22 -183 -111 39 -315 13 -138 -394 -9 -172 74 -71 -118 452 -37 107 335
2007C35j86J66k95k20N42k44k70L34o2J24l60l4N90k39l81j11J17J33j6l84M50
$$ 335 149 315 20 -200 342 98 -172 162 100 224 -136 -170 420 181 -200 -311 -194 -61 -77 -461 -11
2028a1k49k11O49k42J03N7k40N11j87j87L93n05r6O87n12K39j18j00K97n52MN25
$$ -11 -260 -471 178 -64 39 96 -144 367 180 -7 386 -119 -215 472 -40 199 81 -19 278 -274 -270 255
2050B55q29M04K77k76J42j68J11K21n26L53L78n03M10k99j4K97p31N52J90m82
$$ 255 -574 -170 107 -169 -27 -195 -84 137 -389 -36 342 -161 249 -50 -64 233 -498 54 244 -238
2070b38M99k35j43M39l60L74j42l17K74m7k88K36J0P8l4k46P9J16m48N91l84l2
$$ -238 261 26 -117 322 -38 336 194 -123 151 104 -184 52 62 140 106 -140 -61 55 -393 198 -186 -218
2092b18L88m92M08j2k64P36m73j24L40k31K2j70J02M08k44j35L92l21r1P1l47
$$ -218 170 -322 86 74 -190 546 73 -51 289 58 80 -90 12 420 176 41 433 112 21 92 -255
2113b55M07m15j13P49m00k66J99m54O54j12k60O43p61K37N07m25L48k69j34L11
$$ -255 152 -263 -376 373 -27 -293 -94 -548 106 -6 -266 377 -384 -147 360 -65 283 14 -120 191
2133A91k87K78J92o22K75J26k76M27l27L22m4p35M35K37l53k45M59j52K42m57
$$ 191 -96 182 374 -248 27 153 -123 304 -23 299 255 -480 -45 192 -161 -406 53 -99 143 -314
2153c14K03K82n12P79k01k07R7l60N15m08J04L08J58l29J69j43j25K27k72L82
$$ -314 -111 171 -341 438 237 30 127 -233 282 -126 -22 286 444 115 284 141 16 243 -29 353
2173C53l48j34J63O3l44K4j91M78J55l79K01j55j83K80J75q6K2k53O29m31j89
$$ 353 5 -129 34 97 -247 -223 -414 64 219 -160 41 -114 -297 -17 158 72 94 -159 470 39 -150
2194a50L98m3J07l68K0J32m44L67L64o58J02L19l60L49k14N6K31k86j3J08k37
$$ -150 248 205 312 -56 -36 96 -348 19 383 -275 -173 146 -214 135 -79 -23 208 -78 -91 17 -220
2215b20pJ06R6J78m57L99K47m56L59J56n54K75O3j50L15m80L53J39n95J03K54
$$ -220 -227 -121 -25 153 -304 95 342 -114 245 401 -153 122 185 35 350 -130 223 362 -233 -130 124
2236A24q4ol26N08Kn61K16k9k5L1K35M4O9q63P27P6k20K13k2m0Q4l30L68p9r0
$$ 124 40 34 -292 216 218 -343 -127 -156 -181 -150 85 129 198 -665 62 138 -82 131 109 69 153 -177 191 112 22
2261B2K79j51l7k6j3N5j05j57K82o47L53L49j79J18j99l61O09k67l47P05m11N0
$$ 22 301 150 113 87 74 129 24 -133 149 -498 -145 204 25 143 -56 -417 192 -75 -422 283 -128 -78
2283g8N9O3K82l45j61K42j87j31L98r3K62n30K23K77n17P1L18j34j6k50O7L07
$$ -78 -19 44 326 -19 -180 62 -125 -256 142 49 311 -219 4 281 -236 -165 153 19 3 -247 -180 127
2305A27m05m6M45n22P25p0k19K76n15LL97m41L78J26l84K35l4P6o0j78J77L13
$$ 127 -278 -324 121 -401 324 254 35 311 -204 -201 196 -245 133 259 -125 110 76 152 92 -86 91 404
2327D04n36J55m4J7L01m43O1J09j40J75j28j30L11k24N01l46k11L03qm89M49l1
$$ 404 -132 23 -21 -4 297 -146 -85 24 -116 59 -69 -199 112 -112 389 43 -168 135 127 -362 87 56
2349E6n1n4K82q9k18r3L74l49j53M62m38L38m60M10K2j88j21O28n26j01L33p9
$$ 56 5 -49 233 144 -74 -167 207 -142 -295 167 -271 67 -393 17 39 -149 -270 358 -168 -269 64 -15
2371a5K48m96LM14j34q0L88o23N12j19j07K83j65j54L59m37J70P8j74K25O6k69
$$ -15 233 -263 -260 154 20 -60 328 -295 217 98 -9 274 109 -45 314 -123 47 125 -49 176 242 -27
2393b7j05K1J77O7l62K15k77K39K30n29L42K98m18Q3L00l06J77j83K16r0l05M63
$$ -27 -132 -111 66 133 -229 -14 -291 -52 178 -351 -9 289 -129 -46 254 -52 125 -58 158 68 -237 226
2415B26J9m44J55n0J57K56l77K00j03l43J87k66K95K75m08M6J91l28O63n40NK61
$$ 226 245 -199 -44 -94 63 319 -58 142 39 -304 -117 -383 -88 187 -221 -175 16 -312 351 -189 -184 77
2437G7k37J11l7NP13n20o2K98l07O4j73p7L85k69j69K93l17Q5K4j35K98j55l13
$$ 77 -160 -49 -86 -81 632 112 50 348 41 105 -68 -145 240 -29 -198 95 -222 -137 -113 -248 50 -105 -418
2460d18O30l60N5M5N2K12j57p0K38k63K10J33k64QR3o4J15j71K03L0k54J22j88
$$ -418 212 -148 -93 -48 4 216 59 -11 227 -36 174 307 43 51 144 80 195 24 227 257 3 125 -63
2483f3J12m1j67j24M68l54L4M32o50L01j36N8K05k94J56K99n02K37M6j70K88j70
$$ -63 49 8 -159 -283 185 -169 -135 297 -353 -52 -188 -130 75 -219 -63 236 -266 -29 17 -153 135 -35
2505c5k6J11j94M27k46m3N35n83M9L30n33M21l6j6J85m26k31M40n32M07l8k81
$$ -35 -61 50 -144 283 37 -6 529 -54 -5 325 -208 213 177 161 346 -80 -311 129 -403 4 -34 -315
2527c15O89n00r1K89j27j26K32r7L09j56j39N33o60J79J22k35O74l70n06N48m11
$$ -315 374 -126 -217 72 -55 -181 51 -46 263 107 -32 501 -159 20 142 -93 581 211 -295 253 -158
2548a58m9K53k60m7L23j40K68o02L00L63o48L47p0l40M44k95M72J60l88L18N0
$$ -158 -207 46 -214 -261 62 -78 190 -412 -112 251 -397 -50 -120 -460 -16 -311 161 321 -67 251 301
2569C01k37J58k49r0N34o47L24j37L0J8j33J05J51m00M81n6j92n3kl24L36L6R
$$ 301 64 222 -27 -117 417 -230 94 -43 -13 5 -128 -23 128 -272 209 153 -39 -92 -94 -418 -82 -46 -37
2592c7K90m02M17l58rJ44P3j21j09O8L06k43j85M18k61r6L65k21P6l83P8K96l9
$$ -37 253 -149 268 -90 -99 45 118 -3 -112 -44 262 19 -166 252 -9 -105 260 39 115 -268 -190 106 67
2615F7l61L08j28R1J20j81J00jj24J78j20J03n1P0M53k85l83L63k27L2K63l88
$$ 67 -294 14 -114 -23 97 -84 16 15 -109 69 -51 52 1 71 524 239 -144 219 -8 24 287 -101
2637a01K44j08j05J98j88J64q9j36q1K12j00j09k6J11L30n53M71j33k06R9J32
$$ -101 143 35 -70 128 -60 104 15 -121 -202 10 -90 -199 -225 -114 216 -337 134 1 -205 -106 26
2658B6R9l9l10L89Lj99K99k87M85k03m08K7L20o22Q17j94n17M76k64L33j74n36
$$ 26 125 86 -224 165 168 -31 268 -19 466 263 -145 -118 202 -420 397 203 -314 162 -102 231 57 -479
2680d79N41N4j84K23l48j2K41o2L08l16j5L3K20n40O35o5j04j44j58L67j06Lj50
$$ -479 62 116 -68 155 -193 -205 36 -26 282 -34 -49 -16 204 -336 299 234 130 -14 -172 195 89 92 -58
2703e8m1J56k56k9L09n7k66J84k72M10p2o9J86l86K27L50m58J59K69k20k0J72
$$ -58 -99 57 -199 -228 81 24 -242 -58 -330 80 8 -61 125 -261 -34 316 -142 17 286 66 46 218
2725B18l18L95n43L06P1k10J2R2k64L36l89K03K57n14N04j23k91K93j28r0J46
$$ 218 -100 295 -248 58 129 -81 -69 23 -241 95 -294 -91 166 -348 156 33 -258 35 -93 -183 -37
2746c7l6Q6q2J93o4j32l2K25k28L00J28k94K79k33k58L33m2L25l19l99L17j2j74
$$ -37 -73 13 -69 124 60 -72 -104 121 -107 193 321 27 306 73 -185 148 106 431 112 -287 30 18 -156
2769a56L1j99L00j9J41j76K57j71J64k68O5K56l83J33j61L4M62k52k29M97l32
$$ -156 -125 -324 -24 -43 98 -78 179 8 172 -96 -31 225 -158 -25 -186 -152 310 58 -171 326 -6
2790fj61L36n1r8r0pK73m23K39K10o0r3k50l8L48m46L06n1j58J09j09K64J24m45
$$ -6 -167 169 118 20 -70 -77 196 -227 12 222 162 69 -181 -219 129 -317 -11 -62 -220 -111 -220 44 168 -277
2814b77J29M26m48R9J6J46M1Nj43j56J36O2R7k91K15j12n8j6k11K65K7l74N46
$$ -277 -148 278 -170 -71 -55 91 132 137 -6 -162 -26 36 133 -158 57 -55 -113 -129 -340 -75 -48 -422 124
2837A24l15J29K58j90K26k83k42K96K29j89K87k28r8Q6l52N25j84l35J81J64j52
$$ 124 -191 -62 196 6 232 -51 -293 3 232 43 330 102 4 90 -262 263 79 -256 -75 89 -63
2858f3J76j56K03j45l33L36q2J38r1l5J04m44L84N3k01k57N53k03K39K8l88M67
$$ -63 113 -43 160 15 -318 18 -64 74 -17 -52 52 -392 -8 45 -156 -413 140 -63 176 204 -184 283
2880B83m41L06l8j4k07j54K51J78l03l8L49n35K92J22k17K53k53NK49k14m2J68
$$ 283 -158 148 110 96 -111 -265 -14 164 -139 -177 172 -363 -71 51 -166 87 -166 -161 88 -126 -168 0
2902@k40L98j65L6m9J5J65L0m22K93K5K9L98k94Q9N2n89M53l04jJ22L2j55Q5k18
$$ 0 -240 158 -7 29 -20 -5 160 190 -232 61 86 115 513 219 308 360 -229 224 -80 -81 41 73 -82 3 -215
2927b15K19oj91L06k2l00J52J56j92Q9k10O48n43K53O5j41J27k63j23O02n98k5
$$ -215 4 -2 -193 113 91 -209 -57 99 -93 -4 -214 434 -109 144 209 68 195 -68 -191 411 -187 -212
2949b12O77l90k1j81j94M12n46L12L76j12Q6j14k87L30m19J96L56k85L2K06j07
$$ -212 465 75 54 -127 -321 91 -455 -143 233 121 207 93 -194 136 -283 -87 269 -16 16 222 115
2970A15q8L19m71L89n84L15Q4kK97J22o72L72j25j27L22l60P0N9j81QK45k03J51
$$ 115 27 346 -125 264 -320 -5 79 77 374 496 -176 196 71 -56 266 -94 -24 35 -146 -138 107 -96 55
2993E5K2k47R4j70Q3K58k68K56k93K94J02l78J80M00l37J38m7N0P6m86N62l31
$$ 55 77 -170 -76 -246 -163 95 -173 83 -210 84 186 -192 -12 388 51 189 142 192 268 -218 344 13
3015A3j95K59j51j04J02J23j17j27Q3K37k09k35K54K3p0K77m61N08l36J7J9j56
$$ 13 -182 77 -74 -178 -76 47 -70 -197 -114 123 -86 -321 -67 -44 -114 163 -298 210 -126 -109 -90 -246
3037b46L35Q9l4k3O8m35M88l73O6k7P8j9Pj60J86j33k0N69m33J16k26q5O27k66
$$ -246 89 178 144 121 189 -246 242 -131 -65 -92 -14 -33 -26 -186 0 -133 -153 416 -17 99 -127 -212 415 149
3061A49k53j20J63K02l4o4L19m24M3L76m65P7K93n48J97L30j23N7m00J81R0l45
$$ 149 -104 -224 -61 141 107 43 362 -62 -19 357 -108 -31 262 -286 -89 241 118 175 -225 -44 46 -299
3083b99K91p1R3R5k37K60O2k98K62j86j89L41j98n9P7j71M52J1j98K95k47j59
$$ -299 -8 -79 14 109 -128 132 194 -104 158 -28 -217 124 -74 -133 -56 -227 225 236 38 333 86 -73
3105g3K34k27K83k30k18N69l78J6O1j08k52L13j74L55l82j79K33j11L31N6k37
$$ -73 161 -66 217 -13 -231 338 -40 -24 37 -71 -323 -10 -184 171 -211 -390 -157 -268 63 119 -118
3126a18kK26k48L72k14O6L51o52O35l94r1K51l65J18K95l48%J21k46N24n77M63
$$ -118 -120 106 -142 230 16 82 433 -219 416 22 -69 182 -183 -65 230 -118 -118 3 -243 281 -296 167
3148A67j75n0j43L02m70P86k97l54N15m56J87K92k67q1J76q8o8K9J02P7k82K69
$$ 167 -8 -58 -201 101 -369 417 120 -234 281 -175 12 304 37 -44 132 44 -24 5 107 184 -98 171
3170A71k21J36J7j85N9K73l85K32N1m68L55k4j9M5j29J4l6q2N81k81j33K97k39
$$ 171 -50 86 103 -82 -23 250 -135 97 148 -320 35 11 -8 37 -92 -78 -114 -196 385 104 -29 268 29
3193B9J71L0j35J81l45J49K31k83K16l24JK31j25r8K25l04j7K67k31L22j95o9
$$ 29 200 230 95 276 -69 80 311 28 244 -80 -79 152 27 -71 154 -150 -167 100 -131 191 -4 -73
3215g3K85k34j3J9p2J48J0k04L72k85J74J96m53J35o3p2K40o3k26M25l55l2K84
$$ -73 212 -22 -35 -16 -88 60 70 -134 238 -47 127 323 -130 5 -58 -130 110 47 -179 246 -109 -141 143
3238A43o54N53n74P47j68k81K26p7j71M53j27j35J98k82J50K61k08J56j38k0J85
$$ 143 -511 42 -532 215 47 -234 -8 -85 -256 197 70 -65 133 -149 1 262 54 210 72 52 237
3259B37k45J02j9k83K75O6l12MM6j5J68k22K08k7n9K49j31k24JL04j01p8k5K34
$$ 237 -8 94 75 -208 67 133 -179 -175 -129 -144 24 -198 10 -17 -76 173 42 -182 -181 123 22 -56 -81 153
3283A53p6m20N04k80J70K12l09J92l0l41L78m27K73O5J9o5M31o25K30k19j90L10
$$ 153 77 -343 161 -119 51 263 -46 146 116 -225 153 -274 -1 64 83 18 449 -176 54 -165 -355 -45
3305d5j17J63j52j70M95m21K64J44n02K78K25l67M68k33l54M91k20L77l72J92
$$ -45 -162 1 -151 -321 174 -247 17 161 -341 -63 162 -205 263 30 -324 167 -53 324 -48 144
3325A44j22Q8N5p4j24p3J88j21m5J97k7P5n17L91J13k37K27j06Q8j38K6k32K08
$$ 144 22 110 165 91 -33 -106 82 -39 -84 113 86 161 -356 35 148 -89 138 32 120 -18 8 -224 -16
3348a6p1J92k13J32L92m07r2J33k21K46Q9k33J11r2l8L88m84J20Q2j90K52Ol27
$$ -16 -87 105 -108 24 416 9 -83 50 -171 75 164 -69 42 -50 -88 300 -184 -64 18 -172 80 86 -241
3371b41M73k39k03J98Q6R9k71j60L72j25j0L47j79J17k69oN5j60J42Q2k32O1j72
$$ -241 232 -7 -210 -12 74 173 -98 -258 114 -11 -21 326 147 264 -5 -11 44 -116 26 108 -124 -63 -235
3394b35O4L83l16j77K06o7K00k0j70j6r3P0K62%M6R3m23K19L0nL02l45l5K26k88
$$ -235 -171 212 -104 -281 -75 -142 58 38 -132 -148 -241 -171 91 91 137 230 -193 26 56 51 353 8 -27 199 -89
3419h9J90j13j01L32m46J04K40m14KO31m27k0kJ35k4k91M65m33M7M05J29j10k2
$$ -89 101 -12 -113 219 -227 -123 117 -297 -295 336 -91 -111 -113 22 -2 -293 172 -261 -214 191 320 210 188
3442A88l84M97l61Q6L80o44J77K12j48Q6k40j24K15P8k37L40m26K69n0k66L31
$$ 188 -196 301 -60 26 406 -238 -61 151 3 89 -151 -275 -60 18 -219 121 -305 -36 -86 -352 -21
3463b1p7n8L63l75P9L9j89L07M6k4M3Mnm4m1kk04J78m8L2J16j14j9j20P4n2j37
$$ -21 -98 -156 207 -168 -89 -50 -239 68 114 90 133 137 132 88 47 45 -159 19 -29 3 119 5 -14 -134 -60 -112 -249
3490b49K3J66l4j56N07j18J9m8k67l5L33l26J22K90l54K07n9J2K7j13P7Q1M1K0
$$ -249 -226 -60 -94 -250 257 139 158 110 -157 -192 141 -185 -63 227 -127 80 21 33 60 -53 24 105 146 166
3514A66l4k81K00j47K28j01l87L04N3l05L23Rl68L05J97M1j5k69J40Q2j87J18
$$ 166 132 -149 51 -96 132 31 -356 -52 1 -304 19 28 -340 -35 162 203 188 -81 59 141 -46 72
3536G2J32k00j06J80K54m46m4K69R3j47j19j41L50l56j04M17k98K54j13L8l3J07
$$ 72 204 4 -102 78 332 -114 -158 111 204 57 -62 -203 147 -209 -313 104 -194 60 -53 -15 -48 59
3558E9k04M38k54j7j75J10R6N3l12M33j72m6L35p25O44k44J21k4m17J90M28n14
$$ 59 -145 293 39 22 -153 -43 53 106 -206 227 55 9 344 -381 263 19 140 116 -301 -111 317 -197
3580a97K5Q9J49j77p0Q9p7j00M06j53k49M21j88j07L97l64J47J02k12K29J06l52
$$ -197 -172 -83 66 -111 -181 -92 -169 -269 137 -16 -265 156 -32 -139 258 -106 41 143 -69 160 266 -86
3602h6J39Q5j67M7p7L09k53k2N20n47J89J9j15j1k45k44N48p6k07M16n16O43j72
$$ -86 53 138 -29 18 -59 250 -3 -25 495 -52 137 156 41 30 -215 -459 89 13 -194 222 -294 349 177
3625A77j84J38j16R9R0k94K5j24J36M19l50n4O8J50K4o2j39O2N4l48Q8J05j85
$$ 177 -7 131 15 114 204 -90 -65 -189 -53 366 16 -38 30 180 204 142 3 65 119 -229 -141 -36 -221
3648b21J02j5j3J57l7J42j47k73L83l4m9K1J69J48k36q3K59n57M77k5l14J30J08
$$ -221 -119 -134 -147 10 -27 115 -32 -305 78 44 -5 16 185 333 97 14 273 -284 193 168 -146 -16 92
3671I2j54J86j72J08K0k69K43j25k09L81k09L05k31QL9l2o0K06l4K94o9n47K86
$$ 92 -62 124 -48 60 80 -189 54 -71 -280 101 -108 197 -34 -26 13 -19 -79 127 93 387 318 -229 57
3694E7J27l63L32N1j69J24l42J58o5N2K05l09M4j6j02J35l8P5K55k13n4J36k29
$$ 57 184 -179 153 204 35 159 -183 -25 -90 -38 167 -142 -98 -114 -216 -81 -119 -44 211 -2 -56 80 -149
3717a49J60Kr8K36k91O2J43k18N04l86K3J97l28n3K37o8k6J63k68L06j19j82K41
$$ -149 11 13 -85 151 -140 -78 65 -153 351 -35 -12 185 -143 -196 41 -27 -53 110 -158 148 29 -153 88
3740H8n15L02J68l16K85j34j37L28N0l26K21J03j44o5L02l13K32j42K13m92M00
$$ 88 -427 -125 43 -273 12 -122 -259 69 119 -207 14 117 -27 -92 210 -103 129 -13 200 -292 108
3761A08J02l23J86k0p2K40m59J26L10m17J68K33m16M53l15J4Q9j59K58k5j40J63
$$ 108 210 -113 73 53 -19 221 -238 -112 198 -219 -51 182 -234 219 -96 -82 7 -152 106 81 -59 104
3783A04R2k54K43j22J33mk79M75n26J72j43J5L5N0j62L90l94N7L34k97j29m6J22
$$ 104 196 -58 185 63 196 192 -87 388 -138 34 -109 -94 -59 -9 -171 219 -175 -118 216 -81 -210 -256 -134
3806a34M9R8q4L3J17k1k3N1L5k03J39Q8l96M13K76n66L58k37q7j4J63j7n5o9J79
$$ -134 -85 13 -71 -38 79 58 35 86 121 -82 57 145 -251 162 438 -128 230 -7 -94 -108 55 38 -17 -86 93
3831I3k50J29K97m48J29K26k68J0J64p1k8R1j26J27j32K77j61k21M02m8k70j71
$$ 93 -157 -28 269 -179 -50 176 -92 -82 82 11 -17 74 -52 75 -57 220 59 -162 240 192 -78 -249
3853b49K25j75L70j24J13k61J28Q9k44K82k89N8L40m75L01J43j63q8K94m07K44
$$ -249 -24 -199 171 47 160 -101 27 116 -128 154 -135 -77 263 -212 89 232 69 -19 275 -132 112
3874A12l01R6K01l81M48j02j27Q5L9j10J78J4j31K50j72P3m0k96L27k67J39M3
$$ 112 -189 -93 108 -273 175 73 -54 31 70 -40 138 152 21 271 99 172 132 -164 163 -104 35 78
3896G8j21L44l56N0n0l35K74N42m11l9K19k85K01P5j33K16m28L68r5q3m2o4l5
$$ 78 -43 301 -55 -5 -55 -390 -116 426 15 -24 195 -90 111 186 53 269 -159 209 114 31 -11 -75 -110
3919a10j6J3J99K38l91K37n8m94N31k70m6K12nJ39j64m9K90j06q7J70m17M43k55
$$ -110 -126 -113 86 324 -67 170 112 -382 149 -121 -167 45 40 179 15 -34 256 150 63 233 -184 259 4
3942Dk3L40k28k71J45J81l65L35j87L11j51k60M71m48j46P8J88J68j55j16J21
$$ 4 -19 321 93 -178 -33 148 -217 118 -69 242 91 -169 302 -146 -292 -214 -26 142 -13 -129 -8
3963hm7J87q7k61J46k9j10L48j97j79M19k7j71N3j11K40j82J17J32k50K48n05
$$ -8 -55 132 45 -216 -70 -99 -209 139 -58 -237 182 155 -16 37 -74 166 -16 101 233 -17 231 -274
3985b74J24K05k14J24j15K28j69J95m80K93k6R4J85m63N43k37p7J41J04j94J99
$$ -274 -150 55 -159 -35 -150 78 -91 104 -376 -83 -109 -15 170 -293 250 13 -64 77 181 -13 186
4006A86Nr4L62p32L79j46O4J27n37L94K83n10K02l62KM89k31K20l27J26L62m76
$$ 186 191 97 459 -273 106 -40 24 151 -386 8 291 -219 -17 -379 -377 112 -119 101 -226 -100 262 -214
4028b14k9L91P5l47PJ74J14j11l7J63j26J69l00j5O4j06o2K39j78O5J05k25p1
$$ -214 -243 148 223 -124 -117 57 171 60 23 186 60 229 -71 -86 -22 -128 -190 49 -129 -64 41 -184 -255
4051b55K42m8o3L56l64K81m4k31Q3J32j16J04J30p9p0j92J98M8L7k45J20K43k65
$$ -255 -13 -61 -124 232 -132 149 105 -126 -43 89 -27 77 207 128 58 -134 64 112 149 -96 24 267 2
4074Br5K49o0K8k35M5K95k23J89k88K2l6K26o14N86o7l39N24l97Q5j9K00j8lN5
$$ 2 -93 156 96 124 -111 -66 229 6 195 -93 -71 -107 119 -495 91 24 -315 209 -188 -103 -122 78 60 57 112
4099A12nK2LK71m29N8n2K9j34Q7j69J68k00J92q0j51J57j36j9M05k5oj46j90O59
$$ 112 107 129 132 403 -26 32 -20 9 -125 -38 -207 -39 -239 -47 -127 -278 -121 -257 -276 129 104 98 -48 -238 421
4124D21m82j4J77k13j53L03K6J97m62K05K61l01K8p6Q4k4K4J05P4j21NK25m75
$$ 421 -61 -75 102 -111 -264 39 65 262 -200 5 266 -35 -7 -83 1 -23 1 106 180 59 64 289 -186
4147a86n5J18n4J44j49K23J53l35j06L39J32J91k67m8m8k61J3L21j94l3K87o0
$$ -186 -241 -123 -177 -33 -182 41 194 -141 -247 92 224 415 148 100 52 -209 -196 125 -69 -102 185 125
4169A25J1j02k76K80l98L87j15m9K01O7j01m0j74K29K01j33J9r4q4j4j09K12r8
$$ 125 136 34 -242 38 -360 27 -88 -137 64 131 30 -10 -184 45 246 113 132 38 -46 -60 -169 43 -55
4192e5J64j03j25L59k58j06J11Q6k01P6J2o4K31j20LJ59n15M52k3l22K74o6k08
$$ -55 109 6 -119 240 -18 -124 -13 73 -128 -52 -40 -104 127 7 10 169 -346 106 83 -239 35 -31 -239
4215b39K34k22M67k76m1J84k90K34r6R2J6l41L38J56l93K58J16l09J21J89j34
$$ -239 -5 -227 240 -36 -77 107 -183 51 -45 47 63 -278 60 216 -177 81 197 -112 9 198 64
4236F4L6j47rK56k53o4K5Q1p4P5l35M11p3j02J44m4k14K18k35L18N1j61J41k77
$$ 64 100 -47 -56 200 -53 -117 -92 -11 -85 -10 -345 66 -7 -109 35 -9 -223 -5 -240 78 129 -32 109 -168
4260a68L06K43m08J91k68J52r1Q6j77m3M02j85k3J26l39q4M46j40k18J89q3j5
$$ -168 138 381 -27 164 -104 48 -43 43 -134 -177 225 40 17 143 -196 -280 166 26 -192 -3 -86 -101
4282a01M34m20J98j36J60k0l3j28J37j50k9L54l49J3j99m0L19l3M0j08j63M66
$$ -101 333 -87 111 -25 135 115 82 -46 91 -59 -88 266 -83 -70 -269 -309 10 -23 17 -91 -254 212
4304B12K6l91L87k28j69K15k12J91J16k79K47j98J58J38l29L23l76m9K66j33L7
$$ 212 238 -153 234 6 -163 52 -160 31 147 -132 115 -83 75 213 -116 207 -169 -218 48 -85 -48
4325d8J42j59J32j8R2J9k69r5L33k90K49q2m1j8q4O3J80j45m2K07m13M22m8l8
$$ -48 94 -65 67 49 141 160 -109 -204 129 -161 88 6 -35 -53 -137 -74 106 -39 -81 126 -287 135 87 49
4349D9Lo0p1J55m6K48j91j7L2L5j94L8q5K18m2n21O16j34M4k50J52J93j93J82
$$ 49 52 -8 -79 76 30 278 87 70 102 137 -57 -19 -104 114 72 -449 167 33 77 -173 -21 172 -21 161
4373A61j74L5m3L63l89M3nJ6J68n4p7J03k4m2n0M6o9N6p5Mj41R1J28j42K15l27
$$ 161 -13 22 -21 342 -47 -4 -9 7 175 121 44 147 123 81 31 77 8 64 -11 -7 -148 -57 71 -71 144 -183
4399a83L71o1J0k52L48k97rJ91l53M08l46K26jml0M9j07k14K13j83R1J44Q9n9
$$ -183 188 127 137 -115 233 -64 -73 118 -235 173 -173 53 52 48 18 67 -40 -254 -41 -224 -133 11 100 41
4423D1l1Rp4j68J41KK25k96l09N85ql83J73K23j79K81o6k2j44J09O8r8p8L39k77
$$ 41 10 19 -55 -223 -82 -80 145 -151 -460 125 117 -266 -93 130 -49 232 166 144 0 109 177 79 1 340 63
4448F3l2R4j20J18l33m6J83P6P9j64j97K44o7P0Q1l04R1Q8J62K69k69j1J3j52
$$ 63 31 125 5 123 -210 -256 -73 3 82 -82 -279 -35 -102 -32 49 -255 -164 -76 86 355 86 75 88 -64
4472f4M66k96p4j12L34k59Jj02P4j41Q6K78r2N9o6k51j06K60N2K49m49J54J12
$$ -64 402 106 32 -80 254 -5 -4 -106 -32 -173 -87 191 99 158 92 -159 -265 -5 47 296 -153 1 113
4495A13k37K42Jm28M53r1O6j0o9r8J35J78n7k3J9P3l87J18J01l01K45J11l18K37
$$ 113 -124 118 119 -309 144 53 119 109 40 -58 77 255 198 175 194 267 -120 -2 99 -202 43 154 -164 73
4519G3l41K81J7r3j19L16l87K15k9q0M05k57j20J4r2N2K39J3m7J8J06j03j97j94
$$ 73 -268 13 30 -63 -182 134 -253 -38 -67 -147 258 1 -119 -105 -197 -145 94 107 60 78 184 81 -116 -310
4543c10K91j74L31k46R1K29l12J26j52j00M37m88J91K62k54K47j25J76k41L8K38
$$ -310 -19 -193 138 -108 -17 212 -100 26 -126 -226 211 -277 -86 176 -78 169 44 220 -21 17 255
4564B55j33j74L52j45m71K72M3l6J52r7J59P5l55j5L7k4P3oJ02K9k74K67j68q7
$$ 255 122 -52 300 155 -316 -44 -1 -37 115 18 177 252 -103 -118 -81 -105 -32 -38 64 93 -181 86 -82 -169
4588a69j6m9L04O9j97j03K6P6L34n35K00L00k11K86j37M01m57j51n2J16j67R2
$$ -169 -185 -234 70 139 -58 -161 -135 -59 275 -260 -60 240 29 315 178 579 122 -29 -81 35 -132 -40
4610d0J34n7lL4L8j63j30J10M6q1J52K2N3K7j38K60j11l05L02k61m1O9J73M0j60
$$ -40 94 37 34 68 106 -57 -187 -77 -31 -112 40 62 115 142 4 264 153 -152 150 -111 -152 -83 90 130 -30
4635c0q9J43j05l1PL73m70J8K5J26J11j33J43j30Q3K92j19L7j07m4p3J8J29j83
$$ -30 -119 24 -81 -112 -105 268 -202 -184 -159 -33 78 -55 88 -42 41 333 214 251 144 100 27 45 174 -9
4659ik8l4J92j89L92l46k41K58J03L8j84k27J56J27k3O9N1q8J40m10P1K20m2j8
$$ -9 -37 -71 121 -68 324 -22 -263 -5 98 136 -48 -275 -119 8 -15 54 105 17 157 -253 -182 38 -4 -22
4683b2m2P4M3P5j29M6j12K15m20J18K42k4j6O7j14l3J74j83kj70M09l6j19j35
$$ -22 -64 10 53 128 -1 45 -67 148 -272 -154 88 64 48 115 1 -32 142 -41 -43 -213 196 160 41 -94
4707i4L6n7K68J3m77L38j35K84l76L05R2l35K97j85J73k32K92j49Q5k18Qr5nM93
$$ -94 -58 -115 153 166 -311 27 -108 176 -200 105 197 -138 159 -26 147 -85 207 58 143 -75 -67 -162 -167 326
4731C26j00l83K86k04J18n5j15J49j48K63J7l8j86K71N2j90M5k89L96k94J04L3
$$ 326 226 -157 129 -75 43 -12 -127 22 -126 137 154 116 -70 201 253 63 108 -181 215 -79 25 58
4753E8pp1L8j7J77k53Pp9JN6J66j68O3P5q1L2K5l0J78%P3k13l5J17j50j07L13
$$ 58 51 -20 18 1 178 -75 -68 -147 -146 -90 76 -92 -29 46 -35 -3 22 -8 170 170 243 30 -5 112 -38 -145 168
4780A68j78k43K45K4J32k98K09K1j73J49J17m52L91n1K3k7m8lR7j90J55p2j82
$$ 168 -10 -253 -8 16 148 -150 59 80 -93 56 173 -279 112 61 84 57 9 6 103 -87 68 -4 -186
4803a86K56l15K5L73K4l02K97j86Q0j5k21J19J83K26j72k74J83k5j60L10l9k95
$$ -186 70 -245 -220 153 177 -125 172 -14 66 51 -170 -51 132 358 186 -88 95 70 -90 220 181 -114
4825a14JR2J32k88K1K16j93J98j3K1n1j20p4L66m15K92m7L1J9J90j78J12l2j20
$$ -114 -113 -21 111 -177 -156 60 -133 65 52 73 22 -98 -172 194 -221 71 24 55 74 264 86 198 166 46
4849D6J12k19J29j17J87j10o2J9j36K07J87j27l60R3L05Ml73J55O4K37l0Nj29
$$ 46 158 -61 68 -49 138 28 -34 -15 -151 56 243 116 -244 -151 154 158 -215 -60 4 241 211 216 87
4872H7o9n6m5K47n5m5J88l46R3J64j98N2j12J41o5RR3j42N2q8k5K03j78J36q1
$$ 87 18 -38 -83 164 109 64 252 -94 -1 163 -35 17 -95 46 -19 -10 83 -59 -7 -95 -120 83 -95 41 -40
4897d0j78J90J34k85K53K87k79k59K75j02k10L15k34M5J58k44L92Q4l25m2J82
$$ -40 -218 -28 106 -179 74 361 82 -177 98 -4 -214 101 -133 -88 70 -174 218 302 -23 -65 117
4918A17NJ00k94k35L98M5j16N7K3j87J22n8Q1o3M0l0kR1J37Kj19k81K36j57lK51
$$ 117 122 222 -72 -307 91 136 20 77 100 -87 35 -23 58 -5 35 5 3 94 231 233 114 -167 69 -88 -91 160
4944A60j77J77j66L8K39r9l27O2J34l08J13J27j80P9K5J15k82L69L0q3j49N7J7
$$ 160 -17 160 -6 32 271 172 -155 -93 41 -267 -154 -27 -207 -128 -103 12 -270 99 129 46 -103 -46 -29
4967b9K61j60o3kQ4J83j12k67K15j90m6M22m02K66k55j41L51J48k88L25k97j85
$$ -29 232 72 9 7 91 274 162 -105 110 -80 -126 296 -106 160 -95 -236 115 263 -25 300 3 -182
4989a82K42J42k51P5j01R4N6j44j59K08J11R1J20j38k13P0J09k06nK87k25J14
$$ -182 60 202 -49 26 -75 19 75 -69 -228 -20 91 182 302 164 -49 21 130 -76 -81 206 -19 95
5011I5j2j63J09j99K69j29j6J68p0l41J29L73k83J46j76m5j2OJ30k9K61j64J1
$$ 95 83 -80 29 -170 99 -30 -46 122 52 -289 -160 213 -70 76 -100 -145 -157 -151 -21 -50 211 47 58
5034E8j85K09q2M0l1J7rK1L5j79P2L18m97J67J15j32j45J14Oj29K16j78M35k31
$$ 58 -127 82 0 40 9 26 17 38 73 -106 -34 284 -213 -46 69 -63 -208 -94 -88 -217 -1 -179 256 25
5058B5Q6j19k00L12l65K29mQ9r2K21l04K44m4j22J79q6n8m3j05q9P9P2L61k72
$$ 25 111 -8 -208 104 -261 -32 -36 53 -39 182 -122 122 78 -44 135 49 -9 -52 -157 -246 -167 -95 266 -6
5082fj95L67k63k2J8M7K23P7j67j03j02K62k86J53RJ4p9Q1j26J73n6J3j74q5Q9
$$ -6 -201 166 -97 -119 -101 -54 169 246 79 -24 -126 136 -150 3 12 26 -53 28 -98 75 19 32 -142 -227 -138
5107a38K71j65j11p2K30L7K04l93K63j15O8N3k93K3j75L57n0Q1j86L59j63p8R1
$$ -138 133 -32 -143 -215 15 52 256 -137 126 11 79 132 -161 -138 -313 44 -6 75 -111 248 85 7 98
5130I8m3k82L73N6j42k5L6j63P7L27k02j57J24k23J34o7m2K33j72j15J71K34o
$$ 98 55 -227 146 202 60 35 71 -92 -15 312 110 -47 77 -146 -12 -79 -121 112 -60 -175 -4 230 224
5153B24J1n48L22O7j95l3K37k75O3P9J53q6j39J42P2K3k6j34PM4q3j63R7K66J11
$$ 224 235 -313 9 76 -119 -152 85 -190 -127 -48 105 19 -120 22 94 117 91 -43 -36 8 -75 -238 -141 125 236
5178B36l79K1j8P7q8L9j0K17O2OqJ58m7m34K15J61k86j15J71J33j74l5L4J4R5
$$ 236 -143 -122 -140 -63 -151 -112 -122 95 157 163 155 313 266 -168 47 208 -78 -193 -22 111 -63 -98 -64 -50 45
5203D5K65j96k46L27l19K62M9j32j43J03O0O1J25j13M5j20J50m41K74j2N2k21
$$ 45 310 114 -132 195 -124 138 187 55 -88 15 75 136 261 148 193 73 223 -218 56 44 96 -125
5225a25P3L52l35K47l26K48n1k4R3j60j05K34J2o0o5j21J82o5k31K33P9J20p1
$$ -125 -52 300 -35 212 -114 134 83 59 152 -8 -113 121 133 73 8 -113 69 4 -227 6 85 205 134
5248A34j76J81k41k1J14mJ20L11m44J23j88K25J57m35K18p6o9m0RP2L5q3m4L50
$$ 134 -42 139 -102 -123 -9 -13 107 418 -26 97 -91 134 291 -144 74 -2 -71 -111 -102 -30 5 -78 -122 228
5272B28P9k12%l2j10K9J21OR5j08J63l90J77L7Q6j95l0o6k16M91k88J23J77k34
$$ 228 307 95 95 63 -47 -18 103 109 204 96 259 -131 46 83 169 -26 -56 -122 -338 153 -135 -12 165 -69
5296f9j6j43L12j55J26j34j78M30k05N9j65Q7J50k15K79j21J42k55J94o7L3nl66
$$ -69 -85 -228 84 -71 55 -79 -257 173 -32 27 -138 -51 99 -116 163 42 184 -71 123 56 89 84 -282
5319b82L66J32j53m6k28P2K58j47J29R3j31j05o2K4k0O3J98l03jK73k86K9J28
$$ -282 84 216 63 17 -211 -139 119 -28 101 194 63 -42 -104 -80 -100 -37 161 -142 -143 130 -156 -127 1
5342Aq7q4J89QP9j83L53r9k64P2J10L5k01P6%m63K17K28L25m15M9L7R7j41j27
$$ 1 -86 -170 19 27 106 -77 276 177 -87 -15 95 130 -71 5 5 -458 -241 -13 312 -103 -54 -17 80 -61 -188
5367a88J26J01k00L00J25k16p4J7Nm3O5J6K8j97K1K74J89k79j93k8J60o3J50k78
$$ -188 -62 39 -161 139 264 48 -26 -9 -4 -47 18 34 62 -135 -114 160 349 70 -123 -151 9 -54 96 -182
5391a82R2M00n30J37J96k08J64k36J04J97o6j91J15r8K43K9J8j91j58K31R2j25
$$ -182 -90 310 -220 -83 113 -95 69 -167 -63 134 68 -123 -8 -106 137 166 184 -7 -165 66 158 33
5413C3l69J65R5o3J20Q1j39j69Q8J33k1J18k44J05J06J61j61N1j00K53j30j13
$$ 33 -336 -171 -76 -139 -19 62 -77 -246 -158 -25 -46 72 -172 -67 39 200 39 90 -10 243 113 0
5435@K4j03N5J96j84O7k2j22M7o1J50k64p8L84j12k55M94j23q0k46M43j05J19
$$ 0 24 -79 -24 172 -12 55 33 -89 -42 -103 47 -217 -295 89 -23 -278 216 93 13 -233 210 105 224
5458B24k4r1k33O7K07j74J83k40N1L6p0P1M5oJ15l93N9J48k26J65J0N7K49l14
$$ 224 200 109 -124 -57 150 -24 159 -81 -30 6 -64 7 52 46 161 -232 -173 -25 -251 -86 -76 -19 230 -84
5482h4J34Rk28M3J84m6Q2k29o8K89Q0j93K72k73j44L18p3j95K08l31M17L6n83
$$ -84 50 59 -169 -126 58 12 94 -135 -203 86 166 -27 245 -28 -172 146 73 -122 86 -245 172 208 -375
5505c75O76m95J90Jp6K04j76J92j62N1k6K2n7L50k65j54L15r7J47k25N0o6K2j27
$$ -375 301 -194 -4 -3 -79 125 -51 141 -21 30 4 26 -31 319 54 -100 215 118 265 40 90 24 46 -81
5529h1j96N2N43l66j63L52Q5j62l91J71J28r2J26Mk33J27r1R1j36K77k71K06j84
$$ -81 -277 -225 318 -48 -211 141 226 64 -327 -156 -28 -120 6 10 -223 -96 -187 -96 -232 45 -226 -20 -204
5552b04K12m6p0J30K65l55K36l19M66k29r5N5O8k39K30J77k82l2M5j30J06J45
$$ -204 8 -38 -108 22 287 -68 168 -151 315 86 -9 46 114 -125 105 282 0 -32 13 -117 -11 134
5574A34k32Q6j9k88M2L57j52J99j86J12J3j59j0J63Mj05O3j27k3J43l5o0J24O9
$$ 134 -98 -12 -31 -319 -277 80 -72 127 -59 53 66 -93 -103 60 64 -41 22 -105 -128 15 -20 -80 44 113
5598A13l68N90j74j78J26j35P5k79N7M69j35j25l6p7L2r8K61j63j36L04J61m91
$$ 113 -255 335 161 -17 109 -26 49 -230 -173 296 161 36 0 -77 -45 -143 118 -45 -181 123 284 -207
5620b07J77N1K84k86J98j69j78K60k32M10k55j45l5L40k12k5j25K59r2J76l9l03
$$ -207 -30 21 305 19 217 48 -130 130 -102 308 53 -92 -127 213 1 -24 -149 110 18 194 155 -148
5642a48K34k25J37o6j01L12p8j20jJ31q6L11k90K0j76k46M13j85L02l46K29Lm06
$$ -148 86 -139 -2 -68 -169 143 65 -55 -56 75 -11 300 10 30 -146 -392 21 -164 138 -208 21 24 -382
5665c82M43j00J02j70J76M6k10M5K0j91p7R8L01Q0jk23O5J58j59J0K5J2J06K2
$$ -382 61 -39 63 -107 69 115 -95 -50 -30 -221 -298 -200 101 181 180 -43 22 180 21 31 56 68 174 196
5689A96p6q8M2N2J83q7K40o45J77J11k36Q9R5k05o8K37J27k04l7L5K4k07K31K60
$$ 196 120 32 74 126 309 222 462 -183 -6 105 -131 -42 53 -152 -220 17 144 -60 -97 -62 -38 -245 -14 246
5713B46k44L01k92k4P2m7J67o9j67L44l79RL25j50K4j11Pjr5p0m7L29q2q3J98
$$ 246 2 303 11 -13 59 12 179 110 -57 287 -92 -83 242 92 116 5 12 11 -84 -154 -201 128 46 -37 161
5738A61n8j92n7K23n5L1k42J08o2K50l88L70j40J82k60q4K23j11l8N5J76k17K07
$$ 161 103 -89 -146 77 22 53 -189 -81 -143 107 -281 89 -51 131 -129 -213 10 -101 -139 -84 92 -125 82
5761H2r8j94L39j44O8N4m7r0o0K11J87m21K63k14K23l7l1P8j74j92K04L21l54
$$ 82 -16 -210 129 -15 53 107 60 -30 -90 121 308 -113 150 -64 159 122 91 169 -5 -197 7 328 -26
5784b6M1j13L5J2K9k71O9R5J47m5q4J15j26K08q4R1n2J9j50K4J21N6P1j20j61
$$ -26 15 -98 -63 -51 -22 -293 -224 -129 18 -27 -111 4 -122 86 2 93 41 60 -90 -66 55 111 182 62 -99
5809i9J36n4J16J34m89K92J16n2O0j63M7p2M6l9k91K96K8j17K89j07n6m1O2r7
$$ -99 37 -17 99 233 -256 36 152 100 160 -3 44 -28 18 -21 -312 -16 12 -105 184 77 21 -20 42 -55
5833e5J0r1L62p3l60R4J43j08K29j30L53Nm23K0J19n5O1j18j65L66l23J91l2j37
$$ -55 -45 -136 226 153 -207 -113 30 -78 151 21 374 379 -44 -24 95 40 101 -17 -182 184 -139 52 20 -117
5857a17K20j11M6q0j33J43QqJ1o8Q4j9J24K1k26j39J85R0J44j39n3P1M7k64M09
$$ -117 103 -8 38 -42 -175 -32 -24 -32 -21 -89 -5 -24 100 121 -105 -244 -59 31 175 36 -17 54 101 -163 246
5882B46j16j98L00l22k13L57k66J74n4K06j41l7M3J02j4J84l48K35J25l48J38
$$ 246 130 -68 232 -90 -303 54 -212 -38 -92 114 -27 -64 -21 81 67 251 -97 138 263 -85 53
5903E3J34m6R1k93R5M2k57L57l70J60Mj60j8J12l0J72L4k51K83L7L0Q2j09j1l40
$$ 53 187 141 232 -61 34 76 -181 176 -194 -34 -30 -190 -208 -96 -126 46 80 -171 112 149 179 261 152 141 -199
5928a99m1M08k77N9K50k43q4K27j61J44K10m17J37K5j2K41l33J33l0m7J48k08
$$ -199 -240 168 -109 -50 200 -43 -127 100 -61 83 293 -124 13 38 26 267 -66 67 37 -10 138 -70
5950g0J83j21j07j42K26Kj82J34J45kk44J46p1P7K68j84r7J99q9j31j39J19J08
$$ -70 113 -8 -115 -257 -31 -29 -211 -77 68 66 -178 -32 -103 -26 242 58 -39 160 71 -60 -199 -80 28
5973B8j11J91k29K31j95J67k5nj82K02j40o0M9K46j41J4q3j13K29j6j9K32k94
$$ 28 -83 108 -121 110 -85 82 57 52 -130 72 -68 -128 -79 167 26 40 -43 -156 73 57 38 270 -24
$$ [...]
8191A06
##END NTUPLES=NMR FID
##END=
