##TITLE=1H_Pr 5051-2
 CDCl3,8 sc, 
 3.9.2021
##JCAMPDX= 6.0         $$ Bruker NMR JCAMP-DX V2.0
##DATA TYPE= NMR FID
##DATA CLASS= NTUPLES
##ORIGIN= UXNMR, Bruker Analytische Messtechnik GmbH
##OWNER= root
$$ XWIN-NMR		Version 3.5
$$ Fri Sep  3 13:46:33 2021 Russian Standard Time (UT+4h)  she@DPX200
##.OBSERVE FREQUENCY= 200.1314
##.OBSERVE NUCLEUS= ^1H
##.DELAY= (6, 6)
##.ACQUISITION MODE= SIMULTANEOUS
##.ACQUISITION SCHEME= undefined
##.AVERAGES= 8
##.DIGITISER RES= 18
##SPECTROMETER/DATA SYSTEM= spect
##.PULSE SEQUENCE= zg30
##.SOLVENT NAME= D2O
##.SHIFT REFERENCE= (INTERNAL, D2O, 0, 15.7039)
##AUDIT TRAIL= $$ (NUMBER, WHEN, WHO, WHERE, WHAT)
$$ ##TITLE= Audit trail, XWIN-NMR		Version 3.5
$$ ##JCAMPDX= 5.01
$$ ##ORIGIN= Bruker BioSpin GmbH
$$ ##OWNER= she
$$ F:/spectra/data/she/nmr/H-F/1/audita.txt
$$ ##AUDIT TRAIL=  $$ (NUMBER, WHEN, WHO, WHERE, WHAT)
(   1,<2021-09-03 13:45:07.04 +0400>,<she>,<DPX200>,
      <created by zg, POWCHK disabled, PULCHK disabled
       configuration hash MD5:
       00 E9 B6 7A A2 85 ED C7 34 08 36 98 17 FE 4E 26
       data hash MD5: 16K
       18 FF 84 59 6A 5B 03 BC 54 9B B0 FC 5D BC 4F 35>)
$$ ##END=
$$ 
$$ hash MD5
$$ 51 B8 30 3E 42 FE C1 2B 66 38 82 13 59 FE 7C F5
##$RELAX= 
##$RELAX= 
##$RELAX= 
##$RELAX= 
##$RELAX= 
##$RELAX= 
$$ Bruker specific parameters
$$ --------------------------
##$DU= <F:/spectra>
##$EXPNO= 1
##$NAME= <H-F>
##$PROCNO= 1
##$TYPE= <nmr>
##$USER= <she>
##$AMP= (0..31)
100 100 100 100 100 100 100 100 100 100 100 100 100 100 100 100 100 100 
100 100 100 100 100 100 100 100 100 100 100 100 100 100 
##$AQSEQ= 0
##$AQ_mod= 1
##$AUNM= <au_zg>
##$AUTOPOS= <>
##$BF1= 200.13
##$BF2= 200.13
##$BF3= 200.13
##$BF4= 200.13
##$BF5= 200.13
##$BF6= 200.13
##$BF7= 200.13
##$BF8= 200.13
##$BYTORDA= 1
##$CFDGTYP= 0
##$CFRGTYP= 5
##$CHEMSTR= <none>
##$CNST= (0..31)
1 1 145 1 1 1 1 1 1 1 1 1 1 1 1 1 1 1 1 1 1 1 1 1 1 1 1 1 1 1 1 1 
##$CPDPRG= <>
##$CPDPRG1= <>
##$CPDPRG2= <>
##$CPDPRG3= <>
##$CPDPRG4= <mlev>
##$CPDPRG5= <mlev>
##$CPDPRG6= <mlev>
##$CPDPRG7= <mlev>
##$CPDPRG8= <mlev>
##$CPDPRGB= <>
##$CPDPRGT= <>
##$D= (0..31)
0 1.2 0 0 0 0 0 0 0 0.06 0 0.03 0 0 0 0 0.0002 0 0 0 0 0 0 0 0 0 0 0 0 
0 0 0 
##$DATE= 1630662306
##$DBL= (0..7)
120 120 120 120 120 120 120 120 
##$DBP= (0..7)
150 150 150 150 150 150 150 150 
##$DBP07= 0
##$DBPNAM0= <>
##$DBPNAM1= <>
##$DBPNAM2= <>
##$DBPNAM3= <>
##$DBPNAM4= <>
##$DBPNAM5= <>
##$DBPNAM6= <>
##$DBPNAM7= <>
##$DBPOAL= (0..7)
0.5 0.5 0.5 0.5 0.5 0.5 0.5 0.5 
##$DBPOFFS= (0..7)
0 0 0 0 0 0 0 0 
##$DE= 6
##$DECBNUC= <off>
##$DECIM= 32
##$DECNUC= <off>
##$DECSTAT= 4
##$DIGMOD= 1
##$DIGTYP= 9
##$DL= (0..7)
0 120 120 120 120 120 120 120 
##$DP= (0..7)
150 150 150 150 150 150 150 150 
##$DP07= 0
##$DPNAME0= <>
##$DPNAME1= <>
##$DPNAME2= <>
##$DPNAME3= <>
##$DPNAME4= <>
##$DPNAME5= <>
##$DPNAME6= <>
##$DPNAME7= <>
##$DPOAL= (0..7)
0.5 0.5 0.5 0.5 0.5 0.5 0.5 0.5 
##$DPOFFS= (0..7)
0 0 0 0 0 0 0 0 
##$DQDMODE= 0
##$DR= 18
##$DS= 0
##$DSLIST= <SSSSSSSSSSSSSSS>
##$DSPFIRM= 0
$$ [...]
##$SUBNAM2= <"">
##$SUBNAM3= <"">
##$SUBNAM4= <"">
##$SUBNAM5= <"">
##$SUBNAM6= <"">
##$SUBNAM7= <"">
##$SUBNAM8= <"">
##$SUBNAM9= <"">
##$SW= 20.0188988654967
##$SWIBOX= (0..15)
0 0 2 0 0 0 0 0 0 0 0 0 0 0 0 0 
##$SW_h= 4006.41025641026
##$TD= 16384
##$TD0= 1
##$TE= 0
##$TE2= 300
##$TE3= 300
##$TEG= 300
##$TL= (0..7)
0 120 120 120 120 120 120 120 
##$TP= (0..7)
150 150 150 150 150 150 150 150 
##$TP07= 0
##$TPNAME0= <>
##$TPNAME1= <>
##$TPNAME2= <>
##$TPNAME3= <>
##$TPNAME4= <>
##$TPNAME5= <>
##$TPNAME6= <>
##$TPNAME7= <>
##$TPOAL= (0..7)
0.5 0.5 0.5 0.5 0.5 0.5 0.5 0.5 
##$TPOFFS= (0..7)
0 0 0 0 0 0 0 0 
##$TUNHIN= 0
##$TUNHOUT= 0
##$TUNXOUT= 0
##$USERA1= <user>
##$USERA2= <user>
##$USERA3= <user>
##$USERA4= <user>
##$USERA5= <user>
##$V9= 5
##$VALIST= <valist>
##$VCLIST= <CCCCCCCCCCCCCCC>
##$VD= 0
##$VDLIST= <DDDDDDDDDDDDDDD>
##$VPLIST= <PPPPPPPPPPPPPPP>
##$VTLIST= <TTTTTTTTTTTTTTT>
##$WBST= 1024
##$WBSW= 4
##$XGAIN= (0..3)
0 0 0 0 
##$XL= 0
##$YL= 0
##$YMAX_a= 504107
##$YMIN_a= -336682
##$ZGOPTNS= <>
##$ZL1= 120
##$ZL2= 120
##$ZL3= 120
##$ZL4= 120
##$ABSF1= 10
##$ABSF2= 0
##$ABSG= 5
##$ABSL= 3
##$ALPHA= 0
##$AQORDER= 0
##$ASSFAC= 0
##$ASSFACI= 0
##$ASSFACX= 0
##$ASSWID= 0
##$AUNMP= <proc_1d>
##$AZFE= 0.1
##$AZFW= 0.1
##$BCFW= 1
##$BC_mod= 2
##$BYTORDP= 1
##$COROFFS= 0
##$CY= 11.3945322036743
##$DATMOD= 1
##$DC= 2
##$DFILT= <>
##$DTYPP= 0
##$F1P= 2.36226072786647
##$F2P= -0.459571619588291
##$FCOR= 0.5
##$FTSIZE= 0
##$FT_mod= 4
##$GAMMA= 1
##$GB= 0.15
##$INTBC= 1
##$INTSCL= 1
##$ISEN= 128
##$LB= 0.24
##$LEV0= 0
##$LPBIN= 0
##$MAXI= 10000
##$MC2= 0
##$MEAN= 0
##$ME_mod= 0
##$MI= 1.114404
##$NCOEF= 0
##$NC_proc= 0
##$NLEV= 6
##$NOISF1= 3.799351
##$NOISF2= 2.8
##$NSP= 1
##$NTH_PI= 0
##$NZP= 0
##$OFFSET= 15.70392
##$PC= 1
##$PHC0= -13720.88
##$PHC1= 20.4009
##$PH_mod= 1
##$PKNL= yes
##$PPARMOD= 0
##$PSCAL= 0
##$PSIGN= 0
##$REVERSE= no
##$SF= 200.130013532006
##$SI= 16384
##$SIGF1= 3
##$SIGF2= 2
##$SINO= 400
##$SIOLD= 16384
##$SREGLST= <1H.CDCl3>
##$SSB= 0
##$STSI= 0
##$STSR= 0
##$SW_p= 3612.71676300578
##$SYMM= 0
##$S_DEV= 0
##$TDeff= 0
##$TDoff= 0
##$TI= <>
##$TILT= no
##$TM1= 0
##$TM2= 0
##$TOPLEV= 0
##$USERP1= <user>
##$USERP2= <user>
##$USERP3= <user>
##$USERP4= <user>
##$USERP5= <user>
##$WDW= 1
##$XDIM= 8192
##$YMAX_p= 0
##$YMIN_p= 0
$$ End of Bruker specific parameters
$$ ---------------------------------
##NTUPLES= NMR FID
##VAR_NAME=  TIME,          FID/REAL,        FID/IMAG
##SYMBOL=    X,             R,               I
##VAR_TYPE=  INDEPENDENT,   DEPENDENT,       DEPENDENT
##VAR_FORM=  AFFN,          ASDF,            ASDF
##VAR_DIM=   8192,          8192,            8192
##UNITS=     SECONDS,       ARBITRARY UNITS, ARBITRARY UNITS
##FACTOR=    0.0002496,     1,               1
##FIRST=     0,             0,               0
##LAST=      2.0444736,     0,               0
##MIN=       0,             -336682,         0
##MAX=       2.0444736,     504107,          0
$$ Real data points
##PAGE= N=1
##DATA TABLE= (X++(R..R)), XYDATA
$$ [...]
1949i4l84J90J85j40o00N96J98k00k97M93l8k59L3O33r5o41J48P62m79n73P43
$$ -94 -478 -288 -103 -243 -843 -247 -49 -249 -546 -53 -91 -350 -317 316 221 -420 -272 490 11 -562 181
1970A81L29o16R3N91k04o92J31O04j18o54K89O39o15k63K90N59n64l69Q47N9n42
$$ 181 510 -106 -13 578 374 -318 -187 417 299 -355 -66 573 -42 -305 -15 544 -20 -389 458 517 -25
1991b5l8N04K78q04J01M99p1q79M10M53m18n13O64K96p73K50M38O5m80J37M68
$$ -25 -63 441 719 -85 16 515 444 -435 -25 428 10 -503 161 457 -316 -66 372 437 -43 94 562
2012E62m28l34K57M91j95l77M78k98l61r7O38k7p00K68L39n38k76N68L95n53m99
$$ 562 134 -200 57 548 353 -24 454 156 -205 -302 336 309 -391 -123 216 -322 -598 -30 365 -188 -687
2033f87P42K72n25k72P17p3m16J52N99l48o39M24L93q80O3P40J01p53N3R20l82
$$ -687 55 327 -198 -470 247 174 -242 -90 509 161 -478 -54 339 -541 -478 262 363 -390 -337 583 201
2054B01n52K51L70N3o89K27M54k28o32M79N18l47m71M33J15m92J62N57l40l60
$$ 201 -351 -100 270 323 -366 -139 315 87 -545 -66 452 105 -366 67 182 -310 -148 409 69 -291
2074b91P3N71k94n94L26M00m33l59L85J77j67k05O19l57m55J26O52l57k66J46
$$ -291 -218 353 59 -535 -209 191 -242 -601 -216 -39 -206 -411 208 -149 -604 -478 174 -183 -449 -303
2094c03K70m13k2L72J47n80J15P09m36l74L05M58n29nN21J42n01k41L00M05q66
$$ -303 -33 -446 -468 -96 51 -529 -414 295 -141 -515 -210 248 -281 -286 235 377 -124 -365 -65 340 -526
2115e26L79O26m02n37N39L20j78o92M74M47m15k76O14K23o27kL34L45n86l04N93
$$ -526 -147 479 77 -460 79 399 221 -471 3 450 35 -241 373 596 -31 -33 301 646 60 -244 349
2136C49j36k86J59K49l97k63K43M16m58j14M10L74m93j25M30n41J1M25L43k06
$$ 349 213 -73 86 335 -62 -325 -82 334 -124 -238 172 546 53 -72 358 -183 -172 253 596 390
2156C90o75R21k26l77J30J67n7m07L19M60l78l21L03J02k97j10K07L95o55R2L48
$$ 390 -285 636 410 33 163 330 273 -134 185 645 267 -54 249 351 54 -56 151 546 -109 -17 331
2177C31l8o23K55N21j95n46N22L80n28n02O39J68o32j73P53j49n74L03L62p3m87
$$ 331 293 -330 -75 446 251 -295 227 607 79 -423 216 384 -248 -421 332 183 -391 -88 274 201 -286
2198b86K44K72N2n78M52K17l40m39N28K21o94k7N05r4l70L55P5j12l67J99L53
$$ -286 -42 230 282 -296 156 373 33 -406 122 343 -351 -378 127 33 -337 18 93 -19 -386 -187 166
2219A66m40j4R5K06m28J15K14L8m02K1L07k7k41K66K84m13J9J7J78o23K74M43
$$ 166 -274 -288 -193 13 -415 -300 -86 -48 -450 -429 -122 -149 -390 -124 160 -253 -234 -217 -39 -662 -388 55
2241E5k67k03L36J98j82k75L63l7j77p3M74l3m77M5M54K8k45K2N68r1p32K32N87
$$ 55 -212 -415 -79 119 -63 -338 25 -12 -189 -262 212 179 -298 -253 201 229 -16 6 574 483 -249 -17 570
2264E70n31O2M30J78o99p6L91K60m89j47K70J32k16k3J72L9k39M49Km17o8N46
$$ 570 39 101 531 709 10 -66 325 585 96 -51 219 351 135 112 284 323 84 533 535 118 50 596
2286E96l14m46K28K79Lk27k5K70m52q5M56p9j62JL19Jk87k87M44p1k46Q0K95k40
$$ 596 282 -164 64 343 346 119 94 364 -88 -173 283 204 42 43 362 363 76 -211 233 162 -84 -4 291 51
2310E1k05L76j48l58k75R24J52o37J32J06j96j82L59M48p61k12L09K78m31j09
$$ 51 -154 222 74 -284 -559 365 517 -120 12 118 -78 -260 99 547 -214 -426 -117 161 -270 -379
2330c79L04K89o28K17J8L66o90J59M04l19p8K83L09m00j44O0k7r2j21N49j31j67
$$ -379 -75 214 -414 -197 -179 187 -503 -344 60 -259 -337 -54 255 -145 -289 -229 -256 -348 -469 80 -51 -218
2352b18r2L20n3m31L53n4r9p5K35M29l96k3J50j62k07M32j09Mk06M53j9o86J69
$$ -218 -310 10 -43 -474 -121 -175 -274 -349 -114 315 -81 -104 46 -116 -323 109 0 4 -202 251 232 -454 -285
2375b85O19l07l25J24K74j39m22K90K22M0k86J33M59n91P9J57L06n73N8N16%n03
$$ -285 334 27 -298 -174 100 -39 -461 -171 51 91 -195 -62 397 -194 -115 42 348 -225 -167 349 349 -154
2397a54qP39k97m06J83M79l13m87M62K89m31j58K82K84j54n73N84l8j34j21N78
$$ -154 -162 577 280 -126 57 536 223 -264 198 487 56 -102 180 464 310 -263 321 283 149 28 606
2418F06j65l65K13k51J52n9J77J51j45l72M1L9k75L49K4J11k56K06l8l02J58L54
$$ 606 441 76 289 38 190 131 308 459 314 -58 -17 22 -253 96 120 231 -25 181 143 -159 -1 353
2440C53q3o32L94L10m97k92N75K08n07k4M12J59m44l51O00k43j7m3J37J1ll60
$$ 353 270 -362 32 342 -155 -447 128 336 -171 -195 217 376 -68 -419 181 -62 -79 -122 15 26 23 -337
2462c37M55l44k45L41L20l38l24N25J8m60l1P21k47n88J83L42k98j41K56K62N0
$$ -337 118 -226 -471 -130 190 -148 -472 53 71 -389 -420 301 54 -534 -351 -9 -307 -448 -192 70 120
2483A20m16K57j3j58j84O10j16j87k22O05k52m92L00L53l18q1L45J16l32o2M80
$$ 120 -296 -39 -52 -210 -394 216 100 -87 -309 296 44 -448 -148 205 -113 -194 151 267 -65 -127 353
2504C53j07n65L66M05j85o2k20K34o30K43K70N3m99K56L68j10m13pM91j32k44
$$ 353 246 -319 47 452 267 205 -15 219 -411 -168 102 155 -344 -88 280 170 -243 -250 241 109 -135
2525a35n5N95n57m28P94O3l08r9L31M5j08l04K97j09k26L07M74n56j70L22k4j00
$$ -135 -190 405 -152 -580 214 277 -31 -130 201 246 138 -166 131 22 -204 103 577 21 -149 173 149 49
2547D9r8M57l03j07O1K77m2m17J60L96m28o9K1K11r3N9lp3j48k91K43K13m77K87
$$ 49 -49 408 105 -2 59 336 294 -123 37 433 5 -64 -43 168 75 134 131 58 -90 -381 -138 75 -402 -115
2571a15L43k59k88L96L5k92o1N16J40o85K37M95m50l45N42kk76L1J16J27k41j17
$$ -115 228 -31 -319 77 112 -180 -241 275 415 -270 -33 462 12 -333 209 207 -69 -38 78 205 -36 -153
2593a53J68J45m67J05M22j6l46Q3J89l82k09K05K25l34O6K57J84j96j31J51q9
$$ -153 15 160 -307 -202 220 204 -142 -59 130 -252 -461 -256 -31 -365 -299 -42 142 -54 -185 -34 -123
2614a23j64J00J89r9k21K49L47n98L51K49j30n07K32N53k14k61N8o9J84k48O4
$$ -123 -287 -187 2 -97 -318 -69 278 -320 31 280 150 -357 -125 428 214 -47 11 -58 126 -122 -58
2635e8L32m74R0L07k6m8j85Q6j07m5Q7K26J0m78N04O6k83l06M68n3m60K90J19
$$ -58 274 -200 -110 197 171 123 -62 24 -83 -128 -41 185 195 -283 221 287 4 -302 166 113 -347 -57 62
2658F2J04l83m7K66L7k41K94J53j45j58J99Pn01K90J39J34l00Q6K82k4m53K34
$$ 62 166 -217 -264 2 39 -202 92 245 100 -58 141 148 -353 -63 76 210 -90 -4 278 254 -199 35
2680C5K12r5l34K48J97m22k56N86%k86J14K35J13k57r6K31k32q2K18l7j04Q4O9
$$ 35 247 152 -182 66 263 -159 -415 171 171 -115 -1 234 347 90 -6 225 -7 -89 129 92 -12 72 141
2703A41k72K3j00N29o49J76K5L81j60l93L92K69m01mJ37r7l32J57M27n9l34j24
$$ 141 -131 -108 -208 321 -328 -152 -127 254 94 -299 93 362 -39 -43 94 -3 -335 -178 249 190 -144 -268
2725b68L73j39l13L64K16l88j73O98k51l85k22P75k81l26L98J33k68k72J88L7
$$ -268 105 -34 -347 17 233 -155 -328 370 119 -266 -488 287 6 -320 78 211 -57 -329 -141 -104
2745a04J08k97N22m8n78J42K00K63k68m8j79K47J8r5M99n18o7J72J9k89M27k4
$$ -104 4 -293 229 181 -397 -255 -55 208 -60 -108 -287 -40 -22 -117 382 -136 -203 -31 -12 -301 126 102
2767A02j76k07O9J95m3j18J82K92k55o1K57J14p99L20L32L9j80J07n7l%m7J35
$$ 102 -74 -281 -212 -17 -60 -178 4 296 41 -20 237 351 -448 -128 204 243 63 170 113 110 110 63 198
2790A98k08J18J53P2l87j42N51j64m01Q7K28k58m8K84J63k39q3J9L05l28J5L30
$$ 198 -10 108 261 333 -54 -196 355 191 -210 -123 105 -153 -201 83 246 7 -76 -57 248 -80 -65 265
2812B65Rl22J29K15k49k4M8J55k59o8K66J06l47j30L16J7k92O7K69j5m77L37K76
$$ 265 274 -48 81 296 47 23 71 226 -33 -101 165 271 -76 -206 110 127 -165 -98 171 156 -321 16 292
2835B92k35p6j70O84p06L27j93J84r2N2j4J65k84qL09k29l42M01n8l99L00N1q7
$$ 292 57 -19 -189 495 -211 116 -77 107 15 67 53 218 -66 -74 235 6 -336 65 7 -392 -92 -41 -128
2858a28m4J19o1J21k12K57J1r5m16O48M9k94j55L17k5k70M8K81k20M3j17J50j27
$$ -128 -172 -53 -114 7 -205 52 63 -32 -448 200 249 -45 -200 117 92 -178 -130 151 -69 -26 -143 7 -120
2881a20k68J56M47l70J10mK05k56J2L81k16l18J19L66l07Q7k27K52K52l25m2K64
$$ -120 -388 -232 215 -155 -45 -49 156 -100 -88 293 77 -241 -122 244 -63 24 -203 49 301 -24 -66 198
2903A98l47L08k2j38k43J59K45m2j61K31n0k86J88J02J05n28M7M70o3l02J19J16
$$ 198 -149 159 137 -1 -244 -85 160 118 -43 188 138 -148 40 142 247 -281 -234 236 173 -129 -10 106
2925A06k04K97l21N19l12M1oK77l44J82J00l64K31jK51k15r6n3M05k98j81L89
$$ 106 -98 199 -122 397 85 126 120 397 53 235 335 -29 202 201 452 237 141 88 493 195 14 403
2947D03n0k63k34K04J38j08J34Q2j53l27K41L46l48j69K16j17P6j24P4J78k91
$$ 403 353 90 -144 60 198 90 224 306 153 -174 67 413 65 -104 112 -5 71 -53 21 199 -92
2968i2k69M19r5j32L88k88J24j43P7J4j59J46j52M57o20K08K24q8k69J97L54j31
$$ -92 -361 58 -37 -169 219 -69 55 -88 -11 3 -156 -10 -162 295 -325 -117 107 19 -250 -53 301 170
2990A70l23J37K2k46K92LN2k70N2J71j84k17J87P1L0j46P6j6Qm7J13J20m55m5
$$ 170 -153 -16 6 -240 52 55 107 -163 -111 60 -124 -341 -154 -83 -53 -199 -123 -139 -131 -178 -65 55 -400 -445
3014d45N66R0n89K87M12l09k57J51J39j85k60K31L19l59J62J7J28j35P3J18k80
$$ -445 121 211 -378 -91 321 12 -245 -94 45 -140 -400 -169 150 -209 -47 -30 98 -37 36 154 -126
3035a26j06J65L83m30j04L87J71k46N0J24l93P1J56J65l07K37j60Rj86R4M12j52
$$ -126 -232 -67 316 -114 -218 169 340 94 144 268 -125 -54 102 267 -40 197 37 46 -140 -46 366 214
3057B14j87M0J70k17k21K06K85l42j48P4L98k27k05N0K90r8l85L19L01m93K25
$$ 214 27 67 237 20 -201 5 290 -52 -200 -126 272 45 -160 -110 180 82 -303 16 317 -176 49
3078D9J57j04m28N43r4l43k29N01Q7l46K1R2L56r6p3Kk09P0P8J47k81J06J3K6
$$ 49 206 102 -326 217 123 -220 -449 52 139 -207 -186 -94 262 166 93 95 -114 -44 34 181 -100 6 19 45
3102D5O0j32J51K8J7k09Q5M00n61J08L5K26k59l7J86k49k70L45M33k42l70K84
$$ 45 105 -27 124 152 169 -40 45 445 -116 -8 27 253 -6 -43 143 -106 -376 -31 402 160 -210 74
3124G4M1j69j36K02j14k27M25q5j15k45K01K78j97o6L40jj68j72L37k61j78J89
$$ 74 115 -54 -190 12 -102 -329 96 11 -104 -349 -148 130 -67 -133 207 206 38 -134 203 -58 -236 -47
3146d7J81k54q1M26k58J28j54J68j11j70J96L90n85O7Q7L67k62k53K14p4k69R4
$$ -47 134 -120 -201 225 -33 95 -59 109 -2 -172 24 414 -171 -104 -17 350 88 -165 49 -25 -294 -200
3168b00K09M6k19O7J61J26l14P7K26k65o9N55l15j03k21O00k69k83L11j26J7J91
$$ -200 9 55 -164 -97 64 190 -124 -47 179 -86 -155 400 85 -18 -239 361 92 -191 120 -6 11 202
3190B02N4m8l90J31R3J70m82M52j24nm3k01K89j89j94K57L77m75L79m13K34j48
$$ 202 256 208 -182 -51 42 212 -270 182 58 53 10 -191 98 -91 -285 -28 349 -126 253 -160 74 -74
3212g4P2K65j17l76NL54l1l54L17R1k49j12M29J00n26n3L05N4j32O8K7L36k02
$$ -74 -2 263 146 -230 -225 129 98 -256 61 152 -97 -209 220 320 -206 -259 46 100 -32 36 63 399 197
3235A97n97P21k79l44N53k17l45K19M04j82P1m33L48k16j12M26k68J52m92K07
$$ 197 -400 321 42 -302 251 34 -311 -92 312 130 201 -232 116 -100 -212 214 -54 98 -394 -187
3255a87M73m30P8K36n9k53J67k51K41j12j03K58j72R1J26k02j2n3l7J81j07O6
$$ -187 286 -144 -66 170 111 -142 25 -226 15 -97 -200 58 -114 -23 103 -99 -111 -164 -201 -20 -127 -61
3277f1M4o1k6j1K73j12k99L55j53k8mK60j11k18K75P4n5j91n8K96j74k3L0J10
$$ -61 -17 -78 -104 -115 158 46 -253 102 -51 -79 -83 177 66 -152 123 197 142 -49 -107 189 15 -8 22 132
3301A32j99o9p0K59k05J52j07K06N0k49N0J71j70j31O0K20r0r1K23k44NK97k79
$$ 132 -67 -136 -206 53 -152 0 -107 99 149 -100 -50 121 -49 -180 -120 100 10 -81 142 -102 -97 200 -79
3324g9PM09k75K97l41J30N2j09l2q8P9k8r9J98L2j84LL93k55j86n9J09n0J20M11
$$ -79 -72 337 62 359 18 148 200 91 59 -29 50 22 -77 121 153 -31 -28 365 110 -76 -135 -26 -76 44 455
3349D55l79K2k62L23k88j2O8O50p06Q0L6J26k54K48k16L92l19r0L14R5j74k34
$$ 455 76 98 -164 159 -129 -141 -73 577 -129 -49 -13 113 -141 107 -109 283 -36 -126 188 283 109 -125
3371a25L34n1l53J36K25n8j91j4Rj01J30J78P6k10k5j9n4K05j10K58l03l12M23
$$ -125 209 158 -195 -59 166 108 -83 -97 -88 -189 -59 119 195 -15 -40 -59 -113 92 -18 240 -63 -375 48
3394D8k40K34j02m7l4K0l3M85m35m9L3L25k41l08J19L90j93j11R8m0j5j3K19K30
$$ 48 -192 42 -60 -107 -141 -121 -154 331 -104 -153 -120 205 -36 -344 -225 165 -28 -139 -41 -81 -96 -109 110 340
3418C40n44J98J71k60jk4L55l05k01J43J9J44l33n5K08j11J63J67p4j73J85q7
$$ 340 -204 -6 165 -95 -96 -120 235 -70 -271 -128 -109 35 -298 -353 -145 -256 -93 74 0 -173 12 -75
3440g5J38l7J38r7K11l72K83k07L3l2R1J34k90rK16k55J63J34j3k93K59k37J18
$$ -75 63 26 164 67 278 -94 189 -18 15 -17 74 208 -82 -91 125 -130 33 167 154 -139 120 -117 1
3463Ao9M7j25K79K70l27P1j70r8J37J1q4K89r4o4j03J32K51k79j27l0R2j04O1
$$ 1 -68 -21 -146 133 403 76 147 -23 -121 16 27 -57 232 138 74 -29 103 354 75 -52 -82 10 -94 -33
3487c3LK73j57j46n2J93R8l31L62q6l60L78j69j42J47J18O7j15l98M30j46R2m8
$$ -33 -30 243 86 -60 -112 81 179 -152 210 124 -236 142 -27 -169 -22 96 163 48 -350 80 -66 26 -22
3510b2J26J0k72O5M2K53m20J24l7l2J81j37K95l11j71M16m73P3J0M14J0q0j17
$$ -22 104 114 -158 -93 -51 202 -218 -94 -131 -163 18 -119 176 -135 -306 110 -363 -290 -280 134 144 64 -53
3533e3j82K18r8J15L03l82L19j75k00l38O50j32j03k8n8K59O2k63K48r5P7L3l33
$$ -53 -235 -17 -115 0 303 -79 240 65 -135 -473 177 45 -58 -86 -144 115 177 -86 162 67 144 177 -156
3556a56J92k51J36K14j12k99L47k7j43j62N03k96r9M7J77q3j21J89j80M1J91k66
$$ -156 36 -215 -79 135 23 -276 71 44 -99 -261 242 -54 -153 -106 71 -12 -133 56 -124 -83 108 -158
3578a58J51k38J61L31n3j92P4L39l61k34K59J69j57k32M50o1j35j56K56l07j73
$$ -158 -7 -245 -84 247 194 2 76 415 54 -180 79 248 91 -141 309 248 113 -43 213 -94 -267
3599b67O35k00R5l40K8J44jl62K44n2M5K40j31J89m93J42M07n42K48k03Q6M6j89
$$ -267 368 168 263 -77 -49 95 94 -268 -24 -76 -31 209 78 267 -226 -84 323 -219 29 -174 -88 -42 -231
3622b31M39l09J99M8J55j13j34p6L1k3k27K57O8q2o6L32j20q2k48J14J39k31n6
$$ -231 208 -101 98 146 301 188 54 -22 9 -14 -241 16 84 2 -64 268 148 66 -182 -68 71 -160 -216
3645b16J97mj12J84K37l93J47J55r4j42j25L24m10K03p5L9J18k04Q8J38j3k18
$$ -216 -19 -23 -135 49 286 -107 40 195 101 -41 -166 158 -252 -49 -124 -85 33 -171 -83 55 42 -176
3667a76M34l18J40k69N03n63L37j85O7m0L9n1K41l18J49l1k86M31l63L74J02l22
$$ -176 258 -60 80 -189 314 -249 88 -97 -30 -70 -31 -82 159 -159 -10 -41 -327 104 -259 115 217 -105
3689a05l3N1K70p2j22l1L85n99J25J55j67P0j47J36j74J52pL93l29j51M70l56
$$ -105 -138 -87 183 111 -11 -42 343 -256 -131 24 -143 -73 -220 -84 -258 -106 -113 280 -49 -200 270 -86
3711h6j92R0l3L04l02L2J16L4j50K63J9j40m8K36p6k18J32J1O8n2J22j43j22J29
$$ -86 -278 -188 -221 83 -219 -187 -71 -37 -187 76 95 -45 -93 143 67 -151 -19 -8 60 8 130 -13 -135 -6
3735fm9K20m69rN32k64pp1L68k78J15j37K29m52K00J27j08j18J5JM46l38R4J35
$$ -6 -55 165 -304 -313 219 -45 -52 -123 245 -33 82 -55 174 -278 -78 49 -59 -177 -162 -161 285 -53 41 176
3759A76l28L03nr4k29j27M60j52j80L66l66K65k22N5Q6Q8n47L53M53k65j03M0
$$ 176 -152 151 146 52 -177 -304 156 4 -176 190 -176 89 -133 -78 8 96 -451 -98 355 90 -13 27
3781B7M7j14K05m70L53k01l53M08N2m24L70K12r2lJ70q5l3J38j19j22K29l17J44
$$ 27 74 -40 165 -305 48 -153 -506 -98 -46 -470 -100 112 20 17 187 102 69 207 88 -34 195 -122 22
3804B2k5J0J1j96oK99J07k51j7o9J41M3L4j52K37l40k1RK13j13k71M21R8O9l94
$$ 22 -3 7 18 -178 -184 115 222 -29 -46 -115 26 69 103 -49 188 -152 -173 -164 49 -64 -335 86 184 253 -141
3829a41M9J36j58Q9J02Q2m8q3j30K3%L57k88j63J47J10j53M0P2J6lJ87n10L16
$$ -141 -92 44 -114 -25 77 159 111 28 -102 -79 -79 278 -10 -173 -26 84 -69 -29 43 59 56 243 -267 49
3853D9L6J42m6p1k89j82M56K9j35Lq7J3k50K60K31k31R8J8K88j60j85K5N5o9K03
$$ 49 85 227 181 110 -179 -361 95 124 -11 -8 -95 -82 -332 -72 159 -72 26 44 332 172 -13 12 67 -2 201
3878B01l34J97m41M24K88o82N33j07L10l70j29M45l15J90j24k29Q5J97k22K15
$$ 201 -133 64 -377 47 335 -347 186 79 389 19 -110 335 20 210 86 -143 -58 139 -83 132
3898A32j53j20N32j56k39k66J54K48l48j53N83k40Q7j89O5Q2k29l7L23j52J10
$$ 132 -21 -141 391 235 -4 -270 -116 132 -216 -369 214 -26 61 -128 -63 19 -210 -247 76 -76 34
3919C4l1Q9j85J04q9Q6O6l32J89L9j52LJ90k0j59K07k73M25j57Q2j53q3K70o8
$$ 34 3 92 -93 11 -78 8 74 -258 -69 -30 -182 -179 11 -9 -168 39 -234 191 34 116 -37 -120 150 82
3943H2J26l46nK63j92j37L15J54k00j07k5Mj32K11K70m18P9M3p8P4l40N01J29
$$ 82 208 -138 -143 120 -72 -209 106 260 60 -47 -72 -68 -200 11 281 -137 -58 -15 -93 -19 -359 142 271
3966B71m75O9J51K40l66j15J92K79k12j03K00j24l74K48K15KJ01K34k19o8m70
$$ 271 -204 -135 16 256 -110 -225 -33 246 34 -69 131 7 -367 -119 96 98 199 433 214 146 -324
3987c24K14J1J56j4l04L40p1J04Q3r6j9%j57n8J99J90k85j9J60k08Q9r2P8K39
$$ -324 -110 -99 57 43 -261 79 8 112 195 99 80 80 -77 -135 64 254 -31 -50 110 -98 -9 -101 -23 216
4011B16l34p0Q2j2l4L29m4k30QK85k26j7J4K4j09L3N4N7m1k66L05rl7k2k69L79
$$ 216 -118 -188 -106 -118 -152 177 133 -97 -89 196 -30 -47 -33 -9 -118 -85 -31 26 -15 -281 24 15 -22 -44 -313 66
4037F6r4j81K27K1j1n16M52k1K9j24J99j03J02j97K30L7l38J53j57K31J6m01K77
$$ 66 -28 -209 18 39 28 -488 -36 -57 -28 -152 47 -56 46 -151 79 116 -222 -69 -226 5 21 -380 -103
4060a03O1J59k71p2j03N59k55M2j48M7J85j70J0J57j79l23O4M89P3k65j52P6o7
$$ -103 -42 117 -154 -226 -329 230 -25 17 -131 -84 101 -69 -59 98 -81 -404 -340 149 222 -43 -195 -119 -186
4083a86K46J85j86n4J74j85mn5p2O7J34j17J4J79k79J57j24J90J92l08J35J58
$$ -186 60 245 59 5 179 -6 -10 -65 -137 -70 64 -53 -39 140 -139 18 -106 84 276 -32 103 261
4105B61m27j9K36K1j3K04ol51P3K49m15k2K32M1l43R5J31K57l19J20L9J95l17
$$ 261 -166 -185 51 72 59 263 257 -94 -21 228 -187 -209 23 64 -279 -184 -53 204 -115 5 44 239 -78
4128g8k5Q8N7J46k01J47k48nN8K49r3k8J92n7k70j54Q2K42k9j42J99j67P2o3K01
$$ -78 -103 -15 42 188 -13 134 -114 -119 -61 188 95 67 259 202 -68 -222 -140 102 73 -69 130 -37 35 -28 173
4153A73J07m17N6K62K1l92K6M00k59o1L63j87l81M40j95J04k79J52K0J65J67l31
$$ 173 280 -137 -81 181 202 -190 -164 236 -23 -84 279 92 -289 151 -44 60 -219 -67 -47 118 285 -46
4175d6k3J13m7j10J91m0j49L48l9l99L24r7P6k71K73j17L80p33L12J18j60L3K73
$$ -46 -69 44 -3 -113 78 38 -111 237 198 -201 123 26 102 -169 104 -13 367 -366 -54 64 -96 -63 210
4198B10j31j86L4J08j02j15J06J11K82m51j21L39j73k83M33r3O3j55K16p0M6n
$$ 210 79 -107 -73 35 -67 -182 -76 35 317 -134 -255 84 -89 -372 61 -32 31 -124 92 22 68 63
4220F3n3m5o7J55k19L22k34J36l19J05J78J15k16l14N54J6l86j87M10J73j01l05
$$ 63 10 -35 -102 53 -166 156 -78 58 -261 -156 22 137 -79 -393 161 177 -209 -396 14 187 86 -219
4242b19K90K3j33p9K9O0J87k77L58k86J28j9N3k58n3O15l62j97j64L89jJ4k6k
$$ -219 71 94 -39 -118 -89 -29 158 -119 239 -47 81 62 115 -143 -196 419 57 -140 -304 85 84 98 72 70
4266G0O9K8q3J8O6p4q1J45j58R0M7k97P2K55j81J1k4p3J23m3k03K08J01k87k6
$$ 70 139 167 84 102 168 94 13 158 0 90 137 -160 -88 167 -14 -3 -27 -100 23 -20 -223 -15 86 -201 -227
4291b27K30K61k75j41J04j1k6k14M05n6k42o7L79j40jK1l4L0Pp0K81k09N6j12
$$ -227 3 264 -11 -152 -48 -59 -85 -299 106 50 -192 -259 120 -20 -21 0 -34 -4 3 -67 214 5 61 -51
4315e1j0J8J20J32j50n1J85pm27K48M5j52J31m6k7p6j75L72J91j31m76Q5J07M7
$$ -51 -61 -43 77 209 59 8 193 186 -241 7 52 -100 31 -15 -42 -118 -293 79 270 139 -337 -252 -145 -98
4339i8n8m1L3J70k21K40R7l31K19N6j21j16j23L79J0p2K33m09l10L53P1Q9j52
$$ -98 -156 -197 -164 6 -215 25 122 -209 10 66 -55 -171 -294 85 95 23 256 -153 -463 -110 -39 50 -102
4362a02P5J38k13L15j00J70j65ok7J4r0QK24j44Q6k40J83j39n5L33j27j99j18
$$ -102 -27 111 -102 213 113 283 118 112 85 99 9 17 241 97 183 -57 126 -13 -68 265 138 -61 -179
4385a79K77K96l31M7Q1j57k39L71m1l31J04p5L40k37L4J49l72K96J82j54n7j1
$$ -179 98 394 63 110 191 34 -205 166 125 -206 -102 -177 163 -74 -40 109 -263 33 215 61 4 -7
4407gj12K83o3j78K00l22j7L18M9l73J7M54k58l8j29R0n0J01j13J14p4J60n7J84
$$ -7 -119 164 101 -77 123 -199 -216 102 151 -222 -205 249 -9 -47 -176 -86 -136 -35 -148 -34 -108 52 -5 179
4431A79p6j82J00J41l5j67j54J96J05K8j49R1j02k7J20J27m96J38j98K51J81k19
$$ 179 103 -79 21 162 127 -40 -194 2 107 135 -14 77 -25 -52 68 195 -301 -163 -361 -110 71 -148
4453a48L18m05M6m2M06r8j95L19j20k38K57M7j72n1m3j22K43Qj70J88J68j14j04
$$ -148 170 -235 -189 -231 175 77 -118 201 81 -157 100 147 -25 -76 -119 -241 2 10 -160 28 196 82 -22
4476b2J43k7P2q5k44J20p2K87j51m3K32j38J1k88J78n4j38J23J28K59m43K12K6
$$ -22 121 94 166 81 -163 -43 -115 172 21 -22 210 72 83 -205 -27 -81 -219 -96 32 291 -152 60 86
4499H6k01O5K4M9k56K28J22k05j01M64m83J33L8k7J82k25%j36N93l61j14O8L9
$$ 86 -115 -50 -26 23 -233 -5 117 -88 -189 275 -208 -75 -37 -64 118 -107 -107 -243 350 -11 -125 -57 -18
4522a8j8R6j00Q2j64R0L3j2N8j12J74l68L87j80L34l20J41J24j20J07l29J69j91
$$ -18 -36 60 -40 42 -122 -32 1 -11 47 -65 109 -259 128 -52 282 -38 103 227 107 214 -115 54 -137
4545a37M15j55k5j18J38k9k92J14M6p4J73p4J16m4P0j02r5M33l72q3J4K02j95
$$ -137 278 123 98 -20 118 89 -203 -89 -43 -117 56 -18 98 54 124 22 -73 360 -12 -95 -81 121 -74
4568g4O3K19k78K41j29O6p6J46j3j96j61N4MK98l35P2K34k47K81j46K07K3m15
$$ -74 -11 208 -70 171 42 108 32 178 165 -31 -192 -138 -134 164 -171 -99 135 -112 169 23 230 253 -162
4591a62Q8J91R5N1k10j98J58N9q2N2M8l24K41o8j72L78j6o2K1RJ51k15k4J51n0
$$ -162 -74 117 212 263 53 -145 13 72 -10 42 90 -234 7 -61 -233 145 129 67 88 97 248 33 9 160 110
4616A10l2l82L48Oj00j35K56P4l39J91R5k84R1L29j60k37K57J31n0k25k4J76L6
$$ 110 78 -304 44 50 -50 -185 71 145 -194 -3 92 -192 -101 228 68 -169 88 219 169 -56 -80 96 132
4639A32q9l44N45j7j04p3k77K64j60M79k75J23l83K60k53O1K63j34P3j38K01l6
$$ 132 43 -301 244 227 123 50 -227 37 -123 356 81 204 -179 81 -172 -111 152 18 91 -47 154 118
4661A18j2j1j35Q0n1O0k20M64n0k88J52l57L29q1R5j63J24k45L32j56j73K41J87
$$ 118 106 95 -40 40 -11 49 -171 293 243 -45 107 -250 79 -2 93 -70 54 -191 141 -15 -188 53 240
4684B40l24J95n3k64K42Jj23K3K00k8j44N3N7k29K88J06l66j13K25OK34L8k89
$$ 240 -84 111 58 -206 36 37 -86 -63 137 109 -35 18 75 -154 134 240 -126 -239 -14 -8 226 264 -25
4707b5l6J35r1J66N9m41o8L85k2j56r4J05K15Qp3j99L20p1j24k8M1o1j7j62L07
$$ -25 -61 74 -17 149 208 -233 -301 84 62 -94 -188 -83 132 140 67 -132 188 117 -7 -35 6 -55 -72 -234 73
4732G3k00nQ6j77J13j13K49m4j33M7L33j73j9l7J20q7N6p8N8j49L05p8k41q8J99
$$ 73 -127 -132 -46 -223 -110 -223 26 -18 -151 -104 229 56 37 0 120 33 89 11 69 -80 225 147 -94 -182 17
4757A7k8O8j99m5N38l24k16Q9J43l79K42L15k75j89P1J55Rj04J07J25j02k58O4
$$ 17 -11 57 -142 -187 351 27 -189 -100 43 -336 -94 221 -54 -243 -172 -17 -8 -112 -5 120 18 -240 -176
4780a76K98j11%J10K7j30l08N41n09J62K57N3k92j8J02J37j94J20m8k4J96l93
$$ -176 122 11 11 121 148 18 -290 251 -258 -96 161 214 -78 -96 6 143 -51 69 21 -3 193 -200
4802b00K37lj54K92M9m04K35L8j64L24l45J11q8J0j27J82q9K6Q8m7k7k06L58j96
$$ -200 37 34 -120 172 221 -183 52 90 -74 250 -95 16 -72 -62 -189 -7 -96 -70 18 -29 -56 -262 96 -100
4826a00J23Q6j08j55L45k03K84l29L6J25r5k1m8J9l8J3n9J74R1j91K97j44j31
$$ -100 23 109 1 -154 191 -12 272 -57 -21 104 9 -12 -60 -41 -79 -66 -125 49 140 -51 246 102 -29
4849b9M0j91L04k23K13p1J18k11K57j32J22l48l8J16L40l38K03j52l1J63k66K35
$$ -29 11 -180 124 -99 114 43 161 -50 207 75 197 -151 -189 -73 267 -71 132 -20 -51 112 -154 81
4871H1j72r9J41J56j96J1L57l90K8l8j06J58k79L49M2Oj96L21k05J6m6J73k23
$$ 81 -91 -190 -49 107 -89 -78 279 -111 -83 -121 -227 -69 -348 1 43 49 -147 174 -31 -15 -61 112 -111
4894a11m5R0J1j9p0L85k94k6P8J95L16m29j65J07J30l34L33j19j38J6J24M1R2
$$ -111 -156 -66 -55 -74 -144 241 -53 -79 -1 194 510 81 -84 23 153 -181 152 33 -105 -89 35 76 168
4917A68k60P0r5O1p5J86%k25J65j76K78l77O83l85j88L30k91K96j88j25K59p5
$$ 168 -92 -22 -117 -56 -131 55 55 -170 -5 -181 97 -280 403 18 -170 160 -131 165 -23 -148 111 36
4939C6N4j56K03Q0k71J32l7r1n3k39M38j78J22j11J00k10P5q5L20J40j80k82K06
$$ 36 90 -66 137 217 -54 78 41 -50 -103 -342 96 -82 40 -71 29 -181 -106 -191 129 269 89 -193 13
4962A3N4k60O2O4L4Q1k33L7k9K59p7j60K00m5J56k53L45n03K80J60K29n56J77
$$ 13 67 -193 -131 -67 -33 48 -185 -148 -177 82 5 -155 45 0 156 -97 248 -255 25 185 414 -142 35
4985C5j9P2j17L2o6J71J29l71K62J43j76P4k34K29j33j95K28J04rl57K99k84p4
$$ 35 16 88 -29 3 -63 108 237 -134 128 271 95 169 -65 164 31 -164 64 168 159 -198 101 -183 -257
5008b57L30J31l66mJ88Q7Jj07Q1q3j75M40j2j54j4m1j69q1K07K1j26K1K79j18
$$ -257 73 204 -162 -166 22 109 110 3 84 1 -174 266 254 100 86 45 -124 -205 2 23 -103 -82 197 79
5032G9J13k83J99O3k2m18L37q0J09j6j53K31j83k28K02p8J15K5J11j40R3j7l35
$$ 79 192 -91 108 171 149 -269 68 -12 97 81 -72 159 -24 -252 -50 -128 -13 12 123 -17 76 59 -276
5055b76J68k7K52k84K1MN3J98ml62J04j4L80Np7k68J01O2J97k13r4J88k64k9K31
$$ -276 -108 -135 117 -167 -146 -142 -89 109 105 -257 -153 -167 213 218 141 -127 -26 36 233 20 -74 114 -150 -179 52
5080E2O1Q2k21oj09K95p1q9j2p2K17r2j06n4j05K31J51n91L68J22o0p5K04Q0M5
$$ 52 113 195 -26 -32 -141 154 83 -6 -18 -90 127 35 -71 -125 -230 1 152 -439 -71 51 -9 -84 120 200 245
5105B45l17k8J55l41J21J97J85j19k10L07j8l01j3J16j4J8QK03k21k2L20o1l77
$$ 245 -72 -100 55 -286 -165 32 217 98 -112 195 177 -124 -137 -21 -35 -17 -9 194 -27 -49 271 210 -167
5128a67K37K00k43J95l52PJ57l11M23j93J77k53J97N0j29J19ln9j65J86j65J76
$$ -167 70 270 27 222 -130 -123 34 -277 146 -47 130 -123 74 124 -5 114 111 52 -113 73 -92 84
5150H4k02K84k61J42Q7r8r8J96K47k15j48j21L06l43q6L72l31M80k97k8j40L07
$$ 84 -118 166 -95 47 134 36 -62 134 381 166 18 -103 203 -140 -226 146 -185 295 -2 -30 -170 137
5172A37q2O9j16j22J32N1m9j3j21r5J60L5j79O44l21k97n8K50M9l21J77J46j25
$$ 137 55 124 8 -114 18 69 20 7 -114 -209 -49 -14 -193 451 130 -167 -225 25 74 -247 -70 76 -49
5195d9o9%n5L19k89J25q1j54J85J88l41J16L00J4k53m3J19R9ql46K31j1j95K30
$$ -49 -118 -118 -173 146 -143 -18 -99 -253 -68 120 -221 -105 195 209 -44 -87 32 131 123 -223 8 -3 -198 32
5219C2rj33pJ65P0j36K57j48O8l40K30j05M5K83l47O2j94kL86M1k75p6J33j01
$$ 32 23 -110 -117 48 118 -18 239 91 159 -181 49 -56 -11 272 -75 -13 -207 -209 177 218 -57 -133 0 -101
5243a01o6K34P3n8q4J39j54J4K1k60L89l07l8M87l07J94l60K3k2k0M24k79K02
$$ -101 -167 67 140 82 -2 137 -17 -3 18 -242 147 -160 -198 289 -18 176 -184 -161 -183 -203 221 -58 144
5266A44j77l2J01N0j08m4K19j66l44L56J48k18R7R9n0r8j04J37l28L62j5jj82
$$ 144 -33 -65 36 86 -22 -66 153 -13 -357 -1 147 -71 26 125 75 -23 -127 10 -318 44 29 28 -154
5289a54Q4J35j78k1K45p2P9j09Q5P1l7L6m94M07r2NJ30j68p7L12j52r9j13L74
$$ -154 -70 65 -113 -134 111 39 118 9 94 165 128 164 -330 77 -15 -10 120 -48 -125 187 35 -64 -177 197
5313A97M4k56J31J76k14q5q1l9l4k2M51l5j75J10j72p8k04M35o0j51k38M76j4
$$ 197 241 -15 116 292 78 -7 -88 -127 -161 -183 268 233 58 168 -4 -82 -286 149 89 -62 -300 176 162
5336A62l55k9L67o7l33M48q6k54L71l22NK82p4r7L1k42K7j59M65k05j18J88K35
$$ 162 -193 -222 145 78 -255 193 107 -147 224 -98 -93 189 115 18 49 -193 -166 -325 140 -65 -183 5 240
5359B40j51j14mk4P6O7l15O11m43K3n2L11k12l8P4j80J18J08j08j27K95k33l5
$$ 240 89 -25 -29 -53 23 90 -225 386 -57 -34 -86 225 13 -25 49 -131 -13 95 -13 -140 155 -78 -113
5382a13J6K4K96j33j03j72N0K83j27K5j52J37PJ8j08j07L14j86j33O4N8o4J65
$$ -113 -97 -73 223 90 -13 -185 -135 148 21 46 -106 31 38 56 -52 -159 155 -31 -164 -100 -42 -106 59
5405E9l15L36m0Q4r8l4j67J75P%J46k90lQ4J69p7J22l7J23K1K2k33R2k45J67j3
$$ 59 -256 80 40 124 26 -8 -175 0 7 7 153 -137 -140 -56 113 36 158 121 244 265 287 54 146 -99 68 55
5431E5K10k25Kj8J19po3k18J01l7K26l73J68J52k2j58K20r1k95K33K9j35n6j64
$$ 55 265 40 42 24 143 136 73 -145 -44 -81 145 -228 -60 92 70 -88 132 41 -254 -21 8 -127 -183 -347
5455c47N26j30k35MJ87L23m05j7K00j02L4j94M04l59J37Q9o5j31M40m58J15l42
$$ -347 179 49 -186 -182 5 328 -77 -94 106 4 38 -156 248 -111 26 115 50 -81 359 -99 16 -326
5477c26K50L64j25j82N9j30n6L50k75J37j75J60p7K15j00j94L13j62J85j57m5
$$ -326 -76 288 163 -19 40 -90 -146 204 -71 66 -109 51 -26 189 89 -105 208 46 231 74 29
5498B9M4M3k59L16n1l58M26j15l19K4Q4L34j91L3L7q3Q6J96l10k50K97K09j62
$$ 29 73 116 -143 173 122 -236 190 75 -244 -220 -136 198 7 40 77 -6 80 276 -34 -284 13 222 60
5521F0j16j18R4J84J54j39j03J30k64K31kk10J84p3o3j73K87j89K89k28J42J44
$$ 60 -56 -174 -80 104 258 119 16 146 -118 113 111 -99 85 12 -51 -224 63 -126 163 -65 77 221
5543B21n8l36J63r0j15L26k33K89K32l14L0k37j38L70K13k09k03M0L61m22J20
$$ 221 163 -173 -10 -100 -215 111 -122 167 399 85 115 -122 -260 110 323 114 -89 -49 312 -110 10
5564A0K64k15J15j63J8M15m24J42k59k42M43l69K1r3o7N20k74J06k01L47k53J22
$$ 10 274 59 174 11 29 444 20 162 -97 -339 104 -265 -244 -337 -404 116 -158 -52 -253 94 -159 -37
5586c7J40j12o8J70r0j27M7L88l64K57j69m4k7j44L98k87j4N9j9O8K64m36K36
$$ -37 103 -9 -77 93 3 -124 -77 311 -53 204 35 -9 -36 -180 218 -69 -83 -24 -43 25 289 -147 89
5609H9m1k9j51L10n2p0j62q6N7K04k54J52N7N7j1j34K95k72J2q7R1J34k32K36
$$ 89 48 19 -132 178 126 56 -106 -192 -135 69 -185 -33 24 81 70 -64 231 -41 -29 -116 -25 109 -123 113
5633A13k96K28J02j03m10M16K2k72j24J69J28Q5J00j52J25q0q2j03M1K2J10j4
$$ 113 -183 45 147 44 -366 50 72 -200 -324 -155 -27 58 158 6 131 51 -31 -134 -93 -71 39 25
5655B5j65mK17K67k69j11o2K04Q6Pk15j49K94L2m65J91K13J64k71p8M7j05J22
$$ 25 -140 -144 73 340 71 -40 -102 102 188 195 -20 -169 125 157 -308 -117 96 260 -11 -89 -42 -147 -25
5678b5J79l09o6K94k99O1O7K41j40p6K4J6k40K04L1l8m6J63J93l68M2K79N3l6
$$ -25 154 -155 -221 73 -226 -165 -98 143 3 -73 -49 -33 -273 -69 -38 -76 -122 41 234 -134 -92 187 240 204
5702B04k15J0J38j66J63j05K9j11q9J6PJ17J5L34o12K16J27o2r6K69m43M05j61
$$ 204 -11 -1 137 -29 134 29 58 -53 -142 -126 -119 -2 13 347 -265 -49 78 16 -80 189 -254 151 -10
5725a0O2r2n6p6J25P8m2N7k17K41l86K06J10p8k7k35O60m28K47l5j57k6rqJ41
$$ -10 52 -40 -96 -172 -47 31 -11 46 -171 70 -316 -110 0 -78 -105 -340 320 -108 139 104 -53 -79 -88 -96 45
5750D5j92J15L23l98k7R6q9j56J54J92l2j10PJ96k38nl2J47J15k15rN7q4k71N93
$$ 45 -147 -32 291 -107 -134 -38 -127 -283 -129 63 31 -79 -72 124 -114 -119 -151 -4 111 -104 -113 -56 -140 -411 182
5775A82J44l60N5J92rj39O4q2R3l59J01RM1N1J3r0m31L55J61J13k38r5J91L4l4
$$ 182 326 -34 21 213 204 65 129 47 140 -219 -118 -109 -68 -17 -4 -94 -525 -170 -9 104 -134 -229 -38 -4 -38
5800c8j34L48J6k46J94m04J41K65k84K75O7k74J27o6j74m6L23r0q3J91l22N81
$$ -38 -172 176 192 -54 140 -264 -123 142 -142 133 200 -74 53 -13 -187 -233 90 0 -83 108 -214 367
5822C67m52K0K74j94o2q5K34p0l2j94J92j53oJ12O2j62J4J32q8J35j81j4J8L24
$$ 367 -85 -65 209 15 -47 -132 102 32 0 -194 -2 -155 -161 -49 13 -149 -135 -3 -91 44 -137 -151 -133 191
5846A91j97j72l0J98M9J02k85N0J2j7J51k7p7q3Q2J26J20k09K44o0k77j30J08
$$ 191 -6 -178 -208 -10 39 141 -144 -94 -82 -99 52 25 -52 -135 -53 73 193 -16 228 168 -109 -239 -131
5869a31J53L02m27J25J82l69J14p9J68O6OQ2k01j9K1J07k04K49r4K14j97j35J21
$$ -131 22 324 -103 22 204 -165 -51 -130 38 104 110 192 -9 -28 -7 100 -104 145 51 265 68 -67 54
5892E4j37L03j75j84K3K61k44R0k2j19J45j42K8K03j31J65j85P6J61k33Q4k70
$$ 54 -83 220 45 -139 -116 145 -99 -9 -31 -150 -5 -147 -119 84 -47 118 -67 9 170 -63 21 -249
5914b49L10j70j9j5L8k29L29L6RN6j51J45j19k19N29k79l08M18j23J6J40k72q9
$$ -249 61 -109 -128 -143 -105 -334 -5 31 40 96 -55 90 -29 -248 281 2 -306 112 -11 5 145 -127 -216
5937b16L48q8j2j59N13k46j94j22R3K8K13j79j01k5K41q1k81K17K77l85L15p1
$$ -216 132 44 32 -127 386 140 -54 -176 -83 -55 158 -21 -122 -147 94 13 -268 -51 226 -159 156 85
5959H5R6l44Q8lm5p8P6O9k2K21m01K54l6j06J04LK54j43K3J58m51K13k00O0R0
$$ 85 181 -163 -75 -78 -123 -201 -125 -56 -78 143 -258 -4 -40 -146 -42 -39 215 72 95 253 -198 15 -185 -125 -35
5984c5q9L05m29N4K21j48K42r7J09j20K20m66J3J98O2j14Oj0J39o8q4P5j03jO7
$$ -35 -124 181 -248 -194 27 -121 121 24 133 13 233 -233 -220 -22 40 -74 -68 -78 61 -7 -91 -16 -119 -120 -53
6009e3j67O6R2J53L6j10m9j60R1n1k5q2J31K74k22J88r5O4J43O5q2l18J48j3K08
$$ -53 -220 -154 -62 91 127 17 -32 -192 -101 -152 -177 -259 -128 146 -76 112 17 81 224 289 207 -111 37 24 232
6034B32m04J95j30J53j80L7r8K52j77L32p4L2r2j71P4J32J54k98p3L64k94K2r4
$$ 232 -172 23 -107 46 -134 -97 -195 57 -120 212 138 170 78 -93 -19 113 267 -31 -104 260 -34 -12 -106
6057a06m0J3K11P6n9J9K1J15l42k6L85j15j51m5j9N4j42J6J56k2l8nj18n3J18
$$ -106 -146 -133 78 154 95 114 135 250 -92 -118 267 152 1 -44 -63 -9 -151 -135 21 -1 -39 -44 -162 -215 -97
6082i7J21J0j46K03l08J91K49j21j03l0L6J11K4k12k00J86K49j51j71K25N6j15
$$ -97 24 34 -112 91 -217 -26 223 102 -1 -31 5 116 140 -72 -272 -86 163 12 -159 66 122 7
6104Gj0r4Q6N0Qj37j1J38n0K39j34Q5j36J12q8J97k85K75j87k07M21l49j11J96
$$ 7 -3 -97 -11 39 47 -90 -101 37 -13 226 92 177 41 153 65 262 -23 252 65 -142 279 -70 -181 15
6128A5j83J41R6l3k39K9r7K42o5j9P0O8l08K43RrJ09Q8j14n0q6K1o8R3M9j10K49
$$ 15 -168 -27 69 36 -203 -174 -271 -29 -94 -113 -43 25 -283 -40 -31 -40 69 157 43 -7 -93 -72 -140 -47 2 -108 141
6155A41k60Q4j17L63j68j02n9M2j8M7K19q9j42j6K81m94N47l34p1L6L09l50K4
$$ 141 -119 -35 -152 211 43 -59 -118 -76 -94 -47 172 83 -59 -75 206 -288 259 -75 -146 -110 199 -151 -127
6178a27K54k07J30m6l73L40K24k09q5J60k44L30J53j28j08k31J06n1Q0O2k2M3
$$ -127 127 -80 50 4 -369 -29 195 -14 -99 61 -183 147 300 172 64 -167 -61 -112 -32 30 8 51
6200E1R1j40K9j82J20l5j5m9p9j60M45m7j20M5J10m0M2j83L72j94N7k10J41R5
$$ 51 142 2 31 -151 -31 -66 -81 -130 -209 -369 76 29 -91 -46 64 24 66 -117 255 61 118 -92 49 144
6224A44o4Mj16k04K44R8l83K18m0M99k10m03O2L80j96n3k16K43J51j26J42j97
$$ 144 80 84 -32 -236 8 106 -277 -59 -99 400 190 -213 -151 229 33 -20 -236 7 158 32 174 -23
6246b3O8qpP8j70Oj0K55J8j17L6n46M99j49J44l8j53J59r9K85l49J58r3J56l39
$$ -23 45 37 30 108 -62 -56 -66 189 207 90 126 -420 79 -70 74 36 -117 42 -57 228 -121 37 -56 100 -239
6271b39M0L26l26K80j40oNL92k07n3M1j13j05J13K58l34j65L89l74K07oj8J98
$$ -239 -199 127 -199 81 -59 -65 -60 332 125 72 113 0 -105 8 266 -68 -233 156 -218 -11 -17 -35 163
6294A63j01j45M5R7j12k9L2q9K93l51L63j13k39J87r9L42j70j03J52l13n6M34
$$ 163 62 -83 -38 59 -53 -82 -50 -139 154 -197 166 53 -186 1 -98 244 74 -29 123 -190 -246 188
6316A88j56m41M82M0O5r8k46K78l2q7j2m8j20K38m5P9q6n0J04o4L44m68nQ0K6
$$ 188 32 -409 73 113 178 80 -166 112 80 -7 -19 -67 -187 51 6 85 -1 -51 53 -11 333 -135 -140 -60 -34
6341c4K87l65m8q1KK93o8k7Q5m1l69K64K68M0n6K9k61q6K07l3k67M23m02L28k0
$$ -34 253 -112 -160 -241 -239 54 -14 -41 44 3 -366 -102 166 206 150 179 -82 -168 39 6 -261 162 -240 88 68
6366F8J71m01K51k79J77k37L7M1J74J6j67J89m5K71m07j15O77m02j12K77n64M85
$$ 68 239 -162 89 -190 -13 -250 -213 -172 2 18 -149 40 -5 266 -141 -256 421 19 -93 184 -380 105
6388A05l20K47O8j44O0J0j08J51j78J8J60p7j00r5J96J3O6j75J14l60K26Q8l4
$$ 105 -215 32 100 -44 16 26 -82 69 -109 -91 69 -8 -108 -203 -7 6 72 -103 11 -349 -123 -35 -69
6411f9L2J84q9q2j88K58M2j57k00K03J35m2Q5J03l62O48l77l30L02k68J36J38
$$ -69 -37 147 58 -24 -212 46 88 -69 -269 -66 69 27 112 215 -147 501 124 -206 96 -172 -36 102
6433A02J18j32J90j95j96j21L73n9p8K8j11J06j33R6m6K55j24r7K50l36j3J95
$$ 102 220 88 278 83 -113 -234 139 80 2 30 -81 25 -108 -12 -58 197 73 -24 226 -110 -123 72
6455G2k66J23K98q4k22J16j29J29j80Q1j33J44k70M12q5L41o93K72L93m28J60
$$ 72 -194 -71 227 143 -79 37 -92 37 -143 -62 -195 -51 -321 91 6 347 -346 -74 319 -109 51
6476E1M2J89k90l2K48K2k31J09m0k08N9R2K72k95j27R4r2K13k8k51K11K06l55
$$ 51 93 282 -8 -40 208 230 -1 108 68 -140 -81 11 283 -12 -139 -45 -137 76 48 -203 8 214 -141
6499a41K92k04J57n3J56k16K3l0K6Q7j15L5kj83P3J40q5J09m1Nl7q8J96l13J79
$$ -141 151 -53 104 51 207 -9 14 -16 10 97 -18 17 15 -168 -95 45 -40 69 28 33 -4 -92 104 -209 -30
6524c0J63p2q4K50l18j34K25j46K03kk68J51j25J81n1J76j94M19m39N6O7J86O
$$ -30 133 61 -23 227 -91 -225 0 -146 57 55 -213 -62 -187 -6 -57 119 -75 344 -95 -39 28 214 220
6547B20l42J2j57M2K45RR1j67j72M9L33k29J80k14J47j87M34k06m54O39k28l08
$$ 220 -122 -110 -267 -225 20 29 120 -47 -219 -170 163 -66 114 -100 47 -140 294 88 -366 273 45 -263
6569b63L71lK8k07RM8l0j15l3M41j30k16J66k46J60J18q9k3k81M3L51j53K2j75
$$ -263 108 105 133 -74 -65 -17 -47 -162 -195 246 116 -100 66 -180 -20 98 9 -14 -295 -252 99 -54 -32 -207
6593b07M43j7k38J11n0k8M2n0J1l07J73L2O2K75m02L31K7n4k67J13O6m5m0J51
$$ -207 236 219 -19 92 42 14 56 6 17 -290 -117 -85 -23 252 -150 181 208 154 -113 0 66 21 -19 132
6617A32k43J13m5J71K7k63j30L74j81L4J11M0M9k57J01k4j13M4j75K82J98j83
$$ 132 -111 2 -43 128 155 -108 -238 136 -45 -11 100 140 189 -68 33 9 -104 -60 -235 47 245 62
6639F2q7mJ5J76o9r4q8l0M58l42l9N5j10K14q9j20L74l79J1o2K53k58J77Lk31
$$ 62 -25 -29 -14 162 93 -1 -89 -119 339 -3 -42 13 -97 117 28 -92 282 -97 -86 -148 105 -153 24 27 -204
6664b04J41O9Q7j72J06J45k91P7R3m5o3J64j80J71j52k5J38k14J88m5l9k07L29
$$ -204 -63 6 93 -79 27 172 -119 -42 51 6 -57 107 -73 98 -54 -79 59 -155 33 -12 -51 -258 71
6687G1Pl06N04l05O5M5k37J44J44l9j49R6R4k56J84J79l99J23o4J09M7P5J04j49
$$ 71 78 -228 276 -29 36 81 -156 -12 132 93 -56 40 134 -122 62 241 -158 -35 -99 10 57 132 236 87
6711H7K5k17M16m45K09J67l43n1K5J65k82L7j04L25O6j78q2J71K7k37L28R2j39
$$ 87 112 -105 311 -134 75 242 -101 -152 -127 38 -244 -207 -311 14 80 -98 -180 -9 18 -219 109 201 62
6734F2R1j75O2j54j3pK98k59k0L15j52j37P5k78J92J04k02Q0J76k75N5K17O8L2
$$ 62 153 -22 40 -114 -127 -134 164 -95 -115 200 48 -89 -14 -292 -100 4 -198 -118 58 -217 -162 55 123 155
6758A55j30K09p7j7j67j52M2K37l6j14o2J86r9M8J17q6k2K05j08k4QP2m4m3L6
$$ 155 25 234 157 140 -27 -179 -137 100 64 -50 -112 74 -25 23 140 54 32 237 129 105 113 185 141 98 134
6783A34j48N1J7J49m56J69l6RJ85J5l21J86j34L60j96K0J43j38J26j84J39j43
$$ 134 -14 37 54 203 -253 -84 -120 -111 74 89 -232 -46 -180 180 -16 4 147 9 135 -49 90 -53
6805e3%k71R8K88J44k64j00L57m08K13J11M0k40M38m95K61j92L8K48m71O3L23
$$ -53 -53 -324 -226 62 206 -58 -158 199 -209 4 115 155 -85 353 -142 119 -73 -35 213 -258 -195 128
6827A28l43K75p7J05Lp7K7K7r1J2J6R3q0j69K40j65k1P7m2o5M13k78l7j66N9M75
$$ 128 -215 60 -17 88 91 14 41 68 -23 -11 5 98 18 -151 89 -76 -97 -20 -62 -127 286 8 -29 -195 -136 339
6853C39l23j05J98j99N39o19L41k80K67P4l15K00o0j52Pp3K33R9k34K00j66l4
$$ 339 16 -89 109 -90 449 -170 171 -109 158 232 -83 117 57 -95 -88 -161 72 171 -63 137 -29 -63
6875f3rK1J13o9K03k78N3J46k0q9j1K44j51k41K84j84O9Jj49J35j7J6L74j79L2
$$ -63 -72 -51 62 -7 196 -82 -29 117 97 8 -3 241 90 -151 133 -51 18 19 -130 5 -12 4 378 199 231
6900B31l98L29k65K05J51k42j18P3L1M8L3k02K11J8k85Q3J83J6j47K78k50J36
$$ 231 -167 162 -103 102 253 11 -107 -34 -3 45 78 -124 87 105 -180 -97 86 102 -45 233 -17 119
6922A19kj47k18L60r1l64N79k09K42m46L0J44K75l49J53J49k0l51J59j76L32k55
$$ 119 117 -30 -248 112 21 -343 236 27 269 -177 -147 -3 272 -77 76 225 205 -146 13 -163 169 -86
6944h6l7J00J04J91j87K9L5j93j55J50P1m2j36J3q2L88l9m8J4j01Kk4K25j78M5
$$ -86 -123 -23 81 272 85 114 149 -44 -199 -49 22 -20 -156 -143 -225 163 124 76 90 -11 -9 -33 192 14 59
6969E9J05O2L9k09N0j60L73J4j76L4k44J25j0p5j2m9J57j73J22k46J45J14j56
$$ 59 164 226 265 56 106 -54 319 333 157 191 -53 72 62 -13 -25 -74 83 -90 32 -214 -69 45 -111
6992a11K78j21J15O6l23j12J94Mo4j09K78J03j56l8J29o1k54J62j05J73k36L01
$$ -111 167 46 161 227 -96 -208 -14 -10 -74 -183 95 198 42 4 133 72 -182 -20 -125 48 -188 113
7014A13OJ99m27K43j24k78K72L0J17j96o3L68k57l6J49J48k95NN9R3l10R0R7n0
$$ 113 119 318 -109 134 10 -268 4 34 151 -45 -108 260 3 -33 116 264 -31 -26 33 126 -184 -94 3 -47
7038d7N2j22J63J83m56K85j25k0j55J08K09m9r4j70K68r7J09J94l13N0J2O2m9
$$ -47 5 -117 46 229 -227 58 -67 -87 -242 -134 75 26 -68 -238 30 -67 42 236 -77 -27 -15 47 -2
7061bL2k43L5K82r3K8K69k32M6j03n1k7p3J94m9K7j9q0K5q7L41j79q0K27m42L95
$$ -2 30 -213 -178 104 11 39 308 76 122 19 -32 -59 -132 62 13 40 21 -59 -34 -121 220 41 -39 188 -254 141
7087A41k24L1L05k03j48P3O1k19rJ43M5j13R4J0k7Q4j12J31j29K73l92M5K89m1
$$ 141 -83 -52 253 50 -98 -25 36 -183 -192 -49 -4 -117 -23 -13 -40 44 -68 63 -66 207 -185 -140 149 108
7111A08q5N6n5m6l0j10N9Q2P6l16L02j1o8K0k00K77j87J69J5q1l1j6J55j78L18
$$ 108 23 79 24 -22 -52 -162 -103 -21 55 -261 41 30 -38 -18 -218 59 -128 41 56 -25 -56 -72 83 -95 223
7136B23k07n4J49j51O2J60l75J02J96j14N2J28k08P2k83L25q6J48j67m4j08J59
$$ 223 16 -38 111 -40 22 182 -193 -91 105 -9 43 171 -37 35 -248 77 -9 139 -28 -72 -180 -21
7158b1j43J24K03j76RJ24Q8q6j50L8j2k04K90R9l28Q9j29J39k51K81M6N4k9L19
$$ -21 -164 -40 163 -13 -4 120 208 122 -28 10 -2 -206 84 183 -145 -56 -185 -46 -297 -16 30 84 55 374
7182C74m19j05K64n63L56J66J18k51k16L03k63M37K5l12K1k2J2M24n43K66J33
$$ 374 -45 -150 114 -449 -93 73 191 -60 -276 27 -236 201 226 -86 -65 -87 -75 349 -194 72 205
7203B05l97K09K34k43r2J89J68n4j57j78J77J32l44K02q4K49o7l63L77q4j47k56
$$ 205 -192 17 251 8 -84 105 273 219 62 -116 61 193 -151 51 -33 216 149 -214 163 79 -68 -324
7225c24O07k69k01K81L2j62J5L7j07L41r7J52k51q3m8R7k25J69J35j20j90J22
$$ -324 283 14 -187 94 126 -36 -21 16 -91 250 153 305 54 -29 -77 20 -205 -36 99 -21 -211 -89
7247h9J97k47Oq1J77m6j51J45R9N5R3k18N7J82k10j63K67M4K04l76J44l6j89M38
$$ -89 108 -139 -133 -214 -37 -83 -234 -89 10 65 158 -60 -3 179 -31 -194 73 117 321 -55 89 53 -136 302
7271C02m41K8K0L42j64k99L78j03r7l83M80k20M8J52j27J40l7O1rp5l9j84J72
$$ 302 -139 -111 -91 251 87 -212 166 63 -34 -417 63 -157 -109 43 -84 56 19 80 71 -4 -43 -227 -55
7294e5j1q4K97j90l2K00J46J31k51j49O7Q2J59j72m87M64l77K16K13l96K20J3
$$ -55 -66 -150 147 -43 -75 125 271 402 151 2 69 151 310 138 -349 115 -262 -46 167 -229 -9 4
7316DM6k54J84K34m79P1K34J06k71K67K16n08J41OJ41j96M1R1j53N4J5R2kn8j9
$$ 4 50 -204 -20 214 -265 -194 40 146 -125 142 358 -150 -9 -3 138 -58 -17 74 -79 -25 -10 82 80 22 3
7341Cm9R4J57m77M43k29O5j07K48k51K48j33j61q3M17m6m3k53M3J11j52K47j41
$$ 3 -46 48 205 -272 171 -58 7 -100 148 -103 145 12 -149 -232 185 139 96 -157 -114 -3 -155 92 -49
7364d9J31jj99m7m0L14l4l9k20j83K72J58%p4k9L19k56J77j25j92l40M54j01l0
$$ -49 82 81 -118 -165 -205 109 75 36 -184 -367 -95 63 63 -11 -40 279 23 200 75 -117 -457 -3 -104 -134
7388a34K33j76K44j64o5j27J01mJ36K15k83J98k26n7l00K59K07j57N6J55J10p
$$ -134 99 -77 167 3 -62 -189 -88 -92 44 259 -24 174 -52 -109 -409 -150 57 -100 -44 111 221 214
7410B14j12j50K28l53K49l77K26K67l6j43j7j45R3J16j04J73k22K2O5n57N49J15
$$ 214 102 -48 180 -173 76 -301 -75 192 156 13 -4 -149 -56 60 -44 129 -93 -71 -6 -563 -14 101
7432A01l62M88l21J77l5L6M5M0l05R5J46j34J34j78J86q2J17k84K64j99Jl5K24
$$ 101 -261 227 -94 83 48 84 129 169 -136 -41 105 -29 105 -73 113 31 148 -136 128 -71 -70 -105 119
7455A19k0j65N2p8k0j78K69j87K16j77K97j46N4P1l91J57L43j67q9M05n17J36
$$ 119 99 -66 -14 -92 -112 -290 -21 -208 8 -169 128 -18 36 107 -284 -127 216 49 -40 365 -152 -16
7477a6K68m32J63l1K27j46mj04J02N3r5J44k14J17l7P2r8M2J5j27j11J09K79l20
$$ -16 252 -180 -17 -48 179 33 29 -75 27 80 -15 129 -85 32 -5 67 -31 11 26 -101 -212 -103 176 -144
7501a44K0k3o1K16J95p3j54K8O8l5r0p7J91j06L58k92k05K83j20n0J37l5J19k87
$$ -144 -124 -147 -208 8 203 130 -24 4 72 37 -53 -130 61 -45 313 21 -184 99 -21 -71 66 31 150 -137
7525a37q5K63m8l7O1j75L25l46L18L6j95k23O6K03k75L11j88p7L51j39L0L4o8
$$ -137 -222 41 -7 -44 17 -158 167 -179 139 175 -20 -243 -177 26 -249 62 -126 -203 148 9 39 73 5
7548Eq5K39q2k39J11l0K51l28K26j28j48L69j29j70M93m53J66P0q3N0j74j8M2
$$ 5 -80 159 77 -162 -51 -81 170 -158 68 -60 -208 161 32 -138 355 -98 68 138 55 105 -69 -87 -45
7571d5J35kj32m7O5j40M1k5J30J05P5k57q1K1RM27m84R8K13j41J78j40L7j63J08
$$ -45 90 88 -44 -91 -26 -166 -125 -150 -20 85 160 -97 -178 -157 -148 279 -205 -107 106 -35 143 3 40 -123 -15
7596a5K43L1k63J02j06j9m8J48J6m5Mj23K18k87K30J06n37J47J07P3J37j92jN2
$$ -15 228 259 -4 98 -8 -27 -75 73 89 44 48 -75 143 -144 86 192 -345 -198 -91 -18 119 -73 -74 -22
7620b2p8K25l41kJ81K09k92K05j66K34j26l72M24n9j11R3m3LJ06J83rk45k40K28
$$ -22 -100 125 -216 -218 -37 172 -120 85 -81 153 27 -345 79 20 -91 2 -41 -38 68 251 242 -3 -243 -15
7644a5J31l24j06M25l2m3pk28K06j09J41k28J48Q9k94K15l5K8l7j23L10j04j84
$$ -15 116 -208 -314 111 79 36 29 -199 7 -102 39 -189 -41 48 -246 -31 -66 -38 -75 -198 112 8 -176
7667a76K08k20r2K10l5M5r2J74J13k59R7jJ46j38j48k7M17j78j11K92l74M6K12
$$ -176 32 -188 -280 -70 -105 -60 -152 22 135 -124 -27 -28 118 -20 -168 -195 222 44 -67 225 -149 -103 109
7690A09m14L93J33l3l42J22Q6KL01k36j65J42o9O3L51k70k24Q4ROo6J87j51k00
$$ 109 -305 88 221 188 -154 -32 54 56 357 121 -44 98 29 92 443 173 -51 33 42 48 -18 169 18 -182
7714a82P7j64L12L5k56K33M9L2p1l6K01l19K16L8k28j28J62k27J91J9l3R2R6J0
$$ -182 -105 -269 43 78 -178 55 104 136 65 29 230 -89 127 165 -63 -191 -29 -256 -65 -46 -79 13 109 119
7738A19j81J41l36L22j07oJ64j58O1j94M0K30R2l48K52k03K36j7pl7Q1k57K8J25
$$ 119 -62 79 -257 65 -42 -48 116 -42 19 -175 -135 95 187 -161 91 -112 124 107 100 63 144 -113 -85 40
7762D0j79J10j17p1Q9L1M6qj5j8K17l13L6K19k2J67Kl28l3j48K72J59J99j88m06
$$ 40 -139 -29 -146 -217 -128 -97 -51 -59 -74 -92 125 -188 -152 67 45 212 214 -114 -147 -295 -23 136 335 147 -259
7787b59L77K11j74j71q6K70k35L8m2J02j6k3J25Q9l21K81r4q3k9J00J01j62J45
$$ -259 118 329 155 -16 -102 168 -67 -29 -71 31 15 -8 117 206 -115 166 72 -11 -40 60 161 -1 144
7810A44k35J87o5J41k95J50j62K3j3n1L6L91k88j14N3K17p3j11J14j76J29J78
$$ 144 -91 96 31 172 -123 27 -135 -112 -125 -176 -140 251 -37 -151 -98 119 46 -65 49 -127 2 180
7832A80q9l37K48j38K46k98k05P99m77O5J35lk42J14j24L30k3j71k70M54j73P7
$$ 180 91 -246 2 -136 110 -188 -393 406 -71 -6 129 126 -116 -2 -126 204 181 10 -260 194 21 98
7854I8j05K32k71lN3J22k61j99L13k47L90Kk8j20P3j47M07jm42J07P5Rj32J47
$$ 98 -7 225 -46 -49 4 126 -135 -334 -21 -268 122 124 96 -24 49 -98 309 308 -134 -27 48 57 -75 72
7878G2k16K85l01Q4J54N4k45J88q7J17j38J58l8J26j68J03j76p7L84j99L2k43
$$ 72 -144 141 -160 -76 78 132 -113 75 -12 105 -33 125 87 213 45 148 -28 -105 279 80 112 -131
7900a31l9q9J60K37Lk29K51j40P4r9N8m7J62j16l9j92J49J13j28O1K05k15N4l7
$$ -131 -170 -259 -99 138 141 -88 163 23 97 -2 56 9 171 55 16 -176 -27 86 -42 19 224 9 63 26
7924B6j50K57l57N46l48J57j47L40n45L52k22J18j30k0K70o0p5L12m84J17J95
$$ 26 -124 133 -224 322 -26 131 -16 324 -221 131 -91 27 -103 -123 147 87 12 324 -160 -43 152
7945A52k76J25j56L31k78P3J97j16j90J38QM0mK3KN8j3Kk83L35K1k31P7l2K07
$$ 152 -124 1 -155 176 -102 -29 168 52 -138 0 8 48 44 67 69 127 114 116 -167 168 189 -42 35 3 210
7970B10j4k75K02p5J55k96J80j98K59m9n2j08J78Rl55L37j29J03n2j1J35j49J19
$$ 210 196 -79 123 48 203 -93 87 -111 148 99 47 -61 117 126 -229 108 -21 82 30 19 154 5 124
7993A24l19L68p8o8k0L12k79J79l24J36o5k00M48r6j06jK13J06l52j47L72k26
$$ 124 -195 173 95 27 7 319 40 219 -105 31 -34 -234 214 118 12 11 224 330 -22 -169 203 -23
8015b3m1j7L7L5L7j31J1J42j66l5N2j60J50K29k83q0M36o0j28J12K0j67K81k52
$$ -23 -64 -81 -44 -9 28 -103 -92 50 -116 -151 -99 -259 -109 120 -163 -243 193 133 5 117 137 -30 251 -1
8039aJ67j27l9j78K11K43m07Q0k35L23j11J77l86K72K72l09l3J5k7K76j74m2k7
$$ -1 166 39 0 -178 33 276 -131 -51 -286 37 -74 103 -283 -11 261 -48 -81 -66 -93 183 9 -33 -60
8062f0L4J57l15M50k24j08J89L0p9K8m7J91j95k9J0k06J05j1P3o6M70m02J44o7
$$ -60 -26 131 -184 266 42 -66 123 153 74 102 55 246 51 22 32 -174 -69 -80 -7 -73 397 -5 139 72
8086G2J19j02j00K17j20j87J14O7J40k61K75k38j75L72r8O3k84o7K90j20r7J01
$$ 72 191 89 -11 206 86 -101 13 80 220 -41 234 -4 -179 193 95 158 -126 -193 97 -23 -120 -19
8108a9j68K03j69K21J11r9J77j75k80L32o8k6r7J54k66J54q8r6K73ql48N4M64
$$ -19 -187 16 -153 68 179 80 257 82 -198 134 66 40 -57 97 -169 -15 -103 -199 74 66 -282 -228 236
8131B36k16j2O9j9Q5q4q9n6R0N1K02k09k81J67QL9K23j51k84K65K2o4k07K73k42
$$ 236 20 8 77 58 143 59 -30 -86 4 55 257 48 -233 -66 -58 -19 204 53 -231 34 56 -8 -215 58 -184
8156a84O7m2K69j03o0j05N5M5p4K05o3p0p8J7J12qJ02q2R9l14J98j24J58l3k9
$$ -184 -117 -159 110 7 -53 -158 -103 -58 -132 73 10 -60 -138 -121 -9 -17 85 3 102 -212 -14 -138 20 -13 -42
8181d2J24k98O35m28J73k49K03q5p7L05
$$ -42 82 -216 419 -9 164 -85 118 33 -44 261
8191B61
$$ Imaginary data points
##PAGE= N=2
##DATA TABLE= (X++(I..I)), XYDATA
0@%%%%%%%%%%%%Qj6J6j6J6k4L2l3M1n4O2p2Q6j02J18j34J54j78K06k36K68l01
$$ 0 0 0 0 0 0 0 0 0 0 0 0 0 8 -8 8 -8 8 -16 16 -17 24 -30 32 -40 46 -56 62 -72 82 -96 110 -126 142 -159
34a59L40l84M30m84N42o04O73p49Q32r22J022j129J245j373J514j669J837k023
$$ -159 181 -203 227 -257 285 -319 354 -395 437 -485 537 -592 653 -720 794 -875 962 -1061
52a061K230k460K717l005L333l708M140m647N252n988O905q088R677j1942J5466
$$ -1061 1169 -1291 1426 -1579 1754 -1954 2186 -2461 2791 -3197 3708 -4380 5297 -6645 8821
67H821k1756L6519j38035j40844K3353q8404j6336J5430N6293L8131M9459J3693
$$ 8821 -12935 23584 -114451 -255295 -231942 -320346 -336682 -321252 -264959 -226828 -177369 -163676
79a63676J7162N2541R8052N1182J992N106M7756L2291M924j244Q275j1336j4463
$$ -163676 -146514 -93973 4079 55261 57253 62359 110115 142406 147330 146086 154361 143025 128562
92A28562l000J524j4505p087M053p966k2975M755L2129J2726k5466k1485P147
$$ 128562 125562 127086 112581 105494 109547 101581 78606 83361 115490 128216 102750 81265 88412
105H8412K0576J0953q914l4151l2750N089K9759l685m7725l8276N388K4251J0859
$$ 88412 108988 119941 111027 76876 44126 49215 78974 75289 27564 -10712 -5324 18927 29786
118B9786j0816k4475j4865K1472M1235J0523k6500j2850K3558K5492J990n687
$$ 29786 18970 -5505 -20370 1102 42337 52860 26360 13510 37068 62560 64550 58863
130E8863l468p316r84J2554N150j6349j1140Q681K356j5965l824J6602R02k4308
$$ 58863 55395 48079 47095 59649 64799 48450 37310 45991 48347 32382 28558 45160 46062 21754
144B1754j5227P768N572q988j3085j9896k4006k018J9902r84l8251k8012J6663
$$ 21754 6527 14295 19867 10879 -2206 -22102 -46108 -48126 -28224 -29208 -67459 -95471 -78808
157g8808L0237P098r119m853O356K4980L7559J7790j6189j1923K3850K9655k077
$$ -78808 -48571 -41473 -50592 -55445 -49089 -24109 13450 31240 15051 3128 26978 56633 54556
170E4556k3019j6470j0557j1554q825j3840l1462l1130p237P79j5284j5130O653
$$ 54556 31537 15067 4510 -7044 -15869 -29709 -61171 -92301 -99538 -98759 -114043 -129173 -122520
183a22520J0887j552N932K6813K6616J2291J3050J8225J1758J3247K4556J2550
$$ -122520 -111633 -113185 -107253 -80440 -53824 -41533 -28483 -10258 1500 14747 39303 51853
195E1853j8776k0657J0259J6762j2860l0720j8317m846J23N348K73j8435j5980
$$ 51853 33077 12420 22679 39441 26581 -4139 -22456 -27302 -27179 -21831 -21558 -39993 -55973
208e5973J7966L4577R262j3381J69K0987J7226P302L201o265j2531p72R097o243
$$ -55973 -38007 -3430 5832 -7549 -7380 13607 30833 38135 41336 35071 22540 21768 30865 24622
222B4622k3620j4836j056n904j2877l327M474r47j759P520J2320J0972J5201J4575
$$ 24622 1002 -13834 -14890 -20794 -33671 -36998 -32524 -33471 -35230 -27710 -15390 -4418 10783 25358
236B5358L771K307J6805K2537K988j3661q476J419J923k759j1895k4581k1278
$$ 25358 29129 31436 48241 70778 73766 60105 51629 53048 54971 52212 40317 15736 -5542
249e542J632R983j0471k5689j0203J0676J0268M019K453j293k260J3284K3387
$$ -5542 -3910 6073 -4398 -30087 -40290 -29614 -19346 -15327 -12874 -14167 -16427 -3143 20244
262B0244N552j2719k177J3969N158r266m490O24q810j1056J452K582r681p512
$$ 20244 25796 13077 10900 24869 30027 20761 16271 16895 8085 -2971 -1519 1063 -8618 -16130
276a6130N471J452p813L245J7465N487j1169q50J5857J0454l315l692k641o596
$$ -16130 -10659 -9207 -17020 -13775 3690 9177 -1992 -2842 13015 23469 20154 16462 13821 7225
290G225l96R587k270k2475j6240Q181J0492p041j1714k968J937N952J2137O688
$$ 7225 6829 16416 14146 -8329 -24569 -16388 -5896 -12937 -24651 -27619 -25682 -19730 -7593 -905
304i05o337k904J4891J6457Q11n537K549L026j454m11K66p813j0075k081p36q367
$$ -905 -7242 -10146 4745 21202 22013 16476 19025 22051 20597 20186 20452 12639 2564 483 -253 -8620
320h620p396K787J56q921k770J0390Q054j752M5N102L021N094J1565L996j1118
$$ -8620 -16016 -13229 -13073 -21994 -24764 -14374 -6320 -8072 -8027 -2925 96 5190 16755 20751 9633
335I633p637J0367R880q838j4296m342N11j980J038n44j1486r524R270J4281j103
$$ 9633 1996 12363 22243 13405 -891 -5233 -4722 -6702 -5664 -6208 -17694 -27218 -17948 -3667 -4770
350d770r423L664J1201M671J935N105M73m726J673P675k363r693k861J700n781
$$ -4770 -14193 -10529 672 5343 7278 12383 12856 8130 9803 17478 15115 5422 2561 4261 -1520
365a520q999J064L077n856o230K479L941J347M425M799j758j638R955J2682j636
$$ -1520 -10519 -9455 -6378 -12234 -18464 -15985 -12044 -10697 -6272 -1473 -3231 -4869 5086 17768 16132
380A6132q696k28N765J172j769k937r122r151L117P160o207j4278j490Q298K608
$$ 16132 7436 7208 12973 14145 12376 9439 317 -8834 -5717 1443 -4764 -19042 -20532 -12234 -9626
395i626k070K435K546j905M113J2020L539p004L71R418J302p523r56L803n291
$$ -9626 -11696 -9261 -6715 -8620 -4507 7513 11052 4048 4419 13837 15139 7616 6660 10463 5172
410E172r290M3K670n943o286J315l01n723J557J0099J319q222J40J2000O362l022
$$ 5172 -4118 -4075 -1405 -7348 -13634 -12319 -12620 -18343 -16786 -6687 -5368 -13590 -13450 -1450 4912 1890
426A890r74J490r21Q48O110j154j1597o542N687M048o311o872m87L55R42M022
$$ 1890 916 2406 1485 2333 8443 7289 -4308 -10850 -5163 -1115 -7426 -14298 -14785 -14430 -13488 -9466
442i466K400l925o59P806O776j204j169M031J332k236Q09K256l421n271k43m84
$$ -9466 -7066 -10991 -11650 -3844 2932 1728 559 4590 5922 3686 4495 6751 3330 -1941 -2184 -2668
458b668o044k588L396j033p381r44Q586M043l109P18N914K173K517Q503M130o201
$$ -2668 -8712 -11300 -7904 -8937 -16318 -17262 -8676 -4633 -7742 -7024 -1110 1063 3580 12083 16213 10012
474A0012k569R611O156o974p266J852J242m028o52L64n263o748M652P465l288
$$ 10012 7443 17054 23210 16236 8970 10822 12064 8036 7384 7748 2485 -4263 389 7854 4566
489D566n987M049P288m52k00M959K806l455Q91N039n73n339n41J910m767n668
$$ 4566 -1421 2628 9916 9464 9264 14223 17029 13574 14465 19504 18931 13592 13051 14961 10194 4526
505D526J538K574n377n545J688K722o59J678L086j192r53O893P644j945m869K116
$$ 4526 6064 8638 3261 -2284 -596 2126 1467 3145 6231 5039 4086 10979 18623 16678 11809 13925
521A3925N207q56j892m36m170o495J069K871n734r189j056L964k010m053J212
$$ 13925 19132 18276 16384 15948 11778 5283 6352 9223 3489 -5700 -6756 -2792 -4802 -8855 -7643
536g643J585l138J40O650J278m712K99N551j161n800M31K906m582p676L25J858
$$ -7643 -6058 -9196 -9056 -2406 -1128 -5840 -5541 10 -1151 -6951 -6520 -3614 -8196 -15872 -15547 -13689
552a3689n124n126O30k33n084Q18O443J45n306J979Q760L228k124J953L528P55
$$ -13689 -18813 -23939 -23309 -23542 -28626 -27808 -21365 -21220 -26526 -24547 -15787 -12559 -14683 -12730 -9202 -8447
568h447J055M706N18o180j721M626J285n254k590J172q78j692K639J325k837o31
$$ -8447 -7392 -2686 -2168 -8348 -10069 -5443 -4158 -9412 -12002 -10830 -11708 -13400 -10761 -9436 -12273 -12904
584a2904N179K982j735P03M552O08k708J955L575k455l707J147N01m412j712L286
$$ -12904 -7725 -4743 -6478 -5775 -1223 -615 -3323 -1368 2207 -248 -3955 -2808 -2307 -6719 -8431 -5145
600e145o18o210MO864J769l341J626O029J715J653O064M738k166p29Q237N056
$$ -5145 -5763 -11973 -11969 -5105 -3336 -6677 -5051 978 2693 4346 10410 15148 12982 12253 20490 25546
616B5546m331k876L877J478l936p70J976l669n531K470L426l188m648K839L289
$$ 25546 21215 18339 22216 23694 19758 18988 20964 17295 11764 14234 17660 14472 9824 12663 15952
631A5952k157j537L575J961l300j90L196m49l644k48R81l777m137J262M48m605
$$ 15952 13795 12258 15833 17794 14494 14304 17500 17051 13407 13159 14140 10363 6226 7488 7936 3331
647C331m205J353K54k114J03J594j651r78M015L864j799k604L386K954j018r54
$$ 3331 -874 479 733 -1381 -1278 316 -1335 -2313 1702 5566 3767 1163 4549 7503 6485 5531
663E531J417j466l773J012K283l708n730N82K279l384l464J636Q51l495j450M776
$$ 5531 6948 5482 1709 2721 5004 1296 -4434 -3852 -1573 -4957 -8421 -6785 -5934 -9429 -10879 -6103
679f103K02l496M50M273j043l615J787L867k974m578K404K166l065l349J725J21
$$ -6103 -5901 -9397 -8947 -4674 -5717 -9332 -7545 -3678 -6652 -11230 -8826 -6660 -9725 -13074 -11349 -11228
695a1228l677K90M140o89m187J216N087P35k300J520K713l01J05L207J368l766
$$ -11228 -14905 -14615 -10475 -11164 -15351 -14135 -9048 -8313 -10613 -9093 -6380 -6681 -6576 -3369 -2001 -5767
711e767q9L911N34l350k95K175q49j595J918J637j968o22L436J362j921M04L755
$$ -5767 -5856 -1945 -1411 -4761 -5056 -2881 -3730 -5325 -3407 -1770 -3738 -4360 -924 438 -1483 -1079 2676
728B676m69k143J548L178j284k657J878Q94k451j003K958n17m080K87M252J20
$$ 2676 2207 64 1612 4790 3506 849 2727 3621 1170 167 3125 2608 -1472 -1185 3067 3187
744C187l731Q10L574j66j661K771K628l414j322M062J997m219j551K816L86l671
$$ 3187 -544 266 3840 3674 2013 4784 7412 3998 2676 6738 8735 4516 2965 5781 6167 2496
760B496k85K203k006l531J481K626k250k536K481K238j759q48L441J201k162J40
$$ 2496 2211 4414 2408 -1123 358 2984 734 -1802 679 2917 1158 310 3751 4952 2790 2930
776B930K980M2k288P97Q82k260k248J753L54l525k202J435L24k534R5J352j127
$$ 2930 5910 5952 3664 4461 5343 3083 835 2588 2942 -583 -2785 -1350 -1026 -3560 -3465 -2113 -3240
793c240j123L019K227j595r05K787J929j457J68J945m82k884J055K166k654l201
$$ -3240 -4363 -1344 883 -712 -1617 1170 3099 1642 1810 3755 3273 389 1444 3610 956 -2245
809b245J261K034l213k306K238J231l034k94M068J144l170J434L911n11k327K136
$$ -2245 -984 1050 -2163 -4469 -2231 -1000 -4034 -4328 -260 884 -2286 -852 3059 2548 221 2357
825B357L318j924l063K215J888l104k629J560K58l513n31K540q20l203R36L337
$$ 2357 5675 3751 688 2903 4791 1687 -942 618 876 -2637 -3168 -628 -1448 -4651 -3715 -378
841c78n60j835K209K137l77k04K648P24j882J90K317n70k548L78J034j841k571
$$ -378 -938 -2773 -564 1573 1196 992 3640 4364 2482 2672 4989 4419 1871 2249 3283 1442 -1129
858a129R46O78k470j267K064J06k193P12K339r2j978J897K697j285j878K083R05
$$ -1129 -183 495 -1975 -3242 -1178 -1072 -3265 -2553 -214 -306 -2284 -387 2310 1025 -853 1230 2135
875B135k342j136K572n83l538j35K671r20l602P24K382q45j643K390K255k607
$$ 2135 -207 -1343 1229 646 -2892 -3027 -356 -1276 -4878 -4154 -1772 -2617 -4260 -1870 385 -2222
891b222m51L482J545k631q60L351J98k935%J782j174l313R58J421j841k110J497
$$ -2222 -2673 809 2354 -277 -1137 2214 2412 -523 -523 1259 85 -3228 -2270 -849 -2690 -4800 -3303
908c303R65j846o55K684Q58j322N72K224L98j249J306J380j336n76J261P53k280
$$ -3303 -2338 -4184 -4839 -2155 -1297 -2619 -2047 177 575 -674 632 2012 676 100 1361 2114 -166
925a66j134J423j95k110L51J348j252j115J818J710j728q45K630J582j589K1K247
$$ -166 -1300 123 -72 -2182 -1831 -483 -1735 -2850 -1032 678 -1050 -1895 735 2317 728 749 2996
942B996l46j893N46J995j435l039J360J229k687j984J953Q77l175l26K864L11
$$ 2996 2650 757 1303 3298 1863 -1176 184 1413 -1274 -3258 -1305 -428 -3603 -3929 -1065 -754
958g54k310Q70L284m85j374J546K945j124j989J985J583k237j882J191O19k527
$$ -754 -3064 -2194 1090 605 -769 777 3722 2598 609 2594 4177 1940 58 1249 1868 -659
974f59p31K101p17k567M69J957o28j626J950J737o94n45K008P90j475K98J964
$$ -659 -1390 711 -6 -2573 -2104 -147 -775 -2401 -451 1286 592 47 2055 2845 1370 1668 3632
991C632k74k001L69J086j489j862J211J24j759o88J488Pj622M90K390q93j224
$$ 3632 3358 1357 1726 2812 1323 -539 672 796 -963 -1651 -163 -156 -1778 -1288 1102 209 -1015
1008a015K127J685o56j468K119J267j560r05K323J38l191p6K235j003k964P17
$$ -1015 1112 2797 2141 673 2792 4059 2499 1594 3917 4055 864 788 3023 2020 -944 -227
1024b27J991j162j662J855J734j767o38K413J532j942l98K503L34k435J49J804
$$ -227 1764 602 -1060 795 2529 762 124 2537 4069 2127 1729 4232 4566 2131 2280 4084
1040D084j446k007K94J397k135j522N92P05j980n76J477N42j498oK248o08r77
$$ 4084 2638 631 925 2322 187 -1335 -743 -38 -2018 -2594 -1117 -575 -2073 -2079 169 -439 -1416
1057a416J324Q96j050p51J493J59k010p62Q38o22j738J24J040j637j327J379J087
$$ -1416 -92 804 -246 -997 496 655 -1355 -2117 -1279 -1901 -3639 -3515 -2475 -4112 -5439 -4060 -2973
1074b973j478m26J834P45j368K45K184L6j894Q92K099j073j997R80J916k389j312
$$ -2973 -4451 -4877 -3043 -2298 -3666 -3421 -1237 -1201 -3095 -2203 -104 -1177 -3174 -2194 -278 -2667 -3979
1091c979J377P67k337o96K249J31k192O54K259o45j466J545K051q89j449K056
$$ -3979 -2602 -1835 -4172 -4868 -2619 -2488 -4680 -4026 -1767 -2412 -3878 -2333 -282 -1171 -2620 -564
1107e64J546j765j166J602P35k015m01J780o27j856O05J558m16q93J069J253n11
$$ -564 982 -783 -1949 -347 388 -1627 -2028 -248 -875 -2731 -2126 -568 -984 -1877 -808 445 -66
1124f6l38K040R08j139P27J473j09q90J073J253j412n50J101K14j650k91J605
$$ -66 -404 1636 2544 1405 2132 3605 3496 2606 3679 4932 3520 2970 4071 4285 2635 2344 3949
1141C949k39j713M79J674p10j068J110J555j142j194J739R59j676o80J955l5k487
$$ 3949 3710 1997 2476 4150 3440 2372 3482 5037 3895 2701 4440 5399 3723 3043 4998 4963 2476
1158B476q7J493n59k254M19J505j150j695J103J258j852j171K366N11j608n09
$$ 2476 2389 3882 3323 1069 1488 2993 1843 148 1251 2509 657 -514 1852 2363 755 246
1174B46K210Q7j959J98J632q79j539P22Q12j450j090O97M23j637n04J405k67j221
$$ 246 2456 2543 584 782 2414 1535 -4 718 1530 80 -1010 -313 110 -1527 -2031 -626 -893 -2114
1192b114J12J107l28n10R2J025r52n53J321N9j641N0R37o89j319K51Q63q61j318
$$ -2114 -2002 -895 -1223 -1733 -1641 -616 -1568 -2121 -800 -741 -2382 -2332 -1395 -2084 -3403 -3152 -2289 -3150 -4468
1211d468J000N66j351m71J687O93j646K81K033O6j441Q04J487n84j238J238J506
$$ -4468 -3468 -2902 -4253 -4724 -3037 -2344 -3990 -3709 -1676 -1610 -3051 -2247 -760 -1344 -2582 -1344 162
1228A62j617j285J723N47k035k56J869J60j635R7K038l4j621Q86J915o63j460
$$ 162 -1455 -2740 -1017 -470 -2505 -2761 -892 -732 -2367 -2270 -232 -266 -1887 -1001 914 251 -1209
1245a209J811R63j295n09J542J72j204q9J287m13j492M88J353r95p87J011R41
$$ -1209 602 1565 270 -239 1303 1475 271 182 1469 1056 -436 52 1405 410 -377 634 1575
1262A575j233j29J404K68j105M96J663q38n37Q19M13p84q26J067L98j471j56P72
$$ 1575 342 213 1617 1885 780 1276 2939 2101 1564 2383 2796 2012 1186 2253 2651 1180 1024 1796
1280A796j24j505L92Q28l60j186N90J292j131j041J774N22j370o08J941r4j618
$$ 1796 1672 167 559 1387 1027 -159 431 1723 592 -449 1325 1847 477 -131 1810 1716 98
1297I8j33J441l01j942M77J536j101j453P97J355j719q31J501O16j141l80J742
$$ 98 -35 1406 1105 -837 -360 1176 75 -1378 -581 774 -945 -1776 -275 341 -800 -1180 562
1314E62O5j403n5J546j57j699O81J007o82j239R62M38j302j81J133k31j150P66
$$ 562 627 -776 -831 715 558 -1141 -460 547 -135 -1374 -412 26 -1276 -1457 -324 -555 -1705 -939
1332i39Q25n99o59J072N63q88k88J140L00r43k9P99j96j246O27J005r68r84Q86
$$ -939 -114 -713 -1372 -300 263 -625 -913 227 527 -416 -445 354 158 -1088 -461 544 -424 -1408 -522
1351e22Q26j256k07J149L88j089j46J728j29j372O78J817o67j523J146J039j228
$$ -522 304 -952 -1159 -10 378 -711 -857 871 742 -630 48 1865 1198 -325 821 1860 632
1368F32p98J265L28j184o09J339R2j694l5J611l77j189P93R56o02j044J416N58
$$ 632 -166 1099 1427 243 -366 973 1065 -629 -664 947 570 -619 174 1130 528 -516 900 1458
1386A458j191l34J043M69j405l17P53k11j204K59Q71p17p42J029J29q07j67R15
$$ 1458 267 -67 976 1445 40 -277 476 265 -939 -680 191 -526 -1268 -239 -110 -917 -1084 -169
1404a69M37p96K22R85k85q46P69O67m75j055Q93O85j331o19J546o11j055j16J016
$$ -169 268 -528 -306 679 394 -452 317 984 509 -546 347 1032 -299 -918 628 17 -1038 -1154 -138
1423a38l27j321R62Q48r53n83J000O65j007m27J527L31j498j51J580m2j614O63
$$ -138 -465 -1786 -824 24 -929 -1512 -512 153 -854 -1281 246 577 -921 -1072 508 466 -1148 -485
1441d85J073q47j258R67R37j193r57J274O78j066m07J616L9j293N13R72j76q01
$$ -485 588 -259 -1517 -550 387 -806 -1763 -489 189 -877 -1284 332 371 -922 -409 563 387 -414
1459d14O38R06r23o55R36K80j158q9N44J75j339M89P61l56p19P20N52o00l15Q70
$$ -414 224 1130 207 -448 488 768 -390 -479 65 240 -1099 -610 151 -205 -924 -204 348 -252 -567 303
1479C03L42q18k0J345l04j376J065O80p28j030R82J46p89n96J088L56j097j14
$$ 303 645 -173 -193 1152 848 -528 537 1217 489 -541 441 587 -202 -798 290 646 -451 -565
1497e65J509l17j106N05J250l89j169P50J175q88q11Q64O99j055p30J382L9j360
$$ -565 944 627 -479 26 1276 887 -282 468 1643 755 -56 808 1507 452 -278 1104 1143 -217
1515b17k54J545n92j005M76P48n40o77R21O22j019o1P79K66j228J34R82k28j060
$$ -217 -471 1074 482 -523 -47 701 161 -516 405 1027 8 -53 726 992 -236 -102 880 652 -408
1534d08N84N01m15p90O54N44r01o3N74K57q81M68Q51k61o74P80N71q40j38Q00
$$ -408 176 677 262 -528 126 670 -231 -294 280 537 -344 124 975 714 40 820 1391 551 413 1213
1554A213J23j033j78P80m7j340K64Q30n06j072N67J011j262l81P88O42j117k85
$$ 1213 1336 303 125 905 858 -482 -218 612 106 -966 -399 612 -650 -1031 -243 399 -718 -1003
1572a003Q41N91j176L5J284p33r16M13J160q21j071P69P27p99o15P26O57j247
$$ -1003 -162 429 -747 -712 572 -161 -1077 -664 496 -325 -1396 -627 100 -699 -1314 -588 69 -1178
1590a178j52J233p1p29l1J045l53o07O56M43n44o45O99K77o55m33P51p9r75K13
$$ -1178 -1330 -97 -168 -897 -928 117 -236 -843 -187 256 -288 -933 -234 43 -612 -1045 -294 -373 -1348 -1135
1610a135O56o21l54K93O44n72k44P09K31q35J76J076l36p86K96J195p77r85J013
$$ -1135 -479 -1100 -1454 -1161 -517 -1089 -1333 -624 -393 -1228 -1052 24 -312 -1098 -802 393 -384 -1369 -356
1629c56N10j063r0Q40M39j250n7R61L22j115N42Q99q9q17Q92O68n64o04Q75N25
$$ -356 154 -909 -999 -159 280 -970 -1027 -66 256 -859 -317 582 493 -324 568 1236 672 68 943 1468
1649A468o81p42J473l5j234J55P99n28o30P39P10q37n11O67M14m63m84J145Q0
$$ 1468 787 45 1518 1483 249 404 1203 675 45 784 1494 657 146 813 1227 764 280 1425 1505
1668A505r44J69O03L6r56K50P50l69n64L43K48o37j27N46l8q99M24Q35m33p53
$$ 1505 561 730 1333 1369 413 663 1413 1044 480 823 1071 434 307 853 815 -84 340 1175 742 -11
1688a1O61K53l08l37O30N08r14l26M99L3j087M07P91n12r88N58O23q23q72R69
$$ -11 650 903 595 258 888 1396 482 156 655 688 -399 8 799 287 -701 -143 480 -343 -1215 -246
1708b46N53r88l50Q60J11o83k30Q17M66j500L44R49n92o39J17R38r08n16N33N61
$$ -246 307 -681 -1031 -171 -60 -743 -973 -156 310 -1190 -846 103 -489 -1128 -1011 -73 -981 -1497 -964 -403
1728d03r40oP50j10l52p4P79m82k08K64M74m39L5M11Mm80k40M77M9p73L67O96
$$ -403 -1343 -1349 -599 -709 -1061 -1135 -356 -838 -1046 -782 -308 -747 -712 -301 -297 -777 -1017 -540 -491 -1264 -897 -201
1750b01m50m99Q53L24p79j38R35p1q36L9J002J23o45L75O69n84m49O71N72o71
$$ -201 -651 -1150 -297 27 -752 -890 45 -26 -862 -823 179 302 -343 32 701 117 -332 339 911 240
1770B40n58Q74J4q15K3R71k7j066N57O92j05o45K57Q25o52l03O46N05p60k79P33
$$ 240 -318 556 570 -245 -222 749 722 -344 213 905 800 155 412 1237 585 282 928 1433 673 394 1127
1791A127J57r61j81J153m70r80O72M61o45l61M83N60n68j52M34M1o82J13O36k1
$$ 1127 1284 323 142 1295 825 -155 517 978 333 -28 455 1015 447 295 729 770 88 201 837 816
1811H16r34N42L49n55m42O75l4m08k19N19j54p77M23N90j66q89O44P76j019k59
$$ 816 -118 424 773 218 -224 451 417 9 -210 309 155 -622 -199 391 225 -664 -20 756 -263 -522
1831e22N68M75j007J77M75k54m57n5Q11l31q13K73J008q12o93M81N90m20l53O52
$$ -522 46 521 -486 -309 166 -88 -545 -600 211 -120 -933 -660 348 -464 -1157 -676 -86 -506 -859 -207
1851b07O41j308J07M91L67j106J88J013j91r29M98M25m69j15M60M29q63r2N03
$$ -207 434 -874 -767 -276 91 -1015 -827 186 -5 -934 -436 -11 -480 -595 -135 294 -569 -661 -158
1870a58L4o17K15Q25o08l92L95L92J45m48L28L07m41j0L95k5p58L87M41m21m34
$$ -158 -124 -741 -526 299 -309 -701 -306 86 231 -217 111 418 -23 -33 362 337 -421 -34 407 -14 -448
1891d48O09J58n41j02O44K56q30L38N36l17m58N83M18n21n03Q43K32q63j55N97
$$ -448 161 319 -222 -324 320 576 -254 84 620 303 -155 428 846 325 -178 665 897 34 -121 476
1911D76M47j157Q1P01j07p44L05M40O2o12K07R75q22p00R02N4l53k16O48J77p74
$$ 476 923 -234 -153 548 441 -303 2 442 504 -108 99 1074 252 -448 454 508 155 -61 587 764 -10
1932a0j68P90l15o42Q6N29l30r2K35R8k81j86O32R4n71q7L68j46l20M15Rl5l51
$$ -10 -178 612 297 -345 -259 270 -60 -152 83 181 -100 -286 346 440 -131 -218 150 4 -316 99 108 73 -278
1955b78L91J23n10j51N84j19o81J35M92l92l52L07N94n89l57Q01M44j150mR40
$$ -278 113 236 -274 -425 159 40 -641 -506 -14 -406 -758 -451 143 -446 -803 -2 442 -708 -712 228
1975B28q3o91q0P27q0n33k13P69k41n66M74P17p01m32P80O0r10K82Q74j27k37
$$ 228 145 -546 -626 101 21 -512 -725 44 -197 -763 -289 428 -273 -705 75 135 -775 -493 381 254 17
1996A7k15Q66m09m73K34O22n97j35K92K14o21l11O98J34n21K01L51k70j69K82
$$ 17 -198 668 259 -214 20 642 45 -90 202 416 -205 -516 182 316 -205 -4 347 77 -92 190
2016A90J14k06o0n0J37n8k0K98k66o77O03N28n65k82M27L16n77k02N94M0l26l15
$$ 190 304 98 38 -12 125 67 47 345 79 -598 5 533 -32 -314 113 429 -148 -350 244 284 -42 -357
2038c57O16j85n27M16O68j52q35M08M90n08m20J039j41p88j13M99J46n34o2M78
$$ -357 259 74 -453 -37 631 479 -356 52 542 34 -386 653 512 -276 -389 110 256 -278 -340 138
2058A38K9o51N09N82o88j26K27N32m80k66L37K12n92O0L38K21o88N2N19m88k42
$$ 138 167 -484 25 607 -81 -207 20 552 72 -194 143 355 -237 -177 161 382 -306 -254 265 -223 -465
2079d65O11Lj70m30P01j91l40J19L28p4n55M79J2k5l92M04N9l32K11K0K33l75
$$ -465 146 149 -21 -451 250 59 -281 -162 166 92 -463 16 28 3 -389 15 74 -258 -47 -27 206 -169
2101a69K25J89l03m95K86N95o99j86L92K83o18l85J029K87o82j32N50k12o79N17
$$ -169 56 245 -58 -553 -267 328 -371 -557 -165 118 -500 -885 144 431 -251 -383 167 -45 -724 -207
2121b07N63o37l85M72M02o57l14P53Q2o74j20P80Q1p88K31O73k42k76J56L54k32
$$ -207 356 -281 -666 -194 208 -449 -763 -10 72 -602 -722 58 139 -649 -418 255 13 -263 -107 247 15
2142A5k49L58J01n24j08N49k07j49L13J16p2n29O34R5l75j39O14j69j99M4J06
$$ 15 -234 124 225 -299 -407 142 -65 -214 99 215 143 -386 248 343 -32 -171 443 274 75 119 225
2163B25l5k89P1L14k02l19M96L20m85m77O15O0n87J4N55o6m01o8N30l00J83J0
$$ 225 190 -99 -28 286 84 -235 261 581 96 -381 234 294 -293 -279 276 210 -191 -259 271 -29 154 164
2185A64M00l58n82Q26J91q02j21Q41J93q50q1P59l11m22K32mJ29k54L18L80n09
$$ 164 564 206 -376 450 641 -161 -282 559 752 -98 -179 580 269 -153 79 75 204 -50 268 648 139
2206A39k19L72K06m71q3L09l3k56l5O02n88k34M89O6k06j64M73k82k67M2J22J58
$$ 139 -80 292 498 27 -56 253 220 -36 -71 531 -57 -291 198 264 58 -106 367 85 -182 -140 -18 140
2228A40l56K74M28n68j39K42J5l15K1K82k34j01j02M14M9p67N84n8j29l02M45
$$ 140 -216 58 486 -82 -221 21 36 -279 -258 24 -210 -311 -413 1 50 -717 -133 -191 -320 -622 -177
2249a77L21n21J07K90o0n90M46M9L93p96J76O49l33m61P81j82l71n01O09J95k49
$$ -177 144 -377 -270 20 -40 -630 -184 -135 258 -538 -362 287 -46 -507 274 92 -279 -780 -171 24 -225
2270b25j53K97K4k41M5L80j02m13L26R7o1j53M49J1m66K9M06r2l01mL54l13M0
$$ -225 -378 -81 -57 -298 -253 127 25 -388 -62 35 -26 -179 270 281 -185 -156 250 158 -143 -147 207 -106 -66
2293f6J43K75j97m43P16k8j58n2J9R4k01K65J48l00r4J71K14n89J2N52k60m29
$$ -66 77 352 155 -288 428 400 242 190 209 303 102 367 515 215 121 292 506 -83 -71 481 221 -208
2315b08m5P78k80p34M20L57l22k52P02R8n73l23O88K54o36q6K53J21k63J0L99
$$ -208 -253 525 245 -489 -69 288 -34 -286 416 514 -59 -382 306 560 -76 -162 91 212 -51 -41 358
2336C58r5m99J47K46q9j97K36l2j27j43L74J55k80k10J06J50m06L89M0k04k5K22
$$ 358 263 -236 -89 157 68 -129 107 75 -52 -195 179 334 54 -156 -50 100 -306 83 123 -81 -106 116
2358A16Q4l52j27M80j87j4p7L06k15n84O73k32n3n29L94N35m52j70L84Qm09N6
$$ 116 200 -152 -279 201 14 0 -77 229 14 -570 103 -129 -182 -711 -317 218 -234 -404 -20 -12 -421 -365
2380c65L69M4o61M10K94l17j39K23J63j65l53O66P5n43P5J54J10l75jL24P5k87
$$ -365 4 48 -613 -203 91 -226 -365 -142 21 -144 -497 169 244 -299 -224 -70 40 -335 -336 -12 63 -224
2402b24J01L44m68k00M68J10k00j39R9lj80L39J94J00m70p2N53l01k48L22p9R
$$ -224 -123 221 -247 -447 21 131 -69 -208 -109 -112 -292 47 241 341 -129 -201 352 51 -197 125 46 55
2424E5p3K30M5j86L6M56l42j84K87P1k81k31L72K62p22J68M00l3m40Q4O18m21
$$ 55 -18 212 257 71 107 563 221 37 324 395 114 -117 255 517 -205 -37 363 330 -110 -26 592 171
2446A71j02m23R21o57j13N97K6o03J34M47k36l28J15M51l59j67J82K19m70N6J46
$$ 171 69 -354 567 -90 -203 394 420 -183 -49 398 162 -166 -51 400 41 -126 56 275 -195 -139 7
2467GL46m92P1K27P4m40m4M62k06O0l9O0o6k90N96j55m80o7O42k21k0j34J55j68
$$ 7 353 -139 -68 159 233 -207 -251 211 5 65 26 86 20 -270 326 171 -309 -376 266 45 25 -109 46 -122
2491a22q3L14O6o3k77j8K09k53m2L36Nk31P8K77k90j98L1P34o64j37J02L63j04
$$ -122 -205 109 175 112 -165 -183 26 -227 -269 67 72 -159 -81 196 -94 -292 -261 473 -191 -328 -226 137 33
2514C3l74M7K99k71j67M86l40Q6m6L37mj94k0M87n72m9M54M3m38n7K16K71l34
$$ 33 -341 -294 5 -266 -433 53 -287 -201 -247 90 86 -108 -128 359 -213 -262 192 235 -203 -260 -44 227 -107
2537a07L01J43k54l06qM02k65k83J85L86l79r2M31j4m25K39J32j16k52J37M28
$$ -107 194 337 83 -223 -231 171 -94 -377 -192 194 -185 -277 154 140 -285 -46 86 -30 -282 -145 283
2558B83n25M26j13K40k62k31L93N2l41K59K77k39j03K22Q8l46J26J09k3j27k70
$$ 283 -242 184 71 311 49 -182 211 263 -78 181 458 219 116 338 426 80 206 315 292 165 -105
2579a05M30q0j49l3K80k54m15L20M26l73k56K61R8j06l23N93j42m83j30O80k68
$$ -105 325 245 96 63 343 89 -326 -6 420 47 -209 52 150 44 -279 314 172 -311 -441 239 -29
2600b9l48K72l5R0l20M54J92j59j33J63l5l04K27L05o2l30Q5J99k81j25L86J32
$$ -29 -377 -105 -140 -50 -370 84 276 117 -16 147 112 -192 35 340 278 -52 33 232 -49 -174 212 344
2622C44l93j44M77J01l08k23M14r8k15j35R3J74m5j11J54l68J80L1N6j86J19L77
$$ 344 -49 -193 284 385 77 -146 268 170 -45 -180 -87 87 42 -69 85 -283 -103 -72 -16 -202 -83 294
2644B94l82K0l4N1j50k53L24K92k49j75K5L17k63K6L87q4l29J90L74o56J24K69
$$ 294 -88 -68 -102 -51 -201 -454 -130 162 -87 -262 -237 80 -183 -157 230 146 -183 7 381 -275 -151 118
2666A18J17j21j43M49j74k05j39M42K06o74J82K9j80o1J59J81j61j75K35q8j16
$$ 118 235 114 -29 420 246 41 -98 344 550 -124 58 87 -93 -154 5 186 25 -150 85 -3 -119
2687a19k25N54O3k52j96N15k13n71K07J28M9k53K18LM4j08J82K56l66J16J97r0
$$ -119 -344 210 273 21 -175 340 127 -444 -237 -109 -60 -313 -95 -92 -48 -156 26 282 -84 32 229 139
2709A39J41k14K50k65n5K20j00j14m9Q8r2j52M31k2K6l12K2L25k26k56N02r5k10
$$ 139 280 66 316 51 -4 216 116 2 -47 41 -51 -203 228 206 232 -80 -58 267 41 -215 287 192 -18
2732a8p3K44n7l48J71J4L2q4m8L88m75O7j47M75n17J55J70K79m60m7L15P7l73
$$ -18 -91 153 96 -252 -81 -67 -35 -119 -167 221 -254 -187 -334 141 -376 -221 -51 228 -232 -279 36 113 -260
2755b60K45L70k58m73L17L16m27P0R8J49j77pM8l25K94j18K57k85j76M30P4m21
$$ -260 -15 355 97 -376 -59 257 -170 -100 -2 147 -30 -37 11 -314 -20 -138 119 -166 -342 88 162 -259
2777b59j30L88J09j81l23O12k43O2J5Rj59k18K31K52l22o7L82km44K41J96o3k78
$$ -259 -389 -1 108 -73 -396 216 -27 35 50 59 -100 -318 -87 165 -157 -224 158 156 -288 -47 149 86 -192
2800a92m5M43l8o86O72K69j89n42K02J61j18j48O22l61j90J32J31j87j74J4K06
$$ -192 -237 206 168 -518 154 423 234 -308 -106 55 -63 -211 411 50 -140 -8 123 -64 -238 -224 -18
2821a8J33j73J39N55q47J02L94J49n09J48J58J16l40J70oj17j2qK98k9m40N19
$$ -18 115 -58 81 636 -211 -109 285 434 -75 73 231 347 7 177 171 54 42 34 332 303 -137 382
2843C82J37o61K58K64m05q2L38l78P9n0J24K49l34j56K86J71m92K69K87k65j13
$$ 382 519 -142 116 380 -25 -107 231 -147 -68 -118 6 255 -79 -235 51 222 -270 -1 286 21 -92
2864i2n6M37m9n91N80O8k75k86K88K65o23J77M76j24l09p0L82M2o37M68N4l01
$$ -92 -148 289 240 -351 229 297 22 -264 24 289 -334 -157 319 195 -114 -184 198 240 -397 71 125 -176
2886a76j12P6L88k70J10L44j73o18K06K79P5l27r0K92j63j51K66J69k09j20M60
$$ -176 -288 -212 176 -94 16 360 187 -431 -225 54 129 -198 -288 4 -159 -310 -44 125 -84 -204 256
2907B56l69k60J54J97k76J22J18J60k72j00K36k07kO2K56q6j34L47j41k0j24j32
$$ 256 -113 -373 -219 -22 -298 -176 -58 102 -170 -270 -34 -241 -243 -181 75 -11 -145 202 61 41 -83 -215
2929b15M55k68j15K66k15j77L32MK9j70J87J43l52q1K20K96j98l00L56j44Pk41
$$ -215 240 -28 -143 123 -92 -269 63 67 96 -74 113 256 -96 -177 43 339 141 -159 197 53 60 -181
2951a81J82j02j05J44J05Q4l27M4O99n47M8Q0k44P1K45l01J78k61k8M81m5p5R3
$$ -181 1 -101 -206 -62 43 127 -200 -156 543 -4 44 124 -120 -49 196 -105 73 -188 -216 265 220 145 238
2974B38l79J15k77O79l79k1M7K49k02q4L37q7l78PM08k7j14n04K21P4m7j13N30
$$ 238 -141 -26 -303 376 -3 -24 23 272 70 -14 323 236 -142 -135 273 246 132 -372 -151 -77 -124 -237 293
2997B93l35N9P8J43l26l8J31J60j48j36K49j16k9m46O10j04j64j59L02K83n62
$$ 293 -42 17 95 238 -88 -126 5 165 17 -119 130 14 -15 -461 149 45 -119 -278 24 307 -255
3018b55p8L65j80J26J69j1j65k04K99L7j61M1J93j87j00k70N05J12l33r0J60J63
$$ -255 -333 32 -148 -22 147 136 -29 -233 66 103 -58 -17 176 -11 -111 -381 124 236 -97 -187 -27 136
3040A36n01M09Q0k92J5L77l24q6K27J41l0k73J40l6r2n7R4k21o3J03L96j70O8
$$ 136 -365 44 124 -168 -153 224 -100 -186 41 182 152 -121 19 -17 -109 -166 -72 -293 -356 -253 143 -27 41
3063D1m64M67Ml58L71J85l48KJ37L61o83J06N12k26Ok07J01J65n83L16J38J28
$$ 41 -423 44 48 -310 61 246 -102 -100 37 398 -285 -179 333 107 113 -94 7 172 -411 -95 43 171
3085A71j79Q2J1o8j82M52j68j58J03J07k20m6J57Lo0l56P6N73j46j05l5N1k52
$$ 171 -8 74 85 17 -165 287 119 -39 64 171 -49 -95 62 65 5 -351 -275 298 152 47 12 63 -189
3108a89KM72k61qO0J81l14l9J15J95l32J24OJ57k40K26P7m60J89k7N4Q6j21K94
$$ -189 -187 285 24 16 76 257 -57 -96 19 214 -118 6 12 169 -71 155 232 -228 -39 -66 -12 74 -47 247
3132B47j96j22Q9K77j54j98J51J14j32L7j00j37J67k00J23L23l04p8N2J31r9k04
$$ 247 51 -71 18 295 141 -57 94 208 76 113 13 -124 43 -157 -34 289 -15 -93 -41 90 -9 -213
3154b13N56k07l77K05J19K23n05J85R8j43M2j74O07m02l87N20j73M2J99j10j00
$$ -213 343 136 -241 -36 83 306 -199 -14 84 -59 -17 -191 416 14 -373 147 -26 16 215 105 5
3175ELj55K57o8N0p1r1oq7K0N9J31L9kMk54R4K88o13L41J11j46K39m08K52l4o7
$$ 5 8 -147 110 42 92 21 -70 -76 -163 -143 -84 47 86 84 88 -166 -72 216 -397 -56 55 -91 148 -260 -8 -42 -109
3202a09Q4K26k79J59k30K60k78nOM81k79l94N39k41j87k4L98nl72K95q4J08l41
$$ -109 -25 201 -78 81 -149 111 -167 -172 -166 315 36 -358 181 -60 -247 -271 127 122 -250 45 -39 69 -272
3225b72L54K11l81K96p6j48q0k59L66J13k51K44R3k53J29K1l14L17k40M08j6l83
$$ -272 82 293 -88 208 132 -16 -96 -355 11 124 -127 117 210 -43 86 107 -207 110 -130 278 262 -121
3247a21K30l6k85J37p5K4n7K3L38j07J4p0j93k8M8o5J84M26j96j14K05j98k35
$$ -121 109 73 -212 -75 -150 -126 -183 -160 178 71 85 15 -178 -206 -158 -223 -39 387 191 77 282 84 -151
3270a51K41J60k71q9K84k40p4J41J12j81L5l5K93km23L71p5k91K03n1J65N3m80
$$ -151 90 250 -21 -110 174 -66 -140 1 113 -68 -33 -68 225 223 -200 171 96 -195 8 -43 122 175 -305
3293c05L58j9q6O2j0j98jm5K79j49J7M7P0P4m16J66M89n70K30J1j72N3K01j60
$$ -305 53 34 -52 10 0 -198 -199 -244 35 -114 -97 -50 20 94 -322 -156 333 -237 -7 4 -168 -115 86 -74
3317g4R2l22M07J24k57m8J42m2j44J87j07o8K50k27K8L9j74J85L35l41N5K13k88
$$ -74 18 -304 103 227 -30 -78 64 22 -122 65 -42 -110 140 -87 -59 -20 -194 -9 326 -15 40 253 -35
3340c5j42J48K67q3k45J30Q0n5m5J99L9l39J04J29j33j43j11M42J02j54l08M48
$$ -35 -177 -29 238 155 -90 40 120 65 20 219 258 -81 23 152 19 -124 -235 207 309 155 -153 295
3362B95l25k25J95K09K07p38O89j61K31n04L37Lk83K56j46j43j39M7K91k00MJ41
$$ 295 -30 -255 -60 149 356 -382 307 146 377 -127 210 213 -70 186 40 -103 -242 -195 96 -104 -100 41
3384D1R7j58j62M03j33k63O5J33R7j22J21q9j93R1K61j87L9k47K66K3l38J47K57
$$ 41 138 -20 -182 221 88 -175 -110 23 120 -2 119 30 -163 -72 189 2 41 -206 60 83 -255 -108 149
3407A49r0l79K93m3j34L43k29mj21J70L1j18k57K09K00j13k2K63k33rj52J66Q3
$$ 149 59 -320 -27 -70 -204 139 -90 -94 -215 -45 -14 -132 -389 -180 20 -93 -115 148 -85 -94 -246 -80 3
3430Cj07QK06j45l16m6N23m28N0K37l10M14j52P7R5l26K04K5r0L3j45M76l13j07
$$ 3 -104 -96 110 -35 -351 -397 126 -302 -252 -15 -325 89 -63 14 109 -217 -13 12 -78 -45 -190 286 -27 -134
3454a34K82k8l22M84q2m21K15j69L77p9k28L19m14K04j18M6J87r0n2J89R3l88
$$ -134 148 120 -202 282 200 -221 -6 -175 202 123 -105 214 -200 4 -114 -68 119 29 -23 166 259 -129
3476a29k2K94J4k44R0Q1j92o3J50J79k56JJL77k24q8J47J24m05K7L61l58J48P8
$$ -129 -151 143 157 -87 3 84 -108 -171 -21 158 -98 -97 -96 281 57 -31 116 240 -165 -138 223 -135 13 91
3500I1J28Q4o38L75O9r8J64M9r8k21L5J0k03J13N0ork04M52Ql90M71M1l73nl7
$$ 91 219 303 -335 40 109 11 175 224 126 -95 -60 -50 -253 -140 -90 -96 -105 -309 143 151 -239 232 273 -100 -105 -142
3526a42J13P6j37J19m0nm6o6o2L33M7n6r2k64N46k08K0m02L22N4k36L6J78N0l15
$$ -142 -29 47 -90 29 -11 -16 -62 -128 -190 143 190 134 42 -222 324 116 136 -266 56 110 -126 -90 88 138 -177
3551a77K11M7l09J2P7J08l9R3j94K75p1l63L18j32M4k11Q9N09o07L68j29k7M1
$$ -177 34 81 -228 -216 -139 -31 -70 23 -171 104 33 -330 -12 -144 -100 -311 -222 287 -320 48 -81 -108 -67
3574f7m3j20N56m20J11j8P8M5P6l09Q8k42K96J28j67j86K12M7k16PL07J3l79K64
$$ -67 -110 -230 326 -94 17 -1 77 122 198 -111 -23 -265 31 159 -8 -194 18 65 -151 -144 163 176 -203 61
3598F1m00K33j29M07k8l57P3J60q1J92j26k20N9o1J68L29l03m1J26j16J38p5L29
$$ 61 -339 -106 -235 172 144 -213 -140 20 -61 131 5 -215 -156 -217 -49 280 -23 -64 62 -54 84 9 338
3621C38m57R1J4J34k14j25O04j59m74J23K90j59Kj53K71L1m29K07J11K22o57N62
$$ 338 -119 -28 -14 120 -94 -219 385 226 -248 -125 165 6 8 -145 126 157 -272 -65 46 268 -389 173
3643A73o3l26L18k78N83l43p9pq6PJ53j84K53k29L22N4l73Q5k1J03j05l14M40
$$ 173 110 -216 102 -176 407 64 -15 -22 -108 -101 52 -132 121 -108 214 268 -105 -20 -41 62 -43 -357 83
3666H3j06k15L00J64p0k48N4Lj7K06j18Rk33M37k7p7k3M9k18j22j47J58L13j07
$$ 83 -23 -238 62 226 156 -92 -38 -35 -52 154 36 45 -188 249 222 145 122 171 -47 -169 -316 -158 155 48
3690D8l14N42k19k09R4l9M10n20J80L62n60K18L1O9k9pm1j6J20k67J20k01K27
$$ 48 -266 276 57 -152 -58 -97 313 -207 -27 335 -225 -7 24 93 64 57 16 0 120 -147 -27 -228 -1
3713aj49K83q7k07J32lj08J8N12m49r2K58J38l45P1K49j55j96pJ28r6N0l1K48
$$ -1 -150 133 46 -161 -29 -32 -140 -122 390 -59 -151 107 245 -100 -29 220 65 -131 -138 -10 -106 -56 -87 161
3737A61J84m21L9p8R6j42K27N4j07r2J70j47L6j47L61k37p7L64m19K35J04j82
$$ 161 345 -76 -37 -115 -19 -161 66 120 13 -79 91 -56 -20 -167 194 -43 -120 244 -175 60 164 -18
3759a8o6R1j3r4J94j70l0K35k40R8R5J38k03l8j37M46j63p3K8M1L83p18N8J66
$$ -18 -84 7 -6 -100 94 -76 -106 129 -111 -13 82 220 17 -21 -158 288 125 52 80 121 504 -214 -156 10
3783A0Rj03J57k91J93m1K25j00j2n9K60j91Q8k45o0K04R2n5J8L4l35J60K09l26
$$ 10 19 -84 73 -218 -25 -66 159 59 47 -12 248 57 145 -100 -160 44 136 81 99 133 -202 -42 167 -159
3807a59J81K00l73M4J21M7j72P8jn4J05M7n6j78M0K30qk3k66m1K76k24J33L44
$$ -159 22 222 -151 -107 14 61 -111 -33 -34 -88 17 64 8 -170 -130 100 92 69 -197 -238 38 -186 -53 291
3831B91k77m03K81K92j03kj77J22L9r5J35l6j58J31Q7j13l2n2J85nj95J51p8P
$$ 291 14 -389 -108 184 81 79 -98 24 63 -32 103 67 -91 40 127 14 -18 -70 115 110 -85 66 -12 -5
3855eO3j12J3mN6P9j11l4n0j68L58Q3k05L43n09J70j15J44j1J02m3l1O5P7j18
$$ -5 58 -54 -41 -45 11 90 -21 -55 -105 -273 85 168 -37 306 -203 -33 -148 -4 -15 87 44 13 78 155 37
3880C7N5j17OK88n10J76l4M7ON7L7p8O5J26j81r3M5J43r5m5R7%J09k00R9J03q2
$$ 37 92 -25 -19 269 -241 -65 -99 -52 -46 11 48 -30 35 161 -20 -113 -68 75 -20 -65 32 32 141 -59 40 143 61
3907F1j31J72j48j8q6r5K49NJ2j84J74j20N02l68Q7j81L22k96j24LJ73J07j72
$$ 61 -70 102 -46 -64 -150 -245 4 9 21 -163 11 -109 393 25 112 -69 253 -43 -167 -164 9 116 -56
3930e6Rj17L25r6k52J30l2K1J95K09m66l31M24J61j18M6k9J19qj09M9J88m71N6
$$ -56 -47 -164 161 65 -187 -57 -89 -68 127 336 -130 -461 -37 124 6 52 23 142 134 25 74 262 -209 -153
3954a53P6L3k5m2K66j92Pr7J68N3o5R0j45p1o9J45j22J04p6K85l73K17j00L78
$$ -153 -77 -44 -69 -111 155 -37 -30 -127 41 94 29 119 -26 -97 -166 -21 -143 -39 -115 170 -203 14 -86 292
3978B92l78J03o2k4N0o1J14K10l75r6L20r5j30O0J03R3O0r4J6j55J97J03n2j39
$$ 292 -86 17 -45 -69 -19 -80 34 244 -131 -227 93 -2 -132 -72 31 124 184 90 106 -49 148 251 199 60
4002F0j65K15n0m50J48M17j19k81L42M0k44L17l23K2J14p4j25K68J46l87J80J75
$$ 60 -105 110 60 -390 -242 175 56 -225 117 157 -87 230 -93 -71 43 -31 -156 112 258 -129 51 226
4024B26k49K0J74l20K75q1J80m59m9K54k52K72K5J07n8M0j96K09J5m75M21j99
$$ 226 -23 -3 171 -149 126 45 225 -234 -283 -29 -281 -9 16 123 65 105 -91 118 133 -342 79 -120
4046a20N3j62J33J74m7k31L91k28k00K73pj00Q4k1P0l6n7R0k30K22Q9k64J28o
$$ -120 -67 -229 -96 78 31 -200 191 -37 -237 36 29 -71 13 -8 62 26 -31 59 -171 51 140 -124 4 -2
4070blK06k71N6K2L2r9J07L67p00J87j23J91j04N6k7Q1j06R6K92l69K57l24M92
$$ -2 -5 201 -70 -14 8 40 -59 48 415 -285 -98 -221 -30 -134 -78 -105 -24 -130 -34 258 -111 146 -178 314
4094C14l17Qo4J30p3N6k1K32r2m14K95N2j18k59L63N2k40J17J91k36j79L78k30
$$ 314 -3 5 -59 71 -2 54 33 265 173 -241 54 106 -12 -271 92 144 -96 21 212 -24 -203 175 -55
4117e5q7J49J4J51om3K14j04j61R4o7l8k00L43L3j87k87M44Kj30J98n73L36n1
$$ -55 -142 7 21 172 166 123 337 233 72 166 99 61 -139 204 237 50 -237 207 209 79 277 -296 40 -11
4141a1n4J24k60K72p6O0j60J90o3L77m36j98L37K88n63J81J0O3pj16J78l68K93
$$ -11 -65 59 -201 71 -5 55 -105 85 22 399 -37 -235 102 390 -173 8 18 81 74 -42 136 -232 61
4164F1k2O9K23p08O44j81l21P6J19p0j56L36J33k25o0j94M87k53J25k04J75j09
$$ 61 39 108 331 -377 267 86 -235 -159 -40 -110 -266 70 203 -22 -82 -276 211 -42 83 -121 54 -55
4186e5k7K06l22K58p1j73L9R8J64K64k62q8K10l23j44J23K44j70k27K95M5n3j03
$$ -55 -82 124 -198 60 -11 -184 -145 -47 117 381 119 31 241 -82 -226 -103 141 -29 -256 39 84 31 -72
4209g2J79j72L8k48K03J69k71J2J55L35k65k07K13J2k02J9K36k5l29M04l08j26
$$ -72 107 -65 -27 -275 -72 97 -174 -162 -7 328 63 -144 69 81 -121 -102 134 109 -220 184 -124 -250
4231b50J81J38l3k61J90J74j89l8P0Q0p5K27l89M15l08J10K70j61l28k36M20J24
$$ -250 -69 69 36 -225 -35 139 -50 -88 -18 62 -13 214 -175 240 -68 42 312 151 -177 -413 7 131
4253A31j10L7J73l38J8M72l92j32J04j33L22n49M83J39l03l9j6L12j63K84j55
$$ 131 21 58 231 -107 -89 383 -9 -141 -37 -170 152 -397 86 225 -78 -117 -133 179 16 300 145
4274A45n5L90n23J94j74l26O13j87n4j83R9K52p9J39j15l8j73K98l02K40j50J64
$$ 145 90 480 -43 151 -23 -349 264 77 23 -160 -61 191 112 251 136 98 -75 223 -79 161 11 175
4296A75M9ok56N6J78N3l37KJ67j63k9J67J05m59O10l03J67m1k40J07PK1j3q2J65
$$ 175 224 218 -38 18 196 249 -88 -86 81 -82 -111 56 161 -298 312 9 176 135 -105 2 9 30 17 -65 100
4321A00K6P9k60j6j52J73J92r5J7K1j30j70L39o1j17m4K30j65m6K7J62j06k72
$$ 100 126 205 -55 -71 -223 -50 142 47 64 85 -45 -215 124 63 -54 -98 132 -33 -79 -52 110 4 -268
4344b68M75k72j60J03M5K61k30j04M7J76k44L11k1J29n34j44L08j50k26M78J88
$$ -268 207 -65 -225 -122 -77 184 -46 -150 -103 73 -171 140 119 248 -286 -430 -122 -272 -498 -20 168
4365A68k26n0L6M5O4l2L2J2R7j06K69k60l9R2J0j7J6L9k81P2J02J29p1r3k30J98
$$ 168 -58 -108 -72 -27 37 5 37 49 146 40 309 49 10 102 112 95 111 150 -131 -59 43 172 101 8 -222 -24
4391b4j0k00L26k1J88l93J78j23O2k72L22J25l9k20O5k4P1j76J66k95K90J95l25
$$ -24 -34 -234 92 71 259 -134 44 -79 -17 -289 33 158 119 -101 -36 -60 11 -165 1 -294 -4 191 -134
4414a34m8K3P9K2J42j6P7k36qK70k12N8j61J45J86k48M6L2P6k55J78k39L55k82
$$ -134 -182 -159 -80 -58 84 68 145 -91 -99 171 -41 17 -144 1 187 -61 -15 17 93 -162 16 -223 132 -150
4438a50K25K9qMk97K51k00J6M76k44L0m85M22K50l55O8OJ2O2O5J9l26k9J19J1
$$ -150 75 104 96 100 -197 54 -146 -130 346 102 132 -353 69 319 -36 32 38 50 112 177 196 -130 -159 -40 -29
4463b9r0L22k43M5j78M60k54j49l9P3J48N8k16K26n4l16J29J19J09k34K44l73
$$ -29 -119 203 -40 5 -173 287 33 -116 -155 -82 66 124 -92 134 80 -236 -107 12 121 -113 131 -242
4485b42K6Q9K69n0p9J20M6r1k41J77r2O7Po9K32k75Q5M8Oq2rK25k3q6o6K62m23
$$ -242 -216 -127 142 92 13 133 179 88 -153 24 -68 -1 6 -63 169 -106 -21 27 33 -49 -58 167 144 58 -8 254 -169
4512a69o7K49J27j64p8K32o1J29m42M6J25J63k32J74j81K8K16K3L2k22K04R8k58
$$ -169 -236 13 140 -24 -102 130 69 198 -244 -198 -73 90 -142 32 -149 -121 95 118 150 -72 132 230 -28
4535b8J31j14k55R8M4K54l1l9J7k60l1J36J39Q9k32M1J98j52k60J02J45K2k49
$$ -28 103 -11 -266 -168 -124 130 99 60 77 -183 -214 -78 61 150 -82 -41 157 5 -255 -153 -8 14 -235
4558b35N02k88j07r8oL93j55k7k01L79p2k35K24l3j12q1P1K07j43L1o9n3l8J05
$$ -235 267 -21 -128 -226 -232 161 6 -21 -222 157 85 -150 74 41 -71 -152 -81 126 -17 14 -55 -108 -146 -41
4582d1qJ54j23l5M2k53L33K45j92M8l45K36J4n3o1M1O9k03J13q1nK1J72l21K17
$$ -41 -49 105 -18 -53 -11 -264 69 314 122 170 -175 61 75 22 -39 2 71 -132 -19 -100 -105 -84 88 -233 -16
4607a6o2k4J11j12J51j30k46N08J03j38k27K33k58R0J74k46Q8J28l46K04M4J35
$$ -16 -78 -102 9 -103 48 -82 -328 180 283 145 -82 151 -107 -17 157 -89 -1 127 -219 -15 29 164
4629A64k08J57j48k27J07K91k25J84j68J15L01m98Q5j92L55j86ll9K65N2j31Q9
$$ 164 -44 113 -35 -262 -155 136 -89 95 -73 42 343 -155 -70 -262 93 -93 -96 -135 130 182 51 140
4651A40l52K10j26J66l26L04L6l9j02K98r2j22j12L29j4j05j9j2k51J46J21j36
$$ 140 -212 -2 -128 38 -288 16 52 13 -89 209 117 -5 -117 212 198 93 74 62 -189 -43 78 -58
4673e8j59K20J98k90J48l47J90J69Pk01J23PJ63k05j9k60J53K30j47P3p6J97k13
$$ -58 -217 3 201 -89 59 -288 -98 71 78 -123 0 7 170 -35 -54 -314 -161 69 -78 -5 -81 116 -97
4696i7rK13j07j30K01j21J07O2j32K31l62K25Q7J04k78k66K24J22p1N6l7K79m48
$$ -97 -106 107 0 -130 71 -50 57 119 -13 218 -144 81 168 272 -6 -272 -48 74 3 59 22 301 -147
4719a47nM40Lk65l9j62K16l7o6Q5j67P8P9Q5k01J64Nk89K56p7L53n15m1L60j32
$$ -147 -152 288 291 26 -13 -175 41 4 -62 23 -144 -66 13 98 -103 61 66 -223 33 -44 309 -206 -247 113 -19
4744a9J8j53L84J72o48J17J83O1m12K55K76l51p3L03O8l00J68q9n3Pq2R3j8K95
$$ -19 -1 -154 230 402 -246 -129 54 115 -297 -42 234 -117 -190 113 181 -119 49 -40 -93 -86 -168 -75 -93 202
4768B02k11%K03m2l59J43K17l20J62%j34L45j85N3o0j54L87K3k15j88J99Q3j91
$$ 202 -9 -9 194 152 -207 -64 153 -167 -5 -5 -139 206 21 74 14 -140 247 270 55 -133 66 149 -42
4791d2J41J5j70K17k40r2K76p3N8j07o0l3J79j62K10r0L1k55M08j84p8k7j25J86
$$ -42 99 114 -56 161 -79 -171 105 32 90 -17 -77 -110 69 -93 117 27 58 -197 211 27 -51 -78 -203 -17
4815a7M4j20j42L54N2l12L10j91Q0l51L63J16j65k19J44J5j9J61k52J34J95k37
$$ -17 27 -93 -235 119 171 -141 169 -22 58 -293 70 186 21 -198 -54 -39 -58 103 -149 -15 180 -57
4837e7L66k37l57L53j66J1M2l2J44J4j40K92k59m4k97O46k50j75kL52m44J65J62
$$ -57 309 72 -285 68 -98 -87 -45 -77 67 81 -59 233 -26 -70 -367 279 29 -146 -148 204 -240 -75 87
4860H7L5j01M9lK16m37J41O1R1o7Q3k05J15q8J97l19R8m9J73K52k90r1m3J85n4
$$ 87 122 21 70 67 283 -154 -13 48 139 72 155 -50 65 -23 174 -145 -47 -96 77 329 39 -52 -95 90 36
4885C6J66j61p7K05N0l82J47j17J37J87l63L41n5k02J08M8n8M0L1j29J06q4R0
$$ 36 202 41 -36 169 219 -163 -16 -133 4 191 -172 169 114 -88 20 68 10 50 81 -48 58 -26 64
4908F4R7k77j87L26J16j73p6J79O4P7K0j23Rk17J25K03n9m31K48O3J67l29K46
$$ 64 161 -116 -303 23 139 -34 -110 69 133 210 230 107 116 -101 24 227 168 -263 -15 48 215 -114 132
4931A32r6j86m4M09l37J94j19j33K74k39L42j40N4J5k16J82l1O6J3n5j64j82K45
$$ 132 36 -150 -194 215 -122 72 -47 -180 94 -145 197 57 111 126 -90 92 61 127 140 85 -79 -261 -16
4954a6k0l4N9J42l9j72J8K90l15L52j39j23J21j82J39j32q2L96p7k46jJ51J12
$$ -16 -36 -70 -11 131 92 -80 -62 228 -87 265 126 3 124 -58 81 -51 -133 263 186 -60 -61 90 202
4977B02J5j81j62N9k41L23J50j50q6L35k60k10J5J88p2K1n4K71j18j46j00K32
$$ 202 217 36 -126 -67 -308 15 165 15 -71 264 4 -206 -191 -3 -75 -54 -108 163 45 -101 -201 31
4999C1O3qMJ50k19L2m5o9L23m31K53l2j42K15K08r7n57L39ln1J06r8J11R9k07
$$ 31 94 86 90 240 21 53 8 -61 262 -169 84 52 -90 125 333 236 -321 18 15 -36 70 -28 83 182 -25
5024b5l7o8L2Q4R6p2q0k87M23j84q9J10K22l81K07K67k74p7k0R9o9o1J69R9J17
$$ -25 -62 -130 -98 -14 82 10 -70 -357 66 -118 -207 -97 125 -256 -49 218 -56 -133 -153 -54 -123 -184 -15 84 201
5049B01l36K00K2k14L89Pj56k09N9K7L5Ol72O39j78k76L54j79J02j06p8Q0J44
$$ 201 -135 65 87 -127 262 269 113 -96 -37 -10 25 31 -341 298 120 -156 198 19 121 15 -63 17 161
5072A61o8k81L13k82M31k38r6O3M1j08M0p5j08O9K07J6P7j67j20J01Q3J8k50K85
$$ 161 93 -188 125 -157 274 36 -60 3 44 -64 -24 -99 -207 -138 69 85 162 -5 -125 -24 59 77 -173 112
5096A12m4J37l90k9n7L36p0K4q5n0J16nJ63P3l77K03L4j23rL44m17L00j33m3o
$$ 112 68 205 -185 -214 -271 65 -5 19 -66 -116 0 -5 158 231 -146 57 91 -32 -41 303 -114 186 53 10 4
5121Do7qJ69j3j81K66k12l1k2J32j48K11J55r2n10L70O4K0Q0l69M73k60m2j16
$$ 4 -63 -71 98 85 -96 170 -42 -73 -95 37 -111 100 255 163 -347 23 87 107 187 -182 291 31 -11 -127
5145a27J39j58m5L81kj84K4K0j33k10L87l07L38n27M06J35l55J95m3J74n58M94
$$ -127 12 -146 -191 190 188 4 28 48 -85 -295 92 -215 123 -404 2 137 -218 -23 -66 108 -450 44
5167D4J37j98k90L39j81K49p5j07j4K69k61K41l83L57j68K79K44n66p9K56j83
$$ 44 181 -17 -307 32 -149 100 25 -82 -96 173 -88 153 -230 127 -41 238 482 -84 -163 93 -90
5188i0j61L48Op7nLJ35l03J56L33m34K91l47K79j08j05K21N3m01l2L49J0r8j79
$$ -90 -251 97 103 26 21 24 159 -144 12 345 -89 202 -145 134 26 -79 142 195 -206 -238 111 121 23 -156
5212a56K51L8k04k4J81j06q1K15j67P9M6m8L5q8J49k50j59L29J73l48L20j05k24
$$ -156 95 133 -71 -95 86 -20 -101 114 -53 26 72 24 59 -29 120 -130 -289 40 213 -135 185 80 -144
5235a44K96K6k63K10o1k47J51L7m4J82k77J04j32J91R1j61k92L55k34K55o1r4
$$ -144 152 178 -85 125 64 -183 -32 5 -39 143 -134 -30 -162 29 120 -41 -333 22 -212 43 -18 -112
5257a12K98k37k5L96l07k15J68J19K8k14j35L47KJ5p4L3p1J0J31J6j61J02j17
$$ -112 186 -51 -76 320 13 -202 -34 85 113 -101 -236 111 113 128 54 87 16 26 157 173 12 114 -3
5280cL30k76k21K04J71j51O3Rj1J0j17J45j54J39k01N1P1nj58q5J54K14j69J32
$$ -3 327 51 -170 34 205 54 117 126 115 125 8 153 -1 138 -63 -12 59 54 -104 -189 -35 179 10 142
5304A42j42J96k8j13l47L23l26L51M6J47j50j90o6M32m65R0J96k77K99k19P9k
$$ 142 0 196 168 55 -292 31 -295 56 102 249 99 -91 -157 275 -190 -100 96 -181 118 -101 -22 -24
5326b4j51J90K45L7l12j4N6K02n4k17o1J51n2k06M47l70J52j35M93k55j24m8J13
$$ -24 -175 15 260 297 -15 -29 27 229 175 -42 -103 48 -4 -210 237 -133 19 -116 377 122 -2 -50 63
5349F3l72M32k52L9JqJ33Pk36J62J97k17J05j52r4L2J8K10m59L84K86k45l4l62
$$ 63 -309 123 -129 -90 -89 -97 36 43 -193 -31 166 -51 54 -98 -192 -160 -142 68 -391 -7 279 34 0 -362
5373c62M78j42j05K54O5l30K00M3K15l54m9N5K0k33J94J06j50K39l88J53L52k05
$$ -362 116 -26 -131 123 188 -142 58 101 316 -38 -87 -32 -12 -245 -51 55 -95 144 -244 -91 261 56
5395E6QJ54k05pK04j07k13K65k77n4J29j62K02m1o4K43k12l6J3p1K53J01k58J46
$$ 56 64 218 13 6 210 103 -110 155 -122 -176 -47 -209 -7 -48 -112 131 -81 -117 -104 -175 78 179 -79 67
5419F7J54j14J3J7j84J87j35j02J78K1k12P6k11K43j79J59r3L00k70l7Q1J2K1
$$ 67 221 107 120 137 -47 140 5 -97 81 102 -110 -34 -245 -2 -181 -22 -115 185 -85 -122 -41 -29 -8
5442ho1J75l31K91l5j83K18K15o44K73J42k7J35l88K97jJ23j86j25j05L54j07
$$ -8 -69 106 -225 66 31 -152 66 281 -363 -90 52 25 160 -228 69 68 191 5 -120 -225 129 22
5464B2m1J34R4j61j28P7k59M38k72J53r0k5J91l72kJ89Rl8O0j13K93j61m4J27
$$ 22 -19 115 209 48 -80 -3 -262 176 -96 57 -33 -58 133 -239 -241 -52 -43 -81 -21 -134 159 -2 -46 81
5488H1j40L5Q8l4P6j02o3Q1n6J3J77r8j46J15j37q6J67j2K15k56q7K76j23j26
$$ 81 -59 -24 64 30 106 4 -59 22 -34 -21 156 58 -88 27 -110 -196 -29 -41 174 -82 -169 107 -16 -142
5512a42L08l0k54O9J64k6j25k0L57q9m00J78j82j28K39J64q2n7n5K8J07lJ12p1
$$ -142 166 136 -118 -49 115 89 -36 -56 301 212 -188 -10 -192 -320 -81 83 1 -56 -111 -83 24 21 133 62
5536F2J07k23j56M0L65pj63q3J09j09J59j57p2oJ65J22p2n1j29k27L35J25k52
$$ 62 169 -54 -210 -170 195 188 25 -58 51 -58 101 -56 -128 -134 31 153 81 30 -99 -326 9 134 -118
5559a18K63m58M60q7q8M2M3n6k70L85n8r5Q6m5j04N8R7J38L5m00K75J54j71J46
$$ -118 145 -313 147 60 -28 14 57 1 -269 116 58 -37 49 4 -100 -42 55 193 228 -172 103 257 86 232
5583B32k11K22j92k0O3m6l08L86k30K01m23L01k0Jp5j8J00j56J03L00m78K49l9
$$ 232 21 243 51 31 94 48 -260 126 -104 97 -326 -25 -45 -44 -119 -137 -37 -193 -90 210 -268 -19 -58
5606e8P3L8k43J76r6m9j0J03J74J73j09Qj16K71m55K96k41j19n6L5K72r8j70K27
$$ -58 15 53 -190 -14 -110 -159 -169 -66 108 281 172 180 64 335 -120 176 -65 -184 -240 -205 67 -31 -201 26
5630B6j19K32j04j05k50L18J43m1j66p0R8j2K31K4q6r1q2l3P8O4j9l17K94M5O7
$$ 26 -93 139 35 -70 -320 -2 141 100 -66 -136 -38 -50 181 205 119 28 -54 -87 -9 55 36 -281 13 58 125
5655A25P4l28MK0J18M5j50j58M79k55J40r4j00J19l0J31r3j96K98l5J76l82j5
$$ 125 199 -129 -125 -105 13 58 -92 -250 229 -26 114 20 -80 39 9 140 47 -149 149 114 290 -92 -107
5678a07J90j33k0J45J33m61L68n9K26k84j82J1L01l22J80Q9Q1j82L5J51k53K65
$$ -107 83 -50 -70 75 208 -253 115 56 282 -2 -184 -173 128 -194 -14 75 156 -26 9 160 -93 172
5700A72l59J87j17R4J32j39m3q2J04J68Qj77qj13J07L88l74l80N29j18J68n2K1
$$ 172 -187 0 -117 -23 109 -30 -73 -155 -51 117 125 -52 -60 -173 -66 322 -52 -432 97 -21 147 95 116
5723A16lO5m03J77J21p7l9J60j15j98OK85Nk32j2Q2R2N6j66J70j07q5K8j98M60
$$ 116 113 178 -225 -48 73 -4 -43 117 2 -196 -190 95 100 -132 -144 -62 30 86 -80 90 -17 -102 -74 -272 188
5748A88j95P4o8J03j54K6K38k04J65j9k83J57l8J65O2m63K45q1j59J24L39K0m17
$$ 188 -7 67 -1 102 -52 -26 212 8 173 154 -129 28 -10 155 217 -246 -1 -82 -241 -117 222 242 -175
5771a75J48J71ok42J14J03j5n1j41J83j72P3J93j31j84L02p1l9j4j04K30m25L96
$$ -175 -27 144 138 -104 10 113 98 47 -94 89 -83 -10 183 52 -132 170 99 60 46 -58 172 -253 143
5794A43R6j92j84o2L44j15K08k89j13PK25k39J94j44j42j0J55k4M41r1m72K7L08
$$ 143 239 47 -137 -199 145 30 238 -51 -164 -157 68 -171 23 -121 -263 -273 -118 -142 299 208 -264 -237 71
5817G1j18K24l10p0M10M0k83N4q6M7q2J78j74J17j50J16J16J7k83J10rq0Q7J20
$$ 71 -47 177 -133 -203 207 247 -36 18 -68 -21 -103 75 -99 18 -132 -16 100 117 -166 -56 -65 -145 -58 62
5841F2Lj16J81j73k54M45l59M05k07j01L1J17J53j77R7l57K31K94n86j25O35j39
$$ 62 65 -51 130 -43 -297 148 -211 194 -13 -114 -83 34 187 10 107 -250 -19 275 -311 -436 199 60
$$ [...]
8191B4
##END NTUPLES=NMR FID
##END=
