##TITLE=1H_Pr 5050-m
 CDCl3
 8 sc, 
 23.09.2022
##JCAMPDX= 6.0         $$ Bruker NMR JCAMP-DX V2.0
##DATA TYPE= NMR FID
##DATA CLASS= NTUPLES
##ORIGIN= UXNMR, Bruker Analytische Messtechnik GmbH
##OWNER= root
$$ XWIN-NMR		Version 3.5
$$ Fri Sep 23 15:33:15 2022 Russian Standard Time (UT+4h)  she@DPX200
##.OBSERVE FREQUENCY= 200.1313499994
##.OBSERVE NUCLEUS= ^1H
##.DELAY= (6, 6)
##.ACQUISITION MODE= SIMULTANEOUS
##.ACQUISITION SCHEME= undefined
##.AVERAGES= 8
##.DIGITISER RES= 18
##SPECTROMETER/DATA SYSTEM= spect
##.PULSE SEQUENCE= zg30
##.SOLVENT NAME= CDCl3
##.SHIFT REFERENCE= (INTERNAL, CDCl3, 0, 15.7039)
##AUDIT TRAIL= $$ (NUMBER, WHEN, WHO, WHERE, WHAT)
$$ ##TITLE= Audit trail, XWIN-NMR		Version 3.5
$$ ##JCAMPDX= 5.01
$$ ##ORIGIN= Bruker BioSpin GmbH
$$ ##OWNER= she
$$ F:/spectra/data/she/nmr/H-F/1/audita.txt
$$ ##AUDIT TRAIL=  $$ (NUMBER, WHEN, WHO, WHERE, WHAT)
(   1,<2022-09-23 15:32:03.92 +0400>,<she>,<DPX200>,
      <created by zg, POWCHK disabled, PULCHK disabled
       configuration hash MD5:
       00 E9 B6 7A A2 85 ED C7 34 08 36 98 17 FE 4E 26
       data hash MD5: 16K
       95 87 66 ED CE 4F BB 16 6B 89 03 38 A5 9F 07 17>)
$$ ##END=
$$ 
$$ hash MD5
$$ 3B FF 29 F3 23 A0 4E 31 21 9B B6 A3 A8 C9 5E 51
##$RELAX= 
##$RELAX= 
##$RELAX= 
##$RELAX= 
##$RELAX= 
##$RELAX= 
$$ Bruker specific parameters
$$ --------------------------
##$DU= <F:/spectra>
##$EXPNO= 1
##$NAME= <H-F>
##$PROCNO= 1
##$TYPE= <nmr>
##$USER= <she>
##$AMP= (0..31)
100 100 100 100 100 100 100 100 100 100 100 100 100 100 100 100 100 100 
100 100 100 100 100 100 100 100 100 100 100 100 100 100 
##$AQSEQ= 0
##$AQ_mod= 1
##$AUNM= <au_zg>
##$AUTOPOS= <>
##$BF1= 200.13
##$BF2= 200.13
##$BF3= 200.13
##$BF4= 200.13
##$BF5= 200.13
##$BF6= 200.13
##$BF7= 200.13
##$BF8= 200.13
##$BYTORDA= 1
##$CFDGTYP= 0
##$CFRGTYP= 5
##$CHEMSTR= <none>
##$CNST= (0..31)
1 1 145 1 1 1 1 1 1 1 1 1 1 1 1 1 1 1 1 1 1 1 1 1 1 1 1 1 1 1 1 1 
##$CPDPRG= <>
##$CPDPRG1= <>
##$CPDPRG2= <>
##$CPDPRG3= <>
##$CPDPRG4= <mlev>
##$CPDPRG5= <mlev>
##$CPDPRG6= <mlev>
##$CPDPRG7= <mlev>
##$CPDPRG8= <mlev>
##$CPDPRGB= <>
##$CPDPRGT= <>
##$D= (0..31)
0 1.2 0 0 0 0 0 0 0 0.06 0 0.03 0 0 0 0 0.0002 0 0 0 0 0 0 0 0 0 0 0 0 
0 0 0 
##$DATE= 1663932723
##$DBL= (0..7)
120 120 120 120 120 120 120 120 
##$DBP= (0..7)
150 150 150 150 150 150 150 150 
##$DBP07= 0
##$DBPNAM0= <>
##$DBPNAM1= <>
##$DBPNAM2= <>
##$DBPNAM3= <>
##$DBPNAM4= <>
##$DBPNAM5= <>
##$DBPNAM6= <>
##$DBPNAM7= <>
##$DBPOAL= (0..7)
0.5 0.5 0.5 0.5 0.5 0.5 0.5 0.5 
##$DBPOFFS= (0..7)
0 0 0 0 0 0 0 0 
##$DE= 6
##$DECBNUC= <off>
##$DECIM= 32
##$DECNUC= <off>
##$DECSTAT= 4
##$DIGMOD= 1
##$DIGTYP= 9
##$DL= (0..7)
0 120 120 120 120 120 120 120 
##$DP= (0..7)
150 150 150 150 150 150 150 150 
##$DP07= 0
##$DPNAME0= <>
##$DPNAME1= <>
##$DPNAME2= <>
##$DPNAME3= <>
##$DPNAME4= <>
##$DPNAME5= <>
##$DPNAME6= <>
##$DPNAME7= <>
##$DPOAL= (0..7)
0.5 0.5 0.5 0.5 0.5 0.5 0.5 0.5 
##$DPOFFS= (0..7)
0 0 0 0 0 0 0 0 
##$DQDMODE= 0
##$DR= 18
##$DS= 0
##$DSLIST= <SSSSSSSSSSSSSSS>
$$ [...]
##$SUBNAM2= <"">
##$SUBNAM3= <"">
##$SUBNAM4= <"">
##$SUBNAM5= <"">
##$SUBNAM6= <"">
##$SUBNAM7= <"">
##$SUBNAM8= <"">
##$SUBNAM9= <"">
##$SW= 18.0517283424941
##$SWIBOX= (0..15)
0 0 2 0 0 0 0 0 0 0 0 0 0 0 0 0 
##$SW_h= 3612.71676300578
##$TD= 16384
##$TD0= 1
##$TE= 0
##$TE2= 300
##$TE3= 300
##$TEG= 300
##$TL= (0..7)
0 120 120 120 120 120 120 120 
##$TP= (0..7)
150 150 150 150 150 150 150 150 
##$TP07= 0
##$TPNAME0= <>
##$TPNAME1= <>
##$TPNAME2= <>
##$TPNAME3= <>
##$TPNAME4= <>
##$TPNAME5= <>
##$TPNAME6= <>
##$TPNAME7= <>
##$TPOAL= (0..7)
0.5 0.5 0.5 0.5 0.5 0.5 0.5 0.5 
##$TPOFFS= (0..7)
0 0 0 0 0 0 0 0 
##$TUNHIN= 0
##$TUNHOUT= 0
##$TUNXOUT= 0
##$USERA1= <user>
##$USERA2= <user>
##$USERA3= <user>
##$USERA4= <user>
##$USERA5= <user>
##$V9= 5
##$VALIST= <valist>
##$VCLIST= <CCCCCCCCCCCCCCC>
##$VD= 0
##$VDLIST= <DDDDDDDDDDDDDDD>
##$VPLIST= <PPPPPPPPPPPPPPP>
##$VTLIST= <TTTTTTTTTTTTTTT>
##$WBST= 1024
##$WBSW= 4
##$XGAIN= (0..3)
0 0 0 0 
##$XL= 0
##$YL= 0
##$YMAX_a= 199458
##$YMIN_a= -168912
##$ZGOPTNS= <>
##$ZL1= 120
##$ZL2= 120
##$ZL3= 120
##$ZL4= 120
##$ABSF1= 10
##$ABSF2= 0
##$ABSG= 5
##$ABSL= 3
##$ALPHA= 0
##$AQORDER= 0
##$ASSFAC= 0
##$ASSFACI= 0
##$ASSFACX= 0
##$ASSWID= 0
##$AUNMP= <proc_1d>
##$AZFE= 0.1
##$AZFW= 0.1
##$BCFW= 1
##$BC_mod= 2
##$BYTORDP= 1
##$COROFFS= 0
##$CY= 11.3945322036743
##$DATMOD= 1
##$DC= 2
##$DFILT= <>
##$DTYPP= 0
##$F1P= 2.36226072786647
##$F2P= -0.459571619588291
##$FCOR= 0.5
##$FTSIZE= 0
##$FT_mod= 4
##$GAMMA= 1
##$GB= 0.15
##$INTBC= 1
##$INTSCL= 1
##$ISEN= 128
##$LB= 0.24
##$LEV0= 0
##$LPBIN= 0
##$MAXI= 10000
##$MC2= 0
##$MEAN= 0
##$ME_mod= 0
##$MI= 1.114404
##$NCOEF= 0
##$NC_proc= 0
##$NLEV= 6
##$NOISF1= 3.799351
##$NOISF2= 2.8
##$NSP= 1
##$NTH_PI= 0
##$NZP= 0
##$OFFSET= 15.70392
##$PC= 1
##$PHC0= -17952.22
##$PHC1= 18.60069
##$PH_mod= 1
##$PKNL= yes
##$PPARMOD= 0
##$PSCAL= 0
##$PSIGN= 0
##$REVERSE= no
##$SF= 200.130013532006
##$SI= 16384
##$SIGF1= 3
##$SIGF2= 2
##$SINO= 400
##$SIOLD= 16384
##$SREGLST= <1H.CDCl3>
##$SSB= 0
##$STSI= 0
##$STSR= 0
##$SW_p= 3612.71676300578
##$SYMM= 0
##$S_DEV= 0
##$TDeff= 0
##$TDoff= 0
##$TI= <>
##$TILT= no
##$TM1= 0
##$TM2= 0
##$TOPLEV= 0
##$USERP1= <user>
##$USERP2= <user>
##$USERP3= <user>
##$USERP4= <user>
##$USERP5= <user>
##$WDW= 1
##$XDIM= 8192
##$YMAX_p= 0
##$YMIN_p= 0
$$ End of Bruker specific parameters
$$ ---------------------------------
##NTUPLES= NMR FID
##VAR_NAME=  TIME,          FID/REAL,        FID/IMAG
##SYMBOL=    X,             R,               I
##VAR_TYPE=  INDEPENDENT,   DEPENDENT,       DEPENDENT
##VAR_FORM=  AFFN,          ASDF,            ASDF
##VAR_DIM=   8192,          8192,            8192
##UNITS=     SECONDS,       ARBITRARY UNITS, ARBITRARY UNITS
##FACTOR=    0.0002768,     1,               1
##FIRST=     0,             0,               0
##LAST=      2.2672688,     0,               0
##MIN=       0,             -168912,         0
##MAX=       2.2672688,     199458,          0
$$ Real data points
##PAGE= N=1
##DATA TABLE= (X++(R..R)), XYDATA
$$ [...]
1321B02L45q63j68Q66n12q15N59J28m47K60j78m51R55L08j210K52J341l05o38
1340c71M45J37L29N05r43l98J514J92j625R4J145l71n93q0k64L94L52j211l70
1359a119J332j65j298M24P69m37j39J04l5O11J97r44M52J245o53p60R87L69n25
1378D15N5m2p6O06l95j008P66O49j287l69R33k34n92J17j49J08M33p41l69J294
1398A14J01j306M56J109l83k85K66k7N74K96j005K3J363m11j122O49M47o15j7
1417B27q1m06M79k3j018L85O98r76l21J070l85o94P30J56m10M65n8l10R60N4j110
1438e68P37J180j029o09J009K28m50j37m41M10Q78j231j190J591P00j848m83J214
1456c9K04m66o24m21J379Q85k114o95K624N51k273j31J762M72o40r80R7J935K20
$$ y = [202, 547, -316, -484, 382, -130, -945, -386, -258, -705, -445, -623, -1074, -119, 189, -1021, -769, 572, 267, -371, 74, 211, 540, 1045, 102, -296, 1218, 1410, -215, -121, 1024, 653, 60, -20, -284, 110, 462, -749, -1119, 213, 48, -1250, -826, -57, -494, -633, -529, -564, 47, 244, -700, -248, 997, 344, -416, 571, 940, 415, 470, 428, 352, 958, 563, -445, 321, 970, -317, -686, 247, 13, -579, -462, -611, -503, -70, -811, -1180, 114, 215, -1091, -635, 474, 91, -194, 72, 45, 619, 915, -90, -67, 1296, 885, -237, 412, 859, 244, 227, 146, -260, 219, 196, -822, -437, 261, -715, -1036, 34, -351, -1045, -315, -159, -569, -104, -162, -472, 488, 542, -568, 169, 1349, 320, -289, 720, 948, 498, 361, -80, 330, 1208, -23, -1213, 378, 1078, -770, -1253, -39, 165, -301, -925, -1346, 33, 918, -1196, -1891, 733, 1284, -989, -1120, 642, 1114, 474, -506, -409, 1526, 1746]
1475A746k583o4K725j10k534k13J809O28j486j602J030K148j146k705J029K583
1491A255p36k318M8K148J041k032j823K480K520k519k379K554K207j583j886L38
1507f85K065J164k757k282L474K577m133k521L774J884l029j781J221J970M00
1522A341k926j707L932K350m515k367M649K419l844k178K749K662j166l048j7
1537a666L773J104m100j945M197K570m107l296L598L580l162l953K155L731j189
1552A290l564m72L247K219l347l779L710M969m062n057M368M589l452l471J931
1567h81K792O51k530l138L210N028m227n895M997N438n118m541L799L272j776
1582A081k831j067K862L401l645n157M523N783m909n487M630M934l227m033J476
$$ y = [1746, -837, -901, 1824, 1714, -820, -1033, 776, 1404, -82, -1684, -654, 1494, 348, -2357, -1328, 1255, 519, -1799, -1751, 397, 1438, -594, -2417, 63, 2583, 64, -2315, 239, 2446, 863, -1023, -685, 1380, 2544, -213, -2495, 979, 3556, -577, -3098, 676, 2560, -469, -2250, -1029, 941, 1341, -1585, -3292, 640, 2990, -1525, -3892, 757, 3176, -668, -2846, -97, 2565, 1399, -1649, -1666, 2107, 3211, -889, -2834, 1363, 3933, -174, -3470, 128, 3708, 546, -3407, -1252, 2479, 1290, -2274, -2746, 501, 2720, -627, -4406, -696, 4273, 211, -4846, -478, 4111, 659, -2812, -881, 1911, 2562, 32, -3106, 104, 5132, 905, -4990, 7, 5445, 327, -4214, -415, 2857, 1081, -1750, -2817, 45, 3446, -199, -5356, -833, 4950, 41, -5446, -816, 4118, 891, -3142, -1666]
1597a666L751P83l368k672L496M366l555n496L611O016l575o027K964N298k204
1612A722m429M50L182J553k559l942K264N903k650p050L236P200l471o008L044
1627a555M501j184k835j130K018M023j873o157K516P365l320p232L510N930k903
1642A674m421R22K956J309k331l848K079N570k448o584K676O600k463n825J732
1657b402M945k91l709j121K832K943j893m394J562N599j261o169J058O137r12
1672B924n517L32M220L36k904j839J417L315o47m965K54O050m92o293Q32N609
1688B632o66m110J44K553J421j022l059M15M807k64n625N98N646q08m856M44L529
1705A779L16k352j723J205K939q34m136M96M552m57m503J72L941M52l235j052
$$ y = [-1666, 2085, 2868, -500, -3172, 324, 4690, 1135, -4361, -750, 5266, 1691, -4336, -1372, 3926, 1722, -2707, -2257, 925, 2478, -81, -4023, -1759, 4144, 1494, -5556, -2320, 4880, 1409, -4599, -1555, 2946, 1762, -1073, -2203, -185, 3838, 1965, -4192, -1676, 5689, 2369, -4863, -1353, 4577, 1674, -2747, -1825, 1131, 2440, 109, -3739, -1660, 3910, 1462, -5122, -2446, 4154, 1691, -4134, -2402, 2543, 2252, -1457, -2578, 254, 3197, 1304, -3090, -1528, 4071, 2810, -3359, -2301, 3836, 2924, -2593, -2261, 1959, 2295, -609, -2448, -1031, 2284, 1637, -3328, -3074, 2976, 2484, -3809, -2977, 2632, 1966, -2144, -2000, 553, 1974, 952, -2107, -1692, 3115, 2851, -2774, -2176, 3470, 2662, -2194, -1750, 1779, 2095, -257, -1980, -775, 2164, 1330, -2806, -2310, 2242, 1785, -2718, -2546, 1395, 1847, -1388, -2440]
1721b440K626J877j769k370J198L026m08l203j59L521P49l561j073L318J171k856
1737c53j379J868J509r89k063j62K529O78l167r79L281R31l060p59K366R10j273
1754a12j125M39J888L12k317m53K732N78k586m38K113N17j379r32O67J298l36
1771H66j903J0J985j35j898j61J462L82j146q00P76J261o09j423P18J438m45j053
1789f75K95Q78K91n86o60O86J046p85j090Q26Q55p77o26L55K37K5m03n51M09O46
1809C96p18o98Q01L85o59q7K80J06K12q3m30N16N30n63j59O29Nl14K66q2j18L19
1831E34j68m58L39J38n19j3K58l09o5J94l43r5M53k13m07M23J63k86K25N9k09
1852b99M71J91n86J50P16k64l58L35L9m3J63m25k11O96j61q18K37M94l95k98O9
$$ y = [-2440, 186, 2063, 294, -2076, -878, 2148, 1740, -1463, -1622, 1899, 2648, -913, -1986, 1332, 2503, -353, -1732, 136, 1645, 656, -1407, -1569, 960, 1638, -1529, -2508, 773, 1704, -1356, -2115, 251, 1161, -112, -1237, -798, 1090, 1402, -915, -1368, 1364, 1942, -644, -1082, 1031, 1548, 169, -763, -96, 1202, 866, -1037, -1027, 958, 823, -1075, -1236, 226, 608, -538, -1338, -562, 699, 90, -1333, -615, 823, 378, -675, -380, 498, 789, 203, -457, 229, 1275, 490, -600, 226, 1081, 304, -322, 33, 270, 295, -108, -659, -250, 396, -322, -1020, -219, 166, -493, -580, -300, -194, 18, -65, -495, 21, 551, -12, -171, 458, 463, 149, 415, 333, 215, 534, 366, -92, 247, 385, -134, -147, 111, -198, -263, -69, -412, -507, -54, -267, -674, -251, -88, -374, -149, -90, -299, 172, 363, -223, -73, 643, 379, 21, 356, 395, 352, 515, 90, -121, 575, 414, -404, -167, 327, -68, -366, -297]
1873b97r7K82P1o93N3Q81k67o96M70N01k60n8M4K1N12L5p14K92Q00m54n11L92
1895C07J47k03Kl07q5N19k99o69M54L44o51q5M01k22k7J92k54J13M73m17k19P72
1917B86j5o02M43L93l52M1K20k33J79J97n97L5O58m49o32N46J56n47J2N6j47K82
1939g0r4n90M28N75o46k85P22N2l69K36P1RL56k60k75O29J68p29J11O74l85l74
1961d6K43jn7l9l93J6N98m47o83N53N12o19l61M22K93ml98k13P88M88r61l14J122
1984D99L14q06k48M72N86j18r99j06J343J22j683j05J424J6j173l39N54P28k95
2003A86j328J08J750j57j851K30J741m4j298j63J006Q15o66j223O28J720n65j802
2021i13M56J786k76j618k35J436O50j479j144J302J278j260j426Q18J399l18j579
$$ y = [-297, -394, -112, -41, -734, -681, 200, -67, -763, -293, 208, -52, -110, -66, -45, 467, 502, -212, 80, 880, 426, -85, 307, 454, 251, 253, -54, -139, 380, 81, -588, -134, 210, -441, -526, -125, -347, -374, -182, -436, -323, 150, -267, -486, 286, 271, -331, 112, 505, 153, 194, 414, 181, 360, 557, -40, -5, 653, 204, -428, 118, 274, -273, -261, -205, -352, -70, -164, -754, -326, 249, -397, -682, 40, 92, -277, -41, 30, 39, 395, 135, -140, 489, 657, -72, 39, 713, 328, -46, 197, 196, 139, 100, -293, -277, 321, -126, -809, -256, 256, -363, -724, -302, -9, -13, -411, -624, 164, 652, -309, -623, 499, 813, 7, -241, 231, 817, 699, -300, -406, 937, 1059, -624, -729, 695, 711, -462, -801, -247, 481, 186, -1142, -1034, 716, 559, -1292, -1062, 679, 635, -663, -826, 180, 995, 329, -894, -266, 1454, 889, -913, -457, 1329, 1053, -565, -800, 636, 1286, -193, -1337, -35, 1243, -17, -1443, -625, 774, 456, -1123]
2038a123k96J886P96k140r02K327J016k033q43J560J056p09j322n9J988O49k591
2055g40q94K941P91k937p88K297P43j501j234M56J780J99k581o36L086P95l199
2072a422q01K938R74k218j150J535J703o80k116J44K587M81k794r40K832J393
2088B466k829j699K483J752k057j873J203J825l97k024o87K232J519k677k048
2103b811L042K186l007j915K618J683j590j379L58J672J074k212j886K931K304
2118C068l387k232L345J763k740j532J502J440k32j919j028K391J756k979k155
2133b939L183K187k997k045K450K014j470j963N61K157N36k187j400K465K133
2148B685k513k541K497K699k335k600J703K306j043j988j61J717J216j849k315
$$ y = [-1123, -1419, 467, 1263, -877, -1779, 548, 1564, -469, -1312, 248, 1304, 595, -727, -786, 1202, 1851, -740, -1634, 1307, 2098, -839, -1627, 670, 1413, -88, -1322, -866, 914, 1113, -1468, -2104, 982, 1777, -1422, -2223, 715, 1689, -529, -1679, -144, 1559, 879, -1237, -1093, 1494, 1975, -819, -1759, 1073, 2466, -363, -2062, 421, 2173, 116, -1757, -554, 1271, 874, -1150, -1837, 395, 1914, -763, -2811, 231, 2417, -590, -2505, 113, 1796, 206, -1173, -815, 857, 1931, -281, -2167, 764, 3068, -319, -2551, 794, 2557, -183, -1715, -213, 1227, 995, -924, -1952, 439, 2195, -784, -2939, 244, 2431, -566, -2611, -161, 1853, 383, -1580, -1019, 1138, 1674, -513, -1913, 552, 2685, 172, -2369, 128, 2827, 492, -2108, -405, 1901, 858, -1130, -1291, 426, 1642, -207, -2522]
2163b522K027K922k372l028K421K768k054k107J241J692P4j395j259J659K384
2178B451j976k854K322K909k320k560J847K056j057j762j23J542J155j780k015
2193b165J816K394j905k609J728K458j269k205O43K068J51j802p65J691J529j430
2209C28j946J260K393j031k543Q36K474n89k245J85J685L51j317j154Q91J760
2225A338q28k361P89K477p47k441P33K000l41j394k44R98J097p01j620P55K128
2242A638p45k152P98J940n51j559N2J185N06j088j101Q89J384r13j623O87J534
2259H81m42j487RJ411L49j323o12J280Q60j026q47P54J043k65j104j6J333L04
2277A102j404l91J346L83j142m75P12N20l45q48p7J013J70j279j96J191J47j009
$$ y = [-2522, -495, 2427, 55, -2973, -552, 2216, 162, -1945, -704, 988, 1062, -333, -1592, 67, 2451, 475, -2379, -57, 2852, 532, -2028, -181, 1875, 818, -944, -1067, 475, 1630, -150, -2165, -349, 2045, 140, -2469, -741, 1717, 448, -1757, -1114, 954, 1105, -697, -1462, 229, 1758, 328, -1618, -358, 2035, 1004, -1539, -703, 1771, 1182, -1063, -878, 807, 1158, -159, -1313, -422, 1338, 510, -1851, -1062, 1415, 668, -1773, -1040, 960, 619, -775, -1019, -21, 1076, 375, -1245, -490, 1638, 893, -1259, -461, 1479, 928, -631, -579, 606, 1112, 24, -1077, -188, 1196, 283, -1340, -653, 881, 439, -1048, -1039, 372, 721, -602, -1214, 66, 926, -100, -947, -193, 850, 585, -519, -535, 798, 1102, -302, -693, 653, 1036, -106, -581, 131, 651, 306, -542, -619, 394, 564, -715, -911, 280, 427, -582]
2295e82j69O88L31k73n50J39Q52L1r19J24R19m9o70k5M62K48k74n07K09O28l31
2316B82p14K93M84k75l60j1J80K18k46m92L47N74m42m74N19L42l14q5J23J15K34
2337B98j21l64L37M34m47k66M20N7k52K0p0n2K16j69l96K64K03l58q0K15o5n1
2359b27R9j66M1K94j29j51K27J08j28J59J0j18K55R3l24Q2K34j85j12J26j17j8
2381E3J31k46k08L15J4m41J40K16k11l5J04j52K13J39k91K6M25q9k91K78J50j66
2403G4J28m9q5K52M7m11J49L19l19k52K35j3j67J5j22l8K49j56l16K94J96k97
2425b67l4K85p9K8P4j61J70K59k18j45L96M7l29J25J84j80j7K6j23O5O0k92pL07
2449A74k47k62K27O7k09K6O4o0J74n4k21K89K27l10l0L41K4j99R6pJ41M8k45p1
$$ y = [-582, -751, -63, 268, -5, -555, -416, 436, 467, -452, -328, 591, 542, -128, -153, 309, 557, 283, -224, -15, 613, 282, -432, -139, 345, 70, -290, -301, -121, 97, -149, -641, -294, 280, -162, -636, -117, 225, -89, -174, -51, 64, 298, 177, -187, 150, 584, 137, -129, 291, 348, 96, 116, 46, -6, 210, 41, -355, -91, 112, -246, -326, -111, -176, -227, -128, -294, -253, 41, -88, -239, -12, 96, -32, 127, 137, 19, 274, 367, 43, 125, 359, 174, 62, 188, 71, 53, 184, -62, -270, 45, 59, -382, -242, -26, -237, -272, -168, -320, -107, 32, -259, -233, 192, 103, -188, 90, 240, 74, 202, 153, 68, 320, 367, -44, 105, 424, 105, -147, 88, 75, -92, -77, -199, -237, 12, -144, -460, -166, 30, -267, -301, -16, -95, -67, 7, -154, 16, 275, 57, -88, 308, 355, 26, 151, 335, 155, 138, 164, 41, 106, 166, -126, -133, 174, -73, -335, -108, -41, -250, -224, -160, -220, -46, -100, -321, -32, 195, -115, -145, 196, 220, 21, 117, 110, 251, 299, 54, -17]
2473a7L87l7m68O3L24j74k44K9k3J70j6m22Q7M86k18m76L43L41k30j10R4J09K27
2496B25j17l63L56M59l90m04M48L07m05k02J57J82M6l85l03M98K64o70k81N73
2516eK46m68l23K50M74n1o39%Q56P5q06L1O74J84m60l30L01O56j69r41J93J031
2538G79k42j015J21Q03Qo49l62M17O58m22r59L19J150l85j113L19R96p0p87j64
2558e98O99N67n65p46N91R72m86r99L59J023j20j091j25J037K91j061m94Q65N29
2577F48o74p54L69R22j35j206p1J401K16j493j47J382K13r77l28O16P37j44j176
2596f01J0J557R7j811QJ703k1j462j47R47M56n87r46J67J369r0j710MJ800L0j678
2617i05j35J408M31j045p08Q05J040l92j294K41J467R2j574l21J633N35j575o55
$$ y = [-17, 370, 333, -135, -72, 252, 78, -166, -137, -160, 10, -6, -428, -341, 145, -73, -549, -206, 135, -95, -205, -111, -2, 225, 108, -255, 101, 560, 170, -234, 214, 521, 116, -86, 71, 253, 299, -86, -389, 109, 373, -297, -578, -5, 241, -227, -550, -300, 174, 123, -516, -516, 340, 415, -391, -360, 314, 498, 38, -292, 9, 665, 496, -445, -252, 779, 537, -478, -357, 446, 454, -195, -557, -140, 518, 96, -863, -544, 606, 221, -892, -573, 423, 353, -434, -598, 101, 668, 103, -643, -52, 920, 434, -565, -206, 817, 697, -394, -519, 518, 809, -252, -746, 119, 648, -26, -780, -411, 511, 376, -830, -901, 500, 716, -777, -924, 458, 671, -306, -634, -18, 719, 575, -601, -591, 966, 1063, -748, -740, 963, 942, -520, -667, 280, 736, 149, -797, -630, 739, 649, -1061, -1057, 743, 773, -905, -1040, 368, 799, -246, -954, -149, 891, 499, -795, -554, 913, 1005, -569, -890, 743, 1278, -297, -952]
2635i52J318O88j004q55N13R15p5j197m38J495O14j728o90J757O16j514m86J107
2653H4N78m67p57o9J241N15j576o44J838O29j835n10J534M59j048o32M47Q78m5
2672F20j270l36J491M64j658o07J597O73j374p75J033R52o17j024K59J220J69
2689H17j274m72J366Q21j328r86J330J015j133j024P95Q99l77r30k19R80O30j156
2707b46r95J224J090j288j059J185R00q75o79L39P54K38q24o26J074R09j149r51
2725i79J228Q56r93p77O52P13k08q45k20R15M39j061o36J010O66r19p73O76Q57
2744F01m89q91K39R65J1r04j36Q58M38p27o16O03R25n19r95M93R72m00q78J88
2764b62O86R0o09m57M77O59n26q63M92Q83n06p82L79O08r4m95k05N38M72m81n99
$$ y = [-952, 366, 1054, 50, -805, -292, 623, 548, -649, -1087, 408, 1022, -706, -1396, 361, 977, -537, -1023, 84, 662, 195, -562, -631, 610, 1125, -451, -1095, 743, 1372, -463, -973, 561, 1020, -28, -660, -213, 665, 620, -650, -986, 505, 969, -689, -1296, 301, 974, -400, -1175, -142, 810, 193, -831, -572, 648, 817, -457, -929, 437, 1258, -70, -1056, 274, 1289, 156, -868, -73, 826, 449, -481, -700, 280, 910, -246, -1241, -17, 1073, -215, -1274, -89, 811, -64, -743, -404, 350, 588, -236, -862, 212, 1121, -28, -979, 249, 1105, 112, -665, -13, 700, 492, -353, -573, 342, 781, -280, -916, 94, 760, -159, -932, -256, 601, 112, -779, -540, 425, 436, -468, -604, 254, 692, -35, -651, -48, 877, 358, -637, -144, 828, 428, -450, -262, 424, 514, -95, -552, -75, 584, 58, -805, -313, 570, 64, -718, -339, 269, 175, -320, -525, 13, 485, 4, -595]
2785e95N63O74m53n76L25N36q5n12q0N08K21n85l51N38K91m49l57K24L55o4m77
2806c49j16N73J36o28r0N54J31l69r3J85K50J8l53o4N59N2n53K4N01o5l27j0J21
2829H7J45p4l01o4L78p1l76K4L00k7k56j1R4J80l6k37Q7L06r3k22J36J60Nj1j34
2854a1Q9J91j07k24J65J32k18n4J26q6j7O4j88k1K07j43j75J72P4j76O6J08j10
2877a36P0R8j49N4K00n4j50K07M0j18O1K7j11Q1M6j67J9J12j50l3O4o9k9N9j20
2902a48j8J41n2j45Q8Q9o7O3K2o1J32R7j95K9K36p4j51J54L6n6J2p8m5J33Qk50
2928a00J1K00j61j13P8k8K4mo8m0J93o7j49J41J52j50K8Q2KL4L5o9N1J36j45p3
2954@J57Mj45L4M0q6L6o7j13J36L3k56L9K07j41j05J26N0n8P3o0kJ74J8k07J61
$$ y = [-595, -32, 642, 189, -387, -62, 474, 389, -123, -203, 305, 526, -59, -410, 128, 419, -30, -387, -163, 192, 128, -349, -465, 108, 244, -384, -474, 80, 211, -158, -251, -66, 184, 202, -151, -215, 344, 396, -157, -133, 368, 303, -24, -34, 87, 232, 158, -143, -207, 171, 100, -276, -252, 48, 21, -235, -246, -152, 28, -8, -245, -158, 148, 55, -167, -31, 129, 134, 123, -11, 78, 269, 162, -62, 103, 235, 17, -37, 89, 3, -14, 50, -138, -159, 48, -95, -270, -98, -24, -200, -134, -26, -136, -66, 32, -117, -63, 137, 83, -67, 140, 180, 62, 123, 150, 39, 120, 166, -1, 18, 130, -20, -53, 11, -58, -87, -28, -148, -166, -25, -77, -222, -134, -45, -112, -49, -27, -88, 44, 141, -54, -25, 211, 137, -14, 140, 176, 120, 132, 54, 9, 142, 150, -100, -89, 111, -50, -163, -85, -113, -89, -93, -161, -201, -8, -75, -224, -83, 69, -81, -53, 29, 31, 65, 100, 31, 82, 218, 73, 0, 157, 161, 16, 50, 90, 4, 40, -27, -140, -4, 29, -227, -188, 19, -122, -227, -101, -51, -109, -36, -96, -98, 76, 94, -113, 48]
2980D8J97j92p7J62L0p8Rk6J7O3j21j76J74R7k32m9J60k9j15l3K4J18k7j31M5
3005a42K26p6j74J25J48l8j7q0J16J61j36k38K21K36k32j88J28J31j20j05q6J27
3027a3J61k59k42K98K23l60j93L38Q7j20j15K5K09J70l19j56M35K00m39j21M00
3048B09J36k48j96J45K46n9m17j7M00%m23r2L36J67l08k76K29L86k12m73K54M72
3070B59j72l40M6L25J97k87l40L38N33m10n19L83N37l47m28J57K93N3l33l14L58
3091a1M26m98n25N29M91m55m90L32M22j09m02q8M75K69m55l72N36M54m19n18L93
3112a5N58k27o38J16O48m6o09j39N15K43m20m92L05O40k91p78K27Q29k19p36J37
3133c92O24O8m56k43L39O08l14p95L85R13l52q84L26P08j72n67q8M24L68m19o43
$$ y = [48, 245, 53, -24, 138, 168, 90, 99, 73, 90, 153, 32, -144, 30, 127, -105, -154, 6, -23, -138, -171, -147, -29, -56, -187, -142, 84, 8, -166, -41, 107, 69, 52, -28, 88, 249, 113, -125, 96, 332, 100, -88, 40, 171, 51, -54, -140, -13, 148, -111, -353, -55, 168, -192, -385, -47, 40, -80, -195, -170, 39, 209, -110, -266, 169, 369, -70, -191, 209, 345, 97, -99, 46, 292, 233, -184, -201, 199, 199, -224, -316, 20, 187, -121, -397, -168, 218, 6, -467, -213, 259, 87, -253, -207, 118, 315, 28, -312, 26, 559, 149, -370, 13, 550, 203, -225, -68, 225, 278, -55, -369, -11, 415, -83, -608, -79, 412, -43, -533, -201, 221, 112, -290, -378, 97, 366, -89, -461, 75, 529, 110, -408, -15, 543, 316, -322, -206, 442, 396, -213, -352, 163, 406, -14, -506, -201, 439, 148, -630, -403, 426, 207, -529, -392, 232, 300, -156, -399, -60, 548, 234, -561, -176, 737, 385, -499, -173, 535, 363, -204, -292, 132, 500, 81, -562]
3154e62L61P85l94q71L23Q10k15p79M7O37J97n29l78N17N46l71o47L25P86j82
3174D06q07P6Q60J9q07j02O53K13m94m12K78N48j34q03O5Q38jr47QQ54oo67j02
3197d64M50L16j65n57P2Q62n5r70J34R19o3p80K1N95J62m22m21K24O47j83q07
3218d85J21Q12j02q14k4P25J28o27l08M83M91l88n29K66O38p6o69k2P17K06o98
3239a55k85O85L40n29m03L45M38k17m77o2N72J60o54k92P02K46o57k64M76K95
3259B64l13l14P5M78O2n44j23O63J65n70j62N21J93l14k74K05M03j32n16L7N24
3280C28n0m99p3L90J56l33l22K67L88k44m47K07M39j34l60M9L32J48k69k56K77
3301fM42l30m04L62L33k57k59J01K25L1k68j91K60K71l44k93K44K54k22k26Q6
$$ y = [-562, -201, 584, 190, -681, -358, 452, 237, -542, -495, 142, 339, -190, -568, -51, 495, 124, -523, -198, 588, 406, -401, -325, 535, 554, -253, -355, 298, 511, 17, -395, -117, 431, 297, -506, -441, 397, 396, -551, -543, 311, 305, -362, -464, -14, 302, 137, -420, -348, 514, 459, -511, -377, 542, 479, -301, -280, 315, 477, 55, -366, -142, 505, 322, -485, -364, 448, 346, -468, -492, 233, 361, -266, -574, -91, 400, 12, -517, -251, 387, 311, -358, -380, 337, 543, -155, -440, 245, 585, 56, -347, -2, 436, 219, -258, -320, 252, 412, -242, -534, 168, 414, -243, -507, -31, 264, -49, -363, -288, 190, 252, -292, -415, 248, 413, -157, -319, 202, 395, 81, -193, 12, 415, 283, -233, -196, 328, 278, -221, -294, 96, 252, -81, -403, -136, 252, 8, -439, -232, 207, 73, -287, -238, 94, 242, -27, -283, -6, 436, 106, -298, 64, 397, 140, -119, -18, 207, 238, -30, -221, 39, 310, -34, -327, -83, 171, -51, -277, -191]
3322a91K36K3k73o6K72J67k45j67K79J38j12j26L3K35K1k28n5K79lk62oJ77m0
3345H6q2o2l2J42M7k54n8K69m6k44J03J14o9M9m7l3J37O0j73L7K39p0j39R7P2
3370A43o4L8p5NP9l1j32j1J48r0r9L0j1jK7j05K2J32m8j00O9M6PN5l5m0J32J3
3398A04j35P6J10o8n9O0k4JN5r3p2R7Kj43K3Q0q3l9ml6Q0N8j21m7J77j0r5Q9O9
3427E2k0J5k2l1J39Qj35L9J53r9j06P8K3q1J9o6l4J24n3j64N5J22r3q3P6J3KL7
3455c2p7M1J48o4j61J47J38q3n8Q6K6Oj2j07O0O6n0j39J24L4j24l7L7jpo0k1P4
3483d6K1j21L2J12n1j0ML8K9O7j11J4J76n0j10Q7Q3j19j1K8oJ0Nj46N0J32j71
3510f4j06J52N9j78MP2k4L2J3o6P2J14j35o6J98M3j48K4R9N1n2k1l7R8K2k12L1
$$ y = [-191, 45, 68, -205, -271, 1, 168, -77, -244, 35, 173, 61, -65, -32, 203, 224, -4, -59, 220, 217, -45, -51, 126, 86, 4, -58, -90, 52, 99, -155, -213, 56, 10, -234, -131, -17, -86, -37, -84, -117, 20, 80, -93, -56, 183, 113, -26, 71, 143, 79, 117, 42, 47, 126, 95, -37, -48, 100, 10, -89, -59, -70, -71, -44, -149, -127, 5, -43, -143, -74, -28, -21, 34, -1, -41, 91, 104, -31, 45, 155, 87, 28, 88, 64, 65, 120, 27, -45, 52, 54, -89, -66, 14, -69, -108, -112, -148, -68, -10, -131, -178, -1, -11, -106, -17, 52, 32, 47, 25, -6, 133, 141, 6, 45, 198, 99, -7, 71, 94, 13, 32, -34, -68, 56, 3, -161, -106, 16, -77, -160, -84, -71, -69, -32, -109, -68, 80, 16, -145, 2, 140, 57, -1, 85, 111, 117, 105, -2, 58, 124, 74, -65, 59, 93, -31, -68, -31, -32, -39, -99, -120, -46, -25, -146, -114, -2, -53, -63, -59, -21, 8, 75, -36, -22, 154, 104, -6, 81, 164, 45, 34, 62, 56, 66, 71, -75, -25, 107, -64, -170, -18, 41, -137, -133, -61, -85, -53, -40, -106, -34, 80, -55, -121, 77, 120, -28, -4, 95, 146, 94, 73, 36, 134, 156, -56, -25]
3537b5J31m1j54KM5Q3j30j00J08J16j20j24J35J43j24o5L0J31Q2j61p4J95J53
3560B36k59o6K73M7k05m8O3Q3J1j87r1K44Q3l37j07L34M0k81n2J93R6j14j60J3
3584a91K82N1l20OL35N4k87n9K64J23j73k20J48K67j31l08J00K70m8k86j03K67
3606D1J49k98k37L14K13k43k46K29J89q6k03l7K86J72k94k45M07K77m18k13L85
3627A42J73k38j77O5K19P7l60j85L99J83m45k11M01J77l21k06J70K79n4l15o3
3648b90M07J48m25j53M27K30l58k43K89L33j96l94J53L82n7l82q0L48J70l20l47
3669c58L08M07l57m50L07L86k32l71J18L08J16l14k26L41M02l52m08L78M36l18
3689A21l84K48K88l5l10j21L43K69m22l75L77L84l82l72K19L97j49m14J3M13J09
$$ y = [-25, 106, 65, -89, -87, -42, 41, -89, -189, -81, 35, -85, -209, -74, 69, -55, -120, -90, 41, 123, -38, -112, 83, 236, -23, -89, 184, 231, 26, -22, 41, 124, 135, -52, -143, 101, 184, -153, -260, 74, 114, -167, -219, -26, 70, -44, -204, -191, 91, 142, -178, -172, 163, 217, -70, -129, 135, 258, 85, -135, 13, 280, 149, -159, -59, 211, 163, -123, -226, 41, 190, -108, -345, -31, 182, -61, -307, -78, 111, 25, -178, -215, 71, 243, -51, -296, 111, 388, -30, -243, 142, 315, 77, -100, -35, 184, 261, -99, -284, 115, 298, -147, -358, 43, 220, -101, -307, -137, 142, 88, -227, -290, 117, 265, -160, -313, 114, 344, -14, -257, 32, 365, 169, -225, -72, 310, 253, -129, -209, 139, 309, -11, -358, -50, 357, 0, -450, -143, 243, 11, -360, -242, 66, 182, -132, -358, -17, 385, 33, -375, 3, 439, 121, -263, -15, 273, 238, -72, -193, 150, 419, -3, -378, -1, 383, 1, -371, -152, 245, 96, -318, -305, 108, 217]
3710B17m28j70L80K78l01l26K65M21j77m44J26M80j5m75J1L86R0l07k53K33L33
3731C24j91n00J65M90j40n04R8M01l3k87j09K09L07j96m22K42N06k13m64K25L89
3752B97p4l44l7L12J82k74l38K86L52k55m04J97L19q3l64l3L50J25l72k14L77
3773EK37l29k45K43K49o1l05J1L69J39m25q8L47J49k66j95K03K12j08k60k2K99
3795A59Q2m35m7L39L7k81q5J70J51j26k17Q1L01ql52Q5K67L9k28l7J60J67j33
3818H9k14J53K58j56k61J18J85m4j83p6J76J08j68k30J86J94j89j89J42J71j10
3839d0p5j2J17J11j41j62K32J79k02j36J99R9p2p0m1J29N4j51j27J49J03j58j03
3862a18Q9Q8m5j59jJ18O3j39o9J59M6j25j0M9R0L4j01j8J47L3j34M2P5k7n3oO
$$ y = [217, -211, -381, -1, 277, -24, -350, -85, 336, 159, -285, -159, 321, 306, -169, -158, 228, 318, 11, -242, -9, 324, 133, -367, -202, 288, 148, -356, -258, 143, 110, -177, -286, -77, 230, 34, -388, -146, 360, 147, -317, -92, 297, 223, -121, -158, 154, 336, 62, -276, 10, 362, 107, -297, -100, 219, 136, -228, -261, 89, 214, -158, -372, 5, 242, -87, -332, -89, 160, 99, -206, -195, 174, 313, -112, -200, 147, 296, 30, -165, 38, 250, 142, -118, -140, 159, 241, -194, -241, 98, 135, -146, -231, -61, 90, -36, -253, -172, 129, 121, -231, -146, 121, 160, -68, -105, 55, 222, 89, -125, 28, 286, 130, -131, -13, 172, 128, -55, -131, 45, 153, -15, -245, -59, 135, -54, -243, -101, 70, -40, -115, -127, -10, 101, -40, -202, 30, 209, 7, -129, 70, 169, 97, 27, -14, 115, 169, 18, -109, 40, 143, -15, -118, -29, 59, 14, -145, -146, -28, 35, -104, -173, -14, 32, -93, -103, -54, 36, 70, -31, -49, 98, 131, -3, 39, 114, 87, 34, 28, 34]
3889C4MM1q5p0J14Qj46RP1l5k2M1q3O4N5j14RJ51m0n0M1M1k8L0j1j6P6Kp9JJ20
3920A33n0q5L9k2Kj9o3o3J31k6r4J9J04m1n9K2K0N6J3q2KJ58l0q7M1Q4j4n2kJ9
3950E4O9m0j30L4J34p6j15J8N6ll3q8K0J34j06p6J02P0q4k0L5K3J6J7q7R6J03
3977A23p1r3J34L6q7rK5%K2n8r3Q2Q1j26j03J42L5j47J5N7m3M3m2m9J17K6j08
4004i1J4J27J6j15L3R3L4r2k3M2P3k9r5L4N9l3r2JM9J6o7q4J10M3j06o1J03J2
4032b9j6j2j8O4O6p3o0J37O7j43k6J29J4j19O9nk3R9j17o7J25K3j83k0J45l8j27
4059a38K7L4K9J1r1K4J17K4j61O0J69j1j54K8J07P6q7j06R9J07n6j74P4J17l4
4084I1j36n1J45K6j81r4K07O9k04o9J77K0m7o8mJ67P7k04o8K62P8k58j1K11K9
$$ y = [34, 38, 79, -6, -76, 38, 46, -100, -91, -20, -55, -77, -36, -119, -55, 0, -114, -105, 46, 6, -44, -3, 38, 10, 40, 29, 13, 89, 91, 12, 13, 133, 83, -2, 37, 15, 17, -2, -65, -128, 3, -23, -117, -98, 6, -35, -94, -72, -52, 4, 17, -65, -63, 95, 65, -22, 19, 103, 89, 37, 35, 54, 123, 83, -47, -13, 121, 45, -70, -52, 4, 1, -32, -120, -100, 34, -72, -148, -46, 24, -60, -80, -45, -22, -6, 11, -76, 20, 123, 52, -41, 93, 129, 42, 33, 58, 58, 80, 22, -71, 11, 92, -34, -137, 5, 40, -107, -92, -35, -78, -35, -77, -126, -9, 17, -91, -77, 50, 66, -49, -16, 77, 111, 19, -4, 38, 111, 82, -13, 21, 80, 47, -45, -44, 5, 21, -46, -130, -20, 23, -83, -144, -41, -29, -45, -57, -75, -11, 55, -18, -78, 59, 126, -17, -43, 86, 100, -19, 50, 45, 22, 121, 4, -63, 62, 85, -98, -118, 27, -11, -138, -111, -77, -48, -37, -128, -104, 13, 37, -124, -64, 105, 94, -60, -32, 75, 151, 64, -42, 57, 164, 108, -66, 8, 125, 91, -45, -96, 49, 75, -106, -200, 7, 76, -128, -197, -20, 0, -47, -115, -119, 48, 125, -79, -147, 115, 193, -65, -76, 135, 164]
4109A64j43n8O9J04Lk05n5K66J3l33pK70k3k04k5J08J16q3j90N7K49k8k62O2K54
4134A19L2k11o9K41J08j79j74J72J96j21k37M9K37m8k25m9K23J24k92j63K56J45
4156A34k13j29J32J19L1k31n4K99J05l18q7L60R9k84j20K31J21o9k11J7K58K1
4178B11l49n0L55J3l07r7K33J28j83k17J12K74l5l35K6L38K5k67q4K85J61k71
4200c4j63K26K75j79k81J21K80k2l10m9K61J13k78k01K51K28k72k57K31K08j26
4221B2k31J6K40J21k91j87L18K07k69k31L06K28j92j58O7K15K4k58j12L29J18
4242B82l22j77K60J73j89k24R2K41n5k88rK99M3l23o0K64J64j97j77J25K89q0
4264A31l11P2L44l3k81j6K42Q9k03j86J74K45j77l26J48K63j15k47K7K27K2j78
$$ y = [164, 21, -37, 32, 136, 139, -66, -121, 145, 158, -175, -182, 88, 65, -139, -164, -56, 60, -23, -213, -156, 93, 65, -197, -135, 119, 151, -60, -129, 112, 220, 41, -133, 39, 235, 114, -123, -74, 163, 115, -110, -159, 64, 188, -104, -267, -11, 134, -79, -208, -76, 43, 74, -157, -211, 88, 193, -125, -212, 148, 247, -37, -157, 74, 195, 126, -85, -68, 190, 211, -138, -188, 167, 180, -127, -224, 9, 137, -46, -263, -151, 123, 88, -247, -221, 117, 142, -125, -209, 76, 237, -34, -197, 29, 304, 125, -156, -35, 245, 223, -87, -136, 125, 238, -40, -241, 10, 238, -34, -291, -60, 148, 22, -209, -193, 47, 168, -123, -310, 8, 215, -54, -285, 21, 249, 57, -101, -34, 181, 205, -53, -165, 164, 282, -40, -217, 43, 216, 27, -197, -105, 136, 81, -207, -216, 83, 126, -197, -257, 7, 171, -26, -203, -78, 211, 131, -180, -108, 236, 203, -78, -94, 148, 237, 34, -152, 22, 267, 90, -236, -88, 175, 60, -187, -160, 67, 89, -89]
4286h9j04J55J84j84k30K16K29j04k42J03J91K5k18o9K38J63k67j65K50J43j95
4307C0j59N1K05k9k06q1K53N7k42r5K11R7j46j03Q9J46mk36J8K82K5k44j3J91
4331I7Q8j74q6R7J47k9k11qK27j6k37k5K05k3j23j09J17J35j01j69N9K13m9j71
4355a46M5J40L2q7o2J07J24p0j66R9J52n0j63L1P9N5r5j18Q5J36j40j36J28Q1
4379F1j20p5N1L4M7m2j12J32J29j42p7J19P8n8o8O6O3J2p9l2J05N4j32o4Q0M3
4405G3q2pl4O3K5q9o4Q9M7j05n1Q2N1j2m3l7J34Qq1KJ07K0o1k1M9L1Qp3m1J02
4435I0n2q1RN3l9l5j%J3Qo5mJ26m0j06O5R6m1n1N7J3M0Np8J6J03k2j07P1O8m5
4466F6p6J6oK1L5j03l2J41r7o9M4P1n9j1k4K4M7qo2M7J00l9q1M6Q0J4p5m0R5N5
$$ y = [-89, -193, -38, 146, -38, -268, -52, 177, 73, -169, -66, 125, 150, -68, -137, 101, 264, -3, -168, 82, 225, 30, -129, -78, 127, 98, -108, -189, 64, 121, -121, -216, -5, 92, -54, -157, -68, 78, 74, -162, -144, 138, 163, -81, -94, 97, 185, 11, -75, 22, 169, 140, -71, -79, 148, 132, -105, -130, 75, 52, -71, -180, -63, 72, -29, -198, -139, 74, 25, -146, -101, 39, 71, -16, -78, 29, 153, 83, -83, 16, 168, 118, -45, -14, 65, 120, 25, -93, -8, 128, -12, -148, -20, 61, -59, -134, -83, -49, -2, -44, -156, -24, 105, -37, -114, 5, 83, 25, -43, 23, 86, 98, 19, -13, 92, 146, 14, -50, 30, 73, -9, -16, -50, 13, 38, -51, -115, -26, 21, -84, -135, -53, -2, -14, -57, -94, 40, 48, -33, -31, 76, 96, 35, 14, 63, 94, 102, 29, -12, 90, 38, -43, -34, 19, -20, -55, -56, -56, -43, -35, -100, -104, 22, -18, -124, -59, 37, -4, -55, 2, 15, 55, 60, -18, -2, 101, 79, -28, 43, 111, 66, -10, 6, 0, 21, 56, -47, -79, 62, -35, -104, -60, 11, -48, -59, -83, -59, -12, -20, -82, -35, 65, 26, -55, -9, 71, 85, 10, -30, 65, 120]
4496A20j07m3O3M4n7l3pL8K4j07n9R5M6j18nJ14j6q6M3j9N9L5n5j8J15M0j39K6
4524gJ18n6p9N5J7LO0j25j7J09j4j46rJ43p1q8K5N0J5k7n6L8O3m7n7O9J07k0j04
4553e1L7R0J5q6k6P8O5q4n3M7L4l7o2k8J01K0j48m6J38L7j44j4J14j7l4k7PJ09
4581C5J0r2l3J98l3j50L3J83q8n1k6N3N5j9j11k0J54m2j82M6J32n2q6m2J10J6
4607bn1r0R3R9l9j34M4K02m1j51K5J42M4j42l5J06R9j35j16J11Q6m4j40OJ31K6
4633I4j79n2J88M4k26J0R5M0j2j22j7K01M1k36K9K44k9j71MJ62ln7j08K1J99j3
4659A47k83O6K32r1k05O0J41Rj09j27J12J39j15j69J13J60l0k04O0J58L8j55n8
4682a11J60J47j68j49J93J04j05j64N6J54jj91p2K24N7k25j05K07J02j52j31L4
$$ y = [120, 13, -30, 33, 77, 20, -13, -20, 18, 42, -65, -124, -29, 17, -101, -106, 8, -8, -94, -51, -70, -11, 24, -31, -49, 66, 106, -33, -7, 111, 55, -24, 31, 48, 51, 111, -14, -31, 78, 64, -82, -91, 52, -19, -107, -82, -32, -17, -44, -100, -62, 1, -46, -103, -34, 73, 53, -51, -14, 76, 91, 5, -21, 57, 122, 38, -15, 32, 66, 29, -33, -61, 40, 60, -88, -134, 4, 41, -103, -117, -3, -20, -54, -81, -74, 35, 45, -47, -80, 118, 85, -65, -32, 151, 63, 12, -14, 39, 94, 75, -36, -56, 98, 56, -126, -80, 52, 0, -86, -128, -18, -2, -53, -143, -50, 49, 10, -124, -80, 122, 81, -70, -45, 97, 141, -1, -36, 70, 169, 34, -82, 29, 115, 71, -69, -63, 68, 94, -85, -137, 51, 95, -131, -121, -26, 14, 2, -120, -137, 64, 105, -131, -102, 142, 113, -58, -54, 108, 105, 48, -60, -39, 160, 147, -136, -70, 162, 71, -134, -74, 67, 76, -33, -160, -48, 91, -24, -193, -80, 80, 50, -154, -94, 64, 102, -53, -111, 49, 196, 28, -121, 72, 176, 71, -93, -37, 117, 116, -75, -147, 77, 134, -91, -196, 11, 113, -39, -170, -136]
4704a36K02Ok32MK40O1k57l5K17R1j60q6P9J62n1k01K5K80n2k68K0K01L6k28m5
4729a27P5J41r0k25R2K76r9k34M8K03L2j76j02K06J28j38j70J65J88n5k41R6J71
4752A64k8j91k0J63J06k13j43J90J15j44j85J25J61n4k16OJ95Q6k24r7K19J12
4774A27j86j05J52J59o6j71K2J99L9k31m2K30M6k18n3J00J29p7j93M8K26o1k47
4797a73lK32K4j92n1J36J14r2j47P2K17n2j88K3K39k9k10mJ38R5j17j58J13J69
4821A56j18j70Q6J46m3j40o7J80M0j37j08J53J36j25j40R5J51m4j25k3J80N9j81
4844c9m7J67P4j18r1R5P4l1j28o5J69J3j82qJ56J6j36l4R8M3o5p3rJ69J8j61j2
4871a07K06k3j17j2J15N1n2o3K0Q6Mj67M4J33m8j18rO1M2p7j01O1R7J0j46J9J21
$$ y = [-136, 66, 72, -160, -156, 84, 145, -112, -147, 70, 161, 1, -85, -6, 156, 105, -96, -71, 209, 157, -111, -91, 110, 146, -82, -127, -52, 89, -1, -226, -134, 142, 43, -191, -143, 60, 92, -84, -186, 20, 148, 10, -160, 5, 193, 138, -103, -7, 164, 136, -55, -75, 88, 194, -19, -162, 28, 143, -1, -186, -61, 100, 46, -170, -164, 31, 117, -107, -204, 15, 127, -59, -164, -12, 147, 81, -90, -68, 131, 170, -61, -103, 127, 173, -45, -98, 2, 131, 54, -139, -91, 135, 74, -173, -176, 56, 80, -112, -163, -27, 87, -5, -152, -80, 137, 85, -103, -80, 159, 130, -80, -84, 54, 149, 32, -126, -13, 156, 38, -132, -46, 100, 57, -83, -150, 30, 70, -67, -175, -22, 114, -11, -151, -56, 95, 51, -74, -97, 83, 142, -39, -86, 81, 155, 37, -54, 41, 115, 84, -44, -109, 60, 73, -109, -117, 39, 55, -81, -115, -17, 26, -39, -112, -121, 48, 66, -95, -107, 99, 76, -41, -53, 62, 113, 61, -2, 18, 104, 108, -59, -15, 118, 70, -48, -57, 4, 46, -31, -132, -71, 26, 36, -110, -91, 30]
4898C0l4q0mP5P5p1q5P7J29j01l3M4P1k0p3mL4Q6o6j01Q3N1r0o5O3J5k0k6l7O7
4928a0M6q5o9J20L6p4l0O3K2K4m8kN3M2n0p1R2M9j12l2N6Lol3jOL2p7k9Q7K1p9
4960e6k7O9JK8p7L4N2k0l1pP7j0jm1L7L4J5r6J8R9n5n0rM4m0rn9K5Q5m3r8L9R7
4993B5m6p1O0K3k2JkqR9kj07P8O8p6l9P9J6k4j8n4M2K3m8o7O8M4q4j7J7J5jl3
5025f1l1O5K3j9JLQ7r3kL4L5J1p2K1O7J8r4%O8Kl6k0k4P3k8r9J5Q8l2p7KQ4l9
5058c0k9J0J3L6L3q6M3P8l3q4O5R1p4n6K3L8RKr7M1J05q2q7M1Q3o9m6%N9J6m8
5089c5m8O3P0o4q5O9O9j9n8J3R4J4j00KP3M2p3k4lP7l0r4LJ20k6j42kJ17m7r0
5119a14N6N4J8l6k4l4J40j5j65Q1J50n3r3J9J00j5k2o1N0Q0m1j54P5J30r5j45
$$ y = [30, -4, -84, -88, -13, 62, -9, -94, -17, 112, 11, -22, 22, 93, 73, 0, -4, 30, 116, 50, -51, 32, 83, -7, -72, -9, 6, -14, -40, -77, -10, 36, -49, -118, 2, 38, -36, -66, -3, 19, 43, -5, -7, 46, 88, 38, -33, 59, 108, -4, -36, 20, 23, 17, -16, -17, -11, 21, -56, -85, 2, 23, -56, -83, -14, -13, 15, -62, -28, 24, 4, -27, -34, 43, 33, 32, -9, 28, 62, 77, -19, -1, 98, 43, -7, -16, 28, -12, -21, -80, -55, 30, -13, -111, -72, 25, -21, -92, -32, -9, -31, -30, -32, -40, 59, 57, -50, 28, 96, 20, -19, 60, 76, 52, 34, -20, 22, 45, -3, -70, -2, 42, -42, -59, -42, -27, -28, -61, -92, -27, -4, -23, -22, -19, 68, -25, -27, 7, 42, 53, -19, 2, 69, 87, -7, -7, 61, 63, 27, 7, -17, 56, 28, -71, -56, 32, 0, -77, -75, 9, -30, -59, -49, -36, 0, 33, -53, -10, 68, 35, -49, 16, 107, 33, -23, 0, 38, 47, 49, -48, -7, 98, 16, -71, -30, 53, -16, -62, -62, -3, 13, -35, -83, -20, 50, -14, -99, -30, 39, 20, -38, -25, 69, 83, -17, -15, 58, 100, 27, 3, 0, 77, 47, -47, -44, 76, 50, -92, -94, 23, -24, -114, -58, -4, 14, -22, -46, -80, 60, 45, -120, -39, 111, 58, -35, -16, 84, 69, 47, -14, 36, 116, 75, -79, -4, 126, 31, -114]
5145a14P9Q4l8q5k8Q0N0p5q5P0J19m7j30Q5Q4mj20J5J30M9j38m3J35N0r1m9j0
5172b7J28k5j38nJ68qk13lJ31K7j06k3O1Q7l8j33J0K12n9j53L9J59k9r2j1P4O8
5199A01o2j04M6J37l2j81N7J41n7j15j4J09N9j07r7P9J02p5j24N9J45m6j44K5
5223i8J51J9r6n7J44Q8j55q2J03R9l7j39K9J38Jj73m8J62M2j56l8P6O9l9j16M
5249a09J64j5j41rJ77Lj35l9J41Q7r2j12O0J70n4j90O7J68k9j62J1J12K2p9j08
5274i2Q5R4p4j87P4J40l6j58M3J12L2q0o7J09R5q3j43J36J13o4j03O5J08j1j54
5299d6k2J31O8j27j08J28P6j18j05O7R6Nj76K1J46K2j34m8J41M6p5o2K5J34Jj49
5325f3kJ78j2j22k6J19L4r9n5RJ05mj44RJ58m4j69K2J42k5n0q4O1J47o0j34O0
$$ y = [-114, -35, 49, 11, -74, -102, -22, 28, -47, -132, -62, 57, 10, -120, -35, 49, 45, -75, -60, 70, 119, -19, -62, 73, 123, 32, -17, -27, 101, 76, -62, -67, 101, 93, -120, -123, 8, 35, -71, -94, -33, 54, 16, -117, -107, 105, 46, -107, -68, 91, 62, -30, -41, 33, 101, 39, -65, -19, 118, 86, -95, -38, 103, 46, -69, -83, 26, 85, -22, -119, -40, 62, -13, -137, -78, 67, 21, -123, -98, 53, 72, -24, -81, 63, 151, -4, -86, 17, 116, 79, -60, -31, 107, 108, -65, -113, 49, 91, -65, -103, -27, 42, 3, -113, -109, 55, 40, -101, -110, 67, 70, -65, -104, 37, 124, 32, -80, -20, 150, 96, -94, -27, 141, 112, -50, -39, 73, 95, 16, -92, -7, 87, 13, -174, -100, 40, 4, -154, -111, 1, 33, -47, -114, -5, 90, 7, -136, 0, 113, 49, -54, 11, 119, 108, -46, -68, 63, 131, 4, -104, 24, 100, -18, -123, -56, 40, 45, -131, -110, 36, 58, -76, -124, 17, 63, -12, -74, -49, 85, 86, -63, -65, 113, 101, -21, -47, 72, 106, 7, -48, -39, 66, 62, -82, -73, 85, 41, -128, -106, 36, 11, -39, -123, -62, 85, 25, -109, -49]
5352d9J26l0j19O2J13j2p3n9Q2P4p6j19P2J12p1r1L4P5K4j27m9R8O0j09n8P9O2
5379C1m7n2RR2J2j05J2J05O2j13m9J16lo7oJ5M8L6j19j2R1L8j46qQ9m5j1n0K3
5408e4O8J3j31K0J16rr6L2O9M4p2l1K2P5k8p7K6J16%j30K3O7ql7n7M2L5l1q2R
5438f6Q5k8p0LQ6po2OL6N4n6j4M0M3j9m6mO0L9o0l7M5L1m5o3M7M8l9k6j2oP1m8
5471a4p2O3O6q7l9O5M1l0k3j4M0N5m4l1P0O5j05k3R5kp6K0j1J0K2o2l7Q4L1r4
5501c7m3Q8ql8k8K7L9j1o4K6N5J1k9QK6J9J0p0M3L9j6p8L6O7m6j3l6J8O6n1r1
5532h1N1P9q1o7P2L8n5nlJ2N7j8n5M4R2o1q7R8O3q4j1K4JL4k5o2N0O3o5o5N3M0
5564D6p4k0J4K2j3m9j2P3Rm6oL7O1l7n4M3N8j6n5J2Q3m5n6M1K9j0jm8j9P3k5q7
$$ y = [-49, 77, 47, -72, -10, 103, 91, 18, -41, 41, 115, 39, -80, -8, 104, 33, -58, -24, 51, 75, -52, -101, -3, 57, -52, -110, -31, 31, -16, -68, -59, 33, 45, -60, -48, 57, 119, 6, -43, 73, 70, 3, -3, 12, 60, 96, -23, -35, 56, 94, -52, -60, 29, -16, -27, -77, -54, 14, 27, -104, -84, 32, 23, -73, -41, 28, 72, 0, -31, -9, 66, 38, -39, -13, 103, 103, -27, -4, 63, 55, 18, -39, 3, 38, 7, -75, -66, 19, -9, -79, -76, 10, 3, -59, -53, -17, 37, -19, -33, 7, 50, 31, -15, -19, 41, 80, 20, -17, 28, 59, 14, -49, -2, 46, 7, -19, -31, -37, 34, -14, -86, -23, 43, -44, -83, -18, 23, -7, -30, -44, -4, 51, 7, -24, 46, 111, 6, -17, 78, 76, 0, 20, 9, 19, 41, -21, -58, 26, 57, -37, -80, 8, 0, -38, -66, -39, 0, -11, -75, -49, 6, 17, -12, -4, 22, 41, 51, -19, 24, 63, 47, -31, 5, 72, 26, 13, -23, -5, 61, 10, -81, -30, 49, -32, -99, -27, 11, -44, -49, -52, -40, 17, -1, -56, -12, 80, 19, -68, 30, 93, 9, -2, 22, 23, 57, 32, -30, 20, 83, 18, -47, 6, 46, -28, -48, -34, -12, -25, -74, -86, -13, -4, -50, -56, -19, 42, 5, -49, -6, 52, 36, -19, -7, 76, 31, -25, 16, 45, 35, 34, -14, -33, 40, 15, -72]
5596g2L7R8r2m1L9PK0qp3L6P5j1p4J5J25o4m3M4K4pj7k5J7P2n2o5L0J01p0q1L1
5627b4O9k6o8J3K4K8o3m0O0M4m8l9M7R0p1m1M2Q2Kq0K0J6L1l7k5J1N5l0q0pJ42
5658I7o0j66J08N8m0m2kQM4j1q6RJ60o4j03O2J30q3o0O4M4mk8o6L5R9l6j06O8
5687B9O3o9o0J5O5J2j00j9O2N2j04l4P1O2n2p5K5J21k8r7M1P9Qp5jN8M1l6q7K3
5717a0Q5k0j03J7J07o7n1k0P4K6l9o6jJ22n8r8N2Q6nj01M6Q6j9k9m8L6Q4n3n8
5746b5RJ15p9q2L9J06k9q8n8Q4L8n8p6O7J13j09p9N6P3rp1l3J15L4o3o5J24M9
5774I8q0m2M8P7m2r4%Q6L7j15k6J02M3j06o3O5L5lj25K5J13Nj41J6J13kk6n8N2
5803hO4kj22N3J21m8p8rJ25m3n0k5M8K2Nj28M1R6o5r6N4J03n7n6%O3N4j01o5J37
$$ y = [-72, -35, 63, -29, -70, -31, -24, -4, -12, -85, -49, 26, 15, -59, -44, 81, 17, -26, 18, 42, 35, 18, -7, 10, 82, 30, -35, -5, 96, 26, -55, -24, 45, 19, -49, -36, -12, 16, -47, -87, -27, 17, -31, -70, -23, 67, -4, -45, -3, 79, 81, 1, 21, 37, 68, 31, 6, 17, 72, 42, -38, -45, 97, 37, -129, -21, 37, -3, -45, -47, -39, 5, -6, -92, -83, 77, 13, -90, -28, 102, 19, -41, 23, 67, 63, 35, -31, 4, 103, 67, -39, 29, 92, 23, -37, -22, 43, 55, -45, -64, -2, 50, -54, -88, -17, 45, -7, -82, -57, 64, 36, -61, -20, 59, 67, -8, -9, 49, 90, 54, -33, -10, 75, 55, -48, -31, 76, 9, -42, -62, 12, 38, -1, -67, -68, 54, -4, -102, -50, 36, 31, -70, -24, 62, 43, 14, -34, 2, 86, 33, -25, -16, 99, 20, -62, -23, 83, 54, -34, -92, -8, 30, -28, -104, -37, 76, -33, -112, -56, 17, 8, -63, -96, 19, 53, -10, -75, 49, 98, 18, -24, 24, 101, 59, -35, -35, 51, 88, -27, -53, 49, 92, -14, -77, -12, 23, 20, -105, -80, 33, 38, -103, -87, 26, 24, -2, -60, -8, 56, 54, -68, -15, 106, 58, -20, -29, 96, 53, 3, -22, 26, 48, 53, -75, -34, 62, -3, -99, -45, 58, 1, -55, -55, 8, 62, -39, -104, 33]
5833C3N6q9p0O7N1Ko0NP0J7q6k7Q2M3j05l3L3O4m9n1J1L7M3j27J1O7K4l3o2O5
5863a1L3Op5L2J17l4r5jJ24k2l6k6L0L6l6j10O4N5m4p0M9M3lr4J4K7K0op9M4P1
5894B3j2p5M1O5l0n0J8M4L5o1l0O3P3n3q9M2N3j1n7qM1Pm3l4L0N7n2q8M6O6%o1
5926e0k0P7Mm3qO8M1o0k9L9N1l8l6J4M3Rp5J7M4k2m8NmJ4K0r6J0O5K6j01L0O8
5958A5j9l4K6j1M1Rn4OO0K8j00M1L5J1n4J9RJ2Qm1l1L5J3q4L3M7k1m0lK9K2l7
5990c0K0QM1k8l8J3M5L3o2k2M9L6n4rK7om1QJ7J5k6pk5L9Qo9j1Q3J0p3J2J0J8
6023i%mk9M8N7r7kP6K1m7mRK3Kj3k5J7K4n3j4J9K4o0qK6L5l9l0OQK7l1K1L3pq
6059doK3M9l0q5O8N5m6m3O6k1J6k6J7k5K2j6q7O0N1p3rL4J5n0J9j7%P1l3o3M7
$$ y = [33, 89, 0, -70, -3, 48, 50, -10, -5, 65, 82, -4, -31, 51, 94, -11, -44, -11, 53, 4, -47, -36, 1, 44, -83, -72, -5, 19, -14, -76, -11, 22, 28, -47, -15, 102, 68, -27, -28, 96, 74, 38, 12, 42, 78, 42, -68, -4, 51, 7, -63, -14, 29, 26, -68, -54, -27, -7, -13, -92, -48, 23, 11, -64, -23, 42, 12, -38, -20, 24, 59, -2, -32, 31, 104, 51, -38, 4, 57, 46, -11, -19, 22, 29, -14, -48, -18, 39, -13, -101, -55, 11, 11, -50, -70, 7, 11, -32, -40, 28, 69, 9, -20, 19, 70, 32, -4, 10, 53, 62, -13, 4, 48, 26, -22, -17, -21, -7, 13, -83, -73, -8, 18, -83, -53, 15, -4, -38, -12, -23, 18, 27, -27, -21, 39, 67, -33, 8, 43, 54, 0, 19, 28, 40, 48, 7, -24, 11, 24, -60, -27, 20, -1, -41, -44, -15, 7, -30, -10, -2, 39, 11, -27, -14, 31, 64, 2, -20, 29, 65, 11, 2, 29, 23, -18, -10, 7, 22, -4, -11, -36, 3, 11, -58, -69, 14, 24, -49, -37, -27, -9, -9, -13, -42, 6, 63, -34, -36, 40, 61, 14, 10, 19, 42, 44, 31, 6, 23, 47, -6, -20, -1, 23, -37, -45, -19, 16, -23, -53, -47, -39, -12, -43, -22, 11, 4, -4, -10, 13, 62, 32, -53, 15, 70, 24, -19, 47, 26, 42, 16, 33, 8, 30, 14, -73, -13, 38, -35, -44, -10, 5, -45, -26, -43, -43, 28, -5, -68, -21]
6091b1Q6q0j8J02n2Mj8K2mM5k2o2M9O0p8m7P6kn9l9M1O%k6j0K9RJ3n0K4O1l6m1
6124c8M3N0k5o6N7Mj9mRJ4N2n0q6M6Q0o5q8N9K9m1J6lJRMn5K9O5l3o9O9M8o9K8
6158AJqK3Ql4J8P9n7o4N7J1n2k7M4J9k3k2lJ9Jl7k4N6J6k5n9L4P5k4l8K4M9kn0
6192a4PK9L6Rp8J4M8m4l3K2N9n3m2M4J5k5k7j2J1N7l2q5L6R2l8p2N2N0Jl6%K0
6224A1N7n6k3K9L0l9k0K2N2k5m8l4P7ko8NK8Pk8k0J2O4l1n2L2N9J0r9L3Q0j0l1
6256B2k8ON5j3o2PQ6n4q5L2P3k3l7PPKj6o3M4O4k4o7M9N1l1l0OO1nj5m3L2P7m9
6290C6m5K8M3j5o1RM4J9n7l1J4M1o1k8O0L3n4Pk1L5K4q6j3Q4N1p9j8P7J3m3l8
6321c2J8O7J5o5K1M2k3o1j1M6M0n9o6N0N5m2n7M5KK9n9PL4j5J2l5L9L1ro0K3N9
$$ y = [-21, 65, -15, -33, 69, 17, 21, 3, 25, 21, 66, 44, -18, 31, 91, 13, -34, 42, 40, -19, -58, -17, -11, -11, -37, -47, -18, -9, 4, -46, -22, 39, 3, -38, 5, 55, 30, -36, 21, 25, 6, 2, 11, 25, 77, 27, -59, -13, 67, 2, -86, -27, 2, -39, -23, -26, -25, -16, -12, -67, -38, 27, -6, -75, -6, 42, -27, 1, 2, -6, 17, 25, -9, 9, 88, 31, -33, 24, 35, -17, -44, 0, 19, -4, -26, -29, -10, -9, -46, -70, -14, 2, -23, -82, -48, 27, 3, -35, -11, 38, 36, -14, -7, 22, 58, 67, -11, 3, 51, 7, -26, -4, 55, 2, -40, 4, 19, -6, -33, -45, -34, 23, -9, -94, -58, 34, -4, -76, -24, 26, 27, -9, -9, 11, 68, 12, -11, 18, 48, 9, -11, 11, 63, 38, -10, -44, 33, 31, -37, -32, -4, 3, -25, -45, -33, 31, 0, -52, -20, 39, 49, -50, -17, 63, 53, 22, -6, 0, 55, 42, -20, -13, 73, 19, -66, -34, 39, 16, -21, -14, -7, -5, -21, -84, -40, 24, 0, -67, -18, 33, 2, -28, -22, 39, 34, 19, -24, 8, 85, 36, -9, 19, 62, 47, -14, -5, 39, 58, 1, -30, -16, 25, -36, -64, -4, 29, -25, -18, -39, -4, 20, -66, -79, 5, 56, -23, -41, 36, 49, 6, -32, -14, 53, 68, 3, 24, 66, 43, -18, -29, 17, 57, -2, -68, -18, 37, -5, -62, -17, -15, 14, -45, -38, -4, -19, -7, -42, -3, 28, 19, -41, -18, 41]
6353D1pl6j4P3l1k1l1K7N6n3n9O8%m5j9K5M7%k8n1P4L1p2j9O0J4n2oJ6N6Qn3l4
6386c5Q2K1r5JN9K3l9l8K2j1N2p1k8P6jn9PN2j5l8lj6O8jk5k3Q7rn7%M6nNm3K9
6421A8N4l7n5N9L0o0l0nL7J1n6k0K8K7k9m8K7M9l3NLL2J5k2m9M0O3m9k4M8M5o0
6453A4k4M0j0oQlJ0K2n7l9L0O1n9qQOJ5n0L1QM0o2MK3K2J6m9jP5k7m8J8L2lm1
6488dPMRlk3MK4K8j01J6M8Om2LL3j7%j1rN4J5p2J2N8j5n6L6K2j7RJ0j1Qnm7M5
6524A8j2j0j0kK8k9k9j1L7L1l4l8M4RJ0omK7Pl4pM8K6n8kK0Qk5k3J8L1k1l3%J6
6559a0J4o3M7J8Jp2M3KRL7p2J3O0Rn9K5J9J8k9LjK4j0l0RK3Jk3l2M2mj4j5LK8
6594A4o2M0l4K6Oqk4K9K7m6j7O0Rl3k4M2M9k2j9JqK5j5n0N5J4m3l7N6kk2k2K7
$$ y = [41, 34, -2, -16, 57, 26, 5, -26, 1, 57, 4, -55, 13, 13, -32, -51, -26, 21, 21, -7, -58, 16, 47, -25, -44, 16, 30, -22, -28, -12, 44, 52, -1, -35, 47, 68, -27, -26, 33, 56, 17, -21, 1, -10, 42, -29, -57, 19, 18, -41, -34, 18, 3, -35, -38, -54, 14, 13, -12, -35, 52, 43, -14, -14, 32, 27, 32, -11, 18, 72, 35, -20, 39, 69, 9, -21, -26, 11, 22, -34, -54, -26, 1, -28, -76, -49, 0, -33, -28, -25, 7, 22, 0, -49, -9, 54, 5, -19, 29, 74, 14, -10, 30, 20, 14, 22, 19, 29, 51, -6, -45, -15, 46, -13, -21, -13, -7, 8, -42, -11, -3, 37, -25, -21, 2, 24, 40, -9, -10, 65, 38, -10, 8, 40, 37, -4, 3, 7, 16, 13, -10, -6, 18, 46, -55, -39, 9, 15, -27, -24, 9, -8, -8, -19, -28, 26, 41, -31, -19, 39, 24, -32, 4, 26, 9, 18, 28, 17, 25, 20, -27, 18, 6, -4, -14, -16, 12, -17, -46, -57, -20, 11, -23, -61, -17, -8, 2, -4, -8, 19, 26, -8, -15, 33, 59, 1, -1, 19, 27, 2, -21, -3, 28, 7, -26, -26, -10, 4, -59, -12, 6, 7, -65, -22, -20, -11, 26, -46, -33, 27, 36, -23, 2, 21, 39, 10, 13, 12, 36, 26, -4, 5, 28, 29, 6, -26, 16, 12, -2, -17, -14, 14, -48, -8, -42, -16, -10, -18, -42, -13, 14, -32, -49, 11, 20, -13, -37, 5, 54, 32, 13, 14, 6, 31, 16, -34, 21, 35, -8, -45, 11, 9, -13, -35, -8]
6627hk1J6mm8P7Pm2mN2Jl2K2PJ3j9k6QK7J9o1j1L1M6n1l1K0J9k2PoK5j7k5j3K7
6662a7jJqMN9l8l8M3L7k5k9N2j4mK3n0J7K4%n1M1K2n9j8M9k4k9j0J8J7Mm0j3M0
6696a7O8o2k1L3K5j0k1K0Qj8K8j6mJ5k7j9N2J9n6j3LN8m5l5K6LJ1k4M%k5L9m1
6729d2L0jJ5n0K0O9n8J5j6RL4J7m6QM5l6o5O5L9m9j3J2j3PNl7J4M2k2o1M2M4o0
6762c7J6J5MM7n3j3L3L9m9qL4J0l4j3KJ8K5n8l8P7rm6J6J7M0p1j0rM7J8m1j0O1
6795B0om3J4L7Kk2j2L1J5k4mNM7n5j8J0K9jn4j0L0L9m3m0qO3j2m6N5Ol5Qj2L3
6829aK8l7k4M9Kj2k3M7K1j6k8j0L2J5n7LK0Pl9J5j1J0K1n7LK2L6o9nQ1ln7J1L1
6863ELj0l0QN6nl8PM7j2k1l0J2N5n4rJ1L3m6n8O8kpJ6m3O4km1j5K8N3j7o5N5K0
$$ y = [-8, -29, -13, -17, -65, 12, 19, -23, -27, 25, 26, -6, 16, 23, 36, 17, -9, -1, 26, 45, -16, -27, 4, 50, -1, -32, -12, 7, -15, -8, -14, 11, -6, -31, -44, -17, -18, -17, -25, -21, 38, 0, -38, 5, 42, 17, -12, 40, 26, 22, 45, -5, 12, 36, 36, -15, 26, 48, -11, -29, 20, -4, -33, -43, -25, -8, -4, -44, -57, -17, 51, -11, -32, 1, 26, 16, -5, 15, 23, 5, 33, 17, 13, 28, 1, -18, 34, 53, -3, -16, -13, 45, 0, -35, -9, -6, 5, -19, -15, -15, -40, -1, -42, -12, -13, 2, -48, -28, 41, -17, -2, -18, -9, 25, 42, -4, 4, 49, 13, -52, 13, 52, 3, -10, 2, -11, -4, 1, -36, -22, 20, -2, -63, -21, 23, -37, -21, -6, -2, 45, -8, -21, 12, 51, 2, -6, 28, 38, 4, -9, -7, 11, 36, -22, -60, 17, 8, -38, -22, -5, 35, -36, -46, -55, -8, 10, -31, -41, 20, 14, -29, -15, 22, 24, 2, -10, 21, 36, 12, 8, 13, 60, 5, -13, -3, 26, 25, -29, -39, -9, 30, -13, -53, -61, 2, -10, -56, -1, 5, -30, -22, -34, -1, 27, -10, -34, 15, 17, 5, -18, 29, 50, 34, 6, -4, 28, 43, -14, -11, 9, 16, -23, -8, -19, -9, 12, -45, -42, -20, 16, -53, -58, 23, 20, -37, -26, 5, 8, -2, -32, -24, 32, 27, -11, -4, 43, 31, 10, -20, -8, 47, -7, -16, -5, 28, -18, -76, -8, -10, -17, -1, -44, 20, 18, -23, -38, -10, 43, 26, -39, 16, 36]
6898C6m5k5L6J4J0l3k1N4No3J6K4j4j5j4K7nK8k6m8M5J8n9M8J1K0k1j6k3O8Rj9
6930B2m6N7J3o2J2L7Qj6l6K2NPl7rL2J8m3lLpJj1J1J6j4nJ6L5j3j8J2lM6n2l2
6965c4N7N0o6j1J8K5m6NQOMm2j3L0J2l7nJ8OLnJ0j8L0Rl6L1L3l3pK0k6K0rj9K0
7001HL9l8j8M1qk7j7L3k7J1j5J5kQm6L5PK8o6M9j2K3j1j2j3O4l1l9K2J5J6j2k1
7034aL4Ll0Km1N8k7l5M6qj5k0J0ML2om2J5K1Qm3J8M5j5mrJ4NnmPJ6l8j3L1K4l8
7071aJ2k2K8J0n5K7j8J9pj1QK5Lmk4J0L8m2lK4j6J2KL2mn2J9nKJ7m0j9K3K6m9
7106c5J8J2j7K0l8J8k1L0k2K0L6j8l1j3K4M0j8j3j0L5Kl0L5j2j0klK8J2l2j7J6
7138DlQk9mL7k6K1k2J2MJ7j6OPk7k5M3k6K9J9l6L2nj3l7O1k2l5j0N1j6JJ9Lm1
$$ y = [36, -9, -34, 2, 16, 26, -7, -28, 26, 31, -32, -16, 8, -6, -21, -35, -8, -13, 15, -11, -59, -14, 4, -55, -7, 4, 24, 3, -13, -36, 32, 41, 22, -24, 33, 46, -16, -4, 33, 41, 25, -11, 11, 16, 23, -14, -23, 9, 27, -16, -19, -16, -23, -22, -33, -22, -6, -20, -25, -9, 26, 13, -5, 7, 4, 50, -2, -34, 23, 73, 7, -4, 14, 39, -7, -2, 6, 12, 16, -26, -39, -9, 3, -34, -39, -21, -15, -12, -17, -7, -25, 5, 14, -22, 9, 42, 9, 2, 22, -4, 16, 7, -12, 8, 47, 9, -9, 32, 24, -3, -20, 13, -14, -3, -18, -3, -5, 3, -43, -8, -1, 27, -39, 10, -2, 21, 10, -2, -15, 49, 18, -21, 1, 16, 32, 20, -1, 33, 36, 6, 8, -33, 25, -2, -37, 9, 1, -14, -34, -24, -20, 12, 6, -36, -21, 0, 8, -35, -17, 28, 13, 9, 0, 14, 19, 14, 10, 17, 33, -5, -18, 13, 37, -1, 11, -11, 17, 27, -28, -1, -19, 0, -7, -18, -10, 15, 18, 14, -10, 0, 38, -4, -7, 17, 1, 13, 15, 47, 43, -9, 10, 5, 7, 24, -16, -35, -12, 14, -35, -17, -5, -22, -2, -40, -22, -43, -13, -35, -15, 21, 3, -28, -41, -17, 23, 5, -8, -18, 17, 19, -11, 24, 12, 2, 0, -3, 25, 37, 5, -12, 4, 1, 9, -20, -24, 13, -13, 8, -14, -2, 2, 19, 3, 9, 16, -11, -36, 7, -19, 10, 29, -7, 25, 20, 7, -30, 31, 9, -26, -36, 15, -1, 0, 19, 22, -19]
7173a9L0l6jK3L1m2rN5pj6K0m7J0L7k4QjJ8l9jM8km5lkJ3l1K1J5j8J6j6j7K7j1
7208a5om3N0J7k2K0j2k5J2J4J9oNJ4j0K1Qm3j4N8m2pj0LL7j3nl4L9k3j8oNJ8o
7243b0MK0rj8L6jJ4k4k%M8m8k8RK2J9l8K6pJK5n7K8pk4J4k8K1L6l6j1L6J7j0l8
7278c0M0l1K6k2J4J7k3kJ7j1L7m3k1M2K1l7Pj7L5j4ml7M1krj8L6nk3j5L6lK3m3
7312a8QJ5L0l5JJ6j1J0qj5K4j0m1K0J6Pk5NQk3Rk6K9j0OnK3J0k3J4l8M9jRlj5
7348BJ7J6n5L5ok8J4mK1Nl5ML2Lm0Rj4RPl0J4Qkk7K8J9J9k7j6L7j2k6K8J7JOl6
7385g%J5M3l3l1L7Pl3j6J8J5ll8K0J0rj3MJ2j8J1JOmJ4j7J8J1J2n5RJ3L5j4m2
7420b2J3J8L3l8j8PlLMqNl0K9KJ2k3J2RLk0MJ3Mj9J2NJ9Ol4K2pkj1k3N5l1qk1
$$ y = [-19, 11, -25, -26, -3, 28, -14, -23, 32, 25, 9, 29, -18, -8, 29, 5, 13, 12, 30, -9, -10, 38, 36, -9, -12, -14, -1, -32, -11, 4, -14, 2, -14, -31, -4, -15, -21, -64, -14, 3, -19, 1, -11, -36, -24, -10, 9, 3, 8, 22, 12, 33, 41, -2, -16, 42, 0, -7, -17, -14, 23, 10, 5, -29, 10, -13, -31, -37, -32, -14, -20, -16, 4, -5, -23, 13, 12, 26, 2, 0, 0, 48, 0, -28, -19, 3, 22, -16, 10, 3, 4, 29, -28, 0, -7, -31, -17, -45, -24, 12, -24, -35, 1, 18, 8, -30, 10, -21, 5, -17, -3, 14, -9, -11, 6, -5, 32, -11, -32, 10, 31, -6, 1, -16, 19, 5, 1, -36, 5, 3, -6, -24, 12, 7, -16, -31, 5, 2, 25, -18, -10, 5, 35, 0, 1, 17, 6, 16, 8, -7, 17, 7, -34, -14, 2, 9, -16, -11, -3, -26, -17, -43, -14, -24, -18, -23, 0, 10, -13, 1, -37, 12, 11, 20, 17, 2, 19, 35, -20, 15, 9, -19, -5, -9, 12, 17, -18, -14, 18, 21, -19, -10, -24, -15, -8, -38, -24, -16, -18, -45, -17, 2, 21, -6, -22, 15, 3, -23, 5, 22, 23, 29, -7, -7, 8, 51, 18, -13, 24, 31, -2, -18, 0, 15, 12, -26, -6, 4, -5, -18, -14, -2, -20, -9, -8, -2, -6, 8, -9, 9, 20, 32, -23, -14, -1, 34, 20, -22, -9, 9, 42, 4, -14, -7, -10, -7, -3, -11, -6, -36, -7, -5, 7, -16, -4, 5, 8, -12, -8, 5, 9, -10, 2, 7, 26, 32, -2, 20, 13, 11, 0, -23, 32, 1, -7, -28]
7458b8L0m2K5k2J5j5L2l2NJ0J1J4k7KM8rpk0M4k1j4J3%Rk3K4k4J2k1j8K6j9Pj8
7492c3KJ2J6k4j1J4K4j5j9K4J2Kj0mL2l0kKK8k1j5lJ4K3j7%j3J2L0m3LL3l1j9
7526b7OLK0l4K5J4qJ7j8j9M4nm3K8Qj1J8j0J2j0qJj7L3l8M0j3j9K5ol4PJ5JlJ0
7562Dj0k5J8j1K1jNk9K7J%j9L3Qj7j3K8j1J0ok2J1Pkj9jMj4JLJ7lk6L3kqK4n7
7600d1K4JL8j6lRkOLPk0J5k7M0m6J9nlj2J5jjnlj3%j2J1K9J2n3L6lpOk3L8j1j1
7639iJ8J8k5L4l7M0ql3J4K5m8NpKlK2k5J7J0j6k3%L7qJjj9J4mKj7M1k2Pj7K5k1
7676a1J4Lqk8L8j2j6OJ1K5kj6k3pK9NJrJ0lJ4n0K9J8qJ4k5qJ3j8OJ2nk3L0j1K2
7713A7m2PJ7m6L9pjk2M2k9K0J7j5rJ1J9k0K0j8rJK5nl1K7%Pl3J9K4lnk2Rj0J6
$$ y = [-28, 2, -40, -15, -37, -22, -37, -5, -37, -32, -22, -11, 3, -24, -22, 26, 17, 10, -10, 34, 13, -1, 12, 12, 21, -2, 22, -2, 10, -11, -29, -3, -22, -15, -33, -31, -19, -3, -27, -38, -24, 0, -15, -34, -10, 2, 4, -6, -10, 22, -8, -10, -8, 20, -1, -16, -19, -5, 18, 1, 1, -12, 0, 30, -13, -10, 23, -8, -27, -21, -18, 2, -32, -7, 7, -1, 16, -2, -21, 23, 18, -25, 3, 11, 0, 18, 8, 20, 10, 2, 3, -14, 19, -19, 21, 8, -11, 14, 8, -26, -19, -4, -3, -6, 4, -6, -31, -13, -24, -3, -4, 1, -28, -1, 0, 0, -19, 14, 22, 5, -8, 20, 9, 19, 13, -9, 2, 9, 7, -12, -13, -9, -23, -22, -19, -2, -5, -31, 2, 0, -8, 16, -41, -17, -16, 22, 6, 3, 12, 10, 16, 19, 26, 6, 21, -6, 34, -12, 7, 2, -1, -13, 2, 1, 0, -5, -8, -21, -21, -33, -22, 7, 19, -34, 2, -1, -8, -2, -25, 13, 2, -9, 9, 27, 2, 36, -1, 39, 31, -2, 12, 37, -11, -6, -13, -11, -14, 8, -17, 0, 10, -6, -29, -29, 8, 0, 1, 0, -19, -5, -9, -7, -24, 17, -5, 2, -15, 10, -11, 3, 6, -2, -30, 8, -4, -20, -14, -3, 22, 20, 4, -19, -26, 3, 8, 9, 0, 10, 7, 21, -29, 0, 18, 10, 24, -1, -9, 4, -14, -8, 4, -1, -24, 6, -5, 17, -25, -18, -1, -47, -8, -15, -16, -38, 4, -25, -5, 12, -3, -12, -1, 18, -2, 18, 0, -9, -8, 17, 12, -19, 8, 8, 15, -18, 1, 25, 22, 17, -5, 4, -6, 10]
7749A0j5k2lM6k2kkL4n1K0qK4j0oRJ4K0ro%j8oJ3J4k8j5K8k3K6l0L3mJ1ll0RK2
7786B0m5RmJ9j1K2m1K6K3l6j0L8k0K0j1j0K3K7l7k8N2k8k2pM1J6l1KK8j0lj4k7
7819b9J5L3j2j3K7j5j4P%J3k1OjmK7j7oL1j1l7QK0k2qJ5Qk4K5l6PK4j6J2J5OJ
7855A4j5Jj9K3J9l4M2Kl7M6k4j5J7knoojl2K6Qk2RJkK3k3jMM5m8J0j1K9kj3j9
7892a8J2qKJ3K2lQk1J0J7j4j7JQl1L4j1KkRk1J3j4JoJ4j2OJJ0pOj3J2kj8L2k0
7930eMJ6j3jj7L3qqOj7MK4rj9j4K9k7JK8qLj7J9j3Nk5L7j3J1Ok5M0j7l0L3m8N0
7967A5j7mK2rOj6J8j7K4j4Pj5J5k3k1J1J3lJ3J6l2J0OnL0Ml3K1j0nmqJ4J7l4r
8003a7%j3K7l8L4k9M1j1J3j3k8K6%KPKrjL3k0J2k6oK8j5j4L4j1jj4K0K2m2L3k9
$$ y = [10, -5, -27, -30, 16, -6, -8, -10, 24, -27, -7, -15, 9, -1, -7, 2, 16, 36, 27, 21, 21, 3, -3, 10, 24, -4, -19, 9, -14, 12, -18, 15, 11, 22, 19, -11, -2, 20, -25, -16, -20, -1, -12, 10, -31, -5, 18, -18, -28, 10, -10, 10, -1, -11, 12, 39, 2, -26, 26, -2, -24, -31, 10, 26, -5, -3, 25, 15, 12, -2, -29, -14, 19, 7, -6, 21, 6, -8, -1, -1, 12, -9, -3, -4, -8, 19, 2, -4, 27, 16, -21, -13, 7, -15, -23, -8, 0, -24, 1, -35, -28, -4, -20, -8, 7, 13, 14, -1, 0, -19, 4, 23, -11, 31, 33, -4, 42, 18, 3, 20, 18, 13, 7, 1, 0, -32, -6, 2, -20, -11, -10, -12, 11, -12, -13, -9, 36, -12, -2, -13, 16, 14, 1, -18, -6, -14, -12, 1, 23, 20, 28, 7, 17, 34, 20, 3, 4, 12, -19, 15, 4, 6, 4, 13, -8, 5, -9, -8, -14, 0, -12, -6, -5, 5, -2, 4, -9, 3, 1, -17, 15, -5, -1, 15, 2, 1, -16, 17, 9, 1, 7, -10, -6, 18, 9, -10, -24, 5, -22, -21, 7, -1, 2, -15, 4, -9, -4, -29, 8, -5, 6, 12, -13, 27, 10, -20, 13, -35, 15, -2, -6, 16, 7, 13, -3, 15, -2, 22, 8, 15, 0, 15, -8, -29, -18, -5, -8, 5, 21, -11, -1, 5, 0, 30, 34, 1, 22, 12, 7, 3, -5, 9, 26, -8, -17, -17, -30, -3, -41, -7, -36, 5, -6, 7, -6, -34, -8, -8, -6, 1, 3, -6, -7, 26, 6, 18, -8, -14, 14, -1, -15, 19, 8, 7, -7, 13, 35, -7, 26, -3]
8038cPnK8l1LkJ4k8J%mpJ0K7k8K3j9J0K0qk0J4%k8ML6l0j4K0J6Rl7OnJ8noNqN5
8078C8l5j7K2rLm4M4Pj3j2KJ1J3J2l1K2lj7K8l7K0j2j1JJ6Mj9J2%jj4K3rmJ4K1
8114B5l6K3j7jj4L8ml1K4j3J4mj2J5j0K8j2Mlqj3nj1J5pj5PkM8j6j6JOl1L1l3
8150c5N3k5oM8Oo6M6j3lJ2k4J9pqM6n5K1k9J8Qjj6K1j0qJ9prOk2RKK1k7J8J7k4
8187ej3J9rK2
$$ y = [-3, 4, -1, 27, -4, -1, -3, 11, -17, -16, -16, -20, -27, -17, 10, -18, 5, -14, -4, 16, 8, -12, 2, 2, -26, -22, 14, -16, -30, -10, 6, 15, -22, -16, -21, -3, -8, -14, -9, -17, 38, 3, -14, 8, -1, 2, -42, 2, 9, -4, -16, -14, -3, 10, 22, -9, 13, 10, -7, 21, -16, 4, -8, -19, -18, -2, 2, -17, -5, -5, -6, -20, 3, -6, -10, 4, 25, -11, 12, -5, -6, -20, 18, 14, -17, 7, -6, 8, 4, -8, 7, -3, 25, 13, 17, 14, 6, -7, -12, -23, -8, -15, -30, -23, -25, 23, 7, -9, -8, -2, -33, -2, -35, 18, -7, -13, 35, 41, -25, 21, 8, 5, 17, -7, 12, 5, -3, 43, -12, 9, -20, -2, 6, 5, -11, 10, 0, -8, 11, 4, -5, 1, -21, -12, -10, 11, -16, 2, 19, -5, -18, 1, -8, 14]
8191A4
$$ Imaginary data points
##PAGE= N=2
##DATA TABLE= (X++(I..I)), XYDATA
0@%%%%%%%%%%%%qJ6j6J6j6K4l2M0m8N6p2Q0q8J05j27J50j69J93k24K57k93L33
34A77l76M24m77N35n99O67p42Q29r23J022j132J253j382J524j682J853k040K248
52A179k478K729l012L332l692M103m573N125n780O568p544Q784j0423J2702j6113
67i093K1825l3712R9541j62935q4538L21368q1070j73455R9872N8058j00439P7804
79C3226J9275j42579M8080J75401j32396j55733J75948J21312j99540n7499J74594
90F0089K837j21487L8016L7859l6646M2697J3578j01961L4127J30467p7309j34384
102a12117J14705J15192j32069p8379J29426K9211r6455J3172L2692l8012M1888
113A9254K5300j05174J5795J32468o7955j22109J00506Q4796j04179m3770Q0944
$$ y = [0, 0, 0, 0, 0, 0, 0, 0, 0, 0, 0, 0, 0, -8, 8, -8, 8, -8, 16, -16, 24, -24, 32, -40, 40, -48, 57, -70, 80, -89, 104, -120, 137, -156, 177, -199, 225, -252, 283, -316, 351, -391, 438, -485, 537, -595, 658, -724, 800, -882, 971, -1069, 1179, -1299, 1430, -1582, 1750, -1942, 2161, -2412, 2713, -3067, 3501, -4043, 4741, -5682, 7020, -9093, 12732, -20980, 78561, -84374, -168912, 152456, 71386, -102069, -2197, 55861, -44578, 33226, 52501, -90078, -41998, 133403, 1007, -154726, 21222, 142534, -57006, -114505, 60089, 62926, -58561, -20545, 17314, -19332, 23365, 36943, -65018, -30891, 99576, 22267, -112117, 2588, 117780, -14289, -92668, 36758, 65969, -30486, -17314, 15378, -22634, 19254, 44554, -60620, -44825, 87643, 19688, -102421, -1915, 82881, -21298, -65068, 15876]
124A5876J6457l9208k998m523N346M4618j5798p1361L3602Q5947m6965q3145N2830
137i322O9176m6586n3279K7956L9588o841l1490j3717K1659K9358j2941m8177
149c4616L611O5005k174p6562Q577P6140j6630o1091J9047L8745p593j5089j1165
162a3795K683L4316K619m9630j918N6854J299n6034j645M9715K989m0829q153
175b1529K8109J2800j8484k0437Q863K5174k373k8552n217K8765J3074k9520k0472
188b9799L3491K5119l6420k0532L7082J2590k7651l756J2416L092O835r084k1268
201a7885K0672K8071l2424k7826L7524K0800l6511j4080K7100P061j5232n151
213g881j5N897J2614j1060k1220J7537K4896k1285k3458K2636K1087j9169j5960
$$ y = [15876, 32333, -6875, -9873, -14396, -9050, 35568, 19770, -51591, -17989, 67958, 20993, -62152, -9322, 59854, 13268, -40011, -12055, 27533, 20692, -10798, -24515, -2856, 26502, 13561, -34616, -31005, 34000, 31826, -44736, -36159, 39981, 23351, -37740, -18693, 20052, 12459, -2630, -13795, -11112, 23204, 25823, -23807, -25725, 31129, 32428, -23606, -25251, 24464, 27453, -13376, -21529, 6580, 19380, 896, -19541, -10678, 14496, 12123, -16429, -21646, 7119, 20193, -9327, -29799, 3692, 28811, -7609, -28141, 8941, 21531, -6120, -9876, 2540, 5632, 12467, 3383, -17885, 2787, 30858, -1566, -29392, 8132, 28932, -7579, -21659, 5441, 12502, -2730, -7881, -7896, -1999, 10615, -445, -21665, -4128, 20768, -517, -23975, -1339, 19748, 579, -15381]
226a5381J5504J2434q526p316J597L506P040j160j6244K090K3151p193k6560J2008
240e050K2272j6418j5556J4512N558r299K020j9o434R612N881j6938p03K0750
254A0188m720j7874J0681J3041j1758m811R984j001l868M509k142m177O750J802
268F604r926o3J0067k940j0288L813P911n568o353N044K777m796N88K754l521
283c897R93N801m279m836Q211L358r259J108R827m295o354P552J775p471L111
298A345M581o598n81O788m395n509O441R82p691J959M965m812k259M962r07l967
314d696L072K331l645K78L930j114j852K645J277k082N18K435j152j681K380R59
330C603l148j19L021j803l379K688J328m499K41L646l277k451M098n28m141L090
$$ y = [-15381, 123, 12557, 4031, -3285, -1688, 1818, 8858, 7698, -8546, -6456, 16695, 9502, -17058, -5050, 17222, 804, -14752, -240, 5318, -3981, -1961, -1980, -8414, 1198, 7079, -9859, -10562, 10188, 5468, -12406, -1725, 11316, -442, -5253, 4731, 3730, -138, 4371, 2229, -1948, 4802, 6604, -3322, -3385, 6682, 3742, -6546, -2733, 5178, -390, -6743, -1699, 1078, -3718, -3130, -376, -3897, -2904, 2897, -1382, -6218, 1993, 5351, -3908, -2800, 7027, 2732, -3622, 3930, 5705, -1766, 1345, 5926, -672, -1253, 5535, 1140, -4369, 2072, 3054, -4637, -2678, 2287, -2525, -4784, 178, -729, -4696, -1624, 707, -2938, -2660, 1270, 156, -1696, 949, 2226, 144, 662, 3097, 1945, 264, 2644, 3603, 455, 336, 3357, 1554, -1825, 863, 2191, -2308, -2067, 1579, -1698, -4149, -51, -579, -4720, -1630]
346a630K552m483P80N024l221k511N601L86m762K854L677l428r34L452j032j752
362E73K022p70k196K230N25l591j12K635j072k906K89J946o1k214p75K537R79
379C9k461l08K158P51J25r49j017L458K457m950j718O918Q58o887N96N190j151
396C109k672o54n61K721J630o478k640Q143J385r482q16Q017N31n724j925L559
412a857M892j854o711J963Q531q57p614R3P033L007n500o231N850R300p086j0540
428g581P527R115p051p519L108N041J387n210p581O093J1579r066j3541J1167
442b532J2646j0904r798Q321P734k327o183l431Q031R459j0032j1914J2431J2803
456A4304j2099j2295R526J1778n894j2318J253J2104J908j2586n994J0942R136
$$ y = [-1630, 922, -3561, -2781, 2243, -978, -3489, 2112, 2498, -2264, 590, 4267, 839, -95, 3357, 2325, 573, 2595, 1825, -371, 1859, 2384, -1207, -1319, 1316, 244, -2662, -2373, -427, -488, -2702, -3477, -940, 39, -2422, -2730, -572, 179, 304, -645, -1662, 1796, 4253, -697, -2415, 4503, 5361, -1526, -930, 4260, 3109, 437, -217, -778, 1943, 3573, -2905, -5545, 2598, 3983, -5499, -6315, 1702, 2233, -3491, -5416, -1857, 3035, 1181, -5530, -3567, 4964, 4107, -3507, -3414, 3619, 6626, 1126, -5105, 745, 10045, 2959, -7581, -54, 9061, 2010, -5509, -2401, 2640, 4027, -1183, -8764, -2671, 8908, -158, -13699, -2532, 10114, -790, -10588, -2267, 5467, 3140, -3043, -6474, 1557, 11016, 984, -10930, 1501, 14304, 2205, -10090, -564, 11214, 5320, -6998, -5745, 6359, 8267, -4319, -10313, 629, 9765]
469I765r561j3766P818J7607p375j9999P380K0128o209j6837M051J2891J922p577
483B38r257N215J8362m879k4884P704K7462j0559k5092J0511J8319o686j1447
496d993k813N775J3554n356k3937P387K8808j1116k8882J2504K4641j0003j8280
509a2711L988J3224N517r280j4242Q605K2351p966k6421Q075K8445o962k7394
522a4771M680K4202j348k0022l787J3927R133q626j6765L057K3982q06l1022Q14
536a7352L3933k902l1878M485K4796k458j3663l740L875J5241L112k6966l415
549a6932L6728J78l9484M885L5122p060k5012L750J2314M629k815j7154k688K8018
563A4479J977l5594N41L6354l672l1886L624K3760K48j4587o792P378J5470j410
$$ y = [9765, 204, -13562, -5744, 11863, 4488, -15511, -8131, 11997, 5788, -11049, -6998, 5893, 7815, 238, -9019, -3804, 14558, 9679, -15205, -7501, 19961, 9402, -15690, -5179, 13140, 6454, -4993, -7806, -2031, 11523, 6167, -17770, -10383, 18425, 7309, -21573, -9069, 15572, 5569, -12711, -8723, 4501, 10018, 738, -13504, -4899, 17452, 9486, -16935, -8860, 19585, 12623, -14771, -10091, 14111, 12763, -7259, -11046, 2881, 12014, 3388, -13377, -10320, 13662, 12856, -18166, -17352, 16581, 13679, -18199, -13714, 11082, 8624, -5039, -8779, -4904, 10337, 13449, -13517, -16932, 19796, 19974, -19510, -14625, 20497, 13437, -11575, -7825, 4489, 9118, 6303, -10851, -13539, 14479, 16456, -19138, -18597, 17757, 14085, -17801, -14177, 9583, 9831, -4756, -11548, -4170, 11300, 9890]
577I890k2943j400K9857L287l2993l050L3344K840k9490l063K2264M561j2941
590A63r288K203J5966N850k5340j0966L2748J0510l7084p242L4752K970k6078
603a0836j695J3418O072M3j4564q804K5685J2660l3302j0427L6415O533l2108
616a0910l196K2844L590j1206q302J18J5231O853k3159j0747K7951J0122k9669
629a0480q874K6156P370j9863p892J1986J0005m064j2648k376J6417Q072j9055
642e246j1081K1946J3005k2461j2095K1272J0310j6556q242Q857P769j56j0485
655c163q253J4524J2929j9891j4863K2475J2731k2232r801J7270P174r300o860
668g260M07R630P744j3498j2099J8170J3595j9678j1385J8453R156j3212p530
$$ y = [9890, -13053, -14453, 15404, 18691, -14302, -17352, 15992, 18832, -10658, -13721, 8543, 13104, 163, -9125, -6922, 9044, 14894, -10446, -21412, 11336, 21846, -15238, -22480, 12272, 15242, -10836, -12531, 887, 6959, 7002, -7562, -16366, 9319, 21979, -11323, -21750, 14665, 21198, -10910, -14106, 8738, 12328, 1122, -7180, -7062, 8169, 15022, -8137, -18884, 9067, 19189, -10480, -19354, 6802, 14172, -5691, -13583, -1597, 8408, 4344, -8304, -10680, 5737, 13809, -5246, -16327, 5619, 18624, -3837, -15932, 5340, 15650, -906, -9148, -291, 7478, 7322, -3163, -11416, 3108, 16037, -3854, -18717, 3758, 16489, -5743, -15544, 1726, 8900, -400, -7260, -6853, 2777, 10521, -2977, -15076, 3094, 16689, -2989, -14374, 4079, 13235, 23, -7507]
681g507O438Q156J53j0457n615J2593Q434j4528j0363J3891J0304j2399j0710
694a1610R032J0193n454r969J432R670K749r063n976R165R057q216j0324Q045
708a269J1207o702j0079N274Q565k550o648j056N290M448n386p903N844R033p433
723F35r094P110P046n887n377K443M326J301m384m291N512O434o127o247O640
738D0N913n073m536L245M425m67m491j605N210K770n791l374N284K868m395l452
754c429K125L741q46n000o35N483R10n666r29M719J307k849j725J416L317J08
770B047l914p3M697K89l935J54K893J57j370r48P4J830k5k947k2K640j005k290
788a748Q25Q25q14r5j31n23J092K38j399O65J472r62l05J488j84o53J096K35o50
$$ y = [-7507, -1069, 7087, 7240, -3217, -8832, 3761, 12195, -2333, -12696, 1195, 11499, -900, -11610, -2578, 7615, 2161, -7808, -6376, 3294, 6043, -3020, -8996, 169, 9226, 1010, -9314, -1269, 9938, 3236, -6843, -1569, 6996, 4446, -2202, -3258, 2032, 6480, 1094, -6809, -965, 8068, 635, -8459, -1349, 5697, -190, -5567, -3124, 1202, 2503, -1881, -6172, -660, 5774, -353, -6600, 40, 5953, 880, -3656, -411, 4014, 3547, -944, -2549, 2661, 5431, -360, -3734, 1550, 4418, 23, -3429, -1304, 2437, 1591, -3409, -4044, 1439, 2349, -3317, -4246, 473, 1780, -1069, -2794, -1378, 1939, 2047, -1867, -1940, 2757, 3046, -889, -735, 2158, 2315, 945, -3, 71, 1901, 1876, -1071, -1093, 1547, 542, -1748, -923, -98, -912, -1007, -1138, -1661, -569, -331, -1730, -1065, 407, -555, -860, 628, 444, -209, 887, 1122, 472]
807D72O10J43n94P57l7j400P32R45j607p10J233m10r66L21l77k60Q90p61j115
826b134J542O26j699L95J526n26m13Q18MK63O73p36j35J571l54j501J054Q92j299
845E67l46O15m31r4kj197K39J319j497j339J762M59j662J45Q25j61L97j35p60
864a296J295J190j647k31K080j48j150O91L58k81M76m90q58J163K46j893K04J318
882A027j235q34R44m44o33O78m61n28J129l25j044J351O93j590O34J642j010l94
900d00J321j97j24P27r04j20J775q56k012J600J210k110o18J080j90j46n61j263
918a788J231J549k529j405L019P66k615m4J613N73N4j299o55L076J162l792m83
935a567M185K03l372k06K127J016j133k713M23L711q67m601O74L977n22l510q93
$$ y = [472, 1082, 1225, 631, 1388, 1351, -49, 683, 1628, 21, -689, 544, 134, -832, -511, -888, -1148, -258, -1019, -2134, -592, 34, -1665, -1270, 256, -270, -683, 135, 139, 402, 1075, 339, 204, 1775, 1421, -80, 974, 1866, 567, 221, 836, 405, 311, 309, -888, -649, 670, -827, -2166, -404, 55, -1607, -1462, -637, -798, -401, -536, -1296, -1, 1189, -458, -689, 1391, 1243, 93, 784, 1142, 861, 1337, 847, -11, 1152, 1398, -495, -291, 1027, -208, -1042, -98, -542, -1175, -497, -958, -1486, -357, -682, -1726, -375, 318, -1272, -638, 1004, -6, -400, 921, 724, 600, 1327, 423, 303, 2078, 1222, -790, 810, 2020, -90, -708, 372, 182, 36, -525, -1788, -557, 992, -1537, -2942, 77, 843, -1772, -1816, -203, 370, 424, -875, -1530, 1546, 2708, -1084, -1567, 2618, 2821, -551, -757, 1370, 2386, 1253, -1460, -1037, 2674, 1807, -2794, -2120, 1857, 1335, -2175, -3068]
952c068K625K534k534m106K964N072l130m583L017M005j204k872p78L051L488
967D481l478n095M639N684n307n083M593L697k779l274m36L235L012m844n214
982f169O091N529p121n028O536M165m512l674J871M477J155n330k861O689M419
997F237o842m827O631N602n413o237L995O816k733p240R92O683N85o273l282N226
1013h0N633n016q410M996R859n474r828N219Q579l476o109L74M609M404l769q569
1029g058M974J1942o439j2552P719J1066p020q334L871N610N30m386o041M328
1043a790R931n859j2545O975J2394p306j1076N800Q985k749o966j002N937N326
1057F055n170q534N338J1281m976j2343M883J2725m170j1693K978R645j011p120
$$ y = [-3068, -443, 2091, -443, -4549, -1585, 3487, 357, -4226, -1209, 2796, 1592, -1280, -2058, 993, 4481, 1003, -4092, 547, 6231, 924, -4159, 434, 4131, 1352, -1922, -2358, 877, 3889, -955, -6169, -78, 5451, -1670, -6698, -162, 4003, -509, -4183, -2312, 2165, 3320, -2010, -4871, 1818, 6237, -605, -5432, 1199, 6801, 1388, -4849, -854, 5962, 3229, -4011, -3019, 3664, 4249, -2024, -5306, -80, 5553, 537, -7873, -2877, 6982, 1508, -8320, -3101, 5478, 2002, -4107, -3733, 876, 5280, 1511, -7058, -2084, 9858, 3419, -9133, -1414, 9652, 2632, -5702, -1831, 3779, 4309, -77, -6118, -1790, 8141, 2282, -10263, -3288, 9106, 1800, -9276, -3476, 5509, 2760, -4206, -5208, 729, 6055, 885, -7649, -2311, 8970, 3994, -8349, -3466, 9259, 5089, -6604, -3626, 6019, 5008, -2112]
1071b112k383M274O194k791j0791K032J4001l098j5623M181J4361m686j0933L110
1085d264O795Q69k922o059J301J1948j384j5617L506J6883n057j4763N295J0927
1099G458l106o620j371L143O602j875j1700J652J4582k858j5596L231J4037k883
1113D696j1491J069Q226J983n134n410K942R101j076j1682M53J3795N2j3984J96
1128f264J2943J33j0179j112O459L165k771o517n47J0036J747j3458j909J4641
1142F367O33j3935Q6J0723J11o324k078K030N782J165r511k179J2942K015j3791
1157e964p62J2929J94r607o88N752K673k098n765m63Q536J374j0752j846J1033
1172D546J495j0404j903Q321K458o094l620L546N115j163o376o84P811K401q436
$$ y = [-2112, -4495, -221, 5973, 3182, -7609, -5577, 8424, 5326, -10297, -6116, 8245, 3559, -7374, -4264, 2531, 3400, 478, -5581, -4280, 7668, 6284, -9333, -5827, 11056, 5999, -8764, -3469, 7458, 4352, -2268, -3639, -496, 6106, 4231, -7469, -5817, 8765, 5907, -9689, -6458, 7579, 4696, -6795, -5726, 2500, 4483, -651, -6061, -3119, 5982, 4906, -6776, -6323, 7472, 7524, -6460, -6264, 6679, 6812, -3367, -4479, 1980, 5145, 2374, -4143, -4690, 5346, 7093, -6365, -8274, 6367, 7000, -6935, -6849, 3874, 3985, -2339, -4417, -2387, 3395, 4560, -4951, -7130, 5812, 7827, -5964, -6726, 6203, 6397, -3210, -3898, 1854, 4527, 2429, -3336, -3799, 4737, 6111, -4641, -6487, 4546, 6041, -4363, -6266, 2055, 4513, -1581, -5201, -1655, 3460, 2297, -4079, -4763, 3048, 5449, -2987]
1187b987l040Q958L552q109l332O783L394m432l671J685M452P62n844k971P066
1202B266L596q205l787P874K910o679k512M046K667j174l735j190N471K721o613
1217b344k838P314K779o278k292M770K617k423l232N60M204P29n002j624N076
1232B016J818m888k286L756K349k816l161J608L525r10l828K35L676N15l063j175
1248b629K721K302k144k795K226L330j919k872J677K356p22j767m91J520J436
1263B229j788k316J852K184k191k095J692J380j170j138P6J103O42j315j059J782
1279a32J283j801p62J715P37q30n25K64J022N05j437n65J763M02j741k65J116
1296G49J3n02n77l01Q17K54j355l27J190Kr22J17L25L0L65k29m98Q91N15p83R2
$$ y = [-2987, -6027, 2931, 6483, -1626, -4958, 1825, 5219, 787, -2884, -1199, 3253, 4015, -1829, -4800, 2266, 5862, -2343, -6130, 1744, 4654, -2025, -4537, -491, 2176, 1002, -2733, -3923, 1548, 4269, -2344, -5182, 2132, 4911, -1367, -3659, 1111, 3728, 1305, -1927, -1367, 2837, 3566, -1436, -3060, 2016, 3834, -1054, -3340, 416, 2765, -51, -3212, -1604, 1921, 1011, -2817, -2582, 1094, 1609, -1454, -2629, 92, 2394, 250, -2545, -319, 3011, 1092, -1780, -103, 2253, 1531, -236, -727, 793, 2229, 441, -1875, -23, 2161, -30, -2125, -433, 947, -223, -1361, -1285, -182, 460, -855, -1914, -132, 1151, -650, -1412, 303, 1040, 210, -315, -51, 971, 1476, 39, -526, 1237, 1639, -102, -367, 749, 762, 260, -317, -618, 199, 453, -902, -1229, -39, -37, -959, -842, -517, -487, -122, -351, -849, 42, 557, -226, -134]
1317a34P70l03l9N76m59k55Q96k17r51N40L82p11l4O2n66M62K80j219j54J274
1337B00l37j025M03M05RK69n17l99J410M38j519J02J565j65p87K58K02J74L65
1356A051q45m72J239J2j431J52R56o05n57J89j18J49J08q96J43J128n52r74R76
1375c47O10o81nM02K3N07o1p85P18R65j046n02J157rq22J46J39j55K17n60n69
1396f58R07J70j435J08J142n25o91L54J35J62K88p15o6J337r1j160O56R46n53
1415C11j05L37k08K93K74q35J42Q66q39o20R37j31j047M95L14p68J42J13m75N00
1435c04K03j051M13J217q18q16J192N15o80L6J23L17P84p67j036J472R81j830
1453d9o10J536K42r93m67j37Q81O12j901r49K390N39k568k88K008K60j171n78
$$ y = [-134, 636, 333, 294, 870, 411, 156, 1052, 835, -116, 424, 806, 95, 61, 123, -443, 19, 299, -920, -1074, 200, -137, -1162, -759, -354, -345, -76, -593, -992, 418, 856, -663, -561, 1004, 839, 52, 310, 512, 686, 1051, 206, -266, 973, 985, -446, -294, 662, 57, -500, -311, -429, -280, -172, -1068, -925, 203, -349, -1323, -347, 263, -418, -423, -21, 2, 509, 448, -337, 381, 1346, 300, -202, 955, 946, 124, 270, 409, 254, 471, -89, -658, 249, 419, -1016, -908, 234, -291, -982, -628, -493, -331, -43, -758, -824, 513, 422, -738, -82, 864, 311, 206, 543, 335, 628, 902, 67, 209, 1075, 236, -384, 553, 422, -625, -130, 184, -584, -442, -329, -804, -304, -101, -1152, -739, 478, -340, -1156, 36, 551, -129, -93, 30, 347, 1131, 364, -672, 800, 1781, -49, -659, 877, 1119, 126, -341, -478, 403, 1015, -886, -1835, 555, 1094, -1474, -1762, 246, 506, -665, -1243]
1471a243L93J571J87k196QK785Q9k613J39K186M06j574j096J212J890j161k580
1488a597J031K624j076k582L51K089L80k145j499K194K213k564k481K637K374
1503A949k068j920J098K025N28k265j657L195K593l795k557M123K225l544j822
1518a892K118J721m92k501j239L344J992m355k539M617K341m392k302L338K416
1533B175j947k759N78L505P26l885j432M319K346m093k893L976L484l362l803
1548c065K690L844j731l750K95L309J217l345l176L410M395l992n161M226M880
1563D046m067m010K858L081o05k470j874K888M300l611n500M784N856n127m970
1578d421M617L866k864k970L17K667K226l309m493M004N483m867n842M845N155
$$ y = [-1243, -850, 721, 908, -1288, -1280, 1505, 1594, -1019, -880, 1306, 1712, 138, -958, 254, 2144, 983, -1597, -566, 2058, 982, -1600, -1249, 840, 1220, -925, -2424, -230, 1983, -581, -3062, -425, 1949, -119, -2039, -941, 1084, 1612, -653, -2310, 885, 3478, -317, -2874, 1249, 3474, -70, -1892, 226, 1947, 1455, -1046, -2285, 1059, 3051, -1304, -3843, 774, 3115, -1277, -3579, -241, 2175, 228, -2531, -1953, 1552, 2278, -1607, -3039, 1280, 3626, -467, -3360, 616, 4100, 738, -3065, -375, 3469, 1738, -2012, -1717, 1592, 2809, -536, -3712, -302, 4093, 101, -5060, -834, 4046, -21, -4031, -1173, 1908, 1303, -1167, -3041, -153, 4147, 536, -4964, -180, 5676, 549, -4421, 196, 4062, 1198, -1772, -1455, 1212, 3438, 129, -4364, -360, 5123, 256, -5586, -741, 4414]
1593D414m082m476K394L861l54l442j727L535L630l431m885L676N890l472o026
1608d495L371N792k624m934J407L809M25k850k868K313M867k517o675K847P191
1623E059l537o753L291N311k279l631J49K354K640j718n100K206O977k805p364
1638e200L608O739l264n143K059L651J10k545k679K102M742k351o292K508O582
1653D627k714o331K021N378j105m404l60L240K048k298l638J779N144j297n852
1668c762J200O312q79n820P26M993k0l552j100K142K523j019m252K85N527m40
1684B864o331N61N997r09n033M50L308N58j734k166O37M038j72n258M89N834o29
1701B504n243P50M301o8k871r16J717K328r58l632N67M371n61m685K51M192K2
$$ y = [4414, 332, -4144, -1750, 2111, 1757, -1685, -3412, 123, 3753, 322, -4563, -887, 5003, 1531, -4495, -1124, 4668, 2044, -2890, -1483, 2326, 2751, -99, -2967, -654, 4213, 1696, -4979, -2132, 5059, 1522, -5231, -1940, 3371, 1092, -2539, -2390, -36, 2604, 886, -4214, -2008, 4969, 2164, -5200, -1592, 5147, 1883, -3260, -1201, 2450, 2560, 15, -2664, -562, 4180, 1829, -4463, -1955, 4627, 1913, -4418, -2397, 2981, 1876, -2528, -2888, 352, 2400, 102, -3536, -1757, 3387, 2090, -3762, -2562, 3750, 2871, -2949, -2223, 2770, 2750, -802, -1902, 240, 2763, 1744, -2508, -2223, 3304, 2864, -3467, -2906, 3091, 2182, -2851, -2401, 907, 1465, -269, -2435, -1798, 2240, 2068, -3190, -2701, 3133, 2504, -2739, -1989, 2312, 2244, -627, -1543, 174, 2502, 1544, -2088, -1521, 2850, 2289, -2396, -2145, 2047, 2069]
1718B069l715p52K800J450k203k197J492K737p67l057J33L439O04l480q62L586
1734A277J250l091j246K470J463j422j775M01K217M34k915r71L227Q62l320r08
1750b047K639P73j910j049Q24J466pk138l68K611O09k670l79K471N33j683o43
1767i68J122J131l62j595J35K000m4k093l4J680J84j383o52Q43R89q30j444O31
1785f90J413o31j299M05R48L4o66m32O55R88o25j023Q90J065p58o55N96M87j71
1804E31k74l10L55N79o23p63P17M72q52k83L70ko7j42l97K94N12n31l56O49J79
1825E8m50K24J68r2K83Q1l59L07L69m03p1M13j72j91K65k19j98L29j19n59K64
1846g2K04m64K9J27k78J61K30n00j6P10k05n12M29K99j29J30j33j06O29O0p37
$$ y = [2069, -1646, -2398, 402, 1852, -351, -2548, -1056, 1681, 914, -2143, -2010, 1429, 2033, -1447, -2309, 1277, 2527, -564, -1810, 660, 2123, 701, -1074, -673, 1544, 1978, -937, -1908, 1319, 2181, -1139, -2047, 592, 1365, -545, -1594, -770, 696, 689, -1449, -1817, 794, 1403, -1267, -1646, 825, 1358, -325, -968, 154, 1285, 923, -672, -537, 1463, 1419, -674, -708, 972, 1156, -227, -879, -36, 953, 123, -1321, -690, 723, 92, -1207, -802, 146, 180, -486, -918, -263, 725, 100, -923, -33, 1032, 274, -381, 215, 702, 531, 257, -53, 302, 881, 258, -505, 212, 684, -168, -451, -81, -83, -150, -292, -689, -395, 117, -414, -770, -121, 58, -392, -168, 0, -92, 191, 272, -87, 220, 589, 186, 115, 528, 356, 165, 430, 211, 13, 342, 223, -336, -72, 132, -332, -303, -176, -454, -293, -63, -563, -579, 131, -74, -586, -157, 142, 13, 143, 10, -96, 533, 593, -144]
1867a44K12P03l21m66K40L8PO6n58j23P59k62q70L20N87m26l32J91MK70O2o10
1889f53K10Q56l38n91N53M18k83L8l5j4M29r3n95L23N28o28k86N06j58l23J46
1910A0k05j06L64l39m39N91J64p45K41N68m10r6L64r2O7L11l36kP11k12o82O16
1932C43M01n74p5K90j40M3%n19J66N23o20n24P17O9o04Q3K10j51K19j03l47N58
1954c5K85o65M3Q06j99m55M20K39j76N5j76j8N54k96o92M53N37o49m89M60K17
1975B19k75l53j78N59L82r76l54J053L19r26k08P07M51k29p10M1J249K24j497
1994e02o3J594M1j328j64Q42M88m78j059P6J514j78j914J36J806k61j546o3J109
2013E0M95p85j070P35J544n48j704N77J872l51j586P2J523N43j465q65J366J245
$$ y = [-144, 68, 771, 450, -16, 224, 262, 269, 335, -223, -346, 413, 151, -719, -399, 188, -238, -570, -379, -375, -105, -43, -653, -443, 413, 75, -516, 37, 455, 172, 210, 175, 161, 590, 497, -98, 225, 753, 125, -161, 345, 187, -136, 10, -195, -301, 63, -276, -715, -124, 40, -705, -464, 104, -306, -402, -38, -130, -63, 248, -88, -90, 621, 409, -273, 343, 744, 170, 95, 385, 245, 288, 288, -231, -65, 458, -162, -686, 31, 100, -504, -421, -211, -362, -143, -246, -593, -35, 250, -415, -372, 434, 235, -220, 200, 439, 263, 318, 142, 124, 678, 382, -310, 143, 680, 31, -458, 2, 219, -56, -409, -587, -28, 354, -622, -976, 77, 396, -530, -738, -31, 420, 191, -519, -478, 771, 995, -502, -565, 1029, 1070, -258, -422, 420, 908, 430, -629, -553, 961, 783, -1131, -995, 811, 550, -996, -1059, 50, 545, -240, -1310, -575, 969, 421, -1283, -706, 1166, 815, -771, -699, 824, 1367, -98, -963, 403, 1648]
2031A648j311j408J013J356o41j552k8J593N26k073r28K241R28k238r16J853R17
2048I80j081j118L55J684M49k214p74K903Q97k939p34K672P46j917r54R71J461
2065A387j31k263n16K791O74l237q50L032Q26k638j057J886J385j096j859M10
2081a256K417K41k669o71K872J265k810j489K714J782k278j796J656J857q31j932
2097i28k16K078J069k514j940K879K124l155k118K887J717k181j471R77J505M03
2113A116j856j507K621K235l125k292L498K089l077j586K172J471q62j641m66
2128a210K105J415k726k101L064K177l199k212K729J958j997k014J015K007L4
2143A045k153r27K358J857k471k322K575K733k400k668K160K496j402k126M72
$$ y = [1648, 337, -1071, -58, 1298, 657, -895, -923, 670, 1196, -877, -1805, 436, 1364, -874, -1790, 63, 980, -101, -1219, -864, 820, 1269, -945, -1719, 1184, 2081, -858, -1592, 1080, 1826, -91, -1045, -74, 1387, 1256, -1007, -1523, 1268, 1942, -1295, -2145, 887, 1713, -925, -1982, -96, 1289, 193, -1666, -1256, 1161, 1402, -1267, -1938, 934, 2199, -611, -2100, 614, 2396, 118, -1678, -22, 1835, 1004, -928, -1144, 934, 2003, -511, -2451, 428, 2552, -603, -2721, 166, 1883, -298, -1769, -792, 713, 1116, -740, -2247, 374, 2609, -516, -2808, 690, 2779, -298, -1884, 288, 1759, 897, -744, -1210, 895, 2310, -416, -2517, 547, 2724, -475, -2687, 42, 2000, 3, -2011, -996, 1011, 1045, -1108, -2035, 323, 2180, -291, -2613, -38, 2695, 295, -2373, -213, 2283, 881, -1245, -773]
2158g73J854O38j772j807J849K636k282l070K356K882k348k510J681J881o40j526
2174i51o57J497J886j758k620K210K980k320k701K232K346j460j829M75J683O47
2190A660j643j674J768K273j941k604J817K487j605k398R70K073l47j940m40J692
2206A48J183j555j709J379K262j142k437J002K568o50k340M42K029P8j458p51
2222i51J097J409q23k110P20K439q27k561P41K160o02j724l0J201O46q71j371
2239a457P52J933p20k160Q79K097o60j708M08J408K36j072p78R76J294r03j567
2256a042Q27J512o01j563K12J380J30j440n44J279P18j184q84Q65R52m98j027
2273i08J56J249K55j366l32J477M46j220l90R67N15n29o36J41R18R9j183k62J238
$$ y = [-773, 1081, 1719, -53, -1860, -11, 2625, 343, -2727, -371, 2511, 163, -2347, -666, 1215, 575, -951, -1608, -111, 1775, 17, -2603, -393, 2587, 267, -2434, -202, 2144, 684, -1145, -670, 1013, 1660, 17, -1657, 111, 2384, 443, -2161, -344, 2143, 538, -1860, -890, 1183, 836, -1104, -1544, 148, 1331, -224, -1933, -554, 1708, 566, -1871, -869, 1699, 1049, -1291, -849, 1180, 1258, -200, -951, 146, 1555, 732, -1378, -658, 1781, 954, -1607, -866, 1294, 692, -1032, -1062, 139, 785, -86, -1457, -705, 1228, 508, -1652, -773, 1324, 664, -1044, -636, 772, 1008, -64, -842, 134, 1428, 525, -1042, -215, 1297, 696, -867, -655, 725, 855, -585, -1129, 150, 868, -316, -1200, -335, 617, 119, -908, -752, 497, 752, -614, -946, 531, 977, -243, -633, 334, 849, 320, -316, -175, 743, 842, -341, -603, 635]
2292F35J23j191j85P92J82m99m90K06O79l8r10K3R49l2p79N8O26K01l36l35L03
2313a8O57k57o60L29O20k96m63J70K25Q1k47m13K33M88m39n94M53L69m77j91K18
2334b12N0J01p2l38K92M64l67l03M66K18k99J6J49l2J99o0l24K40K94l88j49K41
2356A86m1j74N5j27q6K50j39k80J60J47k24O3P6j25J63J67k53K6L79j10j78K23
2378A58Ml0J87j15k03L17N3m26O0K96j99j80R0j11k0J41k82r1L66j03l70K20K39
2401Aj65k5J05n7J68J50k73N7M36j97k72L06J47k11j9L4j09J84p8l46J80K03l53
2424a34j28K75n7j85P1q9L5K08j80k29L77J33l68J24L12j00q6J91o1O4J25k06
2446I2n6L67j52l07J93J41k69o9J13r7J7m3k22J14K36k85k00L70K4k47N7J21Q6
$$ y = [635, 758, -433, -618, 174, 356, -143, -633, -427, 252, 214, -696, -673, 276, 244, -535, -477, 149, 350, 14, -321, -18, 639, 382, -278, 51, 671, 375, -88, 82, 307, 388, 141, -272, -39, 449, 10, -584, -131, 238, -239, -430, -212, -162, -61, -133, -471, -179, 285, -82, -385, 81, 299, 0, 16, 165, 133, 332, 272, -52, 188, 482, 94, -55, 186, 145, -29, 26, -101, -187, 63, -76, -356, -196, -49, -273, -210, -134, -259, -96, 71, -182, -156, 223, 113, -65, 158, 162, 132, 319, 204, 1, 318, 371, -55, 5, 301, 102, -78, 12, -99, -119, 22, -260, -351, 15, -88, -458, -238, 1, -164, -189, -84, -141, 27, 177, -96, -39, 397, 200, -72, 234, 381, 170, 151, 185, 76, 260, 182, -164, 16, 219, -134, -262, 13, -44, -229, -158, -247, -212, -4, -184, -413, -36, 97, -271, -147, 165, 65, -21, 170, 109, 173, 298, 92, 36, 403, 251, -56, 137, 278, 9, -60, 53, -44, -27, -70, -292, -178, 58, -227, -427, -57, -33, -280, -223, -102, -16]
2469a6P5j27p5L78M5m11J28M33j67k27J03N5Q0k8l51J6M61k07n89K87L80l33k73
2492c63J78R8K3r1k53K16M47l19m20M75M03m35k05L07K63k0k68j65M38K90o15
2513a6l02O18K34n84k86L10L52j94n97k6P59J4q75kP43R5n73k11M01N66k14p63
2535e51J86J066j73j014J91R95j06o87j82M96N06m28q66L14J050m28j185L23J043
2554E50k38r43l5P56L54o70o35N85R07m89r82M61J079k08j016M1J082K34j032
2573a99m04J019N28q41o43M96Q26k82j077p1J277J07j481j99J410J99j252k40
2591h27Q11N04l82r27J03J400J35j713k7J842N5j629k3J274K52o89p36L55J171
2610I49j35j623M4J748o8j787p9J523K31j263n67Q93Q78o03j159L15J399%j501
$$ y = [-16, 59, -68, -143, 235, 280, -131, -3, 430, 263, 36, 139, 194, 274, 246, -105, -89, 372, 165, -424, -137, 243, -90, -363, -185, -87, -64, -155, -408, -192, 255, -64, -484, -9, 394, -41, -246, 61, 324, 304, 36, -129, 309, 599, -16, -318, 300, 534, -50, -336, -26, 326, 132, -465, -491, 268, 282, -593, -595, 148, 243, -330, -541, -140, 426, 212, -551, -365, 701, 528, -486, -295, 700, 594, -93, -275, 221, 727, 299, -567, -253, 797, 369, -816, -493, 550, 312, -631, -666, 90, 444, -226, -861, -276, 631, 142, -840, -379, 700, 492, -524, -483, 599, 833, -199, -603, 416, 944, 103, -540, -44, 782, 500, -577, -648, 629, 736, -745, -944, 466, 665, -587, -827, -16, 488, 106, -821, -718, 682, 817, -896, -923, 919, 974, -655, -678, 596, 848, 159, -577, -222, 949, 814, -809, -765, 983, 915, -872, -951, 572, 803, -460, -1027, -134, 744, 141, -1018, -703, 696, 696, -805]
2629h05j89J631M16j520n44J459P32j194p67Q66Q25k95j094k23J348N02j622p00
2647a174J683O71j741n77J289N35p90o86J92J001L14j387n49J744O71j818n47
2664a169J720N52j288n49P91P66k04j073j92J380M07j632n34J570O09j510p55
2681a111J164Q25q88r87M46J099l6j227l59J376O78j348q74J380J050j223r79
2698a014R94J010n70r10J00R40M15j048q70J181J079j334j151J260R46j055q41
2715h68N37P41n7p90m83R74P98j129r07J236R30j095p75Q69P58l92p54K3R00L44
2735H60r91n57J032O31r68p67Q21P56n96r33L17R38j64r78p6Q81K81p70n19O53
2755a49P61n33r06N32J037m25r11L10Q29m9o02k47N31N73n20q07M89R05n54q87
$$ y = [-805, -994, 637, 1053, -467, -1011, 448, 1180, -14, -781, 85, 910, 615, -479, -702, 646, 1148, -474, -1174, 509, 1180, -561, -1138, 151, 686, -104, -790, -598, 403, 717, -670, -1219, 525, 1196, -622, -1169, 551, 1103, -185, -734, 57, 823, 619, -454, -646, 734, 1141, -491, -1025, 545, 1154, -356, -1111, 53, 878, -10, -997, -551, 548, 512, -715, -1074, 302, 980, -368, -1242, 138, 1188, -35, -1014, -20, 990, 420, -490, -390, 550, 965, -83, -953, 228, 1307, -27, -1178, 82, 1028, -27, -868, -331, 410, 353, -437, -920, 54, 852, -277, -1184, 52, 982, -113, -888, -19, 739, 347, -407, -384, 516, 860, -131, -688, 344, 975, 7, -760, 61, 817, 221, -712, -395, 543, 379, -599, -675, 206, 487, -283, -802, -149, 612, 79, -827, -295, 742, 317, -594, -284, 545, 496, -106, -353, 178, 751, 231, -576, -87, 818, 264, -623]
2775f23M33O49k55n71r6N22L07n04n72N51O26m88n91M10N70j77n00K6N59J80n26
2796g0k73O06L40n20l13L09L39j28m58n3N01J07o33j78N89N0m76j11L24Q2k8k98
2818b92n4M65J06n41j8O13m3l87N8K61Q0m0k05m3L63J0m41M3L65p1k93k3J26O4
2842A03j09k27O4K32j37k40J20J79o1o8J1J2K09p4j82J63K62k08p4J83L9j11M2
2865A28l2n4J80p7k43J13J91k67n7J50r4p9J20j46k2J66n7j14J08J25j70Q0J11
2888F0j11J00O0o4k6J52l5q9R2j0o7O5m7j03J04J7k02M1P8q7k9J8n6M5R3j82j6
2915a99K19l2k03J64J07o5N2J8m1J19N9j73K9K09j24j59J25L8p6No2p0J02j8k13
2940a89O3J35j32q7J25Jn2N4m9M4J23m9j08K05O3j58R0J00m9j5K1o7O0O5j76j9
$$ y = [-623, -190, 459, 204, -367, -463, 59, 366, -138, -710, -159, 467, -21, -612, -202, 368, 191, -309, -283, 276, 456, -70, -343, 263, 603, 83, -230, 79, 418, 290, -168, -221, 280, 387, -246, -424, 165, 215, -261, -372, -48, 34, 6, -292, -346, 119, 225, -316, -334, 279, 236, -151, -93, 168, 248, 208, 3, -40, 323, 333, -108, -65, 300, 229, -64, -87, 39, 103, -6, -233, -169, 63, -74, -314, -194, -15, -76, -144, -133, -121, 88, 14, -168, -5, 257, 49, -25, 158, 197, 86, 128, 96, 42, 222, 145, -98, 15, 206, -61, -118, 32, -62, -141, -21, -167, -189, -23, -80, -194, -86, 39, -131, -51, 60, -51, 49, 109, 45, 19, 171, 136, 47, 139, 129, 62, 127, 80, -23, 81, 98, -104, -63, 15, -72, -101, -83, -139, -94, -1, -183, -199, 20, -12, -215, -51, 56, -9, 43, 61, 20, 139, 198, 25, 54, 263, 139, -20, 105, 143, 67, 72, 10, -60, 42, 24, -189, -126, 9, -123, -210, -85, -84, -136, -82, -131, -87, 36, -13, -121, 84, 147, -11, 79, 179, 130, 115, 136, 69, 129, 194, 18, -1]
2966aJ51n9k05J07N8j34Rj2o5Q0M7j96P3K02j70j13K31O6j07L1M1L6N8l4j14J69
2992A49J29k24r9K25j6j47LK8M2m0j60k2J86p6j96N2J57m7j25NJ15J22p3j98J66
3017d4K87k13j74K31J66j51o7J5P7J49j92k75K91K51l99k38L32J32k79p4M8J39
3039A2L2k47j23L44K06m58j03M32J58l23j27J77K69n5l00lM44M2m46p5L85Q8l09
3062B0k60K56L22k77m47K17M52k12m64R7L67L6k71k65L47M34l35n16M28N69m03
3083I5m23L14L52p4k80j74L63L61m29m99M78N16n44n09L74M07k04m60J0M42J54
3104B70n19l15N09M52m91m61M36N39k58n77J85O39j2n87p0N60K15m43l96L27N83
3125E86l22p20K31Q00k55q40J98O53j39n05j31L60M46k94p17L29R09l59r29M38
$$ y = [-1, 150, 91, -114, -7, 51, -83, -74, -86, -151, -71, -24, -220, -147, 55, -115, -228, 3, 69, -38, -7, 34, 70, 128, 94, -20, 149, 278, 54, -45, 180, 164, 17, 20, 48, 90, 50, -110, -132, 54, -22, -218, -166, -9, -56, -181, -176, -61, 61, -12, -210, -44, 243, 30, -144, 87, 253, 102, 35, 50, 127, 276, 84, -191, 100, 351, -48, -286, 46, 178, -101, -175, -127, 12, 44, -203, -326, 18, 224, -234, -337, 95, 253, -70, -197, -20, 249, 194, -106, -109, 335, 377, -69, -144, 241, 329, 20, -240, 16, 338, 61, -386, -169, 283, 71, -393, -296, 71, 107, -164, -429, -82, 352, 17, -499, -71, 498, 95, -328, -14, 338, 264, -16, -190, 173, 534, 105, -394, 84, 600, 56, -453, -79, 328, 124, -336, -326, 116, 270, -249, -564, -55, 397, -94, -555, -119, 420, 162, -415, -230, 409, 397, -190, -260, 300, 515, 72, -324, 3, 586, 264, -456, -225, 575, 320, -520, -322, 331, 192, -313, -444, -84, 362, 68, -649, -320, 589, 230, -699, -261]
3145b61Q03k67n98M7N14K34l91m99L81P44m10q33L39Q46l41p64R3O85O7o23l12
3166e46N31M63m68o41L62P31k21p81J19Q95J3q50q5P71J97n65k64L78M88k23o90
3187c86R2Q63m9r41k3R03l6p50j26N27K33l40m62J50P02n7q87O7R59o3q53P8P19
3210C20P2m68k76L84M76k03p12J79Q17j12q66N0P56M4o52k90N64L67m78n02K85
3231b45O17k05o41JO84J47o70k74O97L79o05l67N04M69l27m02Q2N20J01n99k57
3252c91O98K77p01l00N78K63m34l37J56M08j6n18j02N83J67o10j71N23J93l58
3272i2k47K94L62j48m37J11N05k3n07jM56J15l83k36K69L55k93m53K07M50k01
3293A03m32J26L07K0k55k27K55L92k90m26L14M28k82l14K18K76J5k41j51K95K35
$$ y = [-261, 542, 275, -323, -276, 238, 472, 81, -418, -37, 707, 297, -536, -197, 649, 308, -456, -363, 322, 389, -234, -546, -15, 448, -20, -661, -299, 432, 211, -570, -451, 444, 457, -393, -478, 293, 490, -75, -339, 39, 527, 304, -386, -294, 569, 520, -421, -444, 459, 423, -327, -453, 74, 307, -33, -495, -345, 357, 300, -587, -520, 439, 376, -477, -399, 320, 392, -76, -352, 32, 508, 305, -407, -228, 589, 477, -389, -339, 417, 461, -191, -481, 83, 450, -28, -530, -245, 372, 167, -474, -473, 211, 358, -312, -586, 111, 490, -115, -482, 22, 491, 164, -238, -156, 364, 465, -134, -391, 307, 584, -117, -417, 161, 424, -10, -347, -191, 217, 201, -317, -419, 164, 331, -279, -450, 73, 266, -92, -339, -45, 317, 169, -268, -157, 348, 325, -182, -183, 273, 388, 5, -231, 38, 393, 100, -353, -146, 304, 103, -329, -203, 104, 124, -131, -358, -103, 289, -1, -427, -113, 315, 33, -281, -63, 213, 228, -13, -164, 131, 366]
3314C66l13k85L15K63k98k34J63K17q5k59r4K34J74l38j42K79J19j88r9O5J87
3335D7J3k35L6K55P7k93NK68j7j08pJ8R7N7k27p2K82m8k54L4J33r4m2Rk9N1N3
3362Ij90j2K23m2j35Q1J04k5k8MLR5M0j09J3J28o3o3M3J%Op2j6P9n2j36O2N0p0
3392g2j3K0k8QP0j35K4J58o8p4J13J7rO7l0m4R0P3j75K8J45p4q7L8J1m1K2n5p9
3421a00J18Pj53K5R9m3m8%PM4N4r6KJ82n7j04Q7J00l5k5Mj3M2M1j53M5J22j23
3449B9p4N6Rp2J4n4qR7j5j57Q8J47j45p7J50jjJ0k4L6J40o6j11J45O3j23n4J15
3477A17Nl3n0j4M6K5j50k9Q4Mj04LK2Rno4RJ34%j37O6J42r5pR0j3J1M8p2%J54
3508A96j10j54J52J22j97m4J14p2m2Lo0j1J31j42r6J78O8j68j1J52J0o8J7J7Q5
$$ y = [366, 53, -232, 83, 346, 48, -186, -23, 194, 109, -150, -244, -10, 164, -174, -316, -37, 82, -106, -205, -140, 47, 60, -175, -139, 116, 193, -100, -95, 173, 156, 48, 41, 59, 156, 213, -14, -86, 196, 148, -106, -72, 61, -33, -75, -66, -95, -44, 9, -181, -193, 30, -12, -147, -66, 38, 13, -15, -11, -8, 87, 127, 18, 31, 159, 96, 33, 76, 77, 77, 83, 11, -5, 74, 22, -114, -52, -2, -72, -85, -65, -93, -85, -15, -150, -126, 32, -36, -110, 3, 20, 11, 78, 48, 4, 94, 167, -8, 20, 165, 91, 4, 42, 53, 12, 34, -21, -100, 18, 25, -128, -103, -4, -47, -95, -95, -88, -44, 10, -86, -84, 98, 41, -63, 24, 124, 89, 64, 68, 55, 97, 138, -15, 30, 152, 29, -45, 11, 20, -52, -38, -92, -100, -3, -18, -175, -87, 60, -85, -162, -12, -13, -14, -4, -28, 8, 148, 82, -29, 116, 179, 56, 2, 117, 122, 89, 39, 25, 71, 96, -54, -83, 1, 5, -99, -96, -74, -65, -70, -134, -125, 9, 9, -128, -62, 80, -15, -22, 68, 55, 66, 114, 42, 42, 196, 86, -68, 84, 206, 9, -35, 79, 7, -35, -32, -92, -103, 28, -114, -210, -32, 36, -132, -143, 9, 19, -49, -32, -15, 70]
3533G0K2j06oJ81k2j51K5J17nr5p2J03R2j43j47J13J07j14j34J00O8qj10o1J49
3558b7J60k24j37K76R8k31lJ34R0m0q8k9J58J10k87r0L30L2l25l3K23Mj06j47
3582a52N4J49J6k77l8L20L4l15l6K97Q3k03j39J92K38j04k63J17K84l7k87l3K79
3605A79J09k79k01K77J97k70k73K53K25k14k13K1J98J09k54k52L80K83m28k16
3625c69M03K04k48j97J91K10M6k72j63L95J94m36k16M44J82l65k54K50K33j35
3645I7l55K2L76N4m24j46M21J91l58k41L11L18k43l71K34M03r8l77J8L64J40l05
3667C1k91L26L75l24m54K92M44k91l84J56L17ol22k01K94L46l85l95M13M36m03
3688b6m18L44L45r8l08n2L63K17l73l09M24L36l70l82L00L62k12l86O7L60P3m30
$$ y = [70, 92, -14, -20, 161, 139, -12, 13, 130, 125, 30, -42, 61, 153, 10, -137, -24, 83, -31, -165, -65, 3, -5, -115, -176, -27, 133, -91, -228, 48, 146, -85, -88, 46, 136, 96, 8, -21, 137, 247, -40, -130, 200, 232, -93, -126, 97, 101, -5, -152, -98, 51, 67, -210, -248, 72, 106, -209, -245, 52, 135, -68, -207, -15, 223, 119, -144, -27, 257, 220, -67, -100, 179, 288, 9, -192, 85, 282, 12, -261, -8, 217, 3, -210, -189, 9, 118, -136, -388, -8, 275, -153, -369, 34, 238, -10, -207, -16, 194, 240, -32, -195, 200, 394, -42, -258, 186, 368, 3, -251, -1, 232, 97, -258, -236, 140, 194, -230, -376, 45, 236, -122, -363, -52, 266, 23, -348, -114, 289, 191, -186, -168, 196, 336, 31, -260, 66, 441, 117, -337, -45, 399, 108, -276, -120, 197, 191, -131, -332, -38, 308, -77, -472, -59, 377, -26, -444, -100, 245, 147, -161, -213, 150, 367, -6, -315, 109, 445, 75, -307, -7, 355, 143, -243, -176, 184, 257, -173]
3710a73j65L96K35l97k89L01L61k24m45J52N19n8m96L5M50Q9l52j54K94L00k13
3731A66m11J87M70j56n28J40M53j19l57k1K27J79k09l77J94M47k28m97K22M28
3751B10j06l91L8L50J48l02k27L18L37k80l51K38L71j71k99RL30Q5l84k12L94
3772A05K06l65k65K57K54j68l03J6L65O8m16q7M01J39l50j13K52K28j51k07N5
3793g9L15K2l62l6L59L7l28r6K77R9j83k08P7K72p7l46O3L43n0k89j6J99J10j34
3817c1j89J67K46j11k57J39K40r7j33j9J45J13j52j98J70K39k15k39J77J32j32
3838ej07nJ13Q7j63j72K11J45j69j80K14J55j19j15M5J44M9r8j37J82J60j82j22
3861f9J41Q2q8q6qJ14K1j63o4J53L9j58m4R2%Np1m3J71J2j28k3J74j2o8M8NK8
$$ y = [-173, -338, 58, 293, -104, -393, -92, 269, 45, -400, -248, 271, 213, -283, -248, 202, 291, -61, -215, 79, 379, 166, -245, -58, 412, 256, -272, -132, 321, 202, -155, -176, 51, 230, 21, -356, -162, 285, 57, -440, -218, 210, 104, -287, -249, 101, 249, -53, -280, 38, 375, 95, -256, -18, 353, 182, -117, -108, 222, 307, -77, -289, 105, 311, -54, -319, -62, 192, 24, -279, -263, 102, 170, -246, -333, 68, 207, -143, -256, -4, 224, 73, -134, -79, 236, 258, -104, -140, 219, 256, -72, -168, 109, 208, 25, -183, -106, 166, 89, -257, -194, 149, 99, -190, -206, -7, 103, -31, -220, -53, 193, 82, -175, -36, 204, 107, -26, -45, 100, 213, 61, -137, 33, 272, 57, -182, -5, 127, -5, -112, -117, -4, 83, -80, -252, -41, 104, -65, -245, -31, 124, 5, -110, -65, 79, 128, 30, -107, 75, 235, 53, -69, 72, 154, 66, -20, -28, 86, 107, -56, -120, 33, 72, -86, -130, -38, -38, -33, -104, -147, 24, 36, -92, -115, 59, 47, -21, 27, 32, 60]
3889F0L9o9l5J33J0j10j1J09q7l3J8lk5L9p2p5J15j3j15L3O1l7K0k5OL0O9r1J7
3918d2J27l6p8O8M7Orj9n3J02J5j59K0R6m4r8M8j6J2L5j30%Q0M6j45J9J34m9l8
3947f1J1J3J07l4o6mJ61k7j28O2P1j5k6n6OP4o1j09M9P8o9q8P1Ql8K9q1N4J21
3976E2j16m4J21M4j03QP4K1K2jo8N6R0j06q4J10Q0j79j9R4l2ln8m0K3M1j18k1
4004a56J37Kj19J2J10j3k7j4J9R7kp9O2J10m3p9L9N1K3q1n4O7P0q9q5N5L3p8m9
4033h1K7J8L1n0j04J14J06j57m3J52mj00O5N0OL9m9m6J02Q6j77pJ75m4j40k0R3
4060D2%j9j06M0J04l9j67L3J36J0j74L4J14K5j00l7R8R0o6q3O2J36m5j05J3J10
4086A06M1j72n5J92J9j65p6J65K3r5j04K5J12J2j74o1K45L9k39j0K72nj83qJ08
$$ y = [60, 99, 30, -5, 128, 138, 28, 17, 126, 39, 6, 24, 21, -4, 35, -37, -112, 3, -10, -125, -92, -31, -68, -48, -73, -67, -37, 32, -59, -42, 85, 49, -29, 39, 86, 92, 83, 64, 11, 113, 128, -31, -11, 85, 41, -57, -9, -25, -13, 22, -108, -108, -28, 18, -127, -108, 26, -23, -61, -50, -37, 70, 36, -30, -34, 127, 100, -28, 34, 105, 90, 64, 8, 14, 88, 27, -82, -33, 45, -24, -112, -41, -33, -71, -42, -123, -69, 52, -64, -108, 13, 57, -46, -38, 36, 57, 79, 78, 10, 66, 156, 50, -34, 76, 156, -23, -42, 52, 20, 17, -41, -81, -58, -17, -135, -156, -19, -17, -136, -124, -14, -27, -54, -68, -49, 48, 46, -33, 29, 139, 96, 17, 56, 107, 130, 49, -5, 62, 132, 43, -42, 13, 46, -32, -81, -54, -36, -5, -55, -159, -45, 61, -96, -139, 13, 9, -91, -26, 24, 30, 69, 20, -26, 76, 162, -15, -22, 153, 109, -31, -51, 42, 42, 23, -83, -43, 61, 22, -145, -112, 24, 34, -140, -106, 8, 33, -67, -104, -6, 84, 18, -65, -3, 133, 88, -17, -4, 106, 147, -25, -80, 112, 131, -34, -110, 55, 78, -17, -121, -96, 16, 28, -146, -207, 38, 77, -162, -172, 100, 95, -88, -96, 12]
4111A2J19Nk03J1K47L0l02j9L11k9k41k7J18J10j16j64L9K23o2k65KK88l9k18
4135a70m6K21J14j94r9J61K14j47j93J14K19l5k22k3K36J28k79j55K67J37k47
4156Aj74J52J73p6k26j0K11P4k99j18L71Q5l05j06K83J16j48j58P7K36M3l01n1
4179a50L81P4l98m9L25O4k03j89J12K47j17k97O6K72k0l19l7L04P7k67j43K24
4201d3K35j84k76J84K88r6k54L2K59J06k86j74K90K38k54k80K39K38k09k34Q6
4222i5J95N1k56j50L06J45k83k25K71K25k17k05J30K28L2k78l9K96J44l12j65
4243b02L19J50k16j97J52K18n1k94kK97J2l32p1K63J35k72j75J60K39j12l09J04
4265a84L63j03k72N5K47N5k00j00K02J95j53k76J43L12j47k52N2K47%k30j26J59
$$ y = [12, 131, 136, -67, -56, 191, 221, -81, -100, 211, 182, -59, -86, 32, 142, 26, -138, -99, 124, 62, -203, -201, 87, 48, -170, -216, 5, 119, -75, -174, -13, 201, 54, -139, -25, 194, 159, -63, -86, 150, 278, -1, -156, 111, 248, 1, -173, -21, 152, 76, -150, -160, 51, 125, -174, -292, 79, 164, -141, -247, 36, 152, 4, -154, -77, 159, 202, -99, -150, 231, 305, -93, -142, 183, 247, 44, -145, -33, 214, 97, -200, -134, 138, 118, -201, -238, 66, 143, -124, -267, -43, 192, 8, -268, -84, 204, 108, -146, -114, 145, 251, -35, -209, 81, 319, 65, -215, 24, 262, 53, -181, -95, 100, 151, -105, -255, 51, 196, -87, -312, -41, 184, -33, -238, -108, 120, 152, -126, -165, 131, 275, -37, -202, 117, 267, 51, -146, 6, 224, 173, -121, -123, 174, 186, -146, -217, 46, 181, -91, -266, -106, 133, 21, -288, -184, 179, 76, -196, -141, 106, 161, -39, -139, 63, 258, 105, -171, -28, 284, 137, -115, -63, 184, 184, -46, -172, -13]
4287a3K14k25k19J58K37j63k43J09K20j4j85q4K06J79k44j62K58J79j93j33J18
4308@J76j9k18k4K53L4k80n4K25P0j70j22Q1J31j4k16l5K30M4k55m3K54K9j69
4332i2m5J18J11l0j62K7K24j3k05l2K46L5k06j7P2R5j00j27%K16n4k10K2J54j
4357B6j20m9J00J24j28j11J28J41p3j20P2J10J1j08k6J03O8j32j03J40J13j75
4379im3N4N4rr5p4Q5J22j29j22J00J08r5p4P6N7Nn5n4J33Q1j09o8J16R8j33l4
4406a4K2P5K4q5m3J06Lj21n5P9O1p5p7J8P7j7o1k1Q0L5j09L9O3K0k1k8J6M4K8
4435F3q7J1J31n6m3rL4jRm9m2J01k1j29M6N6o9m3M3NqN7q5J6Q5L4j24P1R3o0m7
4466a8O7oL5%q9K6P9m8j05P3N5l4o8j9L4JMq4QR0m6p6M4R6l7j6pL7P4j03J1N2
$$ y = [-13, 201, -24, -243, -85, 152, -11, -254, -145, 75, 61, -124, -208, -2, 177, -67, -229, 29, 208, 15, -118, 0, 176, 157, -61, -85, 168, 202, -78, -132, 93, 163, -7, -129, -48, 83, 69, -147, -182, 48, 92, -163, -206, 48, 77, -92, -137, -19, 92, 62, -100, -73, 151, 138, -67, -99, 147, 182, -24, -41, 31, 126, 26, -101, -101, 115, 61, -149, -127, 27, 26, -94, -143, -43, 81, -47, -158, -30, 111, 38, -82, -10, 100, 111, 3, -23, 80, 148, 16, -87, 53, 166, -9, -52, 2, 56, 47, -48, -122, -37, 85, -44, -166, -66, 42, -53, -127, -51, 6, 11, -44, -98, 35, 116, 7, -61, 55, 153, 20, -14, 8, 83, 107, 22, -21, 85, 88, -33, -88, -9, 52, -23, -100, -82, -5, -22, -83, -104, -24, 11, -98, -59, 4, 24, 3, -25, -9, 35, 63, -24, -13, 118, 62, 19, 10, 44, 43, 52, 3, -39, 62, 41, -88, -42, 14, -55, -98, -55, -50, -58, -1, -86, -70, 15, 49, -75, -4, 89, 29, -18, 49, 43, 78, 78, -11, 15, 94, 46, -59, 14, 69, 35, -33, -52, -18, -17, -13, -97, -89, 1, -45, -121, -77, 19, -18, -34, -41, -4, 70, -33, -22, 30]
4498C0N6k4p9P4PM6p5q2J14N0j37p0J33k9o2J5nJ1ol4m6J20J7j19j9J70n5r6O2
4527c3N3K2J7n6kJ28kj44MJ37n0j18N7N3l2n7l5L6O4k9j13L9R7o3j09M7Q8J8r0
4556g3k1R0O9p5n6J11N2n2n3j6J17j6o7l9J28L3j59k0J08j9n9m5LM8L1j10n6J68
4584B2M0j86K8J75q2r8O0P3J3Pr9L1J19Lj62L7J75j01j11K1Q5K0r9o9O0J09p7
4611fj26P2J26p8j27L1J12J0r6j2J09J05j44l9J08R5o9j23L6J59%j75o1K03Mj72
4637e8n0J27O7p6j13J2J28lj77RK13ok20RJ83Op6o2M2J59l1j72K2K43k5k19L5
4664c3J65rj50n6J49O8q7k21J09K07j29k07N0J94k3j37m7J77P7j64j26J75J67
4687A49j16j78Q3J93Mk17J8K12P4k86n1J97J16j85j21J00J02j8k19OK29J5k61
$$ y = [30, 86, 62, -17, 57, 64, 110, 35, -47, 67, 117, -20, -90, 43, 14, -48, -33, -38, -27, -33, -67, -113, 7, 24, -95, -114, 56, 1, -95, -33, 20, 42, 59, 3, 1, 129, 127, -17, -13, 124, 74, -44, 13, 66, 34, -23, -58, -22, 42, 13, -100, -61, 36, -27, -136, -89, -1, 17, -73, -94, -4, 65, -10, -66, 45, 97, 45, -8, -24, 93, 77, 10, -29, 99, 132, -27, -47, 61, 42, -17, -62, -59, -11, 20, -90, -146, 22, 62, -124, -96, 79, -3, -101, -41, 32, 45, 52, -47, -16, 103, 106, -56, -19, 156, 55, -56, -35, 50, 70, -29, -98, -38, 71, -6, -132, -60, 66, -12, -139, -108, 4, 14, -82, -94, 15, 120, -24, -63, 45, 140, 71, -52, -16, 143, 143, -32, -93, 110, 114, -58, -108, 19, 86, 10, -103, -91, 37, 34, -143, -134, 79, 73, -147, -138, 45, 51, -25, -87, -45, 114, 83, -89, -67, 176, 151, -68, -33, 132, 123, -27, -83, 66, 134, 47, -174, -65, 142, 13, -194, -144, 50, 27, -110, -157, 20, 97, -67, -193, -18, 149, 33, -145, -62, 131, 135, -82, -64, 148, 222, -64, -115, 82, 198, 13, -108, -8, 94, 76, -143, -137, 92, 107, -154]
4710a54m1K41O7k19q5J70J35p1j89L8K54k2k24J6K57j7j96q5J77J12j47j34J14
4733cK02j24k58R0K17m6j89p3K02Q7j73j28J56J56j08k27J50J83l7j65j2K08P7
4756A85j93j19J94J46j86j78J78J50r7j77LJ63L5k20p1J83J33k37r2J51J34q6
4778aj36K3K01J2k01l7K41P4j95r8J67J44j19j62L8K54p3k16lK06J8k44l6J75
4802C2N0r2j80R1K05o9k46Q4K37n6j79J0J63M7j11j17J16J81p9j96J00J63m9j91
4826h6N2J25N6j82o5J11J14j27j41J04J27q3j32lJ34P0j81o3J88O8j22q6J35P4
4850H7m9r5J3J42L5j79j9J74K1j85k7J33Qn4p5k3J27K3j72nJ77k0j65NJ38L1q1
4877c5l6L9R8Nj45M3J27k4r7l0J37Op2n3M8R7n5j33J9J01nj26J0M4O3q0j06J12
$$ y = [-154, -195, 46, 113, -106, -191, -21, 114, 43, -146, -108, 146, 124, -100, -84, 173, 156, -40, -125, 52, 164, 17, -117, -3, 199, 75, -183, -93, 124, 78, -111, -184, 18, 105, -68, -196, -40, 116, 8, -219, -69, 114, 77, -88, -100, 108, 185, -8, -127, 67, 213, 27, -151, 27, 177, 80, -97, -94, 69, 104, -116, -187, -4, 129, -108, -200, -49, 85, -1, -137, -114, 87, 99, -102, -139, 102, 176, -19, -117, 50, 194, 75, -87, -49, 205, 132, -84, -87, 119, 137, -107, -143, 32, 82, -10, -190, -99, 106, 37, -209, -125, 112, 56, -123, -113, 50, 97, -14, -131, -15, 166, 87, -109, -9, 154, 105, -86, -34, 91, 147, -35, -100, 11, 125, -2, -143, -39, 88, 5, -127, -130, 4, 74, -107, -170, 18, 86, -36, -122, 13, 87, 38, -57, -44, 98, 133, -46, -65, 109, 130, -55, -82, 51, 59, 5, -70, -93, 34, 57, -115, -120, 57, 37, -128, -123, 15, 46, -35, -71, -32, 66, 71, -74, -31, 96, 72, -25, -55, 82, 88, 16, -37, 11, 108, 53, -80, -61, 40, 35, -91, -81, -37, 26, -54, -160, -48]
4905d8Q0o1j02J10L4j3l7k2Q2N7n5p5J10Q3j06o3O4L0m4qm7L4P8r8j04J06N9j17
4933g3m4R0J6n3j5pO0N9p9k5J00M2o9l0L3N5km9j1N4L8o4k1O2Jo5k8L4J5k3p5
4964g4J9N6np4ON1Pm2j5L6O7l8p7P2P6k3o6K9P3m0K4p8J3P3m3q5L8Q7o6p3L1O8
4996B7o2kj4j4R0qj18N0J14r8l5Q4K7l1j0J0J4M7l2p3O9O1o0p1M4N9o8m3lM8J7
5027A9n7m2M6N3o5n0O8J4L3q7J0R9j5o6J9P0K2l4k3J1N3Kp6l0J01J0j38N2M3k6
5057A6m8j4J7J9nr2L1J12n9j10P9R5p4l7N4K5K4j4m6L8N7J6j06O0P9o6o8N5L1
5086F9l3k4m1L5L2o8n4N8N7q6n6J3J32l8p1pR5K6r9L6L5M6k4l4nQ7J0j04k0J60
5116A27k8j74M8P9k6n3J7rN0j3j31K3J65q0j23P0J04n1m6J1J2R1j2j10M8J33m3
$$ y = [-48, 32, -29, -131, -21, 13, 0, -37, -59, 23, 80, 25, -50, 60, 143, 37, -26, 38, 68, 24, 16, -31, 3, 81, -17, -121, -15, 44, -73, -117, -27, -11, -64, -79, -86, -26, 33, -46, -71, 29, 71, 2, -28, 5, 60, 58, 9, -2, 52, 90, 26, 5, 67, 68, 3, -25, 9, 24, 1, -74, -55, 1, -4, -78, -72, -21, -14, -56, -71, -35, 32, -6, -83, -11, 65, 42, -24, 5, 78, 38, 62, -16, -3, 70, 27, -58, -20, 67, 1, -72, -41, 27, -35, -37, -51, -65, 25, 17, -101, -51, 63, -35, -70, 14, 41, 10, 0, 10, 24, 71, 39, -34, 35, 96, 36, -35, 9, 68, 0, -43, -46, 2, 19, -38, -80, -34, 19, -46, -96, -28, -14, 19, -68, -58, 41, 26, -40, -21, 49, 71, 37, 14, 25, 78, 80, 4, -26, 75, 85, -53, -1, 42, 16, -32, -46, -29, -10, -15, -107, -76, 36, -23, -133, -54, 41, -33, -70, -16, 9, 33, 19, -27, 11, 68, 84, -22, 38, 117, 51, -17, 38, 69, 36, 12, -29, 6, 38, -30, -84, -26, 31, -55, -111, -98, 34, -4, -75, -82, 13, 39, -60, -24, 11, 57, 33, -1, -6, 81, 91, -13, -33, 127, 99, -75, -27, 52, 26, -27, -10, -19, 31, 18, -113, -90, 75, -5, -128, -58, 46, -5, -51, -40, -28, 63, 51, -59, -11, 122, 79]
5143G9j61J02P4l2p9kP4J7r8n8Q6O7j24n8N8J17o3q4j2R8M2j29l7J49M5r2m2P3
5171A0J05k9j26NJ74j9j57K1J38j1j22k6N5L7m8j22J7J47j8k11N2J91n4j51J2
5196a30J14M8l2r7P9J11m6j33N9J86q9j10QJ30L3j29q3J08J17j15j66J20J02p2
5220A3j41K8J25K9j35o4J36N5j01p5Q9J35p1j04K3J32L5j59l3K16Rj52o4J44N4
5245A24q7r6MJ56l9j61k4K04l7j61j2J43L6p6j05N6J65o2j47P2J32k0j49L7J20
5270G3K6j14n7J05J02p3j72P1J53m1j79L1P7K0j12k8Q2R8j01j35J12J53j16j25
5294a50P6J62Pj40j9J29P6j47p0J34J04j15j02P2R8k6j45pJ48Mj53n3J05O0q1
5319c3j14P9J16n2j05J2J41kj46RJ51j1o4k1M2J09k6j53J7J75l3j50O9P4j2r7
$$ y = [79, -82, 20, 94, 62, -17, -19, 55, 72, -26, -84, 2, 69, -55, -113, -55, 62, -1, -85, -97, 1, 43, -86, -123, 26, 71, -21, -63, 10, 115, 86, -40, -35, 139, 120, -37, -16, 122, 111, -11, -37, 18, 55, 7, -115, -98, 49, 31, -180, -128, 63, 9, -142, -130, -16, 32, 0, -97, -18, 93, 47, -86, -27, 159, 70, -40, -32, 98, 131, 2, -81, 27, 144, 29, -137, -17, 85, 13, -128, -100, 25, 54, -81, -145, -9, 46, -55, -130, -41, 94, 23, -81, -58, 74, 109, -50, -83, 133, 142, -10, -74, 70, 124, 37, -59, -55, 101, 62, -99, -123, 81, 44, -117, -129, 14, 50, -26, -131, -75, 90, 28, -119, -47, 85, 65, -84, -47, 73, 99, -15, -72, 33, 135, 62, -110, -39, 114, 73, -106, -75, 2, 22, -90, -118, -36, 62, -39, -174, -62, 91, -25, -150, -74, 88, 95, -45, -64, 65, 141, -6, -76, 58, 162, 47, -55, 17, 115, 89, -56, -63, 85, 89, -64, -117, -12, 48, -33, -147, -68, 48, -4, -109, -97, 44, 42, -104, -95, 56, 45, -19, -40, 2, 111, 85, -68, -51, 124, 91, -59, 10, 84, 72, -25]
5345b5j2K5J01o9j32K1J60q5j18K8J38J0q0o2Q2N9l7r4J06J09o4j18O7N8l5n1
5371a8j8J13N2j33q2Q1P1l5j48Q5N6j9p5j9J03L2r7n7J19N2j02l3O4Q1j0p6k2
5398c5J32j1j25j8J07K4o7m0K6M1k2o4k3J26l6j04j5J63p1q8J5K2Q5l1l6mQ1J9
5426E1r6K1R6J4q5j9O8M8p3n5M6N6k8p8RO0j6q0jQ5%o8l5J5N6ln2K9L2J1l9j2
5458d3M2M4o4k6P8P5p2k9NK8L9n9m2N5M9q3m6O6K0j14NM2rM1m3m2N9M0o6m2R4
5489BJ7k8rK8J9J3j5m4O1J8m2j2K5L6p1l1K6K9k3l9J0K4J5p7j0N7L4j7n5J4J03
5520E8m4p2M1O7Jo4N0lJ3j4o6L3R8o1q7M2P9p1n4L2j1J6%p0K6R1n3j02R5O7n1
5551a4l0L8K7klmnM5j1o4K7O0l6p4Q2J2m6j7j2K9J7m0m7K8N4n4k0J3N6l2n2L6
$$ y = [-25, -37, -12, 89, 20, -112, -91, 69, -16, -134, -106, 32, 42, -38, -100, -18, 41, 4, -90, 16, 125, 61, -57, 10, 68, 33, -18, -36, 77, 129, -4, -86, -5, 66, 31, -117, -32, 24, 5, -70, -89, 14, 46, -51, -108, 11, 63, -39, -72, -8, 73, 63, -13, -35, 97, 86, -39, -57, 50, 74, 7, -33, -7, 34, 12, -52, -75, 51, 15, -89, -104, 59, -12, -100, -85, -63, 22, -9, -45, -49, 32, 51, -45, -24, 72, 86, 1, -18, 50, 98, 25, -30, 16, 72, 44, -34, -25, 35, 19, -61, -62, 23, 23, -45, -80, -65, -9, -12, -64, -35, -3, 8, -31, -43, -1, 43, -21, -47, 31, 106, 34, 5, 10, 38, 77, 18, -24, 31, 80, -3, -49, 17, 37, -77, -72, -30, -39, 2, -41, -83, -24, 16, -50, -92, 2, 19, -9, -18, 10, 29, 42, 27, -17, 44, 62, 20, 8, 33, 69, -2, -33, -7, 22, -1, -40, -30, -6, 9, -68, -78, -21, 13, -4, -59, -45, 58, 14, -58, -17, 50, 51, -13, 37, 34, 47, 33, -33, 0, 98, 37, -50, -8, 71, 0, -54, -22, -33, -17, -17, -87, -61, 30, -23, -125, -30, 37, -14, -44, -6, 21, 19, 16, 12, 7, 52, 41, -23, 4, 64, 28, -46, 36, 48, 2, -15, -27, 2, 19, -21, -68, -40, 14, -40, -60, -47, 9, -23, -75, -39]
5583c9P2m4j3J7K1J8j9k0J7O0j2m5mQ3m9n7M0kl6Qk8k2N3kp8kJ33j00m4P5L5o4
5615d8j3K8L3J0j6m5M9O7k9q6P7O0o7m7NN8K1q1QJ3K9m2n2K3Q3n3n2JJ03pr6J4
5647e2J04k5k6pRM0j3o7J1R7kj52O3R9n3n3J5K4pJ6p8PQ0l8j00P4P4o6q2Q4M9
5678B5k1k8l3N7Q0o4n5L8P7m4p6L5J03j8r7J1N9Qn0r4Q0K3j9o7J1Q6k1j14K9J08
5708B9qr8j1N3N1l8l0K9R4Nj21K9J29l6j03K4R2rn0o2L5M8k0j21K8J03k7r7J4
5737f8M2K4n9l4P2P3r4n6M7J21oj31M2J08k3p2j2N8M0m6o1P7N2p8q0O0N7k8p8
$$ y = [-39, 33, -11, -24, -7, 14, 32, 13, -7, 10, 70, 58, 13, 9, 92, 43, -14, 26, 24, -12, -4, -32, -54, -1, -3, -81, -83, 50, -50, -94, -19, 16, -48, -61, -33, 0, 10, -6, -51, -2, 65, 36, -50, 27, 87, 20, -27, -22, 36, 57, -24, -16, -3, 26, -16, -68, -45, 38, -15, -67, -66, 37, 30, -66, -52, 52, 27, 1, -6, 3, 43, 30, -37, -26, 71, 69, -83, -20, 79, 26, -27, -12, 12, 5, 21, -57, -50, 30, -8, -108, -34, 40, -26, -108, -24, 25, 4, -24, -57, 0, 80, 16, -39, -1, 76, 32, -44, -9, 94, 76, -21, -10, 49, 57, 7, -87, -7, 16, -3, -70, -59, 27, 6, -108, -79, 29, 21, -77, -88, -35, 16, -22, -52, -23, 71, 76, -45, -16, 113, 77, -26, -2, 90, 81, 31, -31, 4, 52, 32, -89, -61, 42, 15, -82, -68, -26, -2, -61, -95, -23, 50, -44, -100, -53, 68, 62, -69, -27, 81, 58, -14, -26, 32, 72, 26, -35, 42, 94, 16, -64, -4, 53, 25, -53]
$$ [...]
8191a7
##END NTUPLES=NMR FID
##END=
