##TITLE=1H_Pr 5050-d
 CDCl3
 8 sc, 
 23.09.2022
##JCAMPDX= 6.0         $$ Bruker NMR JCAMP-DX V2.0
##DATA TYPE= NMR FID
##DATA CLASS= NTUPLES
##ORIGIN= UXNMR, Bruker Analytische Messtechnik GmbH
##OWNER= root
$$ XWIN-NMR		Version 3.5
$$ Fri Sep 23 15:27:18 2022 Russian Standard Time (UT+4h)  she@DPX200
##.OBSERVE FREQUENCY= 200.1313499994
##.OBSERVE NUCLEUS= ^1H
##.DELAY= (6, 6)
##.ACQUISITION MODE= SIMULTANEOUS
##.ACQUISITION SCHEME= undefined
##.AVERAGES= 8
##.DIGITISER RES= 18
##SPECTROMETER/DATA SYSTEM= spect
##.PULSE SEQUENCE= zg30
##.SOLVENT NAME= CDCl3
##.SHIFT REFERENCE= (INTERNAL, CDCl3, 0, 15.7039)
##AUDIT TRAIL= $$ (NUMBER, WHEN, WHO, WHERE, WHAT)
$$ ##TITLE= Audit trail, XWIN-NMR		Version 3.5
$$ ##JCAMPDX= 5.01
$$ ##ORIGIN= Bruker BioSpin GmbH
$$ ##OWNER= she
$$ F:/spectra/data/she/nmr/H-F/1/audita.txt
$$ ##AUDIT TRAIL=  $$ (NUMBER, WHEN, WHO, WHERE, WHAT)
(   1,<2022-09-23 15:26:22.82 +0400>,<she>,<DPX200>,
      <created by zg, POWCHK disabled, PULCHK disabled
       configuration hash MD5:
       00 E9 B6 7A A2 85 ED C7 34 08 36 98 17 FE 4E 26
       data hash MD5: 16K
       BB 69 56 4D E4 07 DA E7 B4 89 B2 86 56 32 B2 92>)
$$ ##END=
$$ 
$$ hash MD5
$$ 48 4A BF C4 AE 8B AB E7 A0 23 18 C1 0A 6C 50 B9
##$RELAX= 
##$RELAX= 
##$RELAX= 
##$RELAX= 
##$RELAX= 
##$RELAX= 
$$ Bruker specific parameters
$$ --------------------------
##$DU= <F:/spectra>
##$EXPNO= 1
##$NAME= <H-F>
##$PROCNO= 1
##$TYPE= <nmr>
##$USER= <she>
##$AMP= (0..31)
100 100 100 100 100 100 100 100 100 100 100 100 100 100 100 100 100 100 
100 100 100 100 100 100 100 100 100 100 100 100 100 100 
##$AQSEQ= 0
##$AQ_mod= 1
##$AUNM= <au_zg>
##$AUTOPOS= <>
##$BF1= 200.13
##$BF2= 200.13
##$BF3= 200.13
##$BF4= 200.13
##$BF5= 200.13
##$BF6= 200.13
##$BF7= 200.13
##$BF8= 200.13
##$BYTORDA= 1
##$CFDGTYP= 0
##$CFRGTYP= 5
##$CHEMSTR= <none>
##$CNST= (0..31)
1 1 145 1 1 1 1 1 1 1 1 1 1 1 1 1 1 1 1 1 1 1 1 1 1 1 1 1 1 1 1 1 
##$CPDPRG= <>
##$CPDPRG1= <>
##$CPDPRG2= <>
##$CPDPRG3= <>
##$CPDPRG4= <mlev>
##$CPDPRG5= <mlev>
##$CPDPRG6= <mlev>
##$CPDPRG7= <mlev>
##$CPDPRG8= <mlev>
##$CPDPRGB= <>
##$CPDPRGT= <>
##$D= (0..31)
0 1.2 0 0 0 0 0 0 0 0.06 0 0.03 0 0 0 0 0.0002 0 0 0 0 0 0 0 0 0 0 0 0 
0 0 0 
##$DATE= 1663932382
##$DBL= (0..7)
120 120 120 120 120 120 120 120 
##$DBP= (0..7)
150 150 150 150 150 150 150 150 
##$DBP07= 0
##$DBPNAM0= <>
##$DBPNAM1= <>
##$DBPNAM2= <>
##$DBPNAM3= <>
##$DBPNAM4= <>
##$DBPNAM5= <>
##$DBPNAM6= <>
##$DBPNAM7= <>
##$DBPOAL= (0..7)
0.5 0.5 0.5 0.5 0.5 0.5 0.5 0.5 
##$DBPOFFS= (0..7)
0 0 0 0 0 0 0 0 
##$DE= 6
##$DECBNUC= <off>
##$DECIM= 32
##$DECNUC= <off>
##$DECSTAT= 4
##$DIGMOD= 1
##$DIGTYP= 9
##$DL= (0..7)
0 120 120 120 120 120 120 120 
##$DP= (0..7)
150 150 150 150 150 150 150 150 
##$DP07= 0
##$DPNAME0= <>
##$DPNAME1= <>
##$DPNAME2= <>
##$DPNAME3= <>
##$DPNAME4= <>
##$DPNAME5= <>
##$DPNAME6= <>
##$DPNAME7= <>
##$DPOAL= (0..7)
0.5 0.5 0.5 0.5 0.5 0.5 0.5 0.5 
##$DPOFFS= (0..7)
0 0 0 0 0 0 0 0 
##$DQDMODE= 0
##$DR= 18
##$DS= 0
##$DSLIST= <SSSSSSSSSSSSSSS>
$$ [...]
##$SUBNAM2= <"">
##$SUBNAM3= <"">
##$SUBNAM4= <"">
##$SUBNAM5= <"">
##$SUBNAM6= <"">
##$SUBNAM7= <"">
##$SUBNAM8= <"">
##$SUBNAM9= <"">
##$SW= 18.0517283424941
##$SWIBOX= (0..15)
0 0 2 0 0 0 0 0 0 0 0 0 0 0 0 0 
##$SW_h= 3612.71676300578
##$TD= 16384
##$TD0= 1
##$TE= 0
##$TE2= 300
##$TE3= 300
##$TEG= 300
##$TL= (0..7)
0 120 120 120 120 120 120 120 
##$TP= (0..7)
150 150 150 150 150 150 150 150 
##$TP07= 0
##$TPNAME0= <>
##$TPNAME1= <>
##$TPNAME2= <>
##$TPNAME3= <>
##$TPNAME4= <>
##$TPNAME5= <>
##$TPNAME6= <>
##$TPNAME7= <>
##$TPOAL= (0..7)
0.5 0.5 0.5 0.5 0.5 0.5 0.5 0.5 
##$TPOFFS= (0..7)
0 0 0 0 0 0 0 0 
##$TUNHIN= 0
##$TUNHOUT= 0
##$TUNXOUT= 0
##$USERA1= <user>
##$USERA2= <user>
##$USERA3= <user>
##$USERA4= <user>
##$USERA5= <user>
##$V9= 5
##$VALIST= <valist>
##$VCLIST= <CCCCCCCCCCCCCCC>
##$VD= 0
##$VDLIST= <DDDDDDDDDDDDDDD>
##$VPLIST= <PPPPPPPPPPPPPPP>
##$VTLIST= <TTTTTTTTTTTTTTT>
##$WBST= 1024
##$WBSW= 4
##$XGAIN= (0..3)
0 0 0 0 
##$XL= 0
##$YL= 0
##$YMAX_a= 50640
##$YMIN_a= -44738
##$ZGOPTNS= <>
##$ZL1= 120
##$ZL2= 120
##$ZL3= 120
##$ZL4= 120
##$ABSF1= 10
##$ABSF2= 0
##$ABSG= 5
##$ABSL= 3
##$ALPHA= 0
##$AQORDER= 0
##$ASSFAC= 0
##$ASSFACI= 0
##$ASSFACX= 0
##$ASSWID= 0
##$AUNMP= <proc_1d>
##$AZFE= 0.1
##$AZFW= 0.1
##$BCFW= 1
##$BC_mod= 2
##$BYTORDP= 1
##$COROFFS= 0
##$CY= 11.3945322036743
##$DATMOD= 1
##$DC= 2
##$DFILT= <>
##$DTYPP= 0
##$F1P= 2.36226072786647
##$F2P= -0.459571619588291
##$FCOR= 0.5
##$FTSIZE= 0
##$FT_mod= 4
##$GAMMA= 1
##$GB= 0.15
##$INTBC= 1
##$INTSCL= 1
##$ISEN= 128
##$LB= 0.24
##$LEV0= 0
##$LPBIN= 0
##$MAXI= 10000
##$MC2= 0
##$MEAN= 0
##$ME_mod= 0
##$MI= 1.114404
##$NCOEF= 0
##$NC_proc= 0
##$NLEV= 6
##$NOISF1= 3.799351
##$NOISF2= 2.8
##$NSP= 1
##$NTH_PI= 0
##$NZP= 0
##$OFFSET= 15.70392
##$PC= 1
##$PHC0= -17952.45
##$PHC1= 18.60069
##$PH_mod= 1
##$PKNL= yes
##$PPARMOD= 0
##$PSCAL= 0
##$PSIGN= 0
##$REVERSE= no
##$SF= 200.130013532006
##$SI= 16384
##$SIGF1= 3
##$SIGF2= 2
##$SINO= 400
##$SIOLD= 16384
##$SREGLST= <1H.CDCl3>
##$SSB= 0
##$STSI= 0
##$STSR= 0
##$SW_p= 3612.71676300578
##$SYMM= 0
##$S_DEV= 0
##$TDeff= 0
##$TDoff= 0
##$TI= <>
##$TILT= no
##$TM1= 0
##$TM2= 0
##$TOPLEV= 0
##$USERP1= <user>
##$USERP2= <user>
##$USERP3= <user>
##$USERP4= <user>
##$USERP5= <user>
##$WDW= 1
##$XDIM= 8192
##$YMAX_p= 0
##$YMIN_p= 0
$$ End of Bruker specific parameters
$$ ---------------------------------
##NTUPLES= NMR FID
##VAR_NAME=  TIME,          FID/REAL,        FID/IMAG
##SYMBOL=    X,             R,               I
##VAR_TYPE=  INDEPENDENT,   DEPENDENT,       DEPENDENT
##VAR_FORM=  AFFN,          ASDF,            ASDF
##VAR_DIM=   8192,          8192,            8192
##UNITS=     SECONDS,       ARBITRARY UNITS, ARBITRARY UNITS
##FACTOR=    0.0002768,     1,               1
##FIRST=     0,             0,               0
##LAST=      2.2672688,     0,               0
##MIN=       0,             -44738,          0
##MAX=       2.2672688,     50640,           0
$$ Real data points
##PAGE= N=1
##DATA TABLE= (X++(R..R)), XYDATA
0@%%%%%%%%%%%%%%%%%%%%%%qJ6j6J6j6J6j6K4l2L2l2M0m8M8n6O4p1P9q8J00j08
$$ 0 0 0 0 0 0 0 0 0 0 0 0 0 0 0 0 0 0 0 0 0 0 0 -8 8 -8 8 -8 8 -8 16 -16 16 -16 24 -24 24 -32 32 -39 40 -48 52 -56
43e6J20j34J47j62J78j95K14k37K61k86L16l50L89m33M82n39O09o94P97r28J101
$$ -56 64 -70 77 -85 93 -102 112 -125 136 -150 166 -184 205 -228 254 -285 324 -370 427 -501 600
64F00j338J688k250L306n918K3321L1231p1134j3672M7904R95k4996J2179o21
$$ 600 -738 950 -1300 2006 -3912 19409 50640 -20494 -34166 13738 14733 -10263 1916 1295
78A295j5033J6289J4533k3426q376K0179N625j2015n517l53Q979R926j1672j4891
$$ 1295 -13738 2551 17084 -6342 -14718 5461 11086 -929 -6446 -6799 2180 12106 434 -14457
92a4457J3064J2840j0237n250O166l859o81R123n452j0017J0817O081j3428j41
$$ -14457 -1393 11447 1210 -4040 2126 -1733 -2414 6709 1257 -8760 2057 8138 -5290 -5431
106e431J1999n982n921J0478k701j3191J0265J2732j4288r965J3227N044q101
$$ -5431 6568 586 -5335 5143 2442 -10749 -484 12248 -2040 -12005 1222 6266 -1835
119a835M41K373l482L003L901n427j347N000j956j542L626m226l590R390J226
$$ -1835 -1394 979 -2503 500 4401 -1026 -2373 2627 671 -871 2755 -1471 -5061 4329 5555
134E555j2117K250J0921n276n851O911q81o623O077L866q245j82O223l280j117
$$ 5555 -6562 -4312 6609 1333 -4518 2393 1512 -5111 966 4832 -3413 -3595 2628 -652 -1769
149a769N366m714m598R599K255j1427P08R692k766m717L153j740j308P421j687
$$ -1769 3597 -1117 -5715 3884 6139 -5288 -4580 5112 2346 -2371 782 -958 -2266 5155 3468
164C468j0259M781R061o890m587O681j991m259P948k74j1844M867J2108q136q946
$$ 3468 -6791 -2010 7051 161 -4426 2255 264 -3995 3953 3679 -8165 -3298 8810 674 -8272
179h272R145L875p067J703L381n321J034N771m503l483N939m68m755M569J706
$$ -8272 873 4748 -2319 -616 2765 -2556 -1522 4249 -254 -3737 2202 1734 -3021 1548 3254
194C254o788K320O860n556n041O332J702m990J422J553l469K157L506m789j769
$$ 3254 -3534 -1214 5646 90 -4951 1381 3083 -1907 -485 1068 -2401 -244 3262 -1527 -3296
209c296N448r15m015L514Q94m920L087M731o421l014Q489R20q140J199N697k228
$$ -3296 2152 1237 -2778 736 1630 -3290 -203 4528 -1893 -4907 3582 4502 -3638 -2439 3258 1030
225A030j953K127j783q30L809j419l767L241J541m065J681L082m602p47O035k137
$$ 1030 -923 1204 -579 -1409 2400 981 -2786 455 1996 -2069 -388 2694 -1908 -2655 3380 1243
241A243n575M104L213m373K0K860k827J20M221k853l193M787M91m924K876L301
$$ 1243 -4332 -228 2985 -1388 -1368 1492 -1335 -1215 3006 153 -3040 1747 2238 -2686 190 3491
257C491n617m34O644k521n801M502L536n028j042L632r87j330J705j240j009K751
$$ 3491 -2126 -2560 4084 1563 -4238 264 3800 -1228 -2270 1362 375 -955 750 -490 -1499 1252
273A252o67k847K639J577m162O01M624k779l603M617J749m998N68M069k459j984
$$ 1252 585 -2262 377 1954 -2208 -1607 3017 238 -3365 1252 3001 -1997 -1429 2640 181 -1803
289a803L096n34k249K571K30l274K249K098m298K53M876l228l982N326J666o028
$$ -1803 1293 759 -1490 1081 1311 -1963 286 2384 -1914 -1661 3215 -13 -3995 1331 2997 -3031
305c031J017N003k933k585L530p4k487K068L86k444K015J402l404P93L494l045
$$ -3031 -2014 2989 56 -2529 1001 927 -1560 508 894 -1550 465 1867 -1537 -744 2750 -295
321b95k117M425n6m446K171L023l505r32L267j152j949K150j82j911J983M62k914
$$ -295 -2412 2013 1957 -2489 -318 2705 -800 -1732 1535 383 -1566 584 402 -1509 474 936 -1978
338a978J621K679l477j310M483o05m301K527L125l548j054L679q56k535K088P48
$$ -1978 -357 2322 -1155 -2465 2018 1413 -2888 -361 2764 -784 -1838 1841 985 -1550 538 1286
354A286k271J169J101k403P30K422k668j384L891n48l902K164K695l322r69L291
$$ 1286 -985 184 1285 -1118 -388 2034 -634 -2018 1873 1325 -2577 -413 2282 -1040 -2009 1282
370A282o45k195J595O80j388P54J99j259J439Q24k718N58L352k196k761L621J336
$$ 1282 637 -1558 37 717 -671 83 282 -977 462 1286 -1432 -874 2478 282 -2479 1142 2478
387B478m186M74L626k074k357K750O39k542Q26J304j571K48J257j815j00K525
$$ 2478 -1708 -1234 2392 318 -2039 711 1350 -1192 -366 938 -633 -385 872 -943 -1043 1482
403A482j402k323K746J392l421J96L202j533k010K329O03k221P63J245j226O6
$$ 1482 80 -2243 503 1895 -1526 -1330 1872 339 -1671 658 1261 -960 -197 1048 -178 -112
419a12P96j209M49J528j985j111L090j27l431J464K637k440j264K502k23j793
$$ -112 684 -525 -76 1452 -533 -1644 1446 1319 -2112 -648 1989 -451 -1715 787 564 -1229
435a229J235O04j380O20P83j306M40J341j651n09K504n38k617J741K110k517j154
$$ -1229 6 610 -770 -150 633 -673 -233 1108 -543 -1052 1452 914 -1703 38 2148 -369 -1523
452a523K729Q6k438N98J643j020p85Q68p7k74M61n96l68J202k57j520J033J375
$$ -1523 1206 1292 -1146 -548 1095 75 -710 158 81 -193 268 -328 -696 506 249 -1271 -238 1137
470A137j690p07K206j44k016J024J409j382m38J143l17k96O42p40k78J605p14
$$ 1137 -553 -1260 946 802 -1214 -190 1219 -163 -601 542 225 -71 571 -169 -447 1158 444
487D44j888J821J357k849l33L097r76k642J842J542k068m02J663n47o96Q50k77
$$ 444 -1444 377 1734 -1115 -1448 1649 673 -1969 -127 1415 -653 -1055 608 61 -635 215 -62
504f2m13R38k98j049J243O43j814K69K052j158j793J840J162k041n30J716l3j023
$$ -62 -475 463 165 -884 359 1002 -812 -543 1509 351 -1442 398 1560 -481 -1011 705 672 -351
522c51J63O0N8N82o49q60J310M75j832L85J849j453j341K443N79k885L59K743
$$ -351 -188 -128 -70 512 -137 -997 313 788 -1044 -659 1190 -263 -1604 839 1418 -1467 -1108 1635
540A635r80j939J214Q16p25K15j45p28J127N29j718J92J661j221j066J936n0k279
$$ 1635 655 -1284 -70 746 21 236 91 -637 490 1019 -699 -507 1154 -67 -1133 803 753 -1526
558a526J110J908j762j210J776M24j123J03J04q7Q85k86j463J040J503j663p95
$$ -1526 -416 1492 -270 -1480 296 720 -403 -300 -196 -283 602 316 -1147 -107 1396 -267 -1062
575a062K105k35k059J300J557j963r03K092K47j696J24P64p0J49n02q28J108Q61
$$ -1062 1043 808 -1251 49 1606 -357 -1260 832 1079 -617 -493 271 201 350 -152 -980 128 989
593I89j653l23J743o91j276J649O57k337K38K457q18j926J019J082n77j56j74
$$ 989 -664 -987 756 65 -1211 438 1095 -1242 -1004 1453 635 -1291 -272 810 233 77 -97
610i7l27J083K93j648O1J727p14j311J284L82j711N95J580j364j205J588O73j343
$$ -97 -424 659 952 -696 -635 1092 378 -933 351 733 -978 -383 1197 -167 -1372 216 889 -454
628d54j36N65j01L62K3j087M12J523q82j303J373P14j628K83J526j234j113J796
$$ -454 -590 -25 -126 236 259 -828 -416 1107 225 -1078 295 1009 -619 -336 1190 -44 -1157 639
646F39N04j758K9J121l81o3J40r18L06J355j025j231J566N43j749M92J438j354
$$ 639 1143 -615 -586 535 154 91 231 -687 -381 974 -51 -1282 284 827 -922 -430 1008 -346
664c46p18J789L4j624M41J051m22k35Kl26P41N61j394l59J702k18j548P98Q92
$$ -346 -1064 725 759 -865 -424 627 205 -30 -28 -354 387 948 -446 -805 897 679 -869 -71 821
683H21j163k76J268l40j136N34Q64l93p14l7N84O26o27r21O87J124p55r21Q54
$$ 821 -342 -618 650 310 -826 -292 572 179 -535 -572 12 638 11 -910 -223 901 146 -775 79
702G9N96q67m5Q71m79p66Q61O30r33n03P05K89k68k80m18M13Q62p68j069J154
$$ 79 675 -192 -237 634 155 -611 250 880 -53 -556 149 438 170 -110 -528 -115 747 -21 -1090 64
722F4Q25j458k51J458l89j195J016P40j288k23J202p0o55J08P4K71M01p16n87
$$ 64 889 -569 -820 638 249 -946 70 810 -478 -701 501 431 -224 -116 -42 229 630 -86 -673
741f73J204L13j416J08J259o53q77J021L21j232J48J054l61q10K38L90J51r6o54
$$ -673 531 844 -572 -464 795 142 -735 286 607 -625 -477 577 216 -594 -356 34 185 89 -565
760e65P3J092j09j299M76J227q20q40J126L35j270K83J174o97q16P62M28n41j24
$$ -565 -492 600 491 -808 -332 895 75 -765 361 696 -574 -291 883 186 -630 132 560 19 -105
779a05l2K5M72j54q88M45R45q13p30J069K83j156K64R77n96o67P28M03n12j97
$$ -105 -137 -112 360 206 -682 -237 708 -105 -835 234 517 -639 -375 602 6 -661 67 470 -42 -239
799b39J83K87K26m98m86Q39N14j168k63J248j51j203N83Q36q68n56J005J37r12
$$ -239 -56 231 457 -41 -527 312 826 -342 -605 643 492 -711 -128 708 -160 -716 289 426 -486
818d86J23M89p0o0k00k21O40L20j012p9J259l07j209Q16R03j187l06J261j52r95
$$ -486 -363 126 56 -4 -204 -425 215 535 -477 -556 703 396 -813 3 906 -281 -587 674 522 -473
838d73L94N45l66j72J5j19M48K1r27L32J019p66q41J127L57j223J52J023n13o56
$$ -473 -79 466 100 -72 -57 -176 272 293 -634 -302 717 -49 -890 237 594 -629 -477 546 33 -623
858f23O51L19l96n5J11J7L37k07n84N58O20q73m43J041J65j146K16R54n31o99
$$ -623 28 347 -49 -104 7 24 361 154 -430 128 748 -125 -568 473 638 -508 -292 662 131 -568
878e68N88L43n28j77L24O1qj52l18M37M53p62k98J042j3j141M57J068p52p30R41
$$ -568 20 363 -165 -342 -18 43 35 -117 -435 2 455 -307 -605 437 424 -717 -260 808 56 -674 267
899B67L66q35k4M88k6j75j41j03M75L5p80J46R76n91q88R10N51j089j88J040j52
$$ 267 633 -202 -226 262 236 61 -80 -183 292 327 -453 -307 669 78 -810 100 651 -438 -626 414 262
920B62p55K57M96j52k08kQ1L54j99m77L72N45o05m55P92K68q87k0Q15k00p17K35
$$ 262 -493 -236 260 108 -100 -102 -21 333 134 -343 29 574 -31 -486 306 574 -313 -333 482 282 -435 -200
942b00N33k64l95J41K83K4k82j87L93K91n85k62P62J84r29J01J000l26q43N10
$$ -200 333 69 -326 -185 98 122 -160 -347 46 337 -248 -510 252 436 -493 -392 608 282 -561 -51
962e1O48n74l38M69J66k60j65J8K68N0m41q5O50j24q10M09P25o62o28P75M56q49
$$ -51 597 23 -315 154 320 60 -105 -87 181 231 -210 -295 355 231 -579 -170 555 -107 -735 40 496 -353
984c53j12O63J5l96lK31J03k4k56K8M90k28n24M63N32p12m09Q23K08q56jO57j51
$$ -353 -465 198 213 -183 -186 45 148 124 -132 -104 386 158 -366 97 629 -83 -492 331 539 -317 -318 339 188
1007A88m57J34K02n5q5j11P8L04k50l31M43K70o45r7Q63j22q25K91P03k99m73
$$ 188 -269 -135 67 12 -73 -184 -106 198 -52 -383 60 330 -315 -412 451 329 -496 -205 498 199 -274
1028b74K20K86l6j56j95J86K82l42k71N00J20o49O2O28k83o01M41M92m86m18M32
$$ -274 -54 232 196 40 -155 31 313 -29 -300 200 320 -329 -267 361 78 -523 -82 410 -76 -494 -62
1049f2L93l19l02J47L53l1l63k6M86l6n46J69O27l43n76N28M54o79k84O64P7o04
$$ -62 331 12 -290 -143 210 179 -184 -210 276 240 -306 -137 490 147 -429 99 553 -126 -410 254 331 -273
1071b73J8M05l7k26j07Q5K85q8m72K78N45n36m43P73K63p91j7P75j79n29K26L07
$$ -273 -255 150 113 -113 -220 -135 150 62 -410 -132 413 -123 -566 207 470 -321 -338 437 258 -271 -45 262
1093B62j66q2n5L6K51j63l54K82L40n26k34O81Op39J53O60k58n72K59N15k03l92
$$ 262 96 14 -41 -5 246 83 -271 11 351 -175 -409 272 278 -461 -308 352 94 -478 -219 296 93 -299
1115b99J53L33n0l17l9M09J16m95l5O19q6o28L07N41m75m81N77K76n94j20M33
$$ -299 -146 187 137 -180 -219 190 306 -189 -224 395 309 -319 -12 529 54 -427 150 426 -168 -288 145
1136A45L5k52j29R9K54o0m69J38N94k96o18N18N05o23k67O95M0n55J41L37j17
$$ 145 180 -72 -201 -102 152 92 -377 -239 355 59 -559 -41 464 -159 -426 269 309 -246 -105 232 115
1157A15j55KP9J89j08l36K47L74m52l82O28K15o85j01O38j00n23J62L59j24k24
$$ 115 -40 -38 41 230 122 -214 33 407 -45 -427 201 416 -269 -370 268 168 -355 -193 166 42 -182
1178a82J7K32Q7k49j57L20K57m82j52N99N7o49J14O15k47n09L10L59l29k53J78
$$ -182 -165 67 154 -95 -252 68 325 -157 -309 290 347 -302 -188 427 180 -329 -19 340 11 -242 -64
1199f4K26j06k82N7L10K8m92L2N93j91n96L56N52m35l66M53K56l83j54K93J44
$$ -64 162 56 -226 -169 141 169 -323 -291 302 111 -485 -129 423 -12 -378 75 331 -52 -206 87 231
1220B31k41j16J97J90k27k29K37L11l68l45M10L02m84k48M69J73m65r7L77N8l08
$$ 231 -10 -126 71 261 34 -195 42 353 -15 -360 50 352 -132 -380 89 262 -203 -300 77 135 -173
1241a73l3K27P5j81j19K23J67k43j93L87K25m89j25N55K2n45M2M82j11l70R8K55
$$ -173 -206 21 96 -85 -204 19 186 -57 -250 137 362 -127 -252 303 325 -220 -178 304 193 -177 -79 176
1263A76q0k38j1K63L8l97n7N34m6o01J82N68k68m45K73L74k41k52J96K25j27j91
$$ 176 96 -142 -153 110 148 -249 -306 228 182 -419 -237 331 63 -382 -109 265 24 -228 -32 193 66 -125
1285a25J27K23j54k50K00L12k46l34K53L37l33l54L54L03l76k74L45J89l06j28
$$ -125 2 225 71 -179 21 333 87 -247 6 343 10 -344 10 313 -63 -337 8 197 -109 -237
1305b37K63N7j89p0K15P9j28k03K50L21l94k90M88K30n33j46N40M6m89O8K77m3
$$ -237 26 83 -106 -176 39 118 -10 -213 37 358 -36 -326 162 392 -141 -287 253 299 -190 -122 155 112
1327A12j87MQ7J14j82j99K84K01m56j53O15Jn83J00N18j25l99J74K76j12k10Q3
$$ 112 -75 -71 16 130 -52 -251 33 234 -222 -375 240 241 -342 -242 276 151 -248 -74 202 90 -120 -37
1349c7J67mk13j5L39m5m09N4M66j77m71K06M62l06l68K86K59k28k25K39J36j73
$$ -37 130 126 -87 -102 237 192 -217 -163 303 126 -345 -139 323 17 -351 -65 194 -34 -259 -20 116 -57
1371e7j20R4K33j28k60K12L40k88l20M16K55m64j45L79J17l56j8J97L5r8j49J18
$$ -57 -177 -83 150 22 -238 -26 314 26 -294 122 377 -87 -232 147 264 -92 -110 87 122 24 -125 -7
1393gJ32j62k14K32K00l25j97M40J28m72m7M42M7m17O0K69K7k22j2K18O7k53p4
$$ -7 125 -37 -251 -19 181 -144 -341 99 227 -245 -292 150 197 -220 -160 109 136 -86 -98 120 187 -66 -140
1416a40K96J01l84o3M58l5m86R4M72k06l92K08L27k23k38J23J88p9j94L0K66m6
$$ -140 156 257 -127 -190 268 233 -253 -159 313 107 -285 -77 250 27 -211 -88 100 21 -173 -143 123 77
1438G7k66Q0L64j78l57K57L43l04k74L56J94l05j43K12J04j59j20J24J17j41j85
$$ 77 -189 -109 255 77 -280 -23 320 16 -258 98 292 -13 -156 56 160 1 -119 5 122 -19 -204
1459b04J69K10k31k14L13J76l36j61L68J31l55p1L31O5k54r0K61N4j67q7J82J14
$$ -204 -35 175 -56 -270 43 219 -117 -278 90 221 -134 -205 126 191 -63 -153 108 162 -5 -92 90 204
1481B04k16j56K87J34l96m7L54ql73N4L24q7k93J09K05n2j89l7K23J03k56n5L52
$$ 204 -12 -168 119 253 -143 -190 164 156 -217 -163 161 74 -219 -110 95 43 -146 -183 40 143 -113 -168 184
1504A84Qm10R2M33j90l33K43K33j87j70J40J38r1j77N2K02j05k44Q8K80j65k87
$$ 184 192 -218 -126 307 117 -216 27 260 73 -97 43 181 90 -87 -35 167 62 -182 -94 186 21 -266
1526b66J94K71k27k36K36J85k30j62K22J40j84j23K18J41j69j40J53J75j59j85
$$ -266 -72 199 -28 -264 -28 157 -73 -235 -13 127 -57 -180 38 179 10 -130 23 198 39 -146
1546a46J87J79k29j82K68J63l28j06L14N3l31j4K69Mk04r4K20R9k22j05K62J29
$$ -146 41 220 -9 -191 77 240 -88 -194 120 173 -158 -172 97 101 -103 -197 23 122 -100 -205 57 186
1568A86l16p7L52%l16O9L00q9k68J15K36j04k20O8K16l9k57PL02p4l20J04L03
$$ 186 -130 -207 145 145 -171 -102 198 109 -159 -44 192 88 -132 -64 152 113 -144 -137 165 91 -229 -125 178
1591A78j14k98J77K66k22k17K10J56j57j31J48J88j43j82J47J79j44j81J40K21
$$ 178 64 -234 -57 209 -13 -230 -20 136 -21 -152 -4 184 41 -141 6 185 41 -140 0 221
1611B21k00k30K65J56k47j55K77Q6k48r4J95M6j56r5J77J32j98j43K29J49k14
$$ 221 21 -209 56 212 -35 -190 87 173 -75 -169 26 72 -84 -179 -2 130 -68 -211 18 167 -47
1632d7j42K74J21k88m3K92j2k33K6K21k2k29N1J85rk34m5K77j5k89k8L42k9l27
$$ -47 -189 85 206 -82 -125 167 155 -78 -52 169 147 -82 -31 154 145 -89 -134 143 128 -161 -189 153 124 -203
1656b03L2L11o0l00J57K43j89j90J81J29j06j05R6J42p2j71O7K48r5k96J78K62
$$ -203 -171 140 80 -220 -63 180 -9 -199 -18 111 5 -100 -4 138 66 -105 -38 210 115 -181 -3 259
1678B59k03k15K09J39k19j24J58J03j35j27J40J21q6k08J40J76j54j91K48J30
$$ 259 56 -159 50 189 -30 -154 4 107 -28 -155 -15 106 20 -188 -48 128 -26 -217 31 161
1698A61k36p6K32P6k13m8J76N8j26r7J69Q9k16r3K04J18k53r1K48O7k55m0K35
$$ 161 -75 -151 81 157 -56 -104 72 130 4 -93 76 165 -51 -144 60 178 -75 -166 82 149 -106 -146 89
1721H9J3k38J8K18k0k46N4K07l2j69L0K04Nk59P2K16j4k71N0K61r4k56J61J87
$$ 89 102 -136 -118 100 80 -166 -112 95 63 -106 -76 128 133 -126 -54 162 148 -123 -73 188 94 -162 -1 186
1745A86j83j57J32J34j15j50P3J50o4k21J49J94j43j74J73J94k00j19J69J34j79
$$ 186 3 -154 -22 112 -3 -153 -80 70 6 -215 -66 128 -15 -189 -16 178 -22 -141 28 162 -17
1766a7r2J79J19j80r0J36J08j67j07J36R8j36j33J53J28k02j08K12R1k37p1K13
$$ -17 -109 70 189 9 -81 55 163 -4 -111 25 123 -13 -146 7 135 -67 -175 37 128 -109 -180 33
1788C3N3k04j1J95L8j77n2J99O4k03l0K11L6k25qK30Rk79N9K27q3k17P5K12q3
$$ 33 86 -118 -129 66 104 -73 -125 74 138 -65 -95 116 152 -73 -81 149 158 -121 -62 165 82 -135 -60 152 69
1813F9k00M8J86o6j62N1J87p0k11P3K26j04j96J52J50j18j56J52J22j36j04J03
$$ 69 -131 -83 103 37 -125 -74 113 43 -168 -95 131 27 -169 -17 133 15 -141 11 133 -3 -107 -4
1835dJ49j23j12Q6J33j07j43J09J54j40j61J48J34j79j08K12P1j97n6J38O3j12
$$ -4 145 22 -90 -4 129 22 -121 -12 142 2 -159 -11 123 -56 -164 48 119 -78 -134 4 67 -45
1857d5o6J40J23j63j33J93J02j76p1K20K8k28%J80j4j67m1K05rj34p3J67M2j72
$$ -45 -111 29 152 -11 -144 49 151 -25 -96 124 152 -76 -76 104 90 -77 -118 87 78 -56 -129 38 80 -92
1881i2m9K13Nk02K9J62Qj78N1J73m8j82Q7J51q7j55J07J91j26j32Q3J31p9j54
$$ -92 -141 72 77 -125 -96 66 74 -104 -53 120 72 -110 -23 128 41 -114 -7 184 58 -74 9 140 61 -93
1905i3P3J45q2k01J42J46j58j33J39J07j46q5J34J12j40q4J14R1p6j15J17J27
$$ -93 -20 125 43 -158 -16 130 -28 -161 -22 85 -61 -146 -12 100 -40 -124 -10 81 5 -110 7 134
1927A34j30j20J46J18j69p7J91N5j83n1J60J8j10m9R6J08j83p1J53O5k07m6K17
$$ 134 4 -116 30 148 -21 -98 93 148 -35 -86 74 92 -18 -67 29 137 -46 -117 36 101 -106 -152 65
1950F5rj93L5J92l5j49J4J92m5j52K9J42k2j34J6J53%j92K9K11p5k08P3J80r8
$$ 65 56 -137 -102 90 55 -94 -80 112 67 -85 -56 86 64 -70 -54 99 99 -93 -64 147 72 -136 -63 117 19
1975A9j44R2J41j16j33J34J18j20q4O3J25r8j05R2J03o8j10J10J14j08j05R4P6
$$ 19 -125 -33 108 -8 -141 -7 111 -9 -93 -30 95 -3 -108 -16 87 19 -91 19 133 25 -80 14 90
1998I0j15p4J45M1j04j03J40O3j18q8R7Q8j04r3J29O4j17p5J77M8j61l4J74M6
$$ 90 -25 -99 46 87 -17 -120 20 83 -35 -123 -26 62 -42 -135 -6 58 -59 -134 43 91 -70 -104 70 116
2022A16j49j3J46pj19j7J34M1j68j8J63J6j81m1K03k2j57%J69m8j57N2J29m0j27
$$ 116 -33 -46 100 93 -26 -43 91 132 -36 -54 109 125 -56 -97 106 84 -73 -73 96 48 -109 -57 72 32 -95
2047i5M4J12n6j11K7J43k0j25N3J59n6j60J02J33j30j13J13J12j02j32J23P8r4
$$ -95 -51 61 5 -106 -79 64 44 -81 -28 131 75 -85 17 150 20 -93 20 132 30 -102 21 99 5
2070Eq5P3J16r9j47J14J15j29r5J31R8j56l3J48J7j05o0J50L8j43m0J17Q2j39
$$ 5 -80 -7 109 10 -137 -23 92 -37 -132 -1 97 -59 -92 56 73 -32 -92 58 96 -47 -87 30 112 -27
2094b7n4J49P6j78o3J82L0j89MJ26lj07mQ5K7j30KJ48k5j40K9J40j3j12L3J30
$$ -27 -81 68 144 -34 -97 85 115 -74 -70 56 53 -54 -58 27 54 -76 -74 74 49 -91 -62 78 65 -47 -14 116
2120A16n6j54O5J28k9j42O2J30o8j47N4J62r8j28Q1R7m8j46M8J34p4j11R7J24
$$ 116 60 -94 -29 99 70 -72 -10 120 52 -95 -41 121 23 -105 -24 73 25 -121 -73 61 -13 -124 -27 97
2144I7j03r6R4J15j07p8J28P9j08r0Q6J22j16q6J06P8j09j09J51N6j43p5J39O1
$$ 97 -6 -102 -8 107 0 -78 50 129 21 -69 17 139 23 -63 43 121 12 -97 54 110 -33 -108 31 92
2168I2j59l1J36L6j67k1J38K9j40J1R8N1r7m6J53mj45K9J24mj41K9J67l9j51P
$$ 92 -67 -98 38 74 -93 -114 24 53 -87 -76 22 73 -24 -70 83 79 -66 -37 87 83 -58 -29 138 99 -52 -45
2194d5J23k1j23L9J40n2j49L5J32o8j05M3R7l1j18N4J48r2j11O3J20q2q8Q2J03
$$ -45 78 57 -66 -27 113 61 -88 -53 79 11 -94 -51 46 15 -103 -49 99 7 -104 -41 79 -3 -91 -9 94
2219I4j02q6Q9J22j13r3J11R2j18q5J11Q5j43o3J25P0j32n8J05N6j19n1J28L3
$$ 94 -8 -94 -5 117 4 -89 22 114 -4 -89 22 107 -36 -99 26 96 -36 -94 11 67 -52 -103 25 58
2243E8r4o7J53M9j46l6J48L0j58%J33lr2k6Q0L9j17k4J40rj36QJ22j7j43K2J64
$$ 58 -36 -103 50 99 -47 -83 65 95 -63 -63 70 67 -25 -51 29 68 -49 -73 67 58 -78 -70 52 35 -108 -86 78
2270G8n4j24N4J18l9j21N6J19n5j10N2J25l8j24N5J24r0r5O6J01n6j26P9J17q8
$$ 78 24 -100 -46 72 33 -88 -32 87 32 -78 -26 99 61 -63 -8 116 26 -69 -3 98 42 -84 -5 112 24
2295B4r5P8M9q6o9L8J27q2p8O9J16j29n1J07M4j00m0J07P7j19q1J25Q2j32n8J12
$$ 24 -71 7 56 -30 -99 -61 66 -16 -94 -25 91 -38 -89 18 62 -38 -78 29 106 -13 -94 31 113 -19 -77 35
2321C5O6r9n4J27J3j16m3J14L9j27l6J29Qj15j1J12mj25K3J06j5p4lJ23j7j24
$$ 35 101 2 -52 75 88 -28 -71 43 82 -45 -81 48 56 -59 -70 42 38 -87 -64 42 27 -47 -50 73 56 -68
2347f8K9R1j7q9K3J15m1q2J6J12n1r5M5O9o7p2N2R8l3j21O4J05o9r2P7J00j03
$$ -68 -39 52 35 -54 -31 84 43 -39 -23 89 38 -57 -12 57 -10 -82 -30 68 35 -86 -22 83 14 -78 -1 99 -4
2374dr2Q5Q9p4n4O4P6j04p1J15O7r0q4Q2O7q3p8P1Q3r4o6J07O3j15m3J18Rp0m8
$$ -4 -96 -11 78 4 -50 14 90 -14 -85 30 97 7 -77 5 72 -11 -89 -18 65 -29 -95 12 75 -40 -83 35 44 -26 -74
2403g4R0K0p7j9J11M3j19jP6L5j19nJ06J0j06j3R5j3j03K2J21n1p9%Q0j1j07L2
$$ -74 16 36 -41 -60 51 94 -25 -26 50 85 -34 -39 67 77 -29 -42 53 40 -63 -41 80 29 -50 -50 30 19 -88 -56
2431e6J25p2j08M6J23l2j00J4J33n4q8N3J12n1r2P4K6lq9O4O4p5q5R4N1n5p1O9
$$ -56 69 -3 -111 -65 58 26 -74 -60 73 19 -69 -16 96 45 -47 27 53 50 -39 25 89 14 -71 23 74 19 -52 17
2459A7N6r6o1J18K2q6n6R1M5p1p5J08L8r6k6R3L0r2j5R9K8j04%Q3K4j20oJ37l5
$$ 17 73 -23 -84 34 56 -30 -86 5 50 -21 -96 12 50 -46 -72 21 51 -41 -56 43 71 -33 -33 50 74 -46 -52 85 50
2488E0j03NJ00%j05QJ07k5j04oJ06J2j27J5J10Rj23M5J08m0p3J2J12o3o3L0Q6
$$ 50 -53 -48 52 52 -53 -45 62 37 -67 -73 33 45 -82 -67 43 52 -71 -26 82 42 -31 -19 93 30 -33 -3 83
2515H3m4r7N6P6o4q0M2Q6n7q7N7P6o3n9Q0N1n8o0J06M6j06m4R8M8j08m7J01O0
$$ 83 39 -58 -2 74 10 -70 -28 58 1 -86 -29 47 -16 -75 5 56 -2 -62 44 90 -16 -60 38 86 -22 -69 32 92
2543I2j13m0J06N3j13m8R0M1j21j9J05J9j03j0Q0Mj10j4J17Nq3l0J12K1r8qJ18
$$ 92 -21 -61 45 98 -15 -63 27 68 -53 -72 33 52 -51 -61 19 23 -87 -101 16 21 -62 -92 20 41 -57 -65 53
2570E3J3j31J2J32l4p8J7Q4m2q2M5J04m4j01K2R8m4j15Q2M9n2p2P3P2r9o5M8Q7
$$ 53 66 -65 -53 79 45 -33 -16 68 26 -56 -11 93 49 -52 -30 68 24 -91 -9 40 -12 -84 -11 61 -38 -103 -55 32
2598C2j9r3M7P8n2p4P0J04r4j01J15R4r6r1J09N0j17JL9O0p6p9J14K2p9l8Q1N9
$$ 32 13 -80 -33 45 -7 -81 -11 93 -1 -102 13 107 11 -80 29 79 -38 -37 2 62 -14 -93 21 43 -36 -74 7 66
2626F6o1p0R1L9r8k3Q9J9p2l4J15Jo9k7P0L4j20j3J24k2p0j6Q1%o9j0O6Rq9J9
$$ 66 5 -65 26 65 -33 -56 33 52 -20 -54 61 62 -7 -34 36 70 -50 -63 61 39 -31 -47 34 34 -35 -45 21 30 -59 -40
2656d0Q7l9q4K6J15m6q5J4J27n5q5P6P8l7j10N5Q7o4o6L9N5l2q9O0P7m0o8K7N8
$$ -40 47 8 -76 -50 65 19 -66 -52 75 20 -65 11 89 52 -58 -3 84 20 -46 -7 48 16 -73 -13 64 24 -44 -17 41
2685D1m8p2M8Q5r2m1N6R4r9n4Q8M8n8m2M3N7p8j7J05J8p2n4Q3K4o2k5O7K0p8k7
$$ 41 -7 -79 -31 54 -38 -79 -23 71 -28 -82 6 54 -4 -46 -3 54 -24 -41 64 82 10 -44 39 63 1 -24 43 63 -15 -42
2715d2R6j3j10MJ12K0j45K7J21o0p2RJ08m2q6M2Q9l9n1J7P3m6n7J6J12p3q0N4
$$ -42 54 41 -69 -65 47 67 -78 -51 70 10 -62 -53 55 13 -73 -31 58 19 -32 -15 58 12 -45 -29 83 10 -70 -16
2743a6O4jr1K7Q2l9o9L8L2Mq2K7R4n1q5Q6N2q0l8M9M6p7oK3N2o3j7O6M9r0l6P7
$$ -16 48 47 -44 -17 65 26 -43 -5 27 31 -51 -24 70 19 -66 20 72 -8 -46 3 49 -28 -34 -11 41 -22 -39 27 76 -14 -50 27
2775B7N1j06n0J00Qn5l8Q4K6q7k6R2K7p4l0Q1J9j00KJ01J7j14J7R0Nj15M0O4k4
$$ 27 78 -28 -78 22 30 -25 -63 21 47 -40 -66 26 53 -21 -51 30 49 -51 -49 52 69 -45 -28 62 67 -48 -8 56 32
2804C2o5K6P0l4r6K4Q7l2p3J8N5l2p3N3N8Pp9L2M5k1m7K4N3l1l7O2M7n6n7M6P4
$$ 32 -33 -7 63 29 -67 -43 44 12 -61 -43 12 -20 -93 -40 18 25 -54 -22 23 2 -45 -21 32 1 -36 26 73 17 -40 6 80
2835H0o2o2N2O0p4m5O5O5o9n0P4J8p2l6P0L3q1m8O5P0r7l0Q6L4r4JO1M0j07J6
$$ 80 18 -44 8 68 -6 -51 14 79 10 -40 34 52 -20 -56 14 47 -34 -82 -17 53 -44 -74 12 46 -48 -47 14 54 -53 -37
2865c7O0J1p0K7N1lp8lJ19qp5k1P3k0r0lQ9L1j02qJ16l6n8J5O0op0L9L9k0p2J
$$ -37 23 34 -36 -9 42 39 -39 -42 77 69 -6 -27 46 26 -64 -67 22 53 -49 -57 59 23 -35 -20 40 34 -36 3 42 22 -50 -49
2897d9J09l4n8L1N5l8o3O1L9o0m9K5P4r0pM0L6l5o2P3O4o0n1O3N4r8JN5L6n1l2
$$ -49 60 26 -32 -1 54 16 -47 14 53 -7 -56 -31 43 -47 -54 -14 22 -13 -75 -2 62 2 -49 14 68 -30 -29 26 62 11 -21
2928b1O3j0l8k8N4M8p5k9M8K6m7n3O3K7o7k0P0ll6n8J13k9m5QP2Nr0J0P2J3p4
$$ -21 42 32 -6 -34 20 68 -7 -36 12 38 -9 -62 1 28 -39 -59 11 8 -28 -86 27 -2 -47 -39 33 38 -52 -42 30 43 -31
2959c1K9O4k7p8M8N8l9m8L9N1k6p4K0O5k8o0QQ5n4l4NO2n0l4kJ01n8m3L6O0l4
$$ -31 -2 62 35 -43 5 63 24 -24 15 66 40 -34 -14 51 23 -37 -29 56 2 -32 -27 35 -15 -49 -51 50 -8 -51 -15 45 11
2990A1o6O1K3m7o4J32qk9l1M2mMo2M3N3n8n4O0N1q4nL4M4o8j4M2ql4MO0J0o4l1
$$ 11 -55 6 29 -18 -82 50 42 13 -18 24 20 24 -38 5 58 0 -54 6 57 -27 -32 2 46 -22 -36 6 -2 -36 -32 28 38 -26 -57
3023e7R3j3n5mO8Jo4K4RL4p3OO5ko6%O3k8k1K1M0k2m1J8K2%p6L7M5jm7%R1o6m0
$$ -57 36 23 -32 -36 32 33 -31 -7 2 36 -37 -31 34 32 -34 -34 29 1 -20 1 41 19 -22 -4 18 18 -58 -21 24 23 -24 -24 67 1 -39
3058c9M3N4l2n0L2M6m1o7M6O1o1k3J5L9m6n5P9M1q4m0Q1M4q2rO3M1o6m7Q0L3n1
$$ -39 4 58 26 -24 8 54 13 -54 -8 53 -8 -31 -16 23 -23 -78 1 42 -42 -82 -1 43 -39 -48 15 56 -10 -57 23 56 5
3089Ej3K8M3p1j2N8O2r8n1Q9j5n5RP4%r5j5O4om4mN6K2q4L2O0l9n7J6P5on4J3
$$ 5 -8 20 63 -8 -20 38 100 2 -49 40 25 -30 -21 53 53 -42 -57 7 1 -43 -47 9 31 -53 -21 39 0 -57 -41 34 28 -26 -13
3122a3O6k8p4K3Q2l0n0J2O0m9m7L5P6l5j03N7N3l8m7M6O6m8o9L8M5j8n7L7M5j4
$$ -13 53 25 -49 -26 56 26 -24 -12 48 -1 -48 -13 63 28 -75 -18 35 -3 -50 -4 62 14 -55 -17 28 10 -47 -10 35 21
3152B1n3J9Q1o8m9N7M1r6K0L7J5m8j7N5K5n3n7P6J3m3j8P8%n8l5R2km8lN2nn2
$$ 21 -32 -13 68 0 -49 8 49 -47 -27 10 25 -23 -40 15 40 -13 -70 6 19 -24 -42 36 36 -22 -57 35 33 -15 -18 34 29 -23
3184b3j1P5Rp3K1L5J3n6l6O8j7n4RN9l7l9J5M2J4n0J3J8J4n4M1L8k3n2L0O4l5
$$ -23 -34 41 50 -23 -2 33 46 -10 -46 22 5 -49 -40 19 -18 -57 -42 0 14 -36 -23 -5 9 -45 -4 34 11 -41 -11 53 18
3215A8m0O4qj1p4M0N6m8m7K9O4k5o0O7K3m6m5N6J7m5l8N7K5p0j6M4K1n3j9N8K4
$$ 18 -22 42 34 23 -51 -11 45 -3 -50 -21 43 18 -42 25 48 2 -43 13 30 -15 -53 4 29 -41 -57 -13 8 -45 -64 -6 18
3246A8m3j3M2M4o5n0R4Pm1l6Q5lo2J0N4Mq5K0L9k4o0M1O7m5j5j1K8L7j06M4M3
$$ 18 -25 -38 4 48 -17 -67 27 34 -7 -43 42 39 -23 -13 41 45 -40 -20 19 -5 -65 -24 43 -2 -17 -28 0 37 -69 -25 18
3277A8Ko0J9O8n4m1K0P1m9l4L0L6jo4M8L0l4n0K9N7l7n7O0L9m9k3PO4o3k0N2K1
$$ 18 20 -40 -21 47 -7 -48 -28 43 -6 -40 -10 26 25 -39 9 39 5 -45 -16 41 4 -53 7 46 -3 -26 -19 45 -18 -38 14 35
3309C5l2l6Q4Kn8k1N9J4o4J4J7K1n6k5M7M7m8l5L2J9o0OM5j1k2qO2Jn2j5P3l2
$$ 35 3 -33 51 53 -5 -26 33 47 -17 -3 14 35 -21 -46 1 48 0 -35 -3 16 -44 -38 7 -4 -26 -34 28 29 -23 -38 35 3
3341Co0L8K8jm2L2L6Nn1pN9k3n4L0N5l0m2K4K3%p8M0L5k6o9M3M8m3m1K9P4p1j8
$$ 3 -57 -19 9 8 -34 -2 34 39 -12 -19 40 17 -37 -7 48 18 -24 0 23 23 -55 -15 20 -6 -75 -32 16 -27 -68 -39 35 -36 -54
3374e4O3L7p1jL6O2m7o8L2M7m2l1L7O3o0o5Q1K4o1l5O1%k4j8M9K7o1l1M1L8m4
$$ -54 9 46 -25 -26 10 72 25 -43 -11 36 -6 -37 0 63 3 -62 19 43 -18 -53 8 8 -16 -34 15 42 -19 -50 -9 29 -15
3405a5l3O1qk9J2L4j1k2m3P8j4j7j6N8j0n1RM3K2o9j8M8ol7K8M0m6l8L5M7km4
$$ -15 -48 13 5 -24 -12 22 11 -11 -54 24 10 -7 -23 35 25 -26 -17 26 48 -21 -39 9 3 -34 -6 34 -12 -50 -15 32 30 -14
3437a4RN3Jn0LK8Nq5K9P3k3m6k1P9m1rKM5n0m3O5mk4n5P2K2m4k2L4M7l1l9N4M2
$$ -14 -5 48 49 -1 2 30 35 -50 -21 52 29 -17 -38 41 0 -9 -7 38 -12 -55 10 6 -18 -73 -1 21 -23 -45 -11 36 5 -34 20 62
3471F2p8j6L9L7m3pK2K3n8J2M0kl7kK1J1m4j4P6k1n3j8N7jm3K6K5Jp4L7M2Mn1
$$ 62 -16 -32 7 44 1 -6 16 39 -19 -7 33 31 -6 -8 13 24 -20 -34 42 21 -32 -50 7 6 -37 -11 14 15 -59 -22 20 24 -27
3504b7ON3l1m4N2J8Qo1K7N0j3n7M5Lk9m4K9M8k7k8J5N8p2kL1M1n2o1L2M2k0m6
$$ -27 -21 32 1 -43 9 27 35 -26 1 51 38 -19 26 29 0 -44 -15 33 6 -22 -7 51 -21 -23 8 49 -3 -64 -32 10 -10 -56
3536e6N6M3n4m6P1J7m6l0L4N2n6nL1N5p6pL6Om0k1O3k6k3j7L8K2o0qO0K2n2OJ5
$$ -56 0 43 -11 -57 14 31 -15 -45 -11 41 -15 -20 11 66 -10 -17 19 25 -15 -36 27 1 -22 -39 -1 21 -39 -47 13 35 -17 -11 4
3569DK8l4n6O7K1o5LN6K0p4K6L1k9l8J8L3pl5OO5k4m8K5J8j1n0K0N4k2l1M1J6
$$ 4 32 -2 -58 9 30 -35 -32 24 44 -30 -4 27 -2 -40 -22 11 4 -31 -25 40 16 -32 -7 11 0 -50 -30 24 2 -29 12 28
3601B8j7l1J8L6k6l4L7M9o3j3J1M8l5n9N0M5p1KK6L9n8n6P5L9r2K1K1K2l3JK0
$$ 28 11 -20 -2 34 8 -26 11 60 -3 -16 -5 43 8 -51 -1 44 -27 -25 1 40 -18 -74 1 40 -52 -31 -10 12 -21 -20 0
3632@K1n0k1K8M4m5LM1ll4nM1L5p4J2L1J0o2J9M2j0k9j0K9No8PN9j6o9N4M9m2
$$ 0 21 -29 -50 -22 22 -23 -20 21 18 -16 -21 20 55 -19 -7 24 34 -28 -9 33 23 -6 -16 13 18 -50 -43 16 0 -69 -15 34 -8
3665hl5K1L8qm4L3N1m7k7J0N8j4n6K9K6j0p1O4M0m7l8K8L7m6k0L0K7m0J1M6nm
$$ -8 -43 -22 16 8 -36 -3 48 1 -26 -16 42 28 -28 1 27 17 -54 10 50 3 -35 -7 30 -16 -36 -6 21 -19 -8 38 33 29
3697B9l6L1J0j0k3QJ0l8j3N5J2j5o6Q5j8l1j9K3J2o1%N2J5n4j2N7K2l1m0L5M1
$$ 29 -7 24 34 24 1 9 19 -19 -32 23 35 20 -46 39 21 -10 -29 -6 6 -55 -55 -3 12 -42 -54 3 25 -6 -46 -11 30
3728C0n4J2L1J5q7L3P7l9l9K6J0K8o4NN4j7n2J2K5Ln8J4N8no6J4L7l4l3L1M7l6
$$ 30 -24 -12 19 34 -53 -20 57 18 -21 5 15 43 -21 -16 38 21 -31 -19 6 9 -49 -35 23 18 -48 -34 3 -31 -64 -33 14 -22
3760b2j9M1QKn2J5R0p8pJ3L7k8J4k1M7j9n0M7K2l1n1N3J1rm2L0J8n0j0N8lm6L6
$$ -22 -41 0 8 10 -42 -27 63 -15 -22 -9 28 0 14 -7 40 21 -29 18 40 9 -42 11 22 13 -29 1 19 -31 -41 17 14 -32 4
3793DJ0j7k6pK8K7l6LK3l1poN5nn2K1J6Ol0KM3%n3j3J02n9k5J5M6k1m6J4M3j5
$$ 4 14 -3 -29 -36 -8 19 -17 -14 9 -22 -29 -35 20 15 -37 -16 0 6 -24 -22 21 21 -32 -45 57 -2 -27 -12 34 13 -33 -19 24 9
3827In5M8N9m7j9nM5l6k9K0M3l4j9%O6p8mK9Kqj8K4L5m0m4L8O0p7j2L5J8j0k9
$$ 9 -46 2 61 14 -5 -10 35 -1 -30 -10 33 -1 -20 -20 46 -32 -36 -7 -5 -13 -31 -7 28 -12 -56 -18 42 -35 -47 -12 6 -4 -33
3860c3N1K2m7j0L3J0l6j3K3K3k7pO8l7p4L2L1Mo0K4L0rl2ML0J0l9ML5J4l1K1j0
$$ -33 18 40 -7 -17 16 26 -10 -23 0 23 -4 -11 57 20 -54 -22 9 13 -47 -23 7 -2 -34 -30 0 10 -29 -25 10 24 -7 14 4
3893DOl8J8J3Mj8lO5k6l0J1K9pr0P0L7o2k0K7N8m0m4M0L1l0k8M3k5J2njL7m8j7
$$ 4 10 -28 -10 3 7 -11 -14 51 25 -5 6 35 28 -62 8 45 -17 -37 -10 48 8 -36 4 35 5 -23 20 -5 7 2 1 38 -10 -27
3927b7L1M6o7Kj6O2l0qL0J1m7j4L7J7m0J0J6J3l3k6K9L5m1RJL6n2NJ5Nj4m8Q3
$$ -27 4 50 -17 -15 -31 31 1 -7 23 34 -13 -27 10 27 -13 -3 13 26 -7 -33 -4 31 -10 -1 0 36 -16 -11 4 9 -5 -53 30
3960C0J0l2k9J5Rk4MLJ3l0L9%Np5M2M2j2n2K5M4no2J7N8l1j8KL9k8k7L4L8m7l3
$$ 30 40 8 -21 -6 3 -21 -17 -14 -1 -31 8 8 13 -62 -20 22 10 -42 -17 27 22 -40 -23 35 4 -14 -12 27 -1 -28 6 44 -3 -36
3994c6M9N3m9n4L5L7m8J0K9l2%jPJ6k1l9K1M8n8j0M4J5m9j3M4Ol7J2J5J6k1NK7
$$ -36 13 66 17 -37 -2 35 -13 -3 26 -6 -6 -7 0 16 -5 -44 -23 25 -33 -43 1 16 -33 -46 -2 4 -33 -21 -6 10 -11 -6 21
4027B1Pk2J2K1J1m4m1P0k5l3J6J2Rl7J3L6Ln4J4K0nk8K3K7mm8NK6k6j3M5%j8l2
$$ 21 28 6 18 39 50 6 -35 35 10 -23 -7 5 14 -23 -10 26 29 -25 -11 9 4 -24 -1 26 22 -26 -21 5 -21 -34 11 11 -7 -39
4061c9N0j5roJ5K2k1l9M9J5k8oMM0k6m3L2L2l1k0M5K0l8k7M2j1J7n5M7J3l6rJ2
$$ -39 11 -4 -13 -19 -4 18 -3 -42 7 22 -6 -12 -8 32 6 -37 -5 27 -4 -24 21 41 3 -24 18 7 24 -31 16 29 -7 -16 -4
4094dK3m4qN0Ml1k3M9j3j0k9M7J5p1jO8j7k0j1M4k5L1j9K0K1j01O0L1j9rMOL4
$$ -4 19 -25 -33 17 21 -10 -33 16 3 -7 -36 11 26 -45 -46 22 5 -15 -26 18 -7 24 5 25 46 -55 5 36 17 8 12 18 52
4127E2q2L5K7j3l5J0L7j0p8L6J4J9q0L3K6k4j7M3K9Kn7MO3j6k1nO4m6k9K5J8k3
$$ 52 -30 5 32 19 -16 -6 31 21 -57 -21 -7 12 -68 -35 -9 -33 -50 -7 22 24 -33 -29 34 18 -3 -8 56 10 -19 6 24 1
4159Ao%L3m0oO6k1m0rK7J3j0j6J8nk6J0J7nk0JK3j8j6j6N2J9k4lJ3j2k6J2J6R
$$ 1 -5 -5 28 -12 -18 48 27 -13 -22 5 18 8 -8 10 5 -21 -11 6 1 -19 -18 5 -13 -29 -45 7 26 2 -1 12 0 -26 -14 2 11
4194A1o4K4L9J1k1pL9k5j6j9O3j9k8J8lj2pJ2QJ4n1N1qj4pK0J2m1rK6K8k0k8R
$$ 11 -53 -29 10 21 0 -7 32 7 -9 -28 35 16 -12 6 3 -9 -16 -4 4 18 -33 18 10 -4 -11 9 21 -20 -29 -3 25 5 -23 -14
4228a4L1l5ljOPLpJ6k3mK3K9k8j9K4K3rm4N3kl6NJ0jk3PJ1L4n6J7J4nk8RK6j8
$$ -14 17 -18 -21 -22 -16 -9 -6 -13 3 -20 -24 -1 28 0 -19 5 28 19 -25 28 26 -10 -5 5 4 -19 -12 -1 33 -23 -6 8 3 -25 -16 10 -8
4265hjj1J6k1k0M3PJ0l9J3K9jo6K7L7j4l1j3N4K3l3k1M4k1QpL8l3l3OM0j4m1L0
$$ -8 -9 -20 -4 -25 -45 -2 5 15 -24 -11 18 17 -49 -22 15 1 -30 -43 11 34 1 -20 24 3 11 4 42 9 -24 -18 22 8 -33 -3
4299cJ3Ol4j5K6kj3J0K5om1L3pqj8K5J0rm0N1Rk3j6M0Nm6rL8L9q0L2K9j3j4k6
$$ -3 10 16 -18 -33 -7 -9 -22 -12 13 7 -34 -1 -8 -16 -34 -9 1 -8 -48 3 12 -11 -27 13 18 -28 -37 1 40 -40 -8 21 8 -6 -32
4334c2M9j0j6mL4j7k3jM9j4l5RL9l1nj4K5Jm9L7%mj1kK7Jl7K1K1j6j4RJ3k0jJ0
$$ -32 17 7 -9 -13 21 4 -19 -20 29 15 -20 -11 28 -3 -8 -22 3 4 -45 -8 -8 -12 -23 -25 2 3 -34 -13 8 -8 -22 -13 0 -20 -21 -11
4370a1K3%j7j0L9Ln4M1Pj4k2RL9m7mJ0J2rJK2kl2JK5Jm5j%L8k6j9M0k3K3j4Pm
$$ -11 12 12 -5 -15 24 27 -27 14 21 7 -15 -6 33 -14 -18 -8 4 -5 -4 18 16 -16 -15 10 11 -34 -35 -35 3 -23 -42 -2 -25 -2 -16 -9 -13
4407a3Oj1L2L6m1k2K7J0nm0M1Pnk0L3l5J3qoN%k0J9J7m4OK4jj4k0M6j9j9M1k6
$$ -13 -7 -18 14 50 9 -13 14 24 19 -21 20 27 22 2 35 0 13 5 -1 4 4 -16 3 20 -24 -18 6 5 -9 -29 17 -2 -21 20 -6
4442fjJ7qOPk8J3j2K4LlK3k0j9qL0kk5K6J6j6l2NL2j0l1K1J2Kl7K3OPk3L1J1m9
$$ -6 -7 10 2 8 15 -13 0 -12 12 15 12 35 15 -4 -12 18 16 -9 17 33 17 -15 -10 22 12 -19 2 14 16 -21 2 8 15 -8 23 34 -15
4479a5J0RK3n0rM2j8j6J9K3k5j9J4K2J9n1L5j6mk2K9J4Qn7RM1Qm3L3Oj3KJ9Rl1
$$ -15 -5 4 27 -23 -32 10 -8 -24 -5 18 -7 -26 -12 10 29 -22 13 -3 -7 -29 0 14 22 -35 -26 15 23 -20 13 19 6 8 27 36 5
4514Ek1RK2k5RJ3j1J4m1j1K0J8j7mK9j6k8O7j7l2j8M3j1kj0K0J0k0OmJ5Qj9RK6
$$ 5 -16 -7 15 -10 -1 12 1 15 -26 -37 -17 1 -16 -20 9 -7 -35 32 15 -17 -35 8 -3 -5 -15 5 15 -5 1 -3 12 20 1 10 36
4549C6m3%J3Rk5pK5qoj8M6mk6k4M5Jpl0L9qj6j3J8J6l4PK2J3l1K2j1j3J7k0K0
$$ 36 -7 -7 6 15 -10 -17 8 0 -6 -24 22 18 -8 -32 13 14 7 -23 16 8 -8 -21 -3 13 -21 -14 8 21 -10 12 1 -12 5 -15 5
4584EPl6J0L2J9n1OM1j3m9K7L9j3lj6J1j1l1J9Oj6nJ2L9n7M7j3J0k7OQK5l2Jk0
$$ 5 12 -24 -14 18 37 -14 -8 33 20 -29 -2 37 24 21 5 16 5 -26 -7 -1 -17 -22 -10 29 -28 19 6 16 -11 -5 3 28 -4 -3 -23
4619b3M6n7L1Pm%k9L1K3m2jJ4O4o9j4P6k3l7j6M0kj7l3M2K5n7K3J5J5l1k7L2k
$$ -23 23 -34 -3 4 0 0 -29 2 25 -17 -18 -4 60 -9 -23 53 30 -7 -23 17 15 -2 -35 7 32 -25 -2 13 28 -3 -30 2 0
4652@k2k8O4k1J5j9RmJ5mk3K4m0J7J4J2k0J5L0k4l9K5K0Pmk8L2j8jqK1%m3M4k2
$$ 0 -22 -50 14 -7 8 -11 -2 -6 9 5 -18 6 -34 -17 -3 9 -11 4 34 10 -29 -4 16 23 19 -9 23 5 4 -4 17 17 -26 18 -4
4687dj2k0L7J5j9o2P4Nk0Ql0MK4j9K7J6j1m3K5L1k6%J5j5k1J1J4J1k3KKK2j6J2
$$ -4 -16 -36 1 16 -3 -65 9 14 -6 2 -28 -24 0 -19 8 24 13 -30 -5 26 0 0 15 0 -21 -10 4 15 -8 -6 -4 18 2 14
4721A4k2K1kk6L2pj4l2L0j6J9k0P0m5k4qM0rk1RRMl6J3K7k1Kj3K2L0l5J8j2J1
$$ 14 -8 13 11 -15 17 10 -4 -36 -6 -22 -3 -23 47 2 -22 -30 10 1 -20 -11 -2 2 -34 -21 6 -15 -13 -26 -4 26 -9 9 -3 8
4755Hj8MJ2k7jmM0lk1J1Qpk5J8L1k9k6KM1pKk0J8K5j1mj4Mm9K7j9J3J2j3L1J7
$$ 8 -10 -6 6 -21 -22 -26 14 11 -10 1 9 2 -23 -5 26 -3 -29 -27 14 7 9 -11 7 32 21 17 3 7 -42 -15 -34 -21 -9 -22 9 26
4791B6k2j7J3j6pJ1L9l7oK4mJ1k7K7Rlj6J4oqk3K5j5j4%K8lj9J6j6OnqJ0Rk3M0
$$ 26 4 -13 0 -16 -23 -12 27 -10 -16 8 4 15 -12 15 24 21 5 19 13 5 -18 7 -8 -22 -22 6 3 -16 0 -16 -10 -15 -23 -13 -4 -27 13
4828A3j5j7NL2m9L1l6j0O0l5J4nMM7p1K2J6j0NnL3l8j4K8pmm2N7kk2K5j5l1K8
$$ 13 -2 -19 -14 18 -31 0 -36 -46 14 -21 -7 -12 -8 39 -32 -10 6 -4 1 -4 29 -9 -23 5 -2 -6 -48 9 7 -15 10 -5 -36 -8
4862hnLJ3j4qJ1L3j8k6L1Rl2j0K6Jpk1j3M1jk7OL9m0j2L7%k3K7J6Ml4Oj0L8j9
$$ -8 -13 -10 3 -11 -19 -8 25 7 -19 12 21 -11 -21 5 6 -1 -22 -35 6 5 -22 -16 23 -17 -29 8 8 -15 12 28 32 -2 4 -6 32 13
4898A3l4N0k2l9K0J3k1LK6pQl0j0J9J2Kj9M2m1QJ4L0n8J3J9j8LMomJ6j7K7kk0
$$ 13 -21 29 7 -32 -12 1 -20 -17 9 2 10 -20 -30 -11 1 3 -16 26 -15 -7 7 37 -21 -8 11 -7 -4 0 -6 -10 6 -11 16 14 -6
4933fNNMpnQ%j4K2J6j1j6j6K8k9lj3J4J9mj4J2Qj2oj0J7j0RoK1l1OL0rjj0L0J2
$$ -6 -1 4 8 1 -4 4 4 -10 12 28 17 1 -15 13 -16 -19 -32 -18 1 -3 -17 -5 3 -9 -15 -25 -8 -18 -9 -15 6 -25 -19 11 2 1 -9 21 33
4972C3k6j9L4mk6j6N4k6Lj7K1j0k3RJ7j4JqJ9Qj2rJ7j2j7K5JNk1J0Nj8j7J2L1
$$ 33 7 -12 22 18 -8 -24 30 4 7 -10 11 1 -22 -13 4 -10 -9 -17 2 10 -2 -11 6 -6 -23 2 3 8 -13 -3 2 -16 -33 -21 10
5007A0Ql3K5j3kk9L2J7po%K1j5nPQj6J8j2kpj0K5m6L9k3J9pj7j4J8MmQk0J3om
$$ 10 18 -15 10 -3 -5 -34 -2 15 8 2 2 23 8 3 10 18 2 20 8 6 -1 -11 14 -32 7 -16 3 -4 -21 -35 -17 -13 -17 -9 -29 -16 -22 -26
5045b6JM5k7j3J9Nk8oO0ok9j2J5J1k1K1K6j1ol2J2J0OKpkJ1j3K5n8J8Lj5J7Kn
$$ -26 -25 20 -7 -20 -1 4 -24 -30 30 24 -5 -17 -2 9 -12 9 35 24 18 -14 -2 8 14 16 9 7 18 5 30 -28 -10 -7 -22 -5 -3 -8
5081hLJ7Kl8J4K1n6K7N3k5j4K1rJ7k8PJ2l8KMJ3K4rj4K4Qm1N0k4qJ9l7K7l5oM1
$$ -8 -5 12 14 -24 -10 11 -45 -18 35 10 -4 17 8 25 -3 4 16 -22 -20 -16 -3 21 12 -2 22 30 -11 39 15 7 26 -11 16 -19 -25 16
5117A6k4j5JM8l9J4j0J8Jl1J7NJ3l0rJ6L7n6K8Ol2L7j3j6PJ7QK2l0k9J4L1j1p
$$ 16 -8 -23 -22 26 -13 1 -9 9 10 -21 -4 1 14 -16 -25 -9 28 -28 0 6 -26 11 -2 -18 -11 6 14 36 6 -23 -9 22 11 4
5151DL0k2j4qJ8K3m2j8M3j1NLk4qQK1j8lj2l3N0KJ2k2J8KkLj5J8Nk3PMqJ2J9j4
$$ 4 34 12 -2 -10 8 31 -11 -29 14 3 8 11 -13 -21 -13 8 -10 -13 -25 -58 -8 -6 6 -16 2 4 2 5 -10 8 13 -10 -3 1 -7 5 24 10
5189A0j6K1%Qj0j4k2L5k8K8lrrlj8N6k5qK5k6k1J1K1Jk8K7j3J3qj5J5k0J6K9o
$$ 10 -6 15 15 23 13 -1 -23 12 -16 12 9 0 -9 -12 -30 26 1 -7 18 -8 -29 -18 3 4 -24 3 -10 3 -5 -20 -5 -25 -9 20 14
5224A4m5M7k%j7qJ7roJpJ6j6%K0L0%l6L4l1K2l8J6J3j4J0nLk3K4pJj4lJ8NJ1j8
$$ 14 -31 16 14 14 -3 -11 6 -3 -9 -8 -15 1 -15 -15 5 35 35 -1 33 2 24 -14 2 15 1 11 6 9 -14 10 3 4 -10 -13 5 10 21 3
5262CpJ4kr%J5lKLJ6m9K1MOoj6JJ1K2rj7LJ1m7N3MMm5lK3j8rK6J2n0K1J9l2Kj
$$ 3 -4 10 8 -1 -1 14 11 13 16 32 -17 4 8 14 8 -8 -7 4 26 17 0 3 14 -33 20 24 28 -17 -20 3 -15 -24 2 14 -36 -15 4 -28 -26 -27
5302b7J8MOK3j8j5LoK5lQJ3j8k6LJ6K2j8K3m0QJ2j5K4j7J5j1J2Ro1J0K0mj0K3
$$ -27 -9 -5 1 24 6 -9 -6 -12 13 10 18 31 13 -13 -10 6 28 10 33 -7 1 13 -2 22 5 20 9 21 30 -31 -21 -1 -5 -15 8
5337Hj3J9j5k0mJ3QjjK3n2N6j7J7rj5NJ8l3QJ0j9RJ7j1%k0OL2pNl7J8K1l2J0J7
$$ 8 -5 14 -1 -21 -25 -12 -4 -5 -6 17 -35 21 4 21 12 -3 2 20 -13 -5 5 -14 -5 12 1 1 -19 -13 19 12 17 -20 -2 19 -13 -3 14
5374A4m4L7j1J7j2j0rQL0j0l3JM1m4J5lL5l3pJ3k1pK5JLl3L9J3okQj3njm4M5M
$$ 14 -30 7 -4 13 1 -9 -18 -10 20 10 -23 -22 19 -25 -10 -13 22 -11 -18 -5 -26 -33 -8 -7 -4 -37 2 15 9 7 15 2 -3 -4 -48 -3 1
5411Ak6J1J3Okj0%J1ll6K7Lk6OL9l8NmM8l2J7j1J2pj4J8J8k4P%K5k3rJ6j1J7k5
$$ 1 -25 -14 -1 5 3 -7 -7 4 1 -35 -8 -5 -31 -25 14 -24 -19 -23 25 -7 10 -1 11 4 -10 8 26 2 9 9 34 11 2 18 7 24 -1
5448aJ8j1PJ4Nl0j2nL2ok9MJ9kj9kJ9J0m5pM5k3K7k1L7nk8K3j1Mj2JJ2j4J4k8
$$ -1 17 6 13 27 32 2 -10 -15 17 11 -18 -14 5 3 -16 -18 1 11 -34 -41 4 -19 8 -13 24 19 -9 14 3 7 -5 -4 8 -6 8 -20
5484b0K0J0Jj6pL3k8K4j3l2K7NOJ6k1k6J9J1jj6Qm2K1OqJ9j9J2J6k4lJ2q%K1r
$$ -20 0 10 11 -5 -12 21 -7 17 4 -28 -1 4 10 26 5 -21 -2 9 8 -8 0 -42 -21 -15 -23 -4 -23 -11 5 -19 -22 -10 -18 -18 3 -6
5520fJ0k4mK5K8m4J7J8j1Mj2K4Lk3k8M1l4K5j0MQMl4J0K0j3MmjKj0J5j2PrK0m8
$$ -6 4 -20 -24 1 29 -15 2 20 9 13 1 25 28 5 -23 18 -16 9 -1 3 11 15 -19 -9 11 -2 2 -2 -3 -1 -11 4 -8 -1 -10 10 -38
5557c8J4nN9k2l8J5Qj6M0j6j9L7n6P3k6K4l6K2k1j5M0l4K8ol9J5J2K5k9J6J7o2
$$ -38 -24 -29 30 8 -30 -15 -7 -23 17 1 -18 19 -37 36 10 34 -2 20 -1 -16 24 -10 18 12 -27 -12 0 25 -4 12 29 -33
5589c3L2j4MNJQpJPJ0k7J5Mk0j4J6K4k1Nk3L3J0kMk1K2j0NJ4l6J5omJ9Qk9J1J5
$$ -33 -1 -15 -11 -6 -5 3 -4 -3 4 14 -13 2 6 -14 -28 -12 12 -9 -4 -27 6 16 14 18 -3 19 9 14 28 -8 7 1 -3 16 24 -5 6 21
5627B1l9J6J1j0K8l4J6j7j3J4Mk4J0J3J3k2J4j6k3N3j6Qj0Mj2j4K7lj9PlK2m1
$$ 21 -18 -2 9 -1 27 -7 9 -8 -21 -7 -3 -27 -17 -4 9 -13 1 -15 -38 15 -1 7 -3 1 -11 -25 2 -1 -20 -13 -16 6 -35
5660c5N6k3lNjLJ4kj6QMm1K0J9Ork0K7k7rRL0l3rL3k8RL0m0J3OnRKpkN5m3Mj4
$$ -35 21 -2 -5 0 -1 2 16 14 -2 6 10 -31 -11 8 14 5 -15 12 -15 -24 -15 15 -18 -27 6 -22 -13 17 -23 -10 -4 -9 0 2 -5 -7 48 5 9 -5
5700ej8K7NKnj1J1j3JJ1j8L0j5j1Mj0K4%oj7L5k1qj0J7jJ8l1J0orj0L0Rk3L5R
$$ -5 -23 4 9 11 6 -5 6 -7 -6 5 -13 17 2 -9 -5 -15 9 9 3 -14 21 0 -8 -18 -1 -2 16 -15 -5 -11 -20 -30 0 9 -14 21 30
5737C0l0QOj8j1Qj9%K8K2Nj7nknJ2j1lOJ0j3Pj7QJ6j9oJ4lLj3JOk8K5kJ7m0J6
$$ 30 0 8 14 -4 -15 -7 -26 -26 2 24 29 12 7 5 0 12 1 -2 4 14 1 8 -9 -1 15 -4 -10 4 1 4 -9 -8 -2 -30 -5 -7 10 -30 -14
5776a4NJ1jMK7m0NmL8l1j3KOj5L5nmqj1KQQk6Pk1J0L3qJj5LMlj%J8Qj8J0POm9
$$ -14 -9 2 1 5 32 -8 -3 -7 31 0 -13 -11 -5 -20 15 10 6 -2 -13 -11 -3 5 -21 -14 -35 -25 8 0 1 -14 -11 -7 -10 -11 -11 7 15 -3 7 14 20 -29
5818b9L2k7OqL7lj4M9l3ooNl5O1j7Jk6K9l0NjK6Mk0j4J1Pj5Jj3K0j6J4nLJ5l8
$$ -29 3 -24 -18 -26 11 8 -6 43 10 4 -2 3 -32 29 12 13 -13 16 -14 -9 -10 16 20 0 -14 -3 4 -11 -10 -23 -3 -19 -5 -10 -7 8 -30
5855c0L3j2J5k7L5m6J0J4MK3j9kL2m2M4n3nPK3J5oJ1l2J6J1k6j0J0KJ2j2K5Jj6
$$ -30 3 -9 6 -21 14 -32 -22 -8 -4 19 0 -2 30 -12 32 -21 -26 -19 4 19 13 24 -8 8 19 -7 -17 -7 -5 7 -5 20 21 5
5889El0K9kj1jPj7nNM3k3Rm1J1J9J5KnnJ8j4K3j6j8j4J5pK2k5J9l3K8J0k6RQj4
$$ 5 -25 4 2 -9 -10 -3 -20 -25 -20 23 0 9 -32 -21 -2 13 15 10 5 23 9 32 16 -2 -16 -1 -8 14 -11 8 -25 3 13 -13 -4 4 -10
5926a0K7m7N4j4qPj1lJ5k1L3pLj9l7L2J4j5k3L2j9J6k4K2j2J3K1k1J3l5N5k5n
$$ -10 17 -30 24 10 2 9 -2 -5 10 -11 22 15 18 -1 -38 -6 8 -7 -30 2 -17 -1 -25 -3 -15 -2 19 -2 11 -24 31 6 1
5959AJpOQm2K7J7kj4oK2j5K3k9m1L4RNk1J1L8o7N1j9j0J2Oo%qM4j6n0L8k0RJ6
$$ 1 2 -5 1 9 -33 -6 11 9 -5 -11 11 -4 19 -10 -51 -17 -8 -3 -24 -13 25 -42 9 -10 -20 -8 -2 -8 -8 -16 28 12 -38 0 -20 -11 5
5996Ek3M3l5J2J1Kkk5L3rRk3Kj6J4j8L3m0Qj1L1k4RJ5k4K5l5J8j2L4k3%L1k3J9
$$ 5 -18 25 -10 2 13 15 13 -12 21 12 21 -2 0 -16 -2 -20 13 -27 -19 -30 1 -23 -14 1 -23 2 -33 -15 -27 7 -16 -16 15 -8 11
6031A1nj3K6j7J2J0k1j1KJ9j1Qk8JK0j3%nL5J6n0J9j4j3K3J2j9nNJNm1K6Lj0j2
$$ 11 6 -7 19 2 14 24 3 -8 -6 13 2 10 -18 -17 3 -10 -10 -15 20 36 -14 5 -9 -22 1 13 -6 -11 -6 -5 0 -41 -15 -12 -22 -34
6067c4L0LRj8J5k3J4mL6j4Ll0J6K4Ml3RJ2om1K8Rnk5K5J8k7JLK2pl5J0RK1l0P
$$ -34 -4 -1 8 -10 5 -18 -4 -8 28 14 17 -13 3 27 31 -2 7 19 13 -28 0 9 4 -21 4 22 -5 -4 -1 21 14 -21 -11 -2 19 -11 -4
6104dJ3k4Jj5J2l2M7j1M2l7lj1KJ4k0M5j4kJL2j2k1j4lM3k0j1j2K2k4RMjK2Pl2
$$ -4 9 -15 -14 -29 -17 -49 -2 -13 29 -8 -11 -22 -20 -6 -26 19 5 3 4 36 24 3 -11 -14 29 9 -2 -14 8 -16 -7 -3 -4 18 25 -7
6140gmLMqJ0%k4K4rrnK1K5%l3L2k8kOj8J5k0LJ8K9m3J4MJ5j4qkJ3qJ2J6ok0JK5
$$ -7 -11 -8 -4 -12 -2 -2 -26 -2 -11 -20 -25 -4 21 21 -12 20 -8 -10 -4 -22 -7 -27 -24 -6 23 -20 -6 -2 13 -1 -9 -11 2 -6 6 22 16 -4 -3 22
6180B2rj5Kj5J4k5L0Rl6J7k4L7k5mJ9JJ0j7QRj1PJ5%k5MK9k2m0O1nk6JL7k3j3
$$ 22 13 -2 0 -15 -1 -26 4 13 -23 -6 -30 7 -18 -22 -3 -2 8 -9 -1 8 -3 4 19 19 -6 -2 27 5 -35 26 21 -5 -4 33 10 -3
6216cK0l2N0k8nKJ2k2J7rK7j5o%l5K2k0K0jqk0J5RJ2qLJnNJ7l0K3k1NmqpJ9J7
$$ -3 17 -15 35 7 2 4 16 -6 11 2 29 14 8 8 -27 -5 -25 -5 -6 -14 -34 -19 -10 2 -6 -3 -2 -7 -2 15 -15 8 -13 -8 -12 -20 -27 -8 9
6255Irj0RJ0j6jK6l4K5KJ2Mk6j8M5j8j6J2j5J5Kj7K4jOm0K7k8K7j6K3k9NJ4j9
$$ 9 0 -10 -1 9 -7 -8 18 -16 9 11 23 27 1 -17 28 10 -6 6 -9 6 8 -9 15 14 20 -20 7 -21 6 -10 13 -16 -11 3 -16
6290a6K3j6J8mmMK8Pk2k6PmJJ6pQK2l8L1m0J2rJ2Nk3M3n7RqJ8K7j5nK1rrnJ2L
$$ -16 7 -9 9 5 1 5 33 40 18 -8 -1 -5 -4 12 5 13 35 -3 28 -12 0 -9 3 8 -15 28 -29 -20 -28 -10 17 2 -3 18 9 0 -5 7 10
6329A0j8j6J0oMJ4KrL4j0Kj0j1J8k6oK0J6pj9L7m6J2oL8j4l2L7j1pJjk5K5%kj7
$$ 10 -8 -24 -14 -20 -16 -2 0 -9 25 15 17 7 -4 14 -12 -18 2 18 11 -8 29 -17 -5 -11 27 13 -19 18 7 0 1 0 -25 0 0 -2 -19
6366a9RnNJ3KoRJjlk5L4j6KO%RqmoJ7J1Jj6mJ3k5%nL1k4J8mj7kM1l5Kj6QrK8j7
$$ -19 -10 -15 -10 3 5 -1 8 9 8 5 -20 14 -2 0 6 6 15 7 3 -3 14 25 26 10 6 19 -6 -6 -11 20 -4 14 10 -7 -9 32 -3 -1 -17 -9 -18 10 -7
6409gj2K2qJ9j5poRJ3k8K1%jRj9j6K8jJ6lj1J7kl6J2KNJ5koj8K1LJm0K3l2L1%
$$ -7 -19 3 -5 14 -1 -8 -14 -5 8 -20 1 1 0 9 -10 -26 2 1 17 14 3 20 18 -18 -6 -4 1 16 14 8 -10 11 14 15 -25 -2 -34 -3 -3
6448cm6M7jJ3l1L3k2mK1J1l9oK5JMl2K2LJ7Mj6Q%qlJ8j0mpPk3K1RrK9l8K1J0k5
$$ -3 -49 -2 -3 10 -21 12 -10 -14 7 18 -21 -27 -2 -1 3 -29 -7 -4 13 17 1 9 9 1 -2 16 6 2 -5 2 -21 0 9 0 29 -9 12 22 -3
6487cjOk2J6j8K9j2k0K0k2L0Rl4M5l3mJ0QJ4k3LjJ9%Nnk8L7Mk3Nj9J0J5%j9l%
$$ -3 -4 2 -20 -4 -22 7 -5 -25 -5 -27 3 12 -22 23 -10 -14 -4 4 18 -5 -2 -3 16 16 21 16 -12 25 29 6 11 -8 2 17 17 -2 -5 -5
6525eKLJ6l0K1rOprJ2KJ0rqj4J3j0NJ4k0J2Rk2K4l2L4j6KOJ9l0M0l2j1K9qj3l
$$ -5 -3 0 16 -14 7 -2 4 -3 -12 0 2 12 3 -5 -19 -6 -16 -11 3 -17 -5 4 -18 6 -26 8 -8 -6 0 19 -11 29 -3 -14 15 7 -6 -9
6563iJ6qpj5J5rL1rRk1QKLl9M1oQk2OMj1K7j2OlPLl2J0j1J7k0N6j3k4mK9j0qk
$$ -9 7 -1 -8 -23 -8 -17 14 5 14 -7 1 3 6 -33 8 2 10 -12 -6 -2 -13 14 2 8 5 12 15 -17 -7 -18 -1 -21 35 22 -2 -6 23 13 5 3
6603Cj8M8l6K9k0JRj3j2kK9k1j9L1rOl3J1J2Lj1NJ5j0Ll2M1k6J6RjK2m4K4%J2
$$ 3 -15 33 -3 26 6 7 16 3 -9 -11 18 -3 -22 9 0 6 -27 -16 -4 -1 -12 -7 8 -2 1 -31 10 -16 0 9 8 30 -14 10 10 22
6639B2j2Kk7J4%l0N8Pk4LrJKMpRJ6n4K8pOPk6J4Lj2K6j0j3J6rJ2j3Nk4M5m2K7
$$ 22 10 12 -15 -1 -1 -31 27 34 10 13 4 5 7 11 4 13 29 -25 3 -4 2 9 -17 -3 0 -12 14 4 -9 7 -2 10 -3 2 -22 23 -19 8
6677HLQm0KK7j5Jj2L9j3nl5N0J1l9lK9jj5qL2l0Mkj7K6J0Kkrl0PlQJ7oOj9QJ0
$$ 8 11 19 -21 -19 8 -7 -6 -18 21 8 3 -32 18 29 -10 -13 16 15 0 -8 24 -6 -2 -4 -21 5 15 17 15 6 -24 -17 -20 -12 5 -1 5 -14 -6 4
6717Dl9M0k7J3K5j6J5o%Rjk0Kpj9M3j6mL3l6Pkj8L2j0nRj4nk2K6oJ6nJnoOPJ8
$$ 4 -35 5 -22 -9 16 0 15 9 9 18 17 -3 -1 -8 -27 16 0 -4 29 -7 0 -2 -20 12 2 -3 6 -8 -13 -35 -9 -15 1 -4 -3 -8 -14 -8 -1 17
6757A7k4K7rj5lJ7k6J5Nj4JK6pMJ5j8m2K1K5k6K4k3MK6oNl7J1j4K4j2P%j3K3r
$$ 17 -7 20 11 -4 -7 10 -16 -1 4 -10 -9 17 10 14 29 11 -31 -10 15 -11 13 -10 -6 20 14 19 -18 -7 -21 3 -9 -2 -2 -15 8 -1
6793ajL3l1j0j2L5j2J6l0K3jJonpJJ1LQMj4Q%J7l9K8J2k2K8o7N3l0MJ6J0l5j5
$$ -1 -2 31 0 -10 -22 13 1 17 -13 10 9 10 4 -1 -8 -7 4 7 15 19 5 13 13 30 -9 19 31 9 37 -30 23 -7 -3 13 23 -12 -27
6830b7L9j4J2k2Oj0jQpK2j6k5K6J9j5%j9J7NJ9j6J8k2j5QRnK4J8m1Rk5N2j6k1
$$ -27 12 -2 10 -12 -6 -16 -17 -9 -16 6 -10 -35 -9 10 -5 -5 -24 -7 -2 17 1 19 -3 -18 -10 -1 -6 18 36 -5 4 -21 31 15 -6
6865fNK2j7jj4K3j1%k7K5J0J1jk2j3NOK1j5j4K3%J1qj0J2Nj3pjL1k8Mj0J7k2J2
$$ -6 -1 21 4 3 -11 12 1 1 -26 -1 9 20 19 -3 -16 -11 -5 16 1 -13 10 10 21 13 3 15 20 7 0 -1 30 2 6 -4 13 -9 3
6902Cj1J8klj8MK2k3PKl3O3n7L6l9K2K2m0L6j0j0nOJ8lPrKQk5J3mOJ5l1k1L4k3
$$ 3 -8 10 8 5 -13 -9 13 -10 -3 -1 -34 29 -28 8 -31 -9 13 -27 9 -1 -11 -16 -10 8 5 12 3 5 13 -12 1 -3 3 18 -13 -34 0 -23
6940b3L9Nl5K6k9J3Pj2M7k6k0jj0K0k0j1K9OJ7l6kJ6PPl5nlK2Pl3L1nL0j6LnJ
$$ -23 16 21 -14 12 -17 -4 3 -9 38 12 -8 -9 -19 1 -19 -30 -1 5 22 -14 -16 0 7 14 -21 -26 -29 -7 0 -33 -2 -7 23 7 10 5 6
6977Fj0j2NJ4Kj0J2Ok1mK9Mk8J8ok0J8K5j9Ql8qL0qj3LNK2J1l1pJ2kPj4rL3j9
$$ 6 -4 -16 -11 3 5 -5 7 13 -8 -12 17 21 -7 11 5 -15 3 28 9 17 -21 -29 1 -7 -20 -17 -12 10 21 -10 -17 -5 -7 0 -14 -23 10 -9
7015iJ6ok3L1ORkok4QNj1M0j8j7pL8k8j8K5Lmj3K2kMk1j4MJ0j0j1J1Mlj7J9j6
$$ -9 7 1 -22 9 15 24 22 16 -8 0 5 -6 34 16 -1 -8 30 2 -16 9 12 8 -5 17 15 19 -2 -16 -12 -2 -12 -23 -12 -8 -11 -28 -9 -25
7053b5j3K0OnJ8j5nNPk%j5M4k1JlKMqK7k9J0k3J6j8L4jk2J7qJ4k2J9k0J3mJ8k8
$$ -25 -38 -18 -12 -17 1 -14 -19 -14 -7 -9 -9 -24 20 -1 0 -3 -1 3 -5 22 -7 3 -20 -4 -22 12 11 -11 6 -2 12 -10 9 -11 2 -2 16 -12
7091a2%K6j3J1j4k1J9rKNJ8j9K0ll0K4mNj1J0J8jj4%j4J5qJ7jrj7OqLJ2j2kJ2
$$ -12 -12 14 1 12 -2 -23 -4 -13 -11 -6 12 -7 13 10 -20 4 0 5 -6 4 22 21 7 7 -7 8 0 17 16 7 -10 -4 -12 -9 3 -9 -11 1
7129Ajk4OkJ3J6k1j8J3K5j9jmJ4Rnj9lK1nOoJ6j1j0K1j7j5J0Qk4J3L7k7LK2k5
$$ 1 0 -24 -18 -20 -7 9 -12 -30 -17 8 -11 -12 -16 -2 7 2 -17 -20 1 -4 2 -4 12 1 -9 12 -5 -20 -10 -2 -26 -13 24 -3 0 22 -3
7166cj4j0J9%J9k9%J8K0l1LK%Lj7L0j3k0QK2Ml2kL3j4Qk9MJ9NJQLjk9mJ2j2J5
$$ -3 -17 -27 -8 -8 11 -18 -18 0 20 -11 -8 -6 -6 -3 -20 10 -3 -23 -15 7 11 -21 -23 10 -4 4 -25 -21 -2 3 4 12 15 14 -15 -19 -7 -19 -4
7205dMJ6j0J4k2J0Rk7J3Mk8RK0k9K3j9MJ7l3L0k9L7nk7K2pL0k3j9oK9Kk0J4J7
$$ -4 0 16 6 20 -2 8 17 -10 3 7 -21 -12 8 -21 2 -17 -13 4 -29 1 -28 9 4 -23 -1 -8 22 -1 -20 -26 3 5 -15 -1 16
7240A6j2J9nj5j0K8Kk7KRPMn1L6k0NoL0k9J8k5J5Lj5J6j1nJOMK4l1K1j5J6l7N4
$$ 16 4 23 18 3 -7 21 23 -4 -2 7 14 18 -33 3 -17 -12 -18 12 -17 1 -24 -9 -6 -21 -5 -16 -21 -20 -14 -10 14 -17 4 -11 5 -32 22
7277B2j7Lj2%J2Qoj5lJ0qJ0Oj7KJ0J4jl4jj8M2j0JJ1k6oJ3K0l3K1j2J2J4l4rJ8
$$ 22 5 8 -4 -4 8 16 10 -5 -8 2 -6 4 10 -7 -5 5 19 18 -16 -17 -35 7 -3 -2 9 -17 -23 -10 10 -23 -2 -14 -2 12 -22 -31 -13
7314a3kK9j0q%j7J1%K9k3nOJ0k0L8j5j6MK7l9J1jL5ln9kJ8%J0Ljlj8J6noK8Jl5
$$ -13 -15 14 4 -4 -4 -21 -10 -10 19 -4 -9 -3 7 -13 25 10 -6 -2 25 -14 -3 -4 31 28 -31 -33 -15 -15 -5 -2 -3 -6 -24 -8 -13 -19 9 10 -25
7353b5K3pOk4L0j1%K3l0L2k0J1Kk1J8J7k1j5JJ6J2k0qJ7pl4K2J9J6j3j4KMrJ3
$$ -25 -2 -9 -3 -27 3 -8 -8 15 -15 17 -3 8 10 -11 7 24 3 -12 -11 5 17 -3 -11 6 -1 -35 -13 6 22 9 -5 -3 1 -8 5
7388E%j8J9J7l7j0Pj4M6j5J5rPj7QKk5L3pjj8K4mJ0k3jk1L4M%J0pj5nKNk4KL5
$$ 5 5 -13 6 23 -14 -24 -17 -31 15 0 15 6 13 -4 4 6 -19 14 7 6 -12 12 8 18 -5 -6 -27 7 11 11 21 14 -1 -6 -4 1 -23 -21 14
7427A4j2j9Kj0M2j7j6OlJ4kj3M5j6l5PPoJ5k0M3pj2K4k8LOqQrPk2L2mk6J2J4l
$$ 14 2 -17 -15 -25 17 0 -16 -10 -13 1 -1 -14 31 15 -20 -13 -6 -12 3 -17 26 19 7 31 3 6 12 4 12 3 10 -12 20 16 -10 2 16 13
7465A3k3RJ7k9qL6k3Olj0K0ok8J2M2j6pJ5qJj1okJ0kK2j4l2L1%Qnj4LJ4JjOk4
$$ 13 -10 -1 16 -13 -21 15 -8 -2 -5 -15 5 -1 -29 -17 25 9 2 17 9 10 -1 -7 -9 1 -1 21 7 -25 6 6 14 9 -5 -2 12 13 12 18 -6
7504fJ3NJ4j0oJj6kqqPj3K7K6k1k9lM2j4j2J5j9mJ9j8K5nJ0k1J5PNj6QMmkPj6
$$ -6 7 12 26 16 10 11 -5 -7 -15 -23 -16 -29 -2 24 3 -26 -29 13 -1 -13 2 -17 -21 -2 -20 5 0 10 -11 4 11 16 0 8 12 8 6 13 -3
7543cRjJ3J1j5k5RPMk2J7l1M1m5J2M7n2M1k5J8m4L6j3K6j2j6J1JqNKQj7qK9k5
$$ -3 6 5 18 29 14 -11 -2 5 9 -13 4 -27 14 -31 -19 28 -24 17 -8 10 -34 2 -11 15 3 -13 -2 -1 -9 -4 -2 6 -11 -19 10 -15
7579a5M1j1j8K7l9K5k1K0l5K1L0j5k4J7lOK1l3K4pl2PK7lj9K1nj4NjmmJ8L6m7
$$ -15 26 15 -3 24 -15 10 -11 9 -26 -5 25 10 -14 3 0 6 27 -6 18 11 -21 -14 13 10 -9 12 7 -7 -2 -3 -7 -11 7 43 -4
7614dJ5l0K2rLJ9j4L0pm2J9J7j3Kl2N2k6QrKJ3l1K1kj7K2K8j3j5NkK4n7kK9k2
$$ -4 11 -19 3 -6 -3 16 2 32 25 -17 2 19 6 8 -24 28 2 10 1 3 16 -15 6 4 -13 9 37 24 9 14 12 36 -21 -23 6 -16
7650a6LK0mJ5l2RK3j9K7m9J9oNj6N7j4j2k0%qL7l4J6OrJ6k7QK6k6j0KqRK3Jok7
$$ -16 -13 7 3 18 -14 -5 18 -1 26 -23 -4 -10 -5 -21 36 22 10 -10 -10 -18 19 -15 1 7 -2 14 -13 -5 21 -5 -15 -13 -21 -12 11 12 6 -21
7688b1JL6k4MQRk2pL4k6kJ7j6K3l4K1Nrmk8L7J6opJ0k4j0j0K9OK0k3pPJJ4k6J1
$$ -21 -20 16 -8 -4 4 13 -9 -16 18 -8 -10 7 -9 14 -20 1 6 -3 -7 -35 2 18 12 5 15 -9 -19 -29 0 6 26 3 -4 3 4 18 -8 3
7726ClJ2k6J0J8pk4jPK8k9J3%l9L1J1mJ4q%J1k4J4j7QqK8k2J8Nj4lK9l8K1l4K
$$ 3 0 12 -14 -4 14 7 -17 -18 -11 17 -12 1 1 -38 -7 4 0 14 6 6 17 -7 7 -10 -2 -10 18 -4 14 19 5 2 31 -7 14 -20 -18
7763a8J8Njj2jj1J9k1J5j3Pk1L9lRj6j6L0k8K3rrM5k6L3l5m2P3m0ONpK1j6j7J5
$$ -18 0 5 4 -8 -9 -20 -1 -22 -7 -20 -13 -34 5 2 11 -5 -21 9 -19 4 -5 -14 31 5 38 3 -39 34 -6 0 5 -2 19 3 -14 1
7799AqnLL2j9KqK4k7JJ2j2J2qJ1Jjj3J2lj7k7J8L0l2N1l7J0k0J6RPj3J6j8Lk4
$$ 1 -7 -12 -9 23 4 6 -2 22 -5 -4 8 -4 8 0 11 12 11 -2 10 7 -10 -37 -19 11 -21 30 -7 3 -17 -1 8 15 2 18 0 3 -21
7836b1RL2j8jj8OK7rJ1k7J5kj8J1j9K3j6J5pJ3m2P1m4j9J8K8j7Qj0kkNllQk0J3
$$ -21 -12 20 2 1 -17 -11 16 7 18 -9 6 4 -14 -3 -22 1 -15 0 -7 6 -36 35 -9 -28 -10 18 1 9 -1 -3 -5 0 -3 -6 2 -18 -5
7873eJ9Qj7qJ7k1J4oJ5j9K1m6K7RJ9mk7jjRjJ1j7JK9k4rJ0jpoK0Qk4oJ5J3k9L0
$$ -5 14 22 5 -3 14 -7 7 1 16 -3 18 -28 -1 8 27 23 -4 -5 -6 3 2 13 -4 -3 26 2 -7 3 2 -5 -11 9 17 -7 -13 2 15 -14 16
7912A6j1J3%Km2M4k5JJ8k9K1k2J7J3qJ9l1J2mj1K1mJ9ml3K3pk1J1jkj8J8nJlK
$$ 16 5 18 18 20 -22 22 -3 -2 16 -13 8 -14 3 16 8 27 -4 8 4 -7 14 10 29 25 -8 15 8 -13 -2 -3 -5 -23 -5 -10 -9 -12 -10
7949a0OLQnnmJ1K4l1kL1Jj4J4m0M1j4k4J6J1%j2kk0J6MKlK2j4j9L5k5qLrJ4Lj8
$$ -10 -4 -1 7 2 -3 -7 4 28 -3 -5 26 27 13 27 -13 28 14 -10 6 17 17 5 3 -17 -1 3 5 2 24 10 -9 26 1 -7 -4 -13 1 4 -14
7988a4MK2j2j6K0lJ2j1J7lk9J5K1k4l0K8K3j3qJK1m1L5j7J4rK9l0K4k9ML4j8k0
$$ -14 -10 12 0 -16 4 1 13 2 19 16 -13 2 23 -1 -31 -3 20 7 -1 0 21 -20 15 -2 12 3 32 2 26 -3 1 35 17 -3
8022c%J6j0J7m4M6lnk4L1k0J0j3K3j2j7NK0j5lR%qoj0K9l5K5l5%N4k9NjK3nj8
$$ -3 -3 13 3 20 -24 22 19 14 -10 21 1 11 -2 21 9 -8 -3 17 2 -1 8 8 0 -6 -16 13 -22 3 -32 -32 22 -7 -2 -3 20 15 -3
8059cJrJ9Mm0M2PNk9Rl0oM8Kj4Mk3J0lL1j5Jmj7J3j5kOLj0K3j8K4k6%K3Ok2K9
$$ -3 -2 -11 8 12 -28 14 21 26 -3 6 -24 -30 18 20 6 10 -13 -3 -6 25 10 11 7 -10 3 -12 -14 -8 -5 -15 8 -10 14 -12 -12 11 17 -5 24
8098B4j6j1J4npLJ0Lj3kRj3pKJ3j5KmM6n8L6j5Pk2J9Jk3J4k1N2k4K6j6lKk8M0
$$ 24 8 -3 11 6 -1 2 12 15 2 0 9 -4 -11 -9 4 -11 -9 -13 33 -25 11 -4 3 -19 0 1 -22 -8 -29 23 -1 25 9 6 8 -20 20
8135B0k1j4K2J1qj1J5k0J2m%J1j0oJ5k9mJ5oj1K5k7J0%K1j7K6l4O0n5nLJ7oJ0
$$ 20 -1 -15 7 18 10 -1 14 -6 6 2 2 13 3 -3 12 -17 -21 -6 -12 -23 2 -25 -15 -15 6 -11 15 -19 41 -14 -19 -16 1 -5 5
8170Ej4KJ2%J7pk4JJ1Rrkj8RR%QJ4j9J2q
$$ 5 -9 -7 5 5 22 15 -9 -8 3 12 3 1 -17 -8 1 1 9 23 4 16 8
8191H
$$ Imaginary data points
##PAGE= N=2
##DATA TABLE= (X++(I..I)), XYDATA
0@%%%%%%%%%%%%%%%%%%qJ6j6J6j6J6j6K4l2L2m0M8n0N8p0P8q8J02j10J20j36J52
$$ 0 0 0 0 0 0 0 0 0 0 0 0 0 0 0 0 0 0 0 -8 8 -8 8 -8 8 -8 16 -16 16 -24 24 -26 32 -38 40 -48 54 -56 64 -72 80
40H0j70J94k16K38k63K89l20L53l91M31m73N21n75O36p02P75q60R56j064J192
$$ 80 -90 104 -112 126 -137 152 -168 185 -206 225 -248 273 -302 334 -368 407 -453 503 -561 631
60F31j347J532j760K052k441K984l797N176q112K5467l3350l1773O5968K968l4240
$$ 631 -716 816 -944 1108 -1333 1651 -2146 3030 -5082 20385 -12965 -44738 21230 24198 -10042
75a0042L334J3216j6593J1096J4132j9814j2432K3972N871j5847n786O434O368
$$ -10042 -6708 6508 -10085 1011 15143 -4671 -17103 6869 12740 -3107 -8893 -2459 3909
88C909N976j1148j2888J2375J5051j2234r066Q287J043l666P352k457j0042Q099
$$ 3909 9885 -1263 -14151 -1776 13275 1041 -8025 262 1305 -2361 4991 2534 -7508 591
102E91Q535j2756l234J3205k929r444Q652J735j2015O761J3307j3057j1838J4096
$$ 591 9126 -3630 -6864 6341 3412 -6032 2620 4355 -7660 -899 12408 -649 -12487 1609
116A609P482j1213k359N135k333O40M272m355k667N861j82l477L063j212l974
$$ 1609 9091 -2122 -4481 654 -1679 -1039 3233 -1122 -3789 2072 1890 -1587 1476 264 -3710
131c710O933K558j1306M05J2018l847q695O382K576o962L787N471p710k205P571
$$ -3710 3223 5781 -5525 -5120 6898 3051 -5644 738 3314 -3648 139 5610 -2100 -4305 3266
146C266j822m094M497j918n298P394L705j0875o24J1104j860p475L203J523k506
$$ 3266 1444 -2650 1847 -71 -5369 2025 5730 -5145 -5769 5335 3475 -4000 -797 726 -1780
161a780M806p2r203L377J0288n947p051P196J456n831N094J972j0405K477J2299
$$ -1780 3026 2954 -6249 -2872 7416 1469 -5582 1614 3070 -2761 2333 4305 -6100 -3623 8676
176H676o891j0953Q969O582q341r38N436l784j183N956l011m956N513J600n671
$$ 8676 1785 -9168 -199 6383 -1958 -2896 2540 -1244 -2427 3529 518 -4438 1075 2675 -2996
191b996K675L502n887M49P183m069o070O287L483n949r4L377k731K77L691l719
$$ -2996 -321 3181 -2706 -2257 4926 857 -5213 1074 4557 -1392 -1486 1891 -840 -563 3128 -591
207e91k894N337M60m999K319K571m430J008N007m909m025P641K056q587K55P281
$$ -591 -3485 1852 2312 -2687 -368 2203 -2227 -1219 3788 -1121 -5146 2495 4551 -4036 -3781 3500
223C500j783l844K471J7j587L055k43m082K392K877l857j4L771l268k112N556
$$ 3500 1717 -2127 344 361 -1226 1829 1586 -2496 -104 2773 -1084 -1098 2673 -595 -2707 2849
239B849p17o112L269M537m538j704L793j594j502L711j536l939M003K039n021
$$ 2849 2132 -3980 -711 3826 -712 -2416 1377 -217 -1719 1992 456 -3483 520 2559 -2462
254b462J262M396m316j899O364j066o425L690M764m982k255M522k1k570J523k5
$$ -2462 -1200 3196 -1120 -3019 3345 2279 -4146 -456 4308 -674 -2929 1593 1572 -998 525 500
270E00j560K069J74l042J583K322l542o42M563j700m258L853K793m929n98M706
$$ 500 -1060 1009 1183 -1859 -276 2046 -1496 -2138 2425 725 -3533 320 3113 -1816 -2414 2292
286B292j572l135K964P73k786J746J383l081J045K926l406j033M768j775m664
$$ 2292 720 -2415 549 1322 -1464 282 1665 -1416 -371 2555 -851 -1884 2884 1109 -3555
301c555M422K877n978l35N683k152l967L439J183l173J184J485k430Q46K102k852
$$ -3555 867 3744 -2234 -2569 3114 962 -3005 434 1617 -1556 -372 1113 -1317 -471 1631 -1221
317a221l34L670j928k897L923J112m574J232L865k946j988L547j66k723J736Q96
$$ -1221 -1555 2115 187 -2710 1213 2325 -2249 -1017 2848 -98 -2086 1461 1295 -1428 308 1204
333A204k231J146J226k588N17K919k669k152M084L43m554J663L806l172k071L779
$$ 1204 -1027 119 1345 -1243 -726 2193 -476 -2628 1456 1799 -2755 -1092 2714 -458 -2529 1250
349A250L0l172J624J687k244L10J836j844k30K612j769k019L421M27m063J381
$$ 1250 1280 -1892 -268 1419 -825 -515 1321 -523 -753 1859 90 -1929 1492 1919 -2144 -763
365g63L419k890j901L429O7k884J212J400j668K8Q72j125O16J196k131j78L185
$$ -763 2656 -234 -2135 1294 1361 -1523 -311 1089 -579 -551 321 -804 -188 1008 -1123 -1301 1884
382A884j351l160L033K186m025m32M080j298l074K595J508k755J54J973j321n74
$$ 1884 533 -2627 406 2592 -1433 -1865 2215 917 -2157 438 1946 -809 -655 1318 -3 -577
398e77J495j108p67K227p06k566K122J895l214o02L380r09k690K059J279k326
$$ -577 918 -190 -957 1270 564 -2002 120 2015 -1199 -1801 1579 670 -2020 39 1318 -1008
414a008J83J808j062n74J216p17k22J501j168j397K627N45l396Q15L116k034k053
$$ -1008 -825 983 -79 -653 563 -154 -376 1125 -43 -1440 1187 1732 -1664 -849 2267 233 -1820
431a820K541M78k283Q25J230j496N3J083j030k26J404j094r62K164K1k603J218
$$ -1820 721 1199 -1084 -259 971 -525 -472 611 -419 -645 759 -335 -1297 867 888 -1715 -497
448d97K457k161j685K752O63k648L51K097r09j180J019L15o20L13j98n30Q82J00
$$ -497 1960 -201 -1886 866 1529 -1119 -768 1329 420 -760 259 574 -46 267 69 -461 421 521
466E21j449O29J473j413j145K017K79k199O00J779j245r15J357J7p50O57k06n17
$$ 521 -928 -299 1174 -239 -1384 633 912 -1287 -687 1092 -153 -1068 289 306 -444 213 7 -510
484e10J255j40j791J249J707k402q58L057k99k986J424K144k083j044J944j85
$$ -510 745 605 -1186 63 1770 -632 -1490 1567 1268 -1718 -294 1850 -233 -1277 667 482
500D82j215P18K10p22O22J14j070P87R20j588k05K020o72j954J574J546j971q13
$$ 482 -733 -15 195 -527 95 209 -861 -74 846 -742 -947 1073 401 -1553 21 1567 -404 -1217
518a217J944K31j372J75N37j24K81l04q32R66P06j617j54J909r56j667J934R91
$$ -1217 727 958 -414 -239 298 174 455 151 -681 285 991 -626 -780 1129 173 -1494 440 1431
536A431k722j30K866p02k411J188J412r97k59L52n31O91P85j461k38J812p11j439
$$ 1431 -1291 -1421 1445 743 -1668 -480 932 -65 -324 28 -503 188 973 -488 -726 1086 375 -1064
554a064J662N39k170N69K186j556j645J840P25j518j24O01j83M22l0j291O52J528
$$ -1064 598 1137 -1033 -464 1722 166 -1479 361 1086 -432 -556 45 -138 284 254 -1037 -385 1143
572A143j323j170J894L09k112Q18J910j718j171K155N44j905n7J298j50l27j49
$$ 1143 -180 -1350 544 853 -1259 -441 1469 -249 -1420 735 1279 -626 -683 615 465 138 -11
589a1n52P52R40j435o85J728j72j587J133R89k092k16K454n38k258R75J522p91
$$ -11 -563 189 1129 -306 -991 737 565 -1022 111 1100 -992 -1208 1246 708 -1550 -575 947 156
607A56n95K35r4O22M19j362j67J799l97j562J063Q70j527J53J650j047j435J496
$$ 156 -439 -204 -298 324 743 -619 -786 1013 616 -946 117 987 -540 -387 1263 216 -1219 277
625B77R00j501m33R54m4j15M1p42J79J321o17j476J169J082j512k32J598p30j331
$$ 277 1177 -324 -757 197 153 38 79 -663 -484 837 220 -1256 -87 995 -517 -749 849 119 -1212
644a212J612Q36j818j85J475k25n75K86m54L8J182o76j404J323R16j754j9J606
$$ -1212 400 1236 -582 -767 708 483 -92 194 -260 -222 960 284 -1120 203 1119 -635 -654 952
662I52j005j093J591L37j767K89J373m93n99K39n7L87N18j080m85J626J12j688
$$ 952 -53 -1146 445 782 -985 -696 677 184 -415 -176 -233 154 672 -408 -893 733 845 -843
680h43N34J272r77n62J248j17j207M59R76n10p96J49O40K75o33p67O28J079p66
$$ -843 -309 963 -14 -576 672 555 -652 -193 783 273 -523 -374 266 541 -92 -859 -231 848 82
699H2j030P62P79q16l34Q96j89q37P47P50r32n57R00L86m86k92q5L41O63n74j050
$$ 82 -948 -186 593 -223 -557 339 150 -687 60 810 -122 -679 221 607 121 -171 -256 85 748 174 -876
720h76R56J000j340o33J496q2j418P36R59j205m74J252N5r01J18M00P5J86m78
$$ -876 80 1080 -260 -893 603 521 -897 -161 798 -407 -881 371 426 -475 -357 43 118 304 -174
739a74n10J015M85j301j14J386l51j109Q87O09j217k7J154l31r77L39N76j01k57
$$ -174 -684 331 816 -485 -599 787 436 -673 214 823 -394 -421 733 402 -575 -236 340 239 -18
758a8m06M9Q77q2j224K36J292o32j030R89O16j191OJ244m54j015Q00O25o74k49
$$ -18 -424 -375 502 420 -804 -568 724 92 -938 51 667 -524 -518 726 272 -743 57 682 8 -241
778b41K85L7K59l5p55K99R38o49q77R27M84j144k0J066m94q15O47N41o33l07L76
$$ -241 44 81 340 305 -450 -151 787 138 -739 188 672 -472 -492 574 80 -735 -88 453 -180 -487 -111
799a11K56J9l57l70O92N44r74l90J277L7j221L84J062p65p04R60L04r93K7O68
$$ -111 145 164 -193 -563 129 673 -301 -691 586 623 -598 -214 848 83 -621 339 643 -350 -323 345
819C45j26k87m6j58M34K57q36k48J164j22j278N95J094j013o32J309Q6j145L37
$$ 345 219 -68 -114 -272 162 419 -417 -665 499 377 -901 -306 788 -225 -857 452 538 -607 -270
838b70Q13m44l09K20LK66P2p21J58R76n49r87R33O10j198j51J141l70q61N76M63
$$ -270 543 99 -210 10 13 279 351 -370 -212 764 215 -772 161 771 -427 -578 563 193 -668 -92 371
859C71n09j57K61j1J70j22m65L53O61o63n50J003L59j123L0J079m01q20N70N54
$$ 371 -138 -295 -34 -45 125 3 -462 -109 552 -111 -661 342 701 -422 -392 687 286 -534 36 590
879E90o28k58M19L9j62k9k17K59L94o23m04R31J26j127K27J116n68r27R14N47
$$ 590 -38 -296 123 162 0 -29 -246 13 407 -216 -620 311 437 -690 -463 653 85 -842 72 619
899F19r03j42O84j2l25RJ4K94J69o89J7R17l27r97P00P72j032m35J094L2j017
$$ 619 -284 -426 258 246 -79 -70 -56 238 407 -282 -265 652 325 -672 28 800 -232 -667 427 459 -558
920e58K63O38k95l05P7R7K05j25m44K94N87m91m75O89L83q16j18Q36m6p48J80
$$ -558 -295 343 48 -257 -180 -83 122 -3 -447 -153 434 -57 -532 157 540 -276 -394 442 396 -352 -172
941a72O44k38m82K01K85n6k98r2L20K08m97k94O75J92q41o3R60k05r28M61P85
$$ -172 472 234 -248 -47 238 182 -116 -208 112 320 -177 -471 204 396 -445 -508 452 247 -681 -220 565
962E65o04n17O03K97m14j31K20J69K5k95r3N62m0p34K38P47n17o98P30M84q33
$$ 565 -39 -556 47 344 -70 -201 19 188 213 -82 -175 387 347 -387 -149 598 81 -617 113 597 -236
983b36k76P32O6n77K8K86L6j07j76M0L65j05m82L30O05n87m74P95L06q39j37Q12
$$ -236 -512 220 286 -291 -263 23 59 -48 -224 -184 181 76 -406 -76 529 -58 -532 263 569 -270 -407 405
1005D05p9n72J89K85j18j21L%J55j25l36L07L06n63k13P75j0q59K66P38l02n81
$$ 405 326 -246 -57 228 110 -11 -8 -8 147 22 -314 -7 299 -264 -477 298 288 -571 -305 433 131 -450
1027d50K98L71j18j91p8J97K58k36l10M29K37n69k7O24j88o67L52N55m86n02M59
$$ -450 -152 219 101 -90 -168 29 287 51 -259 170 407 -162 -189 435 247 -420 -68 487 1 -501 -42
1048d2M04l94l50K18L55j17l66jM47K0n20R6O15k23n98M49N46o50l10O87J83o82
$$ -42 362 -32 -382 -164 191 74 -292 -293 154 174 -346 -250 365 142 -456 -7 539 -111 -421 266 449 -233
1070b33J3N19m3l19l6J44J44q0l76J60M77m10m98O38L58p81j42Q09j19o50K36
$$ -233 -220 299 256 -63 -99 45 189 109 -267 -107 370 -40 -538 100 458 -323 -465 344 225 -425 -189
1091a89M19j84k18R1J02J71j29k64K27L64l96k86N63J53p21N2P11k16o58K40N59
$$ -189 230 46 -172 -81 21 192 63 -201 26 390 -6 -292 271 424 -297 -245 466 250 -408 -168 391
1112C91l00m13J42L48j03l24j7L96P6m52r2O04j4n86J89N86l54n12N73L36o19
$$ 391 91 -322 -180 168 65 -259 -276 120 196 -256 -348 256 242 -344 -155 431 77 -435 138 474 -145
1133a45j25N07Q1l48n5J23J58m5l76L3N26k01o45M29N48n80m21O84J45o16N4M92
$$ -145 -270 237 318 -30 -85 38 196 151 -225 -192 334 133 -512 -83 465 -115 -536 148 293 -323 -269 223
1155B23j72k25R8J27P7n5k32J55L97l69l81N37K88o54j44O78m3n90J15M26j48
$$ 223 51 -174 -76 51 128 73 -159 -4 393 24 -357 180 468 -186 -330 348 305 -285 -170 256 108
1176A08k94P1J73Qj76j61K85K23l99k21N59J26o42O2O49j93n81L48M19k89k85
$$ 108 -186 -115 58 66 -110 -271 14 237 -162 -383 176 302 -340 -278 371 178 -403 -55 364 75 -210
1197b10K71J84j11k04LK83Km24JN46j39o33K98N70m05m93M56L02m39j75L56J15
$$ -210 61 245 134 -70 -67 216 218 -206 -205 341 202 -431 -133 437 32 -461 -5 297 -142 -317 39 154
1219A54k47r2J80J57j63j56K03K96l08l34M24L34m89k75M60K36m54j64M21K8l47
$$ 154 -93 -185 -5 152 -11 -167 36 332 24 -310 114 448 -41 -316 144 380 -74 -238 183 211 -136
1240a36k5K48j7j98o5K08J45k76j49L36K29m67k01N78Q2n65L7N41q2m20J32L22
$$ -136 -161 87 70 -128 -193 15 160 -116 -265 71 300 -167 -368 210 292 -273 -236 305 223 -197 -65 257
1262B57r7k37j6K71K8l58n3M36k2n33J09N58k07n22K19M39k86l10K31K11j22k05
$$ 257 160 -77 -93 178 206 -152 -205 231 209 -324 -215 343 136 -386 -167 272 -14 -324 -93 118 -4 -209
1284b09J45K06j21k06J73K86k09l36K78L81l18l62L28L67l62l54L82K16l21j75
$$ -209 -64 142 21 -185 -12 274 65 -271 7 388 70 -292 36 403 41 -313 69 285 -36 -211
1304b11K59O8k04p9J66O4j31j75J77K76k97l02M12L27m94k55N90J01m57M6L60
$$ -211 48 116 -88 -167 -1 63 -68 -243 -66 210 -87 -389 23 350 -144 -399 191 292 -165 -119 241
1325B41p5k25N4J03L6j26j32J92K13l90j86N22P9o18L2N46j05m87J40L72j54k66
$$ 241 166 -59 -5 98 134 8 -124 68 281 -109 -295 227 306 -312 -280 266 161 -326 -186 186 32 -234
1347b34J27K29n2j86nL11n4l28O7M31j34m81K47M64k95m03L13L00l20k25K60J10
$$ -234 -107 122 70 -116 -121 190 136 -192 -125 306 172 -309 -62 402 107 -296 17 317 -3 -228 32 142
1369A42j60j46J24J57j24k03J27L28k82l22L71K84l85k27L93J97l66p5K87O4j98
$$ 142 -18 -164 -40 117 -7 -210 -83 245 -37 -359 12 296 -89 -316 77 274 -92 -167 120 184 -14
1390a4p3J34J04j14j72K03J89l04k05L69J41m18j33M47O1m69K2L41k5k60l2K61
$$ -14 -87 47 151 37 -135 68 257 -47 -252 117 258 -160 -293 154 215 -254 -232 109 84 -176 -208 53
1412E3M4k21l0K26J14l06q5M20L4m76P1N09j58m51K03L50j93l03J77J99j41k06
$$ 53 97 -124 -154 72 186 -120 -205 215 249 -227 -156 353 195 -256 -53 297 104 -199 -22 177 36 -170
1434a70Q5J88o4k41K9L62j45l66K37L29k62l37L61K52k98j64K79J49k11j05J36
$$ -170 -85 103 39 -202 -173 189 44 -322 -85 244 -18 -355 6 258 -40 -204 75 224 13 -92 44
1455D4J60j68j64J41J88j97k14L05J75l63j78L60J19l64q7L32N4k79n9K45N3k02
$$ 44 204 36 -128 13 201 4 -210 95 270 -93 -271 89 208 -156 -243 89 143 -136 -195 50 103 -99
1477i9n5J77R8j89j01K66J25l08j04L86k2l32L2L92j48l03J28K12p1k14L0J55
$$ -99 -154 23 121 -68 -169 97 222 -86 -190 196 174 -158 -126 266 118 -185 -57 155 84 -130 -100 55
1499E5Q3k51j08L52J1l90N1M12j25l81K26K74k21j75K12J19j05j67J03J91n9k18
$$ 55 138 -113 -221 131 142 -248 -197 215 90 -291 -65 209 -12 -187 25 144 39 -128 -25 166 107 -111
1521a11O0L05j58l07K09K66k53k14K27J73k60j40J88J36j86j40J93J46j59j61
$$ -111 -51 254 96 -211 -2 264 11 -203 24 197 -63 -203 -15 121 -65 -205 -12 134 -25 -186
1541a86J75J29j28j55J93J53j72j88K69J51k54j33K80P0l24l9K77L7k41m6K05
$$ -186 -11 118 -10 -165 28 181 9 -179 90 241 -13 -146 134 204 -120 -159 118 155 -86 -132 73
1562G3R1k60j08K55J17k99j33L45N0l54M6L07k5l28J39K56p6k40P6K23m8j94J3
$$ 73 164 -96 -204 51 168 -131 -264 81 131 -223 -177 130 105 -223 -84 172 96 -144 -68 155 107 -87 -74
1585g4K79n6l25R1L47j18l50J32K55j76k39J97K00j71j38J40J34j70j35J40J41
$$ -74 205 149 -176 -85 262 144 -206 -74 181 5 -234 -37 163 -8 -146 -6 128 -42 -177 -37 104
1606A04j05j70J19K08j38k36K45J91k58j25K70J31k74r7K44K2j80o8J81J06k07
$$ 104 -1 -171 -52 156 18 -218 27 218 -40 -165 105 236 -38 -135 109 131 -49 -117 64 170 -37
1627c7j41J95J58k20k13K82J14k71p6K98L1k48pK53kk29kK60j2k40J5J99P2l04
$$ -37 -178 17 175 -45 -258 24 138 -133 -209 89 120 -128 -135 118 116 -113 -115 145 133 -107 -92 107 179 -125
1651a25j8L23J3l54K8L09o1l22J29K48j48k24J47J89j42j26J07J05o6j64N7K50
$$ -125 -143 180 193 -161 -133 176 115 -207 -78 170 22 -202 -55 134 -8 -134 -27 78 12 -152 -95 155
1673A55j08k24J51K90k26k34K35J73k17j24J84R1j42p6J19Q3o7k06R7K06j94j73
$$ 155 47 -177 -26 264 38 -196 39 212 -5 -129 55 146 4 -72 47 130 63 -143 -46 160 -34 -207
1695b07K03J52k42j10K41R9k52m0K26L2j37j19K06O4j69o1K00J20k31r9K57O4
$$ -207 -4 148 -94 -204 37 136 -116 -156 70 102 -35 -154 52 116 -53 -114 86 206 -25 -124 133 197
1717A97k76n0K43L2k77J3K14mk26L4J84l2j91L5K03l9k11L1K42j6k71M9K74r3
$$ 197 -79 -129 114 146 -131 -118 96 92 -134 -100 84 52 -139 -104 99 60 -151 -120 122 106 -165 -116 158 65
1741F5k38J38K29j85j56J31J77j16j48J02J37p9j88Q6J95j22k32J67J93k01j50
$$ 65 -173 -35 194 9 -147 -16 161 45 -103 -1 136 57 -131 -45 150 28 -204 -37 156 -45 -195
1762a95K09J01j57j29J86J11j56j09J30J29j55p5J40J45j68j22K02R2k14r1K02
$$ -195 14 115 -42 -171 15 126 -30 -139 -9 120 -35 -110 30 175 7 -115 87 179 -35 -126 76
1783G6Q7k07j05K22M6k06k6J80Rj76n0J76O9k07o4K46L2k05k8K51j3k44K6K77
$$ 76 163 -44 -149 73 119 -87 -113 67 76 -100 -150 26 95 -112 -176 70 102 -103 -131 120 107 -137 -111 166
1807A66l3k77J26J50o6j80P8J49m9j47L1J61m3k24P0J95j13j60J25J70j40j43
$$ 166 133 -144 -18 132 66 -114 -36 113 64 -83 -52 109 66 -158 -88 107 -6 -166 -41 129 -11 -154
1829a54J30J51j46j24J18J05o3j43J43J07r8j25J15J48j34j52J40J31j74r1J75
$$ -154 -24 127 -19 -143 -25 80 17 -126 17 124 26 -99 16 164 30 -122 18 149 -25 -116 59
1850E9Q0k06o0J73M5j42o8J00R9j22j24J59J18j85p6K04M7k08rK16lk01L0J83
$$ 59 139 -67 -127 46 91 -51 -119 -19 80 -42 -166 -7 111 -74 -150 54 101 -107 -116 100 97 -104 -74 109
1874A09j1j78K2J84j1j87j8J88Pj91k8K12m2j68K9J72l4j62J6K11r6k00J17J99
$$ 109 98 -80 -58 126 115 -72 -90 98 105 -86 -114 98 56 -112 -83 89 55 -107 -91 120 24 -176 -59 140
1898A40j34j56J25J54p5j52J03J47q6j51O2J70j14j74J47J44j75r6J38P6j38o8
$$ 140 6 -150 -25 129 54 -98 5 152 66 -85 -23 147 33 -141 6 150 -25 -121 17 93 -45 -113
1920a13J20R1p8j40R0J17q9j31J31J11j35j00J70R3j69m2J62N8j47q4J33O0j23
$$ -113 7 98 20 -120 -30 87 -2 -133 -2 109 -26 -126 44 137 -32 -74 88 146 -1 -85 48 108 -15
1943a5q0J41J09k16p6J91O6k46PJ91j0j69k4K07m3j77Q2J43j3j99M5J50J1j59
$$ -15 -95 46 155 -61 -137 54 120 -126 -119 72 62 -107 -131 76 33 -144 -62 81 68 -131 -86 64 75 -84
1967h4j9K16l6j56M3K09j12j69J13J17j14j13J38O9r8j39J25J01j13j22R1J53
$$ -84 -103 113 77 -79 -36 173 61 -108 5 122 8 -105 33 102 4 -135 -10 91 -22 -144 -53 100
1989A00j01j52J29J30j08j30J06J24j17p0J23O4q1r1Q3J37j53p7J09P3r1j17J32
$$ 100 -1 -153 -24 106 -2 -132 -26 98 -19 -89 34 98 17 -74 9 146 -7 -84 25 98 7 -110 22
2012B2R5j70n7J49M4j53q3K03Nj20n7J75lj38pJ73K0j71mJ60Jj34k7J75K0k22
$$ 22 117 -53 -110 39 83 -70 -153 50 55 -65 -122 53 50 -88 -95 78 98 -73 -77 83 84 -50 -77 98 118 -104
2038a04L0J94l6j91M0J66p1j52N2J56n0j23K9J51o4j25M2J53q0j36P0J33o6j38
$$ -104 -74 120 84 -107 -67 99 28 -124 -72 84 34 -89 -60 91 27 -98 -56 97 17 -119 -49 84 18 -120
2062a20J13J30j31p3R7R5p9q6M9J04n5j20Q6Q5j03q4P4J19j62n6J48K5j14p3J33
$$ -120 -7 123 -8 -81 16 111 32 -54 -5 99 44 -76 10 95 -8 -92 -18 101 -61 -117 31 56 -58 -131 2
2087BL7j05m0J53M2j26r6J71Q1j57m7J54M5j63j2J40K5j58MJ45j2j50JJ25lj52
$$ 2 39 -66 -106 47 89 -37 -133 38 119 -38 -85 69 114 -49 -61 79 104 -54 -50 95 83 -67 -66 59 56 -96
2113i6RJ61l5j60K4J66n1j24M8J53o8j47Q9J13m5j41N8J50p5j00O6J12p3j10N3
$$ -96 -87 74 39 -121 -97 69 18 -106 -58 95 27 -120 -31 82 37 -104 -46 104 29 -71 -5 107 34 -76 -23
2138b3J30q0r6N7Q8r2j23J10J12j08q4J21O6j12n0R0Q1r7r6J30P3j26r3J38Q3
$$ -23 107 27 -69 -12 76 -16 -139 -29 83 -25 -109 12 78 -34 -84 6 87 -10 -106 24 97 -29 -122 16 99
2163I9j21n9J55M1j47l2J16J2j37k9J29O4j45m8J13P2j78k3J84pj72J6J53K8k05
$$ 99 -22 -81 74 115 -32 -64 52 64 -73 -102 27 91 -54 -102 11 83 -95 -118 66 59 -113 -97 56 84 -121
2188a21L8J39Rj32J2J46k8j06L3J03j8j30QJ55n2j48N1J46j01r4P2Q9o8j41R4
$$ -121 -83 56 65 -67 -55 91 63 -43 -10 93 75 -55 -47 108 56 -92 -41 105 4 -90 -18 71 3 -138 -44
2213d4J18q7p5N6J10o0j12P8Q2m4j10Q8J13j14n1O0J14j23o6R6O9j18o4J14N4
$$ -44 74 -13 -88 -32 78 18 -94 -16 66 22 -88 0 113 -1 -52 8 122 -1 -67 29 98 -20 -84 30 84
2238H4j11o1J06P0j16q0J04N7j00o3J30N2j25k5J04K6r9k6J49oj11k2J33Qr8k6
$$ 84 -27 -88 18 88 -28 -108 -4 53 -47 -110 20 72 -53 -78 26 52 -47 -73 76 70 -41 -63 70 78 -20 -46
2264d6J32J7j62oJ53k5j41K3J50q3j11P1Q0m9j15O2J15m2j09M4J00p1q3Q6R6n9
$$ -46 86 103 -59 -65 88 63 -78 -55 95 12 -99 -28 52 3 -112 -50 65 23 -86 -42 58 -13 -96 -10 86 27
2290B7j14R4P7p5j01J08Q1j03o8Q8N1p7q1Q5J00j03r2O0J15j13n6Q3P9r0p1J21
$$ 27 -87 7 84 9 -92 16 97 -6 -74 14 65 -12 -93 -8 92 -11 -103 -43 72 -41 -97 -14 65 -25 -96 25
2316B5M8j08k3Q7L4p4l8R8K0q6j8J00J5j29OJ19k3j04k8J51n3j04KJ29j5j16n
$$ 25 73 -35 -58 29 63 -11 -49 49 69 -17 -35 65 80 -49 -43 76 53 -51 -79 72 19 -85 -83 46 31 -85 -90
2343i0J23rj13J6R9J6j17KJ83q5j13N0J54o1j24K4J26l5j06L3J32q2p1N0Q9p9
$$ -90 33 24 -89 -73 26 42 -75 -73 110 25 -88 -38 116 55 -69 -45 81 46 -60 -27 105 23 -48 2 91 12
2369A2j10R2P1r9o8Q3R0r6n5N4J04j27l7J00N1o2o7R5O6q9q6J02R7j08q0J04O1
$$ 12 -98 -6 65 -34 -102 -19 71 -25 -80 -26 78 -49 -86 14 65 3 -64 31 97 8 -78 24 121 13 -67 37 98
2396I8j34m1J31J2j13k8Q3O3j29j1R7K8j18l0J38J4j09nJ10J8j16NJ13j3j03j6
$$ 98 -36 -77 54 66 -47 -75 8 71 -58 -69 28 56 -62 -92 46 60 -49 -54 56 74 -42 -37 76 63 -40 -56
2422e6J34k4j33N8J15m9j10L9Q3n2o2K6R6l1j10M2R2o2q7O1P8l4q7N9O9n6o0O7
$$ -56 78 54 -79 -21 94 45 -65 -26 57 5 -57 -31 65 34 -76 -34 58 -4 -91 -30 48 14 -73 -14 55 -1 -61 6
2450FN2l6q6O5J14j00o3O2P1q8r6J17N5j00k9P6O0j10p9J01L3q0k3Q1L3q5k4J10
$$ 6 58 22 -64 1 115 15 -48 14 85 -3 -99 18 73 -27 -56 20 80 -30 -109 -8 25 -55 -78 3 36 -49 -73 37
2478C7K1j07J8R0J1r5j9J13J6j24kR6Oj25L5J15j6j06k4J25l6j11J8J00k9q2L4
$$ 37 58 -49 -31 59 70 -25 -44 69 85 -39 -41 55 61 -64 -29 86 70 -36 -60 65 29 -82 -64 36 7 -75 -41
2505d1P2j5r0J5J42o7j03O4Q6m4p9M9O9nj20R8N3q9n1P0O6o0o4N5P8p1j06J13
$$ -41 31 16 -74 -59 83 16 -87 -23 63 19 -60 -11 58 53 -67 31 84 -5 -56 14 80 20 -44 11 89 18 -88 25
2533B5K3p1m2M2R2p6p3Q9M2n7n2R6M1r5m2J00K5r3k9J08J5j09kJ00J2j10j1J12
$$ 25 48 -23 -65 -23 69 -7 -80 9 51 -6 -58 38 79 -16 -58 42 67 -26 -55 53 68 -41 -43 57 69 -41 -52 60
2561F0Oj27qP1L1r5QJ06j6r6J6Q9m0o9L9O3kp2J3P2Nq5J2R9l9j04N3Q1n5j02O6
$$ 60 66 -61 -69 2 33 -62 -54 52 36 -60 -44 45 5 -64 -25 38 36 -36 -23 49 54 -31 -19 80 41 -63 -10 71 16 -86 -20
2592b0P8n5p2L4Q8n5q3O1P8m9r5N7P8o5o9R0R1r9o8O7Q9q2l6P9O3j24m4J13J0
$$ -20 58 3 -69 -35 53 -2 -85 -24 54 5 -90 -33 45 -20 -89 1 92 -7 -75 -8 81 -1 -37 42 105 -19 -63 50 60
2621F0o7o6Q0N5q7j4P5nq4oO7M3j26j6J13L2r7K1O5j4n3j4P2K4j03j1J11Mj14
$$ 60 -7 -73 7 62 -25 -39 36 31 -53 -59 8 51 -75 -91 22 54 -43 -22 43 29 -24 -38 34 58 -45 -56 55 59 -55
2650e5M9P1k9q4K5O7Kr2J6P0oj06O3O7l6j07M2J04o5p8M3Q8o1n3O1P3n1q2P8P0
$$ -55 -6 65 36 -48 -23 44 46 -46 -30 40 34 -72 -9 58 22 -85 -43 61 -4 -82 -39 49 -12 -65 -4 69 18 -64 14 84
2680H4j06m7O7O2l6r6M0J02q0l5M9M6m2q0Q0O4j10k2P9L4o2m7O4N0r9j8P6N4q1
$$ 84 -22 -69 -2 60 24 -72 -32 70 -10 -45 4 50 8 -72 8 72 -38 -60 19 53 -9 -56 8 58 -41 -59 17 71 -10
2709a0p0J01M6j08mJ01J0r9qO7L4j03%Q2j5q4LJ11l0p7KQ7j2j08K9J06oq7RP3
$$ -10 -80 21 67 -41 -45 56 66 -33 -41 26 60 -43 -43 39 24 -60 -57 54 24 -53 -51 36 24 -84 -55 51 45 -42 -33 40
2739D0l1n8K7J01m3j01O7Q2q8l2M4M6m5p9J4J07o4n4L8O3n6n4P6L1m8q4J00M3
$$ 40 9 -49 -22 79 36 -65 2 84 -4 -36 8 54 9 -70 -56 51 -13 -67 -29 34 -22 -76 0 31 -17 -101 -1 42
2767D2o0j7J3P0m7l4N5M3j02rP1L2p7k9N3M4o0m8Q3K0q4k5Q2M2r3m4Q5K0q7KR1
$$ 42 -18 -35 -22 48 1 -33 22 65 -37 -46 25 57 -20 -49 4 48 -12 -60 23 43 -41 -66 16 58 -35 -79 6 26 -61 -59 32
2798C2Oj01M1O9l7p4M5Q3k7j02M8O0l9n1K9N6lp9L5L2j2o3J2R5l7q1N4O3m4q5
$$ 32 38 -63 -22 47 10 -64 -19 64 37 -65 -17 43 4 -47 -18 38 35 -44 -9 23 11 -52 -40 55 18 -63 -9 54 10 -75
2828g5M5N8o0j8L4Q2m8p5M7O4n4l2M3O1o5n7P3N4r6j7L9N0p6m1N2N2n0k5K1P2
$$ -75 -30 28 -32 -50 -16 66 18 -57 -10 54 0 -32 11 72 7 -50 23 77 -19 -36 3 53 -23 -64 -12 40 -10 -35 -14 58
2858E8q6kL5jk0n1P9Jn8J3P0J1q9JP9Jm0l3P7k9p2K8R0j8r6K7N4k0n1qN0K0q1
$$ 58 -28 -30 5 4 -16 -67 12 13 -45 -32 38 49 -40 -39 40 41 1 -32 45 16 -56 -28 62 44 -52 -25 29 9 -42 -50 0 20 -61
2891f1L1M2j4p3L7P7k3o1K6O2n6k7L8O6o5l3K4O6j7q8O4M3n5o6M6P7n4p8R4J4
$$ -61 -30 12 -2 -75 -38 39 16 -45 -19 43 -13 -40 -2 64 -1 -34 -10 56 39 -49 15 58 3 -63 -17 60 6 -72 22 36
2921C6l4o0M4L6m5l9O9L5o9l4P5K2p1k1L6M7n3j6O3M2p8j8N2K2o9j0O2Pn3l1R6
$$ 36 2 -58 -14 22 -23 -62 7 42 -27 -61 14 36 -35 -56 -20 27 -26 -42 21 63 -15 -33 19 41 -28 -38 24 31 -22 -53 43
2952D3m5m7L4M9%q1J5R0l1o9L3L2jm8k0P2k4n0K7P9l4o5K4Q0n2o1N6L5m4m0K1
$$ 43 -2 -49 -15 34 34 -47 -32 58 27 -42 -9 23 22 -26 -46 26 2 -48 -21 58 24 -41 -17 63 11 -50 6 41 -3 -43 -22
2983b2O8l0q3L6O0k9o5M5N7l8l5L3O2m3p2N7O0p5m0N9O6n6m4N6L9r1k7P1L2o7
$$ -22 46 16 -67 -31 29 0 -65 -20 37 -1 -36 -3 59 16 -56 1 61 -14 -54 5 71 15 -29 27 66 -25 -52 19 51 -16
3013a6k0M5M2j09J5L4N3r8j6J10j8n8j4Q9l3p3L7N4J0o0K0M9Qq6j1R9l1k9j8Q6
$$ -16 -36 9 51 -58 -43 -9 44 -54 -70 40 22 -36 -50 39 6 -67 -30 24 34 -26 -6 43 51 -35 -46 53 22 -7 -25 61
3043F1k7q9K7P3k9o7J1Q4m8l8L7K6k3m5M9K9l6n2R3K2o2n8M2O0j4o7K9M4o2k3
$$ 61 34 -55 -28 45 16 -51 -40 44 -4 -42 -5 21 -2 -47 2 31 -5 -57 36 58 -4 -62 -20 40 26 -41 -12 32 -30 -53
3073e3L9N5k8n5L0O5r4k7Q9J8l7p7Q9K0o4j2M4O5r5J2N9qn6j4P1J4p6KN8ko6k5
$$ -53 -14 41 13 -42 -12 53 -41 -68 21 39 2 -75 14 34 -30 -42 2 67 -28 -16 43 35 -21 -35 36 50 -26 -24 34 32 -34 -59
3105e9Q9km5j5P1j0o6K1L9jo9ON8k2m9J0Q0l2l6RM0%m8J6N9k1l2J5N3m4m2j7R4
$$ -59 30 28 -17 -32 39 29 -37 -16 23 22 -47 -41 17 -5 -54 -44 36 4 -32 -23 17 17 -31 -15 44 23 -9 6 59 15 -27 -44 50
3138E0o6k0K6N1k7n7L0K0om7L4P0o6p0L9O5m8l4M4L6n9kM7M0q1k3Q2L1p0m1N4
$$ 50 -16 -36 -10 41 14 -43 -13 7 1 -46 -12 58 -8 -78 -39 26 -22 -56 -12 24 -35 -37 10 50 -31 -54 28 59 -11 -52 2
3169BL6k4n9Q3K7q2k5N0L2r3K7M6Ro4k1P9k0l0rQ2k1q8K9O3jn1j0O5mn0L0N1k8
$$ 2 38 14 -45 38 65 -17 -42 8 40 -53 -26 20 29 -35 -56 23 3 -27 -36 46 25 -63 -34 29 28 -23 -33 32 28 -22 8 59 31
3202C1o6J3N5l3k7JN8j3o2L1M7l4l5K9N4m5n2N9M3k6p1M3N7n8l6L6K5k0o6P9L6
$$ 31 -35 -22 33 0 -27 -26 32 19 -43 -12 35 1 -34 -5 49 4 -48 11 54 28 -43 0 57 -1 -37 -1 24 4 -62 17 53
3233E3l1p5N9K6n8k3O8J0n9j6M5Rk9l0O4L1o5j2O2J3p9K8M3J0p7j7J05pp2K5O3
$$ 53 22 -53 6 32 -26 -49 19 29 -30 -46 -1 8 -21 -51 13 44 -21 -33 29 42 -37 -9 34 44 -33 -50 55 48 -24 1 64
3264F4m5n8K2M0L0r3J8Q0m5p7N5L2jp2J8M6k3k1rR7n8m4K3M6l3m2K8R3m4o4N2
$$ 64 19 -39 -17 23 53 -40 -22 58 13 -64 -9 23 22 -50 -32 14 -9 -30 -39 58 0 -44 -21 25 -8 -50 -22 71 27 -37 15
3295A5N1k1o8J6N4m7l2N2N8o9j5K6L1n0q3J03K0o0l9J9O6l3l1M7J9k6l4O7L3p4
$$ 15 66 45 -23 -7 47 0 -32 20 78 9 -6 20 51 1 -82 21 41 -19 -58 -39 27 -6 -37 10 29 3 -31 36 69 -5
3325ej7M8Rn5k5O9L0q5K7K4K3q0J4M4kl7j8M9J3o3L5K2J6k3l0M7l2k5j8N7j3m1
$$ -5 -22 26 35 -20 -45 24 54 -31 -4 20 43 -37 -23 21 19 -18 -36 13 26 -37 -2 20 36 13 -17 30 -2 -27 -45 12 -1 -42
3357d2K6M2j3n0L1N7n0m6J8L2%n2K5Q7o4n0M5M9m6l4M1N1m9p0R4mk7k6N2J5k5
$$ -42 -16 26 13 -37 -6 51 1 -45 -27 5 5 -47 -22 65 1 -49 -4 45 -1 -35 6 57 8 -62 32 28 1 -25 27 42 17
3388A7n6O2L9m8l6N8Mq6PN8K9p8KK8K6n7jN4k6km5O5rk0qM8k6j5k4N6J8n4J6K9
$$ 17 -39 23 62 14 -22 36 40 -46 -39 19 48 -30 -28 0 26 -31 -32 22 -4 -6 -51 14 5 -15 -23 25 -1 -16 -40 16 34 -20 -4 25
3422B5%k8m0R6kq6K4L1L0r8K6M4Qq6NO4qo3M4K0Jl9L3J7k0l2L0M0k3l7L2N1o3
$$ 25 25 -3 -43 53 51 -35 -11 20 50 -48 -22 22 30 -56 -51 13 5 -58 -14 6 7 -32 1 18 -2 -34 -4 36 13 -24 8 59 -4
3455dj6K2N8q6LJ4N4m2m3O2J8n9l2N6Jl1oL9K1o2nN3pm7j3P1%Po6N4K0n1J5L0
$$ -4 -20 2 60 -26 -23 -9 45 3 -40 22 40 -19 -51 5 6 -25 -31 8 29 -33 -38 15 8 -39 -52 19 19 26 -40 14 34 -17 -2 28
3489B8l2l2L6J0K6n2j8N3No0K3N4k6n8J0L6J3m7K0L3j1m3M0L7k5m5J9N4rm9mM4
$$ 28 -4 -36 0 10 36 -16 -34 19 24 -36 -13 41 15 -43 -33 3 16 -31 -11 22 11 -32 8 45 20 -25 -6 48 39 -10 -14 30
3521C0Rn7J3L8j2n1L1M3k8n5K1L9l3l7M4L9n9oM0Rj5m9M8J6k1m1M4J3j0j9O1m9
$$ 30 39 -18 -5 33 21 -30 1 44 16 -39 -18 21 -12 -49 -5 34 -25 -31 9 18 3 -46 2 18 -3 -44 0 13 3 -16 45 -4
3553dNk7M1J3m6mL3K7m5J1L8j4q7M2QJ5m4RL7Qk7QLJ9n0oN0k4m3M2M2lm9J2O7
$$ -4 1 -26 15 28 -18 -22 11 38 -7 4 42 28 -59 -17 -9 6 -38 -29 8 16 -11 -3 0 19 -31 -37 13 -11 -54 -12 30 27 -22 -10 57
3588E7n0l4K7L7k0m2J5J5k0k6L4K7Np2M2K6o0KM6j5Ml0M0J0j7j9kO3n4k5L3J2
$$ 57 7 -27 0 37 17 -25 -10 5 -15 -41 -7 20 25 -47 -5 21 -39 -37 9 -6 -2 -32 8 18 1 -18 -20 43 -11 -36 -3 9
3620Il2oL2J5j9j6K9K8o0k4L8L3k3k7M1Kl5%K4j4j8pN6J3p7K0N1Pp3J2Q3k9m6
$$ 9 -23 -29 3 18 -1 -17 12 40 -20 -44 -6 27 4 -23 18 20 -15 -15 9 -5 -23 -30 26 39 -38 -18 33 40 -33 -21 62 33 -13
3653a3mM3k4k5KM2Mn5RL5Lo3K6N3k8n4M4L6j3n1PP4l2l9K0J9j4m0L5O7l5m4K4
$$ -13 -17 26 2 -23 -21 21 25 -30 -21 14 17 -46 -20 33 5 -49 -5 31 18 -33 -26 48 16 -23 -3 16 2 -38 -3 64 29 -15 9
3686IL9k2l5MN1o1m2O1M1n5j0K6K3n7PM8%m1pL2K5m7k5N2K8n3l0P1j4l0k4N0N
$$ 9 48 26 -9 -5 46 -15 -57 4 45 -10 -20 6 29 -28 -21 27 27 -14 -21 11 36 -11 -36 16 44 -9 -39 32 18 -12 -36 14 19
3719A9m6MO0j3k9j4K5kj9rK8nm9L8M6m6k5J5N6k4l1PL5pk0j9P2j2q1J4N5jn9M1
$$ 19 -27 -23 37 24 -5 -19 6 4 -15 -24 4 -1 -50 -12 34 -12 -37 -22 34 10 -21 -14 21 14 -6 -25 47 35 -46 -32 23 22 -37 4
3753Dlnl1J5O6m8k1lM5l0k1K5M2m5l7O4Ml0j2O1Nn5l5N7J5l5LM1J5o9J0M0j6l9
$$ 4 1 -4 -35 -20 46 -2 -23 -26 19 -11 -32 -7 35 -10 -47 17 21 -9 -21 40 45 -10 -45 12 27 -8 -5 36 51 -18 -8 32 16 -23
3787b3PRQrj0J6J5n3j8M6M6n4jOK5l6JN0L2p6J8J1K1n1J0M4l3l1K9M5j8m4JN8
$$ -23 -16 -7 1 -8 -18 -2 13 -40 -58 -12 34 -20 -21 -15 10 -26 -25 25 57 -19 -1 10 31 -20 -10 34 1 -30 -1 44 26 -18 -17 41
3821D1k8k9kM1j7n7K6M8l8j0J4L2k1m6K4P0k0o5K1L3m1NJ9Mlm5O1L6o2k3K2L1
$$ 41 13 -16 -18 23 6 -51 -25 23 -15 -25 -11 21 0 -46 -22 48 28 -37 -16 17 -24 -19 0 4 1 -44 17 53 -9 -32 -10 21
3853B1m1mN1ql3nM5j2k6OOQm7LN3Ln3J4L6l5JrM8jk0l7N4pl2KJ4Jj5j4N2ql2l
$$ 21 -20 -24 27 19 -14 -19 26 14 -12 -6 0 8 -39 -36 17 20 -33 -19 17 -18 -17 -26 22 21 1 -36 18 11 -21 -19 -5 -4 -19 -33 19 11 -21 -24
3891b4pK1qj2P7k4k8RL6k7n0J2N2j4k5L8Lk2k5J1N4o6mJ3N6l4m5K7J2k0l9P6K3
$$ -24 -31 -10 -18 -30 47 23 -5 4 40 13 -37 -25 27 13 -12 26 29 7 -18 -7 47 -19 -23 -10 46 12 -33 -6 6 -14 -53 23 46
3924D6o4m1M3O5o0LlL3l7K0PJ9l7mM3Km1j0O4j3l2l1N4Lk5l9Q2m0l8rN1Qn1KN
$$ 46 -18 -59 -16 49 -11 -8 -11 22 -15 5 12 31 -6 -10 33 35 -6 -16 48 35 3 -28 26 29 4 -35 47 7 -31 -40 11 19 -32 -30 -25
3959b5M4n8K0L9j1n1rP4l1l9J8O7ql3QrRj4K1J9j4n2J0M5k4n1M7K4Qm8K8Rj7o4
$$ -25 19 -39 -19 20 9 -42 -51 23 -8 -47 -29 38 30 -3 5 -4 5 -9 12 31 17 -35 -25 20 -4 -55 -8 16 24 -24 4 13 -4 -68
3993f8N5L7pn3QO8k5n2N7j1k0Jj0K4jj7J4mj1k9M2Nnj2OK0pn5N2Ok4%M1k6%qN1
$$ -68 -13 24 17 -36 -28 40 15 -37 20 9 -11 -10 -20 4 3 -14 0 -4 -15 -44 -2 3 -2 -14 -8 12 5 -50 2 8 -16 -16 25 -1 -1 -9 42
4030D2k0k4j5K7K1n0nL8Jn0K2lRmk1M8Qo1L4J3nk3pO1m8l8M2L2k0l0K7J1j2Kj2
$$ 42 22 -2 -17 10 31 -19 -24 14 15 -35 -13 -16 -7 -11 -32 16 24 -37 -3 10 5 -18 -25 36 -12 -50 -8 24 4 -26 1 12 0 2 -10
4065a0L0K2o6J5K3Kn8M5L7k4l9K8M0n4j4J9L3n0k8L1M5rm6NM5n3lL0J7k8kK5K0
$$ -10 20 42 -24 -9 14 16 -42 3 40 16 -23 5 45 -9 -23 -4 29 -21 -49 -18 27 18 -28 -23 22 -31 -34 -4 13 -15 -17 8 28
4098B8lm2L3Km0J5K9J0k5l7L8Qj9m2M1J7j5oM7m2Kj2J0oj1nM2mm3M2oQm1K3JK5
$$ 28 25 -17 16 18 -22 -7 22 32 7 -30 8 16 -3 -45 -4 13 -2 -8 39 -3 -1 -13 -3 -9 -20 -25 17 13 -30 12 6 14 -27 -4 -3 22
4134B2m6K0O1l2l5qM8l7m2L5L1k1k0K1J6k0k1RM3k2m9O9K2m0m8O1Nk3k3L7K6l6
$$ 22 -24 -4 57 25 -10 -18 30 -7 -49 -14 17 -4 -24 -3 13 -7 -28 -19 24 2 -47 22 44 4 -44 17 22 -1 -24 13 39 3
4166Cl6P6j4o1M1NRj9l7L9kJl4L9j5k0pK5L4l6m0P7Jk7QLjk6L6K3k5k7%K3Oj5
$$ 3 -33 43 29 -32 9 14 23 4 -33 6 4 5 -29 10 -5 -25 -32 -7 27 -9 -49 28 29 2 10 13 12 -14 22 45 20 -7 -7 16 22 7
4202Gj1%Nl2J5K8J4m8J3j6J3nK7Rl2k7M5J2m8LPN9m5j5%L9m4LL6J9lm2J1L1k2
$$ 7 -4 -4 1 -31 -16 12 26 -22 -9 -25 -12 -17 10 19 -13 -40 5 17 -31 -28 -21 38 -7 -22 -22 17 -27 -24 12 31 28 -14 -3 28 6
4237Fl5N8M2o3l7K9K5j7j0K6J4m6j4K6L2o0%K8Qk4J3L4k8jNK1Ln6qK7J1l2lK1
$$ 6 -29 29 71 8 -29 0 25 8 -2 24 38 -8 -22 4 36 -24 -24 4 12 -12 1 35 7 6 11 32 35 -21 -29 -2 9 -23 -26 -5
4271eLNrrL2k8j4N4j0l3NL0j6j3OK6k4J1qJ8Nl2nL3j2k9J2K9l0rMJ2J4l6J2K4
$$ -5 -2 3 -6 -15 17 -11 -25 29 19 -14 -9 21 5 -8 -2 24 0 11 3 21 26 -6 -11 22 10 -19 -7 22 -8 -17 -13 -1 13 -23 -11 13
4307A3l4k5N6k5J8k0RK9k9k2N7jpm9N8l3MOmlj7j6M6Qk2rK1J8l6K1k3J7mj3K1
$$ 13 -21 -46 10 -15 3 -17 -8 21 -8 -30 27 26 19 -30 28 -5 -1 5 1 -2 -19 -35 11 19 -3 -12 9 27 -9 12 -11 6 2 -11 10
4342A0l4j8M2J1nj8k1K1K2j4j0K0mKJ5j7qJJ3J9Jm9J8L0%j8l1O6n1j2OmK3l4N7
$$ 10 -24 -42 0 11 6 -12 -33 -12 10 -4 -14 6 2 4 19 2 -6 -5 8 27 28 -21 -3 27 27 9 -22 44 -7 -19 -13 -17 6 -28 29
4377B9J4m7J1k2N4m8j0L0J7m0qLM5j1l6K0J3k3nQK2j8k8ON3m7K8mK5l3k3N0j1
$$ 29 43 -4 7 -15 39 -9 -19 11 28 -12 -20 -17 28 17 -19 1 14 -9 -14 -6 16 -2 -30 -24 29 -18 10 6 31 -2 -25 25 14
4410A4Mk6lN7m7j5RK2rk3K5lk2mM6K2n7pK2j9nk0O2k0k1J7K3Jn7KL4j0%K7k2O
$$ 14 18 -8 -11 46 -1 -16 -7 15 6 -17 8 5 -17 -21 25 47 -10 -17 5 -14 -19 -39 23 3 -18 -1 22 23 -34 -32 2 -8 -8 19 -3 3
4446Ck8K7Pj5k6M6J4k3j3L5j2nk5M1j6k0k4M4j3Ll5K6K0l1qL1Mj2m8M8K6k2k4
$$ 3 -25 2 9 -6 -32 14 28 5 -8 27 15 10 -15 26 10 -10 -34 10 -3 0 -35 -9 11 -20 -28 3 7 -5 -53 -5 21 -1 -25
4479b5L6r%k6J3M8p2L9j7L3j3J1j3OoqL2jn7J0L0jl4K0M0k8k0K4rJ6k3l4O0j3
$$ -25 11 2 2 -24 -11 37 -35 4 -13 20 7 18 5 11 5 -3 29 28 -29 -19 11 10 -24 -4 36 8 -12 12 3 19 -4 -38 22 9
4513Ikk1J8Rrl7L6K5n5K8J1j9LJ4Lm0K1J9nj3pJ4Pk7J0J3L7m3pJ5QJ2n1L4Rk0
$$ 9 7 -14 4 13 4 -33 3 28 -27 1 12 -7 -4 10 13 -27 -6 13 8 -5 -12 2 9 -18 -8 5 42 -1 -8 7 15 27 -24 10 19 -1
4549aN%J8k0kJk2K3lJ7kk2PrK8k4k3K9J7j4k6K4Mk5OJ9%oJ1rORj7J3K2l8JJ8j2
$$ -1 4 4 22 2 0 1 -21 2 -1 16 14 -8 -1 -10 18 -6 -29 0 17 3 -23 1 5 -20 -14 5 5 -1 10 1 7 16 -1 12 34 -4 -3 15 3
4588Ck9L5K6n3JJ6J4j1k6ORjk4MM0J3k9j6L7J6l2j5L0opj6M1k6j2OL7l7L0J5k3
$$ 3 -26 9 35 -18 -17 -1 13 2 -24 -18 -9 -10 -34 -30 10 23 -6 -22 15 31 -1 -16 14 8 1 -15 26 0 -12 -6 31 -6 24 39 16
4623A6JrKoj7J1J2K1k9Jk0L1l7N%M0n6MJ9L4k1n%jj7J7%J5j4k3N7k9qpJ8nqJ5
$$ 16 17 8 10 4 -13 -2 10 31 2 3 -17 14 -23 -18 -18 22 -34 -30 -11 23 2 -3 -3 -4 -21 -4 -4 11 -3 -26 31 2 -6 -13 5 0 -8 7
4661Gn1L6j3J1j2J7RqJ1%l2M1Qj5j6L7j5k3k7M5j0j2J7kJ4k9J8k%l3MjM1l1J7
$$ 7 -44 -8 -21 -10 -22 -5 4 -4 7 7 -25 16 24 9 -7 30 15 -8 -35 10 0 -12 5 3 17 -12 6 4 4 -29 -25 -26 15 -16 1
4696AJ6J8o6J5K1J4n0K3K2J2ql8K7K5k4l9M3pJl2K8lJ3j4j5M4k1j5J7Mk6lK8j1
$$ 1 17 35 -31 -16 5 19 -31 -8 14 26 18 -20 7 32 8 -31 12 5 6 -26 2 -1 12 -2 -17 27 6 -9 8 12 -14 -17 11 0
4730@j5kK2k5NLL7k1j2j9N1k1J8k2lJ6oJ0j3Mj7PNjLkMml1L5krj2jJ1Ql6K9J5
$$ 0 -15 -17 5 -20 -15 -12 25 4 -8 -27 24 3 21 -1 -4 12 6 16 3 7 -10 -3 2 1 4 2 6 2 -29 6 4 -5 -17 -18 -7 1 -35 -6 9
4769IOj4k0N4k4l9L3j%%K2Ol5oPK3k6J1Mkj4oJ3Kj9ON6j8k2JkJ0j7MJ8rj2lK6
$$ 9 15 1 -19 35 11 -28 5 4 4 4 26 32 -3 -9 -2 21 -5 6 10 8 -6 -12 1 3 -16 -10 46 28 6 7 5 15 -2 2 20 11 -1 -4 22
4808B2j7K2k9J1lk8NL0j6j9M1k1K9Kj6lj3m5L8Roj5M4k2J2l6J1L7k3j3OJ0J9n1
$$ 22 5 27 -2 9 6 -22 -17 13 -3 -22 19 -2 27 29 13 10 -3 -48 -10 -1 -7 -22 22 0 12 -24 -13 24 1 -12 -6 4 23 -28
4842b8M1J9j9jj4K5k0k2JK7k9qJ4L6j8l3J8%jOLJ4nk0L8mPl8K1Rl5j0K1K8j8m
$$ -28 13 32 13 12 -2 23 3 -19 -18 9 -20 -28 -14 22 4 -29 -11 -11 -12 -6 -3 11 6 -14 24 20 27 -11 10 19 -16 -26 -5 23 5 1
4878AKJ7j1%kJ1k5J7Loj7J3QNNk1KK6l1j5N1k5opJ1Rl8L2J6l8J8Omj4l2N3j2M
$$ 1 3 20 9 9 7 18 -7 10 13 7 -10 3 11 16 21 0 2 28 -3 -18 33 8 2 -5 6 15 -23 9 25 -13 5 11 7 -7 -39 14 2 6
4916Fk1lM1j5j2JK3j0pMlj6J1L6m6J1Mj1K2j6j2J3K5j9j6rM9o0%K6K6k6nj3M4
$$ 6 -15 -18 23 8 -4 -3 20 10 3 7 4 -12 -1 35 -11 0 4 -7 15 -1 -13 0 25 6 -10 -19 30 -30 -30 -4 22 -4 -9 -22 22
4951B2l4k1K2Qnj5L3mkmJ4J2k2l1N3k3Pj7L2j7nk1M7rj1Rrk4MKL2l2j4K2%K0m3
$$ 22 -12 -33 -11 -3 -8 -23 10 6 4 0 14 26 4 -27 26 3 10 -7 25 8 3 -18 29 20 9 18 9 -15 -11 -9 23 -9 -23 -1 -1 19 -24
4988b4J9K7l1Rj4nL5m5J5K4Nj8J7j2qJ6j9L5m4L5rJ4J0k1k1J5j5JPJ6qk3rL2p
$$ -24 -5 22 -9 0 -14 -19 16 -29 -14 10 15 -3 14 2 -6 10 -9 26 -18 17 8 22 32 11 -10 5 -10 -9 -2 14 6 -17 -26 6 -1
5023ak7M3K0m6J8j5J3jk5OJ3LPK4j2j5j3J8lj7J8poj2J6J6lj7jL0l8J1K2J4k9
$$ -1 -28 15 35 -11 7 -8 5 4 -21 -15 -2 1 8 32 20 5 -8 10 7 -10 8 1 -5 -17 -1 15 12 -5 -6 24 -14 -3 19 33 4
5058DJ3m%k8J2LO1l6k9Rqk6mL0Rk9j4K9J1k7M4pk8J5l9L3J3nj4j6M2nnKpQj9J1
$$ 4 17 13 13 -15 -3 0 61 25 -4 5 -3 -29 -33 -3 6 -23 -37 -8 3 -24 20 13 -15 0 -39 -6 7 2 -12 -28 14 9 4 6 -1 7 -12 -1
5096aOk0K1L6m4kL4l2PL2l7nK7m1J9J3olm1J6L6j8JlJ0j5KQJ6l4%J1N6o6PJkK6
$$ -1 5 -15 6 42 -2 -4 30 -2 5 37 0 -5 22 -19 0 13 7 4 -37 -21 15 -3 -2 -5 5 -10 -8 0 16 -18 -18 -7 49 -17 -10 -9 -11 15
5134A5l2K7J0J5m2J2K1j1j5Mj3J2j1K9l5KJ6Roj2k1L7j3k6M5j9k7J8j4NK4j9L7
$$ 15 -17 10 20 35 -7 5 26 15 0 4 -9 3 -8 21 -14 -12 4 13 7 -5 -26 11 -2 -28 17 -2 -29 -11 -25 -20 4 -15 22
5167B2pnl3RoJ4J1Qj7J1j2nM3k6j0JJ7l8L5k4J5rP%K2k3qK0k1L1k9K0omj3J7j0
$$ 22 15 10 -23 -14 -20 -6 5 13 -4 7 -5 -10 33 7 -3 -2 15 -23 12 -12 3 -6 1 1 23 0 -8 12 -9 22 -7 13 7 3 -10 7 -3
5204ck0J7JRl1J1J0j3J1j9J3L6pk1L1l1oORJ8l7jK7k8RL2j5j7PRJ1K5n8J2k2K5
$$ -3 -23 -6 -5 4 -27 -16 -6 -19 -8 -27 -14 22 15 -6 25 -6 -12 -6 3 21 -16 -17 10 -18 -9 23 8 -9 -2 7 18 43 -15 -3 -25 0
5240@j3J0j2K7j4qOmJ6k0J5pOJ1j7J1k5J3J3pk8M6j3j6lL2Kl0J3L3k9k7kj1K4
$$ 0 -13 -3 -15 12 -2 -10 -4 -8 8 -12 3 -4 2 13 -4 7 -18 -5 8 1 -27 19 6 -10 -13 19 21 -9 4 37 8 -19 -21 -32 -8
5275hj0J5K9k8oOj6K8k7j1M2j7oK5j0l6K4OROl9K7p%L0j4J0j8l5K4NJ5k4K6kj7
$$ -8 -18 -3 26 -2 -8 -2 -18 10 -17 -28 14 -3 -9 16 6 -30 -6 0 9 15 -24 3 -4 -4 26 12 22 4 -31 -7 -2 13 -11 15 13 -4
5311dkK7%k1JK9j9k6L5qJ6m0K2k9K5qlL3m0J4j8m%k0K2J8kj4kJ9ol1L3JjkljK7
$$ -4 -6 21 21 0 1 30 11 -15 20 12 28 -12 10 -19 6 -2 -5 28 -12 2 -16 -20 -20 -40 -18 0 -2 -16 -18 1 -5 -36 -3 -2 -3 -5 -8 -9 18
5350A8m0J7J6Mk9K3rmKl4L7k3J7L8lk9k1J7j5L2m5K4L8k5oJ1Ql0J5mJ7j6l1K0
$$ 18 -22 -5 11 15 -14 9 0 -4 -2 -36 1 -22 -5 33 30 1 -20 -3 -18 14 -31 -7 31 6 0 11 19 -11 4 0 17 1 -30 -10
5384a0L3k7j0j9L8J0nJpqj3J9OOl4K4RloOnnk4K8k4J0kj1nJ6MjJ8oRJj4NJ0j9
$$ -10 23 -4 -14 -33 5 15 10 11 4 -4 -17 2 8 14 -20 4 13 10 4 10 5 0 -24 4 -20 -10 -12 -23 -28 -12 -8 -9 9 3 12 13 -1 4 14 -5
5424eJ9k2MmKRQjk2J8NqJ3k5PRJJjKpk0KQJ2j0K5j1j0k3J3k0N1k5jqJ9l0L6l4
$$ -5 14 -8 -4 -8 -6 3 11 10 -12 6 11 3 16 -9 -2 7 8 9 8 10 3 -17 -15 -7 5 -5 20 9 -1 -24 -11 -31 20 -5 -6 -14 5 -25 11 -23
5464b3J1J1%L0j2k0k0J7MJ2Rql8L6nokJ7j7kNrj6O2j6k3rJ2j8j2L6%rol2M5j3
$$ -23 -12 -1 -1 29 17 -3 -23 -6 -2 10 19 11 -27 9 4 -2 -4 13 -4 -6 -1 -10 -26 36 20 -3 -12 0 -18 -30 6 6 -3 -9 -41 4 -9
5501iJ4j2K1j7j3J4K4k3J4rLj8QJ8J0k4OJ6oj3JR%j5j3K8j2rLMj7J7%j6J4KRp
$$ -9 5 -7 14 -3 -16 -2 22 -1 13 4 7 -11 -3 15 25 1 7 23 17 4 5 14 14 -1 -14 14 2 -7 -4 0 -17 0 0 -16 -2 0 9 2
5539BjjK6j5l5L6k1NJNk6L5k3%NRnk8O6n0LNJ3LK0j2j2KJ3k0LK0j8mJ8kpl3N4
$$ 2 1 0 26 11 -24 12 -9 -4 -3 2 -24 11 -12 -12 -7 2 -3 -31 35 -15 -12 -7 6 9 29 17 5 7 20 0 3 23 5 1 19 17 10 -23 31
5578C1k3qj5%M7m1J2nJ2ok0J2L4n1NK3j1KJ8j1J8l7NL1j6Lk0LJ2m3K6K0MNk1M3
$$ 31 8 0 -15 -15 32 -9 3 -2 10 4 -16 -4 30 -21 -16 7 -4 -2 16 5 23 -14 -9 22 6 9 -11 -8 4 -39 -13 7 11 16 -5 38
5614C8l2J4n6L4j4mK1oj2J1k3L6n0J8L1j9jLj9L7qk7K7J5pJ6k4j4M3m3K1j9lJ1
$$ 38 6 20 -36 -2 -16 -20 1 -5 -17 -6 -29 7 -43 -25 6 -13 -14 -11 -30 7 -1 -28 -1 14 7 23 -1 -15 28 -15 6 -13 -16 -5
5648eJ9mk6L5k0J8nj8K1j3J4pj5Pl4M5l5K4l4M8mqnJk0J1Lk0J1MpK0J4lk8K9J8
$$ -5 14 10 -16 19 -1 17 12 -6 15 2 16 9 -6 1 -33 12 -23 1 -33 15 11 3 -2 -1 -21 -10 -7 -27 -16 -12 -19 1 15 12 -16 13 31
5685C1l5J0RJ8l5J9qJ7pQj4pQk1J2KJj9J1J5Ljk5MmPj3J3J6k9K4Rl8L5k4j9J7
$$ 31 -4 6 15 33 -2 17 9 26 19 27 13 6 14 -7 5 7 8 -11 0 15 18 17 -8 -4 -8 -1 -14 -1 15 -14 10 19 -19 16 -8 -27 -10
5722a0J9jj8j0K2k6J7Jj1J9QMj9J8j5J5j1PNJMj5nK4lMk5j7K3j5J0j0j0K8K1l1
$$ -10 9 8 -10 -20 2 -24 -7 -6 -17 2 10 14 -5 13 -2 13 2 9 14 15 19 4 -1 23 20 24 -1 -18 5 -10 0 -10 -20 8 29 -2
5758bj9N6k3k7J2j9K5j1rK8k5K0kN%k1J5Nkmj5j2M0pqJ0k0K0l7N9k6j1j5OJ9k3
$$ -2 -21 35 12 -15 -3 -22 3 -8 -17 11 -14 6 4 9 9 -12 3 8 6 2 -13 -25 15 8 0 10 -10 10 -27 32 6 -5 -20 -14 5 -18
5794a8J9j1j8K3Ml9M5j9J4j1JM7m9J7l7M0k0K5nmJ0l1j2kM8Nk2MK4nl3K1pMrj
$$ -18 1 -10 -28 -5 -1 -40 5 -14 0 -11 -10 37 -12 5 -32 8 -12 13 8 4 14 -17 -29 -31 17 22 0 4 28 23 -10 11 4 8 -1 -2
5830bmJ2Kqk2J8J0Pk0Ok7K2j1J8k6J4J8k2j3QPj3K4%j0KK5j6n%j1N3l7j2K7Jk
$$ -2 -6 6 8 0 -22 -4 6 13 -7 -1 -28 -6 -17 1 -25 -11 7 -15 -28 -20 -13 -26 -2 -2 -12 -10 15 -1 -6 -6 -17 36 -1 -13 14 15 13
5867A3K1l7LL%j8Oqj1N2k3qJ4k2K9j2k4j6M3J2k0k4M4l4qQJ0K4l4K5j1PPkkOm
$$ 13 34 -3 0 3 3 -15 -9 -17 -28 24 1 -7 7 -15 14 2 -22 -38 5 17 -3 -27 17 -17 -25 -17 -7 17 -17 8 -3 4 11 9 7 13 9
5904IOnOpJ3J4m0rrJ5l0L4Pj5K7j8l7K5K0k9J3K1nj7J4J3j1j6K4J2m1K3%J5k2
$$ 9 15 10 16 9 22 36 -4 -13 -22 -7 -37 -3 4 -11 16 -2 -39 -14 6 -23 -10 11 6 -11 3 16 5 -11 13 25 -16 7 7 22 0
5939@j9J9kJ2lQk3L3m9J6NQKJ4K2n8J6K0l7K4j2nLk2K1K9j7j8L5m1oM2k5orkO
$$ 0 -19 0 -2 10 7 15 -8 25 -24 -8 -3 5 7 21 43 -15 1 21 -16 8 -4 -9 -6 -28 -7 22 5 -13 22 -19 -25 17 -8 -14 -23 -25 -19
5976a9J9pJ7j3mK6l6J4J1k5ML0k0J8pK3k6Qk2L9j3Kk6J5Rnj4J5j0j7QKK0j7L%
$$ -19 0 -7 10 -3 -7 19 -17 -3 8 -17 -13 17 -3 15 8 31 5 13 -9 30 17 19 -7 8 17 12 -2 13 3 -14 -6 -4 16 -1 2 2
6012BOj1JmJ0Ql3J8nmJ2kJ0qkK1Opl7RLQJ8Nj2Prj6J5l8K8ORj1j1K9j4k0L4j5
$$ 2 8 -3 -2 -6 4 12 -21 -3 -8 -12 0 -2 8 0 -2 19 25 18 -19 -10 -7 1 19 24 12 19 10 -6 9 -29 -1 5 14 3 -8 21 7 -13 21 6
6052FJ4k9K2jj6qL3m1L6j9J0j0j0K3k3j2NK3j9PK7j6K%j2J0NK8m0j0J4lK7k5k
$$ 6 20 -9 13 12 -4 -12 21 -20 16 -3 7 -3 -13 10 -13 -25 -20 3 -16 -9 18 2 4 4 -8 2 7 35 -5 -15 -1 -4 23 -2 -4
6087dK8j8j4J0mj6j7K3J3MqK2m0J0J8j1Krj1J1J4J1k3j3J1K9l6J9J4j4J5mjMj2
$$ -4 24 6 -8 2 -2 -18 -35 -12 1 5 -3 19 -21 -11 7 -4 -2 -11 -22 -11 3 14 -9 -22 -11 18 -18 1 15 1 16 12 11 15 3
6122CnNk5K0J5Rk3K5j6j8QjJ6kj8m0N4K0l5j0j1J1L0k7j3L8l0NJ0lj7L6J0j9j8
$$ 3 -2 3 -22 -2 13 22 -1 24 8 -10 -2 -3 13 11 -7 -47 7 27 -8 -18 -29 -18 12 -15 -28 10 -20 -15 -5 -8 -25 11 21 2 -16
6157a6NK1Mm0L1l0L9k9K5nK6k8Pj8Mj2Rk2K5J4l5L9k3J0k4M1k5mMJ2k1J0j9L7
$$ -16 -11 10 14 -26 5 -25 14 -15 10 5 31 3 10 -8 -4 -16 -7 -29 -4 10 -25 14 -9 1 -23 18 -7 -11 -7 5 -16 -6 -25 12
6191A2j4nj2K6Rj6r%JL7j8Jj9mK4Jj2k2K0j1K1OMOpMk9j0QJ4k2Rj2M5n5K6k0L9
$$ 12 -2 -7 -19 7 16 0 -9 -9 -8 29 11 12 -7 -11 13 14 2 -20 0 -11 10 16 20 26 19 23 -6 -16 -8 6 -16 -7 -19 26 -29 -3 -23 16
6229A6k8j3j5M1J7l2K8%k5OlpNNj0KRJ9qLk1J8Jqrj9J4R%QMj8LpK5Mj4m9M4J6
$$ 16 -12 -25 -40 1 18 -14 14 14 -11 -5 -8 -15 -10 -5 -15 -13 -4 15 7 10 -11 7 8 0 -9 -28 -14 -5 -5 3 7 -11 -8 -15 10 14 0 -49 -5 11
6269A1k7J1Njqjj8J8KpJ2lL6l5NJ6j5oKMj1J3pK5l6O%L3l0j1Mj%J4K3n9M1j8J1
$$ 11 -16 -5 0 -1 -9 -10 -28 -10 -8 -15 -3 -6 30 -5 0 16 1 -5 -3 1 -10 3 -4 21 -15 -9 -9 24 -6 -17 -13 -14 -14 0 23 -36 5 -13 -2
6308bNk0KMM6j3k2pj6K6rKnLj1QJ9j5j0K1lj6J9mJ5j1rK4l0L9m6K5k0NJ8k8K4
$$ -2 3 -17 -15 -11 35 22 0 -7 -23 3 -6 -4 -9 -6 -17 -9 10 -5 -15 6 3 -13 6 2 17 6 -3 21 -9 30 -16 9 -11 -6 12 -16 8
6345HOk5OK0j3J1m0J5Lk6M0NrjJ6k2RJ6k6jk6M1ooJ3%K1rJ0j8Nl1J1pLJ5J2k0
$$ 8 14 -11 -5 15 2 13 -27 -12 -9 -35 5 10 1 0 16 -6 3 19 -7 -8 -34 7 1 -5 8 8 29 20 30 12 17 -14 -3 -10 -7 8 20 0
6383@PK2k3l1K6kj8NJ5j4j6J3lJ2JL3m6K0mj0j2J5J7Kk1jK8k0L8l9pK0%MQk8l
$$ 0 7 29 6 -25 1 -1 -19 -14 1 -13 -29 -16 -19 -7 -6 27 -19 1 -3 -13 -25 -10 7 9 -12 -13 15 -5 33 -6 -13 7 7 11 19 -9 -12
6420a2oJ1rL6l1K4j6PkjlpjJ3kONl1Qj9j5K2J7Nl3M2qj0LMk3K3MKKj5L0j4%rq
$$ -12 -18 -7 -16 20 -11 13 -3 4 2 1 -2 -9 -10 3 1 7 12 -19 -11 -30 -45 -23 -6 -1 -34 8 0 -10 -7 -3 -26 -3 1 3 5 -10 20 6 6 -3 -11
6461a1K1j7J2j3J1J5k5L6k9J9nJ5k9kLj6QJ0Kj7nnK9l7J4Mk6N5k9J7%k0J9%kj
$$ -11 10 -7 5 -8 3 18 -7 29 0 19 14 29 0 -2 1 -15 -7 3 5 -12 -17 -22 7 -30 -16 -12 -38 17 -12 5 5 -15 4 4 2 1
6497Aj%NpkL7k7qJ3j9KK0k1nNkN1l4k7NJ3j5QK1l0M%K6j6MPk3J6Jk4nN8l8J6k3
$$ 1 0 0 5 -2 -4 33 6 -2 11 -8 -6 14 -7 -12 -7 -9 42 8 -19 -14 -1 -16 -8 13 -17 -13 -13 13 -3 1 8 -15 1 2 -22 -27 31 -7 9 -14
6537a4NK7m1J1pQoLK8K2k7jPqqJ2j9L2m4L0k2K1oPk6K3ploj6K2%Pj8j3M3l0QJ6
$$ -14 -9 18 -23 -12 -19 -11 -17 -14 14 36 9 8 15 7 -1 11 -8 24 -20 10 -12 9 3 10 -16 7 0 -3 -9 -25 -3 -3 4 -14 -27 16 -14 -6 10
6576A0k5K8K1m2j1K8lRk1QJ6j7Rmj2l6M1JqK8l8K5k3J8J3qKj4mK8l6J5KQj2j5
$$ 10 -15 13 34 -8 -19 9 6 15 -6 2 18 1 10 6 -6 -42 -1 0 -8 20 -18 7 -16 2 15 7 9 -5 -9 19 -17 -2 0 8 -4 -19
6612a9J5l0K1K8l7K5k5J1J8J1Ql1rJ1Nk0M1m0kJ0PLKJ0j9Jj0mK6k0rK1PJj4l7
$$ -19 -4 -34 -13 15 -22 3 -22 -11 7 18 26 -5 -14 -3 2 -18 23 -17 -19 -9 -2 1 3 13 -6 -5 -15 -19 7 -13 -22 -1 6 7 -7 -44
6648d4L7Kl%j5J4jlRQj1j9jmL2LMk0lJ8J7o0L3KJ4jj1J9j0j7J6j6oJ0J7n6N4k7
$$ -44 -7 -5 -8 -8 -23 -9 -10 -13 -4 4 -7 -26 -27 -31 1 4 8 -12 -15 3 20 -40 -7 -5 9 8 -3 16 6 -11 5 -11 -17 -7 10 -46 8 -19
6686a9pM1m7NJ0J1%j2J6Mj9qJ8Omk2K1pjJ5j9Rqj0rM5k2K5rkJNJ4k1J1l3RRk2
$$ -19 -26 15 -32 -27 -17 -6 -6 -18 -2 2 -17 -25 -7 -1 -5 -27 -6 -13 -14 1 -18 -9 -17 -27 -36 9 -13 12 3 1 2 7 21 0 11 -22 -13 -4 -26
6725b6M1k1MK7l5qJM2k0j6J4k2J8l1PK2j1nJ6jPj0k7K2LJ6j6NmNl9L9J6rOMMk6
$$ -26 15 -6 -2 25 -10 -18 -17 25 5 -11 3 -19 -1 -32 -25 -3 -14 -19 -3 -4 3 -7 -34 -12 -9 7 -9 -4 -8 -3 -42 -3 13 4 10 14 18 -8
6763hj1L6Qjrk9OJ8k1L1j6l5K8oj6J7rQ%k4J4J4J0j7KJ9j5jqj1RK8j7kj2L7kl3
$$ -8 -19 17 25 24 15 -14 -8 10 -11 20 4 -31 -3 -9 -25 -8 -17 -9 -9 -33 -19 -5 5 -12 -10 9 -6 -7 -15 -26 -17 11 -6 -8 -20 17 15 -18
6801a8J9Ooj8L1k6J2J5j5j3K9j7J2ol3J2K5j0Lmrl%L0l9K1j3lnJ3j1J8K2p7M6
$$ -18 1 7 1 -17 14 -12 0 15 0 -13 16 -1 11 5 -28 -16 9 -1 2 -2 -11 -14 -14 16 -23 -2 -15 -18 -23 -10 -21 -3 19 -58 -12
6836a2mJ1k5M2j9J1k%mqNoPNpMPMrJ0Ml1NknNRJ0Pj1%j4nJ7k7L4Qm1J1j0qJ8L
$$ -12 -16 -5 -30 12 -7 4 2 2 -2 -10 -5 -11 -4 1 -6 -2 5 9 0 10 14 -17 -12 -14 -19 -14 -5 5 12 1 1 -13 -18 -1 -28 6 14 -27 -16 -26 -34 -16 -13
6879a3k3K8K3k3PpJ0j0JmJ6j3qJ1JJ1k0K3k9K0lJnl0J2J0L1l3NjJ0mj1lJ4rjR
$$ -13 -36 -8 15 -8 -1 -8 2 -8 -7 -11 5 -8 -16 -5 -4 7 -13 10 -19 1 -2 -1 -6 -36 -24 -14 17 -16 -11 -12 -2 -6 -17 -20 -6 -15 -16 -7
6917g%lJ0MJpk0K0Mk5RJ7J6nk5J6Nl0K6Jj2j5K7Pj0j0lJ1J2k7J1Oj2nl5M4j0J7
$$ -7 -7 -10 0 4 5 -2 -22 -2 2 -23 -14 3 19 14 -11 5 10 -20 6 7 -5 -20 7 14 4 -6 -9 2 14 -13 -2 4 -8 -13 -48 -4 -14 3
6955Ck5J3%j1kK1k5J0K0K1k1J5j9%mk5K6Pkk5K8j4nOkj1J2J2llK2l0J0j2Nk7L0
$$ 3 -22 -9 -9 -20 -22 -1 -26 -16 4 25 4 19 0 0 -4 -29 -3 4 2 -23 5 -9 -14 -8 -10 -21 -9 3 0 -3 19 -11 -1 -13 -8 -35 -5
6992eJ0j4j5J0k3kK3mRNj0kK0mj6J4pJ6Lj8QmJ4j5NK1j4j2J7lj8q%J5JMj4Pj8
$$ -5 5 -9 -24 -14 -37 -39 -16 -20 -11 -6 -16 -18 2 -2 -18 -4 -11 5 8 -10 -2 -6 8 -7 -2 19 5 -7 10 7 -11 -19 -19 -4 -3 1 -13 -6 -24
7031b4QJ0rJ5J4k5kjL4j0j6j9RQk3QML7l0J0loj3K3K1l0K6j0j3J3nrK7j4nmJ1
$$ -24 -16 -6 -15 0 14 -11 -13 -14 20 10 -6 -25 -16 -8 -31 -23 -19 18 -12 -2 -5 -11 -24 -1 20 -10 16 6 -7 6 1 -8 19 5 0 -4 7
$$ [...]
8191a3
##END NTUPLES=NMR FID
##END=
