##TITLE=1H_Pr 505-Me-2
 200.13MHz, CDCl3,
 8 sc
 
 27.3.2025
##JCAMPDX= 6.0         $$ Bruker NMR JCAMP-DX V2.0
##DATA TYPE= NMR FID
##DATA CLASS= NTUPLES
##ORIGIN= UXNMR, Bruker Analytische Messtechnik GmbH
##OWNER= pz
$$ XWIN-NMR		Version 3.5
$$ Thu Mar 27 16:15:30 2025 Russian Standard Time (UT+4h)  she@DPX200
##.OBSERVE FREQUENCY= 200.1313
##.OBSERVE NUCLEUS= ^1H
##.DELAY= (6, 6)
##.ACQUISITION MODE= SIMULTANEOUS
##.ACQUISITION SCHEME= undefined
##.AVERAGES= 8
##.DIGITISER RES= 18
##SPECTROMETER/DATA SYSTEM= spect
##.PULSE SEQUENCE= zg30
##.SOLVENT NAME= CDCl3
##.SHIFT REFERENCE= (INTERNAL, CDCl3, 0, 14.3821)
##AUDIT TRAIL= $$ (NUMBER, WHEN, WHO, WHERE, WHAT)
$$ ##TITLE= Audit trail, XWIN-NMR		Version 3.5
$$ ##JCAMPDX= 5.01
$$ ##ORIGIN= Bruker BioSpin GmbH
$$ ##OWNER= she
$$ F:/spectra/data/she/nmr/H-C/1/audita.txt
$$ ##AUDIT TRAIL=  $$ (NUMBER, WHEN, WHO, WHERE, WHAT)
(   1,<2025-03-27 16:13:59.25 +0400>,<she>,<DPX200>,
      <created by zg, POWCHK disabled, PULCHK disabled
       configuration hash MD5:
       00 E9 B6 7A A2 85 ED C7 34 08 36 98 17 FE 4E 26
       data hash MD5: 16K
       30 94 21 26 27 6E 6C AE 53 7B FA 69 6F F7 DA 7E>)
$$ ##END=
$$ 
$$ hash MD5
$$ 14 EC 52 9F A3 3C 58 FA 45 78 D9 06 BB B2 8A 42
##$RELAX= 
##$RELAX= 
##$RELAX= 
##$RELAX= 
##$RELAX= 
##$RELAX= 
$$ Bruker specific parameters
$$ --------------------------
##$DU= <F:/spectra>
##$EXPNO= 1
##$NAME= <H-C>
##$PROCNO= 1
##$TYPE= <nmr>
##$USER= <she>
##$AMP= (0..31)
100 100 100 100 100 100 100 100 100 100 100 100 100 100 100 100 100 100 
100 100 100 100 100 100 100 100 100 100 100 100 100 100 
##$AQSEQ= 0
##$AQ_mod= 1
##$AUNM= <au_zg>
##$AUTOPOS= <>
##$BF1= 200.13
##$BF2= 200.13
##$BF3= 200.13
##$BF4= 200.13
##$BF5= 200.13
##$BF6= 200.13
##$BF7= 200.13
##$BF8= 200.13
##$BYTORDA= 1
##$CFDGTYP= 0
##$CFRGTYP= 5
##$CHEMSTR= <none>
##$CNST= (0..31)
1 1 145 1 1 1 1 1 1 1 1 1 1 1 1 1 1 1 1 1 1 1 1 1 1 1 1 1 1 1 1 1 
##$CPDPRG= <>
##$CPDPRG1= <>
##$CPDPRG2= <>
##$CPDPRG3= <>
##$CPDPRG4= <mlev>
##$CPDPRG5= <mlev>
##$CPDPRG6= <mlev>
##$CPDPRG7= <mlev>
##$CPDPRG8= <mlev>
##$CPDPRGB= <>
##$CPDPRGT= <>
##$D= (0..31)
0 0.7 0 0 0 0 0 0 0 0 0 0.03 0 0 0 0 0 0 0 0 0 0 0 0 0 0 0 0 0 0 0 0 
##$DATE= 1743077638
##$DBL= (0..7)
120 120 120 120 120 120 120 120 
##$DBP= (0..7)
150 150 150 150 150 150 150 150 
##$DBP07= 0
##$DBPNAM0= <>
##$DBPNAM1= <>
##$DBPNAM2= <>
##$DBPNAM3= <>
##$DBPNAM4= <>
##$DBPNAM5= <>
##$DBPNAM6= <>
##$DBPNAM7= <>
##$DBPOAL= (0..7)
0.5 0.5 0.5 0.5 0.5 0.5 0.5 0.5 
##$DBPOFFS= (0..7)
0 0 0 0 0 0 0 0 
##$DE= 6
##$DECBNUC= <off>
##$DECIM= 32
##$DECNUC= <off>
##$DECSTAT= 4
##$DIGMOD= 1
##$DIGTYP= 9
##$DL= (0..7)
0 120 120 120 120 120 120 120 
##$DP= (0..7)
150 150 150 150 150 150 150 150 
##$DP07= 0
##$DPNAME0= <>
##$DPNAME1= <>
##$DPNAME2= <>
##$DPNAME3= <>
##$DPNAME4= <>
##$DPNAME5= <>
##$DPNAME6= <>
##$DPNAME7= <>
##$DPOAL= (0..7)
0.5 0.5 0.5 0.5 0.5 0.5 0.5 0.5 
##$DPOFFS= (0..7)
0 0 0 0 0 0 0 0 
##$DQDMODE= 0
##$DR= 18
##$DS= 0
##$DSLIST= <SSSSSSSSSSSSSSS>
$$ [...]
##$SUBNAM0= <"">
##$SUBNAM1= <"">
##$SUBNAM2= <"">
##$SUBNAM3= <"">
##$SUBNAM4= <"">
##$SUBNAM5= <"">
##$SUBNAM6= <"">
##$SUBNAM7= <"">
##$SUBNAM8= <"">
##$SUBNAM9= <"">
##$SW= 18.0517328524113
##$SWIBOX= (0..15)
0 0 2 0 0 0 0 0 0 0 0 0 0 0 0 0 
##$SW_h= 3612.71676300578
##$TD= 16384
##$TD0= 1
##$TE= 0
##$TE2= 300
##$TE3= 300
##$TEG= 300
##$TL= (0..7)
0 120 120 120 120 120 120 120 
##$TP= (0..7)
150 150 150 150 150 150 150 150 
##$TP07= 0
##$TPNAME0= <>
##$TPNAME1= <>
##$TPNAME2= <>
##$TPNAME3= <>
##$TPNAME4= <>
##$TPNAME5= <>
##$TPNAME6= <>
##$TPNAME7= <>
##$TPOAL= (0..7)
0.5 0.5 0.5 0.5 0.5 0.5 0.5 0.5 
##$TPOFFS= (0..7)
0 0 0 0 0 0 0 0 
##$TUNHIN= 0
##$TUNHOUT= 0
##$TUNXOUT= 0
##$USERA1= <user>
##$USERA2= <user>
##$USERA3= <user>
##$USERA4= <user>
##$USERA5= <user>
##$V9= 5
##$VALIST= <valist>
##$VCLIST= <CCCCCCCCCCCCCCC>
##$VD= 0
##$VDLIST= <DDDDDDDDDDDDDDD>
##$VPLIST= <PPPPPPPPPPPPPPP>
##$VTLIST= <TTTTTTTTTTTTTTT>
##$WBST= 1024
##$WBSW= 4
##$XGAIN= (0..3)
0 0 0 0 
##$XL= 0
##$YL= 0
##$YMAX_a= 380104
##$YMIN_a= -560528
##$ZGOPTNS= <>
##$ZL1= 120
##$ZL2= 120
##$ZL3= 120
##$ZL4= 120
##$ABSF1= 10
##$ABSF2= 0
##$ABSG= 5
##$ABSL= 3
##$ALPHA= 0
##$AQORDER= 0
##$ASSFAC= 0
##$ASSFACI= 0
##$ASSFACX= 0
##$ASSWID= 0
##$AUNMP= <proc_1d>
##$AZFE= 0.1
##$AZFW= 0.1
##$BCFW= 1
##$BC_mod= 2
##$BYTORDP= 1
##$COROFFS= 0
##$CY= -3
##$DATMOD= 1
##$DC= 2
##$DFILT= <>
##$DTYPP= 0
##$F1P= 0
##$F2P= 0
##$FCOR= 0.5
##$FTSIZE= 0
##$FT_mod= 4
##$GAMMA= 1
##$GB= 0.15
##$INTBC= 1
##$INTSCL= 1
##$ISEN= 128
##$LB= 0.25
##$LEV0= 0
##$LPBIN= 0
##$MAXI= 10000
##$MC2= 0
##$MEAN= 0
##$ME_mod= 0
##$MI= 1.114404
##$NCOEF= 0
##$NC_proc= 0
##$NLEV= 6
##$NOISF1= 3.799351
##$NOISF2= 2.8
##$NSP= 1
##$NTH_PI= 0
##$NZP= 0
##$OFFSET= 14.38212
##$PC= 1
##$PHC0= -472.47
##$PHC1= 16.19221
##$PH_mod= 1
##$PKNL= yes
##$PPARMOD= 0
##$PSCAL= 0
##$PSIGN= 0
##$REVERSE= no
##$SF= 200.129724274929
##$SI= 16384
##$SIGF1= 3
##$SIGF2= 2
##$SINO= 400
##$SIOLD= 16384
##$SREGLST= <1H.CDCl3>
##$SSB= 0
##$STSI= 0
##$STSR= 0
##$SW_p= 3205.1282051282
##$SYMM= 0
##$S_DEV= 0
##$TDeff= 0
##$TDoff= 0
##$TI= <>
##$TILT= no
##$TM1= 0
##$TM2= 0
##$TOPLEV= 0
##$USERP1= <user>
##$USERP2= <user>
##$USERP3= <user>
##$USERP4= <user>
##$USERP5= <user>
##$WDW= 1
##$XDIM= 8192
##$YMAX_p= 0
##$YMIN_p= 0
$$ End of Bruker specific parameters
$$ ---------------------------------
##NTUPLES= NMR FID
##VAR_NAME=  TIME,          FID/REAL,        FID/IMAG
##SYMBOL=    X,             R,               I
##VAR_TYPE=  INDEPENDENT,   DEPENDENT,       DEPENDENT
##VAR_FORM=  AFFN,          ASDF,            ASDF
##VAR_DIM=   8192,          8192,            8192
##UNITS=     SECONDS,       ARBITRARY UNITS, ARBITRARY UNITS
##FACTOR=    0.0002768,     1,               1
##FIRST=     0,             0,               0
##LAST=      2.2672688,     0,               0
##MIN=       0,             -560528,         0
##MAX=       2.2672688,     380104,          0
$$ Real data points
##PAGE= N=1
##DATA TABLE= (X++(R..R)), XYDATA
$$ [...]
1780e71K37J780j363j416J688K78j467L54R23p91J78J008q08n04J038L48k045
$$ -571 -334 1446 83 -1333 355 633 -834 -480 443 -348 -170 838 30 -474 564 912 -1133
1797a133P62J589j281j332J600N41j460L5J050n27J1M09l19l86K040o43j700R99
$$ -1133 -371 1218 -63 -1395 205 746 -714 -679 371 -156 -145 264 -55 -441 1599 956 -744 255
1815B55J471j637j408J480M05j250n28R94k1l64J47l45M32J277l95j570J490J535
$$ 255 1726 89 -1319 161 566 -684 -1212 -218 -239 -603 -456 -801 -369 908 513 -1057 433 1968
1833A968j557r65J531N48j708n39J171p9q62j43k6K17Q02q17r92J642J056j749
$$ 1968 411 -554 977 1525 -183 -722 449 370 -492 -635 -661 -444 358 -459 -1451 191 1247 -502
1851e02n80K017M96j753l56J616O6j204k32J55O88q8j009j83J190N33j616q5J767
$$ -502 -1082 935 1431 -322 -678 938 1004 -200 -432 -277 411 323 -686 -869 321 854 -762 -847 920
1870I20J27j802j91J928l51j164q8N81Q54o45j081O14J115k33j497K88J798m03
$$ 920 1047 -755 -946 982 631 -533 -621 -40 814 169 -912 -298 817 584 -913 -625 1173 770
1888G70j574M21J386k48j396j13J078M16j061j010Q16J245o91j333P90J777q66
$$ 770 -804 -383 1003 755 -641 -754 324 740 -321 -1331 -515 730 39 -1294 -504 1273 407
1905D07j380R56R52l63r77J90P95L99j280m52Q55O52j096j040J039R98r01j038
$$ 407 -973 -17 935 572 -405 -215 580 979 -301 -753 102 754 -342 -1382 -343 655 -246 -1284
1923a284J405O70p27p95M50J123j72q96j6R18Q5j092p07J413N34j496l66R02L75
$$ -1284 121 791 64 -731 -281 842 670 -226 -242 676 761 -331 -1038 375 909 -587 -953 -51 324
1942C24n78m33K78J014j17r69J57J009J20j346k04J540J90j450j08J152q8p27
$$ 324 -254 -687 -409 605 488 -481 -324 685 805 -541 -745 795 985 -465 -573 579 491 -236
1960b36l48N62L29k72m04J10N83L10j420M32J363l65j407N94R40l09r31L94L59
$$ -236 -584 -22 307 35 -369 -259 324 634 -786 -354 1009 644 -763 -169 771 462 -469 -75 284
1979B84l08k50P7o3N79Q5j248L59J259p46p74P23Q22o62n38O73q3m23L31O7n82
$$ 284 -24 -274 -197 -260 319 404 -844 -485 774 28 -746 -23 799 137 -401 272 189 -234 97 164 -418
2000d18O29K44j009J99J089n79r16P44P43q28m18R95l69n50P25l04n03O05N00
$$ -418 211 455 -554 -355 734 155 -761 -17 726 -102 -520 475 106 -444 281 -23 -526 79 579
2019E79q70p1J008m04r33O58O71j115J56Q98l52o29P06q1q65M87Q69p09q39J376
$$ 579 -291 -362 646 242 -691 -33 638 -477 -321 577 225 -404 302 221 -644 -157 712 3 -836 540
2039E40j3j199M86R81j130j16J025m99m97J135j24j200L93J192j121o75J220J28
$$ 540 527 -672 -186 795 -335 -451 574 75 -422 713 589 -611 -218 974 -147 -822 398 526
2057E26j411P18N62r29N4R03n00m94J085J28j389P09J265j340r49J600K95j695
$$ 526 -885 -167 395 -534 -480 423 -77 -571 514 642 -747 -38 1227 -113 -1062 538 833 -862
2075h62M56R42p41o18J027l97l97J221k48j347Q52J408j703o17J735J01j671L92
$$ -862 -406 536 -205 -823 204 -193 -590 631 383 -964 -112 1296 -407 -1024 711 812 -859 -467
2093d67J146m98o54P31m02m11Q97L2j285Q41J273j615o83K282j28j953L99J534
$$ -467 679 181 -473 258 -144 -555 342 374 -911 -70 1203 -412 -1095 1187 1059 -894 -495 1039
2111A039q47j110R16K66o57M41J84j109Q70R39j511m03K084L29k422N01J996j240
$$ 1039 192 -918 -2 264 -393 48 232 -877 -7 932 -579 -982 1102 1431 -991 -490 1506 266
2129B66j299J142O24j074J97J38q75P92O17j320k06J770O3k009P36K079j489j172
$$ 266 -1033 109 733 -341 -144 -6 -881 -89 528 -792 -998 772 835 -1174 -438 1641 152 -1020
2147a020J525N10j192N6O21o40p3L74o63l00J609m22j811R24J751j438j082J656
$$ -1020 505 1015 -177 -121 500 -140 -213 161 -502 -802 807 385 -1426 -502 1249 -189 -1271 385
2165C85Q05j580j18Q40k69k26O25n25m19J243j89j635P50J828j550j299J639R18
$$ 385 1190 -390 -508 332 63 -163 462 -63 -482 761 572 -1063 -313 1515 -35 -1334 305 1223
2183A223j690k74J420o04p29R70o01m47Q03K03j417R81J330j339r72J634Q10j821
$$ 1223 -467 -741 679 75 -654 316 -285 -732 71 274 -1143 -162 1168 -171 -1143 491 1301 -520
2201e20L7J724q07r05J003m49o61Q14q3j094O61Q77j027q78J692O73j839J08J828
$$ -520 -483 1241 434 -471 532 83 -578 236 153 -941 -280 597 -430 -1308 384 1057 -782 -674 1154
2220A154q93j025J101J78n43N2N60j084K14R77q96r30J343M16j526K97J551r27
$$ 1154 261 -764 337 515 -28 24 584 -500 -286 691 -205 -1135 208 624 -902 -605 946 19
2238A9q49J090L39q30N27J38o00o8Q37o60q48J574q5j393L14J410p84j048J011
$$ 19 -830 260 599 -231 296 434 -166 -234 603 -57 -905 669 584 -809 -495 915 131 -917 94
2257I4N36j106K2J008r44m7Q30l31p82P93L04j018k2J152m20q78J021M18r42n0
$$ 94 630 -476 -454 554 -390 -437 393 62 -720 73 377 -641 -663 489 69 -809 212 630 -312 -362
2277c62Q68m89k69P20m42m94M88L60q61L4P81l20p27R48K05q82L25N90n76l60
$$ -362 506 17 -252 468 26 -468 20 380 -481 -447 334 14 -713 235 440 -442 -117 473 -103 -463
2297d63Q25k54m85N95J83m12k12P07l67p27O26K95m99j08P50m35m84Q35M7r10
$$ -463 362 108 -377 218 401 -11 -223 484 117 -610 16 311 -188 -296 454 19 -465 370 417 -493
2317d93L06O63o12j90M88O9l47J10J36k76J29K97n70l5N32M4n36m0Q33m92l98
$$ -493 -187 476 -136 -326 162 231 -116 -6 130 -146 -17 280 -290 -325 207 251 -285 -325 508 16 -382
2338c82N61K4l24k85M97j00k69K23RM5L19j15r09N94Q13o61o94Q52L44o57O9K99
$$ -382 179 203 -121 -406 91 -9 -278 -55 -46 -1 318 203 -706 -112 701 40 -654 198 542 -115 -46 253
2360B53k55r9P1j89J22P1J18n24M84K58l79m32P12L06p10j9N14q9l12j86K91o2
$$ 253 -2 -101 -30 -219 -97 -26 92 -432 52 310 -69 -501 211 517 -193 -212 302 213 -99 -285 6 -56
2382e6J17k42l11N82J41n11k69Q23K4n78j53P12j37m54J22L93J70k32l99K87J09
$$ -56 61 -181 -492 90 231 -280 -549 274 298 -280 -433 279 142 -312 -190 203 373 141 -258 29 138
2403A38j2l81J27M63q8n78r5P51j31l09j12L82J35m03j6J88K65m07j42L26J29
$$ 138 126 -255 -128 335 247 -331 -426 325 194 -115 -227 155 290 -113 -129 59 324 -83 -225 101 230
2424B30r3k96l0O32k08o25J16M84j00k75o5M14l5m59K85N7M77k72o01L61K78k69
$$ 230 137 -159 -189 443 235 -390 -274 210 110 -165 -230 184 149 -310 -25 32 509 237 -364 -3 275 6
2446Fl23k9P35k58p44L73P49k57n51J11N26l83q8O3J45O0m0l91K10N44m67k38
$$ 6 -317 -346 389 131 -613 -240 509 252 -299 -188 338 -45 -133 -70 75 135 95 -296 -86 458 -9 -247
2468b47J12N63o14j0J81K55j67k98J83K32k33j6oo5L51l55j94K75L06l80j70K89
$$ -247 -135 428 -186 -196 -15 240 73 -225 -42 190 -43 -59 -65 -130 221 -134 -328 -53 253 -127 -297 -8
2490hN68o58o1J13J45l12J31K17k08J11L7k89J01L32k39n22O41J92k83k73O85
$$ -8 560 -98 -159 -46 99 -213 -82 135 -73 38 75 -214 -113 219 -20 -542 99 291 8 -265 420
2511D20k27j98Q9j02Q9j30K14j75k49K49J90q16M24M56l66r7K48k8k86M17J43
$$ 420 193 -5 84 -18 71 -59 155 -20 -269 -20 170 -646 -222 234 -132 -229 19 -9 -295 122 265
2532B65m15J21L57l63n4K53K2l30J56L01o78K24L75k19k37lN61o18J91L34k06
$$ 265 -150 -29 328 -35 -89 164 186 -144 12 313 -365 -141 234 15 -222 -225 336 -282 -91 243 37
2553C7k51M85q3k23q5J23K4k42L28J24n32L85R4o47L40M43l16k58L09P8n00N19
$$ 37 -214 271 188 -35 -120 3 27 -215 113 237 -295 90 184 -463 -123 320 4 -254 55 133 -367 152
2575A52J75l75j54L00J05n36M42J1l53J86K28l97j2K57J90m61J36M40l34l99N12
$$ 152 327 -48 -202 98 203 -333 109 120 -233 -47 181 -216 -228 29 219 -242 -106 334 0 -399 113
2596A13N4l35K56k3k24r1M71j34n12O87N0p42L33L33j91l51M04K95k32k33K38
$$ 113 167 -168 88 65 -159 -250 221 87 -425 262 312 -430 -97 236 45 -306 98 393 161 -72 166
2617A66j92R7K50l98m9M29q3m44k9O19o9n16K50K43l82p8M17j27k21L77m36j47
$$ 166 -26 71 321 -77 -126 303 220 -224 -253 366 297 -219 31 274 -108 -186 231 104 -117 260 -176 -323
2639c23M63j46k72L52K24m26k19P46J11q57K70K21k29j92L24j32j55J90l4k63
$$ -323 140 -6 -278 74 298 -128 -347 399 510 -347 -77 144 -85 -277 47 -85 -240 -50 -84 -347
2659c47Q6N35k17n38O60Rn14J01M66K89n42k7j42J43J60j20j84Q8M92o23j98M69
$$ -347 -261 274 57 -481 179 188 -326 -225 241 530 -12 -39 -181 -38 122 2 -182 -94 398 -225 -423 46
2681D6L69n11j46N95l79j69RM10j32j32J11j67K01K05n71j93Q77j76m41J3N70
$$ 46 415 -96 -242 353 -26 -195 -186 224 92 -40 71 -96 105 310 -261 -454 423 247 -194 -181 389
2702C89m13j57J20K31j12p0m9J8J7K04k54j62L71k8m48L86M96n82j13K39Pj12
$$ 389 -24 -181 -61 170 58 -12 -61 -43 -26 178 -76 -238 133 105 -343 43 539 -43 -156 83 90 -22
2724b2k4M03m49j58K57j72L2K95J23n21K64O0q3k54L86P8n08R7J56K8L9M03l07
$$ -22 -46 357 -92 -250 7 -165 -133 162 285 -236 28 88 5 -249 137 215 -293 -196 -40 -12 27 430 123
2747A23l17L06k44r4L42J61m05k15L52K39n66K35L04k53J37k60J85Lj89J8J2P4
$$ 123 -194 112 -132 -226 116 277 -128 -343 9 248 -318 -83 221 -32 105 -155 30 33 -156 -138 -126 -52
2769e2K81k60J65j6j75o0M4K13j70k04K84o2j9J32j6j37J36L7j26j29L64j61k11
$$ -52 229 -31 134 118 -57 -117 -73 140 -30 -234 50 -12 -31 101 85 -52 84 121 -5 -134 230 69 -142
2792a42K02Q9j09K0m3q0j01K8O2j49L17j79m3Q9lJ03p2L2J71k98J31P3q7k49M51
$$ -142 60 149 40 60 17 -63 -164 -136 -74 -223 94 -85 -128 -39 -42 61 -11 21 192 -106 25 98 11 -238 213
2817B13j70j19LJ13j87L86l15J12p2P6j4lJ51m0J02l67J87r8L2j48K75r3j02J72
$$ 213 43 -76 -73 40 -147 239 -76 36 -36 40 26 23 174 134 236 -131 56 -42 -10 -158 117 24 -78 94
2841I4K3k04J06K2Jl0J3j28N9J00J1j33M4J53k02j55J20L33l10Q9O7j3LQ9k40
$$ 94 117 -87 19 41 42 12 25 -103 -44 56 67 -66 -22 131 -71 -226 -106 227 -83 6 73 60 63 152 -88
2866h8m1K85j85%j38M93l04l1j07J76l2O6k09J39oP2k88J81K9O6l17K87Pn0o8
$$ -88 -129 156 -29 -29 -167 326 22 -9 -116 60 28 94 -115 24 18 90 -198 -17 12 78 -239 48 55 5 -63
2891f3m5K73m8k00o1J77j58mJ95o9jq2j66K66N8j3j16N1J07r1J6J6k43R8o3K41
$$ -63 -108 165 117 -83 -144 33 -125 -129 66 -3 -4 -86 -252 14 72 59 -57 -6 101 10 26 42 -201 -103 -166 75
2917G5L3L2j82J29%Qm4j14K11o0j79JK39Q7k25j47qK76m61J30L61J9Qm99J73L41
$$ 75 108 140 -42 87 87 95 51 -63 148 88 -91 -90 149 236 11 -136 -144 132 -329 -199 162 181 189 -310 -137 204
2943B04j60j83J46K13j91j95L13kl3n8j73R4N7J14k76L86j96J32m05L14K45m59
$$ 204 44 -139 7 220 29 -166 147 145 112 54 -119 -25 32 146 -130 256 60 192 -213 101 346 -113
2965a13PJ08l7J37j84K13q2N1j32j55L21j3Q5m45L64o3k00j2K90M7M6k64P1J8
$$ -113 -106 2 -35 102 -82 131 49 100 -32 -187 134 121 206 -239 125 62 -138 -150 140 187 233 -31 40 58
2989E8R5k54J03J5J14j56j28K17r8n0K8r8J77J37k54O4K29k34n4j18K69o5k65
$$ 58 153 -101 2 17 131 -25 -153 64 -34 -84 -56 -154 23 160 -94 -30 199 -35 -89 -207 62 -3 -268
3012b68K39j00Q1nr0J67J3j78J80j50J85j22N8J23K10k52k48K10L0m6q5J43k16
$$ -268 -29 -129 -48 -53 -143 24 37 -141 39 -111 74 -48 10 133 343 91 -157 53 83 37 -48 95 -121
3035a21m2J97J08l95K64Jk49J01J26J13k26J80J03k14m1J69l1J58k38J33j19J41
$$ -121 -163 34 142 -253 11 12 -237 -136 -10 103 -123 57 160 -54 -95 74 43 201 -37 96 -23 118
3057A18m0p3K41l90K71m9Jj04j69M8J50P6O9r2J8j13R5l9M3o4j54L14q0Lj52J08
$$ 118 78 5 246 -144 127 78 79 -25 -194 -146 4 80 149 57 75 -38 57 18 61 -3 -157 157 77 80 -72 36
3083C6m2P3j11O1k26L84k18K50l54J73o2K44l23K11O1j64N6k34K68Jj36K13j37
$$ 36 -6 67 -44 17 -209 175 -43 207 -147 26 -36 208 -115 96 157 -7 49 -185 83 84 -52 161 24
3106B4n3J7J12j40r7L86j11k80P6J76j84K16j57p1j88M82q5j56J36J9q7r6J95
$$ 24 -29 -12 100 -40 -137 249 138 -142 -66 110 -74 142 -15 -86 -274 208 123 -33 103 122 35 -61 134
3129A34J2k26Q8P4K5j08J88R1l94J49K2q9j1j35L0l8K58J7k62L88p8l68J39J17
$$ 134 146 -80 8 82 107 -1 187 278 -116 33 55 -34 -45 -180 -150 -188 70 87 -175 213 135 -233 -94 23
3153B3O6l6L7k18q7J98J08r1j8J16K2m05K88j84Q3j5Q2N6j88K48lo0q6N1rm0K90
$$ 23 89 53 90 -128 -215 -17 91 0 -18 98 120 -285 3 -181 -98 -113 -31 25 -163 85 82 22 -64 -13 -22 -62 228
3180B28l57k6L13j9j95j06J81k8j16K23o1k21K77p3k08K91J84j48l26J71N5J08
$$ 228 -129 -155 158 139 -56 -162 19 -9 -125 98 37 -184 93 20 -188 103 287 139 -187 -16 39 147
3202A47m60M27j42k1j78M07p1pl6N8j28j08N8N6J75o8j07j52M03p5l23J67j13
$$ 147 -313 114 -28 -49 -227 180 109 102 66 124 -4 -112 -54 2 177 109 2 -150 253 178 -145 22 -91
3225i1J6J96k36J91k31K18N9k47L37j21n2O2k9o1r9k8K31k67m6K51Q6j65K91m64
$$ -91 -75 121 -115 76 -155 63 122 -125 212 91 39 101 72 11 -88 -116 115 -152 -198 53 139 -26 265 -199
3249a99L52j82J26k24l8J92J52k95L08k03J70j47j66J62R8j18j68L46o7k03j66
$$ -199 153 -29 97 -127 -165 27 179 -116 192 -11 159 12 -154 8 106 -12 -180 166 99 -104 -270
3270b70J97K90k80k18J38L3m9K08Pj60J93k73K29k1L23j42k86r5R4K79j48j5L3
$$ -270 -73 217 -63 -281 -143 -110 -159 49 56 -104 89 -184 45 24 347 205 -81 -176 -82 197 49 34 67
3293F7k59K9O2J73n1P0j39N4J08L7k29O5M9Nm0r3l7Q1r9Q6J60j64q2k5Q2K16r9
$$ 67 -192 -163 -101 72 21 91 -48 6 114 151 -78 -13 36 41 1 -92 -129 -48 -147 -61 99 -65 -147 -172 -90 126 27
3320B7n5J21j98J05k28J92L6j19N8Q5q8n5n7K59L4l44K36r6R9p5M1K3M6J53l36
$$ 27 -28 93 -105 0 -228 -36 0 -119 -61 24 -64 -119 -176 83 117 -227 9 -87 12 -63 -22 1 47 200 -136
3345a36QRPJ86l4P6j56K24J45l58J14j46K51l97K50Q2p6K3L1l30K45K57l35P6
$$ -136 -128 -119 -112 74 40 116 -40 184 329 -29 85 -61 190 -207 43 125 49 72 103 -227 18 275 -60 16
3369A6m1J51r7J47j45J06j25o4l6O4Mr2L20k42K35k16j66J15J16j12J37J81o3
$$ 16 -25 126 29 176 31 137 12 -52 -88 -24 -20 -112 208 -34 201 -15 -181 -66 50 -62 75 256 193
3392A93m08P7K15R6k88K74j88L2O1p4r6J59j13P5RJ05r3j5j70mJ93r9J18p5rR3
$$ 193 -215 -138 77 173 -115 159 -29 3 64 -10 -106 53 -60 15 24 129 36 21 -149 -153 40 -59 59 -16 -25 68
3418F8Pj15M6p2O8K8m7J02j37L18j71J05j16k13J79j1j36Q2L71n28O0m1J22O6
$$ 68 75 -40 6 -66 2 30 -17 85 -52 266 95 200 84 -129 50 39 -97 -15 356 -172 -112 -153 -31 35
3442C5p3Q0J74l5k24J08J19j00l43J85K60r7J1l22O4K73j98k4k2o0L50k30q9J96
$$ 35 -38 42 216 181 -43 65 184 84 -259 -74 186 89 100 -222 -158 115 -83 -107 -129 -189 161 -69 -158 38
3466C8n7K5n0Q0j66j9K4J70k3J0k29K05O6l0j20LK25p8K1N0j48J53r2j97Q2K78
$$ 38 -19 6 -44 36 -130 -149 -125 45 22 32 -197 8 74 44 -76 -73 152 74 95 145 -3 150 58 -139 -57 221
3492B21n06J56K23k40J32l8j48K96r1j48K9K05j73o6q7M53j16j92j1K59j17P2
$$ 221 -285 -129 94 -146 -14 -52 -200 96 5 -143 -114 91 -82 -148 -235 218 102 -90 -101 158 41 113
3514A13j52K5K6J69k89j36K77j75k7J62K61k14l2j41K62k9l09J37k18L35Q6k58
$$ 113 -39 -14 12 181 -108 -244 33 -142 -169 -7 254 40 8 -133 129 100 -209 -72 -290 45 131 -127
3536a27J78m8J3j39J80J47l07MJ84J10l14L4J49r8J40J08j72J50j68j66K89j50
$$ -127 51 3 16 -123 57 204 -103 -99 85 195 -119 -85 64 -34 106 214 42 192 24 -142 147 -3
3558cl8J0P4n3K15j09q6J23kk05r7K54r6K13m57J84J05R6p4j43J01k0qj93J63
$$ -3 -41 -31 43 -10 205 96 10 133 131 -74 -171 83 -13 200 -257 -73 32 128 54 -89 12 -8 -16 -209 -46
3583d6K19P9j46j53P0k34M1K42n5K5K92l36nR9n8j97J26K7p9j8K47j17m2j05r1
$$ -46 173 252 106 -47 23 -211 -170 72 17 42 334 -2 -7 92 34 -163 -37 -10 -89 -107 140 23 -19 -124 -215
3608b15L21k02J47k4K14k34J30j64K69l7l75L14o6l3N1N9p8k79J80J51l9k76J03
$$ -215 106 -96 51 27 241 7 137 -27 242 205 -170 144 78 45 96 155 77 -202 -22 129 90 -186 -83
3631h3KJ47J32j42k06J02j63P6K27oj96J5L28l70J67j21K9J48k86J49K4m8J32
$$ -83 -81 66 198 56 -150 -48 -211 -135 92 86 -110 -95 233 -137 30 -91 -62 86 -200 -51 -27 -75 57
3654E7r2L9j21o9J26j94K46Q8k42R2O1j56Q9p8L48l21k9K44j05j51R2Nl2Q2Q7
$$ 57 -35 4 -117 -186 -60 -254 -8 80 -162 -70 -9 -165 -76 -154 194 -127 -156 88 -17 -168 -76 -71 -103 -21 66
3679F6j91l9K83l05j5L35%l05J27K93k67k1P9n4l08L64O7m0k21K07qm28K79K30
$$ 66 -125 -164 119 -186 -201 134 134 -171 -44 249 -18 -39 40 -14 -322 42 109 69 -152 55 47 -381 -102 128
3703A28j24Lp9K21j1j87j5R9m3K31m26O2L60l69J6J63J26j55j28J22K4P6q0J32
$$ 128 4 7 -72 149 138 -49 -64 35 -8 223 -203 -141 219 -150 -134 29 155 0 -128 -6 18 94 14 146
3727A46j69Q5J2k31K09j13KQ0O6p0r4J34j69J1n6J17p9K37M4J5k01J55K7n6j26
$$ 146 -23 62 74 -157 52 -61 -59 21 87 17 -77 57 -112 -101 -157 -40 -119 118 162 177 -24 131 158 102 -24
3752b4j07R6J04j28L37k13l19L11p5j57K67k86J79q3J77k8r8j0J81q8l87M78M9
$$ -24 -131 -35 69 -59 278 65 -254 57 -18 -175 92 -194 -15 -98 79 51 -47 -57 124 36 -351 127 176
3775A76l62O2M09k83J0o0j39L06j33K2j19K50j88r5J8L4K33k78M4O8K36k03J01
$$ 176 -186 -124 285 2 12 -48 -187 119 -14 8 -111 139 -49 -144 -126 -92 141 -137 -93 -25 211 8 109
3798A09J3j81J96np9m1Rk14K78J8q2k92L72O2l08l2K84j35P9m2q0l4K2m5J07J12
$$ 109 122 -59 137 132 53 12 21 -193 85 103 21 -271 101 163 -145 -177 107 -28 51 9 -71 -105 -83 -128 -21 91
3824I1p1j38j01L48j72qNJ46o9l1o9K29j07J5j26K55J2k99J42Q6j11K0p7j45L51
$$ 91 20 -118 -219 129 -43 -51 -46 100 31 0 -69 160 53 68 -58 197 209 -90 52 138 27 47 -30 -175 176
3849A76k62R4K8J0p2n3J75k02L7J76Ok47K79p9j0p5J43j94o1O9lp3P8J0J97l84
$$ 176 -86 8 36 46 -26 -79 96 -106 -69 107 113 -134 145 66 56 -19 124 -70 -131 -62 -65 -138 -60 -50 147 -237
3875b37K09l7L04k68J0j43J79J17j81l6K55j9m29J62K22q1J5Q6pj49k6K13m11
$$ -237 -28 -65 239 -29 -19 -162 17 134 -47 -83 172 153 -276 -114 108 27 42 128 121 -28 -54 159 -252
3898b52K63%k53J06Q1M3j87K33n1l2kj90J92j27J0J36L50l22Q3K2q5j17K51j97
$$ -252 11 11 -242 -136 -55 -12 -199 34 -17 -49 -51 -241 -49 -176 -166 -30 320 -2 81 103 18 -99 152 -45
3922d5J67O8l34o5K83j4J2j83K24N7j86K72l54O3J02k34j5J78n7L4J19L7Q6m5
$$ -45 122 190 -144 -209 74 60 72 -111 113 170 -16 256 -98 -35 67 -167 -182 -4 -61 -27 92 129 215 170
3946A70p7M7Qn31M90j57K31l99J27J97oJ16j98J20r1J32k20j34K30k72J94j07
$$ 170 93 140 148 -383 107 -50 181 -218 -91 106 100 216 18 138 47 179 -41 -175 55 -217 -23 -130
3968a30M6K30k60j9K48K8k24J4O7j7J59m11J06K06q2k1j1O2o7j78Q7J66j88J83
$$ -130 -84 146 -114 -133 115 143 -81 -67 0 -17 142 -269 -163 43 -39 -60 -71 -9 -76 -254 -167 -1 -189 -6
3992fk07L94j36j64p5P6K39o8l21K65O5K1j67mK46l0l10J60K14k18j16q4L55j21
$$ -6 -213 181 45 -119 -194 -118 121 53 -268 -3 62 83 -84 -88 158 128 -182 -22 192 -26 -142 -226 129 8
4016Hr9j10L00j63K8J18j24K0j95m0J93N9r8Mj0J69l3o7q4L05r7r1K40j21pr2
$$ 8 -91 -201 99 -64 -36 82 -42 -22 -217 -257 -64 -5 -103 -99 -109 60 27 -40 -124 181 84 -7 233 112 105 13
4042A3j06K37J41m36k3K55R4j28k96M4J76J48m84L36l9J03k11Q6J34J81m15J77
$$ 13 -93 144 285 -151 -174 81 175 47 -249 -205 -29 119 -365 -29 -68 35 -176 -90 44 225 -190 -13
4064a3r6J53j49R3K88k53j33m2K85n5j73J4k4J26k0J80k7j11Q2j41mJ07q1j8k5
$$ -13 -109 44 -105 -12 276 23 -110 -152 133 78 -95 -81 -105 21 1 181 154 43 125 -16 -20 87 6 -12 -37
4089c7K59j42k9o4J25k1j70n2J70m0K5j01K11j99mj16J77L67m25Q0j5K08k22K
$$ -37 222 80 51 -13 112 91 -79 -131 39 -1 24 -77 134 -65 -69 -185 -8 359 -66 14 -1 207 -15 -13
4113a3p3K50q9J7j17r3j23K98j65L3K66m55L62j67N9k12J75L22n77K31J45p5p0
$$ -13 -86 164 75 92 -25 -118 -241 57 -108 -75 191 -264 98 -69 -10 -222 -47 275 -302 -71 74 -1 -71
4136g1K24r8q5N0j9j35O2K19r8k65J19K21r9j95L09j07j1p0K08k02L1J97l18k8
$$ -71 153 55 -30 20 1 -134 -72 147 49 -216 -97 124 25 -170 139 32 21 -49 159 -43 -12 185 -133 -161
4160a61K06l61J14L75r4l0Olj30j9J10j54J03J73l4j83J71R1k10q3J16L83m78
$$ -161 45 -316 -202 173 79 49 55 52 -78 -97 13 -141 -38 135 101 -82 89 180 -30 -113 3 386 -92
4183i2J15M3J10r8l91K77l9L15n7k67J80N5l68J27K59j96j30K03qr2j99K35J50
$$ -92 23 66 176 78 -313 -36 -75 240 183 -84 96 151 -217 -90 169 -27 -157 46 38 -54 -253 -18 132
4206A32l0k08P7J87m4k1j01M3K98l38q0mM48j52m10K51J93j41k43J17J85k20l3
$$ 132 102 -106 -29 158 114 93 -8 35 333 -5 -85 -89 359 207 -203 48 241 100 -143 -26 159 -61 -94
4229i4l5R4J21l0l16PL86l29K37j80J79j01j1K34R8j78N9r8j53J38q1m1J90j66
$$ -94 -129 -35 86 56 -260 -253 133 -196 41 -139 40 -61 -72 162 260 82 141 43 -110 28 -53 -94 96 -70
4253g0j2n4P2L19j66j42J29N1j25j3J16j2j38J72m05K44J72q3j72J39m8j44J20
$$ -70 -82 -136 -64 255 89 -53 76 127 2 -11 105 93 -45 127 -278 -34 138 55 -117 22 -26 -170 -50
4276e0K29j77m06J44L79m1QQp6r0N0LK0lK65l44J78l4m4j50Q3L8K7r4n8K86J91
$$ -50 179 2 -404 -260 119 78 86 94 18 -72 -22 -19 1 -2 263 -81 97 63 19 -131 -48 -10 17 -77 -135 151 342
4303C42k82q5k02K95K39l53N0O5j6j49K3K73j80J3O1l5nn0NJ62k14M3j56J88r2
$$ 342 60 -25 -227 68 307 -46 4 69 53 -96 -73 200 20 33 94 59 54 4 9 171 -43 0 -156 32 -60
4328f0K68k13k4K07k79m5J34k0k6Q5q7K12k68Om0Q8J37j54J1j18J71J07r7q2J27
$$ -60 208 -5 -29 178 -101 -146 -12 -32 -58 27 -60 152 -116 -110 -150 -62 75 -79 -68 -186 -15 92 -5 -87 40
4353D0j03n9K34k10J78j49q3L66k06R5Pn9r0j9K90j98k04p5J69R4k6j41J07o4
$$ 40 -63 -122 112 -98 80 -69 -152 214 8 103 110 51 -39 -58 232 34 -170 -245 -76 18 -8 -149 -42 -106
4377a06K13k16K79j04N3m4R1k45o7J42q5j03J70L8R9L3o2j97OJ76j19K93l08j8
$$ -106 107 -109 170 66 119 75 166 -79 -146 -4 -89 -192 -22 16 115 148 86 -111 -105 71 -48 245 -63 -81
4401h1K24Q6n20L09j37J40k5M7j51K30j76j26L16m5j18L1M0P3J42j57J8n1Jk72
$$ -81 143 229 -291 18 -119 21 -4 43 -108 122 -54 -180 136 91 -27 4 44 117 259 102 120 69 70 -202
4425b02J52L11l44l8J99j11p0r6J61jL69l84oj67L34q8j26O2K48k37j20M19kk76
$$ -202 -50 261 -83 -121 78 -33 -103 -199 -38 -39 330 -54 -60 -227 107 19 -107 -45 203 -34 -154 265 263 -13
4449a3l6J72l2l21P4N3J6P9r5J05L4J04l35J13J89n1j09j10K49k0K9j72m1J42
$$ -13 -49 123 91 -230 -156 -103 -87 -8 -103 2 36 140 -195 -82 107 56 -53 -163 86 66 95 -77 -118 24
4473B4kk6j37L72p4l46L8J64J05j58L0MN8q1J18k17J49q5k34K72qJN7l3P1j57
$$ 24 22 -4 -141 231 157 -189 -151 13 118 -40 -10 -6 52 -29 89 -128 21 -64 -298 -26 -34 -33 24 -9 62 -95
4499i5j63K31J7LJ06k70K33Q4l52M99j69M8k53M5j50K61kk96J23K23l14J55J83
$$ -95 -258 -27 -10 -7 99 -171 62 146 -206 293 124 172 -81 -36 -186 75 73 -223 -100 123 -191 -36 147
4522A47Rl2k78K72j08j73j33K59o8J93k47J77o4J53k42R7Lk0l3Q3l1J66k00p3
$$ 147 156 124 -154 118 10 -163 -296 -37 -105 88 -159 18 -46 107 -135 -38 -35 -55 -88 -5 -36 130 -70 -143
4546a43J89MJ97k74k36K79Mj66M3M5Q7l7m7J70p3lj04K77q3j41O3n5K36l93Q2
$$ -143 46 50 247 -27 -263 16 20 -146 -103 -58 29 -8 -55 115 42 39 -65 212 129 -12 51 -4 232 -161 -79
4571g9l9K27J7l8J34j07j5j22Q3J24j41n4p8L00j50j56m9J68J92k22O6J1j22r4
$$ -79 -118 109 126 88 222 115 100 -22 61 185 44 -10 -88 212 62 -94 -143 25 217 -5 61 72 -50 -144
4595a44J95J9Km8J8K3Q4j59r0J73K7j29J9k6K44k24K45m31K81K4j13J15j89j38
$$ -144 51 70 72 24 42 65 149 -10 -100 73 100 -29 -10 -36 208 -16 229 -202 79 103 -10 105 -84 -222
4619b22L58j14j15N0l2K05Lj25J17q3j78K0J98p9l7J32k46MJ01N6J37k31o7J78
$$ -222 136 22 -93 -43 -75 130 133 8 125 42 -136 -116 82 3 -34 98 -148 -144 -43 13 150 -81 -148 30
4643C0P7j11j20o%K6P5J40J05k14L2k10J84n2r5j1K10k54P4J53M4q3j57K7J29
$$ 30 107 -4 -124 -130 -130 -104 -29 111 216 2 34 -176 8 -44 -139 -150 60 -194 -120 33 77 -6 -163 -136 -7
4668gJ35j36J11j57J26j2j63l5J89j25j97R1K30j02q6J46J54j59k49L20j05j57
$$ -7 128 -8 103 -54 72 60 -103 -138 51 -74 -271 -180 50 -52 -138 8 162 3 -246 74 -31 -188
4690a88J1K27m8J16j60Q6Q6k19kM9O7K0j35j11K28J63l27J21M2J15j34j35L4M1
$$ -188 -177 50 2 118 -42 44 130 -89 -91 -42 25 45 -90 -201 27 190 -137 -16 26 141 7 -128 -94 -53
4714e3Q0n9j74M32om42K27K59l06j00Q1j54J66J50j58m4L1K32k35j3K42j31j32
$$ -53 27 -32 -206 226 220 -222 5 264 -42 -142 -61 -215 -49 101 -57 -101 -70 162 -73 -86 156 25 -107
4737a07k4L68k15k83N17l17J33j68k7M4J5J59k33J50r9L9Q9j99L02j35r0L45l94
$$ -107 -131 237 22 -261 256 -61 72 -96 -123 -79 -64 95 -138 12 -87 -48 41 -158 144 9 -81 264 -130
4760a30J33N5L1j4r2J14q8j81J94j3R0j40K62k71P1O3p4L3M2J45j03k15K0J32
$$ -130 3 58 89 75 -17 97 9 -172 22 9 99 -41 221 -50 21 84 10 43 85 230 127 -88 -68 64
4784F4o4n3P0p1N8M9pj62K42m1p9j12O6M3p0n8qK48j42J16q6J57j40R6M0m1k63
$$ 64 0 -53 17 -54 4 53 46 -116 126 85 6 -106 -40 3 -67 -125 -133 115 -27 89 3 160 20 116 156 115 -148
4811a48MnJ47QN8j55N9j04R4J42j62N4n9J6N3k7J09l46J71Q7k06J76N7J47m06
$$ -148 -144 -149 -2 6 64 -91 -32 -136 -42 100 -62 -8 -67 -51 2 -25 84 -262 -91 -4 -210 -34 23 170 -236
4836b36K09j09J85r0J86j73L4J45K0k08N6Q1N3k33J44m5N8p8n9l6J07O7m5j67
$$ -236 -27 -136 49 -41 145 -28 6 151 171 -37 19 100 153 -80 64 19 77 -1 -60 -96 11 78 33 -134
4860a34J20J40L5K9j73L9q0j99L31q7J19m6k1R2l65K71k18K17k12M4Q6N5l1K1
$$ -134 -14 126 161 190 17 56 -24 -223 108 21 140 94 73 165 -200 71 -147 70 -142 -98 -12 43 12 33
4884C3K7Q2k05J8R8j96J40M9jj02P5M1n8J36o9lj52r0Q5j50R8K11k00Q0pO9QO2
$$ 33 60 142 -63 -45 53 -143 -3 46 45 -57 18 59 1 137 68 65 -87 -177 -92 -242 -144 67 -133 -53 -60 9 17 79
4912G9J31k29QJ00j00qJ76j55l3j7L2m6O3j14K7J09j7mJ95j73P0l5K0l7j04o2
$$ 79 210 -19 -11 89 -11 -19 157 2 -31 -48 -16 -62 1 -113 -86 23 6 2 197 24 94 59 79 42 -62 -124
4938a24K1L54j59j06MO9k5m08M71j77J0K29j76J45j71j05Q4J86k14J30J34j53
$$ -124 -103 251 92 -14 -10 59 34 -374 97 -80 -70 159 -17 128 -43 -148 -64 122 -92 38 172 19
4960A9j62L01Oj17Pm2j82J83J8k81L42M1j57J20j20l8J01j25R1j2J35j53O9o4
$$ 19 -143 158 164 47 54 12 -170 13 31 -250 92 133 -24 96 -24 -62 39 -86 5 -7 128 -25 44 -20
4984b0P1k8j8j1J49k79J86M2o8J2q3nJ49k78J60J0oj4K7j07J61r0L1m3K4K0N0
$$ -20 51 23 5 -6 143 -136 50 92 24 36 -47 -52 97 -181 -21 -11 -17 -31 -4 -111 50 -40 -9 -52 -28 -8 42
5011D2j05P7J26r6r2k6J43J5j32P2J4n3r4m6J65m2k3J50mr2Q8j43K26p4k31J88
$$ 42 -63 14 140 44 -48 -74 69 84 -48 24 38 -15 -109 -155 10 -32 -55 95 91 -1 87 -56 170 96 -135 53
5037E3kk5j11J19j64L52j39l07L42j1o6k50L77k08P9p0q7K71l48K22p7O2J5J13
$$ 53 51 26 -85 34 -130 222 83 -224 118 107 41 -209 168 -40 39 -31 -118 153 -195 27 -50 12 27 140
5061A40j97K6J68j73L5Q4o7N5p0J0j25J83J58l41O0Q6k45Q8k3J69M0rj46J72l16
$$ 140 -57 -31 137 -36 -1 83 16 71 1 11 -114 69 227 -114 -54 32 -213 -125 -148 21 61 52 -94 78 -238
5086b38J93j4j17L68j56J74k44K68q1j87l3j6J52p8O0j0J9k71J64o1K73n6o6j77
$$ -238 -45 -59 -176 192 36 210 -34 234 153 -34 -67 -83 69 -9 51 41 60 -211 -47 -108 165 109 43 -134
5110a34K21Oj03NN3j82l3J85j53J93j16J10j76J63jj16N1Nj00P2k0N7j0j72K39
$$ -134 87 93 -10 -5 48 -134 -167 18 -135 58 -58 52 -124 39 38 -78 -27 -22 -122 -50 -70 -13 -23 -195 44
5135D4J41k01q0Kj23K04J52j94J81p1j14j04o8L28r3n6On6J13j16J28L1j81L71
$$ 44 185 -16 -96 -94 -217 -13 139 -55 126 55 -59 -163 -231 97 4 -52 -46 -102 11 -105 23 54 -127 244
5159B44k45m4l0j40M35j98k36K43k4l3L5J24j80Q3P6j18o8J6K43j30j93J18K05
$$ 244 -1 -45 -75 -215 220 22 -214 29 5 -28 7 131 -49 34 110 -8 -76 -60 183 53 -140 -22 183
5182A83j91J27k43L85m05K42j12J01j44P6M0j02j66J32N3M4r6j4J17k21J32K7
$$ 183 -8 119 -124 261 -144 98 -14 87 -57 19 59 -43 -209 -77 -24 20 -76 -90 27 -194 -62 -35
5204c5j6J60K1o4%k8j33M8%M3K06l67J73J35k63K71j3j27k37J57P7N1k52O9%J42
$$ -35 -51 109 130 66 66 38 -95 -47 -47 -4 202 -165 8 143 -120 151 138 11 -226 -69 8 59 -193 -124 -124 18
5230A8J12k70L1M1J03j1j00J9J08j02N6M3M0r4m0l3J19j46J32O3j17Q1L7j36P8
$$ 18 130 -140 -109 -68 35 24 -76 -57 51 -51 5 48 88 -6 -46 -79 40 -106 26 89 -28 53 90 -46 32
5255C2J06j26R5p7n1J19j22Q0o8P9J7K5r0O5k76Q7J67r5m3p0L19k01j1N8k36J83
$$ 32 138 12 107 30 -21 98 -24 56 -12 67 84 109 19 84 -192 -105 62 -33 -76 -146 173 -28 -39 19 -217 -34
5281c4K8j3O8Nk1O3k15Q3P9j57J22j85K92j41J02j46J57j49L6R4j01k7J38j3k50
$$ -34 -6 -19 49 54 33 96 -119 -36 43 -114 8 -177 115 -26 76 -70 87 -62 -26 68 -33 -60 78 65 -185
5306a85q4K83M3j95K06K0o2j71J31k02K85j03j6Q3j06k19L23q1J08o3J65k97L41
$$ -185 -269 14 57 -138 68 88 26 -145 -14 -216 69 -34 -50 33 -73 -292 31 -50 58 -5 160 -137 204
5329B04o6j24l1k18J19L09k03Q2r3j04KJ57O1j87N5M4j80J29Q1l5N0K19j65k30
$$ 204 138 14 -17 -235 -116 193 -10 72 -21 -125 -123 34 95 -92 -37 7 -173 -44 37 2 52 271 106 -124
5353a24L18j38k0j35K34l35N78m03k4K0L3J0%J34j56j21N5lK27k68J19K11k81
$$ -124 194 56 36 -99 135 -200 378 -25 -49 -29 4 14 14 148 -8 -129 -74 -77 150 -118 1 212 -69
5376f9J24j21p0K32k47J33r2R5J92l05L82k70J06j71P1m3jO6j82K53n3k50J19
$$ -69 55 -66 -136 96 -151 -18 -110 -15 177 -128 254 -16 90 -81 -10 -53 -54 12 -170 83 30 -220 -101
5399a01K56p1o3r9J22L0j68J12k47J66k9J45J55l07J05j5j03r8J94j08J24R2j52
$$ -101 155 84 21 -78 44 74 -94 18 -229 -63 -92 53 208 -99 6 -9 -112 -210 -16 -124 0 92 -60
5422f0Q9l5k4K82k51J08m8n5Q8j11N9M2p9J39nl54L83k08q7K98m41J67J42n1L
$$ -60 29 -6 -30 252 1 109 61 6 94 -17 42 84 5 144 139 -215 168 -40 -127 171 -270 -103 39 -12 -9
5447im5L52l06j22lJ14R1j23J05j69K08j70J16j10J00k1j33L03j70o7K69k91J92
$$ -9 -54 298 -8 -130 -133 -19 72 -51 54 -115 93 -77 39 -71 29 8 -125 178 8 -59 210 -81 111
5470A11L9j98m6O2j08L9KK00l00K51L2k84J55j1J23j76K63l45K06K50j42l6k1
$$ 111 150 -48 -94 -32 -140 -101 -99 101 -199 52 84 -200 -45 -56 67 -109 154 -191 15 265 123 87 66
5493F6j72k0J94M3n0r3lq8K49k1L3p1J39j56j07Q6j01L5k19L76j85j24K23p8l5
$$ 66 -106 -126 68 111 61 -32 -35 -123 126 105 138 67 206 50 -57 29 -72 -37 -256 120 -65 -189 34 -44 -79
5518g9qJ23J33k99K25N3k88J37J1J07j23j9L3M3j0O7o9k37M2K60pj09kL6j21q8
$$ -79 -87 36 169 -130 95 148 -140 -3 8 115 -8 -27 6 49 39 106 37 -200 -158 102 95 -14 -16 20 -101 -189
5544a89K23J11j91L3J00q2p0Q1l9j4J18o9J57J79j02q3j12jl6K0N9k98M67j47
$$ -189 34 145 -46 -13 87 5 -65 16 -23 -37 81 12 169 348 246 163 51 50 14 34 93 -205 262 115
5568A15q0j2N9l8k32J99J42J6k41L6O5j7j86K88q0m8J37k55J45r7o3J77oK05k47
$$ 115 35 23 82 44 -188 11 153 169 -72 -36 29 12 -174 114 34 -14 123 -132 13 -84 -147 30 24 229 -18
5593a8k4M6R5j40j14J40o0R2j53K50j85Q0M6P9l7o8j10M1n3K02o8j37J20K02l37
$$ -18 -42 4 99 -41 -155 -15 -75 17 -136 114 -71 9 55 134 97 29 -81 -40 -93 109 41 -96 24 226 -111
5618a11J31J3q1J25r8J40l06J38j05K39k09O9K3k7j47K14j38Lj8L5lL67l82K52
$$ -111 20 33 -48 77 -21 119 -187 -49 -154 85 -124 -55 -32 -59 -206 8 -130 -127 -145 -110 -113 254 -128 124
5642A24j29j02jK73j69R9j39L1j41K21o1r6J16o5J51k44K69l99P3J83J41j04l27
$$ 124 -5 -107 -108 165 -4 95 -44 -13 -154 67 6 -90 26 -39 112 -132 137 -262 -189 -6 135 31 -296
5665b96K73O0J20j24lK5j58k73M63j94L17o5k00J01j79O5J34n4o2o1J81q6m2J23
$$ -296 -23 37 157 33 30 55 -103 -376 87 -107 210 145 -55 46 -133 -68 66 12 -50 -111 70 -16 -58 65
5689F5O0j02r6R4L5k15J80J53l35M5K21j58P0j86J16Rk8O8J51j8j90N7n0j05K29
$$ 65 125 23 -73 21 56 -159 21 174 -161 -116 105 -53 17 -169 -53 -44 -72 -4 147 129 -61 -4 -54 -159 70
5714G0j20R4q2j24jK50m8k14J94j57L23j51m0o1K30j05j26J78j29l0m2P4J35j20
$$ 70 -50 44 -38 -162 -163 87 39 -175 19 -138 185 34 -6 -67 163 58 -68 110 -19 -49 -91 -17 118 -2
5738bj94M6K30l55L77p1j18K62j77n1J2n8j19K28q4J64J26l73L43k48M4L7J21
$$ -2 -196 -150 80 -275 102 31 -87 175 -2 -53 -41 -99 -218 10 -74 90 216 -157 186 -62 -18 19 140
5761A40o2k64PK40k5k5j14j88N31k12j94J74J4J59j9k05L37j56j50j62J46J22
$$ 140 78 -186 -179 61 36 11 -103 -291 240 28 -166 8 22 181 162 -43 294 138 -12 -174 -28 94
5783I4k63N2K64j52q9J68KK1j8k5j70P9K07k48r2J52Q9n5k47%P6J58lQ5L7k55
$$ 94 -169 -117 147 -5 -94 74 76 97 79 54 -116 -37 170 -78 -170 -18 71 16 -231 -231 -155 3 0 85 122 -133
5809a33J13N8K08j25j69L9N0MM9P8j06j23Q4j37J6J39n2Q1p3Q9l28J24J17q2O0
$$ -133 -20 38 246 121 -48 -9 41 45 94 172 66 -57 27 -110 -94 45 -7 74 1 90 -238 -114 3 -79 -19
5834a9lJ81n0p2n2j25K01r9J70K2k05J34k56L00j8K12l27N6n9J01k51J33P3j88
$$ -19 -22 159 109 37 -15 -140 61 -38 132 154 -51 83 -173 127 109 321 -6 50 -9 92 -159 -26 47 -141
5858a41J54j02J74L5j51j0M6N6J51j51q1J2Q8r7L00l14J5J8J36j95L5J28j39J16
$$ -141 13 -89 85 120 -31 -41 5 61 212 61 -20 -8 80 -17 283 -31 -16 2 138 -57 -22 106 -33 83
5882H3j44r3R5N6J01M1j53j36L29j25K2k75J51q4J59k11M66r4k1k13j41M34q0
$$ 83 -61 -154 -59 -3 98 139 -14 -150 179 54 76 -199 -48 -132 27 -184 282 188 167 -46 -187 247 167
5905A67j33l3rJ23k12M3j2k35J70K33l6j03K01j99n9J1L17m03K74p0j89J55J38
$$ 167 34 1 -8 115 -97 -54 -66 -301 -131 102 66 -37 164 -35 -94 -83 234 -169 105 35 -154 1 139
5928A39r3j33L9J91j11l50J96N1mO7r7P5P3O3j86N2J7K9n9L58k76L0l5j90J98
$$ 139 46 -87 -48 143 32 -318 -122 -71 -75 -8 -105 -30 43 106 -80 -28 -11 18 -41 317 41 71 36 -154 44
5953D4Q8j70J3L6R8j53j47K21L2J01q7k4j04M4J22k17J36q9r5r9K57j54J19J19
$$ 44 132 -38 -25 11 109 -44 -191 30 62 163 76 52 -52 -8 114 -103 33 -56 -151 -250 7 -147 -28 91
5977I1J83l39N3N3p5m9J30J5J0P6j31O9J9k1L5j87K00m1l43L10o7J24j68Q2j20
$$ 91 274 -65 -12 41 -34 -83 47 62 72 148 17 86 105 84 119 -68 132 91 -252 58 -9 115 -53 29 -91
6002i1J75j11k80K49M7J41j47j2J57j82j25Q1K35qj32r0K86o9r4Q4l41K79q0L4
$$ -91 84 -27 -307 -58 -11 130 -17 -29 128 -54 -179 -98 137 129 -3 -93 193 124 30 114 -227 52 -28 6
6026Fm6J70r9k56K54o0p5m6J61m9L9oM8q5L5J25q7j42K01K7j21P3j97J36J07j31
$$ 6 -40 130 31 -225 29 -31 -106 -152 9 -40 -1 -7 41 -44 -9 116 29 -113 88 115 -6 67 -130 6 113 -18
6052a8K0Q1q4K95l15p4j32K48P8j28p0Q1p0RP7O3j00j4Q6k65J44J31j0q6k0J02
$$ -18 2 83 -1 294 -21 -95 -227 21 99 -29 -99 -18 -88 -79 -2 61 -39 -53 33 -232 -88 43 33 -53 -73 29
6078B9J22l00L9J48j06J30O0m4l5j6j4mk11K27r9r5J59K4N3m1k6j39J55J05o9
$$ 29 151 -149 -110 38 -68 62 122 78 43 27 13 9 -202 25 -74 -169 -10 14 67 26 0 -139 16 121 52
6103E2p0K34j20k11J66J20j96l2J90j57R7j34P0o2K4j57L60j68O0M1j78m5J19
$$ 52 -18 216 96 -115 51 171 -25 -57 133 -24 73 -61 9 -53 -29 -186 174 6 66 107 -71 -116 3
6126CK7Km9m8J01J8q2j15m3K39p2k0k9J5n9o6J07J61q7k09K20k58J19J58j45O3
$$ 3 30 32 -17 -65 36 54 -28 -143 -186 53 -19 -39 -68 -53 -112 -178 -71 90 3 -206 14 -244 -125 33 -112 -49
6152d9J28r8Q4R7N3k35K3P4Nr7rM7M8r1j00K03l5n0Jo9K54q2j7r8J02j64R2J48
$$ -49 79 -19 65 162 215 -20 3 77 82 -15 -24 23 71 -20 -120 83 48 -2 -1 -70 184 102 85 -13 89 -75 17 165
6180A65m12K64k03K65l17L05N7k60J67j62K42r6M7j95K66j31j59L21k42j6o7K75
$$ 165 -247 17 -186 79 -238 67 124 -136 31 -131 111 15 62 -133 133 2 -157 164 -78 -94 -161 114
6202A14p3K02k27K35l01j3K20k64N9J5n1n3K49l18K66k08K16N1m4r5p8r4J05M7
$$ 114 41 243 16 251 -50 -63 157 -107 -48 -33 -84 -137 112 -206 60 -148 68 119 75 -20 -98 -192 -87 -40
6226d0M8N3JK7j02M9P4j95K57k66O5j11J32K3Lj78K65J38l39J30o9q0K3J21J89
$$ -40 8 61 62 89 -13 36 110 -85 172 -94 -29 -140 -8 15 18 -160 105 243 -96 34 -35 -115 -92 29 218
6251B18l40J39j37K23l2j62Q4L1j9l1N8pk6j40K02j82K04r8K05r6J31j78n1K7
$$ 218 -122 17 -120 103 71 -91 -7 24 5 -26 32 25 -1 -141 61 -121 83 -15 190 94 225 47 -4 23
6275B3j81Q1P7n8Q0j12pK56j44O2k98P6J44KJ02j61J41o4M8j64K8R5r0k5O9N7
$$ 23 -158 -77 0 -58 22 -90 -97 159 15 77 -221 -145 -1 1 103 -58 83 19 67 -97 -69 26 -64 -89 -20 37
6301C7p2Q6j90J43K8N8j87J58p6P8j25QL02o3j98n4m7L43k53L2k29K14K14k14
$$ 37 -35 51 -139 4 32 90 -97 61 -15 63 -62 -54 248 185 -13 -67 -114 229 -24 8 -221 -7 207 -7
6325gp7O2K35l72J44p6K82j50K7N2l4j38o9J24N5R7k04J14l5N9p4m6j21N1J41
$$ -7 -84 -22 213 -159 -15 -91 191 41 68 120 86 -52 -121 3 58 155 -49 65 30 89 15 -31 -152 -101 40
6350D0j86L46q5k10K24q1R0k22L2L0k6R3j08k4L05k42k04K49j6r5J33k18K53O4
$$ 40 -146 200 115 -95 129 48 138 -84 -52 -22 -48 45 -63 -87 218 -24 -228 21 5 -90 43 -175 78 142
6374A42k42M29p2k60Pl4J77j3P9k44O1m4j69J06n5J27j11J97k26L40k65K47l10
$$ 142 -100 329 257 -3 4 -30 147 134 213 -31 30 -14 -183 -77 -132 -5 -116 81 -145 195 -70 177 -133
6397a33J85n7pj44PR5Oj59J21K70j27m07L54K34p5q9p9K92l34m9O1K02n4j84k07
$$ -133 52 -5 -12 -156 -149 -54 -48 -207 -86 184 57 -350 4 238 163 74 -5 287 -47 -96 -35 167 113 -71 -278
6422b78M73k74p6L17j11k80J54J88o8j26l2j5n0K31p9L20k65L6j23j16J13j08
$$ -278 195 -79 -155 162 51 -229 -75 113 45 -81 -113 -128 -178 53 -26 294 29 65 -58 -174 -61 -169
6444a69K81l64L76l30J06K6P7R0L9k47J7JR9p5J79k44R0O9K3Q8k91J62k38J01
$$ -169 112 -252 124 -206 -100 -74 3 93 132 -115 -98 -97 2 -73 106 -138 -48 21 44 132 -159 3 -235 -134
6468a34O2N1J11j82m7jJ27J36j32R1j26OJ07K7P3k86K73j2j0k2o9j59J33m7m7
$$ -134 -72 -21 90 -92 -139 -140 -13 123 -9 82 -44 -38 69 96 169 -117 156 144 134 112 43 -116 17 -30 -77
6493g7j1M2M1mj02R7p5j13J62o4Q3N2n3k01J46M5k10M65k93J07n5N6j8M3p5p2
$$ -77 -88 -46 -5 -9 -111 -14 -89 -202 -40 -104 -21 31 -22 -223 -77 -32 -242 223 -70 37 -18 38 20 63 -12 -84
6519h4L53l48K07j41J08k47J84L9n0M1n9M7P7L6j72k42K70J19j29J16Q2m31J16
$$ -84 269 -79 128 -13 95 -152 32 71 21 62 3 50 127 163 -9 -251 19 138 9 125 207 -224 -108
6542a08J30J48J0p4k17j1L22k37M6j48J31j56j08M48j13j37N9J38r6k01J57ml6
$$ -108 22 170 180 106 -111 -122 200 -37 9 -139 -8 -164 -272 176 63 -74 -15 123 27 -174 -17 -21 -57
6565e7J13o8j4P4j51O1P0J3k62K84j43J44k11J45l9K05j35J6j22J08j75J67j51
$$ -57 56 -12 -26 48 -103 -42 28 41 -221 63 -80 64 -147 -2 -41 164 29 45 -77 31 -144 23 -128
6588a28L1J01L04j90k15R8j26J7q8K50M4r3M6l2l8N2Q6k98J2M1J78n4J15L5j83
$$ -128 -97 4 308 118 -97 1 -125 -108 -196 54 98 5 51 19 -19 33 119 -179 -167 -126 52 -2 113 148 -35
6613c5k82K11K7M2K3N8j7q9oJ01J6l3J46o1j40J51k38Q3J5q6M2P7J11lj48R0L5
$$ -35 -317 -106 -79 -37 -14 44 27 -62 -68 33 49 16 162 101 -39 112 -126 -43 -28 -114 -72 5 116 113 -35 55 90
6640I0L5j96L0J90N6k67n1O4m3j0k9K41j17j11O2k0K12k62J58rO7j85J35j79J77
$$ 90 125 -71 -41 149 205 -62 -113 -49 -92 -102 -131 110 -7 -118 -56 -76 136 -126 32 23 90 -95 40 -139 38
6665C8j39R0O4j33K14k53N8m8K85l34J74P8j42n2J45k05L28k09R0J4K3q3J27j6
$$ 38 -101 -11 53 -80 134 -119 -61 -109 176 -158 16 94 -48 -100 45 -160 168 -41 49 63 86 3 130 114
6689A14m7J23r1k41R3J03J3j57M1p6K82j93O6M9j42L7K09k51J73j91J53Pj15j49
$$ 114 67 190 99 -142 -49 54 67 -90 -49 -125 157 -36 30 79 -63 -26 183 -68 105 -86 67 74 -41 -190
6713a90K28j1j32P8L8Q4j20J09m5O7j62N7j65J43L3M6j01jK0M9k43P4J09OK95
$$ -190 38 27 -105 -27 11 95 -25 84 39 106 -56 1 -164 -21 12 58 -43 -44 -24 25 -218 -144 -35 -29 266
6738B66m72J36M4P3J25j34Q6j15Q9qK6j43k7K42k10p4%J55K3NK0m8j24j8Q9j10
$$ 266 -206 -70 -26 47 172 38 124 9 98 90 116 -27 -54 188 -22 -96 -96 59 82 87 107 59 -65 -83 6 -104
6764a04N8K46m41K87l2o8M0k08L21o5L0j70J39jJ72k89J58q7p3j33j0J15K40j76
$$ -104 -46 200 -241 46 14 -54 -14 -222 99 34 64 -106 33 32 204 -85 73 -14 -87 -220 -230 -115 125 -51
6788e1O4n7K19j60J12j01Q6j59J37L11l18M9j99K03kk58J62J12r1L1j82m3K17
$$ -51 13 -44 175 15 127 26 112 -47 90 401 83 132 -67 136 134 -124 38 150 59 90 -92 -135 82
6811H2K7l18K53j62jl9R3Q6J64k98l1J50r6N5n1J7O6r2K12ML1l03O5K01q9q7J40
$$ 82 109 -209 44 -118 -119 -158 -65 21 185 -113 -144 6 -90 -35 -86 -69 -3 -95 117 121 152 -151 -86 115 26 -61 79
6838G9p1J44j09j88M1m3J07J28RNN5k81J25J56k48K6O1L1J4Mk14L05k7J60l23
$$ 79 8 152 43 -145 -104 -147 -40 88 97 102 157 -124 1 157 -91 -65 -4 27 41 45 -169 136 109 269 -54
6863e4M9J39Q6k92j21O8R8n7Q2J85k67j39J34kj0J50k65L69r4K03j34j40o3O1
$$ -54 -5 134 220 -72 -193 -125 -27 -84 -2 183 -84 -223 -89 -91 -101 49 -216 153 59 262 128 -12 -75 -14
6887a4pQ8j90P2j45J69J09p8K21k85J01k90K82o0J14lj41j66M21j96J8p9K91k74
$$ -14 -21 67 -123 -51 -196 -27 82 4 225 -60 41 -249 33 -27 87 84 -57 -223 198 2 20 -59 232 -42
6911d2p9J85l25L06j33J67j51K54M2j43k33J74m8K08p7N7j70k87L92P9j41Mk18
$$ -42 -121 64 -261 45 -88 79 -72 182 224 81 -152 22 -26 182 105 162 -8 -295 97 176 35 39 -179
6934a79L16L3k25j09J3K87k02NLK11k43J23K1m2L3j48Q0R7p4O1j78J11j20K02
$$ -179 137 170 -55 -164 -151 136 -66 -61 -58 153 -90 33 54 12 45 -103 -23 74 0 61 -117 -6 -126 76
6958G6Pq1r8p4Q3R0K53k10m9M1j63K36k16n6K64%j25l2J34j13k2l11K83R0m5l9
$$ 76 83 2 -96 -170 -87 3 256 46 -3 38 -125 111 -105 -161 103 103 -22 -54 80 -33 -55 -366 -83 7 -38 -77
6984g7m6N0j46K87j17j62K4K68j1n2J19j72m3L6R8Oj20MR9p3j06J18q8J65j27
$$ -77 -123 -73 -219 68 -49 -211 -187 81 70 18 137 -35 -78 -42 56 62 -58 -54 45 -28 -134 -16 -104 61 -66
7009f6N8l8J02m2M7p5p8P0K73m58N6J76j2L4k21K02j71Q1P2q6p0K81r3q6K01k3
$$ -66 -8 -46 56 14 61 -14 -92 -22 251 -207 -151 25 13 47 -174 28 -143 -62 10 -76 -146 135 42 -44 157 134
7035A34l56L61k16j59K86m7N2k03K68j87J29j14OJ84l08l7K99m5j59R0J66j42
$$ 134 -222 139 -77 -236 50 3 55 -148 120 -67 62 -52 -46 138 -170 -207 92 47 -112 -22 144 2
7057Bj59P7J15J71k19k8j20L89k31k12J17O2m1L5K28k44k9r6K66J92k29j55K89
$$ 2 -157 -80 35 206 -13 -41 -161 228 -3 -215 -98 -36 -77 -42 186 -58 -87 -183 83 275 46 -109 180
7080A80k66J56M2k43J63J59l60lK01n8p2k86L84N0k00J83r2M6J45j04r8l9k50
$$ 180 -86 70 112 -131 32 191 -169 -172 29 -29 -101 -387 -3 47 -153 30 -62 -16 129 25 -73 -112 -362
7103c62K59P9K7Q7j84K54J91j09o1Q7m81J35j41J36M3j30Q5J82R2j89m9OR7j2
$$ -362 -103 -24 3 90 -94 160 351 242 181 268 -213 -78 -219 -83 -40 -170 -85 97 189 0 -49 -43 54 42
7127D2R0j24p9J34q8l4r9J03K4J6m2L64j87p2N7k89K01k7Qj36J64M88p16L11J16
$$ 42 132 8 -71 63 -25 -59 -158 -55 -31 -15 -57 307 120 48 105 -184 17 -10 -2 -138 26 514 -202 109 225
7152B25j58o9p7P6m3Q7j41K03k5j7p5Q1j10O3J00j49qJ75k57j34L99J98j84n1
$$ 225 67 -2 -79 -3 -46 41 -100 103 78 61 -14 67 -43 20 120 -29 -37 138 -119 -253 146 344 160 109
7176A09m8jPo5l2N8oj90P8K2J00j15j06J75q7p7O4N9n5J48q1M2k2K1j59J65kJ29
$$ 109 61 60 67 2 -30 28 22 -168 -90 -68 32 -83 -189 -14 -101 -178 -114 -55 -110 38 -43 -1 -23 -2 -161 4 2 131
7204A31k28O6J7R3n4J32L0k28k56K59k7K58q4j05m1J9M5p3NJ19N4k35rjj06J18
$$ 131 -97 -31 -14 79 25 157 187 -41 -297 -38 -65 193 109 4 -37 -18 27 -46 -41 78 132 -103 -112 -113 -219 -101
7230a01K67k00K5O4p1Q3M2j82M9j40J88r2J59M1j31n8m1j86L33kj80o9R3j12K18
$$ -101 166 -34 -9 55 -16 67 109 -73 -24 -164 24 -68 91 132 1 -57 -98 -284 49 47 -133 -202 -109 -221 -3
7255cJ83l24L0J28k2j26QJ74K4p7M8mk37L25l7k00J00M2n2J4J33j86K04qj16L1
$$ -3 180 -144 -114 14 -8 -134 -126 48 72 -5 43 39 -198 127 90 -110 -10 32 -20 -6 127 -59 145 137 21 52
7281E2J89j17k82J97J24j10j50J82j00J9j26M0n7J83j52J27l0k56M82k87K99j45
$$ 52 241 124 -158 39 163 53 -97 85 -15 4 -122 -82 -139 44 -108 19 -11 -267 215 -72 227 82
7303H2j72J97J82l29k9K17j50J24o6j16j32K10n5l4q4K83O5k01M3K2k15P7l1K29
$$ 82 -90 107 289 -40 -69 148 -2 122 56 -60 -192 18 -37 -71 -155 128 193 -8 35 57 -158 -81 -112 117
7327A17j35P7L4r7J30j28k14K71MK1j11k08K18jk0Q2j9j03Mj23K18l9K1J4rj03
$$ 117 -18 59 93 -4 126 -2 -216 55 59 80 -31 -239 -21 -22 -42 40 21 -82 -78 -201 17 -22 -1 13 4 -99
7353i9P0J47j50J72L4m36K89k87J41j62K83p6K00k28J64m7j03K73k51L6Q2j77
$$ -99 -29 118 -32 140 174 -262 27 -260 -119 -281 2 -74 126 -102 62 15 -88 185 -66 -30 52 -125
7375a25Q3K26j49p2j0N9o2K21j46K02j07j6k20K97j45j83q4L45j08n8l1K40r8
$$ -125 -42 184 35 -37 -47 12 -50 171 25 227 120 104 -116 181 36 -147 -231 114 6 -52 -83 157 59
7398E9j13J39M3n0j34P8q3Q2K6q9L4j07M5M2k20K42lR6j95J31j1j77J84J4J2N
$$ 59 -54 85 128 78 -56 22 -61 21 47 -42 -8 -115 -70 -28 -248 -6 -9 87 -108 23 12 -165 19 33 45 50
7424E0o8J65k12J85pk79L48l23K48j29p6k5J99j49n9L08j21m4j37J64n1o1R7j69
$$ 50 -18 147 -65 120 113 -166 182 -141 107 -22 -98 -123 76 -73 -132 176 55 11 -126 38 -13 -74 23 -146
7448a46J92m8O0n0j37l3J30j15N8m6J53p2J01Q6j09NJ00j69P6j02O3Q4R5k7l58
$$ -146 46 -2 58 8 -129 -162 -32 -147 -89 -135 18 -54 47 133 24 29 129 -40 36 -66 -3 81 176 149 -209
7473b09M26m08J37P3K5J27j22j15l8j8l3J05J3j23N7J31j07K0K12j58J39j09j13
$$ -209 217 -191 -54 19 44 171 49 -66 -104 -122 -155 -50 -37 -160 -103 28 -79 -59 153 -5 134 25 -88
7496h8J45J21k6k92J98o8J20j20P2K5j03R4n8J95l86J22K82j33M4j82K73l78K29
$$ -88 57 178 152 -140 58 -10 110 -10 62 87 -16 78 20 215 -171 -49 233 100 144 -38 235 -143 86
7519H6Q3l58J27M5Q9j04j24K46m3j54J75j48K02p5jP5k19K9K28j30q0K1J00j06
$$ 86 169 -189 -62 -17 72 -32 -156 90 47 -107 68 -80 122 47 46 121 -98 -69 159 29 -51 -30 70 -36
7543c6J01l0k98K18R5q8QJ67L9k36k2j47L02l4p1m1J36N6J04j56j74K43j46jr5
$$ -36 65 35 -263 -45 50 -38 -30 137 176 -60 -82 -229 73 39 -32 -73 63 119 223 67 -107 136 -10 -11 -106
7568a06j8R0j00O6L2J03j72K7j10K45K4j84K4J0J89j17M3k35K65L5j50k8JN3k2
$$ -106 -124 -34 -134 -68 -36 67 -105 -78 -188 57 81 -103 -79 -69 120 3 46 -189 76 111 -39 -67 -66 -13 -35
7593c5O1j14J27j72Q9l8P5K23j66k73k8L17L8j68J39J41k67K12l3k29k9R7K46
$$ -35 26 -88 39 -133 -44 -82 -7 216 50 -223 -251 66 104 -64 75 216 -51 161 128 -101 -130 -33 213
7616B13l43J51j2p8J50k35R5j93M68j35R5j58n1M1q7J05jj80K3J72j37Rj10O0
$$ 213 -130 21 9 -69 81 -154 -59 -252 216 81 176 18 -33 8 -79 26 25 -155 -132 40 -97 -88 -198 -138
7640a38L20m7L9k49K05K18m46O1j88L69l18J89J60j05j60P5R4j24m3K02l2j53
$$ -138 182 135 174 -75 130 348 -98 -37 -225 144 -174 15 175 70 -90 -15 79 -45 -88 114 82 -71
7662g1O6m9p4k0K7J80j65J12l4J54j97J1J04L9j35K3J16J0j50pj6J21Q8m1j71
$$ -71 -5 -54 -128 -148 -121 59 -106 6 -28 126 -71 -60 44 83 -52 -29 87 97 -53 -60 -76 45 133 92 -79
7687g9J29J68l68K0J32J75k58R3o5J32j27q5n1J3K40K38k82J78o2j60j18J68j2
$$ -79 50 218 -150 -130 2 177 -81 12 -53 79 -48 -133 -184 -171 69 307 25 203 141 -19 -137 31 19
7710A9o1J6O0P8j53K16j93K09k40JL7p5Q6j97J04J06j66P0q7Q2J30M9j46J1n8
$$ 19 -42 -26 34 112 -41 175 -18 191 -49 -48 -11 -86 0 -197 -93 13 -153 -83 -170 -88 42 91 -55 -44 -102
7735a02nJ1j38K20mp6nQ4O1j52K08k03j95O2K00J99j50J90j96k7q1n2L49l89R7
$$ -102 -107 -96 -234 -14 -18 -94 -99 -15 46 -106 102 -101 -296 -234 -34 165 15 205 9 -18 -99 -151 198 -191 -94
7760i4J27Q7k41K28j25k1j03J12J05Jk31J53LK6pn2l1Q8L7j14K56n4n9j42M9J5
$$ -94 33 120 -121 107 -18 -39 -142 -30 75 76 -155 -2 1 27 20 -32 -63 25 62 -52 204 150 91 -51 -2 13
7786A3o6R8K5J2n7q5K48J2l85L65j12Lj08K3M9J03k15lK20j22M3M2M3l9n2o6q8
$$ 13 -53 45 70 82 25 -60 188 200 -185 180 68 71 -37 -14 35 138 -77 -80 140 18 61 103 146 107 55 -11 -99
7813i9J37j81J88n0m0K41q6L4j00j07N6P6n5k12J35J27LJj66J7J4J9N0KL0j02
$$ -99 38 -143 45 -5 -45 196 110 144 44 -63 -7 69 14 -198 -63 64 67 68 -98 -81 -67 -48 2 4 34 -68
7839f8jL8o1j3k3J24k6N2j31J96K6j31N6K6P3j55J73l0j24r5J06k12J34l4K25
$$ -68 -69 -31 -92 -105 -128 -4 -30 22 -109 87 113 -18 38 64 137 -18 155 125 1 -94 12 -200 -66 -100 125
7864A25j32j5j70K76k10L40j76pj04l4R1m2K28l54K52k71J46r5J64n7J29k60J91
$$ 125 -7 -22 -192 84 -126 214 38 31 -73 -107 -16 -58 170 -184 68 -203 -57 -152 12 -45 84 -176 15
7887A5J7j87K09L5L3j43p2L6J14k77K72Kk51J43J50m5N3n2j27P5r3L17m20L77
$$ 15 32 -155 54 89 122 -21 -93 -57 57 -220 52 54 -197 -54 96 51 104 52 -75 0 -93 224 -196 181
7911A81j76k04L34j67L89m55j0J69m2k6J60j76K04j54K19k43N4mO4j6L8l33K22
$$ 181 5 -199 135 -32 357 -98 -108 61 19 -7 153 -23 181 27 246 3 57 53 117 101 139 -194 28
7934B8Q2k16K98r3k11J21N0j06K33r8J37k98J26k8j43N8K16j13n8p1o8J70L8j
$$ 28 110 -106 192 99 -112 9 59 -47 186 88 225 -73 53 25 -118 -60 156 43 -15 -86 -154 16 54 53
7958E3P3m8j32j17J42K3K6J54m9j69J33M3l1q5K7j02jPk5p2J20p6K92k99Q0J2
$$ 53 126 78 -54 -171 -29 -6 20 174 125 -44 89 132 101 16 43 -59 -60 -53 -78 -150 -30 -106 186 -113 -33 -21
7984b1n5n4K63q5j66K14J13l53j8J29O1o1j9K67k53j52j0J41J28l30K70j6M6k32
$$ -21 -76 -130 133 48 -118 96 209 -144 -162 -33 28 -33 -52 215 -38 -190 -200 -59 69 -261 9 -7 39 -193
8008a93P3K52k76K21P4k3k08K65j55N4r5j04K25j49l2J62j45L73l25R6j85K93
$$ -193 -120 132 -144 77 151 128 -80 185 30 84 -11 -115 110 -39 -71 91 -54 319 -6 90 -95 198
8030A98j91qJ94k73M4Qk4L14j27o8j89J72n7J24K6k06%N6j41J13O1q1K53l9j43
$$ 198 7 -1 193 -80 -36 -28 -52 262 135 67 -122 50 -7 117 143 -63 -63 -7 -148 -35 26 -55 198 159 16
8055A6kk6Q5k3n0M1m8L78k20j6j56O3M2l13P6J47j20N8LN9J55nk97K36j72N2J13
$$ 16 14 -12 73 50 0 41 -7 371 151 135 -21 42 84 -229 -153 -6 -126 -68 -65 -6 149 144 -153 83 -89 -37 76
8082G6K8l07J37J10L7J16k72J45j89j0O7K55k77m1k4j5J42q6J35o7K41P1m06m4
$$ 76 104 -203 -66 44 81 197 -75 70 -119 -129 -62 193 -84 -125 -149 -164 -22 -108 27 -40 201 272 -134 -178
8106a78J09K00Q1k16j04P6m2j3n0J47J06J32k10J8r6J14J28r8k84J59J42j13o3
$$ -178 -69 131 212 -4 -108 -32 -74 -87 -137 10 116 248 38 56 -40 74 202 104 -180 -21 121 8 -55
8129e5m4j5O5L23r5k69ONJ75o6r8k1J41J07j40R2j93l1l5J5L06j57Q7k42J37K3
$$ -55 -99 -114 -49 274 179 -90 -84 -79 96 30 -68 -89 52 159 19 111 -82 -113 -148 -133 173 16 103 -139 -2 21
8155B1m4K62j13k48N0J39J43r2k80J85q5M9o1K15k03K2N1O1r3L1J4l25J55K97
$$ 21 -23 239 126 -122 -72 67 210 118 -162 23 -62 -13 -74 141 -62 -40 11 72 -21 10 24 -301 -146 151
8179A51k19O5q0j02J91o6k1P2K5k28J34J76
$$ 151 -68 -3 -83 -185 6 -60 -81 -9 16 -212 -78 98
8191I8
$$ Imaginary data points
##PAGE= N=2
##DATA TABLE= (X++(I..I)), XYDATA
0@%%%%%%%%Qj6J6j6K4l2M0n6P2q8J04j23J47j76K14k54K96l45M02m71N43o23P16
$$ 0 0 0 0 0 0 0 0 0 8 -8 8 -8 16 -16 24 -32 40 -48 56 -67 80 -96 118 -136 160 -185 217 -254 289 -334 382
31C82q15R27j053J190j342J510j694J894k114K357k624K914l227L572l949M360
$$ 382 -433 494 -559 631 -711 799 -895 999 -1115 1242 -1382 1532 -1695 1877 -2072 2288
47B288m809N301n842O434p088P813q617R514j0524J1668j2974J4482j6249J8354
$$ 2288 -2521 2780 -3062 3372 -3716 4097 -4520 4994 -5530 6138 -6836 7646 -8603 9751
61I751k0909K4086k8164L3620m1335N3156p3749J19755m07687J07048N96650n01245
$$ 9751 -11158 12928 -15236 18384 -22951 30205 -43544 76211 -331476 -224428 372222 -129023
73a29023j00532L17287k9175k86938K34014J92333q6853j792M5809k13694N4257
$$ -129023 -229555 87732 58557 -228381 5633 197966 111113 109321 155130 -58564 -4307
84d307K39926j70635k76100K05005R4218k49733L7640K74232j40850k28851J13509
$$ -4307 235619 64984 -211116 -6111 88107 -161626 -123986 150246 9396 -219455 -105946
95a05946Q4340l9549J99331M9292l22601K135L35992j38937k88249K72692K43290
$$ -105946 -21606 -61155 138176 187468 -135133 -132998 202994 64057 -224192 48500 291790
106B91790l29416j74497K75538M6573k03242O5932J20259q5499j1873L3468q1633
$$ 291790 -37626 -212123 63415 109988 -93254 -27322 92937 7438 -4435 29033 -52600
117e2600O7011J25091j88922j46707K43851P8422k84852P019K71160r9056k01303
$$ -52600 14411 139502 -49420 -196127 47724 126146 -158706 -151687 119473 20417 -180886
128a80886J63565J02454j26257Q1392J14544j73949l6992K22931m1935j98683
$$ -180886 -17321 85133 -41124 40268 154812 -19137 -56129 166802 124867 -73816
138g3816J18452R0960k41009l8653K42773o0407k13926R1241Q8866j19134L2597
$$ -73816 44636 135596 -105413 -144066 98707 38300 -175626 -84385 4481 -114653 -82056
149h2056J31970n9055j4863J29591p7860j31276K00082J30922k46184o5170K29628
$$ -82056 49914 -9141 -24004 105587 27727 -103549 96533 227455 -18729 -83899 145729
160A45729n4049k15360R6060J09626j54026m0257J36102l7422p5408J04414n433
$$ 145729 91680 -123680 -27620 82006 -72020 -112277 23825 -13597 -89005 15409 9976
171I976j21087J10470J21606j47576l7707J80946l7860j75501Q0574J17394j06397
$$ 9976 -111111 -641 120965 -26611 -64318 116628 78768 -96733 -16159 101235 -5162
182e162m3220R7304m4144o6968R5971n376j13773R0546J03761j41332n6054J60507
$$ -5162 -48382 48922 4778 -62190 33781 28405 -85368 5178 108939 -32393 -88447 72060
194G2060o743j57801N3077J17528q9878o4939Q3827o998m9001O5892q48p8818
$$ 72060 65317 -92484 -39407 78121 -11757 -76696 7131 133 -48868 17024 16176 -62642
206f2642P6593Q5544j11943n0078J41121J5705j36820K4333R7496p0240o2584
$$ -62642 13951 99495 -12448 -62526 78595 94300 -42520 -18187 79309 9069 -53515
217e3515N6967j1579m1341N1853o153p8068N1176Q2510p9918m6148J24977K6845
$$ -53515 3452 -8127 -49468 2385 -3768 -81836 -30660 51850 -28068 -74216 50761 77606
229G7606j18853K2011J06004m5456o5150M2688Q954l2635K0012q583n4504L2475
$$ 77606 -41247 -19236 86768 41312 -23838 18850 27804 -4831 15181 6598 -47906 -15431
241a5431N0862p7974m3252J11873K8574j12180L644R9571j4413n6987K5488K7592
$$ -15431 35431 -42543 -85795 26078 54652 -57528 -53884 45687 31274 -25713 -225 27367
253B7367j2569J333j0129k6464L8042L7239p6769m5284R0744K6934r1434l012
$$ 27367 14798 16131 6002 -20462 17580 54819 -21950 -67234 23510 50444 -40990 -44002
265d4002Q1014j0965o7216J0479M7211R32j5402q960n394K9313J4276n6417j4595
$$ -44002 37012 26047 -41169 -30690 16521 17453 2051 -6909 -12303 17010 31286 -25131 -39726
278c9726P3134P940p5611K636P3912q059p2900J03N6534P719k9858j2820J4066
$$ -39726 33408 41348 -34263 -31627 42285 34226 -38674 -38571 17963 25682 -4176 -16996 -2930
291b930K8425j3264n5422Q931P2829L253o8823m855O4771k009o9083J171O6079
$$ -2930 25495 12231 -43191 -34260 38569 41822 -27001 -31856 32915 30906 -38177 -37006 29073
304B9073J0095m7499k1580L1418K8390k8487l7690K2838M3988j1717m4462P927
$$ 29073 39168 -8331 -29911 1507 29897 1410 -36280 -13442 30546 18829 -25633 -17706
316a7706M9322j0835o2565L074O6017J5735n1922k2828M2299J6127m5808j2734
$$ -17706 31616 20781 -41784 -38710 27307 43042 -8880 -31708 10591 26718 -19090 -31824
328c1824N1916K5556m0157m0401J9995M6645q308n1586o111M8889J2563n4134
$$ -31824 20092 45648 5491 -34910 -14915 31730 23422 -28164 -34275 14614 27177 -26957
340b6957j4216O3162J0706p0631j0429O9995K5868m1924k2904K4029J9897j0910
$$ -26957 -41173 21989 32695 -37936 -48365 21630 47498 5574 -17330 6699 26596 15686
352A5686k0592J373L0899K624n8082j7305O4027R827p1874j0050O3232O481m7822
$$ 15686 -4906 -3533 27366 29990 -28092 -45397 18630 28457 -43417 -53467 9765 16246 -31576
365c1576N094M4086L330k2023n045J1480L0934P380m9162j2029N7557j496p5223
$$ -31576 -26482 17604 20934 -1089 -6134 5346 36280 43660 -5502 -17531 40026 38530 -36693
378c6693l096O6952q487o3835Q350M2816j1120j8844Q296Q504K0276R726l5717
$$ -36693 -39789 27163 18676 -45159 -36809 6007 -5113 -23957 -15661 -7157 13119 22845 -12872
391a2872m958N9977O392p0409k348O5084j4871n7463K7336L5130l9628k2938K3327
$$ -12872 -17830 42147 48539 -21870 -24218 40866 25995 -31468 -4132 30998 -8630 -31568 -8241
404h241O869N658J0878k9720j7538M8154J4668n7879L914O2537k9534o1091M5167
$$ -8241 -1372 4286 15164 -14556 -32094 16060 30728 -27151 -23237 39300 9766 -51325 -6158
417f158M6981m3995k5070K6950L132O22K3286j5589k7197L7331J7050n7998L809
$$ -6158 40823 -3172 -28242 -1292 1840 2462 25748 10159 -17038 20293 37343 -20655 -16846
430a6846O8082l1374p3321L4676M5388m1531k2253L0809p003j6166L1729N220
$$ -16846 51236 19862 -53459 -18783 26605 -14926 -37179 -6370 -13373 -29539 2190 7410
442G410k6885L0932K5100m8200L794O8807k0673o5194L0754L8118m8070k1775
$$ 7410 -19475 11457 36557 -11643 -7849 60958 40285 -24909 5845 43963 -4107 -25882
454b5882L8018j3725l6620K4020O306l0598K9691K7554n1669k892P4361n131o0703
$$ -25882 12136 -1589 -38209 -14189 -7883 -38481 -8790 18764 -32905 -35797 38564 33433 -27270
467b7270L0496M7703m2191k3272M3601o650l6726J9396J348l3952K6410K5496
$$ -27270 3226 50929 8738 -14534 29067 22417 -14309 5087 6435 -27517 -1107 24389
479B4389n2929j2384O5928m653o0454K8689M9728m2090k4615M5666k684l1975
$$ 24389 -28540 -40924 25004 20351 -40103 -11414 38314 -3776 -28391 17275 14591 -17384
491a7384K2395L126l4160K4883L2722m5177j8768N9913Q4n5964K9420M7769m8021
$$ -17384 5011 8137 -26023 -1140 31582 -13595 -32363 27550 27634 -28330 1090 48859 838
504H38k7616M8632L04l7277J2924L076l0769J9486K6319m7512j3915O7863m484
$$ 838 -26778 21854 22158 -15119 -2195 881 -29888 -10402 15917 -31595 -45510 22353 17869
517A7869o7144L5865O6416m0127l3149M5431P345l0456J7686P182l7968P986K7374
$$ 17869 -49275 -13410 53006 12879 -20270 25161 32506 2050 19736 26918 -11050 -3064 24310
530B4310m3238k0758N6447j0690o7736L3750N9725m4363l1290N5758J5737l8300
$$ 24310 -18928 -39686 16761 6071 -61665 -27915 31810 -12553 -43843 11915 27652 -10648
542a0648J2132K3717k1345R428K4373m3113j9254N8223o371o8131K2623N2297
$$ -10648 1484 25201 3856 13284 37657 -5456 -24710 33513 27142 -40989 -18366 33931
554C3931m3693l5511N2226J4318m6736Q391L1816j8368N9K2310k8969r154N0740
$$ 33931 -9762 -45273 6953 21271 -25465 -17074 14742 -3626 -3567 18743 -10226 -19380 31360
567C1360j2383o0856L3139N8292m8173m5758N3291K4976m4192K693K5713k1266
$$ 31360 18977 -41879 -8740 49552 1379 -44379 8912 33888 -10304 -7611 18102 -3164
579c164l21K5919k5556j8296L8843n850m9883K5897M5718m8623l5107O0255J7765
$$ -3164 -3485 22434 -3122 -21418 17425 11575 -38308 -12411 33307 -15316 -50423 9832 27597
592B7597n3725P279M3160j2993j2762J6058j2049l865L6430j1320n4308K2155
$$ 27597 -26128 -18849 24311 11318 -1444 14614 2565 -1300 35130 23810 -30498 -8343
604h343M8370m4383l9872M8627J3520n0141N799L7541j5262j4188K2875k863r495
$$ -8343 40027 -4356 -44228 4399 17919 -32222 -26423 11118 -4144 -18332 4543 1680 -7815
617g815K7685j173l6470K5043L8676m8339l2477N6092J4641n7045l297L7040j3338
$$ -7815 19870 18697 -17773 7270 45946 -2393 -34870 21222 35863 -21182 -24479 12561 -777
630g77j9017J9979j390j4377K2635J448l3149K2134L6818l7810k4502M8697P251
$$ -777 -19794 185 -1205 -15582 7053 8501 -24648 -2514 34304 -3506 -28008 20689 27940
643B7940n1517P894M4253j9442l0846K0250Q045j2751J5626j863l0564J9427L4175
$$ 27940 -23577 -15683 28570 9128 -21718 -1468 6577 -6174 9452 7589 -22975 -3548 30627
656C0627l4423k5577M4013J2003m7974J83M0364j3626k4208K0981L592j9247J3862
$$ 30627 -3796 -29373 14640 26643 -21331 -21148 19216 5590 -18618 2363 5955 -13292 570
669E70Q564k0308J2017K3028k8917j8187M1972R488m6842L273M0484j8303l0066
$$ 570 9134 -11174 843 23871 -5046 -23233 18739 28227 -18615 -15342 25142 6839 -23227
682b3227K1681J0738j7545N901M957j7932R643K4519k1008j8953L3976Q628l9076
$$ -23227 -1546 9192 -8353 -2452 2505 -15427 -5784 18735 -2273 -21226 12750 21378 -17698
695a7698O410L8347j7345k6885J8718Q511j7031O988Q611j7947J628J9997j7507
$$ -17698 -11288 27059 9714 -17171 1547 10058 -6973 15 8626 -9321 -7693 12304 -5203
708e203j6799L3414R932l8690L92L3858r298k0681J7070P899j8560J737J2311
$$ -5203 -22002 11412 21344 -17346 -16954 16904 7606 -13075 3995 11894 -6666 -4929 7382
721G382j0111P27J4633j6953j5088K8171Q203l1355L076K8075j2765k1815J8178
$$ 7382 -2729 -2002 12631 -4322 -19410 8761 16964 -14391 -11315 16760 3995 -17820 358
734C58J3923j6602k061R233r923J761J7298j3973j6204K2707Q333k7159p12K6496
$$ 358 14281 -2321 -4382 4851 -5072 -3311 13987 14 -16190 6517 14850 -12309 -13021 13475
748A3475o087k1209J1056J1401j2338M52Q474q967J899J3412j3163j2616K1219
$$ 13475 7388 -13821 -2765 8636 -3702 -3250 5224 -3743 -1844 11568 -1595 -14211 7008
761G008Q753k5035k192K4157o629k0936J2360J4262j3030n124O585l689L070R647
$$ 7008 15761 -9274 -11466 12691 6062 -14874 -2514 11748 -1282 -6406 179 -3510 -440 9207
775I207j0590r962J6313O493k0787j3K4380o065k3747Q002J6105o599n653K569
$$ 9207 -1383 -11345 4968 11461 -9326 -9339 15041 8976 -14771 -6769 9336 2737 -2916 -347
789c47k288J733O284o583n422J4059L967k1058j603K3201k081k0061L967J1715
$$ -347 -2635 -902 5382 -1201 -6623 7436 11403 -9655 -11258 11943 9862 -10199 -6232 5483
803E483n843o517L472L256J418n2o530p17J4738K360j8150J285K0510n044j8164
$$ 5483 -360 -6877 -3405 -149 1269 1217 -5313 -6030 8708 11068 -7082 -5797 14713 9669 -8495
818h495O106J3471o753j3354J914Q012L42m749o347K733J2188k603j3971O942
$$ -8495 -2389 11082 4329 -9025 -7111 901 1243 -3506 -9853 -7120 5068 2465 -11506 -4564
832d564J7906n100j4684N302J2962l942j0838K296P149j721o636o101L577Q741
$$ -4564 13342 8242 -6442 -1140 11822 7880 -2958 -662 6487 4766 -1870 -7971 -4394 4347
846D347n128j1881O071J2625m873j0960O012J2505m323j0753N058J0667j332r609
$$ 4347 -781 -12662 -6591 6034 1161 -9799 -3787 8718 4395 -6358 -1300 9367 8035 -1574
860a574l896Q303N670r634o953R236P089q971r481P756J1280o033j0904L750J0193
$$ -1574 -5470 2833 8503 -1131 -8084 1152 8241 -730 -10211 -2455 8825 2792 -8112 -4362 5831
875E831j274j0150k122J0755K233j0710k510R855M737p460n395O966P488l300
$$ 5831 4557 -5593 -7715 3040 5273 -5437 -7947 1908 6645 -815 -6210 756 8244 4944
889D944o340J578P282l15j1030j156J1388j509j3678o04R884L6q115p29P006K620
$$ 4944 -1396 182 7464 7149 -3881 -5037 6351 4842 -8836 -9440 444 480 -7635 -8364 -1358 1262
905A262k265k111K958Q735Q34j1613L05J4251j331j4713J94J0395m014j0935K145
$$ 1262 -1003 -3114 -156 8579 9413 -2200 -1895 12356 11025 -3688 -3494 6901 2887 -8048 -5903
920e903O364k707l421j387O4P861M112r235j262J2799L58j1392L262J2088n678
$$ -5903 461 -2246 -5667 -7054 -6990 871 4983 -4252 -5514 7285 7643 -3749 -487 11601 5923
935E923j1030N353M785n332o63L98m157L424M396p328j861J1249k19j3393L798
$$ 5923 -5107 246 5031 -301 -964 -566 -4723 -1299 3097 -4231 -6092 5157 4938 -8455 -4657
950d657J4518o393j1186P612M746p223K08L590l338K107M494p262l505J2819K568
$$ -4657 9861 3468 -7718 -106 4640 -2583 -2375 1215 -2123 -16 4478 -2784 -6289 6530 9098
965I098j5113K641J4422p263j0908Q579L715q777K73L625n475O31P272o086o499
$$ 9098 -6015 -3374 11048 3785 -7123 1456 5171 -3606 -3333 292 -5183 -4552 2720 -3366 -9865
980i865J2813M422j4959L703J6180p019j1122J0104M995j0072L49O061o726k928
$$ -9865 2948 7370 -7589 -3886 12294 5275 -5847 4257 9252 -820 -471 5590 -1136 -4064
994d064P499n841q833J2477M600j6492J747J6887n778j1591J1204P146j0292p04
$$ -4064 3435 -2406 -11239 1238 5838 -10654 -8907 7980 2202 -9389 1815 8961 -1331 -2035
1008b035Q495m939k704Q845o814j0420J3077N664j7497o19J7398n113j4777J0011
$$ -2035 6460 1521 -1183 7662 848 -9572 3505 9169 -8328 -8947 8451 3338 -11439 -1428
1022a428R790j1100j733R677n715l862R985l643j0565J1028N776j6037k32J8519
$$ -1428 8362 -2738 -4471 5206 -509 -4371 5614 1971 -8594 2434 8210 -7827 -8059 10460
1036A0460n540j6487J1083J1724j2926l663J1224l643n301P901l753r880J0944
$$ 10460 4920 -11567 -484 11240 -1686 -5349 5875 2232 -3069 4832 1079 -8801 2143
1049B143P151j7491l181J9486l454j7918J0623J3283j3365m423J2902j665o675
$$ 2143 9294 -8197 -11378 8108 4654 -13264 -2641 10642 -2723 -7146 5756 4091 -2584
1062b584P020p32q602Q234O480j5767l113J9411n260j9684J0438J4695j3989o567
$$ -2584 4436 3704 -4898 3336 9816 -5951 -9064 10347 5087 -14597 -4159 10536 -3453 -10020
1076a0020J2919j08q093P016K616q883N753Q373j3152k765J7428n353j8454J1487
$$ -10020 2899 2791 -5302 1714 4330 -4553 1200 9573 -3579 -6344 11084 5731 -12723 -1236
1090a236J4341j6167r096J5559K129j1577L734M711o994M669P274j2725k480J8446
$$ -1236 13105 -3062 -12158 3401 5530 -6047 -2313 2398 -4596 73 7347 -5378 -7858 10588
1104A0588l761j8476R860J4741j3662r304J5069J609j3732M847P952q321M8P104
$$ 10588 6827 -11649 -1789 12952 -710 -10014 5055 6664 -7068 -2221 5731 -2590 -2542 4562
1118D562q288k082J3601l672j5719R643J4963j4522j0113J6955L243j4852L073
$$ 4562 -3726 -5808 7793 4121 -11598 -1955 13008 -1514 -11627 5328 8571 -6281 -3208
1131c208R069p003j115O788o545l939J1499j418j3527P598J3011j3820r153J7663
$$ -3208 5861 -1142 -2257 4531 -2014 -5953 5546 4128 -9399 -1801 11210 -2610 -11763 5900
1145E900L068j6495L049J1212o154l962O468l132m750R719M2j3153O082J2813
$$ 5900 8968 -7527 -4478 6734 580 -3382 3086 -46 -4796 4923 4965 -8188 -2106 10707
1159A0707j2272q791J5162K757j4797L431J1101p389n943Q743k54p015O415K049
$$ 10707 -1565 -10356 4806 7563 -7234 -3803 7298 -91 -6034 2709 2455 -4560 1855 3904
1173C904j0430N253J0673j0956p784J4521L252j4570J689J1755n463p195P351
$$ 3904 -6526 -1273 9400 -1556 -9340 5181 8433 -6137 -4448 7307 1844 -5351 2000
1186B000M32p178N440K986r656K390R835p592o841J1302L188j1841J938J1494
$$ 2000 2432 -4746 694 3680 -5976 -3586 6249 -1343 -8184 3118 6306 -5535 -3597 7897
1200G897n769p246Q603J331q007M231L677q221L78Q523o280p511R071M165j1013
$$ 7897 2128 -5118 3485 4816 -3191 1040 4717 -3504 -3126 5397 -883 -8394 677 4842 -6171
1215f171Q18J0683m724o260P885K004o791L506M537o333p88P632m355p860P503
$$ -6171 -5353 5330 606 -5654 2231 4235 -2556 950 5487 -846 -1634 5998 1643 -6217 1286
1230A286M735j0574j309R556l227o358O065K295n753K382M848n322j368P879k365
$$ 1286 6021 -4553 -5862 3694 467 -5891 174 2469 -3284 -902 3946 -1376 -2744 5135 2770
1245B770q137N920N280q169j672P580j960n780M217K619m647J090L948m177j771
$$ 2770 -5367 553 5833 -2336 -4008 3572 1612 -4168 49 2668 -1979 -889 3059 -1118 -2889
1260b889O931j813p378M984N335p561k812P448k14o034K274L379k505L7L582l646
$$ -2889 4042 2229 -5149 -165 5170 -2391 -5203 2245 2031 -4003 -1729 1650 -855 -818 2764 -882
1276h82k34O198j860o583M385M954o339l915N984Q43o154p7L975j843p98K282
$$ -882 -1116 5082 3222 -3361 1024 5978 -361 -4276 1708 2551 -3603 -3680 295 -1548 -2346 -64
1292f4k381M47M786j343m277M143M547m980l572O369J400o394j142M043j026k225
$$ -64 -2445 -1998 2788 1445 -2832 1311 5858 878 -2694 3675 5075 -1319 -2461 1582 556 -1669
1308a669J97p11P89J996j949k585M530L566n359l111O482K903o067j275M579K61
$$ -1669 -1472 -2183 -1394 602 -1347 -3932 598 4164 -1195 -4306 2176 5079 -988 -2263 2316 2577
1324B577l406l25J027J390j74k412j130L492K288m091k762N389J982n642j128
$$ 2577 -829 -1154 -127 1263 1089 -1323 -2453 1039 3327 -764 -3526 1863 3845 -1797 -2925
1339b925M394O03m125j289L075J485k249j397J073K737P38l271j14M766O83m692
$$ -2925 1469 2072 -2053 -3342 -267 1218 -1031 -2428 -1355 1382 2120 -1151 -1265 3501 4184 -508
1355e08q42M470O74n296j667M099O87m124j505K257K126j253k678J522L758J00
$$ -508 -1350 3120 3794 -1502 -3169 930 1617 -2507 -4012 -1755 371 -882 -3560 -2038 1720 1820
1371A820k903L14M406R85m729j062M409Q36m834j833L082Q05l381j495K378J503
$$ 1820 -1083 -769 3637 4622 -107 -1169 3240 4076 -758 -2591 491 1296 -2085 -3580 -1202 301
1387C01j337j842O19L397J090l671l70M522Q21m559n75M768J06m967m28L470N3
$$ 301 -1036 -2878 -2259 1138 2228 -1443 -1813 2709 3530 -1029 -1604 3164 3270 -1697 -2125 1345 1398
1404A398k022r64O04J654K93k572p55L662J257m683p83N301K3n127J077L500j230
$$ 1398 -624 -1588 -984 670 963 -1609 -2364 1298 2555 -2128 -2911 2390 2413 -2714 -1637 1863 633
1421F33k345J012J234P8J66q88j187K842J520m150q07M928j163m972J418M238
$$ 633 -1712 -700 534 612 778 -110 -1297 1545 3065 -1085 -1892 3036 1873 -3099 -1681 2557
1437B557k370l301K103J488j732O25P51j146J541J957l272p63M982j64n172J458
$$ 2557 187 -3114 -1011 477 -1255 -630 121 -1025 516 2473 -799 -1562 3420 3256 -1916 -458
1453d58M021k759l524L114J085l134M16J496k138O11K827k474j592M318M29m205
$$ -458 3563 804 -2720 394 1479 -1655 -1239 257 -1881 -1270 1557 -917 -2509 1809 2238 -1967
1469a967J453M021k700l234L814J045m067J110K343l106l07L118j896k210L533
$$ -1967 -514 3507 807 -2427 1387 2432 -1635 -525 1818 -1288 -1595 1523 -373 -2583 950
1484I50J035m352O95M939k859l013L984R46m087J501K449l105p61L743j611l477
$$ 950 1985 -2367 -1672 3267 408 -2605 1379 2325 -1762 -261 2188 -917 -1678 2065 454 -3023
1500c023L373K364m648n9M573j880l263L385J054l659J627K398l184j117M317
$$ -3023 350 2714 -1934 -1993 2580 700 -2563 822 1876 -1783 -156 2242 -942 -2059 2258
1515B258r09m736L422L058m753j324N202j177l685K904J511l056Q93K624k795
$$ 2258 1349 -3387 35 3093 -1660 -2984 2218 1041 -2644 260 1771 -1285 -392 2232 -563
1530e63j487M479r64m745L396L554n433j272N519p91m646K381K478k619j78K587
$$ -563 -2050 2429 1465 -3280 116 3670 -1763 -3035 2484 1693 -2953 -572 1906 -713 -891 1696
1546A696k325j146M448j511m716M074L526n390k194N931j41n150K093L088l169
$$ 1696 -629 -1775 2673 1162 -3554 520 4046 -1344 -3538 2393 2252 -2898 -805 2283 -886
1561h86o69L041j816j265L831j518l742L682L464n231k140O115J63o314J962M293
$$ -886 -1555 1486 -330 -1595 2236 718 -3024 658 4122 -1109 -3249 2866 3029 -3285 -1323 2970
1577B970l167k008K544m96j309K577o39l367L156L173n121j328O347j01o636K192
$$ 2970 -197 -2205 339 -157 -1466 1111 472 -2895 261 3434 -1687 -3015 3332 3231 -3405 -1213
1593a213N190l561k651K747J27j779J450l13k646K857K586m963j322O597n84o290
$$ -1213 3977 416 -2235 512 639 -1140 310 -3 -2649 208 2794 -2169 -3491 3106 2522 -3768
1609c768K878M935l710k959L862N87k712R38N57j867J588J724m328n00N762q68
$$ -3768 -890 4045 335 -2624 1238 1825 -887 51 608 -1259 329 2053 -2275 -2775 2987 2119
1625B119o285K805N384l711l466L868J286l149N35J433j732P88J793l171p07N094
$$ 2119 -4166 -1361 4023 312 -3154 714 2000 -1149 -614 819 -913 -125 1668 -1503 -2210 2884
1641B884j073n102L004M410l780l565M712J311m027k59K386j563K36J131k868
$$ 2884 1811 -3291 -287 4123 343 -3222 1490 2801 -1226 -1485 901 -662 -426 705 -2163
1656b163k34M015r42m077K887M278l873k764M942J443m223L05K623j461j180J437
$$ -2163 -2397 1618 676 -3401 -514 3764 -109 -2873 2069 3512 -711 -406 2217 756 -424 1013
1672A013j672p10K519j423l363K558L517l949k253M772J328l920P98L017j280
$$ 1013 -659 -1369 1150 -273 -3636 -1078 2439 -1510 -3763 1009 2337 -1583 -785 2232 952
1687I52j140J514n72j068J709l17l113J507K578l391j931M344M64m048J157L082
$$ 952 -188 1326 754 -314 1395 1078 -2035 -528 2050 -1341 -3272 1072 1536 -2512 -1355 1727
1703A727j572j466J903L49j169J027l7k191J569K307l074j456L360L31l360R11
$$ 1727 155 -1311 592 941 -228 799 762 -1429 140 2447 -627 -2083 1277 1608 -1752 -841
1719h41K721j524j852K327o3j907J492J31j929R99J553j973j229K715L11k757
$$ -841 1880 356 -1496 831 768 -1139 353 484 -1445 -446 1107 -866 -2095 620 931 -1826
1735a826R53K621j449j316K273j3j533J088Q00j891J91J431j676j217J743K07
$$ -1826 -873 1748 299 -1017 1256 1243 -290 798 1598 -293 -102 1329 -347 -1564 179 386
1751C86k485M85K307j363j142K161M8j305J441Q68j372J71J734j088j643J353
$$ 386 -2099 -1614 693 -670 -1812 349 397 -908 533 1401 29 200 1934 846 -797 556
1767E56P87k227J47J417j132j182J788l44j148J353N84j324O8K159q24j618J549
$$ 556 1343 -884 -737 680 -452 -1634 154 -190 -1338 15 599 -725 -657 1502 678 -940 609
1784F09P45j690r0J085p84n34J208o30p96J139O28j863N37J823q67j770J628R50
$$ 609 1354 -336 -426 659 -125 -659 549 -81 -877 262 890 -973 -436 1387 520 -1250 378 1328
1802A328j685m56R10j32m97K72k95j05Q01K3j314O76J791q33j296J425R50j366
$$ 1328 -357 -813 97 -35 -532 -260 -555 -660 141 164 -1150 -474 1317 484 -812 613 1563 197
1820A97n49R48n5p41j41j81k3O82m69j264J093J565j540j073J989J058j314r33
$$ 197 -352 596 541 -200 -341 -522 -545 137 -332 -1596 -503 1062 -478 -1551 438 1496 182 -751
1838g51J675L11j141m8K92J76k5o98r61J309O79j820p05J893Q07j746l03J645
$$ -751 924 1235 94 46 338 514 489 -209 -1170 139 818 -1002 -1707 186 993 -753 -1056 589
1856E89K87j227m1P42K85m5q40k66J262K0j513l23J680K78j768M2J667K18j548
$$ 589 876 -351 -392 350 635 590 -250 -516 746 766 -747 -1070 610 888 -880 -838 829 1047 -501
1875e01M5N86O30r25r25O05R91k33j545K78K077l44j980M63J582J06j491K83R32
$$ -501 -456 130 760 -165 -1090 -485 506 273 -1272 -994 1083 739 -1241 -778 804 910 -581 -298 634
1894F34K07q59q56R30Q54o60j274L85J339m46j678Q44J451p74q62M04J144l8p60
$$ 634 841 -18 -874 56 910 250 -1024 -639 700 254 -1424 -580 871 97 -765 -361 783 745 -15
1913a5m90J128N34j087p39O90J129j204j087J196O04p78p41M96Q45k29r01R7J063
$$ -15 -505 623 1157 70 -669 21 1150 -54 -1141 55 659 -119 -860 -364 481 252 -649 -552 511
1932E11L29r10n60J155N45j309o72J549%o94o89M26R16p27p49K92P66K76j047
$$ 511 840 -70 -630 525 1070 -239 -911 638 638 -56 -745 -319 597 -130 -879 -587 179 455 -592
1951e92l14J418K63j109q9J147l14n83j41N66K31m29l51p0M94J1q99K49J251k80
$$ -592 -906 512 775 -334 -423 724 410 -173 -314 252 483 54 -297 -367 127 138 -761 -512 739 459
1971D59j729P26J077k39q92M05O36l53l68M71l29L69N05j118j78J303m21j213
$$ 459 -1270 -544 533 294 -598 -193 443 90 -278 193 -136 233 738 -380 -558 745 324 -889
1989h89P28Q66n19j101R65K34o87K42L96n69L29O06q07j95J106m07j083P49P46
$$ -889 -161 705 186 -915 50 284 -403 -161 235 -334 -5 601 -206 -401 705 298 -785 -36 710
2008G10q33o09J252k04r65O34J97n46J48P53q03l27R21K01r96K29J012q87m41
$$ 710 -123 -732 520 316 -649 -15 182 -364 -216 537 -266 -593 328 529 -467 -238 774 -113 -554
2027e54P03J45o64M04N50j184L07J108m54p94N93N69j429P8J373r36o27R58M0
$$ -554 149 294 -370 34 584 -600 -293 815 361 -433 160 729 -700 -622 751 -185 -812 146 186
2046A86p79O73N18j365L63J400q16p61J006Q03j695K80R24q04o53J090o05m90
$$ 186 -593 80 598 -767 -404 996 180 -581 425 1228 -467 -187 737 -67 -720 370 -235 -725
2064g25R85L00j423J59J711j047r21J302P07j756M32J164n57p59N27P7n33L87
$$ -725 260 560 -863 -704 1007 -40 -961 341 1048 -708 -276 888 331 -428 99 176 -357 30
2082C0L44j168M14J235r97j160K051N01k036K65J462o22j049P80N97q63J99J63
$$ 30 374 -794 -380 855 -142 -1302 749 1250 -786 -521 941 319 -730 50 647 -216 -17 146
2100A46q23K81J480j400j046J836P28k142L96J916r26j225J253M97j165j25N62
$$ 146 -677 -396 1084 -316 -1362 474 1202 -940 -544 1372 446 -779 474 971 -194 -319 243
2117B43r07L87R90j258q10J802M28k163M41K111p21j709J642M75r88j70Q88o97
$$ 243 -664 -277 713 -545 -1355 447 875 -1288 -847 1264 543 -1166 476 951 -37 -207 681 -16
2135a6m6O75r22p43J555K39k039L08J964q46j603J655J057j449k34J003m65Q8
$$ -16 -62 613 -309 -1052 503 742 -1297 -989 975 129 -1474 181 1238 -211 -445 558 93 181
2153A81K59m69m88J137L06j972N16J901j105j862J743Q84j448m93J452j63q74
$$ 181 440 -29 -517 620 926 -1046 -530 1371 266 -1596 147 1031 -417 -910 542 379 -495
2170d95P66m30l55R39R6j667N87K019j423j349J602R48j773m44J734l12r37N59
$$ -495 271 -159 -514 425 521 -1146 -559 1460 37 -1312 290 1238 -535 -979 755 443 -494 65
2188F5L67r88P03K94j392M41J390j165j307J527R24j756JJ734k79j260Q77O72
$$ 65 432 -556 147 441 -951 -510 880 -285 -1592 -65 859 -897 -896 838 559 -701 176 848
2206H48q96M16L66j129K89J125j157j138J442P02j881J15J599m59j471J177O37
$$ 848 -48 368 734 -395 -106 1019 -138 -1276 166 868 -1013 -898 701 242 -1229 -52 585
2223E85q69K94N79p02o8R09o45q26J226P09j925j03J367k91j077P06N39q03N1
$$ 585 -284 10 589 -113 -181 728 83 -743 483 1192 -733 -836 531 240 -837 -131 408 -395 -344
2242c44P15l69k85Q45l48p38P27O76j159l72J682q15p92P35M05r66n9R66m81m66
$$ -344 371 2 -283 562 214 -524 203 879 -280 -652 1030 215 -577 158 563 -403 -462 504 23 -443
2262d43Q87j03j033R00M67j060P4Q32k82j004Q91N67j134K5P25Pq12O70J55r90
$$ -443 444 341 -692 208 675 -385 -311 521 239 -765 126 693 -441 -416 309 316 -496 174 329 -661
2282f61P44M98p19l8M71p1q12P42K84n85k45P64l02r07Q27M91q42L53N64l88m72
$$ -661 83 581 -138 -176 295 224 -588 154 438 -147 -392 372 70 -837 -10 481 -361 -8 556 168 -304
2303c04O48Q2p08L72L86p38j69O84k36o38O85P9n11J14P75n08m54O60K83p65K53
$$ -304 344 426 -282 90 476 -262 -431 253 17 -621 64 143 -368 -254 521 13 -441 219 502 -263 -10
2324a0L06l22j56L19j23k96L98J57q08L21P93o56m27Q95J55o30j8J63O0k4K5Q6
$$ -10 296 -26 -182 137 14 -282 116 273 -535 -214 579 -77 -504 391 546 -84 -102 61 121 97 122 208
2346B08n70N21k3n99J75P28m46m37N57L39m99l11P18j80j45k0qJ88J0j39n02M38
$$ 208 -362 159 136 -463 -288 440 -6 -443 114 453 -46 -357 361 181 36 16 8 196 206 67 -435 3
2368CL86n07k61M01M48n37l23P16n1n12Q3M22K2j53o6k17J12K45m71q3M38K46
$$ 3 389 -118 -379 22 470 -67 -390 326 275 -237 -154 268 290 137 71 -146 -34 211 -260 -343 95 341
2390C41o22j27N57J19o24Q4N24n9k40q5o8M08l29N9l22P26M0n40ON49l2r89L87
$$ 341 -281 -408 149 268 -356 -272 252 193 -47 -132 -200 208 -121 -62 -384 342 382 -158 -152 397 365 -624 -237
2413b37M48k6k73L6J94j07n8j14K46K32k05k63j7L91o4l26q5L92J29o78M7N31
$$ -237 211 185 -88 -52 142 35 -23 -137 109 341 136 -127 -144 247 183 -143 -228 164 293 -385 -338 193
2435A93j11l63J51K20K55m41q3L07R3k32j41J47Q8O8m62J82L66r9l31J99J83j1
$$ 193 82 -281 -130 90 345 -96 -179 128 221 -11 -152 -5 83 151 -311 -129 237 138 -193 6 189 178
2457A78k97j4L94j72l10m0K58L56m20o0MM17k32l68L57M16k52m81K42K90j73l7
$$ 178 -119 -133 261 89 -221 -261 -3 353 -67 -127 -123 294 62 -306 51 467 215 -266 -24 266 93 56
2479E6k6m0k9Q0k72K68J92m19k40L23M50n28j19M71j34j32l2L57k15l8J55k9l29
$$ 56 30 -10 -39 41 -231 37 229 -190 -430 -107 343 -185 -304 167 33 -99 -131 226 11 -27 128 99 -230
2502b30M18l8m32K5L88m04j00N12Q2m45m3N15j89m8K26l04PL06ll92K84K55m60
$$ -230 188 150 -282 -257 131 -273 -373 139 221 -224 -267 248 59 11 237 -67 -60 246 243 -149 135 390 -70
2525g0k98L17l1l00L01M12m02l72O87k74k50L27m1k26K62K77m01n0K26J13m06
$$ -70 -368 -51 -82 -382 -81 331 -71 -443 244 -30 -280 47 6 -220 42 319 -82 -132 94 207 -199
2546a99J38L61n34j03N66k93l4J20P1l31R7M36k66l06L73K5m29L02K16k40j06
$$ -199 -61 300 -234 -337 229 -64 -98 22 93 -238 -141 295 29 -277 96 121 -308 -6 210 -30 -136
2567a36L22j95k72K65M07m98qL82j63l87N51K2m19J20K24k04n8L13k46j15J25
$$ -136 186 -9 -281 -16 391 -107 -115 267 104 -283 268 290 -129 -9 215 11 -47 266 20 -95 30
2588C0K73o67Q7O41l62k36K64J86m19K3M67l60j7M41l50l21M41O5m70Q7O06m18
$$ 30 303 -364 -277 364 2 -234 30 216 -203 -180 287 -73 -90 351 1 -320 121 186 -284 -197 409 -9
2610im77O03K64m22q4K39k23J2Q5N0k28J50J24l63K09M79l90l32M47P8l84j17
$$ -9 -486 117 381 -41 -125 114 -109 -97 -12 38 -190 -40 84 -279 -70 409 19 -313 134 212 -172 -289
2632b89N52k54m4J08o7p0K44J7l84K29L30l69l48K97K70m52nN02k55k14K08K22
$$ -289 263 9 -35 73 6 -64 180 197 -187 42 372 3 -345 -48 222 -230 -235 267 12 -202 6 228
2654B28l29K66M3m10j9N92n53l73O80L47q09M9N25j03j36O0J80m34M72k03j20
$$ 228 -101 165 208 -202 -221 371 -182 -555 125 472 -337 -288 237 134 -2 58 238 -196 276 73 -47
2675d7J03J02l05j80N01J42o04J8N23o1o15K58L33k34m9J42N7j40N17n84k92P65
$$ -47 56 158 -147 -327 174 316 -288 -270 253 192 -423 -165 168 -66 -115 27 84 -56 461 -123 -415 350
2697C50p2o97J61N89k76m68M88r2o4o7L27k30n0M71k68k86K41Ll56K10M57k94
$$ 350 278 -419 -258 331 55 -413 75 -17 -81 -148 179 -51 -101 370 102 -184 57 60 -296 -86 371 77
2719G7m98N71j05k41P0J22K05j42n3j12j0L18k5n71M15L41m70j37M36r5q7j68
$$ 77 -421 150 45 -196 -126 -4 201 59 6 -106 -116 202 177 -394 21 362 -108 -245 191 96 9 -159
2741a59J00j95J37L03j59k30M84l7l78P1L83l21O4R3j24o2j72L12J2l94L61k20
$$ -159 -59 -254 -117 186 27 -203 281 244 -134 -63 320 -1 63 156 32 -30 -202 110 122 -272 89 -131
2763a31K13Kk89K28j54K63k67j03M77l6m77NN16m00l8K50N8j73P8P1j80J05J82
$$ -131 82 84 -205 23 -131 132 -135 -238 239 203 -274 -269 247 -153 -191 59 117 -56 22 93 -87 18 200
2786B00q4m53N16k54n2qM56l18j91K96K9j92j99L75j71K70k4j28j45Q8j52p3O3
$$ 200 116 -337 179 -75 -127 -135 321 3 -188 108 137 -55 -254 121 -50 220 196 68 -77 11 -141 -214 -151
2809a51R0n3J3J26m9k21J63J02k17K32k34L46Nj61K27j58J04J33n34K90K20l27
$$ -151 -61 -114 -101 25 -24 -245 -82 20 -197 35 -199 147 152 -9 218 60 164 297 -237 53 273 -54
2831e4K1N7R2j79J29J00j69o5K2JJ43j54j31RK15j3n4l14M66j26L4j53J63o2p4
$$ -54 -33 24 116 -63 66 166 -3 -68 -46 -45 98 -56 -187 -178 37 24 -30 -344 122 -4 30 -123 40 -22 -96
2856i6Q4P5Jk81L47K4j68j6K46k66J55Ko21M03L37j81L5n1L6P5k80J82j5O3k04
$$ -96 -12 63 64 -217 130 154 -14 -30 216 -50 105 107 -514 -111 226 45 80 29 65 140 -140 42 27 90 -114
2881a14J12P6n3N5q1l3L07j80k96J32K8K24k32lJ66J2j00j37L41k67jj63K01N2
$$ -114 -2 74 21 76 -5 -38 269 89 -207 -75 -47 177 -55 -58 108 120 20 -117 224 -43 -44 -207 -6 46
2905D6j82j99L33Qj29o3L35O0j07k94K16R9k0m0r0pj32q0K26K03j22qo5l9L58
$$ 46 -136 -335 -2 6 -123 -186 149 209 102 -192 24 123 103 63 -27 -34 -166 -246 -20 183 61 53 -12 -51 307
2930C07k30j5j52K14j9k80o8M96p2l08j4L75j94K1j21L9P9j92J47N0O2k07kK16
$$ 307 77 62 -90 124 105 -175 -243 253 181 -127 -141 234 40 61 -60 -21 58 -134 13 63 125 -82 -84 132
2954A32N2j68k75K04K45l12Q1j35M59l31J06O9O0j13j33QJ22J79k61J5J94n4k82
$$ 132 184 16 -259 -55 190 -122 -41 -176 283 -48 58 127 187 74 -59 -51 71 250 -11 4 198 144 -138
2977a38j43j5O30m47j01K55P0J0k16n9J07N6j12J05k4J54k72J33p4K60l22K69
$$ -138 -281 -296 334 -113 -214 41 111 121 -95 -154 -47 9 -103 2 -22 132 -140 -7 -81 179 -143 126
2999A26k70K08J37l65K08O2O5k00K1M4K70n88L50J26R3n63L02p3Kp8J94j02P7
$$ 126 -144 64 201 -164 44 106 171 -29 -8 36 306 -282 68 194 287 -276 26 -47 -45 -123 71 -31 46
3022D6j19j47K99j9j13J18l7P9q8k06K75j73J83n2J2j25K87j72j11J47j22nq5
$$ 46 -73 -220 79 60 -53 65 28 107 19 -187 88 -85 98 46 58 -67 220 48 -63 84 -38 -43 -128
3045a28K60j47KN5j75K26o7J5o1J13j37L12j58p5J02j97O7J32L9j30o9K37p8M1
$$ -128 132 -15 -13 42 -133 93 26 41 -20 93 -44 268 110 35 137 -60 7 139 178 48 -21 216 138 179
3069A79j12r2J68k71L25k16O4mj46j5J25K60k97P4J62j71K9o3M9J5p1n8l39L01
$$ 179 67 -25 143 -128 197 -19 45 41 -105 -120 5 265 -32 42 204 33 62 -1 48 63 -8 -66 -405 -104
3093a04J93J9j55j45J56q9M5K25k23p0L12K2j00j81J86n1j89J10J44l41J21M0
$$ -104 89 108 -47 -192 -36 -125 -80 145 -78 -148 164 186 86 -95 91 40 -149 -39 105 -236 -115 -75
3115g5R7J6j39m0K13J25k4j62L40l23p1q1K93j38J03l17J94j73Q8j06P7J58J94
$$ -75 22 38 -101 -141 72 197 173 11 351 28 -43 -124 169 31 134 -183 11 -162 -74 -180 -103 55 249
3138B49j92k98K27J95j91L0J14jj84L6N3l7j12J12l81J44K77j8j79L66Km27j09
$$ 249 57 -241 -14 181 -10 20 134 133 -51 -15 38 1 -111 1 -380 -236 41 23 -156 210 212 -215 -324
3161c24K98K76l43K50P0k81j44K74j47R8o3p9M8K93j48lj01K33m3m33L82j42K6
$$ -324 -26 250 -93 157 227 -54 -198 76 -71 27 -36 -115 -67 226 78 75 -26 207 164 -269 113 -29 -3
3184cj25LJ6J03j8j68J21K10q8k33K09m6o4o8J28K90l85K3J40mk0K1K8K39m65
$$ -3 -128 -125 -109 -6 -24 -192 -71 139 51 -182 27 -19 -83 -151 -23 267 -118 -95 45 41 21 42 70 309 -156
3209a56j6N8J2K5K2J70l8K43n09kL13j03J35l29K54j53M5Nk3O4oj53JpJ30l7n1
$$ -156 -172 -114 -102 -77 -55 115 77 320 -189 -191 122 19 154 -175 79 -74 -29 -24 -47 17 11 -142 -141 -148 -18 -55 -106
3236a06P9J55k27K14Oj00L1o4r1R0l6Q8j3N9j20Pj0J59p7M7j45O6Kj98L26M6j26
$$ -106 -27 128 -99 115 121 21 52 -12 -103 -13 -49 39 26 85 -35 -28 -38 121 44 91 -54 12 14 -184 142 188 62
3263F2n4j16n1K91K1j48m0J32k8q3k7N9k82J97J07k52K91k18M8N9K60k39j18L91
$$ 62 8 -108 -159 132 153 5 -35 97 69 -14 -41 18 -264 -67 40 -212 79 -139 -91 -32 228 -11 -129 262
3287B62k88J47k09J68J58m21n2K17N1j39R8P0j0n9R0or6O5j06k30M21j72OM3J28
$$ 262 -26 121 -88 80 238 -183 -235 -18 33 -106 -8 62 52 -7 83 77 -19 46 -60 -290 131 -41 -35 8 136
3312A36j75J30J8L8j60k00M21j45k30J41k8J29j54N8n0J90r8O5j02j99M36l49
$$ 136 -39 91 109 147 -13 -213 208 63 -167 -26 -54 75 -79 -21 -71 119 21 86 -16 -215 221 -128
3334a28R3J47j13J8N9j25r7L09N5qj15k2J4J09j34k2j64J80l9j17P6k1L1j66L84
$$ -128 -35 112 -1 17 76 -49 -146 163 218 210 95 73 87 196 62 40 -124 56 17 -100 -24 -45 -14 -180 204
3359B04j40l5k1k19R3MQ1L2m7j24KM21m67J32K10j50q9J45l9j46J11J16m9j29
$$ 204 64 29 8 -211 -118 -114 -33 -1 -48 -172 -170 251 -216 -84 126 -24 -113 32 -7 -153 -42 74 25 -104
3383a04J29m6J81L4k43j98J73M8j18j34L33k21P6J77j24j1J01M3J8k67J03Q5j80
$$ -104 25 -21 160 194 -49 -247 -74 -26 -144 -278 55 -166 -90 87 -37 -48 53 96 114 -153 -50 35 -145
3406a45J88O4M6l76K07R9p1l6q5L59jl18J32p7l7M5kO5j1prPj37k54J88J90j72
$$ -145 43 107 153 -223 -16 83 12 -24 -109 250 249 -69 63 -14 -51 -6 -8 57 46 39 30 37 -100 -354 -166 24 -148
3433a48j69K04J43o5k6O4j12J31J2k6l6P2O0n7Q8k2J0k25J12R5j96l9p5K31l6
$$ -148 -317 -113 30 -35 -61 3 -109 22 34 8 -28 44 104 47 135 113 123 -102 10 105 -91 -130 -205 26 -10
3458a0j78K82j46J8j18l3K14k8K4r9N8P2J1k16M1l2PJ79r5J35O9L6l80L16K9j79
$$ -10 -188 94 -52 -34 -152 -185 29 1 25 -74 -16 56 67 -149 -108 -140 -133 46 -49 86 155 191 -189 127 156 -23
3484b3J1k1J25k20O5j80K77j44Q8q9K99j07K5o0K11p8k49K7J87q7k09RJ82J30
$$ -23 -12 -33 92 -128 -63 -243 34 -110 -22 -111 188 81 106 46 257 179 -70 -43 144 57 -152 -143 39 169
3508A69k33K15k3j44r5L1P7J16J03j36K2q7Oq4P3n0K25m11K82l8mr5l8K79j57
$$ 169 -64 151 128 -16 -111 -80 -3 113 216 80 102 15 21 -63 10 -40 185 -226 56 18 14 -81 -119 160 3
3533CJ11k18P8J76J22l46m9L11k20k89N77j71k91J26J10J55j19r4K15m6k01J7
$$ 3 114 -104 -26 150 272 -74 -123 188 -32 -321 256 85 -206 -80 30 185 66 -28 187 141 -60 -43
3555d3J34k37J36O3K1r0J69J69l71J3l5JK5r6J15K37k64J06k5j73J09n3J41j89
$$ -43 91 -146 -10 53 74 -16 153 322 -49 -36 -71 -70 -45 -141 -26 211 -53 53 28 -145 -36 -89 52 -137
3579a37rj39K36l3L6%K14k07R1rn0J06j12J18r8P1Q2k06J11j03kK34p4j03k25
$$ -137 -146 -285 -49 -82 -46 -46 168 -39 52 43 -7 99 -13 105 7 78 160 -46 65 -38 -40 194 120 17 -208
3604b08K09K9KRk85K45k25J47K33o5j36J98r6N4m0q5J11k94J45o9K9%K69l13O3
$$ -208 1 30 32 41 -244 1 -224 -77 156 91 -45 153 57 111 71 -14 97 -197 -52 -121 -92 -92 177 -136 -73
3629g3J79M7k21L1j1J3j08J06K30l38K73R2p3k45M13m25N5J58l9m6j40J63j57
$$ -73 106 153 -68 -37 -48 -35 -143 -37 193 -145 128 220 147 -98 315 -110 -55 103 64 18 -122 41 -116
3652a16j9K82J0m54M65j39j37J51j87J00k24L32J03k07KJ12q6j14K48O9j85J59
$$ -116 -135 147 157 -297 168 29 -108 43 -144 -44 -268 64 167 -40 -38 74 -12 -126 122 191 6 165
3674A65n01K25O3Q9n4j37J83l5p0j98L20Q6k25j8O2J4j08L1J12P3j36j25j23K88
$$ 165 -336 -111 -48 41 -13 -150 33 -2 -72 -270 50 136 -89 -107 -45 -31 -139 -108 4 77 -59 -184 -307 -19
3698a9J20m46J94K26l2L4n5J75l25J77O1j48o0J13J29j73J81j10k72K97J48m13
$$ -19 101 -345 -151 75 43 77 22 197 -128 49 110 -38 -98 15 144 -29 152 42 -230 67 215 -198
3720a98j23L44J03j21m9J7k1K14M6n31J93L59k75j0R7K01k00k36M09k17L7O6k5
$$ -198 -321 23 126 5 -44 -27 -48 166 212 -319 -126 233 -42 -52 45 246 46 -190 219 2 39 105 80
3743H0l02K52j0k02J39K94j99j40kM6n0j96K77J97k07J29o3J31k58J34N5k00K00
$$ 80 -222 30 20 -182 -43 251 52 -88 -90 -44 -94 -290 -13 184 -23 106 43 174 -84 50 105 -95 105
3766A05j69k5P3P2l41P1K76P2l43J55K24j21k84J94n5RJ7K56k41O7j33K51j40
$$ 105 -64 -89 -16 56 -285 -214 62 134 -209 -54 170 49 -235 -41 -96 -87 -70 186 -55 12 -121 130 -10
3789a0KP2K4r4O6L0j40J81j68l1J25l7j46J41J15n8K8J33k24Qk8j7K8J49nk25
$$ -10 -8 64 88 -6 60 90 -50 131 -37 -68 57 20 -126 15 130 72 100 233 9 17 -11 -28 0 149 144 -81
3815h1q7k14L45Pj1J48rj34N3j1j5J85j25j68p9M20j14k38j38K10J13L3j66Rj73
$$ -81 -168 -382 -37 -30 -41 107 98 -36 17 6 -9 176 51 -117 -196 224 110 -128 -266 -56 57 90 -76 -67 -240
3840b40K32j18L40q0j0m3q8K28o0m16L59J76m20%L84l94J51o8N0L7n5L31k98O5
$$ -240 -8 -126 214 134 124 81 -7 221 161 -255 104 280 -140 -140 244 -150 1 -67 -17 20 -35 296 -2 63
3864F3n1M6k32M13k59k4J53q4M4n4l5L0O1J9J6r0J04j76O3j75M70k12l7j06M8
$$ 63 12 58 -174 239 -20 -44 109 25 69 15 -20 10 71 90 106 16 120 -56 7 -168 302 90 53 -53 -5
3889eJ74k08j18P0J53k09J43R2p9j67R5MJ75j82K70k35k4Q2k43J24O9K01j11k10
$$ -5 169 -39 -157 -87 66 -143 0 92 13 -154 -59 -55 120 -62 208 -27 -51 31 -212 -88 -19 182 71 -139
3913a39K73l28N1J53N7P2M2J3j26J89m78J83K01l3j15O0P0k8r9j18j8J19J0k41
$$ -139 134 -194 -143 10 67 139 181 194 68 257 -221 -38 163 130 15 75 145 117 18 -100 -118 1 11 -230
3937b30J81J18J50l54J59L4Rk64j20N25k39r0J1K08j34P2k66J99k6j4j79L74K3
$$ -230 -49 69 219 -135 24 58 67 -197 -317 208 -31 -121 -110 98 -36 36 -230 -31 -57 -71 -250 124 147
3960A47j47N1%L4K3J2k99L40j27k33K08J43j60j05P9J44kN5k30o4K79J5m40M85
$$ 147 0 51 51 85 108 120 -179 161 34 -199 9 152 -8 -113 -34 110 108 163 -67 -131 148 163 -277 208
3984B08k88K17o10K70O7K69q8r9J40n3j44j04J88Q6N8L8l44K37Q4j77L2l6L20
$$ 208 -80 137 -473 -203 -136 133 45 -54 86 33 -111 -215 -27 59 117 155 -189 48 132 -45 -13 -49 271
4007B71l88J49p1J19k74L17J13j60k23J20J55j38j3k47M65m8k08L1jL7Ll48L21
$$ 271 -117 32 -39 80 -194 123 236 76 -147 -27 128 -10 -23 -270 195 147 -61 -30 -31 6 9 -339 -18
4030a8J46k43l6J58j42P8j24J23L93k67q3j83K38M7K14l78J54o5mJ25j01J45k37
$$ -18 128 -115 -151 7 -135 -57 -181 -58 335 68 -15 -198 40 87 301 -77 77 12 8 133 32 177 -60
4053f0k52L98q0n0j20P0j3L57l43K4J71m6k10l2K36K75n29K40j6J06j21J13q9
$$ -60 -312 86 6 -44 -164 -94 -107 250 -93 -69 102 56 -154 -186 50 325 -204 36 20 126 5 118 29
4076B9Q3j86J55j99K61k7m6k83R5J31J8l1J44p0O0Pl15L88k29K2j34K61j44j28
$$ 29 112 -74 81 -118 143 116 70 -213 -118 13 31 0 144 74 134 141 -174 214 -15 7 -127 134 -10 -138
4100a38J04R4J8k89J54J28j68N2KP0j75K8K44k28J23m8J37kJ42m26J05M3J6l5
$$ -138 -34 60 78 -211 -57 71 -97 -45 -43 27 -148 -120 124 -104 19 -29 108 106 248 -178 -73 -30 -14 -49
4124d9j37K26P2j85K2L18k89N9j50r7K43k2J56k61J06n6K01k14L6J31k93J80J10
$$ -49 -186 40 112 -73 -51 267 -22 37 -113 -210 33 11 167 -94 12 -44 157 -57 -21 110 -183 -3 107
4147A07m9j45J12j29J29M0j99J91K8k8j82m1J87j11j17K51j18K42k29J99j99Q0
$$ 107 58 -87 25 -104 25 65 -134 57 85 57 -125 -166 21 -90 -207 44 -74 168 -61 138 -61 19
4169A9q9kJ21J79l82K47J45j72n4j46N5J52j17j99K69ok3k15L57q5q4J4r7K37
$$ 19 -70 -72 49 228 -154 93 238 66 12 -134 -79 73 -44 -243 26 20 -3 -218 139 54 -30 -16 -113 124
4193A24m3L6k11K22q2l48K64J79p1j66m0J69j5J00j01l7j7Mk3JJ77N0l33L8J37
$$ 124 81 117 -94 128 46 -302 -38 141 70 -96 -136 33 18 118 17 -20 -37 -33 -56 -55 122 172 -161 -123 14
4218A4K34m89M03m8j4n7r3J44N9O4m90L79L1j17J34l61L40j28n3J5j4K2j97L23
$$ 14 248 -241 162 114 100 43 -50 94 153 217 -273 106 137 20 154 -207 133 5 -48 -33 -47 -25 -222 101
4242A01J33l00k28L25j28K41k17R2N3Qj45o5L81k59n4j1O6J81P2j39j54l5J49
$$ 101 234 -66 -294 31 -97 144 -73 19 72 80 -65 -130 251 -8 -62 -73 -7 174 246 107 -47 -82 67
4265F7k17R7N9J60j34j64L18O2k29k63M72j69k78J31J78Q1l13q9J52o6P6J72j01
$$ 67 -150 -53 6 166 32 -132 186 248 19 -244 228 59 -219 -88 90 171 -142 -231 -79 -145 -69 103 2
4288BK16j42j42K39J77l55q6J84Ll6q7o0p9J47Nj28P2J99Q8k58oL10l26m9L04
$$ 2 218 76 -66 173 350 -5 -91 93 96 60 -27 -87 -166 -19 -14 -142 -70 129 217 -41 -47 263 -63 -112 192
4313A92N9k83m3J31j83Q6J65m85K87m6K11j00j01M29m07m6K54k27K6m0L20l30
$$ 192 251 -32 -75 56 -127 -41 124 -361 -74 -120 91 -9 -110 319 -88 -134 120 -107 -81 -121 199 -131
4335a31J26l6J50o9j73J24m6J50j66P2P7Q2k5j45k24M28j70n5L3j62J03j03J33
$$ -131 -5 -41 109 40 -133 -9 -55 95 -71 1 78 160 135 -10 -234 194 24 -31 2 -160 -57 -160 -27
4358b7N1mO0p2m0o6K68k57J05j87J02l7n6P6K55r5n3j15J37l28J20J69M0n7j42
$$ -27 24 20 80 8 -32 -98 170 -87 18 -169 -67 -104 -160 -84 171 76 23 -92 45 -283 -163 6 46 -11 -153
4383a53J10J39J04j45K8O1j64k82K09K74j87J8P1n3j7j34k1R3K67k94J53m1M5
$$ -153 -43 96 200 55 83 144 -20 -302 -93 181 -6 12 83 30 13 -121 -142 -49 218 -76 77 36 81
4406H1j94j8K75l7j61m6k2O6n1mO0j08Q6j05M6M05j90j21J17P6q0k27J51L30l19
$$ 81 -113 -131 144 107 -54 -100 -122 -56 -107 -111 -51 -159 -73 -178 -132 273 83 -38 79 155 75 -152 -1 329 10
4431A0j09M81o54J83J79r1k90M30j65n4m8J26P1k2q5j40K03M4j55k8J4n9J05L4
$$ 10 -99 382 -272 -89 90 -1 -291 139 -26 -80 -128 -2 69 47 -38 -178 25 69 -86 -114 -100 -159 -54 -20
4455b0r3J05J86j96J89k37j25J62J12l31L10l7M3j06j74J31J29J39m17K02J15
$$ -20 -113 -8 178 -18 171 -66 -191 -29 83 -248 62 25 68 -38 -212 -81 48 187 -230 -28 87
4476H7j66M8J10L4k09O7k02K53j26j09J25J88k1k00OK45R9j10j63j4J47m3j05
$$ 87 -79 -31 79 113 -96 -29 -231 22 -104 -213 -88 100 79 -121 -115 130 229 119 -44 -58 89 46 -59
4499e9l0K59q9j91nK82j60r4J85k56K48j94K12J34j86j59m4J03K62k83M8J02O0
$$ -59 -89 170 81 -110 -115 167 7 -87 98 -158 90 -104 108 242 56 -103 -147 -44 218 -65 -17 85 145
4522A45o3k12P2J93j31o9JJ16j39o3J29p0Q3j02J44kQ9L1j34J16j87J59j92J35
$$ 145 82 -130 -58 135 4 -65 -64 52 -87 -150 -21 -91 -8 -110 34 32 121 152 18 134 -53 106 -86 49
4546D9J31l29J19j17K11r8J22l4J23j64J49l45J8L1K57j38R4q1j99J61J71o5j71
$$ 49 180 -149 -30 -147 64 -34 88 54 177 13 162 -183 -165 -134 123 -15 79 -2 -201 -40 131 66 -105
4569a05K27k39Q1J27Rj70M3L9J6j37K24k17J15k14M56k78j6k6oK12k14j50L57
$$ -105 122 -117 -36 91 100 -70 -27 12 28 -109 115 -102 13 -201 255 -23 -39 -65 -71 141 -73 -223 134
4592A34L8k31K6p9K80r3l47K85j26j02J12J27pJ24q3n4K3j31Q2n2J3k7J10m6J9
$$ 134 172 -59 -33 -112 168 75 -272 13 -113 -215 -103 24 17 141 58 4 27 -104 -22 -74 -61 -88 22 -24 -5
4617ej54K38l06M55j72j19k6K42k39J02O4oj45K02j72K4J01l2j60Q8N1j43n7K43
$$ -5 -159 79 -227 228 56 -63 -89 153 -86 16 80 74 -71 131 -41 -17 84 52 -108 -20 31 -112 -169 74
4641G4M9N8k18n8N2jj46L35P0j61P1o0p8r5J51N4j35J24j34K6P0J5Q8j45o3L38
$$ 74 123 181 -37 -95 -43 -44 -190 145 215 54 125 65 -13 -108 43 97 -38 86 -48 -22 48 63 151 6 -57 281
4667B81k80p9N4K9L02k37R1k25J7J26q7N4J47j08l37K29K78j17j85r5L18q4Mm1
$$ 281 1 -78 -24 5 307 70 161 -64 -47 79 -8 46 193 85 -252 -23 255 138 -47 -142 176 92 96 55
4691E5QL3R9l87K44O2k72R4J27L5j19M0rL0n9p7P2l1RJ29j48Q0l9k33J58L28j4
$$ 55 63 96 195 -192 52 114 -158 -64 63 98 -21 19 10 40 -19 -96 -24 -55 -46 83 -65 15 -24 -257 -99 229 215
4718B15l71J24L16j18k19j03J59j9J89r7J6L5j30j45J19J49j84J0o5pK09l45l6
$$ 215 -156 -32 284 166 -53 -156 3 -16 173 76 92 127 -3 -148 -29 120 -64 -54 -119 -126 83 -262 -298
4741b98N01j20qk27K08q1l4M8j52J90R6j93oK35j27j07rN8j38L68r1r3r4N1R3
$$ -298 203 83 75 -152 56 -25 -59 -11 -163 27 123 -70 -76 159 32 -75 -84 -26 -164 204 113 20 -74 -23 70
4766G0R0O0k93N0J20N2Jk78O1J30l43N6K94j26MJ41k18J34J58J57k78P0J01k76
$$ 70 160 220 -73 -23 97 149 150 -128 -67 63 -280 -224 70 -56 -52 89 -129 5 163 320 42 112 213 -63
4790f3L9p8K84k55L1J11n8r7pP5k05L30pj37k0j67K08Q0M0l5n7j21K09M5k16o2
$$ -63 -24 -102 182 -73 -42 69 11 -86 -93 -18 -223 107 100 -37 -57 -224 -16 64 104 69 12 -109 100 145 -71 -133
4816a33L7R7M6o2p7J38M0p1j28L9n7Q5M6Q6M3j19r4K40k92O1J0l2mq3J09J80m9
$$ -133 -96 1 47 -15 -92 46 86 15 -113 -74 -131 -46 0 86 129 10 -84 156 -136 -75 -65 -97 -101 -184 -75 105 56
4843E6k7J52j69K19k17k49L18J0j29J38j10K99k85K4l20J96J26Mj94N2K54k92
$$ 56 29 181 12 231 14 -235 83 93 -36 102 -8 291 6 30 -290 -94 32 36 -158 -106 148 -144
4865a44j27L75K1k00L3j47R2O1R0L2j13K1J12k38l8J71Q8k69J74J51k7j31j23
$$ -144 -271 104 125 -75 -42 -189 -97 -36 54 86 -27 -6 106 -132 -170 1 89 -180 -6 145 118 -13 -136
4888a36K40k53K14n4J52m20J31j0K74j2j14m3nP2j80J03o0J72j55jO5j6j96J19
$$ -136 104 -149 65 11 163 -257 -126 -136 138 126 12 -31 -36 36 -144 -41 -101 71 -84 -85 -20 -36 -232 -113
4912a13J33M1l9r6J44k65P1K00j01k7L4k45L52m5k82M06k35J77N1j29L6p6qn9
$$ -113 20 61 22 -74 70 -195 -124 76 -25 -52 -18 -263 89 44 -238 168 -67 110 161 32 68 -8 -16 -75
4936g5N9J79p0l11L03J39rj29k11L44l07J85k15M3k17K01Q9j00J01J31j3m7j78
$$ -75 -16 163 93 -218 85 224 215 86 -125 219 -88 97 -118 -75 -292 -91 -2 -102 -1 130 117 70 -108
4959a08J89j02J64p6k03K5Q8K22k52p8N4kJ02j63J62j08lN1k01N93k07j02p6N4
$$ -108 81 -21 143 67 -136 -111 -23 199 -53 -131 -77 -79 23 -140 22 -86 -89 -38 -239 354 147 45 -31 23
4983B3Kq6J8m6LJ19j67Q2l7M8j27M1Q7K14m05J65J66q3j77J04J29kq1j42K25k1
$$ 23 25 -61 -43 -89 -86 33 -134 -52 -89 -41 -168 -127 -40 174 -231 -66 100 17 -160 -56 73 71 -10 -152 73 52
5009E2j8J1P3J83j90j55%p3L78j48l25J53J17r9j35J06K20r8j49J23M6Ll7J15
$$ 52 34 45 118 301 111 -44 -44 -117 261 113 -212 -59 58 -41 -176 -70 150 52 -97 26 72 75 38 153
5033A53mj67j4P4N8k94O4J98j04j08Q7p8J91o1mJ26j68o4J51J04l05L97l56K08
$$ 153 149 -18 -32 42 100 -194 -130 68 -36 -144 -57 -135 56 -5 -9 117 -51 -115 36 140 -165 232 -124 84
5057H4j5j05m2L3J17R7k09o7j13J20M01j48j71Q7Kj63k7K04j2N8n8j88J46n0k91
$$ 84 69 -36 -78 -45 72 169 -40 -107 -220 -100 301 153 -18 69 71 -92 -119 85 73 131 73 -115 31 -19 -310
5082c10L53J07j41j68K15j17J25J16k64J6J69q3q4K1M9K67j35k72Q3M3Q1l1M1
$$ -310 43 150 9 -159 56 -61 64 180 -84 -68 101 18 -66 -45 4 271 136 -136 -53 -10 71 40 81
5105H1j22J18J42k59K05k69J59j0j08J40n4j4J08k02M8p9L37k14J03m1j30K61
$$ 81 -41 77 219 -40 165 -104 55 45 -63 77 23 9 117 -85 -37 -116 221 7 110 69 -61 200
5127B00j47l7j05J81j90K4K10o5j08J51oj05j4J77j49M4k61M48j73o8o9P4k2J37
$$ 200 53 16 -89 92 -98 -74 136 71 -37 114 108 3 -11 166 17 61 -200 248 75 7 -62 12 -10 127
5151A27P8j7j77o3J40j14p0K90k09Q5j14Q9L6j76M9Q3q0m9P3j63L32k14O4O1J57
$$ 127 205 188 11 -52 88 -26 -96 194 -15 70 -44 45 81 -95 -46 37 -43 -92 -19 -182 150 -64 0 61 218
5176B18l78K92j54J46j94MM6MK19m7k86K29k43R2P6k8P9p9J0j05J54N5k29N2j
$$ 218 -160 132 -22 124 -70 -66 -20 -16 203 156 -130 99 -144 -52 24 -4 75 -4 6 -99 55 110 -119 -67 -68
5201f8K22k40n6K78q6J16j24m0n3J31p5K42k84J4J35j39K2Q9R4l54M9L0J02J25
$$ -68 154 -86 -142 136 50 166 42 2 -51 80 5 247 -37 -23 112 -27 -5 84 178 -176 -127 -97 5 130
5225A30k59L21k72j23M00j07q7L1k35J80j3R5N9l20J77J89m2l84o7M16m9k86J47
$$ 130 -129 192 -80 -203 197 90 3 34 -201 -21 -34 61 120 -200 -23 166 124 -260 -327 89 40 -246 -99
5248i9L55l00Q6k9o7mL59k22j89n0J43j13J47J16M1k50pJ33k2P7K7j43J04j18
$$ -99 256 -44 42 13 -54 -58 301 79 -110 -160 -17 -130 17 133 174 -76 -83 50 28 105 132 -11 93 -25
5272b5l7J16L3l39M79j98J65k45m0R2J24k31k9J9O0J51k21J20j48J42J80k80P9
$$ -25 -62 54 87 -252 227 29 194 -51 -91 1 125 -106 -135 -116 -56 95 -126 -6 -154 -12 168 -112 -33
5295c3O6j86k7L68k46J03R1o8N8j30M4k03K75p4k30K65k0q5l8r7K60j31j5q2J5
$$ -33 33 -153 -180 188 -58 45 136 68 126 -4 40 -163 112 38 -192 73 53 -32 -70 -167 93 -38 -53 -135 -120
5320a20L00j46m4p4Q2J3j00J07o2pk26L42Kl2r1J14j3R8l95K85l1q8L2MK32k32
$$ -120 180 34 -10 -84 -2 11 -89 18 -44 -51 -277 65 67 35 -56 58 45 143 -252 33 2 -86 -54 -50 182 -50
5346e0P8Lk5j51J48LnJ95k92K1J57o3p5K3j14K22j15K26m3k01J7M8J0j81J50O2
$$ -50 28 31 6 -145 3 6 1 196 -96 -75 82 19 -56 -33 -147 75 -40 186 143 -58 -41 7 17 -164 -14 48
5372D8k4j52l4L15j78P8j02K3J99j86J34J26k90J27J32j00J59r3j47j83Nj45L8
$$ 48 24 -128 -162 153 -25 53 -49 -26 173 -13 121 247 -43 84 216 116 275 182 35 -148 -143 -288 -250
5395b50J81J43K39m28P3K00k2j16N4j62J09m7l6Q5J93k50P9k03R3J76j05M3k2
$$ -250 -69 74 313 -115 -42 158 136 20 74 -88 21 -26 -62 23 216 -34 45 -158 -65 111 6 49 27
5418B7j09J65J14j44j47J39q0P8j75J74K6k9k07J52mj43J52j03J25L1o0R4o7n5
$$ 27 -82 83 197 53 -94 45 -35 43 -132 42 68 39 -168 -16 -20 -163 -11 -114 11 42 -18 76 9 -46
5442d6j81L58j75L5r0L90l16J28j37J20j4P9j14L8j45J13n1l9kK29j38j60K07
$$ -46 -227 131 -44 -9 -99 291 -25 103 -34 86 72 151 37 75 -70 43 -8 -47 -49 180 42 -118 89
5465H9j17Mr2L69k01r5j10J40J64l7j57N0j38J20rJ10j02M0m5M5o0K06j07j51
$$ 89 -28 -24 -116 253 52 -43 -153 -13 151 114 -43 7 -131 -11 -20 90 -12 28 -17 28 -32 174 67 -84
5489h4p2L68l70J15j7J03R0k08J38k34J13L9O8M4j26L5K1k45J62k14M82k67R1
$$ -84 -156 212 -158 -43 -60 43 133 -75 63 -171 -58 -19 49 93 -33 2 23 -222 -60 -274 208 -59 32
5512C2p4m1J36j30J3O2k9J92k80%LJ73m39L14J33K2r4k6J33j04n5N3M4J3q4N3
$$ 32 -42 -83 53 -77 -64 -2 -31 161 -119 -119 -116 57 -382 -68 65 87 -7 -33 100 -4 -59 -6 38 51 -33 20
$$ [...]
8191a7
##END NTUPLES=NMR FID
##END=
