##TITLE=1H_Pr 5045
 CDcl3, 8 sc, 
 2.06.2021
##JCAMPDX= 6.0         $$ Bruker NMR JCAMP-DX V2.0
##DATA TYPE= NMR FID
##DATA CLASS= NTUPLES
##ORIGIN= UXNMR, Bruker Analytische Messtechnik GmbH
##OWNER= root
$$ XWIN-NMR		Version 3.5
$$ Wed Jun  2 12:50:29 2021 Russian Standard Time (UT+4h)  she@DPX200
##.OBSERVE FREQUENCY= 200.131506
##.OBSERVE NUCLEUS= ^1H
##.DELAY= (6, 6)
##.ACQUISITION MODE= SIMULTANEOUS
##.ACQUISITION SCHEME= undefined
##.AVERAGES= 8
##.DIGITISER RES= 18
##SPECTROMETER/DATA SYSTEM= spect
##.PULSE SEQUENCE= zg30
##.SOLVENT NAME= D2O
##.SHIFT REFERENCE= (INTERNAL, D2O, 0, 15.7039)
##AUDIT TRAIL= $$ (NUMBER, WHEN, WHO, WHERE, WHAT)
$$ ##TITLE= Audit trail, XWIN-NMR		Version 3.5
$$ ##JCAMPDX= 5.01
$$ ##ORIGIN= Bruker BioSpin GmbH
$$ ##OWNER= she
$$ F:/spectra/data/she/nmr/H-F/1/audita.txt
$$ ##AUDIT TRAIL=  $$ (NUMBER, WHEN, WHO, WHERE, WHAT)
(   1,<2021-06-02 12:49:05.25 +0400>,<she>,<DPX200>,
      <created by zg, POWCHK disabled, PULCHK disabled
       configuration hash MD5:
       00 E9 B6 7A A2 85 ED C7 34 08 36 98 17 FE 4E 26
       data hash MD5: 16K
       2E 4B 3A 7A 22 58 34 0B 96 F0 0F 22 65 FE A3 56>)
$$ ##END=
$$ 
$$ hash MD5
$$ 35 7B 8F 89 AE 49 CA C6 22 B1 53 FC F7 1F 85 3C
##$RELAX= 
##$RELAX= 
##$RELAX= 
##$RELAX= 
##$RELAX= 
##$RELAX= 
$$ Bruker specific parameters
$$ --------------------------
##$DU= <F:/spectra>
##$EXPNO= 1
##$NAME= <H-F>
##$PROCNO= 1
##$TYPE= <nmr>
##$USER= <she>
##$AMP= (0..31)
100 100 100 100 100 100 100 100 100 100 100 100 100 100 100 100 100 100 
100 100 100 100 100 100 100 100 100 100 100 100 100 100 
##$AQSEQ= 0
##$AQ_mod= 1
##$AUNM= <au_zg>
##$AUTOPOS= <>
##$BF1= 200.13
##$BF2= 200.13
##$BF3= 200.13
##$BF4= 200.13
##$BF5= 200.13
##$BF6= 200.13
##$BF7= 200.13
##$BF8= 200.13
##$BYTORDA= 1
##$CFDGTYP= 0
##$CFRGTYP= 5
##$CHEMSTR= <none>
##$CNST= (0..31)
1 1 145 1 1 1 1 1 1 1 1 1 1 1 1 1 1 1 1 1 1 1 1 1 1 1 1 1 1 1 1 1 
##$CPDPRG= <>
##$CPDPRG1= <>
##$CPDPRG2= <>
##$CPDPRG3= <>
##$CPDPRG4= <mlev>
##$CPDPRG5= <mlev>
##$CPDPRG6= <mlev>
##$CPDPRG7= <mlev>
##$CPDPRG8= <mlev>
##$CPDPRGB= <>
##$CPDPRGT= <>
##$D= (0..31)
0 1.2 0 0 0 0 0 0 0 0.06 0 0.03 0 0 0 0 0.0002 0 0 0 0 0 0 0 0 0 0 0 0 
0 0 0 
##$DATE= 1622623744
##$DBL= (0..7)
120 120 120 120 120 120 120 120 
##$DBP= (0..7)
150 150 150 150 150 150 150 150 
##$DBP07= 0
##$DBPNAM0= <>
##$DBPNAM1= <>
##$DBPNAM2= <>
##$DBPNAM3= <>
##$DBPNAM4= <>
##$DBPNAM5= <>
##$DBPNAM6= <>
##$DBPNAM7= <>
##$DBPOAL= (0..7)
0.5 0.5 0.5 0.5 0.5 0.5 0.5 0.5 
##$DBPOFFS= (0..7)
0 0 0 0 0 0 0 0 
##$DE= 6
##$DECBNUC= <off>
##$DECIM= 32
##$DECNUC= <off>
##$DECSTAT= 4
##$DIGMOD= 1
##$DIGTYP= 9
##$DL= (0..7)
0 120 120 120 120 120 120 120 
##$DP= (0..7)
150 150 150 150 150 150 150 150 
##$DP07= 0
##$DPNAME0= <>
##$DPNAME1= <>
##$DPNAME2= <>
##$DPNAME3= <>
##$DPNAME4= <>
##$DPNAME5= <>
##$DPNAME6= <>
##$DPNAME7= <>
##$DPOAL= (0..7)
0.5 0.5 0.5 0.5 0.5 0.5 0.5 0.5 
##$DPOFFS= (0..7)
0 0 0 0 0 0 0 0 
##$DQDMODE= 0
##$DR= 18
##$DS= 0
##$DSLIST= <SSSSSSSSSSSSSSS>
$$ [...]
##$SUBNAM2= <"">
##$SUBNAM3= <"">
##$SUBNAM4= <"">
##$SUBNAM5= <"">
##$SUBNAM6= <"">
##$SUBNAM7= <"">
##$SUBNAM8= <"">
##$SUBNAM9= <"">
##$SW= 16.9725357007746
##$SWIBOX= (0..15)
0 0 2 0 0 0 0 0 0 0 0 0 0 0 0 0 
##$SW_h= 3396.73913043478
##$TD= 16384
##$TD0= 1
##$TE= 0
##$TE2= 300
##$TE3= 300
##$TEG= 300
##$TL= (0..7)
0 120 120 120 120 120 120 120 
##$TP= (0..7)
150 150 150 150 150 150 150 150 
##$TP07= 0
##$TPNAME0= <>
##$TPNAME1= <>
##$TPNAME2= <>
##$TPNAME3= <>
##$TPNAME4= <>
##$TPNAME5= <>
##$TPNAME6= <>
##$TPNAME7= <>
##$TPOAL= (0..7)
0.5 0.5 0.5 0.5 0.5 0.5 0.5 0.5 
##$TPOFFS= (0..7)
0 0 0 0 0 0 0 0 
##$TUNHIN= 0
##$TUNHOUT= 0
##$TUNXOUT= 0
##$USERA1= <user>
##$USERA2= <user>
##$USERA3= <user>
##$USERA4= <user>
##$USERA5= <user>
##$V9= 5
##$VALIST= <valist>
##$VCLIST= <CCCCCCCCCCCCCCC>
##$VD= 0
##$VDLIST= <DDDDDDDDDDDDDDD>
##$VPLIST= <PPPPPPPPPPPPPPP>
##$VTLIST= <TTTTTTTTTTTTTTT>
##$WBST= 1024
##$WBSW= 4
##$XGAIN= (0..3)
0 0 0 0 
##$XL= 0
##$YL= 0
##$YMAX_a= 726263
##$YMIN_a= -409716
##$ZGOPTNS= <>
##$ZL1= 120
##$ZL2= 120
##$ZL3= 120
##$ZL4= 120
##$ABSF1= 10
##$ABSF2= 0
##$ABSG= 5
##$ABSL= 3
##$ALPHA= 0
##$AQORDER= 0
##$ASSFAC= 0
##$ASSFACI= 0
##$ASSFACX= 0
##$ASSWID= 0
##$AUNMP= <proc_1d>
##$AZFE= 0.1
##$AZFW= 0.1
##$BCFW= 1
##$BC_mod= 2
##$BYTORDP= 1
##$COROFFS= 0
##$CY= 11.3945322036743
##$DATMOD= 1
##$DC= 2
##$DFILT= <>
##$DTYPP= 0
##$F1P= 15.9154993809931
##$F2P= -4.1035820241983
##$FCOR= 0.5
##$FTSIZE= 0
##$FT_mod= 4
##$GAMMA= 1
##$GB= 0.15
##$INTBC= 1
##$INTSCL= 1
##$ISEN= 128
##$LB= 0.24
##$LEV0= 0
##$LPBIN= 0
##$MAXI= 10000
##$MC2= 0
##$MEAN= 0
##$ME_mod= 0
##$MI= 1.114404
##$NCOEF= 0
##$NC_proc= 0
##$NLEV= 6
##$NOISF1= 3.799351
##$NOISF2= 2.8
##$NSP= 1
##$NTH_PI= 0
##$NZP= 0
##$OFFSET= 15.70392
##$PC= 1
##$PHC0= -11479.11
##$PHC1= 8.60099
##$PH_mod= 1
##$PKNL= yes
##$PPARMOD= 0
##$PSCAL= 0
##$PSIGN= 0
##$REVERSE= no
##$SF= 200.130013532006
##$SI= 16384
##$SIGF1= 3
##$SIGF2= 2
##$SINO= 400
##$SIOLD= 16384
##$SREGLST= <1H.CDCl3>
##$SSB= 0
##$STSI= 0
##$STSR= 0
##$SW_p= 3612.71676300578
##$SYMM= 0
##$S_DEV= 0
##$TDeff= 0
##$TDoff= 0
##$TI= <>
##$TILT= no
##$TM1= 0
##$TM2= 0
##$TOPLEV= 0
##$USERP1= <user>
##$USERP2= <user>
##$USERP3= <user>
##$USERP4= <user>
##$USERP5= <user>
##$WDW= 1
##$XDIM= 8192
##$YMAX_p= 0
##$YMIN_p= 0
$$ End of Bruker specific parameters
$$ ---------------------------------
##NTUPLES= NMR FID
##VAR_NAME=  TIME,          FID/REAL,        FID/IMAG
##SYMBOL=    X,             R,               I
##VAR_TYPE=  INDEPENDENT,   DEPENDENT,       DEPENDENT
##VAR_FORM=  AFFN,          ASDF,            ASDF
##VAR_DIM=   8192,          8192,            8192
##UNITS=     SECONDS,       ARBITRARY UNITS, ARBITRARY UNITS
##FACTOR=    0.0002944,     1,               1
##FIRST=     0,             0,               0
##LAST=      2.4114304,     0,               0
##MIN=       0,             -409716,         0
##MAX=       2.4114304,     726263,          0
$$ Real data points
##PAGE= N=1
##DATA TABLE= (X++(R..R)), XYDATA
$$ [...]
2022G38J03j480Q26O08j546O05J027j597L83J266j909N57K248k971K33K303k525
$$ 738 841 -639 187 795 -751 -146 881 -716 -333 933 -976 -419 1829 -1142 -909 1394 -1131
2039a131l9K192j063j137K324n88k084K061O84k468J119J635k287K94J727j575
$$ -1131 -1170 1022 -41 -1178 1146 558 -1526 535 1219 -1249 -130 1505 -782 -488 1239 -336
2055c36m15J153r63J09Q45l70l32R07m05p51J195m36j052J594K5k060J511Q87
$$ -336 -751 402 -561 -452 393 23 -309 598 193 -558 637 201 -851 743 768 -1292 219 1106
2073A106k709J775J425l000Q36J967j876p26K155p94j221J497M35k158J407J004
$$ 1106 -1603 172 1597 -1403 -567 1400 -476 -1202 953 159 -1062 435 870 -1288 119 1123
2089A123j977O50Q26j090J88R33j275L60N19p71K83N86n09l50J054n62q40J629
$$ 1123 -854 -204 622 -468 -280 653 -622 -262 257 -514 -231 355 -154 -504 550 -12 -852 777
2107G77k24j516J376K19j883J360J218j823L0J616j216q34J929o41j806J997O41
$$ 777 553 -963 413 632 -1251 109 1327 -496 -466 1150 -66 -900 1029 388 -1418 579 1220
2124A220k136O52J304j797M71J107j703K44R71o16k71R81j031M80O85n93p40J443
$$ 1220 -916 -264 1040 -757 -286 821 -882 -638 333 -283 -554 427 -604 -124 561 -32 -772 671
2142F71j049j477K434m93j462J930K53k294J483J050k087M58J663j621k90K036
$$ 671 -378 -1855 579 86 -1376 554 807 -1487 -4 1046 -1041 -583 1080 -541 -831 1205
2158A205j202r96K128o04j610J672p1j261J671n20j163J467l13j025J288P57k157
$$ 1205 3 -993 1135 531 -1079 593 522 -739 932 412 -751 716 403 -622 666 1423 -734
2175g34P40J439k137J63K310k259m21K649j698j397K757r74j802J636N92k092
$$ -734 6 1445 -692 -529 1781 -478 -899 1750 52 -1345 1412 438 -1364 272 864 -1228
2191a228J209J035j726M4J618j529k46J594j424k19J687j247m54J559j261l95
$$ -1228 -19 1016 -710 -666 952 -577 -823 771 -653 -872 815 -432 -886 673 -588 -983
2207i83J666r18r55J879l58j476J364O61k381R63J871k512M56J987j665m04J809
$$ -983 683 -235 -1190 689 331 -1145 219 880 -1501 -538 1333 -1179 -723 1264 -401 -805 1004
2224A004o77j166J405L36j710R86N74j314M47J102j228N5J040j150L88N45j149
$$ 1004 327 -839 566 902 -808 178 752 -562 -115 987 -241 -186 854 -296 92 637 -512
2241e12N51R58j150l33J366p27o73J208j3j704J264Q90j981P41J467k143L01J971
$$ -512 39 997 -153 -486 880 153 -520 688 675 -1029 235 1125 -856 -115 1352 -791 -490 1481
2259A481j539p24J759q81p68J270K8j520J139L40j274P97O03j048J36P94j274
$$ 1481 -58 -782 977 96 -672 598 626 -894 245 585 -689 108 711 -337 -201 593 -681
2276f81P54O00j407O28R79j300l58J785j183o80J733l23k030K022L31k288J606
$$ -681 73 673 -734 -106 873 -427 -785 1000 -183 -863 870 547 -1483 539 870 -1418 188
2293A88R44k193P01J720k253K99J391j269n01J424l90q39J180l62r17J419m83
$$ 188 1132 -1061 -360 1360 -893 -594 797 -472 -973 451 61 -778 402 40 -877 542 59
2310E9j071J372k05j686J940M53k202J391J004k029M15J575j702r9J962r82j276
$$ 59 -1012 360 155 -1531 409 862 -1340 51 1055 -974 -559 1016 -686 -785 1177 195 -1081
2327a081K057k57j832J935Pj705R75Q03j596P46Q21j405O40N74r05J12P53p74
$$ -1081 976 719 -1113 822 829 -876 99 902 -694 52 873 -532 108 682 -223 -111 642 -132
2345a32n50J680j027m95J427r20j069J887l55j849J744K88j193K80J086j042q26
$$ -132 -682 998 -29 -524 903 -17 -1086 801 446 -1403 341 629 -564 -284 802 -240 -1066
2362a066K408j525r28K035q51n02Q08n5o01R14m17q31J072L3j190O76M19q06k17
$$ -1066 1342 -183 -1111 924 73 -429 379 324 -277 637 220 -611 461 494 -696 -20 399 -407 -624
2381f24R28k60j407K214j994Q75J248m48j532J730K10k725K461K55k411J138J081
$$ -624 304 44 -1363 851 -1143 -268 980 532 -1000 730 940 -1785 676 931 -1480 -342 739
2398G39j397r1J450j084m20J566p36q60J226l93j079J333k0o42Q89k89r29J124
$$ 739 -658 -749 701 -383 -803 763 27 -833 393 0 -1079 254 234 -408 481 192 -737 387
2416C87J37j223N43J094j679L02J707k056l41K589j564j043J983j129r31J598
$$ 387 524 -699 -156 938 -741 -439 1268 -788 -1129 1460 -104 -1147 836 -293 -1224 374
2432C74J3j228J378k86o31J88J257j834J79J904j556m65J378r22l01J649r77p26
$$ 374 387 -841 537 251 -380 -192 1065 -769 -590 1314 -242 -707 671 -251 -552 1097 120 -606
2450f06J391p61p00J741p54j361J564Q4j277N79J349k031M44J668j901L81J388
$$ -606 785 24 -676 1065 311 -1050 514 598 -679 -100 1249 -782 -338 1330 -571 -190 1198
2467A198j447o36J526l74p45R15j36j006J019K75j346R19R8q58N58N81j235O33
$$ 1198 -249 -885 641 267 -478 437 301 -705 314 589 -757 162 260 -598 -40 541 -694 -61
2485f1P91j277K01J402j245l50Q01m0j175J710j93j299N40N62m30J97R66j848
$$ -61 730 -547 -346 1056 -189 -539 262 222 -953 757 564 -735 -195 367 -63 134 1100 -748
2503g48M71R32p59j141J707l05p93J286m16q33R22j24p72R01L16j260J013K03
$$ -748 -277 655 -104 -1245 462 157 -636 650 234 -599 323 199 -573 328 644 -616 397 600
2521F00j025J78J098j365K20J315j460p2J401n56j146J520J16j827J398L34j591
$$ 600 -425 -247 851 -514 -294 1021 -439 -511 890 334 -812 708 824 -1003 395 729 -862
2538h62Q67P85j116J87O89q81M6J034j008k70J121p00l25R82m49q43J451l56j246
$$ -862 5 790 -326 -139 550 -331 -285 749 -259 -529 592 -108 -433 549 100 -743 708 352 -894
2557h94J287K14j416R81M80j551N07J263j706M57J323j393l04J403m41j212J613
$$ -894 393 607 -809 172 652 -899 -392 871 -835 -378 945 -448 -752 651 210 -1002 611
2574F11n53j036J257K66j507R30O49j104M22L65r51J90J108j494L53J616j774
$$ 611 58 -978 279 545 -962 -32 617 -487 -65 300 -651 -461 647 -847 -494 1122 -652
2591f52K40R71l88j070J611n95r12J377o6j275P44O80j327M00Q15o15K85R70j105
$$ -652 -412 559 171 -899 712 117 -795 582 516 -759 -15 665 -662 -262 553 -62 223 1193 88
2610H8r1Q06r73m23J147l99o87J338l91q16J202j67j088O75J17K06q83L00o51
$$ 88 -3 803 -170 -593 554 155 -532 806 415 -401 801 634 -454 221 338 544 -339 -39 -690
2629f90j12R71j008n22K202j086m25J525q48o51Q33R98j792P34M40j033J17P85
$$ -690 -802 169 -839 -1361 841 -245 -670 855 7 -644 189 1187 -605 129 569 -464 -347 438
2647D38p55k03Q13l90j94Q26o25m34N92J4p28J013L5q97O63L20j548J012P72j282
$$ 438 -317 -520 293 -97 -291 535 -90 -524 68 82 -646 367 402 -495 168 488 -1060 -48 724 -558
2667e58M26Q60j140o0J188o70r27J433n80p53J253k33j154J095P91j349N27O86
$$ -558 -132 728 -412 -472 716 46 -881 552 -28 -781 472 239 -915 180 971 -378 149 835
2685H35j081L40M17r31J50R84r14P8O48n45k65J074n75j023J437j88j220J070
$$ 835 -246 94 511 -420 -270 714 -200 -122 526 -19 -284 790 215 -808 629 441 -779 291
2703B91N70j702O82J165j325J70Q17p89m04J316n72q20J122j38j040J221n65n95
$$ 291 861 -841 -159 1006 -319 -149 668 -121 -525 791 219 -601 521 383 -657 564 -1 -596
2721e96N80q9n53J030k54m39M51O32j465K25J019o82R8J94J97j613J539l01r07
$$ -596 -16 -105 -658 372 118 -321 130 762 -703 -478 541 -141 -43 151 348 -1265 274 -27 -934
2740i34J314j41j486J297K13j005N48Q52j195L26J184r89m24J304m35o36K99r6
$$ -934 380 239 -1247 50 263 -742 -194 658 -537 -211 973 -16 -440 864 429 -207 92 -4
2758dr5J227j164j24N00l57k29n1J178j343J95M86j179J552K48n96o08L59o2m89
$$ -4 -99 1128 -36 -160 340 -17 -246 -297 881 -462 -267 219 -960 592 840 244 -364 -5 -67 -556
2778e56J515o37j205J770j481M08qJ13q02J073M24j270K40Q92o38r4J91p75M86
$$ -556 959 322 -883 887 -594 -186 -194 -81 -883 190 614 -656 -416 476 -162 -256 -65 -840 -354
2797c54M67p04J99J388j257l86M35M99j051O62Q48j392O59Q54j427NJ000p52k03
$$ -354 113 -591 -392 996 -261 -647 -212 287 -764 -102 746 -646 13 867 -560 -555 445 -307 -510
2816e10J034o81l61R74l51o68O16J22o45M62L02o40L44O22j049L29R34j422M24
$$ -510 524 -157 -518 456 105 -563 53 175 -470 -8 294 -346 -2 620 -429 -100 834 -588 -164
2835a64P64j091J41J200p49r38J283m0r28P81K96j106P26L08r19K93P12j003K20
$$ -164 600 -491 -350 850 101 -837 446 406 -522 259 555 -551 175 483 -436 -143 569 -434 -214
2854b14Q80r33r7O74l46l9N68l14l15N58j24o69P41r9n45O06K30r20K16P99q83
$$ -214 666 -267 -364 310 -36 -75 493 179 -136 422 298 -371 370 271 -274 332 562 -358 -142 657 -226
2875b26r2Q26q73J06Q21p50k80P91o0o84M60L2l11K35J60q04P32P7p77N16J2p1
$$ -226 -318 508 -365 -259 562 -188 -468 323 263 -421 39 71 -240 -5 155 -649 83 160 -617 -101 -89 -160
2897a60m2O17p44L8N84m13l69P67k80m19R44j61r94P94J98r13N30M90r52K11O49
$$ -160 -202 415 -329 -291 293 -120 -489 278 -2 -421 523 362 -632 162 360 -553 -23 467 -485 -274 375
2918C75k84m98M89rl37M87k0m21K03L19o75N01J55n37M21M29o18L9M34o90K07
$$ 375 91 -407 82 73 -264 223 203 -218 -15 304 -371 130 285 -252 169 598 -20 19 453 -237 -30
2939c0K89l07k05M98k67m48Q77M4j052J217l26q61O90L00p83J90O57n86L0N20
$$ -30 259 -48 -253 245 -22 -470 407 451 -601 616 290 -571 119 419 -364 -174 483 -103 -73 447
2959D47m23m38Q84m01o75R57k30m71N51J7n54L73L85r59P50m9m22J64O45o53p1
$$ 447 24 -414 470 69 -606 351 121 -350 201 218 -336 37 422 -537 213 164 -258 -94 551 -102 -173
2980a73P10r16K0Q65l65n11P27l19o53P11p7l01K75L56q22L52K51m44MM47m47
$$ -173 537 -379 -359 506 141 -370 357 38 -615 96 19 -282 -7 349 -473 -121 130 -314 -310 137 -310
3001c10K52L96n20J36N02n82j83P66k90p42P53M9p65L42N28l55p4N69q13J92P99
$$ -310 -58 338 -182 -46 456 -126 -309 457 167 -575 178 227 -538 -196 332 -23 -97 472 -341 -149 650
3022F50r44Q4M28k27l83M62J67p08L91K05n21J23M20l69K79L9l84P6N74o28K42
$$ 650 -294 -210 218 -9 -392 70 237 -471 -80 125 -396 -273 147 -222 57 96 -288 -212 362 -266 -24
3043b4L45o79M5O11k67n37Q89j59o52O94J75q47M71K56n32j93P66p01J24N31j50
$$ -24 321 -358 -313 298 31 -506 383 224 -428 266 441 -406 65 321 -211 -404 362 -339 -215 316 166
3064A66n96N78n7j56N9J38m84R49n43l39M54k0k77J87M71j088L44P45p43o6O85
$$ 166 -430 148 91 -65 -6 132 -352 597 54 -285 169 149 -128 59 530 -558 -214 531 -212 -278 407
3085D07k07n78Q58n40k76Q08k51o72M47L27o62L55K19o41L18N03o21J92K37j38
$$ 407 200 -378 480 -60 -336 472 221 -451 -4 323 -339 16 235 -406 -88 415 -206 -14 223 85
3105H5k43N78m87k54P56l60n54P21j15l40L56p0n89N76K07o05L69N41r74K90N88
$$ 85 -158 420 -67 -321 435 75 -479 242 127 -213 143 73 -516 60 267 -338 31 572 -402 -112 476
3126D76o01k32N27l53j60N37p4k58L0L48p22O22j46j57M7M60l70j2M20n71J56
$$ 476 -125 -357 170 -183 -343 194 120 -138 -108 240 -482 140 -6 -163 -116 344 -26 -38 382 -189 -33
3147c3M05m45n5M37l51j35O37l59k06M62J39o63oM38n10j47Q54k37l87N93n73
$$ -33 372 -73 -128 309 -42 -177 460 101 -105 357 496 -167 -173 265 -245 -392 462 225 -162 431 -142
3168a42j02L87j12l26M60J04o22N95P4o69K16nl08J56N17m67k8M31k96r6N17j60
$$ -142 -244 143 31 -295 165 269 -353 242 316 -353 -137 -142 -450 -294 223 -244 -272 159 -137 -233 284 124
3190A24o64P69j96m64N21K36o94K74N70q50L81J40l89K29K03k66j19M33k76n3
$$ 124 -540 229 33 -431 90 326 -368 -94 476 -374 7 147 -242 -13 190 -76 -195 238 -38 -91
3210i1N66k50o91M75J69m18K91J92o91O75K15r68O56J55n27K65K76n18j17O16
$$ -91 475 225 -466 9 178 -240 51 243 -448 227 442 -526 130 285 -242 23 299 -219 -336 280
3230B80k36m01N71k15m72N77R3n87O41j6n75M59J72n79Q1M09m30K42L59l98j40
$$ 280 44 -357 214 -1 -473 104 197 -390 251 235 -340 119 291 -288 -207 202 -228 14 373 -25 -165
3251a65M22k35k62N69j39l32L90j40m56L30J32j74l00O38p21J65N74n07j44P24
$$ -165 257 22 -240 329 190 -142 248 108 -348 -18 114 -60 -360 278 -443 -278 296 -211 -355 369
3271C69m42n25P59q1k63K33P1n38N03J22m30K99k6l21J49N35p30M02K96o60O7
$$ 369 -73 -598 161 80 -183 50 121 -417 86 208 -222 77 51 -270 -121 414 -316 86 382 -278 -211
3292b11M39q2n17O78l38J6K34J48n05j83M59k46p0O04m86kM23k63l36M12J27n51
$$ -211 228 146 -371 307 -31 -15 219 367 -138 -321 138 -108 -178 426 -60 -62 361 98 -238 174 301 -250
3314b50M10l3j42K08j38l29L34L3m96L72M35q36L85N22o75j61Q93p34k96N56Q8
$$ -250 160 127 -15 193 55 -274 60 93 -403 -31 404 -432 -47 475 -200 -361 532 -202 -498 58 146
3335A46l35M64Rm21J52K72o74M26L4n04K53M32n97K22K66j30j54L68k3n88O82
$$ 146 -189 275 284 -137 15 287 -387 39 73 -431 -178 254 -343 -121 145 15 -139 229 206 -382 300
3356C00k08m23P17j30o71N79m8o18L74N47o79J70M54l87k06L85j04k36N74j89
$$ 300 92 -331 386 256 -415 164 116 -502 -128 419 -260 -90 364 -23 -229 156 52 -184 390 201
3376B01k79L62l23j56M47j92j54R1J5j84K18Q2l38K97R3k46mL89l93M6L64l40
$$ 201 -78 284 -39 -195 252 60 -94 -3 12 -172 46 128 -210 87 180 -66 -70 319 -74 -28 336 -4
3398dk08O03l51n12K23O13m70k1L29n30K35L28n11K04J23k50q1L80k26k17N58
$$ -4 -212 391 40 -472 -249 364 -106 -127 202 -328 -93 235 -276 -72 51 -199 -280 100 -126 -343 215
3419B15j38l86L27m8n2K55o7l48L06L43o65J73M63n01k91R03m98l20N45l63K1
$$ 215 77 -309 18 -30 -82 173 106 -242 64 407 -258 -85 378 -123 -414 489 -9 -329 216 -147 -126
3440a26J71J91n73J92M35k37p8K56j29l02L20j24K1K0l5j71L39k73N8M04k01m62
$$ -126 45 236 -337 -145 290 53 -25 231 102 -200 120 -4 17 37 2 -169 170 -103 -45 359 158 -304
3462c04L83J12k83J90L17n26j2M71p76J87O30o13JP07m95k81L75Q6n05M46km23
$$ -304 79 191 -92 98 415 -111 -123 348 -428 -241 389 -224 -223 484 -11 -292 83 169 -336 110 108 -315
3484c15K72K29l10M0M18n27J2P81p87K10M45n33r9L61Jm71O73m48M2p3K80m24
$$ -315 -43 186 -124 -84 334 -193 -181 600 -187 23 468 -65 -164 197 198 -273 400 -48 -6 -79 201 -223
3506b23M39K37p34J33L09m74M35K09m57l33O67k60r6N32n36J06J2K22l96N34j82
$$ -223 216 453 -281 -148 161 -313 122 331 -126 -459 208 -52 -148 384 -152 -46 -34 188 -208 326 144
3527A44n32L39L32m98K70K61n55J82L90n11j50N49l80j91P77l16j78K32J17k32
$$ 144 -388 -49 283 -215 55 316 -239 -57 333 -178 -328 221 -159 -350 427 111 -67 165 282 50
3547E0L5P2k08k20Q05n53pK48l80R8J62k79K18J42k90K78j2l67k7J23K50k43J87
$$ 50 85 157 -51 -271 534 -19 -26 222 -158 -60 102 -177 41 183 -107 171 159 -208 -235 -112 138 -105 82
3570H2L5l12o5P30n24l3J96j95l44P26k47l29N20j95J2j01J93n02K47L63k79L76
$$ 82 117 -195 -260 470 -54 -87 109 -86 -430 296 49 -280 240 45 57 -44 149 -353 -106 257 -22 354
3592C54j68m37J29J73Q6m60N64k06k83M30K0k60K41J32m05L51Q9m80P3L06k42
$$ 354 186 -251 -122 51 137 -323 241 35 -248 182 202 -58 183 315 -90 261 350 -130 -57 249 7
3613Gn7N72o63J81K04k00k92P39n99K2J47j20j49K83J40m42J65L24n25R0L59m03
$$ 7 -50 522 -141 40 244 44 -248 491 -108 -86 61 -59 -208 75 215 -227 -62 262 -263 -173 186 -217
3635b17K58J08l30J43J05j35r7L10l22j28O25k97k74K05m7k11L48N0m49J91N42
$$ -217 41 149 -181 -38 67 -68 -165 145 -177 -305 320 23 -251 -46 -93 -304 44 94 -355 -164 378
3656C78k80k57M37l58J75J52j84p9r4J12l19P24l70j32J56J20k81N57k29n40K59
$$ 378 98 -159 278 -80 95 247 63 -16 -110 2 -317 407 37 -95 61 181 -100 457 228 -312 -53
3677e3O08m96j35K88k50q2J56P2l87L53J23k92K55p1k69K16L40m61k87M03j25
$$ -53 555 59 -76 212 -38 -120 36 108 -279 74 197 -95 160 89 -180 36 376 -85 -372 31 -94
3698i4J72J31l37r1K50k3k38K39J64n09L04o4q8K92K36m30J27K40n81L26Q8j27
$$ -94 78 209 -128 -219 31 8 -230 9 173 -336 -32 -96 -184 108 344 -86 41 281 -300 26 114 -13
3720a3l65O06m08J13K94l56j61L27j8j7R8rl31J33J86k70K82O3o49K43L45j33
$$ -13 -378 228 -180 -67 227 -129 -290 37 19 2 100 91 -240 -107 79 -191 91 154 -495 -252 93 -40
3742d0MM64m15l55N58k31n6N0L00l89J80K65m50p8N07m98J70K13l06j70N20m84
$$ -40 -36 428 13 -342 216 -15 -71 -21 279 -110 70 335 -115 -193 314 -184 -14 199 -107 -277 243 -241
3764b41n7L42J33j47J06R6l55J96j4k62L41J00k80p4P3j63K54L12k77j33K13k0
$$ -241 -298 44 177 30 136 232 -123 73 59 -203 138 238 -42 -116 -43 -206 48 360 83 -50 163 143
3786A43j44K96j50l69M26k85q3J53J04j54KM53n56J74J96m04J20L56k75n1M37
$$ 143 -1 295 145 -224 202 -83 -166 -13 91 -63 -61 392 -164 10 206 -198 -78 278 3 -48 389
3807C89l21l12N26l0n10M03j29k35R3K59m01L26J45l59K5L18m16J36K36j60Q7
$$ 389 68 -244 282 252 -258 145 16 -219 -126 133 -268 58 203 -156 -131 187 -229 -93 143 -17 70
3828G0O8j49n3K40n0l44K61M0l72K0L86j72k9M02l66m8J22k87L5L03qk41K84j89
$$ 70 138 -11 -64 176 126 -218 43 83 -289 -269 117 -55 -84 318 -48 -96 26 -261 -226 77 69 -172 112 -77
3852g7r0L95j63k74L17mm44N16J58l88k8J54q9p0K66l30K58j84K39l08J44J11
$$ -77 -167 228 65 -209 108 104 -340 176 334 -54 -82 72 -17 -87 179 -151 107 -77 162 -146 -2 109
3874A09k51p3K48k02L3J85l46K20L08k28l42N26j07k99L32r7j2jJ26k09P9o8p8
$$ 109 -142 -215 33 -169 -136 49 -297 -77 231 3 -339 187 80 -219 113 16 4 3 129 -80 -1 -69 -147
3897a47kP7j37J27K16l68J99J24l10R1J75r8K1L10l22j72K43N1m22M76n9k35L81
$$ -147 -149 -72 -209 -82 134 -234 -35 89 -221 -130 45 -53 -32 278 -44 -216 27 78 -344 132 73 -162 219
3920B19rl68J38lk06M0M80l31k83O02l21l47N66k22R9Q7j98k31O6M44m45L64j71
$$ 219 210 -158 -20 -23 -229 -189 291 -40 -323 279 -42 -389 177 -45 54 141 -57 -288 -222 222 -223 141 -30
3943c0J93k63K11k30o7K82j03n1L51l69j85L81J42m02M38j23m22K18LQ3j79K94
$$ -30 163 -100 111 -119 -186 96 -7 -58 293 -76 -261 120 262 -140 298 175 -247 -29 -26 57 -122 172
3965A72k96k4K93k84M4K3K10l70K62o8k82L87J3k27P5M46p59N46k2k33J24K3r5
$$ 172 -124 -148 145 -139 -95 -72 138 -232 30 -38 -320 67 80 -147 -72 374 -385 161 139 -94 30 53 -42
3988d2N2P2Jp5J67j05l96K89k8k84K65J01r0N7J0O9j21M21n01J16J03m0r8P0m3
$$ -42 10 82 83 8 175 70 -326 -37 -65 -349 -84 17 -73 -16 -6 63 -58 363 -138 -22 81 41 -57 13 -30
4013c0j98K97j04M5Q5k98o5L53L63p68N46k12j28PJ97j65j95M77j19j03K42j22
$$ -30 -228 69 -35 10 95 -203 -268 85 448 -320 226 14 -114 -107 90 -75 -270 207 88 -15 227 105
4035A05l42J89J3j4J80k70K17k26q7p6L18j72J83j01K89l01l7J60k1j91J96J99
$$ 105 -237 -48 -35 -49 131 -139 78 -148 -235 -311 7 -165 18 -83 206 -95 -132 28 7 -184 12 211
4057B11j52p8J8k46N59j33k61J76j8k50P0K65j37J08j18j61J37K43l20K1J47j31
$$ 211 59 -19 -1 -247 312 179 -82 94 76 -174 -104 161 24 132 14 -147 -10 233 -87 -66 81 -50
4079e0r5K47N1l53K51P7m3J78o0l88K13k2o4j68L42j09l19K79n1J09j14K89k04
$$ -50 -145 102 153 -200 51 128 85 263 203 -185 28 6 -58 -226 116 7 -312 -33 -84 25 -89 200 -4
4102dJ38M2l33lM43k42j01l6L44k45j4o2J22Kj44L5Q3o3J98m3p4J6O0K7j59o0
$$ -4 134 176 -157 -160 283 41 -60 -96 248 3 -11 -73 49 51 -93 -58 25 -38 160 117 43 59 119 146 -13 -73
4128g3J90j70N7P6k05K00KR3l42M64k64r1N7j04J55M6R2k78J67j94J65j17J91
$$ -73 117 -53 4 80 -125 75 77 170 -172 292 28 -63 -6 -110 45 91 183 -95 72 -122 43 -74 117
4151A17j76j83M43k70L1K66l17P5K26q6n39N19M0j98L9O7l02L09l3j62J04P2n1
$$ 117 -59 -242 201 -69 -38 228 -89 -14 212 126 -413 106 146 -52 -13 54 -248 61 28 -134 -30 42 -9
4174iJ5K47O0p02N67k18n7K85j89k04K70J4j43J32L2l26L44R8m05K01J60K7l52
$$ -9 6 253 313 -389 178 -40 -97 188 -1 -205 65 79 -64 68 100 -226 118 216 -189 12 172 199 -153
4197a53L52j07k78J1o0n6M33Nm92K92L19m92K68l4k16L12q2J5J8J9j64J14r8n5
$$ -153 199 92 -186 -175 -235 -291 142 147 -345 -53 266 -226 42 8 -208 104 22 37 55 74 -90 24 -74 -129
4221a29J00r4K27j68J08R5j62M4l9j82N6L13l80K00Q2j14R2mK8j81J95j55k5P2
$$ -129 -29 -123 104 -64 44 139 -23 21 -18 -200 -144 169 -211 -11 71 -43 49 45 73 -108 87 -68 -93 -21
4245b1K83o51L75j65K27K8K8j22o3J61k62J28J33j05j40K47j1l31K90O0p9N4L
$$ -21 262 -389 -14 -179 48 76 104 -18 -81 80 -182 -54 79 -26 -166 81 70 -261 29 89 10 64 67
4268F7k81K17j10n5J69q3j28K77j32j75L56j74J72k8P2l03R6J91j72n0J63m2j51
$$ 67 -214 3 -107 -162 7 -76 -204 73 -59 -234 122 -52 120 92 164 -139 -43 148 -24 -74 89 47 -104
4291a04j21K82j80Q4L73m49J79o9n6o7J91R4k38J48K46j98M2%j80J27k51j58N28
$$ -104 -225 57 -123 -39 334 -115 64 -5 -61 -128 63 157 -81 67 313 115 157 157 -23 104 -147 -305 223
4314B23Q5k66k26K15m9k22L12J83n35L51J10l99M81j95p5J43m3j37K03j20p4n0
$$ 223 308 42 -184 31 -18 -240 72 255 -280 71 181 -218 263 68 -7 136 93 -44 159 39 -35 -85
4336h5L73n43q1L68j17J29K56m38k09K27O2p3M67l65J52l24K00k25K48j28K85
$$ -85 288 -255 -336 32 -85 44 300 -138 -347 -120 -58 -131 336 -29 123 -201 -1 -226 22 -106 179
4357A79k65P1K30l82K04N4j97K62o8j43K39L0j63Q8Kl44q7K76j6J7J16j27P5J77
$$ 179 -86 -15 215 -167 37 91 -106 156 88 -55 184 214 51 139 141 -203 -290 -14 -30 -13 103 -24 51 228
4381B28k01k43L90j2k15L05j47k03k35L93Qj99L59j39j82K48o1l0Q2j46o8J14
$$ 228 27 -216 174 162 -53 252 105 -98 -333 60 68 -131 228 89 -93 155 94 64 146 0 -68 46
4403D6j54R8L76j34k84J07m1p5M1K35k14j65L65m62L22J07k18j31K33M3j43k7
$$ 46 -108 -10 366 232 -52 55 14 -61 -20 215 1 -164 201 -261 61 168 -50 -181 52 95 -48 -75
4425g5J9o9K78k86J31k5J06o8m7L4j24K47K36m18K9j4L3j51J62J81l50K05J78
$$ -75 -56 -125 153 -133 -2 -27 79 11 -36 -2 -126 121 357 -61 -32 -46 -13 -164 -2 179 -171 34 212
4448B12k79J34r8o6K40k33RJ74K10k65OO3l08K54R8j96j8l2l3l6Q0M19k13q6P2
$$ 212 -67 67 -31 -97 143 -90 -81 93 303 38 44 107 -201 53 151 -45 -63 -95 -128 -164 -84 335 122 36 108
4473A08k81K32K4L2k92K64l23L38L5q7o1Q8j24n9L22k23m2J46n9N9M0J87l93J69
$$ 108 -173 59 83 115 -177 87 -236 102 137 50 -11 77 -47 -106 216 -7 -49 97 38 97 137 324 -69 100
4497A00J18j31k94K57O6j08L3k20rK27j11m9L30n0j75K0R3j92J0L12l08MN9O2
$$ 100 218 87 -207 50 116 8 41 -179 -188 39 -72 -121 209 159 -16 4 97 -95 -85 227 -81 -77 -18 44
4521D4p2K92l3j88j33PQ%J21l75K39k4K55k50J56k8j81K22j66q2K67Ol74M04k37
$$ 44 -28 264 231 43 -90 -83 -75 -75 46 -329 -90 -114 141 -109 47 19 -162 60 -106 -188 79 85 -289 115 -122
4546a22O2K52l5j65k52L65k61J54K1k44J63J45j32j26J70j71R0K8M3jJ87k68J59
$$ -122 -60 192 157 -8 -260 105 -156 -2 19 -225 -62 83 -49 -175 -5 -176 -86 -58 -15 -16 171 -97 62
4569F2J30k51k3J55J80n19J71J58n9j69K59k51j2J43mM8J21j90M8p2J14j36JJ77
$$ 62 192 -59 -82 73 253 -266 -95 63 4 -165 94 -157 -169 -26 -30 18 139 -51 -3 -75 39 -97 -96 81
4593H1P8k13J65q3J34o3j45L63m24K0j25L6J43N6J76r0j28j4R0r4j95K34j1m2
$$ 81 159 -54 111 28 162 99 -46 317 -107 -87 -212 -176 -33 23 199 109 -19 -33 57 -37 -232 2 -9 -51
4617e1L96l31J11j58R6j19J7q8k27K71O72o28jN9N1q6R4j51n3J62j96K36J17j43
$$ -51 345 14 125 -33 63 -56 -39 -127 -354 -83 589 -39 -40 19 70 -16 78 -73 -126 36 -160 76 193 50
4641E0j71N0K19k54N0K03k47o3L5J18n7j58J64P8R7k36n3l8J14L04o9%r1J10j69
$$ 50 -121 -71 148 -106 -56 147 -100 -163 -128 -10 -67 -225 -61 17 114 -122 -175 -213 -99 205 136 136 45 155 -14
4666a4J03J59k53k32L81K8m01L53K10m19k5J43l0k32J13p8J12n1J87q5K28j50
$$ -14 89 248 -5 -237 144 172 -229 124 334 -85 -110 33 3 -229 -116 -194 -82 -133 54 -31 197 47
4688D7p4J16rn2o9K31k10M4jj28K04J23l89K38j12K42l17K85j23k12L13k34q2
$$ 47 -27 89 80 28 -41 190 -20 24 23 -105 99 222 -167 71 -41 201 -116 169 46 -166 147 -87 -169
4711a69M12j57k83J25K7J07j39J06k4m3J54o8j45J64n9j86J99K9j08NK46l65K76
$$ -169 243 86 -197 -72 -45 62 -77 29 5 -38 116 48 -97 67 8 -178 21 50 -58 -53 193 -172 104
4734A04J65l43m0J37R0l34L81j46j37J68J20q5p2o4n1K04k20J4N5K35p5J01k8
$$ 104 269 -74 -114 23 113 -221 160 14 -123 45 165 80 8 -56 -107 97 -123 -109 -54 181 106 207 179
4757A79m46P3J73L5p3K29j35q9P1K1q6J98Q1l27M5J63m11N27j07l46K34L9N6j18
$$ 179 -267 -194 -21 14 -59 170 35 -54 17 38 -48 150 231 -96 -51 112 -299 228 121 -225 9 48 104 -14
4781a4L5O4k26K31k81J43K76m65M0J82J17k9k38K66j81j73K94k19J24L31k57K9
$$ -14 21 85 -141 90 -191 -48 228 -237 -197 -15 102 73 -165 101 -80 -253 41 -178 -54 277 20 49
4803D9r5J27n3o5R0K10l72j4K8J59K25k53J76k98Q6J25J9j91k10Q04jj063Q08
$$ 49 -46 81 28 -37 53 263 -109 -123 -95 64 289 36 212 -86 0 125 144 -47 -257 547 546 -517 291
4826B91m15k34L13O53j188N20L8O34p17l94J111j245Q01J58m87M49l57r2J09L0
$$ 291 -124 -358 -45 608 -580 -60 -22 612 -105 -499 612 -633 168 326 -161 288 -69 -161 -52 -22
4846b2n7L2M8k13Q0P7k5P3N3l45L62m0m7J18l9k17J27J78m55K70L99n09j88K37
$$ -22 -79 -47 1 -212 -132 -55 -80 -7 46 -299 63 23 -24 94 55 -162 -35 143 -312 -42 357 -152 -340 -103
4870a03K5k34M88q1j23J10j02q9J29J36m76L28L32m50R9L67o88J63K24r2j57M83
$$ -103 -78 -312 176 95 -28 82 -20 -109 20 156 -320 8 340 -110 -11 356 -332 -169 55 -37 -194 289
4892B89l15k10K39M0l15M82j07l6q1L6k0l00M57k14j79L55n8n4K39j38k35K80
$$ 289 -26 -236 3 43 -272 210 103 67 -14 22 2 -298 159 -55 -234 121 63 9 248 110 -125 155
4914A55R6k84R9%k09K5K55k25J11R5q6k72L20l13Q5O01l76j45Q2Kl29L36j0k62
$$ 155 251 -33 66 66 -143 -118 137 -88 23 118 32 -240 80 -233 -148 453 77 -68 14 16 -313 23 13 -249
4938b49J94K80m27J33K70l94J13K76l32J3K46o7j95M43k96j60K01j00m9J62m0
$$ -249 -55 225 -202 -69 201 -193 -80 196 -136 -123 123 56 -139 304 8 -152 49 -51 -100 62 22
4959B2n33P77l16o5P6M03l66l00N85k04k83M02j94k63L68j33J31j67K05q8k11
$$ 22 -511 266 -50 -115 -39 364 -2 -302 283 79 -204 198 4 -259 109 -24 107 -60 145 57 -154
4980a54J12o0J2J52j06qK24j44j33K87k21j39J25k41K38K13r4j21M2M99n32p9
$$ -154 -42 -102 -90 62 -44 -52 172 28 -105 182 -39 -178 -53 -294 -56 157 63 -58 -16 483 -49 -128
5002a28K99j6L0l9jk48L64r6k35K91k21q4P8j0J23M1j68r2JO7n7JL13j81k60M01
$$ -128 171 155 185 146 145 -103 261 165 -70 221 0 -84 -6 -16 107 148 -20 -112 -111 -44 -101 -100 213 32 -228 173
5028A73j47r0J82r6L83l15rj79lm4k43O75l18j54K07J58k43j72M18m56L43N0p4
$$ 173 26 -64 118 22 405 90 81 -98 -101 -145 -388 287 -31 -185 22 180 -63 -235 183 -273 70 120 46
5051D6r3K7Q6j24K43o3k08J40P4k58J06K14j90m4M1j58K88M75o92K78j15M6Qj68
$$ 46 -47 -20 66 -58 185 122 -86 54 128 -130 -24 190 0 -44 -3 -161 127 602 -90 188 73 119 127 -41
5075d1K74p28O27N8l28J19l44O84l90N4l13j35O46j75r2L65M3k87p42O52L90k24
$$ -41 233 -495 132 190 -138 -19 -363 321 -69 -15 -328 -463 183 8 -84 281 324 37 -705 -53 337 113
5097A13J73k75p36P60Mj2J92j13l42K64m9j09L03j66j03q9L09l81N93k38k47K83
$$ 113 286 11 -725 35 39 27 219 106 -236 28 -21 -130 173 7 -96 -185 124 -257 336 98 -149 134
5119A34L6n20N29p8k25J95J5l11K02J16k31J95R5k66j61L06K4k72K37J40j70J7
$$ 134 170 -350 179 101 -124 71 86 -225 -23 93 -138 57 152 -114 -275 31 55 -217 20 160 -10 7
5141GN4j13J07J18j94R5J75m61K77K59l00N5J71m83K94P4k05j31J98l5j96L18
$$ 7 61 -52 55 173 -21 74 249 -212 65 324 24 79 250 -233 61 135 -70 -201 -3 -38 -234 84
5163H4J28k47m8N9j0J62p2l14QN58k68k85L53K4n65N49k15l4L94k79m0O0J08k65
$$ 84 212 -35 -83 -24 -34 128 56 -258 -250 308 40 -245 108 132 -433 116 -99 -133 261 -18 -58 2 110 -155
5187a55K25k0K3m69K93m2J50L4j12JL81l22o8L84n40J86R5O9l26K81J37k66J63
$$ -155 70 50 73 -396 -103 -145 5 39 -73 -72 309 -13 -81 303 -237 -51 44 113 -213 68 205 -61 102
5210A02P1l77Q0M26l13k60L62k46J13J79j08r9j1J58j61J60J92m16J15L88l19
$$ 102 173 -204 -124 302 -11 -271 91 -155 -42 137 29 -70 -81 77 -84 76 268 -148 -33 355 36
5231C6j9K2k9l9Q5j20k53N57r1l26L04k07j54k5K29r6M28N3n76L38p7j61J8R1
$$ 36 17 39 10 -29 56 -64 -317 240 149 -177 127 -80 -234 -259 -30 -126 302 355 -221 117 40 -121 -103 -12
5255a2k85M5J48J25N8m9k9j55K36J21l66K03J59l59L70oj89Rj07JO5L23l53k52
$$ -12 -297 -252 -104 21 79 30 1 -154 82 203 -163 40 199 -160 210 204 15 24 -83 -82 -17 306 -47 -299
5279b99L86p8k42L34j48r0L15j06j90O5Q4k94J69J71j37K7J19j16P0j89J90j54
$$ -299 87 9 -233 101 -47 -137 178 72 -118 -53 31 -263 -94 77 -60 -33 86 -30 40 -149 41 -113
5301a13J96J4k20J74P4j36nK59k83LJ32m54L09N16n03K2J08k10J22k0J02k78L61
$$ -113 83 97 -123 51 125 -11 -16 243 -40 -37 95 -359 -50 466 -37 -15 93 -117 5 -15 87 -191 170
5324A70nl98K28K08n94J74NO34l60p1l26M40q0K81p59N63k61O6M16J53j74l61
$$ 170 165 -233 -5 203 -391 -217 -212 422 62 -9 -335 105 25 306 -453 110 -151 -85 331 484 310 -51
5346e1J0k43k16M66m60J191L36o45l68j67M70l12M15n91J10J67n60J138r89M20
$$ -51 -41 -284 -500 -34 -494 697 1033 388 20 -147 323 11 426 -165 -55 112 -448 690 -299 121
5366A21l47M37M47p43J06J01k62J00L83l62L0L2J24j03p0j08K7J23K14m82L59
$$ 121 -226 211 658 -85 21 122 -140 -40 343 -19 11 43 167 64 -6 -114 -87 36 250 -232 127
5387A27p1j16J62O0j90J8K1o2M3kl2n0J5k19J82J47N1k60J72M5j00P8q2K08l2
$$ 127 56 -60 102 162 -28 -10 11 -51 -8 -10 -42 -92 -77 -296 -114 33 84 -176 -4 41 -59 19 -63 145 113
5412A13p1r0r1K12k86K52J39l27QM28l56k9J24Q1k92j7L23j80J21R5l18K12Rj16
$$ 113 42 -48 -139 73 -213 39 178 -149 -141 287 -69 -98 26 107 -185 -202 121 -59 62 157 -161 51 60 -56
5436e6K56p5j84J45J44l04j09J73o1q2K85Km32L85J00k36L56pm79Q7J98j04O1
$$ -56 200 125 -59 86 230 -74 -183 -10 -71 -153 132 134 -298 87 187 -49 307 300 -179 -92 106 2 63
5459F3j51O2Q9J56l05j19J57J86l60M22k41N2L60m85j86M44K1l98K27J24k49K2
$$ 63 -88 -26 63 219 -86 -205 -48 138 -222 200 -41 11 371 -114 -300 144 165 -233 -6 118 -131 -109
5481a09J19o8K35p9j75J6J90q3q0L94l83o1K97p3j83q5K15n5jK6j24PN5o6q2L55
$$ -109 10 -58 177 98 -77 -61 129 46 -34 360 -23 -84 213 140 -43 -128 87 32 31 57 -67 -60 -5 -71 -153 202
5507B02m19l4J87J7q3J05R2m88N67j71l30M42N3o5m8o5J54l58J43L26l37L07k81
$$ 202 -217 -251 -64 -47 -130 -25 67 -421 146 -25 -355 87 140 75 27 -38 116 -242 -99 227 -110 197 -84
5530h4J29O5L9k07L0lm6L40q9l37L6K22n1j52K50j33j32K03q0p1j00K81l01K64
$$ -84 45 110 149 -58 -28 -31 -77 263 174 -163 -127 95 44 -108 142 9 -123 80 0 -71 -171 110 -191 73
5554G3O8j21J5P9j49o3L05j72r5L54l17l93L79J01l05L96r7Q4P9k44j07R7Q9j99
$$ 73 141 20 35 114 -35 -98 207 35 -60 294 -23 -416 -37 64 -241 155 58 142 221 -23 -130 -33 56 -143
5578a43K88q3k39j03K60J06j76K79l9m01K93j00n9J51M1L5k84K51j91L95k50k12
$$ -143 145 62 -177 -280 -20 86 -90 189 150 -251 42 -58 -117 34 75 110 -174 77 -114 281 31 -181
5600a81K33J14k07R5Q9o4Q1j11j03n1J40Lk70L38k6j83k3J70m5Q0J42l75J33L08
$$ -181 52 166 -41 54 143 79 160 49 -54 -105 35 38 -232 106 80 -103 -126 44 -1 79 221 -154 -21 287
5624B87k77j95L48ml41K10j69L0J27j8j88R3R2n2q2J81m8P2J02k49mJ76l4j39
$$ 287 10 -185 163 159 -182 28 -141 -111 16 -2 -190 -97 -5 -57 -139 42 -6 66 168 -81 -85 91 57 -82
5648h2lp4J6J81K8n6K37j88l55K28J57l40J15K63l46J54J0j0J44j99j4j26L94
$$ -82 -85 -159 -143 38 66 10 247 59 -296 -68 89 -251 -136 127 -219 -65 -55 -65 79 -120 -134 -260 134
5671A34l37L66J9N6k12J80k35r4J43J90m17Q8K28j77P1K37k75j96M34j17l10K75
$$ 134 -203 163 182 238 26 206 -29 -123 20 210 -207 -119 109 -68 3 240 -35 -231 203 86 -224 51
5693E1J32k74J87j46qJ00R2j82L5J96j30j17L25k19l53J65J69j34K89m41J54L15
$$ 51 183 -91 96 -50 -58 42 134 -48 -13 183 53 -64 261 42 -311 -146 23 -111 178 -263 -109 206
5715B06L6m12L53j04r9rO9j51L67j47l50N36j71Q3k01J47NP7l55J41R5L18m84
$$ 206 242 -170 183 79 -20 -29 40 -111 256 109 -241 295 124 207 6 153 158 235 -120 21 116 434 -50
5738e0O3J97J2k65j19K16k53K63Jj85o7K23K8j3K82k93j40J29m3K5K02o2m62M07
$$ -50 13 210 222 -43 -162 54 -199 64 65 -120 -187 36 64 51 333 40 -100 29 -14 11 213 151 -311 96
5762I6R4l91J02L84k89N4J51l03Q9J75J1k96K44R3k80J76L3j17K19j37Oq4K73
$$ 96 190 -201 -99 285 -4 50 201 -102 -13 162 173 -123 121 214 -66 110 143 26 245 108 114 30 303
5785C03k83K8J21n1l57M43m69R0J80J97k81J62j56k2l5J85k64P6K06j64J82Q8
$$ 303 20 48 169 118 -239 204 -265 -175 5 202 -79 83 -73 -95 -130 55 -209 -133 73 -91 91 179
5807A79k76q2L90j17J2k7k14nK16q8Q5j70Q7Q5r0J28k01J06R5k44J50K18j42P
$$ 179 -97 -179 211 94 106 79 -135 -140 76 -12 73 -97 -10 75 -15 113 -88 18 113 -131 19 237 95 102
5831A02L4m8n17N92Nk10k04K17Q1k4r9q1J43j20Q8r5K82k32k53N84l10P4K3J2
$$ 102 136 88 -429 163 168 -42 -246 -29 52 28 -71 -152 -9 -129 -41 -136 146 -86 -339 245 -65 9 32 44
5855D4k85J50Q3k23L64j34k00R3J80k15N6K11m16M49j31P9m09M62k62J33n1k6
$$ 44 -241 -91 -8 -231 133 -1 -201 -108 72 -143 -87 124 -292 157 26 105 -304 158 -104 29 -22 -48
5877d8j80K88p9l11L49N1j57K6J95k67JP0m5J27l9p0r1L78m06J85Q2J8j95K97
$$ -48 -228 60 -19 -330 19 70 -87 -61 134 -133 -132 -62 -107 20 -19 -89 -180 198 -208 -23 59 77 -118 179
5901A79j09m20M93k40j38R1M6q2J37J67q4j72R0l4n0J27J98k39Q6j52k4K57j08
$$ 179 70 -350 143 -97 -235 -144 -98 -180 -43 124 40 -132 -42 -76 -126 1 199 -40 46 -106 -130 127 19
5924A9m9J01O3j53q8K26r0j02J48j54J9Qq9o6K47j28j09P8k03J30L23j2j77K82
$$ 19 -30 71 134 -19 -107 119 29 -73 75 -79 -60 -52 -141 -207 40 -88 -197 -119 -322 -192 131 119 -58 224
5948B24k28N1K2K12j6j10P8%l99J51L5M9k41K47L68m68L48o25M91q23P50Q6p7
$$ 224 -4 47 69 281 265 155 233 233 -166 -15 20 69 -172 75 443 -25 323 -302 189 -634 116 202 125
5971A25O0k84k4M03k04N55p50k37M16J99o03L31Q7l52k7L20k4l63N77m82pQ12
$$ 125 185 -99 -123 280 76 631 -119 -356 60 259 -344 -13 74 -278 -305 15 -9 -372 205 -277 -284 528
5993E28o35n9L1P6P8J10j51k96K63J44j21J12k5N3r3M2K4l28N92J4m36J36L3j7
$$ 528 -107 -166 -135 -59 19 129 -22 -318 -55 89 -32 80 55 108 15 57 81 -247 345 359 -77 59 92 75
6017G5Jj02J2mj3M4R1l2R7k00q2L33j04j34j82K27J56k14R7J20j79j47K12q8j20
$$ 75 76 -26 -14 -18 -31 13 104 72 169 -31 -113 220 116 -18 -200 27 183 -31 66 186 7 -140 72 -16 -136
6042a36j6L19k68k8K56j98l1m6J34K16j45m9k53K07p1j37M08k51q7K69N7k88K09
$$ -136 -152 167 -101 -129 127 -71 -102 -148 -14 202 57 8 -245 -38 -109 -246 162 -89 -176 93 150 -138 71
6065G1O5k34J27o4j28K83O7k61P9J28l84K51Mj74q3M03j74j61K10J02p2k1J75
$$ 71 136 -98 29 -35 -163 120 187 -74 5 133 -251 0 4 -170 -253 150 -24 -185 25 127 55 34 209
6088B09n51M59p3l6J14J51l49K54j32r3J63O9k51q3M50p5n50N01j93j19K80j2
$$ 209 -342 117 44 8 122 273 -76 178 46 -47 116 185 -66 -149 301 226 -324 177 -16 -135 145 133
6110A33m72J55J23R8m31J013r42j12O07k26k56K96j92l48L41r0K29o2L08k50Q6
$$ 133 -339 -184 -61 37 -394 619 -323 -435 172 -54 -310 -14 -206 -554 -213 -303 -74 -136 172 -78 8
6131Hj44p2j34N34j87L45l65L01n01N10k29q6Q4r7R7o4K11P4j91L09L67j15j061
$$ 8 -136 -208 -342 192 5 350 -15 286 -215 295 66 -20 64 -33 64 0 211 285 94 403 770 655 -406
6154d06p05J199N38j257M6N18K80R0j97j1k64J32m53L2O33o6L5J71j16j99l1j26
$$ -406 -1111 88 626 -631 -585 -67 213 303 106 95 -169 -37 -490 -458 175 109 144 315 199 0 -31 -157
6176a57K49q3Jq2L4J30P5k96J49p3j32J13J59p1K26j87P8R1K45m15l8N66p85L30
$$ -157 92 9 10 -72 -38 92 167 -129 20 -53 -185 -72 87 16 242 55 133 224 469 54 16 582 -203 127
6200A27K1j75M15p95O15L53l52j6K26k71l02N4K34Mk12J26J18k47N9J84k60M7
$$ 127 148 -27 388 -407 208 561 209 193 419 148 -154 -100 134 138 -74 52 170 -77 -18 166 -94 -47
6222d7N7J69k79J79l10L43k7j2j28J84q2Q5j05J04l44K92J70j28l64M19j50j29
$$ -47 10 179 -100 79 -231 112 85 73 -55 129 47 132 27 131 -213 79 249 121 -243 176 26 -103
6244a03L28j11k78K70P8k01j98M59l71j57M72l23J7K61j91J32J10k75J44R5k48
$$ -103 225 114 -164 106 184 -17 -215 244 -127 -284 188 -135 -118 143 -48 84 194 -81 63 158 -90
6265i0J3K21r3j29j9J45k08q6J54k55M48J15k05MK5j19R0J57l28R3J14k02j6L40
$$ -90 -77 144 51 -78 -97 48 -160 -246 -92 -347 101 216 11 15 40 -79 11 168 -160 -67 47 -155 -171 169
6289A69k81j6J09l05J57J41K99k63j23K15k67L45k7nk66K54j22pJ36r5k63K87
$$ 169 -112 -128 -19 -324 -167 -26 273 10 -113 102 -165 180 153 148 -118 136 14 7 143 48 -215 72
6311G2l3q2J62l29K11J19o5k86J68J2J06j58K99k77J97K4l41J9O8K03j22l1KN4
$$ 72 39 -43 119 -210 1 120 55 -231 -63 -51 55 -103 196 -81 116 140 -201 -182 -114 89 -33 -64 -62 -8
6335hJ67k00K64j48j9k4oJ66l49k01K96j18%L80q3r2J3l30L51r2J41k22K42jj59
$$ -8 159 -41 223 75 56 32 26 192 -157 -358 -62 -180 -180 200 117 25 38 -292 59 -33 108 -114 128 127 -32
6360c2R1R0j42j06M0j35n1R5K2K58j68rj26J66J53n5M7p2k23L43j77O9l1k1m81
$$ -32 59 149 7 -99 -59 -194 -245 -150 -128 130 -38 -47 -173 -7 146 91 138 66 -157 186 9 78 47 26 -455
6385d55K82K35OQ7k62L32j85P6Mo7o3J25n05N08p7l52J66J04Q6j41M99l80l3J58
$$ -455 -173 62 68 155 -107 225 40 116 120 53 -10 115 -390 118 41 -311 -145 -41 45 -96 403 23 -10 148
6409A48j64J46n9J11j60q4j18J69Q7pk63k2L03j16o4J86J70m01J43j74J95P0r5
$$ 148 -16 130 71 182 22 -62 -180 -11 76 69 -194 -216 87 -29 -93 93 263 -138 5 -169 26 96 1
6432Ap7M55l96l8j0K17k70J49q8l3k28J89J99p4K50j12Jl01J52O6J32oJ45m61
$$ 1 -76 379 -17 -55 -65 152 -118 31 -57 -90 -318 -129 70 -4 246 134 135 -166 -14 52 184 178 323 -138
6456a38J58K82k56l70K96P5L94o05j04N96n33R2j09O79o04J62J05k71K89r7j46
$$ -138 20 302 46 -324 -28 47 441 -164 -268 328 -205 -113 -222 457 -147 15 120 -151 138 41 -105
6477a05qP3K29l62J16J5k4K79l16q4M11m94J83J67q8j03M6J42k85o6J85j90K67
$$ -105 -113 -40 189 -173 -57 -42 -66 213 -103 -187 224 -270 -87 80 -8 -111 -65 77 -208 -274 -89 -279 -12
6500a2J68r5j85K06o3j53K90j77k25L19N6k12J15k3n1J61k98l8K79o6l70O48k05
$$ -12 156 61 -124 82 19 -134 156 -21 -246 73 129 -83 32 9 -42 119 -179 -217 62 -4 -374 274 69
6523F9m0j03M8J61j9j26m4m4M52k57k70R8L9j27K02K54q11N17M23m58Q8O8j22
$$ 69 29 -74 -26 135 116 -10 -54 -98 354 97 -173 -75 -36 -163 39 293 -518 -1 422 -36 52 120 -2
6546bk3J54q3k3J90j19j37j35K75n4j10n9K65l6N25m43J83m38k20K81j91J31Q4
$$ -2 -25 129 46 23 213 94 -43 -178 97 43 -67 -126 139 103 628 185 368 -70 -290 -9 -200 -69 15
6569A5K9n4J46n48N23m50K36M40j007N57M0Q9O72m74j41L9k92N26j43p17K08K1
$$ 15 44 -10 136 -412 111 -339 -103 337 -670 -113 -73 16 688 214 73 112 -180 346 203 -514 -306 -285
6591b85J17K26mk65K04j73m9J33p2M62k36j0j37L1KM15l06k07J78m4p9J31Q6j34
$$ -285 -168 58 54 -211 -7 -180 -229 -96 -168 294 58 48 -89 -58 -56 359 53 -154 24 -20 -99 32 118 -16
6615a6M4K07j61k99J97J9k88L59J44p3j31J40l46J97J87q0j41M3j69M2J74J0p2
$$ -16 28 235 74 -225 -28 -9 -297 62 206 133 2 142 -204 -7 180 100 -41 2 -167 -125 49 59 -13
6638a3k2q6K37k68p3K07j71J19l7J58m7m9J45j26o8k8K53k02PRJ75j65K49l10
$$ -13 -35 -121 116 -152 -225 -18 -189 -70 -107 51 4 -45 100 -26 -94 -122 131 -71 -64 -55 120 -45 204 -106
6662a06N0M39m03j30N9P4k7ko6j8R8kJ00PN6J9k26R7J8n8J99l58J16J03K5l48
$$ -106 -56 383 -20 -150 -91 -17 -44 -46 -112 -130 -32 -34 66 73 129 148 -78 19 37 -21 178 -180 -64 39 64 -284
6688b84K89L9j24J10k33N6J8J33K8l5n5l1J78ol22J69J94j40j5j24J02L28l78
$$ -284 5 44 -80 30 -203 -147 -129 4 32 -3 -58 -89 89 83 -239 -70 124 -16 -31 -155 -53 275 -103
6711a03K97k64nL2K31j74Q4k0p0r6J99j57L6q1r0J46O4j53L70l97J20Q9k04J78
$$ -103 194 -70 -75 -43 188 14 98 78 8 -88 111 -46 -10 -91 -181 -35 29 -124 246 -151 -31 58 -146 32
6735C2M8M3j25j4q4L24k31J05j04j6r1K65l06P6%K9K11p0k42kJ05k37n7L54L42
$$ 32 80 123 -2 -16 -100 224 -7 98 -6 -22 -113 152 -154 -78 -78 -49 162 92 -150 -152 -47 -284 -341 13 355
6760C55n79L60k32p8J78k88K21o8L50k52l4K11l11M20j0l69P5P9J24k2k18J78
$$ 355 -224 136 -96 -174 4 -284 -63 -131 219 -33 -67 144 -167 253 243 -126 -51 28 152 130 -88 90
6782I0J0j82j13J9J17n8n0J99M63o59M2J32j82K02Q3j48k26L49k45r5M03L7k76
$$ 90 100 -82 -195 -176 -59 -117 -167 32 495 -164 -122 10 -172 30 113 -35 -261 88 -157 -252 151 188 -88
6805h8J04j95K04J1N8K4j4k6l69L40O8n22J7N64q6M78m19P3l40N06k25k86J59
$$ -88 16 -179 25 36 94 118 104 78 -291 49 117 -405 -388 176 90 568 149 222 -118 388 163 -123 36
6828C6j9oJ8J76l56mL50k90L3L6o9J74K7m9J50m5j3k25l6N6p1J43J34k46p1K78
$$ 36 17 11 29 205 -151 -155 195 -95 -62 -26 -95 79 106 57 207 162 149 -76 -112 -56 -127 16 150 -96 -167 111
6854A11j02N4J61J19m18l3K19k12J01l4k41L29n8Q1j27L01k90N0Lq4j63K78j6
$$ 111 9 63 224 343 -75 -108 111 -101 0 -34 -275 54 -4 77 -50 251 -39 11 14 -70 -233 45 29
6877B9R4j13%k27K17J88j90J63l21l3K71j71J42k12K90j27p7L9J14L6j7O5k78
$$ 29 123 10 10 -217 0 188 -2 161 -160 -193 78 -93 49 -163 127 0 -77 -38 76 112 95 160 -118
6900a18K31q4q9J1J96j12J05j34q9J7Q1J7r5N1k0p2K06rj36R5k06K84p0j3q5J07
$$ -118 113 29 -60 -49 147 35 140 6 -83 -66 15 32 -63 -12 -32 -104 102 93 -43 52 -154 130 60 47 -38 69
6926F9p1Q3J10j26j28K40k5j5J1j28M2o8K05l33L6P8j6Q9J52j57l4j69M0L5L12
$$ 69 -2 81 191 65 -63 177 152 137 148 20 62 -6 199 -134 -98 -20 -36 53 205 48 14 -155 -115 -80 232
6951B32k29J6j83R5K35j47O5j5J21l29Q3J79j60J90l20L05j79N2J18j49j17K99
$$ 232 3 19 -164 -69 166 19 84 69 190 -139 -56 123 -37 153 -167 138 -41 11 129 -20 -137 162
6973A62j10Q0l0Nk62J78OjL2j05J82m8j98j09L19Q2k67J40j04L5M2K8N1o6j16
$$ 162 52 132 102 107 -155 23 29 28 60 -45 137 89 -109 -218 101 183 -84 56 -48 -13 29 57 108 42 -74
6998g4R9k20J65m3j43j97M16Q7k96K12k20K58K26j52l21L33j60q1j0j5K23q6K66
$$ -74 25 -195 -30 -73 -216 -413 3 90 -206 6 -214 44 270 118 -203 130 -30 -111 -121 -136 87 1 267
7021B67l45Q4O1O6k06j49j1O9K47J3k36K47k00L27l02N8j73J23J02L6k25K65l44
$$ 267 -78 6 67 133 -73 -222 -233 -164 83 96 -140 107 -93 234 -68 -10 -183 -60 42 78 -147 118 -226
7044b26R8K4J29N5k3k29J34OR1q2J35r0j26K9K66j56J6J3m9P6m7nj47N5J06j9
$$ -226 -128 -104 25 80 57 -172 -38 -32 59 -23 112 22 -104 -75 191 35 51 64 15 91 44 39 -108 -53 53 34
7070C4M4Nl29J63O8K15k43N06l97l8j64K38j33R3j16R3r1J02RJ5j42j32J10J88
$$ 34 78 83 -246 -83 -15 200 -43 463 66 28 -136 102 -31 62 -54 39 -52 50 59 74 -68 -200 -90 98
7094I8l0O3R7l63J53J6k71K07J7k52J11L58M9k60J98l60J09kM5J03q4J11l13M87
$$ 98 68 131 228 -135 18 34 -237 -30 -13 -265 -154 204 253 -7 191 -169 -60 -62 -17 86 2 113 -200 287
7118B87j21j88l2O9M4k00%l7k3O9K87r4R6m1q5j93K01j5J36j91k4J38j25M1m5
$$ 287 166 -22 -54 15 59 -141 -141 -178 -201 -132 155 61 157 116 31 -162 39 24 160 -31 -55 83 -42 -1 -46
7143d6j38J65q0K80l83K05j35l8R7p4K75l25L35R2k98L2q5j64K97Q7j0l09J43
$$ -46 -184 -19 -99 181 -202 3 -132 -170 -73 -147 128 -197 138 230 -68 -36 -121 -285 12 99 89 -220 -77
7166g7K52k32k3L03k50k1M1k6J3j5q8N2RK3KJ94l22J36J32k47n8J65M7J76p8J08
$$ -77 175 -57 -80 223 -27 -48 -7 -33 -20 -35 -123 -71 -62 -39 -37 157 -165 -29 103 -144 -202 -37 10 186 108 216
7192B16k28l0k3j7l5J23j27J23j54L57l50J93J21j55q1K58m12K14J68j94j20p3
$$ 216 -12 -42 -65 -82 -117 6 -121 2 -152 205 -145 48 169 14 -67 191 -221 -7 161 -33 -153 -226
7214b26K41r1J39l1m5m3K16j55j12J88j15m5J05k64L57J07l02j03K62j64P3J09
$$ -226 15 -76 63 32 -13 -56 160 5 -107 81 -34 -79 26 -238 119 226 -76 -179 83 -81 -8 101
7236A01P5l26J10l2J68j69J74k88K09j65j73K06J00j53o6L98l21L9L53k84j27
$$ 101 176 -150 -40 -72 96 -73 101 -187 22 -143 -316 -110 -10 -163 -229 169 -152 -113 240 -44 -171
7257a71K94k06K23oj07K23k91k5j0Q4M7R2k4j96n8K89j87j4l2M7Q0j0M7Ql32L19
$$ -171 123 -83 140 134 27 250 -41 -66 -76 8 55 147 123 -73 -131 158 -29 -43 -75 -28 52 42 89 97 -235 84
7283H4l18M14l62J11J35M1k87k9K01P8o3K13ok37L14m57K97k30J72j7r4J58j98
$$ 84 -234 180 -182 -71 64 105 -182 -211 -10 68 5 218 212 -25 289 -168 129 -101 71 54 -40 118 -80
7306h0J00lJ56j62Nj59J07J44J92m34P3J19M7j85K23q9j22J17j57J71j34r4j4
$$ -80 20 17 173 11 16 -143 -36 108 300 -134 -61 58 105 -80 143 54 -68 49 -108 63 -71 -165 -179
7329a79J94m3k0K18l95J97k09J84j2J03K33k29J41k31pR1j36m6K40j79Pm5N2l7
$$ -179 15 -28 -48 170 -225 -28 -237 -53 -65 38 271 42 183 -48 -55 36 -100 -146 94 -85 -78 -123 -71 -108
7353a08J43l6J73k36O8J57k32Q6M4l29J34K42R3k09M8j22j34J05R8j05L82l95
$$ -108 35 -1 172 -64 4 161 -71 15 59 -270 -136 106 199 -10 38 -84 -218 -113 -15 -120 262 -133
7375a33Mo1l8N0K83m8N8r1J74p5j7k33r0J55J41j65j03L77oj06q0K38m85J08K04
$$ -133 -129 -190 -228 -178 105 57 115 24 198 123 106 -127 -217 -62 79 -86 -189 188 182 76 -4 234 -251 -143 61
7400F1qj19j33J80j34OJ01m7K06j40k11O49n07K1K34r6p3L12j94L91m14l99J073
$$ 61 53 -66 -199 -19 -153 -147 -46 -93 113 -27 -238 411 -96 -75 159 63 -10 302 108 499 85 -314 759
7423G59l61q10K09K70K00m22j3J32L60j81j02O6jQ5k12r1m4L40m9r1J10k51n5
$$ 759 398 -412 -203 67 267 -155 -168 -36 324 143 41 107 106 191 -21 -112 -156 184 135 44 154 -97 -152
7446a52J26o9mJ72j34n9N8J10j43P4K5K22k12j2j57K41j37K30n7lk43NM3Q8j42
$$ -152 -26 -95 -99 73 -61 -120 -62 48 -95 -21 4 226 14 2 -155 86 -51 179 122 119 -124 -119 -76 12 -130
7471a30J40O2j27N7j09J51k0o0J6n0r4M2QL6K5M1J55l36K15J3p7m5K02j01l51
$$ -130 10 72 -55 2 -107 44 24 -36 -20 -70 -164 -122 -114 -78 -53 -12 143 -193 22 35 -42 -87 115 14 -337
7496c37M68L7m14K85P6p3j25j79M7J46J67l85M00m1l7l5K03k14K2p9M4R1Q1j85
$$ -337 131 168 -246 39 115 42 -83 -262 -215 -69 98 -287 113 72 35 0 203 -11 11 -68 -24 67 148 -37
7520c7L6M3n7j63J43K32k60L5J51n5k90M18J30n84L97j04M9R4k18K81k73p85K02
$$ -37 -1 42 -15 -178 -35 197 -63 -28 123 68 -222 196 326 -258 139 35 84 178 -40 241 -32 -817 -615
7543f15P93k57J13k17K60j6k40K40k47L66k78J30j90P5L65j99j72J60l20L14R8
$$ -615 178 -79 34 -183 77 61 -179 61 -186 180 -98 32 -158 -83 282 83 -89 71 -249 65 163
7564A63k48q3M69m54j03q8N01J36j35l0M20n69q0K22J27l36J76r0O9o4M5j47K00
$$ 163 -85 -168 301 -153 -256 -344 157 293 158 128 548 -21 -101 121 248 -88 88 -2 67 3 48 -99 101
7587A01o1Q6j64kK37j23J54j57J40j35j23n3K11k09L66j97j08k5k0qK38j55j01
$$ 101 40 126 -38 -40 197 74 228 71 211 76 -47 -100 111 -98 268 71 -37 -62 -82 -90 148 -7 -108
7610a08J45j16R2n4l1K49l40L29L1l31K28J0r3J73j80J9m5J38j43j21J3O1M2j87
$$ -108 37 -79 13 -41 -72 177 -163 166 197 -134 94 104 11 184 4 23 -22 116 -27 -148 -135 -74 -32 -219
7634b19L37n0p0lP2j32qJ51l6j05O3q5j51J54K54k29j18L45o6j04K9j00j20K85
$$ -219 118 68 -2 -5 67 -65 -73 78 42 -63 0 -85 -236 -82 172 -57 -175 170 104 0 29 -71 -191 94
7658I4k06j0J86k57J42J41k3K34m30M81l56l9O7o0J08J28q7J3o8M1N3j47j04j03
$$ 94 -112 -122 64 -193 -51 90 67 301 -129 352 -4 -43 24 -36 72 200 113 126 58 99 152 5 -99 -202
7682b02K25J05l17K03N8o1m6o5J86M5k02J95k40K40n8j30k56L28k51N0L24k15
$$ -202 23 128 -189 14 72 11 -35 -100 86 131 -71 124 -116 124 66 -64 -320 8 -243 -193 131 -84
7704h4n0J34k4J8J60p7M6k70L26k67L00l7j95J3J88n18N71k79p7K76k22J03r0
$$ -84 -134 0 -24 -6 154 77 123 -147 179 -88 212 175 -20 -7 181 -337 234 -45 -122 154 -68 35 -55
7727e5J6K13mr5l50L43O8j77J64Rj32l6n8L89j22k21J5J66p8J25l05O2Q2k8j6
$$ -55 -39 174 170 75 -275 68 136 -41 123 132 0 -36 -94 295 173 -48 -33 133 55 180 -125 -63 19 -9 -25
7752b5J04k28J11K0l1Rj4O8k68M77j20j51QJ31j19jN6j01j61J45J24o1q4Q6q3
$$ -25 79 -149 -38 -18 -49 -40 -54 14 -254 223 103 -48 -40 91 -28 -29 27 -74 -235 -90 34 -27 -111 -25 -108
7777a08J7J83k41J04J35j62J76k8k79K3L69j53m7k1m22O58k18J27l11L85l21J53
$$ -108 -91 92 -149 -45 90 -72 104 76 -203 -180 189 36 -11 -32 -454 204 -14 113 -198 187 -134 19
7799A9J5j78J81O3j5r7l1k7J64j02j28L10N6l1l82J14K05j95j51J82O9J05j64
$$ 19 34 -144 37 100 85 -12 -43 -70 94 -8 -136 174 230 199 -183 -69 136 -59 -210 -28 41 146 -18
7822a8j1J67j77P7J0j39J29j0J9k05K82r0OK48k73ll4k46L31k51j13L59n1jO3
$$ -18 -29 138 -39 38 48 -91 38 28 47 -158 124 34 40 288 15 12 -22 -268 63 -188 -301 58 7 6 69
7847F9n4P2j52j02p8M11j44Q3r4R3j01J30k58J37O0p9Q2j84jJ53n3j27J81k01
$$ 69 15 87 -65 -167 -245 166 22 105 11 104 3 133 -125 12 72 -7 75 -109 -110 43 -10 -137 44 -157
7871a57J41P1k00O0O7L8K1OQ3n2J45l77J63J01j51Mn0L2J53j95L09l96P4K31J11
$$ -157 -16 55 -145 -85 -18 20 41 47 130 78 223 -154 9 110 -41 -37 -87 -55 98 -97 212 -184 -110 121 232
7896B32l07k7K91n06L09p4Q5K64j82M6l48PJ17J15J34k96O5L70n29M08k37j59
$$ 232 -75 -102 189 -317 -8 -82 3 267 85 131 -217 -210 -93 22 156 -140 -75 295 -234 174 -63 -222
7918b22K38j81K72l2M1j74L7K25j04j74K30j5k09J51q8J5j39R9m4L25k17k02K37
$$ -222 16 -165 107 75 116 -58 -21 204 100 -74 156 141 -68 83 -5 10 -129 -30 -74 251 34 -168 69
7941F9k14K3Q2p5J3q6R8N6k32K71p5K18oj87M3r0J12j38J00N5p5R6M4k3n9n35
$$ 69 -145 -122 -40 -115 -102 -188 -90 -34 -266 5 -70 148 142 -45 -2 -92 20 -118 -18 37 -38 58 102 79 20 -515
7967e15O78k62K53K1N0k81J6k78J85L2j8M51j61k44K32j56N3m0J10K79n05K6K02
$$ -515 163 -99 154 175 225 -56 -40 -318 -133 -101 -119 332 171 -73 159 3 56 16 126 405 -100 -74 128
7990A28o9k30M20j62j12J46l61N69l45J68l58K33J4j43K54j96K89l21K86j86j19
$$ 128 59 -171 249 87 -25 121 -240 329 -16 152 -206 27 41 -102 152 -44 245 -76 210 24 -95
8011i5J53j02pj79J4M55k44J19j06R2j80K79l27J01n7j25K39n4k9k4J90r6J84
$$ -95 58 -44 -51 -230 -216 239 -5 114 8 100 -80 199 -128 -27 -84 -209 30 -24 -53 -77 113 17 201
8034B01l63K22K03l00K36o5j49JL2k02N3m5K99k90J35o5J26N8j63K15qr3L3j72
$$ 201 -162 60 263 -37 199 134 -15 -14 18 -184 -131 -176 123 -167 -32 -97 29 87 -76 139 131 38 71 -101
8058a01R2j6K8Q5k24Q7L2p0lL3J01q9J40l8k41K46J06l07L7N8m3j29J91J87l11
$$ -101 -9 -25 3 88 -136 -49 -17 -87 -90 -57 44 -45 95 57 -184 62 168 -139 -102 -44 -87 -216 -25 162 -149
8083a49K67j08M3o5J71m7O0j50p3o5J76J17j71J59j62r2K7j32K63j00pJ55k84
$$ -149 118 10 53 -12 159 112 172 22 -51 -116 60 177 6 165 3 -89 -62 -194 69 -31 -38 117 -167
8106a67jJ21L7n9J38k59L22j1q7O8o1n3J01l91M24l06N8j6K01j12O0j93J92O0
$$ -167 -168 -47 -10 -69 69 -190 132 121 34 102 41 -12 89 -302 122 -184 -126 -142 59 -53 7 -186 6 66
8130F6m5K5J42k58J86J44m26J51j10L1J41O1j86J7N6ql3J12J14J20l70Q9j07L60
$$ 66 21 46 188 -70 116 260 -166 -15 -125 -94 47 108 -78 -61 -5 -13 -46 66 180 300 -70 19 -88 272
8154B72m26K16m0K3m4k01J06j84K25J21j0k82K30M5J61N0l33O3Q5m1q1j08K04
$$ 272 -154 62 22 45 1 -200 -94 -278 -53 68 58 -224 6 51 212 262 -71 -8 77 36 -45 -153 51
8177E1J4k94K20J66j42j74K88j88J05j22R5k7O4j38
$$ 51 65 -229 -9 157 15 -159 129 -59 46 -76 19 -8 56 -82
8191h2
$$ Imaginary data points
##PAGE= N=2
##DATA TABLE= (X++(I..I)), XYDATA
0@%%%%%%%%qJ6j6J6k4L2m0N6p2Q8j05J29j58J90k24K64l13L67m28M97n74O61p60
$$ 0 0 0 0 0 0 0 0 0 -8 8 -8 8 -16 16 -24 32 -40 48 -57 72 -86 104 -120 144 -169 198 -230 267 -307 354 -406
31d06Q71r93J126j271J435j618J817k035K274k534K819l132L472l846M253m698
$$ -406 465 -528 598 -673 762 -856 961 -1074 1200 -1334 1485 -1647 1825 -2021 2232 -2466
47b466N186n718O300o940P646q424R287j0249J1327j2543J3927j5523J7381j9576
$$ -2466 2720 -2998 3302 -3638 4008 -4416 4871 -5378 5949 -6594 7333 -8190 9191 -10385
61a0385K2222k5478K9603l5034M2543n3703P2302j11069L38764m00103p520O35392
$$ -10385 11837 -13641 15962 -19072 23471 -30232 42070 -68999 269765 -130338 -137858 497534
73D97534m89959J6624K68992k14354j25430J17026k63180L8473L23371j19399
$$ 497534 7575 24199 293191 78837 -46593 70433 -192747 -154274 169097 49698
83D9698l40816J47206j7785j39892K05959J6868j55868O6523j43048p3860K48473
$$ 49698 -291118 -143912 -161697 -301589 -95630 -78762 -234630 -168107 -311155 -385015 -136542
94a36542j8248q5892J36252j33712j71574J65169K08687r0586o0856R9650q9352
$$ -136542 -154790 -240682 -104430 -238142 -409716 -244547 -35860 -126446 -187302 -87652 -177004
105a77004q4158J75743N5807R154Q6453j60159p2425J26966O3064J17564m5159
$$ -177004 -261162 -85419 -29612 -20458 65995 -94164 -166589 -39623 23441 141005 95846
116I5846j45506R5242K1849j10167J30627J19953q2251q3893n937r946Q36J70460
$$ 95846 -49660 45582 67431 -42736 87891 207844 125593 41700 35763 25817 26653 197113
128A97113J5714k24033J4088J25485j09197m6148J73125N2678j95538j14503J62704
$$ 197113 212827 -11206 2882 128367 19170 -26978 146147 198825 3287 -111216 51488
139E1488R068p6902J41082o0042j53305J00584j7809p2231J82734J2137j81551
$$ 51488 60556 -16346 124736 64694 -88611 11973 -5836 -78067 104667 116804 -64747
150f4747J232P4180k4521l563J12007k2077j25128J6945L4380K1632O1020n1892
$$ -64747 -63515 10665 -13856 -17419 94588 72511 -52617 -35672 -1292 20340 81360 29468
162B9468o692N9192j44295J582J92135l9632r3226N5345k8322r5168R6886J02450
$$ 29468 22776 81968 -62327 -60745 131390 91758 -1468 53877 25555 -69613 27273 129723
174A29723j15131l3684J07730j24237p0986J89424k0167r4932M9780n4699n9107
$$ 129723 14592 -19092 88638 -35599 -106585 82839 62672 -32260 17520 -37179 -96286
185i6286Q6281K8581m0479j4700r829j7151k9733L3060M5203O034n2761p4135
$$ -96286 -10005 18576 -21903 -36603 -46432 -63583 -93316 -60256 -15053 -9019 -61780 -135915
197a35915O7978M7813q3024N7075P5420j36315q870J00433m8689O822R1574m7848
$$ -135915 -67937 -20124 -103148 -46073 29347 -106968 -115838 -15405 -64094 -57272 34302 -13546
209a3546r9365P8215N6900q1500O4371Q8550j45038k4218J44200n2452k8719Q7996
$$ -13546 -112911 -34696 22204 -59296 5075 93625 -51413 -75631 68569 16117 -12602 75394
221G5394k0313n1437m591J8576N6135J6405n9087n933L3174k2370k3017P2777
$$ 75394 55081 3644 -947 17629 73764 90169 31082 25149 58323 35953 12936 85713
233H5713Q059q5258M4469j552p8564R3128N1915j24756J4294O5971q6406q180
$$ 85713 93772 8514 52983 51431 -27133 65995 117910 -6846 7448 73419 -12987 -21167
245b1167R6491j5230q9869L5664K2321p9503M8578P2814p6486l3580L6370k9155
$$ -21167 75324 60094 -29775 5889 28210 -51293 -2715 70099 -6387 -39967 -3597 -32752
257c2752J0758K7570q039N68l5402j8528L0158J8852r598P638j433m8369p107
$$ -32752 -21994 5576 -2463 -1895 -37297 -55825 -25667 -6815 -16413 -8775 -10208 -58577 -65684
270f5684P2930p472n4936O9432j8837r4850P3432N8592o8598J3035N1578p1176
$$ -65684 7246 -226 -55162 14270 -4567 -99417 -25985 32607 -35991 -22956 28622 -42554
282d2554l4311Q4506K2654o1426L2004J9591q1532L0027O0864k4195M618L708
$$ -42554 -76865 7641 30295 -31131 873 20464 -61068 -31041 29823 5628 10246 13954
294A3954m1600Q264K1058R303L0259k2675l5226R944J6188j4587K7283M8099o8199
$$ 13954 -27646 -19382 1676 10979 41238 18563 -16663 -6719 9469 -5118 22165 70264 2065
307B065m1712P2852j8582m2387J00421j2717j06204M9387L3627n4267L1986O2716
$$ 2065 -39647 33205 14623 -27764 72657 59940 -46264 3123 36750 -17517 14469 77185
319G7185o3150m9102M8460j776k4366N6847L203o8112J2388J471n147M5482r847
$$ 77185 14035 -35067 13393 11617 -12749 44098 47301 -20811 -8423 -6952 -12099 33383 23536
332B3536k2625P950m1300n526P0614q557l8185K4631j0752n9670M0224P3675o3456
$$ 23536 911 8861 -32439 -37965 32649 24092 -14093 10538 -214 -59884 -19660 54015 -9441
345i441j3960N7600p1371l4799J05560o364n6239M4694j6852n6683L4192N1243
$$ -9441 -23401 34199 -37172 -71971 33589 27225 -29014 15680 -1172 -57855 -23663 27580
357B7580j7949j4181J2082l6854j2257M4464R915l37O891n2652k72M0046k5139
$$ 27580 9631 -4550 7532 -29322 -41579 2885 12800 12463 19354 -33298 -33570 6476 -18663
370a8663K9660L6824o5411k8866M9487q303j3377N5995n83q0956Q932O1011m6160
$$ -18663 10997 47821 -17590 -46456 3031 -5272 -18649 37346 36763 -44193 -35261 25750 -20410
383b0410J3320P0747o5997m7700N7263m019k2374N0567R431n1632k2381L1538
$$ -20410 -7090 63657 -2340 -50040 7223 3204 -19170 31397 40828 -10804 -33185 -1647
395a647J1553k030K7750j7093k9971O43n82K5726K6159k5040l339r972l6541M4234
$$ -1647 9906 7876 35626 18533 -11438 -10795 -11377 14349 40508 15468 12129 2157 -34384 9850
409I850L4990l2569m556J5738l3248k6363N3441L2623m7041m854J9869n3135J4480
$$ 9850 44840 12271 7715 23453 -9795 -36158 17283 49906 2865 -1989 17880 -35255 -20775
422b0775O0636l0364j2406J3507l0641j3491L0682J7609n570j4433q094j4276
$$ -20775 39861 9497 -2909 10598 -20043 -33534 -2852 14757 9187 -5246 -13340 -27616
434b7616j257K6648P678J0462k8001m0896M1721J3462l4888M5300J5141p0720
$$ -27616 -28873 -2225 5453 15915 -12086 -52982 -11261 2201 -32687 12613 27754 -42966
446d2966P687L5511j5518J1007L3720l0612m7655M6246J7750m7952M6003M0973
$$ -42966 -35279 232 -15286 -4279 29441 -1171 -48826 -2580 15170 -32782 13221 54194
458E4194p9780j0608N1324j4107O129J9668j4719j9665m11J1279N563J0008P741
$$ 54194 -25586 -36194 15130 1023 7152 26820 12101 -7564 -7975 3304 8867 18875 26616
471B6616j7980j3766j479K01L9982l718l7782K3629j5530k7209N0300J0598m0704
$$ 26616 8636 -5130 -6609 -6408 33574 29856 -7926 15703 173 -27036 23264 33862 -6842
484f842J5855N326l6060O427M3083n382l5785K3968q108l7877M3073K0568l3505
$$ -6842 9013 14339 -21721 -15294 27789 22407 -13378 10590 2482 -35395 7678 28246 -5259
497e259R157l061k2187K0573L67O280J6930k8317j9254J8728J6958j3128L041
$$ -5259 3898 837 -21350 -777 -410 5870 22800 -5517 -24771 -6043 10915 -2213 828
510H28J8058k7235j5755L3936j9432j78N7799n2552m9299O4793J2648m5844J7266
$$ 828 18886 -8349 -24104 9832 -9600 -9778 48021 -4531 -53830 10963 23611 -22233 -4967
523d967L1002l2077k4631L0179O171k0937L1363q094m2294K7248R469j6885J8488
$$ -4967 26035 -6042 -30673 -494 5677 -15260 16103 8009 -34285 -7037 2432 -14453 4035
536D035L583j9653m592K540J3674N23l411L935j2495J108l015N632K8005k2922
$$ 4035 7618 -12035 -16627 -14087 -413 110 -3301 634 -11861 -10753 -13768 -8136 19869 -3053
550c053j9122L0823j6191j6741M4317p603k4937J5989k630j7408J9104L0708k9715
$$ -3053 -22175 8648 -7543 -24284 20033 12430 -12507 3482 852 -16556 2548 33256 3541
563C541k5433L7182M85k9243K3959P769q958P281k7554N976L2598j3817p078O906
$$ 3541 -21892 15290 15775 -13468 10491 18260 9302 16583 -10971 -4995 27603 13786 6708 13614
577A3614j3431K515J4184j2066j212K3065j1521m3527L3553L6169n5381R420M3642
$$ 13614 183 2698 16882 4816 3604 26669 15148 -28379 5174 41343 -14038 -4618 39024
590C9024m9939j2436M6589j9486q558K3762k2710j5871K2727O169k0133J3951
$$ 39024 -10915 -23351 23238 3752 -4806 18956 -3754 -19625 3102 9271 -10862 3089
602C089R238l3723N309K4546j5205K350O634j9422J6391n990k3096L6616R636
$$ 3089 12327 -21396 -16087 8459 -6746 -4396 2238 -17184 -793 -6783 -29879 6737 16373
615A6373l8414j06K3624j1344q484K3685l88l1661J6231J5451l0279J9953K2582
$$ 16373 -22041 -22147 1477 -9867 -18351 5334 4946 -26715 -10484 4967 -25312 -5359 17223
628A7223l1272l933J6294p683J333J3258k030j1460l087J0438l430L994J1745
$$ 17223 -14049 -17982 -1688 -9371 -8038 5220 3190 -8270 -11357 -919 -4349 -355 11390
641A1390j0696m752p00R36J5822l564j0977J7597j0221j8113K2601J0328j2482
$$ 11390 694 -4058 -4758 -3822 12000 8436 -2541 15056 4835 -13278 9323 19651 7169
654G169k348J0228j1175j3165K6395Q319k5736J1347N442k8505J9970J8926k2812
$$ 7169 4821 15049 3874 -9291 17104 25423 -313 11034 16476 -12029 7941 26867 4055
667D055l05J2495j2174j2936J5198J3239j0324r407M68k806N236Q88l885J2952
$$ 4055 3750 16245 4071 -8865 6333 19572 9248 -159 309 -2497 2739 3627 -258 12694
681A2694j4462j4983J7924j935q281J8971o024k4553J0977J1395j2024J436K0460
$$ 12694 -1768 -16751 1173 -762 -9043 9928 3904 -20649 -9672 1723 -10301 -8865 11595
694A1595j7130k1979K5964m48j7081K6030J250l3254J1876J4321j1481O524P989
$$ 11595 -5535 -27514 -1550 -1998 -19079 6951 8201 -25053 -13177 1144 -10337 -3813 4176
707D176p814r348M756K081M093Q808p944n696N903r680M042K4684j8475r976K2020
$$ 4176 -3638 -12986 -8230 -6149 -2056 6752 -1192 -6888 -985 -10665 -6623 18061 -414 -10390 11630
722A1630j6315j2280K8971L423k2885R930N689k1906Q819K6942j7891j3843K2954
$$ 11630 -4685 -16965 12006 15429 -7456 2474 8163 -13743 -4924 22018 4127 -9716 13238
735A3238j4388j4261K5938K060j2513N239n978o876J1782J443n0J725o552q137
$$ 13238 -1150 -15411 10527 12587 74 5313 -665 -7541 4241 5684 5634 7359 807 -7330
749g330Q037O084q609J1888K445k5287O846J9962j8759M820K0660k3919j0389
$$ -7330 707 6791 -1818 10070 12515 -12772 -5926 14036 -4723 97 20757 -3162 -13551
762a3551K0361j713j1462J6615L808k4246J225J7427q023k094J4600j3054q321
$$ -13551 6810 5097 -6365 10250 14058 -10188 -8963 8464 441 -1653 12947 -107 -8428
775h428P632j452N254L448o325j578k391n102R681O554p217m733M658l949r596
$$ -8428 -796 -2248 3006 6454 129 -1449 -3840 -8942 739 7293 76 -4657 1 -3948 -13544
790a3544J8777M902k0367P172P683j9426P022K0945j3913q058J0773m328j0843
$$ -13544 5233 10135 -10232 -3060 4623 -14803 -7781 13164 -749 -8807 1966 -2362 -13205
803a3205J3135J1779j6818J42Q146j2048J631J5773p052k310J626q651N498N674
$$ -13205 -70 11709 -5109 -4967 3179 -8869 -7238 8535 1483 -827 799 -7852 -2354 3320
817C320k834K976J985j1014j547J2748k384o919J3089l487k2245J8382R999k1573
$$ 3320 486 3462 5447 -5567 -7114 5634 3250 -3669 9420 5933 -16312 2070 12069 -9504
831i504J3172J2107k5304q62K1785j0018p288J6433l784j9788J1261J2355j5049
$$ -9504 3668 15775 -9529 -10391 11394 1376 -5912 10521 6737 -13051 -1790 10565 -4484
844d484O536P876j5507R24P402m909P310Q81j1257N816n44n824R033N577j1974
$$ -4484 2052 9928 -5579 -4655 2747 -2162 5148 6029 -5228 588 44 -5780 3253 8830 -3144
859c144j493J0436j0756l054K0532p658j7984J8754k069j8039J9650N144j7716
$$ -3144 -4637 5799 -4957 -8011 12521 4863 -13121 5633 3564 -14475 5175 10319 -7397
872g397M573P284j1045J684J1352m342o351M276k454m407J1101k772m078P212
$$ -7397 -2824 4460 -6585 -4901 6451 2109 -4242 34 -2420 -6827 4274 1502 -2576 4636
886D636j1698m02J5994j0205n478J7422j1379j2235J7139L287j3891P097J0798
$$ 4636 -7062 -7464 8530 -1675 -7153 10269 -1110 -13345 3794 7081 -6810 287 11085
899A1085j9641l06K1657j2397r153K1452r084j6841J8369K326r726M695K911n929
$$ 11085 -8556 -8862 12795 398 -8755 12697 3613 -13228 5141 7467 -2259 2436 5347 -582
913e82j439N312o07m66L585n062m122P342l418N71P557j1246j53Q059q597J352
$$ -582 -2021 3291 2684 2218 5803 741 -3381 3961 543 1114 8671 -2575 -2728 5331 -3266 -1914
929a914J1721r411q232J0095J977j1315L739J4747j4840p831J6399o972o472J4060
$$ -1914 9807 396 -7836 2259 4236 -7079 -3340 11407 -3433 -11264 5135 -1837 -8309 5751
943E751m408j0772P867N47m167K957M172l338o596N866J13j447M152l832O55M321
$$ 5751 1343 -9429 -1562 -1015 -5182 -2225 1947 -1391 -7987 -2121 -2008 -3455 697 -3135 -2480 1841
959A841j1231M996J3455j3616P64R470j1802n89J5347m830j2124J1882L889j6195
$$ 1841 -9390 -4394 9061 -4555 -3791 5679 -6123 -6712 8635 3805 -8319 3563 7452 -8743
973h743O714J6460j7571p66J7018j6830k437J7274p086n437Q226n540m025O844
$$ -8743 -2029 14431 -3140 -3906 13112 -3718 -6155 11119 4033 -1404 6822 1282 -2743 4101
987D101J590l609O96J208o785N979K126r508J1221J952j9118J0694J0259j8724
$$ 4101 5691 2082 2778 3986 -2799 3180 5306 -4202 7019 8971 -10147 547 10806 -7918
1001g918Q629J1002j7156k191J3541n071p888J3194k540j5874J1180Q020j5932
$$ -7918 711 11713 -5443 -7634 5907 836 -7052 6142 3602 -12272 -1092 6928 -9004
1014i004N556J0726j3037J256L592n501P137K503q094K149J468l933L433M730
$$ -9004 -3448 7278 -5759 -4503 -911 -6412 725 3228 -4866 -2717 -1249 -5182 -1749 2981
1028B981m364m038P920n410o429J7431m805j4080J5745j91j6915J2950R837j3199
$$ 2981 -1383 -5421 2499 -2911 -9340 8091 3286 -10794 4951 4760 -12155 795 10632 -2567
1042b567p28P603m528n301J1594k70j0436P896R84j0225Q839M736r424M051o6
$$ -2567 -3295 4308 -220 -5521 6073 5803 -4633 3263 4247 -5978 2861 7597 -1827 2224 2158
1057B158l574L227j518J474M221l981p941M283Q556o722m057J1013o718r140J4687
$$ 2158 -1416 1811 293 1767 5988 2007 -5934 -1651 6905 183 -3874 7139 421 -8719 5968
1072E968l657r348J3806k426j4525Q337Q347j0335L66R855o645r625J2343P92
$$ 5968 2311 -7037 6769 4343 -10182 -1845 6502 -3833 -3467 6388 -257 -9882 2461 3253
1086C253q684R410k365q168P895n19n005Q166k163n738N241k314k574O487K700
$$ 3253 -5431 3979 1614 -6554 1341 822 -4183 3983 1820 -3918 1323 -991 -3565 2922 5622
1101E622r952K574P962j2405K188J6406j3517q633J8108p982r689J5743j312j0747
$$ 5622 -4330 -1756 6206 -6199 -4011 12395 -1122 -9755 8353 371 -9318 6425 5113 -5634
1115e634O271L538j1038M555J0604q853m749Q960n514k536R345n899n16N265q867
$$ -5634 637 4175 -6863 -2308 8296 -557 -5306 3654 -1860 -4396 4949 -950 -1466 3799 -5068
1130e068J338Q580o813j060Q690p498n619J0346R52j0001P945N278j6345N987
$$ -5068 -3730 4850 -1963 -3023 5667 -1831 -7450 2896 3848 -6153 1792 7070 -9275 -3288
1144c288J2363j2940L20J2855j1959m351J2407l511n192O197J107p885K667M662
$$ -3288 9075 -3865 -3545 9310 -2649 -7000 5407 1896 -3296 2901 4008 -3877 -1210 3452
1158C452m574L058K266o848K032K970n631O518J927j0033N593L568q778K551R280
$$ 3452 -1122 1936 4202 -2646 -614 2356 -3275 3243 5170 -4863 730 4298 -4480 -1929 7351
1173G351p434n300Q665j510q525R461M052j3606N816O069j0964L159R491p783
$$ 7351 -83 -5383 3282 1772 -6753 2708 6760 -6846 -1030 5039 -5925 -2766 6725 -1058
1187a058m474P545k559l271M616J795n669K131J952m943M324J672m820M355r19
$$ -1058 -5532 2013 -546 -3817 799 2594 -3075 -944 1008 -3935 389 2061 -2759 1596 677
1202F77o805P654K319q249N200L446q010J10R700n333n790J0873k805j1180J0807
$$ 677 -6128 1526 3845 -4404 796 4242 -3768 -3658 6042 709 -5081 5792 2987 -8193 2614
1217B614M744j2578O368N855j1046J966P548n015j750N908l944l431N371l50l377
$$ 2614 7358 -5220 1148 7003 -4043 -2077 5471 456 -1294 4614 670 -2761 2610 2260 -1117
1232a117N025k616n165P736l175m520R285l253q595R171M43r804Q200M690j1581
$$ -1117 3908 1292 -3873 3863 688 -3832 5453 2200 -6395 2776 3219 -6585 1615 6305 -5276
1247e276J122J0169q793l867J3294o448q724J1146j211r229R934J071r620N169
$$ -5276 -4154 6015 -2778 -6645 6649 201 -8523 2623 1412 -7817 2117 3188 -6432 -1263
1261a263K201n177K791L202m590M39L281n421K708N539o916k52Q411q770j390
$$ -1263 938 -4239 -1448 1754 -2836 -2397 884 -4537 -1829 3710 -3206 -3458 4953 -3817 -5207
1276e207J1357o688m729J0083l054q411R212K561q532K479P008q900o4J0250o736
$$ -5207 6150 -538 -5267 4816 1762 -6649 2563 5124 -3408 -929 6079 -2821 -2885 7365 629
1291F29l522P124k808m429O852j101l564M229k149j720K032K09j247K134l92n225
$$ 629 -2893 4231 1423 -3006 3846 2745 -819 3410 1261 -459 1573 1782 535 2669 2277 -2948
1307b948M216K981o877L310N531r479N44Q530o989j945P978l531o471O311K107
$$ -2948 1268 4249 -2628 682 6213 -3266 -2722 5808 -1181 -3126 4852 1321 -5150 1161 3268
1322C268p505L654N373p566j452P739n174r18N871m498j790L796k333k51L531
$$ 3268 -4237 -583 4790 -2776 -4228 3511 -1663 -2581 3290 -1208 -2998 798 -1535 -1786 1745
1337A745k672j819L657k027k688M727J116o828M869L242r691N301O551r714K75
$$ 1745 -927 -2746 911 -1116 -3804 923 2039 -4789 80 3322 -6369 -1068 5483 -4231 -3956
1352c956Q754p960j953Q953k882o612O611J872q744N207M780p603J305N790o836
$$ -3956 4798 -3162 -5115 3838 956 -5656 955 2827 -5917 -710 4070 -3533 -2228 3562 -3274
1367c274J028N616n045J334K880n116J007N638m463m93N146m125k762O882j545
$$ -3274 -2246 3370 -1675 -341 2539 -2577 -1570 4068 -395 -888 4258 133 -2629 4253 2708
1382B708o578Q338J407j1839P493M664r906M453N904q213L46O439l749k629N226
$$ 2708 -3870 4468 5875 -5964 1529 6193 -3713 740 6644 -1569 -1223 5216 1467 -1162 4064
1397D064j507o067O205O2l895K718O70m299L540o55l871N139q08n454M623Q71
$$ 4064 2557 -3510 2695 2757 -1138 1580 2250 -2049 1491 836 -3035 2104 1296 -4158 465 1336
1413A336n873L865M045o388j209P215n456l355Q889j842q799Q362P02o761M246
$$ 1336 -4537 -672 3373 -3015 -4224 2991 -2465 -5820 3069 1227 -7572 790 1492 -5269 -1023
1428a023M205o109N66K862k052j049M041r31k614K499j080j702M673j650j803
$$ -1023 3182 -2927 -2361 501 -1551 -2600 1441 510 -2104 395 -685 -2387 2286 636 -1167
1443a167L747l063k411O559k722l000N027n04n526L039M123n213q72O118l496
$$ -1167 2580 -483 -2894 3665 943 -2057 2970 2466 -3060 -21 4102 -1111 -1983 4135 639
1458F39m356P372j773n638O865o52o166L572K222k734J71K070k940p58L069n25
$$ 639 -3717 3655 1882 -3756 3109 2457 -3709 -137 2085 -649 -478 1592 -1348 -2106 963 438
1474D38k312L260j932j825M619l634o81N180l448k876N867k287l709N820N86n980
$$ 438 -1874 1386 -546 -2371 2248 -1386 -2067 3113 -335 -3211 2656 369 -3340 2480 3066 -2914
1490b914J840N186n788n60P675n560l223P876l567m155O964j650m086L879m86
$$ -2914 -1074 4112 -1676 -2236 5439 -121 -3344 4532 965 -3190 3774 2124 -1962 1917 1431
1505A431k718J964K252l416R09R41l089J917L170n682J194N018o901M94O284n649
$$ 1431 -1287 677 2929 -487 422 1363 -1726 191 3361 -2321 -1127 3891 -3010 -2516 3768 -1881
1521a881p08N451m166l097O072l85n681L895L416p078J522O803o511j57N029l309
$$ -1881 -2589 2862 -1304 -4401 1671 1286 -4395 -500 2916 -4162 -2640 4163 -2348 -2505 2524 -785
1537g85j382L704l030l84L282k275n23J890o98j361L502q68m010M377P46m871
$$ -785 -2167 1537 -1493 -1877 1405 -870 -1393 497 -201 -1562 1940 1072 -2938 1439 2185 -2686
1553b686M535J916p151L567M245o327J172M452l154k602M648j365l099L969J003
$$ -2686 1849 3765 -3386 181 4426 -1901 -729 3723 569 -2033 2615 1250 -1849 2120 3123
1568C123n174K058L046m659J857K236l192O08J302k142J260P71j982P64J020j756
$$ 3123 -2051 7 3053 -1606 251 2487 -705 -97 1205 -937 323 1094 -888 -124 896 -860
1584h60n63L174j327l070L904p22l794M346J088n422K872K506m781J098L719k434
$$ -860 -1423 1751 424 -2646 1258 536 -3258 1088 2176 -3246 -374 2132 -2649 -1551 2168 -266
1600b66k277L840k74m116L514J242l492K035J219l871K441J307k583J529P22k216
$$ -266 -2543 1297 1023 -3093 421 1663 -1829 206 1425 -2446 -5 1302 -1281 248 970 -1246
1616a246J320J156k713J058K680l307r53M578k311k994N976k374m463N404L23
$$ -1246 74 1230 -1483 -425 2255 -1052 -2005 2573 262 -2732 3244 870 -3593 1811 2134
1631B134m913L443K483n577J382M033l296j535M602k403k639M345j448k312L795
$$ 2134 -2779 664 3147 -2430 -1048 2985 -311 -1846 2756 353 -2286 2059 611 -1701 2094
1646B094j316k710L403j289j919L940j230k662K528R90l999K461K800n102Q26
$$ 2094 778 -1932 1471 182 -1737 2203 973 -1689 839 1829 -2170 291 3091 -2011 -1185
1661a185M178m106j267N966l722k784N118j296l701L521Q66l478J522J681k700
$$ -1185 2993 -1113 -2380 3586 -136 -2920 2198 902 -2799 722 1588 -1890 -368 1313 -1387
1676a387N30K385k460k38K579k944N24K511k762M31K284k694m08L161j945j154
$$ -1387 -857 1528 -932 -1170 1409 -1535 -1011 1500 -1262 -831 1453 -1241 -1649 1512 -433 -1587
1692a587K761r15k651K380K163m581K222K718m190N0L897k794j031L428j774j859
$$ -1587 1174 259 -2392 -12 2151 -2430 -208 2510 -1680 -1630 2267 -527 -1558 1870 96 -1763
1708a763K430N15k230Q04J477k143O05J104j532O87J353k914J744J142k611J459
$$ -1763 667 1182 -1048 -244 1233 -910 -305 799 -733 -46 1307 -1607 137 1279 -1332 127
1724A27J755k550k16K698j928j410L052K5l320K527J613m310J958K971l840R5
$$ 127 1882 -668 -884 1814 -114 -1524 1528 1553 -1767 760 2373 -1937 21 2992 -848 -753
1740g53L027k308j105L076j504r47J464qj798J485J020k503J472M18k326J947
$$ -753 2274 -34 -1139 1937 433 -514 950 942 -856 629 1649 -854 618 1036 -1290 657
1756F57O00k644K003P87l746K341K121l284r5L260k719j949M337j136l189L473
$$ 657 1257 -1387 616 1403 -2343 -2 2119 -1165 -1260 2000 -719 -2668 1669 533 -2656 817
1772H17L38m087K823J875m316J962J676k614K16K236j570m79J621j330l00J631
$$ 817 1155 -2932 -109 1766 -2550 -588 1088 -1526 -1310 926 -644 -1123 498 -832 -1132 499
1788D99p47j297L047j575k028L595j333k317L761l24l609L097P51l206J200K969
$$ 499 -248 -1545 1502 -73 -2101 1494 161 -2156 1605 1281 -2328 769 1520 -1686 -486 2483
1804B483l117r41L636j839j885L320n23k597K585J1k280K120K09j732J096K49
$$ 2483 -634 -1575 2061 222 -1663 1657 1134 -1463 1122 1133 -1147 973 1182 -550 546 795
1820G95j212J097M03j606O66J116k024K13K380k310p21L435k002j977L296q20
$$ 795 -417 680 1083 -523 143 1259 -765 -552 1828 -482 -1203 2232 230 -1747 1549 729
1836G29k384K385N14k794J419J702k192n66K728j594j394K449o47j728K046o17
$$ 729 -1655 730 1244 -1550 -131 1571 -621 -1187 1541 -53 -1447 1002 355 -1373 673 56
1852E6j201J480m04n38R56l00r20R13N48j712J062R98k159L97K359k698o39L504
$$ 56 -1145 335 -69 -607 349 49 -871 42 590 -1122 -60 938 -1221 -824 1535 -1163 -1802 1702
1870A702k224j378L159q95k399K496O57k780J124J939k185n86K828j938q92K938
$$ 1702 -522 -1900 1259 364 -2035 461 1118 -1662 -538 1401 -784 -1370 1458 -480 -1372 1566
1886A566j892p61K119r55n80J614j041m32J561p56r90J609Lj972J825J088l337
$$ 1566 -326 -1087 1032 77 -503 1111 70 -362 1199 443 -547 1062 1065 -907 918 2006 -1331
1903a331J457K503l545P9L472l056o04L171j777j713K765k00k134J440P22k128
$$ -1331 126 2629 -916 -837 2635 -421 -1025 2146 369 -1344 1421 1221 -913 527 1249 -879
1919h79P61J389j953L85J672k571J160R94k369J103J575k563K23K307k064k20
$$ -879 -118 1271 -682 -297 1375 -1196 -36 958 -1411 -308 1267 -1296 -1073 1234 -830 -1050
1935a050K151j611j733K706M11l180K277J350l209J319K078l052M85K270j902
$$ -1050 1101 -510 -2243 463 874 -2306 -29 1321 -1888 -569 1509 -1543 -1058 1212 -690
1950f90j72J311m75r88J457j47j198Q19M94j304J213M52k149K018K64k114J644
$$ -690 -862 449 -26 -1014 443 296 -902 -83 411 -893 320 772 -1377 641 905 -1209 435
1967D35N74j832R40J150j919P5J707n99j906K415P9k694K206P07k520R16J494
$$ 435 1009 -823 117 1267 -652 -577 1130 531 -1375 1040 1119 -1575 631 1338 -1182 -266 1228
1984A228j672Q1J409r33m49J090n62o64R42J93r93O80m7j037J436R6j808J642
$$ 1228 -444 -363 1046 113 -336 754 192 -472 470 663 -330 350 303 -734 702 798 -1010 632
2002F32O4j923J644O21k110Q04J793k120m91K366q84j850K289k73k479K377O94
$$ 632 696 -1227 417 1038 -1072 -268 1525 -595 -1086 1280 396 -1454 835 562 -1917 460 1154
2019A154k521J229J088j902N09J018j191J8R73p09k28J103j253M1J756j128p81
$$ 1154 -1367 -138 950 -952 -443 575 -616 -598 375 -334 -562 541 -712 -671 1085 -43 -824
2036h24J870p27j734K717r24j911K659J94l035J357J835k487K22K464j495j583
$$ -824 1046 319 -1415 1302 378 -1533 1126 1320 -1715 -358 1477 -1010 -788 1676 181 -1402
2052a402L041r21k048J963L26k055J854j77r41J044j93r71N77M76j307R25M94
$$ -1402 1639 718 -1330 633 959 -1096 758 581 -360 684 491 -480 97 573 -734 191 685
2069F85j703P07J667k184K88K008k300k85K466j163j623K070j29j938J602R90
$$ 685 -1018 -311 1356 -828 -540 1468 -832 -1117 1349 186 -1437 633 504 -1434 168 1158
2085A158k106P29J445k102L67J283r04m78J655j270l62J306p91j95P36k70q41
$$ 1158 -948 -219 1226 -876 -509 774 -130 -608 1047 -223 -585 721 -70 -265 471 201 -640
2102f40J065J04j296J228L62j689R93R11j805K07J880j882l02J772r35j383K268
$$ -640 425 529 -767 461 823 -866 127 1038 -767 -560 1320 -562 -864 908 -27 -1410 858
2119H58k07j778R80Q51j462j35J763j545N39J085r17n01J156j162n94K009m96
$$ 858 651 -1127 -147 704 -758 -893 870 -675 -136 949 32 -469 687 -475 -1069 940 444
2136D44j153J176J30j535J895o09j574J982L37k033J066J263k802J065K139k203
$$ 444 -709 467 597 -938 957 348 -1226 756 1093 -940 126 1389 -1413 -348 1791 -412
2152d12j99K230j231j486K118k35j967K265j83j934J590M95j750J048P36j792
$$ -412 -611 1619 388 -1098 1020 785 -1182 1083 900 -1034 556 1051 -699 349 1085 -707
2168g07R56N11j408L54J197j498p6J696j685n51K182j059j594K383m54j952K366
$$ -707 249 760 -648 -294 903 -595 -671 1025 -660 -1211 971 -88 -1682 701 247 -1705 661
2185F61J47k646J551J393k263N75J441j539n58J923p74j023J971j139o67J512
$$ 661 808 -1838 -287 1106 -1157 -582 859 -680 -1238 685 -89 -1112 859 -280 -947 565
2201E65o11q85J409j70j042J466l35j099J217L59j590P04J450k161J61K221j910
$$ 565 -46 -931 478 308 -734 732 397 -702 515 874 -716 -12 1438 -723 -562 1659 -251
2218b51p94K365j071j335K172n41j503J333L92j397L88Q37j074J08J077n74n44
$$ -251 -1045 1320 249 -1086 1086 545 -958 375 767 -630 -242 595 -479 -371 706 132 -412
2235d12J177p51k44Q25r71j99J246o04o24J003l07p62R36L89j587P47J329j934
$$ -412 765 14 -230 595 -376 -575 671 67 -557 446 139 -623 313 702 -885 -138 1191 -743
2253g43n0J785j528m36J963o81j573J897q9j513J070L89j239N83R29j273RJ182
$$ -743 -793 992 -536 -972 991 310 -1263 634 545 -968 102 491 -748 -165 764 -509 -500 682
2271F82j347L1J334j263J0J278j378j47J641r25j031J844n10j460J905R8j967
$$ 682 -665 -634 700 -563 -553 725 -653 -800 841 -84 -1115 729 219 -1241 664 762 -1205
2288a205R40J681k594Q56J638k159Q5J941j485o95J741o99r49J476j60j255J175
$$ -1205 -265 1416 -1178 -322 1316 -843 -758 1183 -302 -997 744 45 -904 572 412 -843 332
2305C32J48j319J205N19j709J044O96j638P57J142j923O49J339j784k2J735j042
$$ 332 480 -839 366 885 -824 220 916 -722 35 1177 -746 -97 1242 -542 -564 1171 129
2322A29j375K313o00j503J544O80j875P27J200j892L10J615j549m9J166j017j84
$$ 129 -1246 1067 467 -1036 508 1188 -687 40 1240 -652 -342 1273 -276 -325 841 -176 -360
2339c60R89o84l38Q59l76p53J336m63j140J460j36j436J424R25k491J335J142
$$ -360 629 -55 -393 466 90 -663 673 210 -930 530 394 -1042 382 1307 -1184 151 1293
2356A293k261O61J208n96r75J136k54j375J868K64j872J228M35j636J248J73j022
$$ 1293 -968 -307 901 305 -670 466 212 -1163 705 969 -903 325 760 -876 372 545 -477
2373d77K54Q17k44J2j39o3l86J006j268P5O85m48n12J908o51p57J147J76k314
$$ -477 -223 594 350 362 223 160 -226 780 -488 -413 272 -176 -688 1220 569 -188 959 1135 -1179
2392a179J860j68j038M78R15q52q34J447m03j146J518j21j242R06N55j628J124
$$ -1179 681 513 -525 -47 868 16 -818 629 226 -920 598 477 -765 141 696 -932 192
2409A92M98j677J014M69j025N31Q70j411L78J378j476l09J749j208j073K009o4
$$ 192 690 -987 27 496 -529 2 872 -539 -161 1217 -259 -568 1181 -27 -1100 909 845
2426H45j895J498K55j605J453L63j297M08Q29j330j97J512r66l27J891j027j323
$$ 845 -1050 448 703 -902 551 914 -383 25 854 -476 -673 839 -127 -454 1437 410 -913
2443i13J760n30j400J997j286q9J506q88q71J144J38j378J050P49j806M89J298
$$ -913 847 317 -1083 914 -372 -461 1045 157 -714 430 568 -810 240 989 -817 -328 970
2460I70j182p88J855r01j050K005o23j197J341k6j433J259K07j160L89J270j336
$$ 970 -212 -1000 855 -46 -1096 909 286 -911 430 404 -1029 230 437 -723 -334 936 -400
2477d00J5Q12p66K96O66j031l7J722j314o18J392p68n38J396m01j382J043J015
$$ -400 -385 427 -339 -43 623 -408 -445 1277 -37 -655 737 -31 -569 827 426 -956 87 1102
2495A102k064M27J030o17j053K115j406rJ696j099o26R96j01p42L40K73n61M30
$$ 1102 -962 -535 495 -122 -1175 940 -466 -475 1221 122 -504 492 391 -351 -11 262 -299 131
2513A31O96j347K99P97j086K79P35j035K90Q74q09k33J148j025n92J290M2j239
$$ 131 827 -520 -221 576 -510 -231 504 -531 -241 633 -176 -409 739 -286 -878 412 454 -785
2531g85Q99O94j675N03J141j476L99J072j130k48J385j035l59J081m29o90R72
$$ -785 114 808 -867 -364 777 -699 -300 772 -358 -606 779 -256 -615 466 37 -653 319
2548C19q5j060J289k95r03J065P3j168Q39P19j340M28P92j201j69J516j114m54
$$ 319 234 -826 463 168 -735 330 403 -765 74 793 -547 -119 673 -528 -697 819 -295 -749
2566g49J519n83j098J561l26j187J112M30j514O53R96j384K44J110j105k21R15
$$ -749 770 187 -911 650 324 -863 249 679 -835 -182 814 -570 -326 784 -321 -542 373
2583C73o35j8P38o05m92J430r02n40J565o37j015J296J56j439R95N30j524O42
$$ 373 -262 -280 458 -147 -639 791 -111 -651 914 277 -738 558 714 -725 270 800 -724 -82
2601h2J092j438J47J293j132l73J155r3j427J092j42n33O88j73r58J156k9r96
$$ -82 1010 -428 -281 1012 -120 -493 662 569 -858 234 92 -441 247 74 -884 272 243 -753
2619g53M40M08m08K3M56m95J37Q17j082N66O39j50o17P6k82m93O59J74r59K80
$$ -753 -313 95 -313 -290 166 -329 -192 625 -457 109 748 598 -19 57 -225 -718 -59 115 -844 -564
2639e64J496j577qJ590r41m79J156o69m55N36K50q06N41K42q11N24K72p40N70
$$ -564 932 -645 -653 937 -4 -483 673 4 -451 85 335 -471 70 312 -499 25 297 -443 127
2658A27N96j089L39N27q80J91R90p96k65J165j050n92J382k24j048J017J83j123
$$ 127 723 -366 -27 500 -380 -189 801 5 -260 905 -145 -737 645 421 -627 390 573 -550
2676e50P54P27j246K67P85j149P5Q85q63J79P66q54J22O51n57n55R85j58r33Q96
$$ -550 204 931 -315 -48 737 -412 -337 548 -315 -136 630 -224 -102 549 -8 -563 422 264 -669 227
2696B27Q9j121J161J92j190O97O40j359K12J421j375j74J136n53o76J178k34j270
$$ 227 316 -805 356 548 -642 55 695 -664 -452 969 -406 -580 556 3 -673 505 271 -999
2714i99J306N4j127R42L06q67j9M48r57J069K4q47Q22J84m52m69J370j276M47
$$ -999 307 361 -766 176 482 -385 -404 44 -913 156 180 -667 155 339 -113 -582 788 -488 -41
2733d1M58Q0j033L76N78j304J177k81r83N67J837k085Q25p9j4K88M19l79m17P37
$$ -41 417 497 -536 -160 418 -886 291 10 -973 -406 1431 -654 171 92 78 366 785 406 -11 726
2753G26j129l74J197k87o69M14N4m86R34l06j122K313P49k502O59P88j027k75
$$ 726 -403 -777 420 133 -536 -122 -68 -554 380 74 -1048 1265 2014 -488 171 959 -68 -343
2771c43J040p55J27J321j483k03M64j61j203J600m93j052J257M2j80O5K49p3j021
$$ -343 697 -58 69 1390 -93 -296 168 7 -1196 404 -89 -1141 116 158 -22 43 292 219 -802
2790h02J172o37o5K72m62Q5R41k78p93R26k97n01M66O09j118J24R51q41m92J297
$$ -802 370 -267 -332 -60 -522 -437 504 226 -567 359 62 -439 27 636 -482 -358 593 -248 -740 557
2810E57p33n47J403o76j087J514j61p78O12K73o50L79N28q91L19K96m47O2L29
$$ 557 -176 -723 680 4 -1083 431 270 -508 104 377 -273 106 634 -257 62 358 -89 -27 302
2829C02n87M4J066r70k3R68r23l90J076k9j159J125p3p53M48P42j377M43O79q21
$$ 302 -285 -241 825 -145 -168 800 -123 -513 563 534 -625 500 427 -326 122 864 -513 -70 609 -212
2849b12J12P60o18l12P75n29n32Q02l83k56O40k65n05O75J5p92O25L05p48L55
$$ -212 -100 660 42 -270 505 -24 -556 246 -137 -393 247 -18 -523 152 167 -625 0 305 -443 -88
2869h8Q35r83kN80p46k6Q70p86j35R89k91p04O18K36q50L83M79p26O7N19o46J88
$$ -88 747 -236 -238 342 -404 -430 440 -346 -481 508 217 -487 131 367 -483 -100 379 -347 -280 239 -407 -219
2891b19N00m94j07Q18p36j26Q72m76j97O53k32n81O46k05n92O91J66o71K30O68
$$ -219 281 -213 -320 498 -238 -364 508 32 -165 488 256 -325 321 116 -476 215 381 -290 -60 608
2911F08q56J29O94m81m59J106m81q43R40Rn63K47K84p79K35Q18p29K5O05q48K87
$$ 608 -248 -119 575 94 -365 741 260 -583 357 366 -197 50 334 -445 -210 608 -121 -96 509 -339 -52
2932e2M83n96q4Q50n71l40O55l84k08M70L5p27O35K70r41N48N08j035J67Q75n50
$$ -52 431 -165 -249 601 30 -310 345 -39 -247 223 258 -469 166 436 -505 43 551 -484 -317 558 8
2953Hn09Q17m44l39P63k92k63O38k46n05M91K1n85N36L70j059O54M65o96K62L98
$$ 8 -501 316 -128 -467 296 4 -259 379 133 -372 119 140 -445 91 461 -598 56 521 -175 87 485
2974D85q22m4J020o17k45O96n00l74O39L3q71O80L60q66L37M25m70L0N28n71j05
$$ 485 -337 -381 639 22 -223 473 -27 -401 238 271 -600 80 440 -426 -89 336 -134 -104 424 -147 -252
2995b52P92q33P7N19m11k98P18k84k87O17k32o18N57O9m26N10J47p37J76O74q23
$$ -252 540 -293 -216 303 -108 -406 312 28 -259 358 126 -492 65 134 -292 218 365 -372 -196 478 -345
3016c45J13P95o30k50P40m61k31N18L4p32M58O8m52J73O46o30L87K80p22J91J99
$$ -345 -232 563 -67 -317 423 -38 -269 249 283 -449 9 77 -375 -202 444 -186 201 481 -241 -50 149
3037A49l60N1N09m78r1M39m10k77O97J41p67N23L54n92r7M41k26r6M19m93k15
$$ 149 -211 -160 349 -129 -220 219 -191 -468 229 370 -397 126 480 -112 -209 232 6 -90 329 -164 -379
3058c79Q67m90k68M24J21n22L31l3m98M89K07o64K79O81q88L54L24p22K47N78
$$ -379 488 -2 -270 154 275 -247 84 51 -447 42 249 -415 -136 545 -343 11 335 -387 -140 438
3078D38o81j02O05l45k32O69k49m68O70P1r96O70M10o66R7O10n27o2L45j29m23
$$ 438 -243 -345 260 -85 -317 352 103 -365 305 376 -620 50 460 -206 -109 501 -26 -88 257 128 -295
3099b95O71m53j63M02j63n05P70k27m45N68j12n62O11K51j061R51K78o13P1P42
$$ -295 376 -77 -240 162 -1 -506 264 37 -408 160 48 -514 97 348 -713 238 516 -97 -26 716
3119G16p11k57M98j76m00P75m28n25R68l41l96M28r9j62P0K92l00l1M32o56J15
$$ 716 5 -252 246 70 -330 445 17 -508 460 119 -277 151 52 -110 -40 252 -48 -79 353 -303 -188
3140a88N99l65l27P96n31j42O07n25m13P01L5n92P53k16l62J45K10n34J63L82
$$ -188 411 46 -281 515 -16 -158 449 -76 -489 212 247 -345 408 192 -170 -25 185 -349 -186 196
3160A96n42k8O92m36j70Q06n38k75M49j22l00J12K78n37K77L00l16K02M5r0j69
$$ 196 -346 -374 318 -118 -288 518 -20 -295 154 32 -268 -156 122 -415 -138 162 -154 48 93 3 -166
3181a66M35k93l91M67r5k56L22l2k42L28J06m69K37O03r14J83L05k89P8M66n29
$$ -166 269 -24 -415 52 -43 -299 23 -9 -251 77 183 -286 -49 554 -360 -177 128 -161 -83 383 -146
3202a46j2N01k31j17L19m68p4L70L9n11M87K75o87K41K52l78K16K38n81J19M61
$$ -146 -158 343 112 -5 314 -154 -228 142 181 -330 157 432 -255 -14 238 -140 76 314 -267 -148 313
3223C13l76l12P73l34m13N68j02m88L67J64n12K79M33o30J69K78l98L00J45l59
$$ 313 -63 -375 398 64 -349 219 117 -371 -4 160 -352 -73 360 -270 -101 177 -221 79 224 -135
3243a35j53O65o69J7N36k15n57P39l9n82N15J22n72L22J88p00L41N39n56J10M58
$$ -135 -288 377 -292 -275 261 46 -511 228 189 -393 122 244 -328 -6 182 -518 -177 362 -194 -84 374
3264C74m88k6K25L5l72P87l35k88R9M50p43M11N8k71j39K96m30L03K48m25J94
$$ 374 -114 -140 85 120 -252 535 200 -88 11 461 -282 129 187 -84 -223 73 -357 -54 194 -231 -37
3285c7J92j01l81Q81m48n62Q79k17o17O00m8l85J72M48p92K87M38n13J1M53m71
$$ -37 155 54 -327 554 106 -456 423 206 -411 189 141 -244 -72 376 -416 -129 309 -204 -193 260 -211
3306b11q6M87j48k92L90k70j54M05j27k92L74j17j73L31J98o15M56L12p73J27
$$ -211 -297 190 42 -250 140 -130 -284 121 -6 -298 76 -41 -214 117 315 -300 156 468 -305 -178
3326a78M56k31k59N12l96k37O06j14n09O77R4q89L71M93o85P0K94j88j11L60l02
$$ -178 278 47 -212 300 -96 -333 273 159 -350 327 421 -468 -97 396 -289 -219 75 -113 -224 136 -166
3347a66K7J93M4j52K16jm92N21m5j92M1L15p05N76K05p16P9O15l29k05M79k06
$$ -166 -139 54 98 -54 162 161 -331 190 145 -47 -6 309 -396 180 385 -331 -252 363 34 -171 308 102
3369A02o06O19L9n01L94J09l23J86l8j77L95K2m32K67J96n43K97j38j38K79K03
$$ 102 -504 115 154 -347 47 156 -167 19 -19 -196 199 221 -211 56 252 -291 6 -132 -270 9 212
3390B12l48k8L49k52l87O29k95l69P59j15l77N6N71o42P3L81k91j59K91q5k80
$$ 212 -136 -164 185 -67 -454 175 -120 -489 270 155 -222 -166 405 -237 -164 217 -74 -233 58 -27 -307
3411c07M87j11k46K44ll11M85j43j93L76n22J47N3R5j46m3N67o15j61M86J89m32
$$ -307 180 69 -177 67 64 -247 238 95 -98 278 -244 -97 -44 51 -95 -138 429 -186 -347 139 328 -104
3433a04K70j30k49M74m2n26L84J92m71K26M02l79J13%o3l50L94N1m39L34k12j33
$$ -104 166 36 -213 261 219 -307 77 269 -202 24 426 47 160 160 97 -253 141 192 -247 87 -125 -258
3455b58Q35n56j95K62J53m79L78K25m06j50N10m93K8M64n33k15P05k15l15M51
$$ -258 577 21 -174 88 241 -238 140 365 -41 -191 319 -174 -146 318 -215 -430 275 60 -255 196
3475A96j57k88M05K30n88L58o1l94K47O66p62R4L53m69q9L84k35k78N67k40j27
$$ 196 39 -249 156 386 -202 156 95 -299 -52 614 -148 -54 299 -170 -259 125 -110 -388 179 -61 -188
3496a88L70p5l85M41R8n31M65K30o49pO73n00k22O69n41N0J76L2l94M73k32j04
$$ -188 182 107 -278 163 261 -270 195 425 -224 -231 442 -58 -280 389 -152 -102 74 106 -288 185 -47 -151
3518a51M75j92r1q8J91j48j18K98j72L09K5n60J24L44m30QL22k97l8N04k25m64
$$ -151 324 132 41 -47 144 -4 -122 176 4 313 338 -222 -98 246 -184 -176 146 -151 -189 315 90 -374
3540c74L17L03k27l2J44k38J26J68j8k73M20j64j38K70j97j94L96k84k75K68j54
$$ -374 -57 246 19 -13 131 -107 19 187 169 -104 316 152 14 284 87 -107 289 5 -270 -2 -156
3561a56M8J11J88k64K17j9k95J45l9o4q2L57ql86M66L8m44M47J0p40P24j89j40
$$ -156 -108 3 191 -73 144 125 -170 -25 -64 -128 -210 147 139 -247 219 257 -187 260 270 -470 254 65 -75
3584g5L1K15k57j27K36j12k24N87l00j60L88o0m66M74k98j85L94N0l20K20K16
$$ -75 -44 171 -86 -213 23 -89 -313 274 -26 -186 202 142 -324 150 -148 -333 61 111 -209 11 227
3605B27o37M95J14k63l9M54m21J31J30j47l55M93O4o00N23k09R2L0J34m97L5L79
$$ 227 -410 85 199 -64 -103 351 -70 61 191 44 -311 182 246 -354 169 -40 52 82 216 -281 -246 133
3627A33l29J47K21n22L99L9j63p5L23m47k31O38j48l69O96j10m12J22K80m75J38
$$ 133 -196 -49 172 -350 49 88 -75 -150 173 -274 -505 133 -15 -384 312 202 -210 -88 192 -283 -145
3648a45N48n29J80P7o6j56M85k14l22L15j79J06K55k31l12N12k51l18M34k45j70
$$ -145 403 -126 54 131 65 -91 394 180 -142 173 -6 100 355 124 -188 324 73 -245 189 -56 -226
3669b26M77j35k00J09J61k48l9L76k75k69M03m6j41K13M3k85J31r2L5PJ70o00
$$ -226 251 116 -84 25 186 -62 -101 275 0 -269 134 88 -53 160 203 -82 49 -43 -8 -1 169 -431
3691d31M42J88m27p0L84J21l84K11j11k40L07O9k47J35L11m12J33L31m50MK35
$$ -431 11 199 -228 -298 86 207 -177 34 -77 -317 -10 59 -188 -53 258 -154 -21 310 -140 -136 99
3712I9l35J86K35n4k82M45l12k69L07j28k02J21K72n7jj3j45J93K52m92J96L35
$$ 99 -236 -50 185 131 -151 294 -18 -287 20 -108 -310 -189 83 26 25 12 -133 60 312 -180 16 351
3734C51n27Q1K71j72k23N88m60N7N8j7k21J61J76j49O2R7k79K7K62l17J13J99
$$ 351 -176 -95 176 4 -219 369 -91 -34 24 7 -214 -53 123 -26 36 133 -146 -119 143 -174 -61 138
3756A38m26J12L43l02J89L10m55k23M73%k24K26j85j90J8M45m04J29J46k44P9
$$ 138 -288 -176 167 -135 54 364 -91 -314 159 159 -65 161 -24 -214 -196 249 -155 -26 120 -124 -45
3777d5L85m95J28L54l93j3K50J6m97L41M1j20J71j36K67k19J54k56n7K84l61J42
$$ -45 340 -155 -27 327 -66 -79 171 187 -310 31 72 -48 123 -13 254 35 189 -67 -124 160 -201 -59
3799e9K11l07p5L29n8k60K59J53k38M3J06k73K49M0k45K5L77k51j60K20m8j58
$$ -59 152 -155 -230 99 41 -219 40 193 -45 -2 104 -169 80 120 -125 -100 277 26 -134 86 38 -120
3821a20M21j96j71J70J67n15M42j38k39K96q3j73j12J65LJ58K57n43J24R6l9j00
$$ -120 301 105 -66 104 271 -244 198 60 -179 117 34 -139 -251 -86 -83 75 332 -211 -87 9 -30 -130
3843a30K93k38l63M47K2m78M85M4m22M52Q9n18K81K12l75%M94k81j93K96j20j10
$$ -130 163 -75 -438 9 31 -447 38 82 -340 112 201 -317 -36 176 -199 -199 295 14 -179 117 -3 -113
3865a13J73J26k75K64j10j28J2J59l12K25J18j95K75K8l31j70N57m49q5K55o3
$$ -113 60 186 -89 175 65 -63 -51 108 -204 21 139 -56 219 247 -84 -254 303 -146 -231 24 -39
3886c9j85K83J62l41M72n60J75k3J53l41K12K27l53N8P6K6j49K51k17MQ7K20j56
$$ -39 -224 59 221 -120 352 -208 -33 -56 97 -244 -32 195 -158 -100 -24 2 -147 104 -113 -109 -22 198 42
3909D2NJ65m28K34k6q4J29J77k82N1K77m68P7K82o4k22L63m20L8J82m4j57N09
$$ 42 47 212 -216 18 -8 -92 37 214 -68 -17 260 -208 -131 151 87 -135 228 -192 -154 28 -16 -173 336
3932C36j07l16K11m8j03m9L95l46P3K60o26L66L53j01o56M45j94J00J22ro8j85
$$ 336 229 -87 124 76 -27 -76 319 -27 46 306 -320 46 399 298 -358 87 -107 -7 115 106 38 -147
3954a47J03j74K46J4q6j82M34j85o5L12l21O4l6J5j22R8J55j67J55J43l48L65
$$ -147 -44 -218 28 42 -44 -226 208 23 -42 270 -51 13 -23 -8 -130 -32 123 -44 111 254 -94 271
3976B71j7m11oK42k42K76o4J4l39K68j08k31K25J13j94J46J94j26J00Q5l02J41
$$ 271 254 -157 -163 79 -163 113 49 63 -276 -8 -116 -347 -122 -9 -203 -57 137 11 111 196 -106 35
3998C5K00k21p6m5o1j12R6K10o0J50j01j52K01%k70K91o4kO1K62m41K80O7m29
$$ 35 235 14 -62 -107 -168 -280 -184 26 -34 116 15 -137 64 64 -206 85 21 19 80 342 -99 181 248 -181
4022a81p9L62k76q3K61pj8K88o08K82n1L05k46K46j23j62J19j2j09K94k6j61J16
$$ -181 -260 102 -174 -257 4 -3 -21 267 -341 -59 -110 195 -51 195 72 -90 29 17 -92 202 176 15 131
4045A31p7j05p6K92k95J27L38k43m03N43j20l30L11l6k00K37J5l15K91j91J46
$$ 131 54 -51 -127 165 -130 -3 335 92 -311 232 112 -218 93 57 -143 94 109 -206 85 -106 40
4066D0j23J52n6k27M45l04k22K83K55l93L0M6K64L6j81j55J54L6k08J26K18k80
$$ 40 -83 69 13 -214 231 -73 -295 -12 243 -150 -120 -74 190 226 45 -110 44 80 -128 -2 216 -64
4088f4j66M39l29Q1J65j95r7L3L32l94L82j11l53K64K23l80k0K71o0k20N28k69
$$ -64 -230 209 -120 -39 126 -69 -166 -133 199 -195 187 76 -277 -13 210 -170 -190 81 21 -199 329 60
4110F0j00J49k85m2L99k45K0K84j46q0J76k01j77J75J63k31j67M15j88j15L04
$$ 60 -40 109 -176 -218 181 -64 -44 240 94 14 190 -11 -188 -13 150 -81 -248 167 -21 -136 168
4131A68r3k02J41K23l67J32m9K03l09J43k69N85l24o1Q2K07k73l7L88p26M09K46
$$ 168 75 -127 14 237 -130 2 -47 156 -153 -10 -279 306 -18 -79 3 210 -63 -100 288 -438 -29 217
4153B17l55J98J37r4j24K41k02k56L99J20m43Q9K14j95k2L93k75QL7m1j72O6J06
$$ 217 -138 60 197 103 -21 220 18 -238 161 281 -162 -73 141 -54 -76 317 42 50 87 46 -126 -60 46
4176D6l62N21k74j7J05O4k41K64j2k25P5R1k80J23M31k29k20J72j20K09K18m8
$$ 46 -316 205 -69 -86 19 83 -158 106 94 -131 -56 35 -245 -122 309 80 -140 32 -88 121 339 291
4198B91l61k48M31o6J38p0n5o2K19k03L5O2M0k33K02m8k81K84j9j15M0J50k78
$$ 291 -70 -318 113 47 185 115 60 -2 217 14 49 111 151 -82 120 72 -209 75 56 -59 -19 131 -147
4221a47j15L55k01K27o8R3l45L22n7k79K53LK5J31j83r4K15j31p2k2K05j88O3
$$ -147 -262 93 -108 119 51 144 -201 121 64 -215 38 41 66 197 14 -80 135 4 -68 -90 115 -73 -10
4244a0J81l45L17J20m25K75lj18k07L63l88J49L15l16L5M2K64n12L55j6k12N4
$$ -10 171 -174 143 263 -162 113 110 -8 -215 148 -240 -91 224 -92 -57 -15 249 -263 92 76 -136 -82
4266h2M97k46n5r3j35J3J11J91k31K12Q0k96O1m6J02o4K8N2j84L15l80J46j3k27
$$ -82 415 169 114 21 -114 -101 10 201 -30 182 262 -34 27 -19 83 19 47 99 -85 230 -150 -4 -17 -244
4290b44M6M58l01L1J69k21J06J01o3l48K95K16k07j80K32k49K49j26J74q7P4j20
$$ -244 -198 260 -41 -10 159 -62 44 145 82 -266 29 245 38 -142 90 -159 90 -36 138 51 125 5
4312Er3p5k89L61o6K31j69j40K29j03L5K88n04M49j29r3k23L52k45k33M76n7k31
$$ 5 -88 -163 -452 -91 -157 74 -95 -235 -6 -109 -74 214 -290 159 30 -63 -286 66 -179 -412 64 7 -224
4335b24K54k4J46r1mj72K54L7l96K53J57j56R7o1l04L6J56J2k6J97l12j10M41
$$ -224 30 6 152 61 57 -115 139 176 -220 33 190 34 131 70 -234 -198 -42 -30 -56 141 -171 -281 160
4358A60l12K9J54l77K67O2J20j09o0K84k15J07n6l06L4R3P8P4o1o4k7M16k5o30
$$ 160 -152 -123 31 -346 -79 -17 103 -6 -66 218 3 110 54 -252 -218 -125 -47 27 -34 -98 -125 291 266 -364
4382c64K19P2j9q7K96k52Q3P3n0J55j44K6M2N8k34j06K29K47n9oj7j19J3J27j65
$$ -364 -145 -73 -92 -179 117 -135 -52 21 -29 126 -18 8 50 108 -126 -232 -3 244 185 179 162 43 56 183 18
4407A8M0L0m62L91K22m89jM26r6n8l5O7j85K46ol31K24KK28k17J71j69q5L33m18
$$ 18 58 88 -374 17 239 -250 -251 175 79 21 -14 53 -132 114 108 -223 1 3 231 14 185 16 -69 264 -154
4432a54K02Jr8J67Oj71M8J15j35O4r8K21k97L0J33p6n4J65k39O2L5K7M14k68l15
$$ -154 48 49 -49 118 124 -47 1 116 -19 45 -53 168 -129 -99 34 -42 -96 69 -170 -108 -73 -46 368 100 -215
4457b15jK67k36M2R6l4P6K53p2k72J36J79p5m08M24j9k85L33K2p6l22M03j83j23
$$ -215 -216 51 -185 -143 -47 -81 -5 248 176 -96 40 219 144 -264 160 141 -144 189 211 135 -187 216 33 -90
4481i0K51k43L58k86J61j02m1k73K27K49k12q4J15l58N80J2m42p6J02NK45l50
$$ -90 161 -82 276 -10 151 49 8 -265 -38 211 -1 -85 30 -328 252 264 -178 -254 -152 -147 98 -252
4503b52L89K0l44J27J28jP5k53L9J70j23rK52k40L05k36J22l14Q4J31j33J79j6
$$ -252 137 157 -187 -60 68 67 142 -111 -72 98 -25 -34 218 -22 283 47 169 -145 -61 70 -63 116 100
4526A00k29J71K8j88J64k5J57q0j0j16L2J03J33j84J36l37J81k31K03q0pK57o9
$$ 100 -129 42 70 -118 46 21 178 98 88 -28 4 107 240 56 192 -145 36 -195 8 -72 -79 178 109
4549A09k63J19N1j02K65j74M1k37K41l06M42m5k17J55j29q3J05O9J39k08j42J86
$$ 109 -154 -35 16 -86 179 5 46 -191 50 -256 186 141 -76 79 -50 -133 -28 41 180 -28 -170 16
4571A6l03N82l91K47M2k09r0J37n5r6J57K09l27J90p3j26O3K46k89o3L12m87J93
$$ 16 -287 295 -96 151 193 -16 -106 31 -24 -120 37 246 -81 109 36 -90 -27 219 -70 -133 179 -308 -115
4594a15N19m46j28K18J2j92K20j71J83j66K0q1J09m7l04L75L7J08m0j04k00K1
$$ -115 404 -42 -170 48 60 -132 88 -83 100 -66 -46 -127 -18 -65 -369 6 43 151 111 7 -193 -172
4616a72L22M1j92N9j16m3q3K35l77M14rM13o02J87k47L38J0k39L15j66j17J70
$$ -172 150 191 -1 58 -58 -101 -184 51 -326 88 79 492 -110 77 -170 168 178 -61 254 88 -29 141
4638A41j57R5q1l0L5l00M21j51r9L8j5K20m6J31j96r1Q5k04K06J19k26l25L91
$$ 141 -16 79 -2 -32 3 -297 124 -27 -126 -88 -103 117 71 202 6 -85 0 -204 2 121 -105 -430 -39
4661c9K22k0j57N7k07J80J12j88j17Q3J39N2Q3q3k35K47m12J16R2J57m10M38m7
$$ -39 183 163 6 63 -144 36 148 -40 -157 -74 65 117 200 117 -118 129 -283 -167 -75 82 -328 110 63
4684F3j03J12l4R5q6J12j65j7J24k61K94J46l69j8J75k00k92O90j66j06n5P7j84
$$ 63 -40 72 38 133 47 159 -6 -23 101 -160 134 280 -89 -107 68 -132 -424 266 100 -6 -61 16 -168
4707a68J87n1j46K68R2k46J78Q9k20j10L40l28p3O34m64l14J03J82j98J95K20
$$ -168 19 -32 -178 90 182 -64 114 203 -17 -127 213 -115 -188 446 -18 -332 -229 -47 -245 -50 170
4728A70k55J60L4k46J10Pj5K66k03j62N6p1M11m32K68p2j93J40l2j05J54Q5k9
$$ 170 -85 75 109 -137 -27 -20 -35 231 28 -134 -78 -149 262 -170 98 26 -167 -27 -59 -164 -10 75 46
4751D6O8l7m1J8M7j20o9K07k06K2J14J1j90k3N68l57r4P4j90K09l9j16n9K59K5
$$ 46 114 77 36 54 101 -19 -88 119 -87 -65 49 60 -130 -153 415 58 -36 38 -152 57 18 -98 -157 102 127
4776A27k26N7J45j97L54j81l7Q1Q2k70J82Q6k51M8Q8k83L73Pk74J44R3k17k7L4
$$ 127 -99 -42 103 -94 260 79 42 123 205 -65 117 203 -48 0 88 -195 178 185 -89 55 148 -69 -96 -62
4800f2l6o8K45O2l39K57k17J88J16j1k63Q7n2J63j24J33j88P1J90j9j26N39j76
$$ -62 -98 -166 79 141 -198 59 -158 30 146 135 -128 -41 -93 70 -54 79 -109 -38 152 133 7 546 370
4823C70m61J97k46m13M39L66K2l7O1p24K56R3n67J075m06J81m52M68j27k54Q7
$$ 370 -91 106 -140 -553 -114 252 274 237 298 -426 -170 -77 -644 431 25 206 -246 222 95 -159 -72
4844g2L20m51M51k72k38M15j82L8J07J33m74K32nL1o9n3R0k62M02o3Q7j19r3P4
$$ -72 248 -203 248 -24 -262 153 -29 9 116 249 -225 7 2 33 -36 -89 1 -261 141 78 165 46 -47 27
4868B7J7O7Oj04K1j78k2KQ3K43j52pj17K87k22K4N2o1l9J02k0j64r5P8K2K20j1
$$ 27 44 111 117 13 34 -144 -166 -164 -81 162 10 3 -114 173 -49 -25 27 -34 -73 29 9 -155 -250 -172 -150 70 59
4895E9l0l10N85j09n1J2q1k82L73r8j97K93p8k79L37r8j78K84l6k25n9M59l83
$$ 59 29 -281 304 195 144 156 75 -207 166 68 -129 164 86 -193 144 46 -132 152 116 -109 -168 291 -92
4918i2J68J51m34J02K64j05k37M06l58J68l1J6k06K12L04l86k11O33n78K3K52
$$ -92 76 227 -207 -105 159 54 -183 223 -135 33 2 18 -188 24 328 -58 -269 364 -214 -191 61
4939F1n51J84N15m07N9L81k84o5K29J85m08K47k7m40M41J40k22j25J89K4K4j29
$$ 61 -490 -306 209 -198 -139 242 -42 -107 122 307 -101 146 119 -321 120 260 38 -87 102 126 150 21
4961B1j18J70k3j20N7lK55l46J59j69jJ68j1j22O5j5j96K05J59j03l9J11J4q7
$$ 21 -97 73 50 -70 -13 -16 239 -107 52 -117 -118 50 39 -83 -18 -33 -229 -24 135 32 -7 104 118 31
4985C1J1K5k75N45m42P9J05j14j75J47L18k44J00J83l54J05j31j57K88L7j0N7
$$ 31 42 67 -208 337 -105 -26 79 -35 -210 -63 255 11 111 294 -60 45 -86 -243 45 82 72 129
5007A29j51J46j64P6on0jJ59l40J70k5j26J16K4N0O8j94L04l50L18l34J51O0K10
$$ 129 -22 124 -40 36 30 -20 -21 138 -202 -32 -57 -183 -67 -43 7 75 -119 185 -165 153 -181 -30 30 240
5031B40l19K03L61q02L08J00k78J0K57o7l25M88l53J45J81j76j43L42j33m3l6
$$ 240 -79 124 485 -317 -9 91 -187 -177 80 13 -312 176 -177 -32 149 -27 -170 172 39 -4 -40
5052d0J09N7j24O9p5N1K04m71J13R9j30m7K15Q8j93L68k97j72K47J42l45J49J5
$$ -40 69 126 2 71 -4 47 251 -220 -107 -8 -138 -185 30 118 -75 293 -4 -176 71 213 -132 17 32
5075C2j94K46K78m56J52J80l22J82l87L56p1l23k18M79j22N62n14N68j2q85J009
$$ 32 -162 84 362 -94 58 238 -84 98 -289 67 -4 -327 -545 -66 -188 374 -140 428 416 -469 540
5096E40k29n7m47M58n93M31l04j90M39M3j9l27M61k96J07O3l7J66j89K42m15L09
$$ 540 311 254 -193 265 -328 103 -201 -391 48 91 72 -255 206 -90 17 80 43 209 20 262 -153 156
5118A56M1k69K30j58j89L23m1j64N7P1J60j28j94M8k75L36J63l24K42M4j69J99
$$ 156 197 -72 158 0 -189 134 93 -71 -14 57 217 89 -105 -57 -332 4 167 -157 85 129 -40 159
5140A59J19k56Q3r3j65K25R2j10p6N8j37q3L55L1n0N6M8l71K16q7j5Q0K04l62
$$ 159 278 22 105 12 -153 72 164 54 -22 36 -101 -184 171 202 152 208 256 -115 101 14 -1 79 283 -79
$$ [...]
8191A0
##END NTUPLES=NMR FID
##END=
